##TITLE=1H_4e1303-05
 CDCl3
 8 sc, 
 14.3.2023
##JCAMPDX= 6.0         $$ Bruker NMR JCAMP-DX V2.0
##DATA TYPE= NMR FID
##DATA CLASS= NTUPLES
##ORIGIN= UXNMR, Bruker Analytische Messtechnik GmbH
##OWNER= root
$$ XWIN-NMR		Version 3.5
$$ Tue Mar 14 14:06:21 2023 Russian Standard Time (UT+4h)  she@DPX200
##.OBSERVE FREQUENCY= 200.13135
##.OBSERVE NUCLEUS= ^1H
##.DELAY= (6, 6)
##.ACQUISITION MODE= SIMULTANEOUS
##.ACQUISITION SCHEME= undefined
##.AVERAGES= 8
##.DIGITISER RES= 18
##SPECTROMETER/DATA SYSTEM= spect
##.PULSE SEQUENCE= zg30
##.SOLVENT NAME= CDCl3
##.SHIFT REFERENCE= (INTERNAL, CDCl3, 0, 15.7039)
##AUDIT TRAIL= $$ (NUMBER, WHEN, WHO, WHERE, WHAT)
$$ ##TITLE= Audit trail, XWIN-NMR		Version 3.5
$$ ##JCAMPDX= 5.01
$$ ##ORIGIN= Bruker BioSpin GmbH
$$ ##OWNER= she
$$ F:/spectra/data/she/nmr/H-F/1/audita.txt
$$ ##AUDIT TRAIL=  $$ (NUMBER, WHEN, WHO, WHERE, WHAT)
(   1,<2023-03-14 14:05:08.39 +0400>,<she>,<DPX200>,
      <created by zg, POWCHK disabled, PULCHK disabled
       configuration hash MD5:
       00 E9 B6 7A A2 85 ED C7 34 08 36 98 17 FE 4E 26
       data hash MD5: 16K
       CD 69 91 94 FD 41 5E 12 DF E9 4B 80 51 67 85 0E>)
$$ ##END=
$$ 
$$ hash MD5
$$ 88 79 B1 C7 81 A8 BE 60 56 27 58 3C 1F 49 8C 74
##$RELAX= 
##$RELAX= 
##$RELAX= 
##$RELAX= 
##$RELAX= 
##$RELAX= 
$$ Bruker specific parameters
$$ --------------------------
##$DU= <F:/spectra>
##$EXPNO= 1
##$NAME= <H-F>
##$PROCNO= 1
##$TYPE= <nmr>
##$USER= <she>
##$AMP= (0..31)
100 100 100 100 100 100 100 100 100 100 100 100 100 100 100 100 100 100 
100 100 100 100 100 100 100 100 100 100 100 100 100 100 
##$AQSEQ= 0
##$AQ_mod= 1
##$AUNM= <au_zg>
##$AUTOPOS= <>
##$BF1= 200.13
##$BF2= 200.13
##$BF3= 200.13
##$BF4= 200.13
##$BF5= 200.13
##$BF6= 200.13
##$BF7= 200.13
##$BF8= 200.13
##$BYTORDA= 1
##$CFDGTYP= 0
##$CFRGTYP= 5
##$CHEMSTR= <none>
##$CNST= (0..31)
1 1 145 1 1 1 1 1 1 1 1 1 1 1 1 1 1 1 1 1 1 1 1 1 1 1 1 1 1 1 1 1 
##$CPDPRG= <>
##$CPDPRG1= <>
##$CPDPRG2= <>
##$CPDPRG3= <>
##$CPDPRG4= <mlev>
##$CPDPRG5= <mlev>
##$CPDPRG6= <mlev>
##$CPDPRG7= <mlev>
##$CPDPRG8= <mlev>
##$CPDPRGB= <>
##$CPDPRGT= <>
##$D= (0..31)
0 1.2 0 0 0 0 0 0 0 0.06 0 0.03 0 0 0 0 0.0002 0 0 0 0 0 0 0 0 0 0 0 0 
0 0 0 
##$DATE= 1678788307
##$DBL= (0..7)
120 120 120 120 120 120 120 120 
##$DBP= (0..7)
150 150 150 150 150 150 150 150 
##$DBP07= 0
##$DBPNAM0= <>
##$DBPNAM1= <>
##$DBPNAM2= <>
##$DBPNAM3= <>
##$DBPNAM4= <>
##$DBPNAM5= <>
##$DBPNAM6= <>
##$DBPNAM7= <>
##$DBPOAL= (0..7)
0.5 0.5 0.5 0.5 0.5 0.5 0.5 0.5 
##$DBPOFFS= (0..7)
0 0 0 0 0 0 0 0 
##$DE= 6
##$DECBNUC= <off>
##$DECIM= 32
##$DECNUC= <off>
##$DECSTAT= 4
##$DIGMOD= 1
##$DIGTYP= 9
##$DL= (0..7)
0 120 120 120 120 120 120 120 
##$DP= (0..7)
150 150 150 150 150 150 150 150 
##$DP07= 0
##$DPNAME0= <>
##$DPNAME1= <>
##$DPNAME2= <>
##$DPNAME3= <>
##$DPNAME4= <>
##$DPNAME5= <>
##$DPNAME6= <>
##$DPNAME7= <>
##$DPOAL= (0..7)
0.5 0.5 0.5 0.5 0.5 0.5 0.5 0.5 
##$DPOFFS= (0..7)
0 0 0 0 0 0 0 0 
##$DQDMODE= 0
##$DR= 18
##$DS= 0
##$DSLIST= <SSSSSSSSSSSSSSS>
$$ [...]
##$SUBNAM2= <"">
##$SUBNAM3= <"">
##$SUBNAM4= <"">
##$SUBNAM5= <"">
##$SUBNAM6= <"">
##$SUBNAM7= <"">
##$SUBNAM8= <"">
##$SUBNAM9= <"">
##$SW= 18.05172834244
##$SWIBOX= (0..15)
0 0 2 0 0 0 0 0 0 0 0 0 0 0 0 0 
##$SW_h= 3612.71676300578
##$TD= 16384
##$TD0= 1
##$TE= 0
##$TE2= 300
##$TE3= 300
##$TEG= 300
##$TL= (0..7)
0 120 120 120 120 120 120 120 
##$TP= (0..7)
150 150 150 150 150 150 150 150 
##$TP07= 0
##$TPNAME0= <>
##$TPNAME1= <>
##$TPNAME2= <>
##$TPNAME3= <>
##$TPNAME4= <>
##$TPNAME5= <>
##$TPNAME6= <>
##$TPNAME7= <>
##$TPOAL= (0..7)
0.5 0.5 0.5 0.5 0.5 0.5 0.5 0.5 
##$TPOFFS= (0..7)
0 0 0 0 0 0 0 0 
##$TUNHIN= 0
##$TUNHOUT= 0
##$TUNXOUT= 0
##$USERA1= <user>
##$USERA2= <user>
##$USERA3= <user>
##$USERA4= <user>
##$USERA5= <user>
##$V9= 5
##$VALIST= <valist>
##$VCLIST= <CCCCCCCCCCCCCCC>
##$VD= 0
##$VDLIST= <DDDDDDDDDDDDDDD>
##$VPLIST= <PPPPPPPPPPPPPPP>
##$VTLIST= <TTTTTTTTTTTTTTT>
##$WBST= 1024
##$WBSW= 4
##$XGAIN= (0..3)
0 0 0 0 
##$XL= 0
##$YL= 0
##$YMAX_a= 392717
##$YMIN_a= -372886
##$ZGOPTNS= <>
##$ZL1= 120
##$ZL2= 120
##$ZL3= 120
##$ZL4= 120
##$ABSF1= 10
##$ABSF2= 0
##$ABSG= 5
##$ABSL= 3
##$ALPHA= 0
##$AQORDER= 0
##$ASSFAC= 0
##$ASSFACI= 0
##$ASSFACX= 0
##$ASSWID= 0
##$AUNMP= <proc_1d>
##$AZFE= 0.1
##$AZFW= 0.1
##$BCFW= 1
##$BC_mod= 2
##$BYTORDP= 1
##$COROFFS= 0
##$CY= 11.3945322036743
##$DATMOD= 1
##$DC= 2
##$DFILT= <>
##$DTYPP= 0
##$F1P= 2.36226072786647
##$F2P= -0.459571619588291
##$FCOR= 0.5
##$FTSIZE= 0
##$FT_mod= 4
##$GAMMA= 1
##$GB= 0.15
##$INTBC= 1
##$INTSCL= 1
##$ISEN= 128
##$LB= 0.24
##$LEV0= 0
##$LPBIN= 0
##$MAXI= 10000
##$MC2= 0
##$MEAN= 0
##$ME_mod= 0
##$MI= 1.114404
##$NCOEF= 0
##$NC_proc= 0
##$NLEV= 6
##$NOISF1= 3.799351
##$NOISF2= 2.8
##$NSP= 1
##$NTH_PI= 0
##$NZP= 0
##$OFFSET= 15.70392
##$PC= 1
##$PHC0= -19262.02
##$PHC1= 9.000742
##$PH_mod= 1
##$PKNL= yes
##$PPARMOD= 0
##$PSCAL= 0
##$PSIGN= 0
##$REVERSE= no
##$SF= 200.130013532006
##$SI= 16384
##$SIGF1= 3
##$SIGF2= 2
##$SINO= 400
##$SIOLD= 16384
##$SREGLST= <1H.CDCl3>
##$SSB= 0
##$STSI= 0
##$STSR= 0
##$SW_p= 3612.71676300578
##$SYMM= 0
##$S_DEV= 0
##$TDeff= 0
##$TDoff= 0
##$TI= <>
##$TILT= no
##$TM1= 0
##$TM2= 0
##$TOPLEV= 0
##$USERP1= <user>
##$USERP2= <user>
##$USERP3= <user>
##$USERP4= <user>
##$USERP5= <user>
##$WDW= 1
##$XDIM= 8192
##$YMAX_p= 0
##$YMIN_p= 0
$$ End of Bruker specific parameters
$$ ---------------------------------
##NTUPLES= NMR FID
##VAR_NAME=  TIME,          FID/REAL,        FID/IMAG
##SYMBOL=    X,             R,               I
##VAR_TYPE=  INDEPENDENT,   DEPENDENT,       DEPENDENT
##VAR_FORM=  AFFN,          ASDF,            ASDF
##VAR_DIM=   8192,          8192,            8192
##UNITS=     SECONDS,       ARBITRARY UNITS, ARBITRARY UNITS
##FACTOR=    0.0002768,     1,               1
##FIRST=     0,             0,               0
##LAST=      2.2672688,     0,               0
##MIN=       0,             -372886,         0
##MAX=       2.2672688,     392717,          0
$$ Real data points
##PAGE= N=1
##DATA TABLE= (X++(R..R)), XYDATA
$$ [...]
3099b43k436L936Q08m270R55L896k326l034L462J733m163j14M119j485l487K831
3115A82K380l820r05M151o45l861K240K991l411j596L911J40l957J329L502k703
3131g2k506L769R59m095N84L803k141l000L334J650l798k77M023j413l291K518
3147D7K332l594q44M003o12l824K054K991l199j592L786K08l927J326L395k668
3163a18k341L625R08l957N10L808k057k823L067J745l920j68L869j222l468K550
3179HK408l532r59L898m63l811K132K823l158j601L724K59l909J235L518k577
3195ek477L510J032l992O53L583j859l053L210J752l830k48L907j256l476K817
3211B68K168l449r75L845n64l634J952K845l041j654L626L03l747J107L360k542
$$ y = [-243, -2679, 1257, 2065, -2205, -1250, 2646, 320, -2714, 748, 2481, -1682, -1796, 2323, 838, -2649, 182, 2562, -1258, -2163, 1988, 1343, -2518, -278, 2713, -698, -2294, 1617, 1757, -2200, -871, 2631, -72, -2578, 1191, 2150, -1945, -1361, 2442, 301, -2699, 635, 2285, -1513, -1790, 2233, 820, -2471, 47, 2379, -1215, -2059, 1944, 1332, -2492, -438, 2553, -646, -2238, 1548, 1756, -2171, -845, 2550, -118, -2459, 1166, 2074, -1883, -1373, 2435, 378, -2445, 622, 2367, -1553, -1721, 2148, 926, -2542, 8, 2416, -1116, -2075, 1823, 1360, -2451, -319, 2504, -654, -2255, 1469, 1728, -2181, -946, 2572, -5, -2482, 1028, 2060, -1932, -1279, 2304, 445, -2608, 602, 2354, -1476, -1724, 2183, 927, -2549, 268, 2436, -1013, -1988, 1857, 1293, -2341, -389, 2456, -585, -2239, 1387, 1690, -2057, -950, 2410, -132]
3227a32k330L488J035l890M87L683j945k892L001J682l609k93L766j142l307K350
3243d8K391l253j194L911l76l738J885K909k960j778L737L86m004J303L343k546
3259c2k304L301J062l795M10L588j792k863K881J692l478m15L663r64l307K300
3275e3K470l366j205L802k49l682J783K926k870j845L597M61l713J104L231k450
3291e9k337L270J037l612L84L404j583k792K779J828l617l95L715j152l237K345
3307b2K429l360j030L613k38l611J669K893k769j810L655K08l487R89L130k232
3323B7k353L209J154l785M64L508j729k825K761J761l535l35L572r95l268K409
3339D0K292l167j152L626l17l447J654K738k835j612L377O29l774Q79L343k243
$$ y = [-132, -2462, 1026, 2061, -1829, -1342, 2341, 396, -2496, 505, 2187, -1422, -1715, 2051, 909, -2398, -48, 2343, -910, -2104, 1807, 1431, -2307, -422, 2487, -473, -2251, 1486, 1872, -2132, -829, 2514, -32, -2336, 965, 2027, -1768, -1358, 2230, 438, -2425, 456, 2148, -1330, -1745, 1918, 954, -2353, -53, 2417, -949, -2154, 1648, 1399, -2283, -500, 2426, -444, -2289, 1308, 1769, -1944, -840, 2391, -59, -2396, 874, 1911, -1701, -1317, 2087, 504, -2288, 491, 2319, -1298, -1693, 2022, 870, -2367, -22, 2407, -953, -1983, 1630, 1392, -2219, -550, 2343, -426, -2236, 1419, 1627, -1860, -871, 2259, 27, -2326, 883, 2037, -1748, -1284, 2224, 495, -2330, 431, 2192, -1343, -1678, 1894, 899, -2369, 40, 2332, -835, -1987, 1639, 1322, -2125, -471, 2267, -568, -2180, 1197, 1826, -1948, -1069, 2274, 31]
3355C1k292L151J025l498J59L489j615k686K617J834l552l56L603j135l042K133
3371a34K352l072r67L553m39l411J658K692k625j673L305M92l557R85L038k202
3387ek303L128J132l516K16L401j625k674K597J706l312l87L475r34l118K190
3403b9K226k988j085L548m71l286J597K812k726j653L274L36l358R59L113k173
3419I6k245L034J074l495L40L207j557k740K659J632l072n53L379q78k982K014
3435h7K235k954j057L437m04l102J462K713k674j679L260M34l331Q64K908k043
3451a8k078K911J116l348K02L195j578k390K301J714l228l11L196q12k937J987
3467g8K255k968r90L206j31l243J459K623k474j733L226M04l371J036K893j948
$$ y = [31, -2261, 890, 1915, -1583, -1424, 2065, 450, -2236, 381, 2215, -1337, -1693, 1910, 775, -2267, -134, 2218, -854, -1821, 1732, 1293, -2118, -460, 2232, -393, -2066, 1239, 1731, -1826, -841, 2197, -5, -2308, 820, 1952, -1564, -1348, 2053, 428, -2246, 351, 2057, -1255, -1642, 1833, 899, -2219, -29, 2197, -791, -1876, 1672, 1201, -2085, -488, 2324, -402, -2055, 1219, 1555, -1803, -844, 2269, 96, -2149, 885, 1959, -1536, -1196, 2011, 454, -2286, 373, 2005, -1067, -1620, 1759, 881, -2101, -87, 2148, -806, -1863, 1574, 1170, -1932, -470, 2243, -431, -2110, 1150, 1584, -1747, -883, 2025, -18, -2096, 815, 1931, -1417, -1215, 1980, 402, -1988, 313, 2027, -1201, -1512, 1684, 872, -2065, -78, 2177, -791, -1781, 1425, 1294, -1949, -490, 2133, -341, -2074, 1152, 1556, -1815, -779, 2114, 166]
3483A66k172K790R65l197K24L202j555k568K447J620k958m77L139q11k861J948
3499i8K198k798j061L184j05l204J400K700k539j683L233L11l217Q32K943k125
3515b9k113K906J075l280K21L280j598k678K528J563l092k47L170q41k853J911
3531g7K067k708r55K970Jl132J266K596k335j723L131M95l208O12L045j957k214
3548b126K846J177l301J81L103j291k617K398J565k964m82L245q87k862J887K202
3564B074k778j055L029p5l040J230K704k344j701L048N12l164O66K859j664k295
3580a994K632J097l007m4L190j195k643K262J617k869n67L077q17k722J960K123
3596B100k806r96K972o5l002J307K478k274j497K703N98k976O83K660j747k030
$$ y = [166, -2006, 784, 1749, -1448, -1224, 1978, 423, -2145, 302, 1922, -1036, -1513, 1626, 815, -2046, -98, 2100, -698, -1759, 1425, 1320, -1884, -484, 2216, -323, -2006, 1227, 1538, -1679, -847, 2096, -29, -2142, 764, 1839, -1441, -1220, 2060, 462, -2216, 312, 1875, -1217, -1464, 1706, 865, -1988, -77, 1990, -718, -1673, 1297, 1298, -1834, -568, 2028, -307, -2030, 1101, 1596, -1612, -1000, 2045, 88, -2126, 720, 1897, -1404, -1223, 1880, 589, -2028, 370, 1935, -1029, -1511, 1734, 847, -2015, -128, 2074, -704, -1759, 1270, 1195, -1845, -615, 2089, -255, -1956, 1092, 1604, -1560, -894, 1965, 301, -1994, 638, 1735, -1272, -1316, 1874, 679, -1964, 298, 1915, -954, -1521, 1556, 739, -1983, -23, 2100, -706, -1702, 1270, 1205, -1797, -490, 1988, -286, -1783, 920, 1518, -1458, -775, 1885, 138, -1892]
3612a892K548J063k998J01K958j242k500K144J712k859n86L159p30k836J828K173
3628B043k599j194L068m5l048J305K428k232j575K863L79k914O69K708j722j929
3644a795K416R56k847N4K903j148k394K033J718k789n66K965n09k916J698K100
3660A879k469j032K857Rl062J291K458k291j602L039M25l130P73K770j827j928
3676a840K508R69k839P6K947j282k293K024J452k638m89K863o78k593J634K186
3692B007k529j237K981m7k863J147K382k069j569K682N03k815M62K796j675k046
3708a890K425J234l044L8K894j156k331K109J566k844l42K876o94k641J718J908
3724A826k409j138K895J8k824J146K323j940j649K561O24k879N48K715j645k047
$$ y = [-1892, 656, 1719, -1279, -1178, 1780, 538, -1962, 182, 1894, -965, -1551, 1608, 878, -1958, -130, 2043, -556, -1750, 1318, 1273, -1775, -470, 1958, -274, -1849, 1014, 1393, -1521, -852, 1856, 134, -1795, 621, 1577, -1270, -1216, 1687, 539, -1855, 178, 1896, -893, -1459, 1506, 997, -1919, -221, 1879, -590, -1622, 1235, 1244, -1818, -527, 1931, -360, -1962, 1077, 1502, -1628, -855, 1915, 88, -1840, 668, 1637, -1202, -1126, 1821, 539, -1754, 270, 1722, -916, -1405, 1458, 780, -1813, -179, 2007, -522, -1759, 1222, 1175, -1688, -541, 1841, -228, -1797, 885, 1388, -1427, -965, 1831, 156, -1890, 535, 1769, -1275, -1237, 1657, 501, -1830, 279, 1845, -999, -1341, 1535, 841, -1800, -82, 1826, -583, -1721, 1174, 1192, -1632, -486, 1837, -103, -1752, 809, 1433, -1446, -898, 1817, 172, -1875]
3740a875K486J083k957NK927j189k351K101J464k592m90K745m62k670J583J983
3756A791k359j007K645Q6k693J033K286j968j576K579N65k804O15K565j483k149
3772a874K332J096k658j10K830r62k437J902J634k563n92K824n11k680J514J986
3788A731k279j125K802K7k743J033K349j941j605K508P20k882M75K510j382j932
3804a734K105J206k662m5K707r88k308J889J620k649m94K780n18k473J364J950
3820A750k217j042K622J53k783R33K351j910j570K466O23k589L91K375j301k057
3836a805K193J197k692j01K765r97k306J849J674k483o43K597l13k497J434J896
3852A768k130j157K506J61k711J090K245j818j682K513O05k553K30K590j381k041
$$ y = [-1875, 611, 1694, -1263, -1258, 1669, 480, -1871, 230, 1694, -898, -1388, 1357, 895, -1775, -192, 1791, -568, -1575, 1070, 1156, -1537, -504, 1782, -186, -1762, 817, 1382, -1422, -807, 1758, 275, -1874, 458, 1554, -1104, -1214, 1616, 654, -1783, 119, 1753, -810, -1402, 1422, 911, -1769, -255, 1731, -548, -1673, 1129, 1156, -1587, -554, 1795, -146, -1751, 757, 1477, -1405, -930, 1580, 198, -1734, 371, 1577, -1085, -1130, 1577, 589, -1719, 170, 1790, -859, -1353, 1427, 909, -1564, -200, 1750, -467, -1509, 1113, 1266, -1517, -584, 1767, -143, -1713, 753, 1376, -1213, -822, 1553, 252, -1805, 388, 1585, -1107, -1208, 1557, 560, -1746, 103, 1777, -706, -1349, 1248, 935, -1562, -128, 1768, -362, -1519, 987, 1148, -1563, -473, 1772, -46, -1728, 785, 1390, -1163, -933, 1657, 276, -1765]
3868a765K241J095k660n2K560q23k192J654J622k306q11K754l71k450J227K057
3884A780k150j157K511J12k560Q15K338j819j535K338N87k509L91K484j412j944
3900a730K114J134k562o8K538q28k201J648J572k360n56K386j83k556J336J988
3916A672k004j150K468J31k505P07K220j558j658K294P23k524L22K422j237j979
3932a656K017J121k392j94K453p86k232J734J476k090o46K351l03k355J235J924
3948A657j949j245K372L96k613P54K203j621j539K230O81k485K26K363j138j987
3964a695K069J202k481k80K503o45k249J681J511k279p82K638k76k368J147J930
3980A626j913j215K433K85k554P59K146j508j678K234P44k432J36K307j029j952
$$ y = [-1765, 476, 1571, -1089, -1141, 1419, 596, -1596, 58, 1680, -626, -1437, 1317, 946, -1504, -277, 1780, -370, -1527, 984, 1096, -1464, -649, 1689, -130, -1665, 673, 1260, -1249, -858, 1626, 214, -1730, 384, 1518, -1044, -1112, 1426, 598, -1603, 45, 1617, -743, -1299, 1087, 904, -1652, -316, 1672, -332, -1482, 986, 1117, -1388, -681, 1539, -19, -1677, 617, 1340, -1184, -862, 1560, 323, -1656, 361, 1482, -910, -1104, 1349, 563, -1669, 65, 1541, -549, -1195, 1156, 853, -1502, -267, 1657, -292, -1537, 835, 1231, -1382, -628, 1575, -46, -1585, 645, 1326, -1159, -933, 1430, 292, -1695, 374, 1576, -905, -1185, 1318, 673, -1576, 105, 1616, -663, -1445, 1193, 917, -1451, -304, 1626, -287, -1502, 931, 1216, -1338, -579, 1567, 59, -1619, 615, 1359, -1073, -937, 1370, 341, -1611]
3996a611J869J223k303m13K480o35k091J456J543k097p64K455k34k405J243J887
4012A603j952j168K298M11k493O24K329j597j718K227Q30k444J18K347j049j913
4028a547J862J044k268k41K383o11k135J495J499k078p24K450k15k441J283J839
4044A595j810j392K489Q7k416P53K231j505j541K060P82k286N8K267j062j840
4060a530J739J281k262l62K414o18k135J340J698j954r25K351r3k323R85J962
4076A568j659j405K304K48k245M92K191j516j602K135P65k330J09K284j042j887
4092a590J816J209k248l26K261m86k139J438J483j843q46K367j57k163P54J923
4108A453j640j223K194L89k363N05K117j313j640K002R29k501J32K288j027j814
$$ y = [-1611, 258, 1481, -822, -1235, 1245, 610, -1481, -25, 1518, -579, -1343, 1112, 878, -1527, -284, 1603, -349, -1517, 781, 1192, -1301, -677, 1652, 55, -1663, 564, 1394, -1050, -932, 1415, 366, -1547, 315, 1359, -909, -1150, 1233, 622, -1513, -18, 1481, -597, -1321, 1129, 914, -1527, -244, 1595, -215, -1607, 882, 969, -1447, -694, 1537, 32, -1509, 551, 1333, -953, -895, 1372, 310, -1530, 209, 1490, -772, -1134, 1280, 662, -1473, -133, 1565, -389, -1314, 1037, 944, -1379, -394, 1568, -91, -1496, 808, 1056, -1189, -697, 1494, -22, -1624, 511, 1276, -1054, -945, 1339, 297, -1590, 226, 1435, -813, -1139, 1122, 636, -1503, -65, 1418, -425, -1271, 1096, 939, -1224, -470, 1453, -187, -1410, 784, 1173, -1190, -685, 1432, 119, -1521, 481, 1410, -1091, -959, 1329, 302, -1512]
4124a512J682J249k068l97K309n65k221J345J734k027q82K531l48k215R95J878
4140A488j667j256K137M16k271N52J930j174j723K005Q87k265P2K182r73j803
4156a463J641J212k160l41K343n65k177J444J552j972p69K287j19k273R78J827
4172A445j737j095K152K00k103M50K126j289j638J944Q05k207J12K084q72j790
4188a413J494J339k124l85K241n43j913J116J680k012o61K192n4k100P59J808
4204A424j670j094K029N07k280L90K107j245j604J806R68k280l4K226p99j858
4220a407J511J235j964m85K170m52j898J124J619j794r39K159l3k064P60J923
4236A465j574j288K064M70k174K90K117j158j664J857R35k138j47K133p23j810
$$ y = [-1512, 170, 1419, -649, -1046, 1263, 698, -1523, -178, 1556, -471, -1353, 1178, 830, -1385, -390, 1488, -179, -1435, 702, 1118, -1153, -601, 1329, 155, -1568, 437, 1324, -941, -869, 1313, 340, -1463, 178, 1390, -770, -1111, 1232, 667, -1510, -66, 1486, -486, -1255, 1032, 913, -1360, -382, 1445, -292, -1387, 765, 965, -1138, -688, 1438, 149, -1489, 455, 1260, -947, -835, 1249, 377, -1413, 81, 1420, -704, -1089, 1152, 609, -1304, -188, 1492, -520, -1181, 1011, 957, -1143, -384, 1424, -246, -1340, 689, 1196, -1084, -694, 1413, 168, -1436, 370, 1338, -942, -976, 1250, 451, -1407, 104, 1339, -625, -1110, 1060, 608, -1290, -166, 1453, -341, -1280, 879, 846, -1218, -458, 1465, -109, -1397, 667, 1137, -1037, -747, 1370, 212, -1452, 405, 1340, -798, -945, 1188, 465, -1345]
4252a345J353J344j989n40K230l91j971R69J721j812q34K017L67k276P22J814
4268A379j479j118J764N84k170K78J952j054j451J714Q84k052j89K182p65j805
4284a346J433J333j926o55K222k47k102J155J440j553r48J979K36k108N79J841
4300A333j379j330J927O07k142K52J979r51j665J658R29k008j83K177n64k028
4316a388J384J319j846n60K020k33j950J003J686j601j108K037K55k217P08J822
4332A331j325j360J761P45k063J40J951r27j610J529J051k036j96K024m95j836
4348a316J289J293j776p48K190j92j961R29J594j517j034K015K07j997M83J842
4364A301j275j353J827O88k022O3K005r40j638J692R90k072k26J997n54j830J301
$$ y = [-1345, 8, 1352, -637, -1177, 1053, 662, -1309, -340, 1381, -431, -1265, 752, 1119, -1157, -435, 1379, -100, -1218, 546, 1130, -1040, -762, 1190, 136, -1315, 399, 1283, -769, -958, 1224, 459, -1346, 87, 1420, -506, -1161, 1061, 814, -1288, -133, 1307, -246, -1194, 785, 1021, -1087, -508, 1333, -46, -1376, 551, 1158, -984, -732, 1247, 296, -1369, 289, 1218, -790, -973, 1204, 640, -1388, -4, 1315, -531, -1091, 929, 696, -1254, -251, 1435, -166, -1274, 763, 1018, -1199, -491, 1331, 6, -1354, 407, 1152, -911, -771, 1180, 253, -1357, 172, 1223, -813, -1009, 1015, 520, -1316, -27, 1266, -510, -1258, 932, 740, -1221, -292, 1302, -215, -1249, 766, 973, -1024, -541, 1301, 26, -1327, 500, 1188, -834, -771, 1234, 294, -1344, 348, 1338, -734, -960, 1037, 483, -1347, -46]
4381d6J404j780o86J985j15j976Q66J660j525j122J970L61k065N20J853j252j443
4398a391J826O13j962J77J896p10j792J458J040j734m25K063m60j845J192J441
4414A387j776p10K014j84j823Q64J553j499j042J933J86j987M96J829j195j394
4430a348J803O47j972kK089q37j689J434J089j825m73K030l84j787J108J465j784
4447d36p03K038j1j946P04J712j425j127J867L19k035M43J945j167j387J561Q43
4464A195j939p2J951o73j726J357J175j888m60J925k22j886J160J327j660p64
4480a200K011q5j922P82J795j439j175J793M66j940J95J853j050j344J583P46
4496A069j822k0J878p41j589J317J195j816n11K041l00j966J094J594j709r27
$$ y = [-46, 1358, -422, -1108, 877, 762, -1214, -348, 1312, -213, -1335, 635, 996, -1069, -549, 1304, 52, -1391, 435, 1048, -914, -737, 1159, 449, -1343, 115, 1155, -579, -1004, 1059, 599, -1246, -54, 1387, -389, -1099, 915, 731, -1092, -228, 1325, -174, -1216, 717, 903, -1084, -588, 1241, 46, -1348, 455, 1102, -870, -872, 1217, 380, -1309, 125, 1214, -611, -1084, 946, 562, -1225, -117, 1348, -436, -1139, 899, 888, -1058, -354, 1358, -67, -1194, 673, 992, -1043, -600, 1345, 178, -1209, 352, 1195, -744, -816, 1135, 462, -1264, 93, 1268, -620, -1080, 845, 623, -1263, -103, 1224, -436, -1200, 811, 726, -1196, -414, 1381, -58, -1233, 560, 1026, -914, -719, 1134, 84, -1260, 323, 1069, -753, -773, 1105, 364, -1225, 92, 1287, -529, -1040, 1001, 701, -1265, -171, 1423, -286, -1213]
4512a213J959J14j838N62J579j158j201J711M72j901K61J862j001j527J724P59
4528A164j818k44J963n99j746J422J160j776n73J984k03j822R08J366j371r30
4544a115J809J78j982O08J796j254j325J855M97k033J92J993r58j632J763P43
4560A135j869j99J945m55j853J297J233j708n62J833j42j863J096J417j574q31
4576a100J784K21j905O07J545j072j209J546O65k000J35J967r60j479J509R34
4592A188j864j30J832n89j683J255J238j797m68J935l07j861J115J492j614q31
4608a089J796J39j968O38J789j309j238J695M85j826K17J727p45j537J400J004
4624A178j893o2J828n06j786J236J214j675m35J913k84j905R26J516j438j083
$$ y = [-1213, 746, 860, -978, -416, 1163, 5, -1196, 515, 987, -914, -653, 1209, 208, -1319, 405, 1164, -654, -898, 1065, 466, -1280, 142, 1302, -474, -1047, 937, 734, -1088, -180, 1186, -185, -1115, 694, 872, -1110, -502, 1294, 40, -1285, 570, 1067, -966, -774, 1219, 261, -1371, 392, 1135, -734, -933, 1012, 557, -1296, 1, 1234, -474, -1036, 797, 655, -1208, -112, 1305, -269, -1100, 684, 905, -1000, -393, 1152, 80, -1129, 417, 1082, -918, -783, 1184, 224, -1255, 254, 1188, -676, -806, 1026, 437, -1246, 9, 1247, -550, -1018, 917, 610, -1251, -136, 1356, -258, -1089, 707, 846, -1122, -484, 1305, -4, -1242, 453, 938, -888, -671, 1056, 311, -1226, 174, 1178, -715, -777, 1051, 545, -1241, -5, 1209, -466, -901, 1012, 728, -1177, -251, 1265, -173, -1256]
4640a256J990J54j947N88J643j259j126J688N51j945L62J665q13j603J518R88
4656A198j902l01J903l90j675J083J344j635p73J982k8j941P77J558j369j013
4672a182J877K52k031N53J809j233j259J680N75j855J76J777r29j461J518R11
4688A178j768l91J969n15j710J216J329j762n33J885j77j904R31J519j403j070
4704a206J842L27j902M61J805j240j289J693O76k082K21J950r48j495J304J064
4720A181j812j96J821m77j762J117J395j664o59J982k76j887R20J516j338j103
4736a242J794L66j873M43J654j099j356J724O66j982J10J981q56j578J478R38
4752A168j845k31J923m45j736J088J305j681o20J800N3j731O21J551j365j016
$$ y = [-1256, 734, 888, -1059, -471, 1172, -87, -1213, 475, 1026, -919, -557, 1108, 295, -1308, 210, 1198, -704, -1005, 898, 508, -1167, -84, 1260, -375, -1148, 834, 806, -1135, -358, 1200, -169, -1182, 695, 947, -1084, -531, 1278, 45, -1214, 466, 1041, -814, -638, 1139, 210, -1251, 267, 1178, -590, -981, 988, 473, -1237, -21, 1308, -454, -987, 898, 721, -1183, -252, 1267, -136, -1206, 636, 963, -939, -478, 1327, 87, -1202, 491, 1167, -915, -694, 1256, 308, -1187, 117, 1181, -631, -827, 994, 517, -1245, -128, 1267, -397, -1056, 926, 650, -1237, -317, 1199, -139, -1242, 552, 918, -955, -512, 1142, 43, -1313, 411, 1077, -905, -795, 1186, 330, -1248, 230, 1168, -677, -908, 1015, 570, -1166, -78, 1227, -454, -1074, 726, 779, -952, -331, 1220, -145, -1161]
4768a161J765K64j813M09J690j099j245J560O88j786j01J879o67j581J172J245
4784A219j846k92J931m62j623Q83J343j555o88J918Nj930P00J555j420r02J812
4801F48K17j783L27J778j108j218J564N79j784J0J742o12j549J352J082j855k48
4818h58J829m26j793J080J449j651p13J804R5j847O87J673j409j125J749M21k011
4835a046N47J747j173j281J535P93j906O1J857p02j696J402J020j765k90J733
4851H36l36j670R76J373j520p38J836j9j773O61J521j285j002J676L59j831L53
4868e83J810j163j348J594P40j828p7J835o71j551J340J221j799m11J843l83j750
4885a181J025J382j523p65J753O0j698N70J527j300j092J741M04j809J87J879
$$ y = [-1161, 604, 868, -945, -536, 1154, 55, -1190, 370, 1058, -728, -829, 1050, 383, -1198, -26, 1219, -627, -919, 1012, 550, -1073, -190, 1153, -402, -1090, 828, 833, -1097, -397, 1158, -262, -1164, 648, 865, -918, -591, 1187, 79, -1139, 425, 1004, -780, -770, 972, 360, -1189, 163, 1245, -610, -858, 971, 545, -1248, -168, 1281, -370, -1083, 721, 816, -1031, -344, 1329, -80, -1205, 544, 965, -1046, -499, 1248, 75, -1206, 329, 1122, -784, -723, 1134, 432, -1264, 138, 1158, -607, -897, 836, 500, -1170, -194, 1179, -341, -1079, 757, 738, -1035, -374, 1147, -138, -1140, 536, 895, -936, -583, 1227, 64, -1284, 310, 1050, -778, -855, 980, 309, -1242, 98, 1319, -480, -891, 952, 569, -1181, -156, 1226, -297, -1062, 691, 751, -947, -377, 1150, -150, -1242, 499, 903, -906, -719, 1160]
4901A160j034j308J442P46j749q1J847o62j493J195J065j746m38J863j55j938
4917a286J081J420j581o71J815J04j957P27J636j319j099J651N04j921K45J845
4933A194r63j421J431Q85j883m0J857o47j628J191J299j791n55J960j61j925J104
4950i3J333j614p43J750J40j883O80J735j383j149J775M43j808J77J853j075j285
4967a147J509P45j819m5J795n82j638J251J149j711m74J874j90j918J013J415
4983A227j456q72J747J79j871N74J647j183j114J597O21j990K57J706r16j374
4999a221J550R45k070m8J854n84j626J271J074j619n27J998k32j929J047J236
5015A119j401p76J821n7j795P25J612j332j141J758M93j947J89J904j014j370
$$ y = [1160, 126, -1182, 260, 1006, -743, -824, 1023, 361, -1132, 63, 1128, -618, -1056, 807, 652, -1286, -205, 1215, -366, -1037, 778, 882, -1075, -348, 1288, -31, -1130, 521, 1025, -896, -651, 1194, 231, -1190, 241, 1126, -757, -797, 1060, 413, -1215, -24, 1275, -516, -1071, 889, 728, -1197, -93, 1240, -374, -1117, 633, 773, -1110, -430, 1305, -78, -1227, 548, 991, -817, -640, 1213, 138, -1147, 362, 1107, -712, -757, 1038, 456, -1182, 69, 1218, -493, -967, 907, 717, -1201, -188, 1227, -229, -1101, 646, 825, -1046, -472, 1175, -8, -1122, 475, 1096, -894, -637, 1069, 153, -1221, 329, 1274, -796, -844, 1010, 426, -1200, 71, 1145, -474, -1001, 997, 765, -1164, -117, 1119, -282, -1058, 763, 706, -1089, -364, 1248, -84, -1225, 533, 1026, -921, -732, 1172, 158, -1212]
5031a212J528P09j796k9J695m50j653J229J205j643n93J893k65j746Q39J484j548
5048c53o33J665J72j822N34J634j277j210J859M17j768J88J779r56j514J618P91
5065A124j725k34J880o79j541J232J125j743m85J864p9j843Q83J401j441p37J618
5082F20K99j990P09J538j308j050J659M46j855K73J781r51j338J408R16j857j19
5099h19J856o53j494J052J184j506o20J863k07j813R43J458j485q17J837o1j695
5116i77O23J503j278j057J623N00j799K08J676o80j481J300R07j738j36J795m72
5133E17j729J219J160j539n52J861k92j711R18J373j498q22J768J49j788N18J556
5150A108j130j079J560N64j912K57J681q33j456J442P97j723q8J851o26j587J278
$$ y = [-1212, 316, 1025, -771, -800, 895, 445, -1208, 21, 1226, -417, -1010, 883, 618, -1128, -289, 1195, -353, -986, 679, 851, -971, -437, 1197, -80, -1290, 569, 986, -782, -594, 1185, 229, -1285, 333, 1124, -601, -835, 1045, 366, -1175, 57, 1182, -561, -1046, 818, 739, -1104, -221, 1180, -261, -998, 620, 919, -1071, -362, 1176, -132, -1182, 477, 923, -932, -659, 1122, 171, -1167, 241, 1157, -700, -819, 1037, 384, -1110, -58, 1126, -380, -1000, 863, 656, -1157, -214, 1244, -241, -1058, 779, 718, -977, -354, 1149, -129, -1186, 437, 937, -862, -654, 1022, 342, -1139, 161, 1068, -670, -806, 989, 517, -1212, 7, 1167, -372, -924, 937, 645, -1066, -148, 1225, -273, -1095, 673, 822, -966, -448, 1108, -22, -1101, 459, 1023, -889, -632, 1049, 216, -1240, 202, 999, -724, -812, 1039, 413, -1174, 104]
5167A04J107j597n71J883k55j805Q16J485j325r47J781J87j881O31J528j128j181
5184a168J736L99j862K78J764q84j394J343R41j801j26J752n10j578J092J140
5200A122j668m09J825l23j634Q46J513j577q14J847J49j982O78J661j264j154
5216a184J614N17j850K40J801r19j398J477P58j717q6J791o10j537J173J075j563
5233d18n79J775j80j669Q44J438j441q31J803P7j802N02J551j193j044J578N94
5250A005j931K99J673p25j508J499Q07j767k30J903m95j787J340R92j452o17J841
5267H47j63j782R16J346j331q69J700J71j819O11J534j204j214J774L89j726K98
5284e22J533q19j308J333Q54j708k13J799m61j730J239J141j509m92J708j71j797
$$ y = [104, 1211, -386, -957, 926, 671, -1134, -318, 1167, -158, -1105, 676, 863, -1018, -387, 1141, 13, -1168, 568, 967, -895, -617, 1147, 263, -1131, 212, 1153, -648, -774, 978, 468, -1110, -18, 1122, -546, -955, 870, 547, -1087, -241, 1272, -305, -1119, 728, 877, -1105, -427, 1234, -30, -1184, 430, 947, -903, -663, 1138, 219, -1179, 298, 1056, -661, -747, 1044, 434, -1103, 70, 1145, -418, -997, 778, 598, -1071, -227, 1211, -230, -1061, 742, 819, -983, -481, 1070, -123, -1167, 411, 1005, -926, -627, 1046, 321, -1187, 312, 1119, -648, -878, 1025, 530, -1257, 83, 1075, -377, -994, 847, 684, -1098, -182, 1164, -167, -1036, 664, 835, -984, -373, 1161, -43, -1257, 517, 906, -820, -522, 1011, 192, -1116, 217, 1071, -637, -850, 949, 488, -1242, -3, 1138, -371, -863, 845, 674, -1123]
5301a123R22J300j424p60J781N4j728N75J583j134j250J748M42j814L14J539p99
5318B26j369J398Q88j824j22J769m52j618J088J189j534o03J748r8j805J042J193
5335A116j452o72J604J46j715N15J642j202j099J493N01j630J14J681p56j394
5351a108J305R55j761j87J785o13j555J166J176j578m72J763k06j700Q68J231
5367A069j413p87J764L40j942O07J476j087j328J767M88j823K01J625q05j433
5383a281J459Q14j704o4J747n94j575J131J177j522n67J718j32j686R28J288j300
5400a63p78J567J73j795M88J618j155j129J709L58j666J24J669q32j276J363P96
5417A071j609k13J713o74j413J135J234j700m73J728k21j543O72J399j273r20
$$ y = [-1123, -201, 1099, -325, -1085, 696, 750, -978, -403, 1180, 46, -1204, 544, 986, -828, -514, 1025, 226, -1143, 255, 1143, -681, -803, 966, 514, -1104, -16, 1173, -361, -964, 784, 686, -1119, -77, 1116, -336, -1008, 596, 742, -973, -458, 1184, -18, -1117, 376, 877, -753, -639, 1042, 286, -1108, 197, 1152, -609, -796, 989, 376, -1179, -13, 1163, -415, -887, 876, 670, -1030, -162, 1069, -344, -1131, 633, 973, -969, -362, 1114, 27, -1301, 466, 954, -869, -668, 957, 152, -1281, 178, 992, -712, -776, 971, 377, -1198, -67, 1110, -412, -979, 739, 607, -1079, -151, 1137, -163, -941, 626, 799, -996, -508, 1110, -45, -1174, 535, 893, -773, -649, 1020, 188, -1088, 275, 1071, -538, -751, 962, 288, -1125, 10, 1244, -456, -929, 799, 578, -965, -293, 1106, -167, -1087]
5433a087J743J57j681M22J552j108j145J546M41j681K56J599p43j364J297Q51
5449A055j680j25J619m25j518J011J278j697m84J846l01j624Q49J296j264q36
5465a000J522K48j634M16J521j061j124J500M96j724J90J669q15j273J291P99
5481A021j626j60J804m99j536J074J026j482n38J714j81j652Q32J387j446p62
5497a024J552J85j646N55J430r59j140J370N70j768K77J544o94j427J273R21j637
5514f18j05J567l57j512R30J021j339n00J657o1j656Q12J266j318p90J580L01
5531H78j751M00J560j096j064J458N06j592J36J565q18j229J348O86j509k43J688
5548I23n52j385J086Q85j400l86J459oj548O87J388j288r21J618J66j573L22J642
$$ y = [-1087, 656, 813, -868, -446, 1106, -2, -1147, 399, 840, -841, -585, 1014, 271, -1093, 204, 1055, -625, -750, 869, 444, -1074, -63, 1215, -482, -966, 880, 579, -1045, -196, 1100, -164, -1000, 522, 770, -864, -448, 1073, 12, -1112, 388, 884, -840, -650, 1019, 204, -1069, 222, 1021, -605, -765, 1039, 540, -996, 78, 1104, -378, -916, 798, 617, -1035, -203, 1184, -262, -1024, 528, 713, -933, -378, 1052, 93, -1047, 323, 893, -875, -598, 946, 252, -1175, 98, 1019, -618, -723, 844, 487, -1025, -95, 926, -413, -913, 744, 683, -973, -161, 1105, -213, -1003, 577, 878, -873, -473, 1087, -9, -1073, 385, 891, -701, -565, 1000, 182, -1047, 301, 987, -522, -765, 923, 371, -1014, 72, 957, -443, -829, 630, 624, -924, -237, 1151, -137, -1058, 560, 726, -847, -525, 1117]
5566A117j103j120J535N05j659J94J472p10j234J198Q07j542k36J595k34j590
5582a005R23J193j519m88J651o8j678Q27J232j266p99J600K03j680M21J527r48
5599A26j114J308O48j678K2J648p58j299J302P69j471k02J647n30j437R41J077
5616I99j398m89J569j38j530P73J237j242p22J452L10j656M51J349r51r36J196
5633B74O26j647J3J644p28j235J200P70j437k49J698m31j467R10J100j404o07
5650i70J631j43j455O18J310j130q34J461K49j498L75J370j023r51J311N13j545
5667g11J56J456o22j329J252P72j497l03J607l43j432R29J058j314n26J512r3
5684E72j460P50J149j122r60J581J93j527M84J241q13j129J421M94j558J23J349
$$ y = [1117, 14, -1106, 429, 934, -725, -531, 941, 231, -1003, 195, 1002, -540, -776, 819, 585, -1005, -82, 1111, -408, -896, 755, 687, -991, -164, 1068, -198, -997, 603, 806, -874, -453, 1074, 126, -988, 320, 968, -710, -688, 960, 202, -1097, 205, 974, -497, -699, 948, 418, -1019, -78, 999, -399, -888, 681, 543, -987, -214, 1023, -219, -941, 511, 821, -835, -384, 965, 14, -922, 274, 900, -747, -734, 910, 182, -1053, 147, 917, -520, -769, 929, 498, -969, -59, 1041, -363, -970, 661, 518, -937, -319, 991, -139, -973, 488, 737, -761, -386, 984, -39, -990, 321, 834, -711, -555, 901, 279, -1050, 202, 974, -523, -826, 781, 438, -994, -65, 993, -321, -847, 665, 572, -888, -138, 1011, -111, -1071, 510, 703, -824, -340, 901, 88, -1041, 380, 874, -684, -561, 788]
5701G88n40j332J163Q51j486j50J482l90j364R10J105j321n43J429J1j526O08
5718c05J326j133p20J362K71j685M12J434q95j053J408M69j594M8J613p13j235
5735i90J231P05j439k05J576n02j408R37J017j258m76J548j67j356N07J341j211
5752a50o85J313L06j489K21J460q58j023J318M07j554J23J476o39j215J131P29
5769H71j416k06J499l46j361Q99J021j292m39J445j54j362O06J124j038p77J410
5786D84K01j478M06J297p35j084J200N35j489Q5J417o40j175J091P55j319l13
5803g62J457k09j375P67J070j281n05J373P3j557O77J266j116o73J294J63j446
5820g84L48J316p44j068J140O00j579K95J370n60j287R35R98j521j61J496k97
$$ y = [788, 248, -1084, 79, 930, -556, -706, 776, 386, -978, -68, 1037, -284, -827, 602, 613, -913, -305, 1021, -112, -832, 530, 801, -884, -472, 962, 67, -986, 422, 891, -703, -655, 958, 245, -990, 241, 946, -493, -698, 878, 376, -1032, -95, 922, -336, -812, 736, 569, -787, -280, 1061, -150, -835, 478, 784, -705, -484, 976, 118, -905, 413, 820, -734, -611, 865, 226, -989, 142, 871, -545, -751, 748, 402, -959, -60, 961, -331, -770, 675, 521, -841, -235, 889, -149, -926, 484, 685, -793, -387, 910, 175, -909, 291, 826, -663, -578, 839, 199, -976, 115, 870, -449, -762, 695, 486, -889, -122, 948, -333, -838, 535, 608, -949, -272, 994, -122, -795, 499, 662, -784, -436, 880, 136, -932, 208, 808, -771, -476, 894, 334, -953, -18, 980, -541, -702, 794, 497]
5837D97j374P65J094j272m81J363j64j278N03J309j100p63J410J15j328K06J425
5854I27p79j096J238M92j319J2J415o98j107J031P68j377j84J405k33j446J010
5871E9Q28j264m27J568k25j426P52J083j115p21J434J87j539L83J368q22j073
5888i50J277L97j453K23J245m61j280J116P40j242l01J378k98j295P83J000j204
5905c25n41J480r8j435O94J114q88q95J354K26j323L00J267p58j124J257M94j375
5923e76k1J374n19j137R49Q31j407k12J426l05j252P43R62j163m81J350j3j444
5941h95O91J065j023o24J293K89j526K27J501j033q94J195N94j324j25J358m11
5958C58j242J022P91j303l69J566m14j310Q37J004j132o54J438r6j299N83J183
$$ y = [497, -877, -112, 982, -290, -771, 592, 428, -850, -347, 962, -138, -901, 509, 624, -704, -498, 927, 148, -948, 290, 782, -537, -525, 890, 192, -915, 116, 884, -493, -677, 728, 495, -951, 59, 887, -377, -804, 764, 539, -887, -135, 948, -167, -888, 546, 733, -806, -423, 945, 123, -950, 327, 724, -729, -506, 739, 278, -1002, 114, 854, -388, -689, 689, 391, -904, -121, 879, -325, -866, 614, 516, -919, -225, 889, 1, -894, 460, 686, -637, -337, 930, 172, -952, 305, 799, -576, -597, 777, 258, -879, 70, 901, -506, -718, 708, 403, -849, -106, 856, -307, -788, 562, 549, -895, -204, 861, -162, -786, 507, 796, -730, -503, 998, -35, -929, 266, 860, -464, -589, 769, 358, -884, 138, 929, -374, -743, 823, 409, -901, -64, 940, -192, -846, 592, 496, -803, -220, 963]
5975I63j063p89J321K09j321J93J326p01j042J067P07j417j28J440n49j107R20
5992B9P59j249k18J452l10j334P48R49j084o10J386l1j263N34J170r69q33J281
6010D07L40j436L37J203o41j152J206M48j278j0J342n24j152J013P45j243k24
6027f19J332j90j393P42J096j303m72J395K6j420O46J104j002o71J123K80j425
6044g51K61J390p96r77J186M54j231j35J342m74j147R19P81j223l41J402k41j207
6062g88P06R09j084m48J192J6j374N37J151q73q87J398J88j264K98J087p35q41
6080h12J130M48j319M4J298o33r67Q92Q14j295j83J245k76j277O98J085j083n73
6098g64J222P9j274M82J082q89p63J060L72j333L73J175q18q17J102M28j184k5
$$ y = [963, -100, -889, 432, 641, -680, -487, 839, 138, -904, 163, 870, -547, -675, 765, 216, -891, 29, 788, -461, -679, 773, 463, -871, -123, 826, -258, -868, 518, 487, -776, -242, 928, -41, -874, 407, 747, -689, -352, 851, 210, -942, 264, 712, -566, -576, 766, 242, -910, 103, 848, -395, -619, 713, 523, -870, -128, 968, -335, -807, 588, 614, -806, -160, 944, -58, -729, 394, 674, -751, -490, 900, 104, -873, 313, 767, -464, -599, 743, 269, -878, 41, 822, -401, -742, 660, 419, -788, -82, 827, -257, -705, 487, 503, -871, -334, 817, -56, -943, 455, 643, -621, -323, 764, 29, -812, 318, 766, -553, -509, 789, 156, -811, 81, 895, -400, -583, 662, 386, -891, -193, 892, -191, -764, 458, 537, -737, -255, 827, -62, -825, 235, 607, -726, -353, 822, 4, -813, 289, 717, -467, -492]
6116d92J126m55j041R32Q76j280l96J392k22j259P44R01j114m69J184J30j227
6133f70M56J052q99q37J231L96j440L39J240p82j012J145L91j144R0J045l82j087
6151h68J068N66j220j94J324k51j134N79R48j048m49J152J15j370M37J188r37
6168i4o54J163L91j437K73J232p50j000J094N87j356N2J369o47j111R36P01j120
6186c71l47J379k57j097N91R08j079n05J235J03j320M84J102q85p60J042L65j227
6204f39K38J221o95r03R15N84j228r1J339m22j088Q83O87j152l02J235j97j213
6222h28Q37Q32j054n12J267j12j146N68R11p58q31J218K08j121J41J167p28r25
6240h66J101M53j176j8J221m86j072Q96P53j147j98J198k96j155O89J064j131
$$ y = [-492, 634, 179, -862, 70, 946, -334, -730, 662, 440, -819, -75, 826, -288, -757, 427, 557, -670, -214, 838, -61, -898, 333, 729, -711, -372, 868, 86, -926, 219, 610, -534, -444, 601, 219, -868, 200, 766, -454, -648, 676, 425, -709, -130, 818, -230, -679, 473, 588, -782, -345, 843, -94, -748, 415, 806, -631, -358, 874, 124, -876, 218, 805, -551, -499, 870, 223, -888, 48, 749, -371, -718, 661, 404, -693, -102, 806, -273, -778, 457, 560, -760, -276, 826, -59, -819, 223, 588, -639, -401, 820, 125, -778, 137, 721, -507, -598, 741, 319, -769, 114, 801, -351, -653, 582, 385, -828, 9, 841, -213, -725, 542, 430, -716, -148, 763, 5, -826, 392, 600, -521, -380, 787, 59, -866, 235, 688, -488, -506, 715, 229, -843, 53, 806, -341, -539, 659, 363, -792, -103, 961, -170]
6257a70n70J316j0j204M97R05p74o60J064K93j295K23J201p17r97J105M54j148
6275d87n9J278n48r57P82P20r65m16J188j74j026O31P75q89o27J292O6j219L43
6294b92R99p88p26J192J87j132K70J054n86r84J008N28j289N2J186l93j096Q55
6312D5P61j175k97J273k59j161P63Q29r60o21J189J68j220M62R98p87q07J167
6330C68K34j206K24J134o99q61R65N93j193nJ155m26r98Q25P15j208k20J206j17
6349D86j101N42Q04r69n17J214P0j269O16Q90p72p06R58L80j210J43J129n89q83
6368g84J024L78j078r6J230n06q68P12O54r99k66J143k68r82O96Q42j078l84J154
6387E24K8j275O06R59r27o31J076K82j269J58J216p23p46R15M75j167o8J213m40
$$ y = [-170, -740, 576, 566, -638, -141, 764, -10, -670, 394, 687, -608, -385, 816, 99, -898, 207, 661, -487, -546, 732, 184, -773, 9, 729, -236, -652, 536, 362, -664, -33, 742, -147, -774, 518, 584, -635, -292, 707, -81, -807, 385, 572, -560, -290, 764, 178, -806, 202, 730, -559, -507, 679, 286, -810, 45, 806, -369, -666, 607, 348, -813, -50, 779, -181, -802, 387, 555, -665, -203, 795, 8, -799, 368, 602, -604, -380, 754, 55, -806, 159, 752, -441, -446, 709, 283, -715, 110, 825, -383, -603, 603, 486, -615, -73, 731, -238, -755, 459, 529, -740, -124, 766, -6, -712, 246, 626, -584, -441, 688, 99, -784, 240, 618, -460, -556, 674, 168, -700, 12, 666, -333, -599, 544, 276, -706, -10, 832, -246, -630, 524, 552, -723, -117, 842, -85, -716, 360, 642, -627, -469, 747, 24, -722, 193, 668, -499, -567, 646, 206]
6406B06r88Q64O08j047l01J104p9j188O19R26q65n61J268n5j176L93J094q25p37
6425g40J060K71j101J99R85o52q70J092M53j285R7J123m72r41P51Q20j149k08
6443e67J078j96j030N98R12j038m75J226O5j159M10Q68q72n34J058L18j186J05
6461d19J149o58q50R31N19j197rJ101k78j072Q09P06j045k35J189j87j084N68
6479f2Q70j007l76J118r1j186M87R98q07p19J084K84j236K49J193p63p64J013
6497B85L80j158M0J088m53r62Q75O75j081k78J272l39j155O69J002j221l69J200
6515D70N2j230M09J046q22o41J133J85j219J21J183o70p65R55M53j053j23J129
6533F13l65j012Q37O40j131o3J107l40r84O07R10j002m21J200j22j113M18J040
$$ y = [206, -782, 82, 690, -357, -658, 446, 367, -821, -202, 724, -141, -702, 566, 511, -665, -272, 822, -3, -740, 320, 591, -510, -311, 674, 22, -848, 244, 697, -588, -491, 632, 160, -781, -30, 790, -359, -567, 511, 315, -715, -117, 795, -243, -718, 508, 573, -586, -176, 692, -180, -714, 344, 662, -524, -419, 730, 72, -778, 153, 672, -525, -534, 567, 289, -783, 26, 732, -313, -548, 641, 454, -630, -62, 808, -199, -575, 543, 452, -734, -247, 751, -56, -775, 309, 593, -643, -394, 799, 36, -728, 285, 665, -493, -453, 635, 182, -780, 95, 770, -311, -589, 683, 344, -811, -142, 860, -361, -730, 470, 522, -708, -299, 747, -75, -716, 417, 602, -617, -496, 687, 17, -748, 207, 660, -393, -516, 613, 248, -764, 73, 713, -418, -481, 626, 286, -698, -91, 819, -183, -604, 596, 474, -639, -221, 819]
6551H19r24n37J030K14j199K67J109p06p27Q18N14j187J37R43m30q95Q38O01j074
6570c89r1R94k13r55N21R10r62n76J150j09r27N39Q59q55n94J072K31j096J71
6589c20J081p08p98Q92M69j069P9J073n46q81Q66N72j109r3J025j99j042O99P24
6608G15r76l93J127q1j080N43P98p56n85J062J70j219M19R86p75o49Q42M31j083
6627e04J1J035l52q38P44N13r63k00J242m28r65P29Q05j119k58J001%j067M09
6646b05Q84p05p01J070J87j105K42J066p14q02R68K91j050J68J039m38q84P61
6664G2N59j102M4J005j94j102P26O60q65l98J029J9j060N26P65p25n86J010Q7
6683D70r27J37J047p02p86J034L61j122Q0J106n35r14Q06O09j026k67J211k80
$$ y = [819, -105, -642, 388, 602, -597, -330, 779, 73, -654, 164, 678, -509, -372, 571, 141, -754, 84, 685, -389, -480, 514, 301, -654, -133, 777, -185, -761, 389, 280, -647, -108, 751, -104, -698, 374, 605, -491, -320, 761, 53, -745, 147, 616, -453, -374, 699, 153, -728, 138, 710, -399, -492, 533, 334, -708, -9, 715, -261, -654, 473, 392, -688, -145, 653, -103, -688, 374, 544, -675, -256, 730, -45, -694, 148, 579, -504, -493, 542, 190, -648, 96, 609, -354, -554, 688, 260, -705, 24, 829, -290, -548, 453, 453, -614, -205, 679, -26, -727, 343, 530, -575, -333, 733, 19, -783, 185, 476, -574, -406, 633, 195, -689, 72, 631, -471, -427, 578, 384, -718, 8, 668, -197, -595, 434, 453, -607, -81, 684, -41, -627, 383, 470, -457, -320, 727, 25, -761, 273, 634, -488, -408, 698, 163, -751, 55, 664, -362, -629, 582, 302]
6701C02j106Q12P64r77l86J068m3j024M71Q41q31m63R15K02j063J70J043o45p04
6720f54Q19M47j098R3J100o16p94Q10N71j080o2J033k87j021P58O76r04l12R14
6739C93n9j033M97Q70q18n12R67K11j152L37Q94n46p57J003K68j085J16J051n31
6758A14p58P74N07j020j19J057l28r32P58O68j016l05J086q6j064N30Q75r10l91
6777e60R26Q0r44L67P92n47p13R14L53j005l0Q97m68p24Q40L51q35k21J088l00
6797B61q06N54O53p95m03J018j04r93N26Q02q28n24R29J19j091M20R92p74o17
6816f61R36K46j057Q9J044n35o51O03O58j068r6J119m35r12P06P04r25k72J060
6835E53j95j067N62R13q95n09J041J08j072K96R64p47o07J005K75j104J38J018
$$ y = [302, -804, 8, 772, -205, -591, 477, 434, -590, -119, 722, -109, -572, 343, 545, -518, -348, 695, 50, -654, 165, 612, -486, -393, 707, 91, -703, 107, 678, -402, -464, 569, 282, -739, 19, 695, -209, -521, 393, 334, -699, -202, 668, -150, -662, 305, 516, -636, -299, 595, 49, -708, 295, 563, -522, -406, 645, 114, -644, 130, 637, -383, -502, 555, 227, -705, 53, 721, -295, -600, 486, 400, -664, -134, 741, -169, -560, 366, 446, -498, -131, 661, 114, -599, 315, 668, -337, -367, 530, 62, -662, 178, 529, -306, -527, 561, 261, -545, 9, 662, -133, -536, 482, 378, -615, -89, 713, -115, -639, 290, 409, -682, -262, 730, -44, -661, 275, 521, -536, -447, 597, 62, -589, 14, 672, -396, -492, 627, 192, -720, -14, 690, -235, -507, 553, 358, -709, -147, 766, -129, -638, 403, 511, -561, -265, 699, -48, -655, 350, 625, -479, -341, 677]
6853F77n75p89Q57L37q37j6R85l77q71P45O29j076j66R94j36r62O26O25r07l19
6873e56J101n7j181N04Q28o99o14J017J64j027J60J014n94p14P66N93j027k02
6891e24R95k76p57N56P32j099j31R65J9j087L24R41p32m76Q92J14j016L31Q80
6910F51o67o47R31K69j016O2J076n48p17Q33L53j003M0R70m65p70O61O50r40k67
6930e44J166k71q89M61O92p93m12J024m7r98M75P75p03m86Q33K12r42J07R78o33
6950Eo66Q06N33j082r2J034l35q52O09N71q42k90J153j77j067O05P99q76m60R93
6970C69qr47M03Q28o30p37J088J82j039J37J010n62p74Q11N09j024JR98m19q73
6990f77P48M61q68j92J026j79r48N92O18p31l96Q94R5j037L52Q72p82m91Q88K23
$$ y = [677, 102, -687, 170, 507, -330, -346, 639, 262, -609, 136, 765, -311, -477, 517, 381, -581, 45, 670, -237, -556, 545, 488, -693, -189, 639, -60, -674, 343, 507, -520, -360, 654, 60, -654, 112, 705, -322, -524, 471, 195, -562, -6, 726, -373, -504, 461, 480, -607, -283, 658, -74, -550, 342, 456, -560, -229, 651, -16, -663, 268, 537, -479, -417, 659, 111, -606, 227, 580, -423, -383, 587, 122, -648, 13, 663, -277, -544, 622, 351, -538, -77, 615, -178, -590, 434, 387, -611, -136, 639, -64, -550, 283, 495, -447, -340, 638, 5, -661, 145, 678, -404, -496, 538, 203, -649, -40, 531, -311, -601, 552, 375, -692, -87, 712, -164, -624, 369, 361, -586, -183, 645, 15, -722, 366, 548, -491, -354, 656, 94, -680, 131, 640, -384, -383, 615, 196, -677, 71, 532, -336, -528, 498, 319, -629, -37, 581, -150, -546, 348, 443, -594, -242, 630, -152, -643, 245, 468]
7010D68r02O1R08n68o40Q61L97r90r5R99l33q13P43N19r94j37J036j59q76M35
7030h0P86q31m38J039R4j168L92Q10o01o54Q50K95r35J37R07m63q69R69K80r14
7050c94j18J069m78o05N54N70q95j92R41k25q60O17P53q57m44R88Lj002L87Q64
7070F76o97n78R42K68j151K53Q17m75o95P46L58r00j3J025k99q61N48O03r08j24
7090d65R02j64q68N12O37p80m74J186p3j047L88Q39n85n55Q91P6q72J35Q99n26
7110E6o87Q36M32j081J3R93m20q37Q45M26q89j71R93j74q43M87P04r24l36R98
7130D21lr57L27R31p49o13P93L41r05Q7Q89n69o79Q28M16j019J13R09m35p16O41
7151E1N33q70k71J075j48r38O04N60q16k47Q88p9r03L68Q69p75m48P72K59r97
$$ y = [468, -434, -373, 535, -33, -673, 188, 585, -405, -500, 499, 166, -647, 96, 615, -379, -516, 520, 361, -515, -80, 706, -125, -563, 476, 570, -598, -206, 604, 3, -651, 199, 494, -441, -304, 603, 140, -729, 240, 520, -394, -512, 557, 79, -526, 28, 598, -297, -489, 452, 227, -633, -16, 737, -120, -564, 424, 427, -575, -188, 676, -21, -599, 343, 611, -540, -287, 530, 55, -640, 106, 464, -436, -449, 576, 277, -584, -36, 567, -341, -465, 437, 273, -595, -83, 554, -226, -700, 486, 413, -634, -246, 593, 8, -547, 344, 420, -452, -317, 582, 56, -631, 205, 637, -444, -431, 562, 142, -695, 150, 576, -313, -484, 509, 335, -508, -21, 683, -241, -577, 421, 418, -539, -212, 719, -30, -643, 150, 491, -414, -327, 562, -7, -686, 142, 558, -461, -348, 561, 126, -590, 51, 584, -286, -557, 518, 370, -568, 36, 596, -220, -467, 421, 342, -561, -193, 676, -99, -547, 225, 484, -513]
7171e13K49P87m47o45P12N13j034O7Q32l09q58Q01L33q24r9Q58r0r98P25N56q34
7192b18l00Q48j6r65M90Q82p29n55R02J45r75K12Q92o26n95P24N54j090K0Q83
7212D83l69p60Q23N08r18k40J039l00p99M36O73p48l09R59j59q60L49P48n46n40
7232e30Q78K41j069K03Q86n49o19P05K97q26k3R50k93r73Q01N23q65l07J079j27
7252C82j018N96O92q16m41J101l4j006L61P37p27m45Q88K88r88J19Q80n42o70
7271f43Q60K63q32jR34l98q49Q27M31q73j59Q89k01p67M88N99p25l98J037j24
7291C58q37K71Q61o79n06Q09J27r45K85Q94n36p28O90M23r13O0Q94m38o75P48
7311A63M27r77r4J025l37p39L98P50q07l57R03l2q10L35P79n53n95O33L81j016
$$ y = [-513, -264, 523, 76, -569, 143, 656, -378, -311, 521, 212, -646, 155, 488, -336, -435, 423, 333, -665, 60, 616, -218, -518, 330, 314, -651, -161, 721, -8, -563, 339, 484, -491, -279, 613, -13, -608, 116, 670, -420, -400, 483, 114, -646, 177, 685, -233, -473, 566, 266, -533, -97, 576, -172, -481, 478, 319, -541, -192, 556, 10, -530, 348, 589, -480, -277, 609, 60, -559, 146, 443, -383, -406, 544, 251, -722, 79, 602, -263, -570, 509, 382, -636, -40, 652, -164, -605, 496, 462, -544, -183, 554, -173, -618, 270, 558, -430, -311, 569, 27, -643, 217, 480, -352, -353, 581, 183, -666, 161, 592, -281, -440, 449, 248, -519, -31, 568, -157, -555, 482, 358, -479, -208, 653, -26, -532, 277, 404, -541, -256, 638, 102, -626, 64, 487, -426, -366, 528, 90, -585, 163, 590, -387, -481, 544, 207, -532, -134, 616, -191, -548, 355, 323, -487, -152, 627, 74, -521, 112, 493, -523]
7331e23K77Q96n90p33P60M85r80k3R80m46o99N10O84r06j75R90k47q78O58M95
7351E35o88l86J068r2j015L89P99o96l98P22K28r72L18P06n78n01P98K70q39M3
7371b89Q41m19o89O69M28r09q7R19k42q42N34O10o88l58Q82K5r43M47P21p97m79
7392f66J016O9r04J27R03m66o51P41L26q59q8J002l23q33P16M81q88j21Q72j18
7412C36q76N93N52q04l23R67m2r55M98O52p13m51P74J87q97J84R46n30o97P99
7432B00K96r04j5R70m21o99O41M97q64j05P91j66q10N25O49o88l79Q77n8r39M61
7453a41P99p13l88O65J78q71J70Q89n97n72P52L36r94J00R32m53n70N88L56p21
7473b55j26Q75l46o53M88O12o43m59R14o9q49L80P50p02n05P99L41r72J14P92
$$ y = [-523, -246, 650, 60, -673, 87, 572, -408, -431, 549, 103, -596, -86, 598, -308, -483, 507, 260, -618, 40, 535, -153, -539, 529, 437, -578, -189, 610, -86, -484, 238, 466, -506, -188, 518, -60, -561, 237, 507, -332, -289, 552, 133, -556, 113, 541, -368, -455, 464, 222, -620, -86, 524, -164, -522, 360, 385, -558, -111, 610, -187, -666, 350, 419, -485, -358, 545, 79, -572, 169, 495, -364, -452, 550, 227, -606, 110, 591, -297, -418, 454, 336, -540, 53, 605, -199, -522, 445, 403, -552, -54, 598, -115, -566, 208, 395, -502, -318, 628, 98, -599, 200, 496, -408, -423, 547, 126, -573, 68, 565, -299, -404, 387, 221, -589, -64, 585, -103, -482, 395, 337, -602, -141, 658, -55, -443, 222, 400, -471, -301, 588, -9, -581, 171, 507, -487, -387, 545, 92, -478, 110, 466, -255, -381, 494, 148, -505, -17, 595, -48, -507, 407, 338, -511, -131, 619, -83, -588, 211, 552, -420, -306, 486]
7493D86n23o19Q44L03r36P5Q86m17o98O81M36p45j72R18k83o70M23O23q03l19
7513e10R27K2r18L03Q23p29n27Q20K15r19J79Q97n41n63O95L79q60j43J046m54
7533A42p34O97M47r48p6Q27q3q35N84N91q32l22R99m6r50M17P45p12m40P72P3
7554C16o46P5P56m71o07P18K46p66L3Q23l49o63N37N59q38k16J043k96p22M53
7574a5N89q03k86Q70N3q94L02P62o71m34P85J66q43J31Q83m79o02P71K58j008
7594d65N2J020l86o76M88N95q69k27Q67j34q51M24N87o15k25P77o2q74M71N57
7614D54n59l96Q21K35r70J73Q39m17o45O74L23q95M9Q38m19o67P01L70o63l14
7634d68R47k97p24M95N61o19m21Q95O3r24K83Q11n81n67P74K25r43K41O70m02
$$ y = [486, -37, -656, 188, 491, -445, -370, 516, 99, -599, 82, 518, -227, -399, 519, 236, -434, -11, 612, -191, -510, 417, 439, -479, -176, 647, -82, -609, 211, 426, -493, -314, 583, 42, -521, 174, 553, -307, -450, 596, 142, -592, 105, 552, -396, -472, 355, 272, -563, 21, 612, -220, -542, 457, 411, -539, -122, 623, -89, -529, 243, 316, -330, -255, 501, 30, -577, 141, 387, -379, -346, 477, 128, -535, 2, 561, -277, -493, 550, 254, -468, -15, 574, -229, -515, 355, 408, -486, -184, 578, -93, -527, 258, 424, -419, -288, 595, 116, -486, 285, 543, -465, -413, 607, 221, -455, 33, 628, -241, -468, 399, 265, -586, -162, 425, -190, -415, 362, 300, -574, -103, 454, -105, -501, 320, 555, -415, -242, 597, 180, -465, 209, 532, -363, -314, 524, 105, -562, 139, 509, -154, -468, 479, 182, -542, -47, 514, -105, -526, 369, 432, -492, -209, 602, 21, -546, 228, 453, -490, -249, 421, 19]
7654A9n77P11L21r10O8P88k76n30N24L01o85j65R01k22q74N80N27o15l62P18Q1
7675C23p99L65P01o68l96P89K55j028R4Q15m04o48P93K33p66O4P70k73p15N64
7695F9M17o64k38Q56q7q88M24N62n74l91R00k0r51M20P31n74m87Q67J93r45J94
7716a86Q33n78n36O10K86q35O2P64l52n90N33M95p33j54Q40k11p64M31N89o85
7736a81k54P20K3p80L43O57n69n06P36L59r24J97P32m92o42P21L37q19Q4P81l36
7757A87p38P05M05q34j21Q16k60n99L16P01p01m38R47k4p60L33O23o23m72P04
7777A67K13p55J07P65n31n00P56K06p58l5Q28k86o72N94M56q43j54Q66j88q05
7797e69N46N38o54k34O48O0q29M15O96p03l77P42J45p32J06P85n43n16O08L14
$$ y = [19, -558, 153, 474, -436, -368, 420, 144, -386, 138, 439, -246, -411, 490, 268, -606, -26, 501, -114, -476, 242, 323, -476, -111, 590, -78, -474, 315, 570, -458, -364, 451, 47, -601, 192, 425, -341, -277, 493, 220, -495, 69, 486, -178, -416, 440, 353, -535, -111, 451, -123, -514, 386, 366, -585, -165, 566, -8, -495, 372, 565, -380, -186, 647, 69, -467, 143, 429, -406, -344, 420, 68, -522, 11, 506, -227, -381, 459, 248, -516, -85, 504, -181, -435, 285, 308, -472, -129, 528, -41, -547, 189, 548, -376, -179, 553, 61, -581, 140, 477, -342, -258, 523, 187, -551, 154, 559, -275, -396, 420, 160, -439, -123, 578, -123, -561, 386, 362, -398, -65, 558, -65, -537, 167, 380, -375, -268, 497, -34, -534, 222, 428, -330, -365, 463, 177, -495, 99, 555, -288, -442, 424, 236, -569, -23, 515, -139, -373, 275, 335, -494, -79, 617, -86, -463, 279, 424, -308, -202, 583, 40, -476, 132, 446]
7817D46q30QQ26l14n50O03K96p21r7P45j02p95N14M47o67j97O57J12p86K64O32
7838D91n06n35P51J78p54R4P42m13n89O06L91q35O9P38k78o86N85N02p51j91P79
7859C88k10o03L67N77o84l01P56J24q94K59O68n66m51Q32N5o13l2Q23l79n72O30
7880A74L37p22r7P79l14o50N36N29q35j24P97j81o53L24O10o75k78P76l5p59K48
7901b13P04o16l16N78K19o79J28O77m59o04O33M79r38N2Q10k76o76N24L79p37
7921c31o2Q29j28o46L29N87q00j14O07J3o22J48O25m43m60O61K33o79q9Q82n11
7942B9o10O18M23p47K9P08k95p01N75M50o46k83P98n9q59M59O28o11l23P11j8
7963B76o67K98N61m76m29O54K32q44K56N69l25n29N47L72p25p6O97l13n22M85
$$ y = [446, -384, -376, 450, 136, -414, 189, 485, -236, -333, 412, 310, -485, 29, 476, -191, -388, 269, 381, -405, -141, 491, -15, -550, 201, 379, -375, -281, 461, 48, -541, 65, 456, -379, -310, 428, 150, -536, 49, 551, -200, -391, 388, 178, -425, -58, 519, -165, -466, 290, 414, -480, -221, 447, -119, -570, 262, 317, -296, -328, 495, 116, -456, 174, 511, -211, -308, 471, 157, -493, 43, 572, -263, -387, 410, 229, -424, -100, 510, -165, -443, 333, 298, -461, -213, 491, -125, -441, 137, 356, -323, -195, 482, 23, -581, 52, 531, -407, -355, 455, 179, -497, 27, 406, -331, -393, 436, 308, -338, -9, 578, -222, -336, 271, 284, -338, -190, 435, -8, -468, 193, 426, -253, -342, 540, 29, -581, 37, 460, -287, -258, 450, 155, -546, 29, 479, -167, -450, 348, 289, -570, -111, 517, -94, -417, 294, 276, -391, -93, 468, -8, -437, 217, 449, -395, -139, 430, 105, -424, 123, 495, -230, -306, 391, 78, -444, 41]
7983D1L87o32j25P66k53o32L23N17n33k09N51L3n72K03O28n50l86O48K44q67J56
8004b62P28l15o10N29K82p02Q6Q03m22o99O05M87o25j06N92r3p48M02N67o04k95
8025d00O63Q5o80J51O92m83m57O89J42o34q6P23l23n25M79L57o35j22Q15l18o13
8046d80N08M37o84o7O02o5p33M15N35n03m00O50O7o32J99N95l00o65P87M0o06
8067c00LO30k11o45P40J44p21o1P96j64p62O27L29o67j09P25j37o46L76M02m72
8088a23k01O20K8p34K57N96m92m21P15J05p21R8O24k57n50N01M04o60n4N54q8
8109B01o72M97M50o28k28P38o4o92L16N05n16k58N38J78p47K13N29l36n07N59
8129G6K93p28K06O71m18o27O21M33q06j08P65k14n76L66M42n74j19O12L4o14J85
$$ y = [41, 428, -204, -329, 437, 184, -448, -125, 392, -141, -350, 201, 234, -338, -135, 493, -57, -443, 205, 449, -418, -262, 466, 151, -459, 70, 352, -350, -264, 539, 117, -582, 23, 510, -115, -221, 371, 278, -470, -68, 499, -105, -400, 263, 348, -332, -181, 511, 28, -429, 260, 402, -232, -318, 405, 82, -443, 36, 393, -242, -364, 451, 133, -480, 28, 465, -219, -286, 316, 251, -482, -67, 468, -35, -435, 215, 282, -350, -151, 444, 144, -521, 266, 306, -300, -297, 333, 122, -523, 217, 361, -360, -421, 375, 211, -551, 76, 405, -262, -371, 354, 217, -429, -53, 349, -123, -324, 296, 324, -410, -153, 443, -49, -470, 245, 350, -371, -273, 351, 94, -456, 45, 449, -211, -265, 289, 201, -471, 26, 476, -152, -380, 358, 294, -398, -82, 423, -93, -351, 187, 365, -382, -169, 360, 24, -483, 76, 369, -359, -153, 518, 100, -527, 94, 527, -279, -387, 378, 164, -412, -46, 396, -178, -297, 315, 349, -265, -80]
8150h0N01m12m60O98O6p00L00O21n00m51O13J66o37O2O88l93n14M96L90q11KO78
8172C23r5o99N04L96n77j91O51k9p01L70N40n40l23O23K4n95P3O94m46
$$ y = [-80, 421, 9, -451, 247, 313, -387, -87, 534, 34, -417, 196, 362, -275, -213, 475, 82, -432, 64, 454, -357, -355, 323, 228, -471, 33, 429, -148, -339, 312, 283, -418, -48, 492, -48, -371, 252, 276, -319, -246, 448, 2]
8191B
$$ Imaginary data points
##PAGE= N=2
##DATA TABLE= (X++(I..I)), XYDATA
0@%%%%%%%%%%%%%%%jJ%Lj1J6j6J6j6K0k4K6l0L6m1M8n5N7o5P5q2R0j02J16j28
40f7J39j53J70j87K05k25K46k73L02l30L63m01M43m89N42o05O79p62Q62r87J145
61F17j349J616j986K529l389M899q001J6577p9574k20598L68058J30085m71343
74b61859j4845M95177j46480m25231L96853L47470n29821j08616O15507j45178
84B22977n55829L75021L50221n74326j52720N88426r7493n16994L04646L82529
94C26458m39157k06026N19335M5088m93340J57565M36363l32753l27555M49036
104A35014J51096n10313M0221M72904k43978l76713L93854K31343m61830m9149
114b17551M58606j38981m06708K93913L06494l97602j54277M55557k4569m48422
$$ y = [0, 0, 0, 0, 0, 0, 0, 0, 0, 0, 0, 0, 0, 0, 0, 0, -1, 0, 0, 3, -8, 8, -8, 8, -8, 12, -12, 14, -16, 20, -21, 27, -28, 29, -36, 39, -43, 47, -55, 61, -67, 72, -81, 89, -98, 107, -118, 128, -145, 157, -173, 190, -211, 232, -257, 285, -320, 359, -403, 459, -528, 617, -732, 884, -1102, 1427, -1962, 2937, -5064, 11513, -68061, -288659, 79399, 209484, -261859, -276704, 218473, 71993, -353238, 43615, 391085, -138736, -247352, 368155, 222977, -332852, 42169, 392390, -181936, -334656, 253770, 156277, -360717, -56071, 326458, -112699, -318725, 200610, 245698, -247642, -90077, 346286, 13533, -314022, 135014, 286110, -224203, -183982, 288922, 44944, -331769, 62085, 293428, -168402, -217551, 241055, 102074, -304634, -10721, 295773, -101829, -256106, 199451, 174882, -273540]
124b73540K13749L80179l64677k39186M51169M1202m70844J53087M03024l15114
134b0951k75821M06531J05883m28771P5016M02520k16239l12630L25082J86216
144B46836l89595l6868M01982j21668l67970K53061K68368l52715j22407M08425
154A87449l3784l94593J87669L22606l06172j97163L80307M1320m04094J08196
164a08259L57625k45600k56995L46310J16878l94147M0526L81734j82837k98177
174b42942L01380J73651l69758l0198L74200j15005l25905K32720K26324l20254
184i5787j02854L60359k9754l44669J61496K80393k70616j72046L44192M2762
194A73476l57865R7427L14012k25048k25589L11107J00456l49887L1964L29767
$$ y = [-273540, -59791, 320388, -44289, -283475, 167694, 208896, -261948, -108861, 294163, -20951, -296772, 109759, 215642, -213129, -138113, 264407, 48168, -264462, 60620, 246836, -142759, -179627, 222355, 100687, -267283, -14222, 254146, -98569, -220976, 187449, 153665, -240928, -53259, 269347, -36825, -233988, 146319, 187639, -216455, -108259, 249366, 3766, -253229, 93081, 209959, -184188, -143662, 238072, 55235, -242942, 58438, 232089, -137669, -167867, 206333, 91328, -234577, -1857, 224467, -95787, -198641, 161718, 131964, -212705, -51209, 229184, -41432, -213478, 130714, 173476, -184389, -86962, 227050, 2002, -223587, 87520, 187976, -161911, -129947, 199820]
204A99820j59849k63376K62806J63851l22716m0037L37083q8087k98609K08894
214b20K19552k96001j06235L34038k8320l21926J55989K57600k58385j55656L15630
225A16066L1693l21521R5356K81574k03134k01954K77564R5648l09931K4725K98850
236A84936j40577k45893K34842J55810k94666m0740L09669q3054k79046J92277
246f442K03965k70691r5944L07533k5749k95489J42872K39626k33686j46119K87603
257A07479L1599k98570Q4193K63574j86000j90715K56724Q9069k89764K4840K80724
268A73153j32186k28101K19462J41857k74435l4837K87326p7651k58098J76637
278f873J88109k48600q8863K84434k1518k74457J28392K23164k14534j37681K67241
$$ y = [199820, 39971, -223405, 39401, 203252, -119464, -159501, 177582, 89495, -209114, -220, 219332, -76669, -182904, 151134, 122814, -199112, -43123, 214477, -43908, -199564, 116066, 147759, -173762, -78406, 203168, 34, -201920, 75644, 171292, -138639, -113914, 184936, 44359, -201534, 33308, 189118, -105548, -146288, 163381, 80327, -198719, -6442, 197523, -73168, -169112, 138421, 112672, -182817, -39945, 199681, -34005, -180124, 107479, 139078, -159492, -75299, 188275, 2275, -188440, 68284, 157353, -132411, -107571, 173153, 40967, -187134, 32328, 174185, -100250, -135087, 152239, 74588, -183510, -6873, 181236, -67364, -156227, 128207, 106689, -167768, -39376, 183788, -30746, -168427, 98814]
289I8814L1598k80081P6349K47979j72795j79025K42225Q3708k73618K3671K64762
300A63587j23934k13398K06940J31525k58305l2427K68236p2185k39414J64082
310e293J74254k31478q3021K64380j8703k55100J18383K08343j99408j29188K50739
321I3908L2262k62378O9122K32190j61865j69909K26504Q0611k56741J9799K47619
332A51122j15490k00364J93877J24368k41104l0622K51474o7579k23513J55035
342b796J62419k19229p8544K46676j9225k38571J12913J94953j87141j20449K33857
353H4863L0177k43498O5119K16596j49925j58876K10337P6101k38836J7141K30814
364A40013j08563j89337J82096J18491k26447k7395K38158o5308k10622J47827
$$ y = [98814, 130412, -149669, -73320, 174659, 1864, -177161, 65064, 148772, -124846, -101175, 163587, 39653, -173745, 33195, 164720, -93585, -126012, 142224, 70039, -169375, -5293, 168961, -62517, -145538, 118842, 100139, -154961, -36578, 171765, -27643, -156831, 93908, 126170, -136208, -67086, 165104, 3239, -166670, 59834, 140445, -116296, -96497, 151122, 35632, -164732, 29145, 153513, -87591, -118213, 133261, 65682, -157831, -2796, 159623, -59606, -138150, 108526, 89301, -149270, -36357, 158596, -28545, -148994, 84863, 115040, -128458, -63339, 153257, 3332, -155544, 54793, 130894, -107942, -90801, 140013, 31450, -157887, 24209, 142700, -83747, -111142, 127016, 61708, -148914, -1087]
374a087J52067k05691p1120K30145j9739k21399J04296J79949j71926j12901K13907
385G6501L0464k25458N7445K05707j35737j52575J96722P5647k27691J4313K21957
396A37295j04050j81971J73744J09639k16447k2851K23043o3742j94496J38039
406a797J39588j87565o5059K11912j4798k06035R1830J69871j58601j10873K01136
417F9609L1171k16276N3048J96185j29270j42534J87220O8949k12203J4668K04194
428A24761r3443j66473J55387J03760j96131l0034K07199m9237j88051J23553
438h709J41666j79624o9517K10300j2925k04295R4857J62969j60857r7805J96148
449G2208J9109j99296N7062J72917j20319j24113J65934O3939j87664M904J86775
$$ y = [-1087, 150980, -54711, -125831, 104314, 84575, -136824, -32528, 147421, -24505, -137406, 76501, 106965, -118493, -61048, 144659, 8922, -143653, 53069, 128716, -98975, -84662, 137295, 33245, -148726, 25018, 134657, -81790, -104641, 118402, 54660, -139836, -1797, 137791, -49774, -114833, 97079, 82281, -123754, -31924, 137947, -20654, -131527, 69609, 100780, -115496, -62448, 133737, 4467, -138067, 49153, 118102, -94101, -79433, 124761, 31318, -135155, 20232, 123992, -72139, -102173, 105026, 55789, -132262, -8709, 132957, -46667, -116184, 94116, 81191, -123104, -28247, 134722, -26135, -123940, 72208, 91317, -107979, -50917, 122000, 1681, -122432, 43502, 107441, -80223, -75319, 111456]
460A11456p5803j61099J39611J09962j87191l8436K04422m4919j87668J23821
470e844J38079j79996o4142K02991j8853j90936R4908J50562j50999r0226J81654
481F7198K0714j85377N0558J65655j13547j24192J59203O2623j84021Q402J80531
492A07747q0327j51315J38654R7910j74086k7369J85970m3825j68502J08909J26888
503A20654j56824o5906J81317p146j82228P6883J51943j36512r6959J75257K6272
514H6751j85139M8279J66990j10237j19936J55953N7454j77835R862J72623p4848
525B9917j44269J27691R3353j65934l0116J79687l8367j64652J03834J23198j53321
536c8979o0425J79134q772j73343P6130J39527j30556q7766J63323K5118j71742
$$ y = [111456, 35653, -125446, 14165, 124127, -63064, -101500, 102922, 58003, -129665, -5844, 132235, -47761, -111903, 91088, 72235, -118701, -23793, 126769, -24230, -114456, 67198, 87912, -97465, -46907, 118748, 5201, -118991, 40212, 102835, -81186, -72784, 107747, 27420, -123895, 14759, 112669, -61417, -88786, 97184, 53359, -115143, -6234, 120654, -36170, -102076, 79241, 72095, -110133, -33250, 118693, -17819, -114778, 60479, 86751, -98388, -50109, 116881, 6644, -113292, 42661, 100115, -77720, -67858, 104765, 29917, -114352, 13339, 106692, -59242, -89358, 90329, 51962, -112690, -8856, 114342, -38979, -99404, 79730, 70958, -102385, -26255, 113272, -17284, -105050, 58273, 83391, -88351]
547h8351L7920J54732r7098j17379J44091O4411j69511M54J69682o7582j42582
558a11213J26726R2634j64940k8157J73114m1659j53947J03603J12063j46548
568c8324n5012J64885q144j58051P0119J30858j20828q6140J52046K7675j61433
579h2349L6328J47488r4902j11524J37891N8575j58275M843J55468o6733j31469
590a04659J16139Q6584j47994k9235J58777l3357j47296R0949J14573j33586o0996
601i0101J57838k791j57976O5381J32560j17091q5430J48357K3852j57625L8793
612d4233J42710r1701j04644J30672N2378j49873N842J47993o1106j24852J06398
623I584Q2092j38727k8785J51687k8691j41427Q2903J08897j25981n8456J51390
$$ y = [-88351, -50431, 104301, 7203, -110176, 33915, 98326, -71185, -70731, 98951, 31369, -111213, 15513, 108147, -56793, -84950, 88164, 46505, -107442, -3839, 108224, -38324, -93336, 71549, 63405, -94646, -24527, 106331, -14497, -100637, 51409, 79084, -82349, -46021, 101467, 6565, -104959, 32932, 91507, -66768, -61925, 93543, 26810, -104659, 11480, 98064, -49930, -79165, 79612, 46255, -101041, -10092, 104481, -29105, -90101, 67737, 64946, -93030, -27649, 104911, -12180, -97610, 50747, 74599, -83026, -44233, 98477, 6776, -97868, 32804, 85182, -64691, -58849, 89144, 28038, -96814, 9584, 91676, -47051, -75836, 75851, 47160, -94267, -11364, 97533, -28448, -86904, 64486]
634F4486q77j52353O0067J27189j10741q1138J43952K3948j52611L5347J35999
645I3268q7401r8932J24977M9218j43103L464J38845n5744j15979R9957P8424
656H6994j30141k9584J43160k3723j33526P7140J03852j20718n8349J43764J239
667F0108j43587N6228J19544j04351p7775J34469K5953j40476K9768J27594p8619
678H856r6829J14764N3078j34712k594J34276n0608j16031R6841Q0121j27686
689d0524k9939J39263k5601j28863P7269R9198j15472n3722J34132j12j33311
700g7682N2355J12854r5141p5525J23135K7733j33121K4849J23945p3082r6620
711h6300J09736N2725j30191j138J30615m9953j11003R2292P4809j19916k7263
$$ y = [64486, 63609, -88744, -28677, 98512, -12229, -93367, 50585, 74533, -78078, -42731, 93268, 5867, -93065, 31912, 81130, -61973, -58509, 80336, 24592, -91387, 8570, 86994, -43147, -72731, 70429, 46706, -86820, -9680, 94172, -26546, -84895, 58869, 60108, -83479, -27251, 92293, -12058, -89833, 44636, 70589, -69887, -40119, 87475, 8856, -87973, 26791, 79869, -54843, -57437, 76839, 26231, -89800, 7041, 87162, -40524, -70463, 68800, 43199, -85664, -8395, 90803, -24669, -78391, 55741, 55629, -77682, -25327, 87527, -7614, -83139, 39996, 67729, -65392, -40543, 83402, 10320, -86300, 23436, 76161, -54030, -55168, 75447, 25494, -85509, 6783, 81592, -38324, -65587]
722f5587J30160k3364j21386O9235R4219j05485n2978J26101L344j28453M7083
733b7111J10626q9832p3964J19212K6752j29864K4549J19416p0880r0679J05100
744B3325M8635j23400p03J22986m6189j04491Q5727P0837j12761k6736J23793
755F1023k0872j15929O5641Q9751j01199n0158J21436K853j22442M5125J04302
766G9531q5646p0178J12922K5613j22421K2041J13351o5582q6851R8994M7571
777F9345j17532k467J17868m3109j00037Q2057O7802j08585k5926J18191j9866
788C7741j09954O2372Q5648r5602m8497J14481M064j15816M0776R9396p9780o7680
800g2851J06446K6486j16309J9189J07815o1737q3307R4428M6396j11777k791
$$ y = [-65587, 64573, 41209, -80177, -10942, 83277, -22208, -75186, 50915, 54259, -74194, -27111, 83515, -6317, -80281, 38931, 65683, -64181, -39632, 79784, 8904, -81775, 23325, 71960, -51440, -52143, 70843, 24654, -79837, 5890, 76727, -36034, -62770, 61023, 40151, -75778, -10137, 79614, -21585, -71743, 49693, 52546, -69896, -24771, 79531, -6115, -76293, 36629, 62242, -60179, -38138, 75213, 9631, -77220, 21774, 69345, -48187, -50654, 67214, 24105, -75932, 6125, 73927, -34658, -60584, 57607, 37741, -72213, -9841, 75807, -19795, -68292, 46189, 50253, -65563, -24787, 74609, -5171, -72851, 33595, 60081, -56228, -37039, 70776, 9039, -74268, 20160, 66556, -45221, -48012]
811d8012J11808m0957r5553P7776O5263j02711k5629J11869j7553j04542N8348
822i893Q1979r0249m7017J08258M696j09648L8790R4390p5920o4738J00656K5123
834E6427j09735J8106J02393n7914p9557Q8187M5306j05050m242J06347l7241
845B3027r2034P2513O3771r6791k6026J06625j6376j00423N5434P8759q5565m4501
857f1587J02710M104j04078L6586Q9710p0697o1858R4213K4826j03679J5367R7682
869F3299n2969p7247Q2373M4592r9654n484J02196l4251q8203O8403O1031r2129
881b8043k4526J01463j4908r5422N1300P4643p9997m3398R6756N854r9058L1983
893b3353Q6289o4954o0180Q8925K5768r8828J2698R3617m8904p3941P7795M2935
$$ y = [-48012, 63796, 22839, -72714, 5062, 70325, -32386, -58015, 53854, 36301, -68241, -9893, 72086, -18163, -65180, 43078, 47774, -61874, -23084, 71306, -4614, -69352, 31304, 56427, -53308, -35202, 67191, 9277, -70280, 17907, 63213, -41837, -46079, 60268, 23027, -69007, 3506, 67277, -29514, -55540, 51085, 34709, -65714, -10280, 68479, -17086, -61587, 41123, 45227, -58851, -22265, 67445, -3252, -65110, 29103, 53929, -49750, -34383, 63299, 10330, -66917, 15456, 60048, -39606, -45090, 57106, 22855, -65348, 3055, 64086, -28043, -52569, 48894, 33986, -61436, -10136, 64507, -15490, -58888, 37868, 43722, -55336, -23353, 62936, -2018, -62198, 26727, 52495, -46333, -33635, 59982, 11078, -62863, 14932, 57867]
905E7867r5021o670R7148l1201q4375O4177N9174q7406k5141R7272j2169r1685
917e8030M8417P2070p6987m1882R2763N435r4026L1118Q0435o2679n5569Q4248
929B5313K3599r1858J1813Q6910m5294o9646P2087M2666q8994q857R1959k7720
941B1978q2016O0516N8978q3705k5889R3827j1737q8271M7595O9536p4871l9837
953e3896Q8726L949q9483L1356P6491o0497n3003P9582K2337q6670J1781Q2493
965E3166m2710o6599O7415M0728q2821q738Q6679k5363p7985N5274N6944p7454
977b1464k5952Q8429r648q5768M3344O8586o9697m0013Q5630N212q7794K8761
989b0374P6084n7404n1795P7293K0921q4931J1979P9789m1980o3014O4974L6519
$$ y = [57867, -37154, -43824, 53324, 22123, -62252, 1925, 61099, -26307, -51448, 45824, 33655, -58030, -9613, 62457, -14530, -56412, 36351, 41786, -52240, -21122, 59313, -3366, -58935, 25313, 48912, -42946, -31133, 55777, 10483, -59163, 12924, 55590, -33404, -42261, 49698, 21978, -60038, 478, 59456, -24249, -50138, 43689, 31952, -56319, -8724, 60812, -14059, -53896, 34830, 38779, -50704, -19348, 57143, -3354, -56357, 23225, 45562, -41108, -29327, 53166, 10456, -56143, 11272, 52000, -30821, -39559, 47120, 21757, -56228, -954, 55990, -21464, -47416, 41013, 31365, -54403, -11059, 57527, -12170, -52183, 33447, 38659, -49135, -20374, 55710, -1694, -53489, 23804, 44725, -40206, -28227, 51562, 9582, -53432, 11542, 48061]
1001D8061p9705o125Q2694k4720p2316N2403N1251p2477k3264Q2370p069p9276
1013d8173L7347O4123o3237m0232P9359R520q4030K2602P4617n2234n3141P5353
1025B1874K3955q4664R553P9468m1508o1328O6330L4870p9070m883P8299k5558
1037A7338o7133N1042M7283o8562k2242P6542n744p3379L4707O0700n9487l9478
1049d8413P5115J0613p8777K1544P0701n0897n1466P0984K3670p8940Q138P5088
1061D7360l8290o0231O1663L6870p4808p510P6380k3724o7541N0533M8574o8287
1073a9011k1198P5237r567p1289L7908N6732n8349l3924O9444O371p1513K1207
1085a7952O4355m4864m8313O2152K4070p1837M589P2321l2542o0548N6029L7656
$$ y = [48061, -31644, -37769, 44925, 20205, -52111, 292, 51543, -20934, -44198, 38172, 31103, -48173, -10826, 53297, -9940, -50172, 29187, 38707, -45323, -22721, 51896, -338, -53479, 21874, 45829, -38835, -29282, 50186, 8678, -52650, 13680, 48550, -30520, -35403, 42896, 17338, -49795, 1247, 48530, -20032, -42274, 34268, 28524, -44855, -10148, 50552, -8935, -48413, 26702, 37315, -41462, -19918, 50783, -114, -51580, 19404, 43074, -35866, -27728, 47360, 9070, -51161, 10502, 47372, -27436, -34946, 41434, 17710, -49831, 702, 49276, -19011, -40209, 35028, 25461, -45828, -7920, 48812, -9537, -43461, 25983, 32354, -39159, -17952, 46403, 1539, -46774, 15378, 39448, -32389, -27800, 44521, 11979, -48569, 7460, 45116]
1097D5116p1166p938P5340k2196o6896M7563M6469o5184j9612P2621q506o9503
1109d3892L3675N5785n4473l3539O8191P540p1792J9624O4223m4262m5566O2721
1121A8235K0356p1465O867O7904l2786n3795N3521L2324o6086p809O8639j7189
1133A8716o1433M1242M6171o0090k3815P0109l102o8973L0691N6501n4672l4887
1145d3542O8730P131p0317K1385O0324m5555m1614O1203J7964o5851P357O1827
1157C9042l0670n0090M9261L2120o1157r463O4515j5767n9428L9293M5152n7250
1169a4442k2698O6131l929o4861L0333N3302n1013l3011O3566P469o6151J8756
1181a6548N8580m1523m2507N7521J9524o4699O079O2255l0275m9949M9055L0583
$$ y = [45116, -26050, -33988, 41352, 19156, -47740, -177, 46292, -18892, -38504, 34117, 25611, -43892, -10217, 45568, -8905, -42444, 25747, 33287, -38505, -18881, 45342, 1080, -44486, 18235, 38591, -32874, -26007, 41897, 9111, -44684, 8837, 41161, -24925, -32734, 35905, 18716, -42717, -1475, 44696, -15394, -39209, 30900, 27798, -41175, -10484, 46017, -8655, -43542, 25188, 32319, -37998, -16613, 43711, -1844, -43458, 17745, 35709, -30142, -22785, 39042, 8372, -41718, 7543, 39663, -21494, -30957, 33558, 17791, -41637, -2344, 42808, -14442, -37140, 28991, 25062, -39799, -9466, 43836, -7177, -40188, 23378, 30847, -35304, -16548, 42032, 509, -41998, 15523, 35047, -29652, -23573, 38682, 8407, -41542, 7513, 38096]
1193C8096o0189o549O2343j7414n5485L8071M0687n3465k0286O1244l302o0516
1205c6765K6199N1133m5985l3314N9604R810o4000J5573N8201l8666m2563N5643
1217A4870J9671o3198N705O0172k9161m7909M7427K8759n7916o146N9819j6443
1229A5650n3124L6425L8833n1153j9519N8885k757n8082K5060M8310m4053l1159
1241c6684N6428R248o0304J4586N4514l6185m0083N2040J9568n9470L605N7843
1253C5106k6033m7211M4360K9700n5726q140N8503j4573n2397L4754L8733m9779
1265a2703j9435N6886k544n5582K4083M6136m2150k9651N3521R084n6903J3064
1277a6194N1688l3335l8729M8447K0119n6155J858N5093k3426m6026M1540K9794
$$ y = [38096, -22093, -28642, 33701, 16287, -39198, -1127, 39560, -13905, -34191, 27053, 23751, -36765, -10566, 40567, -5418, -38732, 20872, 30682, -33318, -17745, 40456, 1790, -40773, 14870, 34541, -28657, -22952, 37220, 8059, -39850, 7577, 36336, -21580, -27726, 32093, 15650, -37474, -1049, 37784, -13369, -32888, 25997, 23240, -34842, -9782, 38528, -5525, -36684, 19744, 28992, -31312, -16726, 37788, 1603, -38480, 13560, 33128, -26342, -22737, 35106, 9073, -38138, 6222, 35922, -19804, -27944, 30559, 15986, -36411, -1657, 37076, -12703, -32138, 24748, 22204, -33378, -9295, 36841, -5309, -34960, 18561, 27645, -29258, -16194, 35494, 2159, -36570, 11877, 31996, -24159, -22301, 32792, 9366, -36660, 4880, 34674]
1289C4674n2842r104N6009j2868n0744L2743L8050m7504j9321N4507k003n3493
1301c1896K2758M4790m0349k9204N1075R462n4459J1706N0064l1126l7886M5728
1313A0663K0087n3207Q52N2865k1553m4432L8735K9290n0137r600N3649j1468
1325A5744m9177L0579L7178m4847j9431N2145q71n1764K0933M3546l7491k8924
1337c2380M8545R550n2191J0760M8001k9199l6588M3413J9453n0888N56N0850
1349B9882k0240m2804L6653K8330m7623r769N1535j0426m7222K8459L5997m2397
1361i625j9230M9946l50m9805J9616M1731l5728k7594M6663R277n0290J0206M5949
1374C0766k7817l4993M1487J8831m8744J7M8557j8723m0967L4759K7343m5441
$$ y = [34674, -18168, -27272, 28737, 15869, -34875, -2132, 35918, -11586, -30907, 23600, 21597, -31896, -9138, 35652, -4697, -33901, 17174, 26636, -27823, -16117, 33947, 2821, -35065, 10663, 30750, -22457, -21605, 31260, 9707, -34725, 4010, 33300, -16837, -26437, 27212, 15744, -33433, -2854, 34324, -10523, -29954, 22191, 21320, -30444, -9511, 34035, -3456, -32380, 16165, 25715, -26476, -15716, 32285, 3086, -33502, 9911, 29364, -21524, -20968, 29882, 9642, -33162, 3491, 31821, -15802, -25571, 25964, 15538, -31684, -3225, 32772, -9625, -28855, 21091, 20741, -29064, -9448, 32283, -3445, -31039, 15624, 24901, -25389, -15183, 30766, 2949, -32044, 9443, 28274, -20470, -20453, 28104, 9381, -31586, 3173, 30516, -14925]
1386a4925r721M9106r470m4937K6974L4351m0472j8615M7548P0m7388J8273M0038
1399C0832l4043k6924M4527R807m8076Q886M4547k6569l4020M0029J8544m6805
1411a9265q3M6531j8645l8958L3730K5538m3431q496M6220r346m2262K5731L2505
1424B9769l8072j8036M4665Q23m4936J6707L8935l1894k6824M2099R956m6148
1436b2956Q487M2787k5327l2698L8038J7580m4362jM4219j7186l7553L1526K5344
1449B7898m0862r255M4399q202m1654K3959L2362l6604j7678M3381N41m3459J6635
1462h539L6669l0505k4179L9403Q653m2728P745L9823k2673l1148L4378J8007
1474B4906m1837k066M3194j4664l7518K9563K5820m0084r653M4233p934m0730
$$ y = [-14925, -24646, 24460, 14990, -29947, -2973, 31378, -9094, -27709, 19839, 19909, -27479, -9206, 30832, -3211, -30135, 14392, 24199, -23877, -14991, 29556, 2987, -31033, 8996, 27540, -19265, -19348, 27183, 8538, -30420, 3310, 28848, -14583, -23079, 23141, 13795, -28467, -2736, 29769, -8303, -26339, 18326, 19149, -25787, -9080, 29855, -2039, -28863, 13236, 23192, -22956, -14469, 28318, 2991, -29707, 8331, 25911, -18451, -18452, 25767, 8581, -28972, 2554, 27898, -12964, -22219, 22180, 13978, -27676, -3717, 28645, -7959, -25637, 17744, 18285, -25174, -8539, 28130, -2375, -26554, 12849, 21502, -21226, -13481, 26342, 3669, -27479, 6899, 24906, -16931, -18997, 24197, 9533, -27985, 1578, 27398, -12686, -22339, 21894, 13960, -26770]
1486b6770K3981L0314l5599j5920M1740n03m0962J5669L4192k8616k3077L7548
1498A1997R023m1020O375L8714k1261l0310L3458J7363m0565j719M0894j4276
1510H673l4861K8190K3481l7366r177M0596o431l7620K1001K9799l2779j7290
1522b3784L9737K002m0375J3974L4752k8372k3975L7736R076m0817P546L6994
1534B4494k2199k7736L2723J5142l7719l24L6983j3680l1947K5555K2659l4043
1546a0092j0063L7975m873l6680J9449L0018l1237j7597L8217K147l9273J3704
1558h305L3941k7212k2958L5669Q104l8439O996L5893k0803k7366L0777J5157
1570B1454l6206q22L6614j3237l1434K4934K1674l3212q672L6581n342l4595J8306
$$ y = [-26770, -2789, 27525, -8074, -23994, 17746, 17243, -23719, -8050, 26142, -2474, -25551, 11997, 21020, -20000, -13625, 25089, 3828, -26482, 6976, 24339, -16226, -17945, 22949, 8673, -26188, 2002, 25483, -11883, -21060, 19536, 13105, -24515, -3514, 26285, -6494, -23784, 15953, 17955, -22420, -8446, 26306, -2066, -26041, 11695, 20771, -20046, -12500, 24494, 2295, -25441, 7282, 22424, -15295, -15619, 21364, 7684, -24263, 1292, 23951, -10092, -20155, 17820, 12947, -23733, -4284, 25734, -5503, -23100, 15117, 17264, -22009, -8305, 25636, -1576, -24534, 11135, 19239, -19200, -12204, 23689, 2886, -24480, 6297, 21454, -14752, -15574, 21040, 7803, -23631, 1303, 22977, -10235, -18907, 17674, 12332, -22263, -3957]
1583c957K7231k8499j5963L4971K538l6278J1179L1989k3715k2628L3063R537
1595A9468l7230M835L5494j8836k7690L0003J5459l6102j138L6097j2814l0245
1607b2699K4424K0189l1988p809L4583m996l2349J7276K5569k7216j5335L3234
1619A2883K845l4400J0320L0447k2746k1845L1503R747l5163M184L3415j7438
1631C752k6440K7950J5470l3763k367L4263j1381k9625K3151K0563l0811q595
1643a7833L3787m607l1729J7074K5157k6653j4776L2054K420l2857J0321K8599
1655B0957k1318k0733K9304R128l2596L757L1399j6047k5243K5771J5309l1898
1667a2210k562L2876j0431k8777K1669K0103k9394q436L2404m129l0726J6137
$$ y = [-3957, 23274, -5225, -21188, 13783, 16321, -19957, -8778, 23211, -504, -23132, 9931, 19468, -17762, -12927, 22567, 3731, -23959, 6044, 21503, -14599, -15737, 20360, 7546, -22699, 1725, 21914, -10074, -17883, 16700, 11704, -20645, -3369, 22200, -5016, -20351, 12883, 15728, -18672, -8352, 22095, -651, -22496, 9007, 18754, -16409, -12225, 21190, 3752, -22688, 5262, 20732, -13031, -15398, 18865, 7484, -22141, 1010, 21573, -9238, -17833, 15954, 11347, -20382, -3308, 21849, -4804, -19580, 12474, 14894, -17963, -7642, 20957, -361, -21094, 8210, 17338, -15258, -11501, 19898, 3851, -21392, 4379, 19688, -12210, -14772, 18104, 7673, -21104, 565, 20668, -8726, -17162, 15242, 11113, -19613, -3476]
1679c476K4392k5340j4260L0790K117l1583R931K7458k0335j9672K8094Q577l1464
1692a4771L555L0134j5178k4310K4752J4538l0244k663L1244r314k7567J9988
1704A64J9508k7631q694L0931l263k9504J4753K3683k3939j4197K9289K921l0469
1717a6448Q830K6810j9137j9202K6662Q897l0337K822K9053j4144k3432K3451
1729C825J4217k8816l128K9933q668k6171J8926J8833k6302q573K9477k855k8169
1742a7471J3703K2807k2720j4030K8121L078k9208Q316K5907j8296j8783K5720
1754G144Q624k8961K712K7656j3554k2382K2357J3737k7657k967K8779q428k5353
1767a8293J8287J8285k5227q450K8451k759k7128J3273K1890k1838j3380K6832
$$ y = [-3476, 20916, -4424, -18684, 12106, 14223, -17360, -7429, 20029, -306, -19978, 8116, 16693, -14771, -11216, 18918, 3740, -20570, 4182, 18720, -11524, -14187, 17057, 7743, -19824, 164, 19672, -7959, -16653, 14278, 11015, -18489, -3736, 19947, -3992, -18189, 11100, 14021, -16448, -7618, 19192, 55, -19147, 7515, 16412, -13925, -11103, 17950, 3806, -19626, 3825, 18042, -10774, -13902, 16031, 7363, -18808, 118, 18951, -7351, -15924, 13553, 10698, -17471, -3768, 19039, -3681, -17711, 10410, 13488, -15720, -7404, 18503, 207, -18576, 7144, 15768, -13193, -10481, 17175, 3621, -18761, 3596, 17333, -10324, -13291, 15488, 7060, -18293, -6, 18279, -6948, -15398, 13053, 10294, -16834, -3561, 18329, -3509, -16889, 9943]
1779I943K798k7692P904K4676j7510j7793K4290Q390k7386K309K6573j2754k1949
1792a8201K1451J3446k6588l107K7791p864k4481J7326J7750k4122q022K7035
1804A2414k514k5950J2671K0797k0538j2829K5374K906k6565P335K3744j6526
1816C19j7432K3314Q294k6675K325K5760j2095k0912K0231J2832k5297k967K6420
1829A4117p359k3352J6243J6637k2565p773K5707k122k4824J1837K0245j9687
1841b896j2466K4468K989k5855P089K2797j5919j6470K2273P710k5112K054K4292
1854A4954j1419j9703J9129J2099k3710l063K4972o815k2348J5525J6214k1925
1866f090p594K4864j839k4165J1499J9362j8864j1963K3433K693k4183O573K1495
$$ y = [9943, 12741, -14951, -7047, 17629, 119, -17674, 6616, 15006, -12380, -10071, 16502, 3748, -18201, 3250, 16696, -9892, -12999, 14792, 6928, -17553, -227, 17523, -6599, -14621, 12414, 9900, -16050, -3379, 17418, -3120, -15949, 9425, 12331, -14234, -6899, 16845, 319, -17113, 6201, 14495, -12180, -9855, 15905, 3810, -17102, 3129, 15961, -9336, -12303, 14117, 6758, -16594, -351, 16286, -6279, -14052, 11655, 9533, -15291, -3454, 16791, -2896, -15362, 9106, 12095, -13760, -6671, 16126, 207, -16263, 6010, 13720, -11392, -9338, 14954, 3535, -16168, 2961, 15060, -8650, -11713, 13259, 6444, -15904, -379, 15835, -6090, -13684, 11180, 9341, -14824, -3325, 16037, -2827, -14790, 8643, 11336, -12847, -6274, 15221]
1879A5221j5003j5685K0962P714k3985J720K3289j0748j9180J8330J2160k3139
1891h344l049K4045o375k1348J4709J5650k0774p437K3474j808k2564J0533J8457
1904A5169j7535j1764K2158K947k3265O130K0901j4249j5513K0325P405k3115
1916a0406J714K2589j0601j8324J7557J1254k1832k610K2594o008k0259J3750
1928e82J4928j9526p100K2207j342k1715R857J7893j6791j1269K1136K993k2520
1941a1831N609K0291j3589j4788J9248P279k2092J360K1593r663j7551J6363J1127
1954A3356k0659l040K1858n432j9775J3046J4472j8897p125K1703j168k0990R321
1967c330J7183j5921j0997K0331L180k1262M975J9103j2535j4281J8051P233k0797
$$ y = [15221, 218, -15467, 5495, 13209, -10776, -9056, 14233, 3485, -15695, 2635, 14795, -8344, -11393, 12652, 6277, -15071, -362, 15288, -5486, -12923, 10551, 8743, -13821, -3288, 15169, -2366, -14130, 8028, 10975, -12290, -6160, 14741, 492, -15021, 5304, 12709, -10406, -8692, 13897, 3296, -15028, 2529, 13783, -8049, -10659, 11935, 5927, -14332, -582, 14346, -5180, -12280, 9927, 8585, -13130, -3273, 14620, -2171, -13440, 7696, 10689, -11831, -6222, 14069, 480, -14308, 4940, 12219, -9873, -8513, 13080, 3417, -14134, 2229, 13356, -7303, -10343, 11515, 6083, -13692, -646, 13826, -5071, -12196, 9507, 8339, -12651, -3330, 13853, -2068, -13065, 7266, 10446, -10816, -5841, 13262, 727, -13554, 4497, 11730, -9067]
1980i067P05K0458q731j7018J5520J1129j9941l273K1192n067j8991J2475J4240
1993A3631j8269p040K0584r92k0012Q914J6678j5505j0618J9424L081k0401N118
2006e407J8289j2184j3747J7455O863j9955J098J9329q527j6415J4698J0679j8621
2019f445l221J9758m485j8058J1487J3750j6637p014J9388o77j9497Q198J6373
2032A2920j4518j0521J8590K961j9888M942J8029j1813j3182J6939O177j9204
2044h568J276J8625q261j5200J3894R481j7701k594J8842m452j6929J0749J2534
2057A1696j5646o597J8583m49j8411P426J5428j3508j0044J7786L253j9315M146
2070e652J7272j0907j2763J6115O418j8635Q80J7988p859j4573J3677R175j7310
$$ y = [-9067, -8362, 12096, 3365, -13653, 1867, 12996, -6945, -10218, 10974, 5907, -13084, -609, 13631, -4638, -11678, 8906, 7914, -12098, -3184, 13494, -2011, -12629, 6795, 9876, -10525, -5407, 12882, 698, -13049, 4406, 11269, -8686, -7588, 11741, 3214, -13201, 1497, 12176, -6445, -9666, 10092, 5607, -12451, -964, 12786, -3851, -10865, 8523, 7846, -11651, -3453, 12920, -1598, -12119, 6471, 9432, -10456, -5514, 12515, 702, -12480, 4459, 10636, -8568, -7292, 11333, 3072, -12128, 1766, 11247, -6454, -9048, 9794, 5342, -11587, -838, 11696, -3950, -10547, 8036, 7587, -10824, -3398, 12030, -1478, -11522, 6264, 9517, -9798, -5652, 11620, 713, -12050, 4065, 10483, -8152, -7272, 10716, 2857, -11716, 1961, 11136, -6174]
2083f174k519J8041m439j6023J0700J1688j5288n965J7418l88j6918O959J4123
2096A1215j2542r487J6279L345j7532L603J6048j0035j2497J5054O763j7587K60
2109g113J7377p342j4528J3153R518j6770k737J7440m416j5533J0416J1593j4762
2122c704n717J6494o78j6156P088J3663j2220q959J5489K831j6392L475J5133
2135A0347r326j1831J3883O214j6229K47J6350o562j4043J2116R083j5527k754
2148h032J6697l809j5294R533J1469j3862n750J6040p70j5887O901J3117j1651
2161a298q370J4982K390j5882L608J4413q952j0760J2869N777j5385j3J5555n953
2175B981j3082J1061Q699j4579k928J5919l110j4784Q919J1024j3455n673J5712
$$ y = [-6174, -8693, 9348, 4909, -11114, -414, 11274, -4014, -9979, 7439, 7051, -9867, -2908, 11215, -1327, -10814, 5465, 8810, -8722, -5119, 10929, 894, -11603, 3451, 10214, -7373, -7113, 10264, 2922, -11606, 1547, 11065, -5705, -8442, 8998, 4582, -10951, -535, 11058, -3704, -9421, 7073, 6395, -9761, -2673, 10990, -1230, -10189, 5300, 8131, -8261, -4786, 10347, 1021, -10810, 3073, 9287, -6942, -6695, 9655, 3093, -10950, 1166, 10249, -5278, -8032, 8665, 4856, -10438, -905, 10564, -3298, -9048, 6992, 6222, -9665, -2764, 10353, -1298, -9668, 5314, 7704, -8178, -4570, 9843, 891, -9869, 3000, 8777, -6608, -6621, 8934, 2981, -10101, 960, 9659, -4920, -7848, 8071, 4961, -9823, -904, 10120, -3335, -9008, 6704]
2188F704m70j5354O488J2582j1295p951J4229K684j5268L260J3844q630j0368
2201i545J2390N710j4842P3J4639n726j2489J0718Q349j3861k877J4916k924j3705
2215i174Q280J0423j2310n830J4575m5j4373N700J2248j0391q147J3613K799j4655
2229g287K986J3502q311j0354J2249N501j4375J43J4205n712j1670J0036P940
2242H853j3081k676J3896k641j3006P702J0036j1681n559J3765J40j3868N376
2255b744J1846r990p851J2956K744j3865K748J2743p554r912J1523N175j3501
2268e682J8J3312n107j1489R640P620j2617k513J3614k615j2448P475R596j1298
2282b494n192J3081L3j3129N054J1121r139p622J2230K823j3321K347J2434p177
$$ y = [6704, 6234, -9120, -2632, 9950, -1345, -9296, 4933, 7617, -7651, -4391, 9453, 823, -9545, 2845, 8555, -6287, -6214, 8425, 2699, -9790, 928, 9277, -4584, -7461, 7455, 4531, -9174, -894, 9529, -2781, -8611, 5964, 5919, -8454, -2754, 9494, -897, -9044, 4569, 7368, -7287, -4301, 9201, 890, -9464, 2785, 8286, -6089, -5946, 8259, 2547, -9123, 913, 8853, -4228, -6904, 6992, 4351, -8655, -953, 9083, -2598, -8157, 5608, 5748, -8120, -2744, 9102, -888, -8739, 4217, 6961, -6904, -4156, 8587, 1033, -8879, 2644, 7819, -5682, -5664, 7648, 2541, -8948, 692, 8312, -4305, -6818, 6796, 4181, -8267, -792, 8804, -2494, -7686, 5395, 5428, -7701, -2647, 8474, -665, -8287, 3943, 6766, -6555, -4208, 8226, 1049]
2296A049r493J0712N347j2893k81J3049m958j0997R159P383j1963k692J2848k244
2310D026j2001O992R224j0493n171J2548K37j2532M547J0744q773p181J1509K785
2324F461j2544K107J1673o563r126J0158N111j2201l46J2191m317j0614Q475P182
2338G647j1220k757J2334j995j1474O421Q898r965m875J1794L08j1845M312J0057
2352G640q155o934J0898K591j1797J870J1111o193q752R607N033j1444n35J1669
2366F609m081r878P801O982j0639k813J1594j821j0898O022Q563r391m790J1170
2380D430O63j1444L979R712p660o794J0329K731j1374J782J0530n752q338R032
2394A826M671j0783n28J1031l815r561P586O403r896k694J1030j607j0397N672
$$ y = [1049, -8444, 2268, 7615, -5278, -5559, 7490, 2532, -8465, 694, 8077, -3886, -6578, 6270, 4026, -7975, -983, 8241, -2252, -7423, 5125, 5362, -7170, -2623, 8121, -652, -7833, 3676, 6461, -6083, -3976, 7697, 1134, -7992, 2166, 7277, -4924, -5270, 6921, 2604, -8010, 465, 7647, -3573, -6330, 6004, 4009, -7465, -1044, 7854, -2111, -6986, 4808, 5116, -6729, -2417, 7640, -515, -7449, 3449, 6040, -5757, -3887, 7224, 1031, -7721, 1886, 6919, -4525, -5060, 6609, 2528, -7350, 451, 7433, -3206, -6019, 5575, 3754, -7144, -1122, 7441, -1950, -6740, 4430, 5093, -6351, -2372, 7340, -320, -7114, 3215, 5946, -5428, -3646, 6884, 1132, -7206, 1826, 6497, -4286, -4814, 6217, 2402, -7159, 427, 6830, -3066, -5760, 5270, 3663, -6734, -1062]
2408a062Q190q741m889J0725O80j1002L635R298p121o544R858K612j0787J703
2422c445R966n442p850Q525M385j0195m46J0267l510q836O912O162r342k628J0441
2437D964j509r746N113P767q124m648J0092P83j0287L221R009o971o157R366K561
2452E434j0315J489R738n393p576Q308M117r741m70R869l240q566O627N955r059
2467b823k409R908j327r284N056P215p843m265R330P42r619L032Q366o109o137
2482f167Q682K720r617R78R227m488p618P622M475r450p69R661l080q337O376
2497B15N860q669k413R527j370q838M772O984p424l988Q752O11q983K892P922
2512E850n928n660P928K746q946O91Q835m249p255P153M300q794p81R044k797
$$ y = [-1062, 7128, -1613, -6502, 4223, 4903, -6099, -2464, 6834, -287, -6831, 3027, 5639, -5148, -3445, 6521, 1079, -6771, 1754, 6139, -4056, -4502, 5765, 2255, -6581, 331, 6493, -2849, -5477, 4964, 3455, -6291, -1178, 6589, -1535, -6183, 3909, 4692, -5595, -2374, 6635, -336, -6493, 2873, 5434, -4881, -3392, 6346, 953, -6623, 1685, 5802, -3939, -4409, 5460, 2220, -6346, 281, 6236, -2823, -5232, 4676, 3349, -5935, -879, 6336, -1507, -5772, 3558, 4300, -5319, -2287, 6079, -30, -6167, 2515, 5235, -4382, -3404, 5823, 1335, -6283, 1339, 5814, -3636, -4405, 5256, 2176, -6161, 215, 6075, -2594, -5007, 4520, 3150, -5688, -916, 6068, -1356, -5344, 3408, 4019, -4964, -2072, 5850, -78, -5738, 2190, 4936, -4010, -3319, 5516, 1267, -5988, 1165, 5465, -3329, -4110, 4934, 2137]
2527B137p908N823N672q028k534Q969j006q517M265O888p026l921Q527N64q620
2542d715K688P560n725n260P712K310q623J088Q077m110o405O530L855p899r85
2557c902Q442k230p709N429N454p561k653Q583p20q260L958O818o729m045Q186
2572C061P71q406K652P209n261n209P220K342q191J000P697l801o290O109L913
2587D816p485j083P967k017p398N001N292p014k481Q029o67p813L759O268o167
2602i93l738P387J089p930K117P117m966n081O787K458p833P62P460l605o057
2617e026N913L713p280q65P611k000o787M561M981o523k547P558l66p396L334
2632a119N924n563l878P196J027p546J917O699m468n014O596K367p459N03P284
$$ y = [2137, -5771, 52, 5724, -2304, -4838, 4131, 3125, -5392, -1127, 5761, -1265, -5186, 3341, 3905, -4715, -2027, 5533, -192, -5452, 2260, 4570, -4053, -2965, 5112, 1002, -5403, 1127, 4982, -2917, -3902, 4540, 2310, -5399, 30, 5484, -2077, -4730, 3853, 3133, -5127, -1169, 5649, -1080, -5125, 3061, 3832, -4574, -1922, 5287, 26, -5183, 2037, 4379, -3812, -2812, 4885, 1084, -5206, 903, 4816, -2669, -3752, 4215, 2198, -5200, -199, 5093, -1921, -4402, 3627, 2960, -4853, -1094, 5174, -993, -4731, 2656, 3745, -4185, -2068, 5049, 83, -4998, 1789, 4247, -3586, -2824, 4636, 1031, -5026, 887, 4600, -2680, -3545, 4066, 2066, -4721, -160, 4821, -1702, -4249, 3309, 2943, -4453, -1119, 4805, -758, -4636, 2560, 3587, -3959, -2042, 4657, 189, -4825, 1771, 4138, -3321, -2818, 4466]
2647D466l498n756N594L553o917p79P197j959o450M451M696o299k258P071l21
2662B791o996K989N779n255l706O821R42p155J840O360m223m856O184K547p170
2677c108L13P038l158n746N345L772o895q28O950j791o279M258M601o118k183
2692c829O900n71o524L001N410n033l529O370J026o687J544O179l976m533N611
2707A359K402o724L70O486k656n563M886L588o270j060O634j526o202M054M522
2722D300n718k309O581m17o266K803N258m829l307N998J089o456J485N643l572
2737B83m376N333K367o180J4O209k353n408M559L452n995j116O504j372n946L619
2753d06M510n403k375O384j48o244K618N080m436l461N892J030o198J412N504
$$ y = [4466, 968, -4788, 806, 4359, -2558, -3337, 3860, 1901, -4549, -98, 4598, -1701, -3959, 3112, 2791, -4205, -1216, 4563, -692, -4398, 2423, 3365, -3790, -1950, 4410, 187, -4669, 1515, 4062, -3108, -2795, 4243, 1085, -4661, 684, 4456, -2439, -3267, 3683, 1892, -4387, -129, 4472, -1646, -3829, 3071, 2500, -4024, -1023, 4387, -646, -4175, 2195, 3221, -3466, -1922, 4257, 281, -4252, 1359, 3761, -2963, -2593, 3893, 1237, -4326, 560, 4148, -2122, -3182, 3452, 1926, -4276, -222, 4300, -1418, -3727, 2854, 2437, -3829, -1026, 4232, -597, -3904, 2094, 3183, -3273, -1788, 3855, 283, -4093, 1240, 3607, -2573, -2559, 3650, 1297, -4111, 448, 3900, -2095, -3211, 3293, 1921, -4025, -406, 4104, -1299, -3674, 2710, 2562, -3682, -1064, 4016, -420, -3881, 2011, 3041, -3157, -1745, 3759]
2768C759l497m294N258K158n878M4N895k301m874M173L274n535j276O100j141
2783A865n501L201M321n015k118N672J37n919K245M934m294l280N527J297o074
2798c002J143N462l244m141M888K308n852n6N823k174m980M042L475n402j140
2813b850N775j074n447L238M005m619k372N659M9n538K038M823l989l266N145
2828A577J369n798J048N281k981m187M635K368n467j77N427j973m750L947L225
2843C544n121j207N488r09n187K937M030m474k303N411J90n520J938M709l742
2858b16l288M978J224n304Q80M965k793l931M360K207n146k96N297j826m513L608
2874B06L173m726j514N373p17n007K774L903m282k282N170K44n218J728M485l559
$$ y = [3759, 262, -4032, 1226, 3384, -2494, -2450, 3445, 1144, -3730, 443, 3717, -1818, -3094, 3006, 1865, -3636, -435, 3886, -1129, -3247, 2425, 2562, -3357, -1112, 3822, -472, -3752, 1775, 3072, -3002, -1859, 3603, 359, -3782, 1106, 3414, -2438, -2494, 3329, 1155, -3825, 217, 3692, -1710, -2850, 2925, 1851, -3596, -358, 3647, -972, -3344, 2315, 2364, -3174, -1136, 3687, -302, -3568, 1577, 2946, -2852, -1804, 3477, 496, -3691, 944, 3312, -2155, -2332, 3095, 1122, -3628, 319, 3544, -1577, -2784, 2704, 1795, -3392, -455, 3575, -899, -3202, 2209, 2399, -3121, -1183, 3526, -216, -3504, 1474, 2698, -2606, -1726, 3239, 446, -3485, 875, 3082, -2064, -2360, 2937, 1111, -3402, 206, 3379, -1347, -2861, 2512, 1795, -3212, -438, 3465, -817, -3099, 2071, 2315, -2903, -1175, 3310, -249]
2890b49k963M635J291n113O42M756k497l832M040K293m976l45N133j600m491L297
2906B1L276m688j340N183p00m821K474L848l990k193M817L84n008J470M503l389
2922a53l096M536J372m968N49M717k444l768L923K300m803m45M962j584m231L229
2938I6K989m283j408M825m69m682K245L808l726k370M628N47m814J450M273l147
2954c8l165M418J337m745L69M591k136l739L690K371m620m56M704j342m149K929
2970A9K984m085j485M705l27m642K208L690l614k276M463O63m755J287M040k856
2986A9k949M011J488m650K47M505j969l737L451K409m444o52M736j139m353K879
3002a48L084l948j488M508k40m495J951L843l489k291M278O01m603J180M168k702
$$ y = [-249, -3212, 1423, 2714, -2399, -1757, 2999, 502, -3330, 710, 3003, -1973, -2318, 2815, 1215, -3276, 21, 3297, -1391, -2731, 2452, 1752, -3069, -595, 3253, -737, -2930, 1887, 2271, -2737, -1267, 3236, -153, -3249, 1287, 2659, -2309, -1760, 2957, 513, -3255, 668, 2968, -1835, -2280, 2682, 1098, -3133, 96, 3085, -1198, -2606, 2219, 1750, -2932, -687, 3121, -605, -2975, 1653, 2200, -2614, -1164, 3109, -38, -3203, 1215, 2552, -2193, -1824, 2767, 631, -3108, 582, 2953, -1667, -2123, 2581, 1239, -2910, 19, 3003, -1082, -2567, 2138, 1811, -2831, -623, 3067, -547, -2823, 1640, 2303, -2452, -1165, 2875, 19, -2930, 1081, 2569, -2081, -1834, 2671, 702, -3035, 416, 2825, -1619, -2271, 2465, 1326, -3027, -148, 2936, -1012, -2500, 2008, 1768, -2727, -776, 3067, -422, -2713, 1565, 2166, -2437, -1257, 2911, 209]
3018B09l067L811J471m521K44M484j805l762L305K343m222p14M611j055m180K728
3034a20L054l777j690M328l9m524K077L530l300k402M182Q60m457R63M166k669
3050A82l021L730J591m311P4M250j751l619L202K288m008p96M379q14m082K524
3066a82K993l670j589M246o4m219J726L622l131k329L906Q28m288Q70L959k401
3082B77l111L607J568m029n3M069j603l450K948K371l956p92M208p21l965K310
3098c22L090l504j668M067J29m234J618L533k953k411L894R15m136N28M035k271
3114C10k901L301J605l957j17L975j379l455K720K543l796r69M036n51l942K235
3130c42L028l402j648L868J96m083J542L457k749k335L655Q74m012N74L796k051
$$ y = [209, -2858, 953, 2424, -2097, -1853, 2631, 826, -2936, 369, 2712, -1510, -2224, 2387, 1332, -2848, -120, 2934, -843, -2533, 1795, 1756, -2768, -691, 2839, -461, -2863, 1319, 2179, -2278, -1315, 2851, 182, -2839, 891, 2482, -1829, -1755, 2495, 744, -2875, 327, 2615, -1393, -2189, 2190, 1376, -2706, -182, 2811, -859, -2448, 1798, 1734, -2485, -759, 2863, -268, -2597, 1309, 2137, -2151, -1281, 2678, 277, -2834, 773, 2341, -1688, -1741, 2328, 725, -2725, 223, 2594, -1362, -2154, 2054, 1333, -2632, -322, 2768, -736, -2404, 1663, 1792, -2442, -824, 2709, -244, -2655, 1239, 2154, -1982, -1454, 2581, 310, -2591, 710, 2315, -1642, -1759, 2216, 837, -2618, 102, 2645, -1151, -2120, 1916, 1365, -2577, -342, 2686, -716, -2364, 1504, 1700, -2383, -841, 2616, -133, -2468, 1187, 2061, -1951, -1377, 2419, 368]
3146C68l081L361J707l976o8L896j348l382K701K342l642q44L916o77l628J954
3162d01K932l209j638L862K13l897J254L396k590k449L571J048m040N29L842k022
3178D01k993L112J809l793k11L778j289l370K591K439l664r30L851m09l755K076
3194c57K922l101j734L820J09l757J268L335k614k295L471R88l878M95L529j742
3210D59k927K933J756l675l24L915j244l378K606K300l434j000L760l97l704K022
3226c32K859l119j717L781J82l804J284L259k428k342L437Q53l652M80L566j890
3242D17k877K979J681l638k89L719j116l367K587K157l290r31L754l45l698J724
3258e33K972k916j861L754L39l905J197L418k486k438L453J025l760L82L592j817
$$ y = [368, -2713, 648, 2355, -1621, -1689, 2207, 859, -2523, 178, 2520, -1122, -1966, 1950, 1273, -2355, -401, 2531, -678, -2316, 1546, 1759, -2138, -884, 2512, -78, -2527, 1044, 2092, -1948, -1419, 2423, 401, -2592, 520, 2329, -1464, -1675, 2103, 814, -2556, 35, 2474, -1190, -2120, 1731, 1322, -2433, -357, 2565, -536, -2270, 1550, 1659, -2098, -830, 2505, -109, -2404, 1067, 2055, -1823, -1328, 2201, 459, -2468, 465, 2221, -1454, -1778, 2137, 893, -2485, 121, 2421, -1013, -2013, 1747, 1350, -2354, -332, 2527, -592, -2309, 1472, 1654, -2150, -866, 2393, -35, -2377, 1060, 1913, -1739, -1259, 2307, 417, -2460, 519, 2200, -1438, -1727, 1992, 876, -2491, 96, 2253, -1037, -1968, 1786, 1441, -2257, -533, 2439, -477, -2338, 1416, 1755, -2150, -953, 2465, -21, -2459, 994, 2019, -1741, -1359, 2233, 416]
3274D16k823K878J771l655k16L634j082l302K308K361l175j062L658l91l576J778
3290d78K849k870j781L652L20l717J102L259k227k424L318R89l648L38L569j699
3306E52k926K793J772l544k87L696j277l065K404K209l190j052L551m04l375J670
3322d73K769k725j840L615K71l503R61L154k224k223L074J079l518L76L388j576
3338F05k945K674J851l396m96L632r49l196K186K357l062j254L621l43l319J507
3354e27K846k772j697L431L37l543J111L051k166k302L128J008l503M51L186j467
3370E72k889K694J755l389m26L549q45l311K273K233l110j061L593l62l396J664
3386d56K765k725j625L347K50l443J024L079k225k171L005R99l368K69L383j555
$$ y = [416, -2407, 471, 2242, -1413, -1629, 2005, 923, -2379, -71, 2290, -885, -1947, 1711, 1320, -2256, -478, 2371, -499, -2280, 1372, 1692, -2025, -923, 2336, 109, -2315, 1003, 1992, -1656, -1318, 2251, 552, -2374, 419, 2191, -1353, -1640, 2056, 779, -2286, 118, 2327, -863, -1915, 1636, 1232, -2143, -473, 2296, -429, -2269, 1346, 1617, -1886, -925, 2229, 5, -2218, 856, 1935, -1583, -1207, 2181, 605, -2340, 334, 2185, -1211, -1707, 1925, 976, -2220, -34, 2323, -739, -1993, 1628, 1285, -2034, -527, 2319, -453, -2150, 1281, 1618, -1925, -814, 2237, 71, -2231, 897, 1905, -1598, -1147, 2039, 572, -2317, 377, 2132, -1257, -1683, 1866, 1021, -2290, -17, 2216, -894, -1955, 1638, 1276, -2120, -456, 2309, -416, -2041, 1306, 1556, -1887, -863, 2216, -9, -2180, 825, 1824, -1544, -1275, 2108, 553]
3402E53k759K672J676l346m11L487r47l080K106K088k871j048L463l26l425J537
3418f31K821k678j597L322L41l352Q95L083k158k237L032J029l414K87L186j486
3434D43k646K560J723l362k15L327r88k941J901K320k837j122L415l89l261J534
3450e38K640k490j686L114O10l484J039K949k070k206K904J066l366L18L263j702
3466C61k525K488J719l210l35L328r83k890K007K153k858r45L139j93l270J444
3482e70K691k505j711L210N08l359Q65K999k023k222K873J129l268J59L183j453
3498E06k653K512J613l078m93L292p15l041K100K084k874r79L151r8l277J431
3514e19K575k407j663L047N05l217P17L110j969k315K837J009l091J20L222j534
$$ y = [553, -2206, 466, 2142, -1204, -1615, 1872, 925, -2155, -49, 2039, -832, -1880, 1583, 1257, -2168, -631, 2190, -488, -2085, 1237, 1578, -1774, -879, 2204, 46, -2191, 841, 1870, -1544, -1257, 1929, 443, -2203, 357, 2080, -1282, -1497, 1830, 842, -2099, -198, 2122, -715, -1837, 1578, 1189, -2072, -538, 2102, -388, -2074, 1040, 1650, -1834, -795, 2154, 84, -2122, 782, 1848, -1518, -1200, 2063, 361, -2164, 324, 2043, -1167, -1502, 1826, 843, -2047, -40, 2113, -745, -1690, 1449, 1256, -2014, -570, 2121, -384, -2095, 1115, 1623, -1736, -871, 2128, 105, -2117, 756, 1885, -1383, -1224, 1959, 506, -2147, 365, 1978, -1100, -1593, 1699, 984, -2057, 43, 2127, -747, -1726, 1425, 1327, -1950, -519, 2056, -351, -2014, 1033, 1538, -1679, -962, 2148, 179, -2136, 701, 1710, -1381, -1261, 1961, 427]
3530D27k575K484J674l094m69L288p76k940J873K083k731j129L371l05l054J310
3546e63K598k350j603K986L90l069O22K989j866k149K706J089l121J39L022j361
3562D59k531K307J602k857n60L243p07l029J949K090k581j103L224k56l049J354
3578d45K518k390j720L168L41l114Q58K697j752k102K632R80k988J14K975j186
3594E86k502K166J667k898o02L143o47k874J815K191k663j192L153j20l080J366
3610d91K523k319j629K974M44l041O86K854k015j895K622Q98k819O1K833j078
3626F08k509K220J495k795n09K971o73k512J467K224k682j076L071n0k986J099
3642f37K658k267j746K910N35l028Q47K592j717k114K549J028k876N8K958j273
$$ y = [427, -2148, 336, 2010, -1084, -1553, 1735, 959, -1981, -108, 1975, -756, -1885, 1486, 1181, -1873, -563, 2035, -315, -1918, 1068, 1458, -1611, -989, 2000, 134, -2015, 691, 1780, -1341, -1202, 1820, 459, -2072, 235, 1837, -1020, -1580, 1663, 956, -2073, -124, 1966, -615, -1718, 1506, 1250, -1799, -445, 2073, -317, -2037, 1131, 1472, -1642, -784, 1913, 161, -1941, 691, 1671, -1317, -1203, 1772, 586, -1916, 250, 1917, -981, -1583, 1560, 913, -1961, -146, 2045, -618, -1810, 1343, 1223, -1857, -491, 2032, -287, -1916, 1058, 1502, -1539, -853, 2001, -14, -1909, 713, 1611, -1208, -1147, 1686, 608, -1901, 319, 1814, -981, -1490, 1481, 808, -1704, -237, 1987, -695, -1771, 1300, 1250, -1736, -637, 2021, -246, -1992, 918, 1453, -1575, -728, 1864, 147, -1967, 582, 1610, -1266, -1208, 1750, 477]
3658D77k373K278J432k918l35L031q19k574J603K130k494j140K947j3k894J109
3674e53K424k115j561K634O27k905N48K796j664k107K479J110l097K03K823j090
3690E52k514K137J652k827m89K928o26k550J646J864k378j061K745J14k913J194
3706e26K331j915j656K661N85k860M61K722j475k264K355J283k876j9K936j159
3722E84k485K197J553k810m27K772n30k727J711K102k583r78K854j22k790J251
3738d28K250k025j542K553O14k798M68K773j587k136K410J110k737p9K706j015
3754E37k330J869J724k621o53K869m61k671J480K096k406j019K747Nk767J114
3770d87K263k013j509K660L85k708N31K622j489k021K302J108k804P4K708j168
$$ y = [477, -1896, 382, 1814, -1104, -1439, 1592, 773, -1801, -198, 1932, -562, -1702, 1245, 1232, -1662, -553, 1871, -244, -1805, 829, 1456, -1449, -901, 1895, 231, -1876, 603, 1713, -1384, -1181, 1642, 552, -1962, 175, 1827, -1000, -1489, 1439, 813, -1737, -91, 1773, -605, -1666, 1079, 1193, -1720, -526, 1805, -110, -1766, 895, 1480, -1380, -919, 1803, 328, -1936, 419, 1702, -1174, -1193, 1743, 584, -1901, 296, 1849, -961, -1388, 1384, 854, -1873, -162, 1940, -643, -1621, 1233, 1111, -1679, -428, 1822, -203, -1745, 808, 1422, -1376, -908, 1865, 278, -1858, 552, 1662, -1075, -1154, 1552, 537, -1793, 76, 1800, -821, -1474, 1395, 934, -1737, -257, 1839, -567, -1586, 1161, 1166, -1601, -487, 1776, -237, -1746, 914, 1299, -1409, -878, 1744, 255, -1766, 536, 1644, -1160, -1086, 1622, 454]
3786D54k238J857J657k581n90K745m49k504J346K142k359j010K596M4k642R18
3802f14K273j789j627K544O65k827L92K729j448k034K306J132k819p2K743j019
3818E35k268J887J656k613o63K708l03k567J350K019k173j034K445K47k753Q70
3834f57K494j876j620K358P70k781M62K508j373j982K153J211k636j54K630r35
3850E72k250J756J614k496m36K540l83k494J224K072k099j141K445K44k645Q81
3866e96K229j722j602K320P63k642L31K522j207k099K094J144k490j64K527p30
3882F78k259J601J560k408n98K628k35k475J187K013k070j191K558K08k582O94
3898f91K332j730j561K318O82k482K48K480j397j811K042J081k438k08K566q32
$$ y = [454, -1784, 73, 1730, -851, -1441, 1304, 855, -1649, -303, 1839, -520, -1530, 1066, 1110, -1532, -614, 1659, -130, -1757, 787, 1452, -1375, -983, 1746, 298, -1736, 570, 1702, -1117, -1189, 1554, 535, -1733, 154, 1810, -803, -1466, 1242, 939, -1628, -278, 1741, -432, -1466, 979, 1226, -1527, -657, 1837, -39, -1659, 699, 1469, -1312, -850, 1658, 285, -1697, 456, 1667, -969, -1123, 1507, 572, -1678, 78, 1692, -804, -1240, 1300, 917, -1577, -353, 1719, -380, -1521, 924, 1168, -1477, -596, 1633, -89, -1691, 629, 1392, -1250, -919, 1603, 396, -1703, 391, 1535, -955, -1119, 1408, 678, -1581, 20, 1580, -828, -1426, 1202, 967, -1508, -321, 1692, -378, -1569, 989, 1197, -1385, -691, 1641, -89, -1650, 668, 1350, -1132, -884, 1596, 199, -1612, 430, 1511, -927, -1135, 1431, 599]
3914E99k213J731J480k259o43K518k92k361J094K007k002j205K452K44k512P41
3930f21K345j797j489K193P66k576K67K415j278j817J900J184k466j93K474p26
3946E81k131J560J563k258o45K545k51k562J328K006k083j169K551J22k519Q67
3962d95K044j575j457K209N86k451K63K421j216j959J833J282k326l11K412n80
3978F80k207J556J573k182o76K329j44k358J007K005j864j221K389K61k539P78
3994f13K200j532j654K262P17k483K13K448j255j862J899J227k436k76K501p54
4010F02k211J587J628k116p66K321j48k457J185J943j865j213K340K77k462P70
4026e85K230j659j547K098P83k481J49K506j112k000J899J189k364k34K385o17
$$ y = [599, -1614, 117, 1597, -662, -1305, 1213, 921, -1440, -346, 1661, -341, -1546, 906, 1150, -1362, -621, 1724, -73, -1562, 631, 1397, -1179, -912, 1503, 225, -1592, 308, 1492, -974, -1167, 1307, 581, -1550, 10, 1573, -685, -1330, 1215, 964, -1598, -270, 1736, -347, -1516, 1035, 1157, -1362, -495, 1549, -26, -1483, 726, 1312, -1139, -876, 1545, 329, -1630, 203, 1485, -841, -1152, 1260, 680, -1527, 29, 1602, -580, -1256, 1073, 929, -1429, -422, 1583, -281, -1502, 887, 1148, -1391, -613, 1587, 55, -1599, 663, 1380, -1103, -890, 1558, 303, -1559, 340, 1567, -869, -1145, 1356, 602, -1609, -22, 1606, -510, -1276, 1045, 897, -1560, -375, 1568, -297, -1510, 830, 1107, -1355, -585, 1645, -14, -1561, 537, 1320, -1161, -1012, 1494, 382, -1618, 281, 1470, -894, -1128, 1257, 640]
4042F40k064J445J586k132p92K420j54k303R77J917j759j227K185M06k385N48
$$ y = [640, -1424, 21, 1607, -525, -1317, 1103, 949, -1354, -377, 1540, -219, -1446, 739, 1145, -1240, -692]
$$ [...]
8191D08
##END NTUPLES=NMR FID
##END=
