##TITLE=1H_4C2410TFA07
 aceton-d6,8 sc, 
 25.10.2021
##JCAMPDX= 6.0         $$ Bruker NMR JCAMP-DX V2.0
##DATA TYPE= NMR FID
##DATA CLASS= NTUPLES
##ORIGIN= UXNMR, Bruker Analytische Messtechnik GmbH
##OWNER= root
$$ XWIN-NMR		Version 3.5
$$ Mon Oct 25 10:43:20 2021 Russian Standard Time (UT+4h)  she@DPX200
##.OBSERVE FREQUENCY= 200.1313468511
##.OBSERVE NUCLEUS= ^1H
##.DELAY= (6, 6)
##.ACQUISITION MODE= SIMULTANEOUS
##.ACQUISITION SCHEME= undefined
##.AVERAGES= 8
##.DIGITISER RES= 18
##SPECTROMETER/DATA SYSTEM= spect
##.PULSE SEQUENCE= zg30
##.SOLVENT NAME= Acetone
##.SHIFT REFERENCE= (INTERNAL, Acetone, 0, 15.7039)
##AUDIT TRAIL= $$ (NUMBER, WHEN, WHO, WHERE, WHAT)
$$ ##TITLE= Audit trail, XWIN-NMR		Version 3.5
$$ ##JCAMPDX= 5.01
$$ ##ORIGIN= Bruker BioSpin GmbH
$$ ##OWNER= she
$$ F:/spectra/data/she/nmr/H-F/1/audita.txt
$$ ##AUDIT TRAIL=  $$ (NUMBER, WHEN, WHO, WHERE, WHAT)
(   1,<2021-10-25 10:41:17.71 +0400>,<she>,<DPX200>,
      <created by zg, POWCHK disabled, PULCHK disabled
       configuration hash MD5:
       00 E9 B6 7A A2 85 ED C7 34 08 36 98 17 FE 4E 26
       data hash MD5: 16K
       4C 3D BA 85 74 18 B5 46 8F 80 58 0E BF A2 A1 B3>)
$$ ##END=
$$ 
$$ hash MD5
$$ CB DD 98 15 33 D5 DE F4 0C 84 CC D3 52 7C A8 16
##$RELAX= 
##$RELAX= 
##$RELAX= 
##$RELAX= 
##$RELAX= 
##$RELAX= 
$$ Bruker specific parameters
$$ --------------------------
##$DU= <F:/spectra>
##$EXPNO= 1
##$NAME= <H-F>
##$PROCNO= 1
##$TYPE= <nmr>
##$USER= <she>
##$AMP= (0..31)
100 100 100 100 100 100 100 100 100 100 100 100 100 100 100 100 100 100 
100 100 100 100 100 100 100 100 100 100 100 100 100 100 
##$AQSEQ= 0
##$AQ_mod= 1
##$AUNM= <au_zg>
##$AUTOPOS= <>
##$BF1= 200.13
##$BF2= 200.13
##$BF3= 200.13
##$BF4= 200.13
##$BF5= 200.13
##$BF6= 200.13
##$BF7= 200.13
##$BF8= 200.13
##$BYTORDA= 1
##$CFDGTYP= 0
##$CFRGTYP= 5
##$CHEMSTR= <none>
##$CNST= (0..31)
1 1 145 1 1 1 1 1 1 1 1 1 1 1 1 1 1 1 1 1 1 1 1 1 1 1 1 1 1 1 1 1 
##$CPDPRG= <>
##$CPDPRG1= <>
##$CPDPRG2= <>
##$CPDPRG3= <>
##$CPDPRG4= <mlev>
##$CPDPRG5= <mlev>
##$CPDPRG6= <mlev>
##$CPDPRG7= <mlev>
##$CPDPRG8= <mlev>
##$CPDPRGB= <>
##$CPDPRGT= <>
##$D= (0..31)
0 1.2 0 0 0 0 0 0 0 0.06 0 0.03 0 0 0 0 0.0002 0 0 0 0 0 0 0 0 0 0 0 0 
0 0 0 
##$DATE= 1635144077
##$DBL= (0..7)
120 120 120 120 120 120 120 120 
##$DBP= (0..7)
150 150 150 150 150 150 150 150 
##$DBP07= 0
##$DBPNAM0= <>
##$DBPNAM1= <>
##$DBPNAM2= <>
##$DBPNAM3= <>
##$DBPNAM4= <>
##$DBPNAM5= <>
##$DBPNAM6= <>
##$DBPNAM7= <>
##$DBPOAL= (0..7)
0.5 0.5 0.5 0.5 0.5 0.5 0.5 0.5 
##$DBPOFFS= (0..7)
0 0 0 0 0 0 0 0 
##$DE= 6
##$DECBNUC= <off>
##$DECIM= 32
##$DECNUC= <off>
##$DECSTAT= 4
##$DIGMOD= 1
##$DIGTYP= 9
##$DL= (0..7)
0 120 120 120 120 120 120 120 
##$DP= (0..7)
150 150 150 150 150 150 150 150 
##$DP07= 0
##$DPNAME0= <>
##$DPNAME1= <>
##$DPNAME2= <>
##$DPNAME3= <>
##$DPNAME4= <>
##$DPNAME5= <>
##$DPNAME6= <>
##$DPNAME7= <>
##$DPOAL= (0..7)
0.5 0.5 0.5 0.5 0.5 0.5 0.5 0.5 
##$DPOFFS= (0..7)
0 0 0 0 0 0 0 0 
##$DQDMODE= 0
##$DR= 18
##$DS= 0
$$ [...]
##$SUBNAM2= <"">
##$SUBNAM3= <"">
##$SUBNAM4= <"">
##$SUBNAM5= <"">
##$SUBNAM6= <"">
##$SUBNAM7= <"">
##$SUBNAM8= <"">
##$SUBNAM9= <"">
##$SW= 18.0517286264689
##$SWIBOX= (0..15)
0 0 2 0 0 0 0 0 0 0 0 0 0 0 0 0 
##$SW_h= 3612.71676300578
##$TD= 16384
##$TD0= 1
##$TE= 0
##$TE2= 300
##$TE3= 300
##$TEG= 300
##$TL= (0..7)
0 120 120 120 120 120 120 120 
##$TP= (0..7)
150 150 150 150 150 150 150 150 
##$TP07= 0
##$TPNAME0= <>
##$TPNAME1= <>
##$TPNAME2= <>
##$TPNAME3= <>
##$TPNAME4= <>
##$TPNAME5= <>
##$TPNAME6= <>
##$TPNAME7= <>
##$TPOAL= (0..7)
0.5 0.5 0.5 0.5 0.5 0.5 0.5 0.5 
##$TPOFFS= (0..7)
0 0 0 0 0 0 0 0 
##$TUNHIN= 0
##$TUNHOUT= 0
##$TUNXOUT= 0
##$USERA1= <user>
##$USERA2= <user>
##$USERA3= <user>
##$USERA4= <user>
##$USERA5= <user>
##$V9= 5
##$VALIST= <valist>
##$VCLIST= <CCCCCCCCCCCCCCC>
##$VD= 0
##$VDLIST= <DDDDDDDDDDDDDDD>
##$VPLIST= <PPPPPPPPPPPPPPP>
##$VTLIST= <TTTTTTTTTTTTTTT>
##$WBST= 1024
##$WBSW= 4
##$XGAIN= (0..3)
0 0 0 0 
##$XL= 0
##$YL= 0
##$YMAX_a= 504558
##$YMIN_a= -422440
##$ZGOPTNS= <>
##$ZL1= 120
##$ZL2= 120
##$ZL3= 120
##$ZL4= 120
##$ABSF1= 10
##$ABSF2= 0
##$ABSG= 5
##$ABSL= 3
##$ALPHA= 0
##$AQORDER= 0
##$ASSFAC= 0
##$ASSFACI= 0
##$ASSFACX= 0
##$ASSWID= 0
##$AUNMP= <proc_1d>
##$AZFE= 0.1
##$AZFW= 0.1
##$BCFW= 1
##$BC_mod= 2
##$BYTORDP= 1
##$COROFFS= 0
##$CY= 11.3945322036743
##$DATMOD= 1
##$DC= 2
##$DFILT= <>
##$DTYPP= 0
##$F1P= 2.36226072786647
##$F2P= -0.459571619588291
##$FCOR= 0.5
##$FTSIZE= 0
##$FT_mod= 4
##$GAMMA= 1
##$GB= 0.15
##$INTBC= 1
##$INTSCL= 1
##$ISEN= 128
##$LB= 0.24
##$LEV0= 0
##$LPBIN= 0
##$MAXI= 10000
##$MC2= 0
##$MEAN= 0
##$ME_mod= 0
##$MI= 1.114404
##$NCOEF= 0
##$NC_proc= 0
##$NLEV= 6
##$NOISF1= 3.799351
##$NOISF2= 2.8
##$NSP= 1
##$NTH_PI= 0
##$NZP= 0
##$OFFSET= 15.70392
##$PC= 1
##$PHC0= -15151.61
##$PHC1= 10.80083
##$PH_mod= 1
##$PKNL= yes
##$PPARMOD= 0
##$PSCAL= 0
##$PSIGN= 0
##$REVERSE= no
##$SF= 200.130013532006
##$SI= 16384
##$SIGF1= 3
##$SIGF2= 2
##$SINO= 400
##$SIOLD= 16384
##$SREGLST= <1H.CDCl3>
##$SSB= 0
##$STSI= 0
##$STSR= 0
##$SW_p= 3612.71676300578
##$SYMM= 0
##$S_DEV= 0
##$TDeff= 0
##$TDoff= 0
##$TI= <>
##$TILT= no
##$TM1= 0
##$TM2= 0
##$TOPLEV= 0
##$USERP1= <user>
##$USERP2= <user>
##$USERP3= <user>
##$USERP4= <user>
##$USERP5= <user>
##$WDW= 1
##$XDIM= 8192
##$YMAX_p= 0
##$YMIN_p= 0
$$ End of Bruker specific parameters
$$ ---------------------------------
##NTUPLES= NMR FID
##VAR_NAME=  TIME,          FID/REAL,        FID/IMAG
##SYMBOL=    X,             R,               I
##VAR_TYPE=  INDEPENDENT,   DEPENDENT,       DEPENDENT
##VAR_FORM=  AFFN,          ASDF,            ASDF
##VAR_DIM=   8192,          8192,            8192
##UNITS=     SECONDS,       ARBITRARY UNITS, ARBITRARY UNITS
##FACTOR=    0.0002768,     1,               1
##FIRST=     0,             0,               0
##LAST=      2.2672688,     0,               0
##MIN=       0,             -422440,         0
##MAX=       2.2672688,     504558,          0
$$ Real data points
##PAGE= N=1
##DATA TABLE= (X++(R..R)), XYDATA
0@%%%%%%%%%Qj6J6j6K4m0M8n6P2q8J04j28J60j90K22k57K98l49M04m66N39o18
31c29P03q01R11j027J157j304J464j636J825k036K264k511K782l081L406l760
47a973M149m574N039n550O114o738P428q201R074j0060J1186j2489J4014j5828
61h409J8030k0773K4297k9006L5668m5890O3736j03817L54868J885n49786J81019
73g8178K97807K84929n10570l52428N47805K59479m29999k08746J03685M13376
83C27160j8427n87240N0575N51211q6766l83111j09708L05363L03618l53603m21512
94d22440L50491L82190k09008l68901L647M07525J36567m67555j49721M52115
104A14910J55090l35676k16848K20312L46979j77338m15773J70517L84155r2329
$$ y = [0, 0, 0, 0, 0, 0, 0, 0, 0, 0, 8, -8, 8, -8, 16, -24, 24, -32, 40, -48, 56, -72, 88, -102, 120, -137, 161, -188, 216, -250, 289, -329, 374, -427, 484, -543, 614, -690, 774, -862, 963, -1073, 1191, -1320, 1462, -1619, 1787, -1973, 2176, -2398, 2641, -2909, 3205, -3533, 3895, -4306, 4768, -5292, 5894, -6595, 7419, -8409, 9621, -11152, 13145, -15861, 19807, -26083, 37653, -66164, 288704, 290589, -259197, -78178, 219629, 504558, -6012, -358440, 189365, 448844, 18845, -189901, -86216, 327160, 308733, -278507, -227932, 323279, 236513, -146598, -256306, 49057, 352675, -928, -422440, -71949, 310241, 101233, -267668, -264021, 143504, 280071, -187484, -337205, 114910, 270000, -65676, -282524, -62212, 284767, 107429, -308344, -137827, 246328, 153999]
114A53999l30206p6853L41600K14068l73216k46677L12158K46582j66999l04611
124b30155O1190L75352l6421l67157o409K94916J16921k61229k27270K63351K61908
135B44997k18551k68552J16061L24141k0333l68759j7420L45816P7725k66416
145e1291j69929K28031K41224k14414k46667J56351K39983n7151k74376j6994
155a65233L03962M4467k76845q4573K17843J62979j77155k29412J46328K47995
165A90356q6668k47095L090K47960N8833k43836j07106K13306J56078j80469k01380
176a96931J44500K21318q7048k31739J6498K54567L5133k60311o6353K21620J15371
187A66625j64436j86070J32452K22340j10904k07151N2382J90848K7236k04244
$$ y = [153999, -176207, -253060, 88540, 302608, -70608, -317285, -5127, 241455, 74456, -230155, -168965, 206387, 169966, -197191, -203600, 91316, 208237, -52992, -280262, -16911, 244997, 26446, -242106, -126045, 198096, 177763, -190996, -208416, 137400, 215125, -51291, -221220, 6811, 248035, 33621, -213046, -56695, 183288, 126137, -148239, -165233, 138729, 183196, -93649, -178222, 39621, 202600, 25445, -203967, -57639, 190356, 103688, -143407, -140317, 107643, 166476, -77360, -184466, 28840, 184918, 4449, -196931, -52431, 168887, 81839, -149900, -133402, 121165, 156298, -104013, -170366, 51254, 166625, 2189, -183881, -51429, 170911, 60007, -147144, -94762, 96086, 123322, -80922]
197h0922p3592K08718R0041j63522j21847J07343J75087p7666j99865N3244J88145
208A05164M879j80269p0460J88899J02052j70608j15283J15416J54241p0054j96833
219a32856N6670J97355k9938j68438l6796J62700R6659j76186j10763J52885J13026
230A24318q8175j47641L7371J86975k1544j80269l797J42936O2168j24324j13901
241a25883J21982J26772r4056j28725M0718J47955M37j63460k3202J50445N4940
252A07923j26443r7456J11226J22944r1545j31126N0454J43376j1311j58478j1033
263i1469J49018L5863j20365p9342J05002J13517r8274j15030O6852J13214j3616
274F5370j32976k1186J48339L0253j24429n2680Q3850J00817o8067j31534O5024
$$ y = [-80922, -154514, 54204, 144245, -19277, -141124, -33781, 141306, 63640, -136225, -82981, 105164, 110043, -70226, -140686, 48213, 150265, -20343, -135626, -20210, 134031, 63977, -132856, -76186, 121169, 91231, -77207, -114003, 48697, 145356, -30830, -141593, 11292, 124318, 36143, -111498, -74127, 112848, 91304, -88965, -92762, 50174, 112342, -11982, -125883, -3901, 122871, 28815, -99910, -59192, 88763, 89200, -74260, -97462, 52983, 107923, -18520, -115976, -4750, 118194, 26649, -104477, -54023, 89353, 78042, -80436, -91469, 57549, 93412, -26953, -106295, -1293, 112224, 13950, -101080, -34228, 78986, 65370, -67606, -88792, 59547, 89800, -34629, -87309, -3459, 97358, 29291, -102243, -37219]
285c7219J24076l0756j12323k5304J25818N7180j33153o2163J04111P9020o5180
296B4107j16238M8075J34245l7289j22500J796J12180M2419j17136o2929J09727
307A6457O9201p5794r1133M3339J18191l0916j19690J1300J01311K8711r6509
318b5532o3430J00749P2743q1492p9466M3277J04515j6865j23055O889J12942
329E1275J6601r4414n6961R1066Q2059q8082q4872N9101R1886k0557j11803K702
341f1999J18215P655r7823l5007Q0629P1294p8139q4897O6962Q1172l2430q9750
353e4118j505J06143J3911j02804k5191P7982N6209o1817q4249N9637Q8119m2766
365B9551q2370P170R2299J9416j04571k7661R1631M0112o5748p0469N2854R1239
$$ y = [-37219, 86857, 56101, -56222, -81526, 44292, 101472, -31681, -93844, 10267, 89287, 24107, -92131, -44056, 90189, 52900, -69600, -67804, 44376, 86795, -30341, -93270, 16457, 85658, 9864, -81269, -37930, 80261, 49345, -70345, -59045, 42266, 70977, -25532, -88962, 11787, 84530, 3038, -76428, -33151, 71364, 54499, -68556, -61667, 51275, 67876, -26538, -83499, 7567, 89626, 1544, -83328, -24227, 67659, 47102, -64701, -61999, 56216, 63871, -33952, -68959, 11670, 82964, 4825, -80072, -13110, 68062, 35632, -54118, -55623, 50520, 64431, -38373, -63564, 14418, 70627, 8810, -75439, -15802, 72317, 29551, -52819, -45649, 46650, 66066, -38505, -66166, 25465, 65577, -171, -70640, -17786, 73453]
377G3453m8885q8568K6233Q3081R265r1257l0642R2793L7396p2950n4085M9403
389a4763P7545m0354q6135K7783P9287J915p9688k9101Q6749L8560p5151m4432
401e7785M7622O9051l0026r0464K9583Q4576j4595o7085k2434P0233M8540q2188
413a4972m6291O8856M5077l3767o7378J3659R1451j4760q5808N280O4173K6878
425E2398n9132n5756O3217N9406n2528n8381K3981O7828k802p7662p606P3581
437B6544K2223o3631m0123N6921N2577m3976n9753K3447P1682p426p9176k03O9025
450B8131J6563n2731m4223N1023N9840n2654n2896L4153M9064k443o5126j1689
462d2988P7705P830o4113j7998M0569M6913l6335o6156L9183N9653k2535n2231
$$ y = [73453, 24568, -64000, -37767, 45314, 54579, -36678, -67320, 25473, 62869, -10081, -64166, -14763, 62782, 22428, -63707, -35924, 43363, 45278, -34410, -63511, 23238, 61798, -13353, -57785, -10163, 58888, 28862, -61602, -32019, 52557, 37962, -29123, -51557, 18676, 67216, -14972, -61263, 7593, 52670, 18903, -48475, -34816, 56635, 41875, -43933, -38653, 25520, 52398, -6734, -62490, 727, 60133, 7605, -50776, -26795, 41033, 38231, -39431, -47037, 26544, 48767, -14864, -54987, 1934, 54511, 10535, -49218, -25771, 45911, 38485, -40691, -40894, 28131, 44694, -8037, -52260, -1237, 58603, 5949, -46947, -12794, 36270, 33827, -31299, -42988, 34717, 42547, -21566, -39564, 1005, 47918, 11583, -54573, -15390, 44263, 21728, -30503]
474c0503q055O0996K4226o6870k4612N2568L3285l2917n3822K8215O3000k4545
486B0966n6723M842N5472J9839o3424k8814O0290L1380l8211m5783K0264O3714
498D3812j6701o3111R970M9504J1650m5979l1852N1193L5384m6003l5690K7119
510a0704M6933j2820n8716O255N7232O035n0620k4011M7261L5228m1697l8675
522c8299K5959M5956j1887n6387P744N4837j797m3118j8710M0880L8404m7511
534c929m0135M0561L6390j4828m7698m623O3291O018n8357r191L7848K9187k7655
547F879m8423L1083M7837k4852l9869L814M4559J2294n3095j5500M7130K2063
559C3920l2623l8090K5769M7976k2021m4434O892M2470J1515m7990j7779M6858
$$ y = [-30503, -38558, 22438, 46664, -20206, -44818, 7750, 41035, 8118, -45704, -17489, 45511, 20966, -35757, -30915, 24557, 44396, -19028, -47842, 12448, 43828, 5617, -40166, -19902, 43812, 27111, -36000, -26030, 23474, 35124, -10855, -42707, 8486, 43870, -2133, -37823, -10704, 36229, 23409, -35307, -29052, 28180, 34215, -16405, -40416, 6845, 42073, 376, -38299, -12340, 33616, 21729, -34658, -26914, 27923, 26126, -16992, -35702, 5178, 43582, -3929, -44064, -3503, 32887, 18059, -29639, -34262, 29029, 35047, -23310, -32501, 5347, 34534, 6879, -41544, -10461, 37376, 12524, -27345, -23531, 21028, 33322, -19773, -35273, 11857, 33920, 1297, -36793, -11024, 36952, 14931, -29503, -22611, 19859, 31374, -16616, -34395, 12463]
571A2463J7232l1356k7705J8944M5156k0439m8254J9370L8868m08l7646k1034
583c4809M7297K6643m6113k4625K7786L3705j0772m8434P052N0447l914m1559
595a7296r488L5529K4685l6373l1392L1449L4842k0716m1515J0596M4702j535
607B3488m1634j3039L9390K5635l9620k7838L0762K7855j2760l7530K742M8798
619B6249n143m3550L094K8660J7411k6143l6176L6698L4158l2926k5021R033L3060
632A9404R611m9965p065M8216L788k8707j9408J7915L8816k3225m1090K2951L1868
645B3109o518l2683j1000M0753J6052m0667j8413K9715K6900j9856l5955J3597
657a4966L8192m659l7476n645L7581J2280l3070j7518K4049K7616j8850l5678
$$ y = [12463, 29695, -1661, -29366, -10422, 34734, 14295, -33959, -14589, 24279, 23871, -13775, -34809, 12488, 39131, -6982, -31607, -3821, 29884, 19112, -29322, -22270, 28177, 24263, -17296, -26784, 8745, 33430, -2943, -34335, -2886, 31956, 11240, -30275, -19679, 25023, 23488, -18146, -31185, 8205, 33840, -5780, -33618, -2856, 24999, 12239, -25291, -22549, 26249, 21106, -22444, -19350, 9310, 26721, 578, -35598, 1100, 35258, 2332, -22689, -13656, 19404, 29015, -20950, -28015, 20201, 23989, -4718, -24126, -6211, 32605, 9380, -31710, -8759, 23109, 16591, -16092, -27092, 13661, 29713, -10954, -29367, 348, 27248, 7392, -28563, -14966, 23226, 18567, -18909, -24554, 13027, 25307, -7763, -25281, -1232, 26384, 7534, -28144]
669b8144J8432L3986j1073k8870n270L3124J6429l9297j5462L2198J6752j6214
681F591k9690R381M0319j2015l6154O404K7092J0136k8611k1828L4173K0766k7859
694a295k1000J3139L1293n393l9259M795L4354L256k7524j7799K7713K5389k7350
707C19k4149J6782K6629m523l4615O90L6207J305k8192j1906K3063K4502k4430
720A682k7181K1369K4154q744k7730k215L4820M108l2955o672K3674J7255j9622
733A943k6393K0149K6683j4832k4797K868K9461M759l3499o382K7773J2404j9888
746B49k3258J8317K8469j6949k5849P184K5764N160l1118r642L1460J0174k2274
759b313j7487J4261K7975j4225k9759J1417K5143o7k5038j0769K9400J2720k6727
$$ y = [-28144, -9712, 24274, 13201, -15669, -20939, 12185, 28614, -10683, -26145, 6053, 22805, 6591, -23099, -13718, 26601, 14586, -21568, -15164, 11928, 22064, -6547, -28375, 5798, 26564, -1295, -22295, -9156, 22137, 16744, -22515, -17720, 16634, 19890, -7634, -25433, 2280, 27669, 319, -23830, -7048, 19581, 15058, -19557, -18867, 17340, 18645, -9547, -21453, 1610, 26112, 1682, -25499, -4130, 20024, 11280, -16450, -18665, 16155, 20263, -12692, -19364, 4310, 21565, 1943, -24450, -4301, 22382, 7550, -17247, -14379, 15082, 19841, -13658, -20040, 7733, 20137, 249, -23009, -4692, 23777, 6828, -19021, -11837, 13927, 19087, -12031, -21673, 9787, 19961, -2313, -19800, -5539, 22436, 8211, -21548, -10131, 15012, 14945, -10093, -20862, 8538, 21258, -5469]
772e469j3017J6472K0873j0363k8906J0306K7642n817k2679o086K3945J4097k7245
785f247j3729K1705J5599j1320k3932O851K9636o709k6044P30K0885J1619k3212
798d168j7729K4818J6486j6940j8856O554K6465l184k9095J921K3701O000j9800
811c827j6111K0985J9159j8663j7955R335K1363j536k6752j38K5274L023j8945
824d788j2210J7102J9257j7846j8848J2885J8042k916k3037k284K6647K454k2039
837g581o732J5391J6122j4837k1068J5665J8387q460j8120j711K3460N323k5072
850i233n255J8666J0477j2426j9372J2469K1601j0909j8433K278J8780O244k2438
863g551q044K1036Q565j3517j4935R138K1258r261k0477N612J7177L088j8456
$$ y = [-5469, -18486, -2014, 18859, 8496, -20410, -10104, 17538, 11721, -10958, -17044, 6901, 20998, -6247, -19976, 1729, 17328, 6008, -17924, -11073, 18563, 11854, -14190, -13460, 7425, 19044, -4168, -21897, 2921, 19407, 2467, -16389, -9835, 16630, 13446, -15649, -13728, 9973, 15973, -3827, -19938, 1047, 20206, 1543, -16412, -7077, 14286, 12750, -14002, -14140, 11134, 14157, -4788, -16998, 104, 19361, 1515, -17333, -4448, 13594, 10678, -12359, -14643, 12004, 14458, -7581, -14313, 1078, 17200, 2363, -18705, -3040, 15347, 6887, -11233, -12944, 10516, 15839, -9233, -14488, 4178, 14655, 2229, -17143, -4674, 16927, 6018, -12415, -10137, 8643, 14887, -7551, -15595, 5441, 14006, 489, -14446, -5308, 15950, 6689, -13788, -8176, 9001, 12089, -6367]
876f367r191K1074Q974j7073j0277R174J7376o775k1436P254J8240k431j5046
889f504o720J7684J0906j9383r557J3192J1948n960j8566M507K0786l919j6974
902h560k073J4696R921j6498j2094J5738J1059q623j4737L028J9923k408j8964
915i592M63J4051O999j3198j2900J5258J1988j1552j1242L656J5729J89j9423
928i574Q09J6047J653j0722r725J1101J4212j2782j2161Q297J1337p10j5557k152
942i927J7757J718j3888n343R791J1550j0030j3630R141J2164l674j3297j626
955i294J6498K420j5057l937J0077R603q143j4113R272J2609o013j0270j665J3011
969D998N398j6133l399J2194M415n573j1030M698J5308p059j2061L593Q774M380
$$ y = [-6367, -15558, 5516, 14490, -2583, -12860, -3686, 13690, 6915, -14521, -7267, 10973, 8542, -6504, -13224, 4460, 15366, -4017, -13574, -382, 11566, 5606, -12960, -8453, 12333, 8414, -8560, -10633, 4063, 13984, -2514, -14608, 1130, 12189, 3566, -11171, -8143, 11780, 9372, -9592, -9129, 4922, 11921, -1277, -14177, 1081, 13069, 1517, -9725, -6069, 9660, 9849, -9574, -8765, 7282, 8935, -1787, -11512, -411, 13801, 1019, -11142, -2845, 8492, 7782, -7775, -9927, 7830, 9548, -4340, -9683, 108, 11658, 1628, -12002, -2861, 9303, 5629, -7668, -9294, 7204, 9624, -5433, -9370, 707, 10310, 2167, -11946, -2674, 9935, 3922, -6348, -8013, 4998, 10396, -5737, -9136, 3058, 7473, 1900, -9130, -4432, 10876, 3817, -8244, -4651, 4123, 8503]
983H503j1321q105J4223N768j0307n870L868J1328l049j3792L664J1379l70r411
997c492n047J0837P140j0863p040O690R619l260j2661K650J1828l33r267m820
1011h019R562Q021j0868o427P174O721j509j1273K39J3718k092r855q27O047P954
1026H566q193j0135R629P286n093o519j397J0862K012j2300j75Q095K561m683
1040E16q022O292R160p033o836K792P353J803j0845j787J0524J770o329n806M478
1055a970R567n620q440M021O337J105q183l613J0553K437q322k998L931P383l059
1070C129j0276M564P823j643o189l161P638N022q638l615N272M747j979p839J979
1085c166Q464k408n854j212N537M715p872l904O920L064k350o501Q79R448k581
$$ y = [8503, -2818, -10923, 3300, 9068, -1239, -7109, -3241, 8087, 5038, -8754, -5090, 6289, 5919, -3492, -8539, 2298, 9438, -1425, -8465, -1775, 7844, 4584, -8077, -5427, 6401, 6068, -3199, -8019, 1543, 9564, -1304, -7731, -557, 6164, 4655, -6618, -6379, 7339, 5247, -4608, -5435, 612, 8566, 373, -9762, -133, 7153, 2060, -4459, -5856, 5006, 7018, -5282, -5457, 2638, 5199, 516, -7506, -1214, 7946, 913, -5923, -3131, 4222, 6025, -4820, -6607, 3917, 5687, -642, -6448, -1970, 7597, 1977, -6463, -2442, 3895, 5000, -3183, -6796, 3757, 6194, -2128, -5126, -1195, 6188, 3129, -7147, -2583, 5240, 3597, -2592, -5753, 1885, 6907, -1731, -5346, -74, 4673, 2694, -5145, -3166, 5298, 2890, -2964, -4176, 1361, 6076, -1796, -5700, 1220, 4284, 1934, -4567, -3688, 5760, 3179]
1100C179p663J497M233L785n078o692P995M066n567k903M76O462R55r537Q78P255
1116C341k1l634m865M348P112n836n381L334M898Q21p144j438P284R90m643l044
1132c878K832O195m278n708L784L879K06n342k436P584J266o172j124K597M671
1147D076k038p333L920N643k958k956j756M733L728p314j936N570J610j746n217
1162c974J321P355k557n390N19L910L021n123l883N600K900k956l937M48O655
1177C909j302n900J061L543K157l526m963N735L321m158k234J51M745J319p496
1192c638Q75N273n43j979l472K556N770m872l693L521K146N97m866j587O742K69
1208C099m979r15K419M330k927n350L556L740j069l806j726N954J433n596j059
$$ y = [3179, -4484, -2987, 1246, 5031, -47, -6739, 1256, 5322, -245, -3148, -2672, 3790, 4745, -4792, -3914, 3341, 3320, -314, -5179, -831, 6281, 445, -4936, -1602, 3296, 4117, -3027, -4465, 2819, 3809, -834, -3878, -1046, 5149, 871, -4837, -1053, 2826, 3032, -2310, -4746, 2838, 4104, -2068, -3192, -595, 4076, 2038, -5295, -1375, 4268, 1310, -1646, -3402, 1331, 5059, -2255, -4191, 1379, 2989, 1243, -3974, -2653, 4702, 2145, -3245, -2726, 1184, 4205, -918, -4801, 799, 3699, 743, -3194, -2746, 3909, 2607, -3293, -2232, 1311, 3468, -58, -5021, 714, 4035, -123, -2357, -2206, 2539, 3858, -3638, -2763, 2510, 1967, -12, -3484, -928, 4842, -30, -3723, -202, 1944, 2541, -2325, -3912, 2830, 3099, -1880, -2795, -376, 3954, 1027, -4323, -767, 2973, 1904, -1902, -3628, 2326, 3759, -1837, -2896]
1223b896K839L423j899n980L426M727k345k982j488M361L201o211j745M443J495
1238B369q31m571O31O473k441m280J036K309K699l869l788N340K009l005k300
1253b219K84M884m80n904J647L565O78k795l864M732L493m499k243J618L340M60
1269B697n962O86N384q56k741k207K784M332m242l455L111K540J78m447j297O150
1285B655J19m299q47J856M052k632m950L589L257j611k664j578M765J585n369
1300b072k49K836J959j308m599K471M606l143k412J00K810K441n042j299M366
1315A465P71j944k942J103N002k084m316J761K477J455l472l028N186J644l467
1330c89j913Q92M426q39n587J755L799j79k460k851L658L463m637j541J942K394
$$ y = [-2896, -57, 3366, 1467, -4513, -1087, 3640, 1295, -1687, -3175, 1186, 4387, -1824, -3569, 874, 2369, 1538, -3033, -2402, 4071, 1630, -2650, -1614, 695, 3394, -475, -4263, 1077, 3086, 81, -2219, -1935, 2949, 2469, -3435, -1788, 1777, 2455, -340, -4204, 528, 4021, -478, -2721, -1103, 2237, 2697, -3265, -2579, 2805, 1949, -792, -2999, -215, 4117, -125, -3580, -469, 2071, 2249, -2198, -3495, 2655, 2774, -1525, -2372, -516, 3536, 904, -4046, -457, 2800, 1189, -1475, -3053, 1712, 3297, -2072, -2321, 515, 2474, 1166, -3433, -962, 3644, 501, -1911, -1811, 999, 3440, -1602, -2901, 1465, 2236, 292, -2650, -1547, 3455, 1371, -2945, -1184, 1293, 2748, -724, -3752, 1434, 3078, -389, -2302, -1410, 3016, 2177, -3410, -1655, 2144, 1965, -495, -3346, 312, 3775, -862, -2403, -461, 1933]
1346A933L20m954O54M582r54k675j104J958L678l586k846L180J507k08l150r79
1362b644N011m6m039J3J802K802k410m248L698L031k353k211n66M174R83n233
1378b236j1L362R06j484l563K253M114k985k339O32K439J780m377j518M375P60
1394B108j925k382O55M496j771l900J551K299R40k725k695M564J725l696j113
1409a869R87L308q25m635K124L302j299j833j882L224K499m410r81K581J492l38
1425A445l859P63M315j519k415n16J909K876l365k729L434J726r63k902n21M806
1441B485l38m400N78K298J826k081l944L698K614k751j536k34L381R22m744M80
1457a746L210l90j011k172J533L407k917j799J511J225R66k897j291L946M6j975
$$ y = [1933, 2253, -2701, -2047, 2535, 1581, -1094, -2198, -240, 3438, -148, -2994, 186, 1693, 1485, -1665, -2644, 2367, 2321, -1718, -1705, 97, 2899, 489, -3759, -61, 2970, 617, -1594, -2160, 2014, 2997, -2236, -2247, 1115, 2021, 537, -3026, -773, 3341, 356, -1983, -1351, 1088, 2868, -1509, -3027, 1348, 2108, 183, -2199, -1544, 2952, 1181, -2719, -1168, 1131, 2071, -654, -3349, 1215, 2940, -756, -1869, -882, 2426, 1601, -3034, -910, 2392, 1093, -740, -2622, 602, 3101, -1309, -2290, 291, 1783, 1445, -2414, -1651, 2664, 1145, -1270, -1786, 123, 2999, -366, -3095, 339, 2065, 1102, -1800, -2321, 2485, 2147, -2253, -1675, 623, 2449, 368, -3576, 122, 2736, -15, -1551, -1785, 1596, 2518, -2226, -1746, 1464, 1074, 63, -2109, -576, 2831, -86, -1885, -374, 851, 1817, -1080, -2371, 1575, 1621, -354]
1473c54j320P79L546j715l643K132K188N3k627j856M618P06l662n10J504K472
1489B311j213m108K418L108k255j264o99K503K077m314o70K756L93j03k451M8
1505a463L669j316k216J95J139K093k046k700L075J488j539j597j73L536m30l705
1521a990Q80K308O34k153k430L396J777l147p14Q50K294j10l995J517K738j358
1537D97p94j373J439L046l323j422K062M05Q90k331j608M025R5k340o23O26K812
1554B083j076l622K169K241r70j817r07L286P04l408j84J893J245j272k564K148
1570e1K012j992p08l63J905J042l349K79K230n29L62k028J01L300j724j911R69
1587d55M79J697j725k680L520J192k231j124K18K996l19l936J448K442l80j706
$$ y = [-354, -1674, -895, 2651, 936, -2707, -575, 1613, 1666, -961, -2817, 1801, 2507, -1155, -1665, -161, 2311, 1098, -3010, -592, 2516, 261, -1003, -1702, 801, 2878, -1436, -2106, 650, 1043, 940, -1511, -1463, 2206, 890, -1326, -1131, 8, 2101, 55, -2645, 430, 1918, 379, -1218, -1391, 2145, 1715, -1990, -1110, 1198, 1832, -321, -2751, 645, 2422, -725, -1439, -589, 1705, 1595, -2400, -883, 1855, 497, -297, -1670, -231, 2815, -508, -1930, 132, 537, 1427, -904, -2512, 1513, 1608, -732, -1355, -729, 2083, 1007, -2615, -446, 1795, 825, -992, -1899, 1387, 2091, -1317, -1501, 392, 1637, 365, -2199, -51, 1961, -31, -739, -1102, 803, 1845, -1504, -1225, 1005, 476, 838, -1190, -1089, 2211, 487, -1424, -455, 24, 1721, -4, -2684, 836, 2028, -203, -1327, -1109, 1887, 1568, -2368, -920, 1522, 1142, -564]
1603e64j463K679J677l123n85J518R33k6k694P65K458j372l82q13O94K184k137
1620b51j182J627J82P98j615j444L257k71k157J67P84J864j314k938K530K014
1636B051j898j324k33K915J30l358P47K063n6j005j879J868J905k500l42P13O72
1653D69Q41k343k64K268n60j46j110l80K874j119k052J142N73J292j247k739L163
1670F62J013k150n06J19K111j06l382J758K128j384q43o93J816J219k789j8J640
1687E95J7K89k069N72K023j355m90K3J57J785j599j418J707L77Mj161j194L080
1705A343R5k660K18J022J627j171k828K481J753k148m94j71J883N47k993O25J951
1722A080r60J4j217R32J714k005l28R98k13J069j417p40K061m01n48n79m27K185
$$ y = [-564, -2027, 652, 2329, -794, -1379, 139, 1072, 1046, -1648, -883, 1575, 203, -179, -992, -298, 1886, -251, -1433, 194, 376, 1174, -441, -1885, 1372, 1101, -1056, -889, -105, 1759, 445, -2493, 37, 2051, 153, -1171, -1404, 1511, 1641, -1717, -970, 1093, 1037, 32, -1847, 21, 1926, -574, -916, -203, 469, 1310, -1033, -1297, 971, 411, 265, -845, -1225, 1649, 530, -1522, -380, 193, 1485, 238, -2501, 662, 1675, -475, -981, -862, 1249, 1143, -2239, -481, 1647, 263, -580, -1273, 543, 1762, -1027, -1045, 595, 612, 901, -1168, -596, 1427, 72, -418, -395, -238, 1547, -52, -1470, 237, 614, 618, -543, -1737, 1343, 1438, -1222, -1004, 18, 1645, 474, -2354, 127, 1880, -268, -762, -933, 950, 1497, -1496, -871, 1080, 120, 134, -1083, -151, 1563, -442, -770, 228, 15, 1084, -333, -1073, 988, 587, 39, -540, -967, 1218]
1740A218l32k229J042P46M92j015j951K731J019k677J73O35J465l70l099J843
1756c09J904j450o30n03J369J295k488k13J614j58K21j319l51K200p43q75K94
1773a42l99J679p22j878J563N34k85p38j054K527M8k238L65R24P92o00k235K040
1791A81J367k137j78M67J030M10k574O99J953j077j86q22P28J772j752q85J268
1808B64j64R64j318j295K318n5p59m94k95K047k02k617J200J090l5q17j599K461
1826F94J034k598j42J111P16l0k318J120J895j737k47Q9M76J117j990k21J767
1843G36n16l0o05n53K134p48j240N00J2J569j098j791K112P23r94o44p89K314
1861A092K43k854O14J634K29p83j807J596K000k365m81P74N93O77k104J35K019
$$ y = [1218, 886, -1343, -301, 445, 937, -78, -2029, 702, 1721, -956, -783, -148, 1317, 947, -2152, -309, 1595, 145, -485, -988, 381, 1676, -812, -1025, 589, 431, 652, -667, -1018, 1182, 439, -436, -142, -541, 1138, 416, -1462, 101, 635, 350, -388, -1442, 1085, 1133, -1105, -740, 184, 976, 376, -1859, 181, 1548, -589, -767, -300, 730, 1140, -1434, -735, 1218, 141, -45, -867, -139, 1633, -119, -1004, 264, 100, 1064, -254, -1549, 769, 714, -45, -539, -834, 1213, 1011, -1606, -406, 684, 649, -168, -1767, 694, 1728, -870, -1012, 99, 815, 785, -1533, -413, 1482, -255, -502, -413, 63, 1180, -810, -1031, 736, 220, 190, -415, -968, 1166, 418, -822, -322, -310, 1259, 161, -1630, 482, 1205, 211, -433, -1222, 1092, 1335, -1519, -905, 729, 958, 175, -1632, -36, 1964, -401, -882, -108, 485, 1162, -942, -807, 1212]
1878A212j071l06n92K93J645j119j231J295l5N96p23j298K096N9j452O5J38J578
1896A150m98k495J734J325q80p84n79J835Q28k951L29J721k8l92j872J341K037
1913A821k067p42N39N45J286k096m69J938k91m74p48j50K249q20j711J057N12
1930C79N35p62j900K132R59j875O1j70J426L34k634J008J856r84o48q02J299J365
1948A579k354l28J588J94k42j536N53J889j073r07M04J88J225j483j214K167J06
1965G56n42o99q54K314K48k448O74O56Q91n69k317K003J444j954k40n3J272P25
1983A307k534L33K043n94q08o69O42J655j753p57J358J05M49j538k47K027n51
2000D68j061J44J85J518j048j673J609N76m49n25j046K202M90k630M94J036N72
$$ y = [1212, 141, -165, -757, -464, 1181, 62, -1169, 126, 91, 687, -36, -1334, 762, 821, -631, -566, -428, 1150, 652, -1843, -109, 1216, 336, -448, -1027, 808, 1636, -1315, -986, 735, 707, 315, -1557, -216, 1821, -246, -988, -449, 96, 1382, -714, -1183, 755, 464, -10, -758, -908, 1341, 521, -1190, -133, 379, 914, 152, -1748, 384, 1343, -532, -471, -641, 785, 1119, -1515, -507, 1349, 365, -283, -1085, 214, 1579, -775, -1103, 485, 679, 437, -1099, -546, 1343, 270, -637, -233, -45, 1180, -303, -1517, 650, 756, 214, -485, -1339, 975, 1223, -1225, -551, 105, 996, 427, -1890, 113, 1557, -397, -637, -690, 582, 1307, -1227, -894, 1149, 555, -253, -922, -280, 1375, -378, -1135, 223, 328, 777, -761, -1008, 1019, 468, -593, -449, -264, 1254, 206, -1467, 142, 718, 269, -256, -1302, 900, 1390, -1240, -746, 290, 862]
2017H62k16k198J250J790j633l79j75J029J125k260l73K016l82m61p68J56K151
2034A534j317j203R37K98O10j005j029J821j17q30p0l35J554k78j867J133Q42
2051F78l34k89j353J674J123k301J74P77M57O2k202Q49K089j268o20n0O03J481
2069A550j865q11J817j15l19o57m89J953n22j410O27K84Q98o44j617J519O44q07
2087C6k31o29J532L43k174O94J035j42k27j371J074J398j959o7P68J28Q35k069
2105a026P9K038p84m85l52L58J432j185j289J438J15O9p05q90J984P8j608K66
2123d67K50R43k06j786J186R55q06l88o80J361Q39k187M13R80k57L41j587N38
2141e58J884j561j84K60J98R91j398o03J729m74l18l44j12J519o48j484J187K47
$$ y = [862, 646, -1552, -302, 1488, -145, -524, -699, 330, 1455, -805, -1178, 838, 456, -5, -773, -617, 1534, 217, -986, -49, 249, 859, -146, -1175, 646, 529, -301, -371, -706, 848, 570, -1297, -164, 678, 344, 55, -1298, 376, 1499, -802, -628, 149, 606, 668, -1534, -685, 1404, 136, -484, -534, 69, 1550, -315, -1126, 691, 576, 257, -400, -889, 1064, 542, -868, -241, 43, 941, 297, -1320, 199, 843, 36, -195, -824, 708, 1051, -1123, -429, 606, 464, 237, -1134, -60, 1338, -621, -688, 80, 208, 1043, -1026, -947, 1091, 307, -178, -530, -172, 1260, 75, -1214, 224, 339, 408, -297, -1187, 797, 875, -733, -467, -217, 726, 520, -1266, -80, 875, 69, -319, -999, 362, 1201, -986, -573, 407, 150, 491, -1096, -558, 1326, -235, -419, -159, 39, 1030, -368, -971, 758, 284, -34, -378, -490, 1029, 381, -1103, 84, 331]
2159C31J56m27j224J658M63j539K12J26Q54P3j795P45J237o35k48q25R51J192
2177A305j839L8N84J72J84j071j17J861r71n98K09j53J373r77j082J450r5k82
2195im4p40J627k10j490Q41K38L5O3j468J226P16j118L00k36N04P13j644K21J129
2215F54n74j1q06N84J226j415l50Q48j67O44j109m71J899o65p08J90j92J152m70
2234B59j353J183L85m17o1q83J232M40j575O60J51K41L54j365M90J093r96N5r1
2253a98J48J052j595J26R37k05op24k5J562j068p85R39k59P85p82q35J480j49
2272C98n72Q0l89J135p9j463P57O11l91J38j205J198P07j362J69K86J12N85j432
2291g17Q9J508p75j19k78q1J401j111m95R12j01M5m08m60J221l51q62P70j01M01
$$ y = [331, 487, 60, -1164, 494, 957, -582, -370, -244, 610, 683, -1112, -367, 870, 235, -13, -838, 113, 1305, -534, -496, 88, 260, 444, -627, -744, 1117, 146, -452, -243, -396, 977, 0, -1082, 368, 273, -9, -53, -793, 834, 624, -866, -25, 213, 248, 311, -1157, 69, 785, -333, -33, -269, 235, 948, -696, -475, 654, 80, 69, -737, -153, 1073, -342, -692, 156, -11, 633, -476, -947, 952, 287, -421, -231, -423, 729, 259, -1094, 89, 474, 57, -4, -887, 345, 785, -790, -130, 21, 262, 616, -749, -259, 834, -162, -107, -198, -50, 1002, -593, -467, 470, 265, 259, -465, -490, 1072, 4, -781, 158, -101, 684, -98, -933, 547, 398, -174, -94, -483, 652, 573, -890, -133, 478, 87, 225, -980, 218, 925, -437, -268, 18, 130, 715, -717, -628, 880, 105, -14, -292, -373, 1028, -83, -578, 334, 233, 278, -130, -590, 631, 280, -582, 188, 87, 488]
2311D88k66j185J270L34r10M80p08Q03M28j497N82N06k63L27j018M37J167j156
2329a81o3K5K34P42j259k38J315l50j86l57k11J282o30p88O63Q3L14j69r05J154
2349D75J26r14L11k19N20Q1j226Q14N46o51M00q91O68R94j485j0O42k46M82j203
2369g86N01J165j055k06K58oR96r36q70J396k56k00q9o81J371k27j020P90j09
2388C6L20p0j179R93P21j194M23o21N86O54j222K38O68m38K39n06L6J302j072
2407h6p0K49k36P65p94m64J303m83l49J12m19R54k94q23P85J05j1k05p33J183
2427D89J03r98Q4K30M96J1j381J049P00r82K07m92M01R31j196k42R31l74L64q88
2447e57J40J332j024l75N72j97N01m68p86J306j63n63L24p40J044Oj087Q69j25
$$ y = [488, 222, -963, 307, 641, -269, 211, -497, 306, 734, -763, -181, 325, 62, 389, -629, -192, 975, -181, -244, -219, 15, 757, -502, -740, 575, 225, 39, -318, -529, 753, 123, -665, -2, 81, 395, 226, -679, 475, 601, -313, -2, -221, 299, 380, -846, -32, 514, -137, 263, -628, 40, 1034, -451, -461, 181, -65, 417, -786, -285, 880, -175, -381, -123, -129, 867, -69, -939, 457, 201, 1, -88, -769, 602, 375, -645, 145, 36, 356, 286, -893, 100, 821, -373, 50, -571, 15, 669, -553, -315, 353, -85, 154, -352, -316, 986, -86, -156, 93, -143, 622, -172, -636, 667, 184, -165, -53, -472, 482, 188, -635, 150, 255, 244, 39, -694, 489, 592, -406, -322, -92, 404, 415, -966, 83, 783, -199, 8, -484, -83, 848, -348, -590, 341, -33, 331, -557, -417, 915, -109, -484, 88, -109, 392, -76, -862, 444, 281, -282, 42, -698, 346, 352, -735, 134, 9]
2466IJ58L1q42R33L73j033J75N7J31O45j171J66R85p26O8k48J64J171j251m68
2486f73J029k98L30n84n68J357l33o01L46j55N50j93r92R62L7l29K59o42O25L82
2506E09j047L26N53l36K72q99N48P17q37mJ06n3P55j065j3J065n66J6m10K6J074
2527G37o49p35Q74j41J14j87p01J118j90o55L48k92R12q7j260Q07M03n86M73q52
2547e49N31Q26j082p1M12mL57q52J8R33p36J96j19J49P36j002l06R15l22J72l67
2568a65l37J089l01o73L63p5L74j36p00Q30J84p48K36j07L39L85j273O27L61j95
2588G8l2p48N63R63r83l52N26k1M98q98p0R88l65k41j55j28R12n12n93Q00j73
2609E7K1q3o08J022o0p96N83j82K15R3j069R22L72o42J88l58M12O78j241R8P91
$$ y = [9, 167, 198, -644, 289, 662, -371, -196, -139, -8, 637, -534, -368, 617, -109, -41, -289, -125, 1046, -205, -673, 356, 58, 388, -196, -764, 593, 260, -341, 5, -150, 400, 207, -785, 177, 214, -115, 144, -498, 127, 509, -538, -212, 341, 5, 277, -622, -74, 643, -194, -198, -92, -145, 610, -455, -468, 597, 31, 47, -363, -337, 737, 88, -647, 227, 86, 200, 13, -688, 430, 240, -415, -67, -359, 553, 466, -794, 13, 416, -170, 303, -549, -18, 808, -274, -345, 67, 63, 420, -432, -414, 519, -217, -21, -140, 9, 745, -257, -563, 352, 30, 202, -165, -502, 587, 286, -387, -24, -99, 275, 139, -561, 269, 453, -295, -59, -166, 173, 558, -715, -88, 273, 78, 46, -702, -139, 824, -159, -511, 15, -6, 492, -406, -476, 512, 147, -94, -249, -377, 535, 23, -570, 230, 57, 78, -5, -613, 409, 349, -447, 136, -46, 169, 262, -807, 115, 487, -155, 33, -325, 87, 765, -476, -378, 413]
2630D13n33M20o75OJ032o52l00L47j4L83n46m32Q88r4m80J53l70R63k62q79P67
2651A35K0j5o2p00P73K88o80L40p6Q9L66r40J75O70o23K72k47l4J055j003k73
2672d70O67l99N05l78m35J110m50l77J48j1L87k83n22Q08L3l78J18o39J039j34
2692C39p69L42K17N0N0p99M32P08p37L7K0JP27j032J73Q06m78L9m03p4J003p62
2714a10k35N91k97L18k29m80P18Jo10K86k7M75j57q70P73Q3k23Q3m19O28J06p89
2736c84K05L20r8K75q13L05Q70o78m7K3N7M69p54k46P27k05J53k70l92R02l27
2757I2o19N64j42K78p3o42P93R3n40K96l01K79K92q23N12J64m23N18o52J76P60
2778F02q45P0L45k56N06p79N7Q13o42K6K18n31P65k14n92P26j72J15l15m63R06
$$ y = [413, -120, 300, -375, -369, 663, 11, -289, 58, 44, 427, -119, -551, 337, 243, -237, -84, -454, 509, 247, -632, 135, 155, 140, 78, -622, 151, 439, -241, 99, 23, 112, 478, -462, -287, 383, -240, 32, -215, -249, 806, -197, -470, 197, -202, 303, -75, -510, 600, 150, -227, -79, -90, 297, 14, -508, 300, 333, -45, 73, -566, 473, 339, -430, -88, 129, 179, 229, -570, -138, 570, -167, -130, -110, -109, 618, -414, -241, 565, 87, 126, -277, -351, 652, -110, -345, 246, -51, 267, 38, -442, 276, 277, -333, -47, -74, 401, 244, -626, 147, 230, 7, 90, -329, 299, 405, -384, -179, 141, 43, 318, -495, -190, 680, 2, -45, -22, 35, 504, -250, -496, 231, 26, 179, -91, -483, 419, 92, -527, 37, -105, 173, 100, -542, 251, 344, -196, 100, -201, 78, 370, -453, 59, 223, -200, 318, -334, -158, 602, -243, -173, 172, -84, 422, -357, -300, 513, -129, -103, 115, -416, 349, 135, -457, 269, 97, 212, -103, -566, 340]
2799C40k92n93N74Q3OJ63p49N59J88l61L36m33K49L54p05K17K04k41L66m01j56
2820b92P11o61J79K18k76M95n35j56P14n18J39M2l17M47r5n74P44m46J74J44o12
2841d75P87L0o41M46l05J85J77p05N44M09o55K27j01k41Q04q44J01M68l65N31
2861C77n10l23R30n01NJ53l28M47k26n16P20l48O7K68n37O38k63m11O41k73j06
2882i6O17p62M29o4m31O40l80j11N37p68L38L44l91K89j45k29N48o61R5O07n55
2903a49M03k83m16Q08m47m6M69o16M98K6m40M97k34k26N46n54L20J19n36N52m24
2924a33k25O72o28J64L56n48O98k77l30O27n79n6M94m17L59j17l43N52l88p0L91
2945B02m42L00Ln18P49m83lM21n00L34jl57M87p1m46O51m84K9L21m67M66j41m23
$$ y = [340, 48, -545, 29, 112, 118, 281, -468, 91, 279, -82, 254, -179, 70, 424, -281, -64, 140, -101, 265, -136, -292, 419, -242, -63, 155, -121, 374, -161, -317, 397, -121, 18, 60, -257, 190, 95, -479, 265, -181, -7, 137, -475, 312, 342, -299, 147, -158, 27, 204, -501, 43, 452, -203, 24, -77, -318, 486, -358, -257, 211, -154, 377, -133, -456, 474, -27, -22, 131, -197, 250, 24, -492, 228, -120, -53, 215, -322, 316, 53, -358, 283, 10, -96, 521, -241, 188, 124, -307, 333, -47, -158, 379, -389, -51, 293, -98, 191, 46, -183, 365, -296, -201, 406, -149, 254, -29, -445, 363, -84, -130, 339, -277, 221, 247, -193, 304, 70, -156, 390, -164, 156, 275, -261, 291, -133, -358, 314, -314, -150, 206, -342, 356, 79, -251, 376, -203, -259, 235, -182, 177, 60, -283, 269, -119, -189, 202, -240, 60, 63, -455, 294, -189, -192, 229, -271, 63, 62, -295, 192, 121, -325, 326, -158, -129, 192, -275, 191, 50, -373]
2968c73Q54n29j05K28m19P17j83o56Q27l75q6L25n02M33J82p65N63l39R3M39n72
2989b43Q7L02l63M44l12j79Q42o99J00K07k53L11j63m28O36m43R5L71n67M38r8
3010H5n34Q77m20k54L65l67M67Q9p66N50J42m24N46q11L71M52p99N57k78K0P19
3031E87o94q3N58l29K07k53k18P10m73k77M38l68M55k05m52P11j5m55J52k66L20
3052E0J90p13O36j26l45N02l29L24L9n96L88j82K7L93n46K09L50n13K15o1m1N18
3074C89n31k48O40k06q6K6l87R57m30m78M11M2R0j02m97N53J25m50K10j27K63
3095A64K39p14N30j19k59L14l18O9Q03q60R5Q5j26M17m35k63Q63l28j07k69j66
3116c85R77n59n75N64L8N2k96k49P75p6o80M96j58L32j46o02N92K34l63O8k34
$$ y = [-373, 481, -48, -153, 75, -344, 373, 190, -466, 361, -14, -100, 225, -277, 156, 338, -427, 136, -203, -110, 329, -243, -156, 146, -217, 227, -85, -264, 578, -121, -21, 186, -67, 244, 81, -347, 289, -154, -59, 312, -255, 183, 85, -449, 428, 8, -246, 119, -248, 219, 308, -458, 92, 234, -190, 356, -455, -84, 368, -431, 126, -152, -132, 587, -107, -190, 368, 39, 246, -7, -225, 485, 12, -265, 173, -195, 260, 55, -397, 314, 299, -156, -4, -270, 50, 240, -473, 163, 37, -308, 194, -135, 189, 228, -368, 20, -162, -135, 258, -288, -79, 271, -242, -27, -88, -129, 389, -142, -390, 250, 44, -42, -16, -403, 554, 124, -354, 57, 99, 189, 87, -410, 143, 268, -182, 28, -99, 164, 403, -311, 219, 100, -159, 155, -163, -94, 709, -151, -56, 29, -97, 320, -115, -378, 485, 157, 50, -219, -385, 592, 33, -542, 22, 60, 112, -184, -433, 342, 266, -414, 82, -76, 256, 110, -492, 100, 334, -29, 39, -195]
3137a95R0N34o87Q4K17j75L74m27j25P42m26j66J26P7O51p62m62Q37j43l4k09
3158g9l88O60k3p52O33J04M6j85n05Q33J28r37M71j04J85K29q07O21L46p35M49
3179A90n68K20R41r61k27L89J2M12n35l39R86l21m50P6j47R07m72j003J142q3
3199A69r2k32l34R58k21p11P10%j36R2o08N88J20n32K57k14K54N35j014J97N09
3220B95k00J99n81j60J077m91m57K83p9O50o16n62J075k5p32OQ3Q26l76q87O19
3241e3N38l08k63m73R79J65j046L71J98K3L05r59K90P20n50J75j36j44P23o37
3261h2l27P03q2P8n65j65J141m20p83L95n3O24l78p49J035R8o45m8K6P69j35j294
3283h57R95J76j78J19p69N24M73q64K34J51m1N90q33k02R41l01j56l56J3R52l46
$$ y = [-195, -105, 429, -258, -174, 43, -132, 242, -185, -310, 432, 6, -160, -34, 43, 694, -68, -530, 307, 164, 130, -79, -467, 193, 170, -582, 51, 155, 201, 16, -489, 344, 472, -465, 6, -98, 87, 316, -491, 130, 476, -259, 190, -378, -158, 783, -178, -405, -16, -4, 408, -127, -466, 520, 199, -251, -175, -322, 585, 113, -890, 252, 169, 77, -155, -489, 469, 248, -463, 247, 247, 111, 203, -405, 183, 303, -229, 28, -186, 68, 603, -411, -214, 295, 95, 294, -287, -447, 630, 139, -318, -35, -114, 536, -80, -642, 433, 408, -324, -318, -235, 591, 215, -672, -53, 485, 177, -86, -559, 420, 585, -461, -90, 108, 131, 436, -523, -233, 487, -63, 112, -24, -168, 555, -82, -409, 294, 212, 290, -275, -440, 701, 281, -502, -107, -160, 464, 86, -663, 372, 470, -175, -223, -197, 572, 437, -857, 138, 314, 136, 255, -514, 10, 483, -381, -147, 4, -37, 553, -280, -482, 459, 158, 2, -354, -341, 611, 265]
3304B65p41L74L61L5m98n43J389j77r15K19J87M21l26q45R65L34n35q9j51N17
3324B47K51r64L11L77l9L2o73K88O21n88M1j7J69O02p70n26J150k27r6m91k02
3345e04J315n13r58O90K35J75o14n14R83K96j047R1J40O92q7q99N25M31m84j3
3365f0l91L23P81q55o5M12p5M36q47k51J199n37k72K1N2R13o49p56Q93R3j89l83
3387b07k84J154j93j153M60L41J72m23o92R80M98p87j7r7M42L12j059K32P43k34
3407A88j8o09J25R35n05n04L52o3Q17p33o11J139q2o09k9j25Q81l89j012Q68N76
3428E92l76l32o16J070L23j151K49L94J49k12j028Q22O24m41j43j16K57N49q41
3447b27p1N48j86K42o95o8J152n78n94K07L86M72o39p90J155K30o13j70k38J089
$$ y = [265, -476, -102, 259, 294, -204, -747, 642, 465, -450, -231, -44, 377, 51, -794, 171, 505, -30, -119, -270, 247, 498, -466, -155, 222, 183, 215, -458, -170, 451, -137, -96, -113, 56, 658, -112, -638, 512, 285, 189, -302, -504, 811, 298, -660, 30, 265, 440, -174, -688, 295, 591, -456, -365, -225, 467, 380, -519, 6, 437, -47, -60, -451, -128, 653, -202, -267, 145, 70, 506, -341, -592, 607, 70, -202, -181, -129, 784, 135, -621, 272, 365, 176, -207, -491, 663, 470, -683, -223, 118, 290, -133, -825, 155, 653, -134, -151, -248, 194, 506, -553, -321, 422, 188, 170, -439, -314, 621, 116, -388, -36, -99, 718, -15, -626, 513, 431, -178, -207, -332, 549, 160, -852, 16, 592, 216, -116, -732, 338, 661, -490, -241, 153, 302, 90, -938, -116, 508, 67, -76, -192, 65, 614, -227, -298, 250, 64, 306, -389, -457, 695, 117, -477, -270, 116, 588, -51, -841, 314, 544, -69, -239, -477, 612]
3467F12k28j083N72M12L8k69n69O82M32q77J03Q9K88L7n53j9O88k93j86l11K32
3488b03R80q89l13N29k4L91p50l29R72J01o47p7J55O42k80j195J062L84n41j17
3508a49k53P33L15j211K58O45q1r8q04O06P06o89l12Q4K21N55q91j84Q98ok24
3529A19m59J5Q60k30p76L01K16N62o19n20Q20J94p46rm6R41j74j139M69P06l55
3550A30k70k73M63N28q70oL96J14K17q48J24Q31m51j97r7J74O10n11o73Q28j5
3571B04N1m60k02R46mr67J95J92N93l68q07P86L09m45k23j57O16M46j227L63N76
3592D17k34j26l90K51P30p82k60L44J47L88q44j05R35k89j14m14K25P26m84o89
3612e68M61L34M9l70o79J009K71p89J16J91K74P8r22M10O19m40k25j19N15L50
$$ y = [612, 384, -699, -127, 285, 323, 54, -515, 167, 599, -278, -175, -86, 202, 239, -314, -333, 355, 62, -124, -435, -203, 777, -112, -425, 104, 80, 471, -279, -608, 364, 465, -182, -259, -104, 538, 258, -937, 125, 509, -32, -149, -402, 331, 646, -565, -307, 338, 257, 159, -645, -39, 667, -22, -334, -250, -29, 526, -365, -549, 349, 343, 119, -340, -325, 535, 305, -471, -170, 46, 608, -11, -531, 289, 483, -263, -272, -318, 623, 449, -690, -221, 485, 130, -140, -413, 50, 578, -292, -298, 98, 212, 429, -419, -295, 536, 85, -112, -209, -35, 575, 64, -609, 219, 204, 255, -205, -407, 539, 535, -432, -237, -45, 548, 180, -627, 159, 468, 23, -200, -357, 259, 705, -522, -159, 417, 183, 57, -333, -82, 648, -134, -394, -50, 97, 485, -359, -464, 471, 182, 68, -346, -121, 605, 121, -568, -107, 227, 276, -94, -773, 236, 507, -282, -166, 25, 299, 377, -545, -135, 484, 44, -181, -300, 215, 565]
3632E65q31j38N98l6K22p33Q2P93l69n03K95P8M06n74n16P54L92n29j99j75J014
3653E96j16r97L39M47l1k03o40P25M65p71k9P8M78K07j000L67N41l08l80NL23
3674I6M15o64o2J87J21K08n18j21Q39l62l61J54q1Q54o77o88Q38J83l78k27j36
3695c80O29R9p43K83K00J07j45o59N61O98p36Po0K90K64p95l9O28L7j25m39J29
3717a89O41n01m40N29m4N28n36m68Q41Kn21q8K87M08k76p78P13J36l18j3l69O51
3739A95J94n09j4K15M1J96p08Q6Q21m41m04N4L74M09n81l60N24K14j18m14j8P33
3761D89l32n43M93m9K58j32p10O24L01l51j65j44N39Q9q70M55L56l8k68l43J27
3782b14P96p01k14M08P3N2m00j66O11j04j33k29Q2O59k59p21M99N6K54l23m42
$$ y = [565, -266, -404, 194, 158, 380, -353, -271, 522, 153, -350, -55, 23, 429, -145, -661, 93, 485, -44, -243, -418, 596, 480, -517, -178, 269, 238, 35, -605, 120, 585, -186, -215, -137, 341, 548, -452, -85, 456, 148, -232, -227, 96, 511, -153, -215, -28, 93, 301, -217, -338, 501, 139, -222, -68, -149, 705, 28, -660, 178, 361, -17, -244, -380, 249, 348, -395, -112, 88, 195, 50, -609, -48, 650, -86, -79, -139, 151, 415, -380, -419, 209, 246, 121, -318, -189, 452, -49, -489, 40, -4, 524, -12, -480, 361, 363, -158, -246, 41, 449, 173, -605, 108, 244, -74, -87, -456, 195, 389, -120, -134, 81, 122, 318, -390, -304, 517, 76, -328, -274, 100, 509, -72, -432, 92, 306, 188, -226, -244, 489, 157, -386, 107, 58, 316, 184, -526, 98, 399, 48, -117, -261, 278, 367, -503, -48, 308, 270, 2, -341, -214, 582, -119, -333, 75, 148, 200, -200, -366, 245, 141, 8, -221, -139, 520, 261, -460, 39, 95, 349, 26, -416]
3803d16Q23j01n58J69p1M53J8r48N15M99j57l85k00K94N51o89j38N02J30r5n54
3824c58m5P79l34k86N8R1M67l63m63N34O2p4j31j54O46n6p41L52J39K06k42n38
3846d51O89M0n07J90q0M10N9r17N16K89k1l09rJ09M94m97l55M07J06R3m67n8O90
3869D21k37l13k1nN70l32n96O24K76k77l07k53P49Q7o52J72O2L79j10o60L86L62
3891C25l51P2j74N6O15r23J34M62j37l0k26j37Q28l78n54L93O1K56n43j66O39
3912B22n8m53J50l0N65k35n16M22R1J29k79m38N62J12m40J20J17J43L8n54J57
3933a75N93m05q5j02J7N18m73m17P79k0j78k29j22N98k08l31K15p1M11k71m11
3954c67N04L01m54j71k4N46O9p11J61M34k91j32j41K68N96n64k17Q1J07L91p14
$$ y = [-416, 407, 306, -252, -83, -154, 299, 317, -631, -116, 383, 226, -159, -359, -65, 486, -203, -341, 161, 291, 196, -358, -403, 376, 42, -244, -186, -95, 372, 9, -454, 80, 142, 68, -63, -217, 429, 373, -368, -16, 123, 329, 87, -451, 238, 278, -229, -39, -119, 291, 350, -567, -51, 238, 217, -92, -101, 8, 502, 5, -350, 57, 163, 256, -211, -269, 421, 184, -129, -150, -155, 415, 83, -513, 111, 387, 110, -197, -450, 299, 386, -266, -94, -32, 347, 237, -423, -37, 325, -26, 46, -128, -72, 543, -380, -246, 216, 79, 49, -177, -314, 514, 136, -418, -25, 36, 292, -251, -417, 222, 164, -289, -139, -169, 396, 161, -355, 67, 158, 287, 8, -430, 132, 244, -196, -76, 41, 184, 222, -332, -175, 418, 13, -72, -174, -157, 361, -112, -529, 250, 230, 52, -177, -299, 299, 91, -240, -25, -96, 315, 44, -367, 137, 438, -16, -187, -211, 335, 404, -307, -146, 288, -3, -135, -276, -8, 588, 24, -193, -112, -5, 386, -328]
3975c28r6P57k71r5k18J79M84l69l04L94JN6k79k67O78j21m67J70P2L26o8p72
3997e38N37K75k67j13j77L23M82p57M0L72R2k85l64K66N27l87k32J73J12K22k85
4018A6l97P08k53lk24j49Q00k54m53J87J28J51k48m30N14J86k23k71J60M37j51
4039B31o68K49N34k98j55j05K93L44o81N3O9L61%m72P0N96m56j10q9J44N51n06
4061d5m32O12q9N3k30j78P03j50n17Q4K78J18p1m88K77M55n13o0j66M33K62o20
4083b84J45L89o8l07r6N6N42l27l82M25o9L30n78j27Q02k70k27j30K6M11o1m63
4105b63M18o4m3l3m85O30J96p48K02K28O3l0l39oO74l51j52j6M5L87m75j79L45
4128DK21k88j29p5P89m64k94J09P9M79m17m09O45r1k61J97k61O01k40m53J82L09
$$ y = [-328, -424, 333, 62, -33, -251, -72, 412, 43, -261, 133, 134, 190, -89, -356, 322, 201, -266, -96, -24, 302, 234, -538, -1, 274, 7, -106, -283, 40, 522, -235, -195, 177, 269, -16, -380, -114, 413, 26, -206, -33, 79, 301, 16, -381, 327, 74, 71, -153, -302, 498, 244, -209, -22, 106, 257, 9, -421, 93, 279, 56, -215, -55, 382, 231, -437, -188, 346, 48, -107, -212, 81, 425, -256, -203, -134, 227, 227, -245, -175, 421, -35, -145, -234, -90, 461, -45, -477, 135, 46, 99, -131, -309, 394, 244, -273, -189, 89, 207, 136, -352, -75, 380, -133, -193, -359, 74, 336, -284, -139, 250, 182, -125, -221, -165, 377, 50, -332, 93, 24, 354, -224, -351, 451, 181, -46, -176, -150, 261, 200, -263, 155, 91, 48, 15, -470, 160, 356, -392, -190, 38, 101, 71, -268, -274, 400, 49, -103, -119, -74, 313, -162, -341, 4, 225, -63, -192, -267, 522, 58, -236, -127, -48, 431, 14, -395, 250, 159, -102, 95, -166, 435, 195, -258, -76, 233]
4150B33o2k5m72K95M65n55q4K41J68J18p05K53M65l24j0j36r4N45m09k12L64J88
4172B47k21k37m9O47j18n38K67j12N11k64m44M65J97l64n9j50L94kn14K29M0J64
4194H9p3k91J58M98l98l5M3m1L08n32P9N19j66l84j6J68M73m31l40L39J56K01
4216C24l71l35O21J0m91J48J12O2O5n56N20P6k03k00p3M15J80n32p9L83j16K47
4238B07n46K04P10o15j77L04j92L78l25m15O11mj10m3k98O09k23n43M07O4K03
4259B06j71m76P05q2l73O4k09N04n4n11K93L80j93m5k36J09N73p07p1L74j5J61
4281B26m71j23P59m64k60K88ML64m02k93M95J9j17j11j82M64O6n33K14N7J06k6
4303H0k51J50K95k64j55l3K45L06n63P7L36l26J13j84M8L97r4k23Q0J64R1l00
$$ y = [233, 171, 146, -326, -31, 434, -121, -205, 36, 204, 322, -383, -130, 335, 11, 1, -135, -229, 316, -93, -305, 59, 247, 26, -211, -260, 387, 269, -269, -2, -114, 397, 133, -311, 154, 351, -13, -72, -222, 172, 170, -344, -115, -75, 89, 16, -275, -117, 381, -17, -52, -9, -50, 258, -274, -195, 324, 158, -226, -242, -74, 399, -32, -372, -33, 123, 324, -47, -382, 239, 249, -242, -94, 18, 80, 145, -411, 109, 185, -18, -218, -291, 124, 304, -228, -307, 76, -40, 207, -339, -135, 575, -40, -217, 87, -105, 273, -52, -467, 144, 140, 30, -13, -311, 298, 75, -468, -61, 3, 206, 35, -441, 264, 182, -191, -127, -336, 168, 114, -397, -104, 276, 83, 38, -198, -89, 484, -223, -294, 80, 65, 226, -245, -368, 391, -73, -333, -45, -41, 323, -79, -372, 123, 142, 25, -86, -268, 196, 262, -271, -57, 0, 106, 80, -171, -21, 274, 10, -145, -178, 67, 373, -190, -113, 223, -103, 10, -174, -126, 271, 177, -46, 34, 198, 289, -11]
4325a1k20M10j5l90J4OM25P6o79L89J93j51J23m83M28J62n15J81J59N1L2m47K62
4348@K89l72O4j28O8L67m45l5K52l3M2k27j5M35k37q6J9j22L95k07l99M68L3k04
4372g8M9q6L28K4l84K18J83j6p8l87J67L66o26J19K66Q8J92o35Q5L52k26O1j01
4395a19j37N93k22l73M46k66K25j11l10O48k68m05K66j22L28j02m19M01J94l13
4415f6K8q9J45L42n71Q5J56n3J9l54K38M14m22J28N1M5J79m75k00O66j64J0k89
4438a77O1L97l35j05J33QK09j23m03N52N6o00K99q6J82J98o18M17K31l14Jj96
4460b13Q8M61m25K0K24j30r1j12l7L80j90K0j15N6J72j30j24K88o3r1P8k76M09
4483A99J32n27L21p4L3P6l91K71K13m34J51k30J76M11m09J4K39j67N8k40K25K69
$$ y = [-11, -231, 179, 164, -226, -212, -206, 219, 295, -384, 5, 198, 47, 170, -313, 115, 277, -238, -57, 102, 153, 185, -262, 0, 289, -83, -19, -147, -79, 288, -157, -192, 60, 27, 69, -158, -173, 262, 25, -61, -42, -164, 231, 24, -375, 93, 126, -78, -29, -115, 213, 237, -147, 71, 254, 238, 160, -227, -60, 306, -320, -201, 65, 153, 345, -290, -205, 147, -79, -18, -119, -256, 337, 115, -258, 188, -78, 147, 36, -274, 374, 106, -299, -33, -155, 173, 71, -348, 53, 247, -66, -38, -127, 18, 360, -211, -126, 30, -23, -4, -358, -120, 294, -128, 0, 51, 96, 275, -200, -400, 266, 102, 112, -177, -116, 281, -54, -159, -26, -18, 191, 68, -335, 217, 273, -327, -28, -114, 68, 266, -352, 65, 296, -18, -17, -213, -125, 336, -89, -69, 155, 25, -66, -178, -215, 165, -25, -5, -120, -64, 108, -22, -146, 142, 79, -12, 66, -210, 199, 331, -196, 125, 51, 84, 160, -231, 40, 253, -181, -30, -260, -84, 327, -82, -68, 171, 4, 62, -178, 47, 316]
4505C16l95j2L73k49J54m24M7L96l01R4j52M9L68k15k94L26R7j69j4j84L39j63
4527a3q8K78J84r2j52l48L68Q0j49M4j68R8L26m81J9M48l88J30k34O4L76l88k8
4550a14K13j47L33j82l93M90j56k48K12O4J53k82k56L51N6k01J49k91K92R7k68
4571a28J55R0j34K66m54J97K69l33M3o4K09K33l86l08M64q0j1j39m0L27k32l3
4593h9K22p4M4J12m85L54J02j81J19j01K4l9k08J25J58j8J28m30K40K95n24N1
4615a75K97j94K02j12k22M30q6k82K03l2L00l32j92K25N6n8J7l48M45j54j85L01
4637A04J0r2Rk47M14J21l31j1j29K04J34m42J26K44m6K7j38L9L39j62k33RN7J89
4661A95l07m7L81l11K05k12K0K65p2k56K60r8M8P6l29J80J88k11n3L1J53Nk54
$$ y = [316, -79, -91, 282, 33, 187, -237, -190, 206, -95, -1, -153, -104, 264, 49, -245, 81, 178, 9, -5, -189, 150, -13, -101, 177, 361, 269, 117, -231, 137, 217, 68, 112, -56, 42, 368, -113, -94, 354, -34, 96, -138, -74, 302, -86, -114, 99, -48, 285, 103, -290, 200, 44, -204, 8, 72, 225, -57, -313, 38, 94, -107, 42, -249, 43, 140, -128, 27, 117, -17, 249, -205, -8, 261, -72, -29, -93, 116, 349, -37, -345, 119, 39, 28, -111, -151, 176, -56, -89, 133, 59, 103, 215, -270, 84, 186, 5, 124, 23, 47, 8, -200, -75, 83, 65, 193, -237, 3, 298, -226, -175, 122, -72, 130, 18, -204, 226, 140, -142, 61, 29, 329, -3, -195, 30, 86, 28, 45, -303, 142, -12, -197, 104, 114, 22, 31, -216, 198, 319, -12, -23, -152, 52, 186, -256, -130, 114, 68, 95, -43, -4, 335, 173, -60, -51, 6, 195, -112, -159, 222, -89, 116, -96, -76, 189, 117, -139, 121, 23, 71, 147, -182, -2, 186, -25, -78, -47, 106, 111, -143]
4684a43M0K58k20N6L0P4J47l63M8L09j90O0K7k98L42q5k15Q4r8M70m20j71M23
4707A65j73O8j8k50K74K7m18K79Q6P2q2l51M76P2k27N9j33LK53j99j95K48lP1
4731A04Rj69K72k47j93L08r9J57j04J5J94j10l63J97N7N8J07m84M40j26r0P5j5
4754gk1K39l49K7R8q3K85m02J18J97k78K66k86K25J67l63lJ82j03N9o8k8L90l66
4778a04QK53j50K52j25k11K29j50n4o5r0L37K1k97L05j2j17J2j58K23j02j41J23
4801a3N0M0J29k31j73L54j50l4j29J5K64j08k64P0J63J51j11j88L58k32j47J78
4823hn4J80j61m6L99k44J7j30J1J62r6l58L41J69k33L5j27J74R5j69k30J48J1
4846a14K53k95N2K36q8j91J68k06M02k06j92K53k2R0o5m9J00Mn47J83K13J7N1
$$ y = [-143, -103, 155, -65, -9, 21, 95, 242, -121, -73, 236, 46, 106, 133, -165, 177, 92, -123, -39, -137, 333, -87, -258, 165, -8, 60, 42, -208, 66, 93, -325, -46, 40, 112, 30, -321, 155, 227, 0, 59, -74, -71, 182, -17, -212, 36, 33, 104, 113, -56, 216, -31, -224, 84, -15, 142, 38, 53, 247, 137, -226, -29, 28, 86, 193, -291, 149, 23, -67, 8, -7, -28, 211, -138, -111, -13, -96, 189, -213, -95, 102, -176, 90, -196, 29, 196, -167, -170, 12, -91, -32, -100, -128, 262, -104, -96, 157, 7, 259, 134, -77, 152, 2, -52, -117, -207, 130, 151, -146, 159, 147, 30, 42, -116, 107, 5, -136, -13, 37, 77, 206, -25, -198, 156, 6, -28, -157, -142, 122, 14, -250, -180, -17, 134, 23, -165, 193, -39, -186, -8, -62, 118, -43, -89, 310, 66, 83, -47, -36, 126, 30, -328, 13, 182, -51, -16, -143, 31, 126, -43, -273, -125, -114, 139, -156, -104, 132, 44, -147, 21, -185, 217, 11, -181, 72, 50, 140, 75, 26, 126, 130, -417, -234, -21, -4, 47]
4869D7k85L44l0j47K48k59J64R7k17Ql8N7O9j15p6L17k6k38o5O8K08k07j06L03
4893A21j93q3O0n8K29q4k19L35l5j16k4r9J10K62k32O4k47K62L5k99J48R3l0j15
4917a15J14l7J89k42j12L30j4r9j11r5L87j99q8R5M7J90k05l71L26N3p0L0J5J52
4941A70Q1n51L07M9n0k6k28K56J75j62k3J12r0K93l63J9P5Q1j23j55J6N36l10
4964H9k97K84Ok1q6j99M06j61O1k93R0J57ml03L32R6l47Q9M1Q7j6Pn8K31j37R0
4990A44k65J70J22k52J48k0M3K20m19J43N7p9Kk40K27J54j54q2J2p0K07N9l42
5013b15J92L58m75J47r4J71j2k85J98J89j68P5l36L03pp0l2J57RJ54k44r5J84
5036A04k63K35o1j91K38n3k79L82p3j0J47m92L73J35l18K14j7P4m0k60K91J44
$$ y = [47, -238, 106, 76, -71, 177, -82, 82, 179, -38, -30, -68, -11, 58, -57, -133, 184, 158, -80, -145, -77, 131, -76, -182, 121, -72, -155, -95, -153, 76, -8, -227, 108, 73, -43, -67, -166, -56, 206, -26, 38, -209, 53, 88, -211, -63, 30, 0, -115, -1, -38, 151, -91, -203, 127, 113, 14, -97, -192, 195, -4, -92, 3, 50, 240, 35, -336, -10, 43, -27, 3, 18, 170, 251, -300, 7, 56, 6, -20, -248, 8, 183, 21, -2, 110, 20, 313, -50, -31, 44, 125, 2, -153, -137, 399, 89, -208, 76, 82, 61, -25, -224, 182, 21, 82, -211, -121, 36, 32, -271, 61, 157, -190, -101, -60, 27, 11, 18, -40, 191, 54, 144, -121, 49, 171, -81, 67, 47, 90, 310, -109, 34, 91, 12, 14, -226, 1, 155, 1, -81, -69, -139, 68, 127, -215, -23, 335, -140, 7, -87, 84, 72, -213, -15, 174, 6, 81, -255, 48, 41, -29, -61, 96, 105, 259, 15, -80, 104, -159, 76, 15, -176, 62, 9, -270, 112, 39, 29, 176, -316, 57, 192, -126, 88, 71, 145, 105, -155, 136, 280]
5058B80k75p9J30j39J92k29RO5k7J99k81R1J32p6L6j5j30K77j96k54N17k21O8
5081G4o4k35L49j08k52K59J69k90P2k63M00J3j95R6L0J27j78k26J79J05k14K01
5103D9j60J50J29l35K22k03J85J5j29j49L62j51j56L17k87J76J1j79L36j54l7
5124A2l4k63M11Qm49K57L4J49j08k23K10K03m67K18L2m8J55l39J99J84K6j74p4
5147h1j20M66l41oJ83j31M6n4r3K83j66j64J58j92N10k22k73K22lj01L9QK21j72
5171A7p3k0K3J88j40k08K51J7n6j13j1kK19k22J44J22j84K14j91M6mlp3j91R9
5196a51K54j08k4J86Q0k64K8N4J68k8m77L16q4L4J40l00K01J71k63K22j15n1K96
5219B85l34K1J79j99j83J16j7J98J02j91Q8j08J75j60j75J64PK1J49n4q6L8j63
$$ y = [280, 5, -74, 56, -83, 109, -120, -111, -46, -73, 126, -155, -64, 68, -8, 28, 13, -117, 160, -36, -290, 227, 6, 74, 10, -225, 124, 16, -236, 23, 192, -98, -26, -289, 111, 124, -71, 25, 55, 182, 4, -222, -43, 62, -152, 49, -111, 39, 168, -167, 55, -148, 37, 52, -77, -226, 136, -15, -171, 146, -141, 35, 46, -133, 203, 49, 12, -22, -285, 126, 134, -315, -58, -24, 125, 17, -206, 4, 207, -260, -42, -10, -58, 97, -242, -43, 141, 167, -7, -81, -201, 265, -76, -82, 101, -30, 16, -38, -131, 152, -14, -178, -20, -212, 298, 76, -197, 25, 22, -79, -40, -32, 189, 17, -56, -76, -53, 135, -5, -213, 38, 55, -1, -114, -125, -127, 92, -130, 14, 136, -48, 166, -25, 21, 17, 14, -59, -250, -151, 103, -5, -29, 157, 237, -27, 1, 55, 223, 195, -282, 34, -50, -16, 124, -176, 25, 196, -67, 155, 40, -11, 285, -49, -28, 151, -48, -231, -115, -132, 66, 168, -23, 65, -43, 132, -28, -203, -39, -32, -11, 138, 84, -2, 36, -127]
5242a27N4K05k69J48j01J16J33m08L83r9q4L0j09K01J90l59j16Q5R8L09k73J1
5264A8j6j68K57k37j2L29k13k03K17j17J51j5J16l4P2p4p8N8MP4k97K77P1k59
5288g9J75k23J37ko9kM0j85L63k56j42N22l73J49N2j35P5r1r1L03j4k44n4J28
5312a6K37k08j28J89m8k4J6k81L18L5k09K52j36J13j02o7j74L87r8j84j08J59
5334g7K16l97K02J27j45K44j71l9K00o9k61J94r3J82o3o6J4J05p0k0k14L58j85
5357b8j45L31j11m0L7j70J0J89Ln0n6NL10l81l3J88k53J68j04J94J16l20Q0K01
5381A41k25j5J64j10R6k07J60n4n0L25r6k04K26j59JP2j78K20J52m41K16n9J14
5404H9Kk91Q6K07k56O7R5L7J82m65J07L32k41J23o7j99L02j04j14K13k63K30j16
$$ y = [-127, -73, 132, -137, 11, -90, 26, 159, -249, 134, 35, -49, -19, -128, 73, 263, -96, -212, -127, -29, 280, 7, 18, 2, -166, 91, -146, -158, 171, -42, -245, -28, -145, 6, -9, 107, 73, 145, 71, -7, 51, 55, 129, -168, 109, 180, -79, 96, -127, 10, 8, -61, -63, -23, -208, 155, -101, -243, 279, -94, 55, 107, -28, 47, -44, -135, 168, 154, -90, -144, -16, 221, 13, -115, 74, 26, 2, 18, -263, 55, 90, -119, 133, -3, 110, 8, -59, -233, 154, 56, -128, -236, -77, 139, -258, -56, 71, -74, 170, -1, -40, 160, 91, -170, 24, -69, 113, 50, -16, -2, 103, 33, 13, -201, 157, -28, -173, 158, 47, 7, 44, -126, -116, 73, 76, 26, -30, -25, 285, -96, -129, 59, -194, -26, -130, 64, 180, -140, -60, 141, -84, -99, 65, -45, 51, -156, 4, -50, -100, 225, 129, -75, 151, -8, -7, 65, -113, 107, 259, -182, 34, -25, 89, 91, -200, -114, 93, -163, -96, -1, 36, 218, -247, -140, 192, -49, 74, 7, -192, 110, 6, -108, 105, -158, 72, -44]
5427d4j83L81k8j72O9n2PJ31k66J92O0r6K13m30K07K80k93r9J36j63K72k68K66
5450A20j0l30K29q5J5J34r8o7K91k31P5j01O4M6R0j84K12j84R6n6k1q3J7K9J1
5475b1L8R7J7j38p8J86j63J25j57O6J07j17%J36j24J61Kl08M83m20j3K13l08L73
5499A57N7k85K4J13j08N3L6o6J72k04J45m0j04M7j43J88J77l14J90p4QM5j84J1
5523i9K27l34J59m9m1N06n63Q0J83j22J79j73j07O9R2J80j21n5R8J5k86K94j28
5546DJ25j71n6J84k3j48J17k0p0K56k89J48K00k97J15k9j42J74l3n7J60j06pn4
5570a9O0P1j48NjJ94j22k6j69J79L2o4O2n1J06o7l00L89m5N4o6k68M33k54r1J65
5596E9j90J66J25j30m8K21l23L21r8j43L27m42p3K95n9l5L3j72M25l52j20K82
$$ y = [-44, -227, 154, 126, -46, 23, -29, -22, 109, -157, 35, 95, -1, 212, -218, -11, 269, -24, -123, 13, -150, 122, -146, 120, 110, -220, 9, -76, -61, 73, -25, -92, 199, -32, 43, -58, 6, 52, 142, -42, 170, -14, 82, 26, 5, -78, -61, -32, -21, 17, 114, 131, -7, -85, 101, -62, 63, -94, -28, 79, -38, -38, 98, -26, 135, 137, -171, 312, -108, -121, 92, -216, 157, 214, -71, -47, 66, -42, 11, 47, -19, 153, -51, 94, 54, -50, -3, -146, 42, 219, -95, 95, 21, 29, 74, -110, -99, 128, -206, -47, -96, -137, 369, -194, -114, 69, -53, 126, -47, -154, -85, 7, 187, 66, 11, 109, 124, -162, 132, 4, 129, -42, -98, 86, 63, -85, 32, 12, -58, 198, -91, 57, 257, -40, 75, 46, -96, 78, 45, -12, 148, 42, 35, -19, 41, 112, -36, -31, -32, 162, 40, 14, -155, 24, 56, -8, 54, 3, 109, 42, -258, 131, 86, 140, 74, -194, 239, -15, -106, 59, -131, 35, 160, 30, -18, 203, -120, 201, 103, -40, 287, -155, -228, 67, 8, -27, 6, -166, 259, -93, -213, 69]
5618F9j39K57l24j20L55m3j43J89n8JJ4j73K53k29L1J05k33K69j19l7L3N8q2j34
5642b00J20m1K28k41N5M9j07L06k92O2K18j55k6N6p4J54j63n3L18r1k07J01k30
5665b13K29j15l6P4J24P0M3j36j54O3l2J99j87r3L93k55m7R8j12J57p8j56L75
5688B11j64j25P1r3J67j12M2J13j31N1n0q2J02R6l09L29k33J28J00j52J63M4k30
5711f4J15j20K6K84l39K2K96l17J65j01j32K29j01k3K5k1J82j56j02K39k54J41
5733fQ1k15K41j90n9L3J6oR0j75J19J18j52J61l0r7K66m24R9L81l65J97M5k19
5757i1L04j91L9k10J26J26k38K2K34j65j25M0J06J43n0k15J81J0k2J21k06n6J57
5780D0j71K92j20j64J40m7n8J67k94%J90n3K40j57n5Jo5J68K3k21M70l46O4M5
$$ y = [69, -70, 187, -137, -257, 98, 55, -88, 101, 43, 44, 58, -115, 138, -91, -60, 45, -188, 81, -38, -75, -42, 16, -66, -200, -80, -121, 107, -134, -79, -30, -137, 169, -123, -61, 157, 2, -24, 32, -42, 112, -51, -104, 214, 123, -84, 17, -213, 16, -99, -135, -61, 63, 133, 176, 40, -114, -51, -83, 116, -71, -164, 229, -26, -73, 25, -87, 70, -8, -164, 211, 47, -78, -7, -100, 67, -45, -3, 110, -21, 30, -20, -102, 0, 96, -213, 116, -117, 11, 111, -41, 122, 166, -64, 51, -69, -43, 241, -98, -76, 220, -97, 68, -33, -165, 64, -37, -60, -35, -56, 126, -30, -132, 107, -147, -6, 75, -140, 101, -89, -148, -115, -99, -105, -15, -190, -71, 47, -105, 56, 26, -71, 195, -229, -130, 251, -114, 83, 128, -91, 213, 22, 61, -149, -23, 103, -135, -113, 121, -44, -169, -129, -23, 120, 70, -145, 36, 46, 24, 145, -61, -117, 40, -131, 161, 41, -123, 17, -30, -88, 79, -215, -215, -25, -78, 162, 5, -50, -49, -114, 54, 77, -144, 326, -20, 44, 89]
5804H9p3P9k56K75nj52K3P7j01R7p4q9J85j88j63K38r3J71rj42J72o5J28j5j32
5829b3N1l8k38J73J41j1J56l16Q3J17k42J68j68K12N6j37J2P2r4O3J08k67P8J59
5853A15k16O1L6OJ89l60K11j66L6K35k17P4R4j04k1M8J67K4k27r0K03j71J10O
5877D3nn4j48J44R3k12M8J20j27J44j03o8J59j17J90nm16M09r3k4M4j09K90j15
5901H8k59M8K20k37J98j78l3M27m79J02J92j02o3J26j97K27k15%K57k71K44k12
5923a17L7M9j50K40N3k78J83K6j06J20m7J7J75l83L50P1k37J40j07j09K62m31
5945b42K39K03k29K01k89J20K23k87O0J59j65O3j08r9J81j1N1J31k11r9K22j35
5967b2J57j37K15j23j74J17k1n3J0R4K8Q0m43M17j15j08M8KL6K67l17j5J67j97
$$ y = [89, 16, 95, -161, 114, 109, -43, -20, 57, -44, 53, -21, -110, 75, -113, -276, -38, -131, 40, 31, -111, 61, -4, 124, 109, -23, 28, -10, -248, -75, 66, 55, 211, -105, -22, 95, -147, 21, -147, 65, 121, -16, -4, 68, -26, 37, 145, -122, -44, 115, -101, -40, -4, 2, 191, -169, 42, -124, -88, 147, -70, 4, 98, -6, -27, 21, 188, 212, -15, -105, 98, -73, 37, 43, 38, -16, -164, -20, 73, -139, -91, 29, -98, 46, -57, -125, 34, -83, 107, 102, -314, 95, 2, -22, 22, -87, 203, 88, -171, -123, 97, -140, 58, -120, -153, 274, -205, -103, 89, -13, -76, 50, -147, 80, -135, -135, 122, -149, 95, -117, -80, -31, -181, 59, 112, -166, 17, 43, -63, 57, 10, 27, 202, -181, 169, 240, 3, 143, 36, -73, 189, -242, -3, 200, -29, 172, -117, 3, 226, -61, -1, 158, -7, 56, -52, -151, 30, 19, 70, 201, -10, -109, 113, -22, 135, -2, 213, 90, -84, 33, 12, -41, -31, 63, 91, 171, -272, 145, 30, -78, -30, -28, 8, 275, -42, -57, 110, -87]
5991h7K63l32j08L87j78J1L6N7Kj1k46K57m6J28m9j76J02J40k85K82j81J54m2
6014G8l14J91R9r1K73j27p4J69k37M4Q4p2j82J18kK2Lr1l5K7J66j20k0M1M9j5
6040a6J24k64P4Q6k6l5Q8j12L32l38M1J80k36O7J71k30K91j2k07L1%n9J17l6N3
6065H4j31q5J61qj53J28O7J31j62k62K93J1N5r2j20J98j7j68Q8j11K56k04o2J19
6089A6l9P3o0j70K35J44l90J42J08j45P3l8Q5J9k03J98K3j13J98j20k94K73J24
6112A39Jp1o5L7j87K3K11k13K99k03J9k5l4R8MJ3m1M7j19K38j58j30K08k10RK23
6138A13k06R6M5j17J78j04j99K98j22j73J98O6o2L7k5M5r7O1j15K9M9M6j76J96
6162F1j24J52r0no8J54p5L5k4p8K13k33J03Pj55J67o9P1J93j63j31R3j52K02l3
$$ y = [-87, 176, -156, -264, 123, -55, -44, -8, 49, 51, 40, -206, 51, 5, 133, 84, -92, 10, 150, -135, 147, -34, 120, 78, -236, -45, 54, -37, 236, 109, 35, 204, -33, 11, 95, 23, -159, -41, -43, -21, -18, -109, -144, -117, 49, -71, -91, -50, -1, -16, 108, -156, -82, 4, -22, -57, 31, -81, 251, -87, -46, 134, -102, -35, 136, -94, 197, 185, -22, 9, 9, -50, 67, 31, 84, -47, -132, 29, 21, -132, -4, 63, 194, 32, -230, 63, 74, 129, 37, -83, 115, 98, -70, 18, -93, 163, -41, -103, 16, -23, 50, -10, -180, 55, 199, -191, -49, 59, -86, -13, -51, 34, 53, -150, 48, 71, -42, 156, 36, -258, 15, 139, 140, 69, 4, 41, -146, -123, 88, -125, 174, -29, -10, -35, -69, 29, 33, 46, 5, 52, -67, 171, 13, -117, 91, -119, -110, 113, -93, 3, 48, -69, 109, 5, -194, 104, -18, -191, 7, 73, 11, 48, 23, 68, -29, 32, -83, -54, -5, 41, -135, 61, -63, 89, -1, -6, -74, 80, 5, 40, 16, -62, 151, -82, 21, 28, -127, 40, -29, 42, 235, 72, -59, 34, -118, 84, 51]
6187E1k60K85j49J77j24M3n2N4j94L01k41P9L19l79J83o8L5M2k20J14L4M5l6j6
6211B3n5O4j73OJ07J46q0r0j2j5J00P3Mj03j00N3J7L7J15j66K96k17q9K7l6P5
6237GJ50j82Q2j84J80Om9l8J06k77J62mRJ58k84J48M4j93J08J57j13R2j60P6J45
6262A46r3k9O5j83J69Pj55J89r3K38k07p9r4n7J39J91j38k3K2k33L24j39P2q6
6286d7Q3j44J44j97L17o4L9j15j11Q2K13k42K23k63PR8J1J7L0q0jJ40k09K00k69
6311a38J15J21j79J05M2k85K14K6km0j33R0K37k51j22L08K6Kk59J31J19j29p1
6334g3J48Qr0l1PR1j14L7Jk7K52k05j23K28j16q8J15j70K41M5j07M9j15P4J37
6359A74j40m8R8j43J15j45Q9l9j08p3L11j53P1%n8K40l47J42J4J1J77j46j26J31
$$ y = [51, -209, 76, -73, 104, -20, 23, -29, 25, -169, 132, -109, -30, 289, -90, 93, 25, 60, 102, -118, -4, 30, 75, 39, 23, -32, 32, -141, -135, -28, 118, 38, -52, -64, -79, 21, 94, 98, -5, -105, -52, -35, 2, 117, -49, 247, 30, -59, -32, -68, 7, 157, -25, 57, -127, 53, 59, 10, -28, 78, -199, -37, -41, -32, 126, -158, -10, 34, -159, -51, 106, -7, 85, -75, 1, 146, 53, 24, 89, -94, 75, 82, -73, 116, 23, 261, 54, -25, -119, -176, -37, 154, 16, -7, 15, -218, 106, -33, 39, -47, 36, -108, 36, -161, 156, 92, 131, 16, -95, -13, 200, -42, 181, -82, -75, 23, 34, 51, 81, 1, 0, 140, -69, 131, -138, -23, 98, -81, 24, 66, -219, -5, 21, 19, -21, -154, -64, 173, -78, -200, 108, 134, 136, -123, 8, 127, -2, -73, 75, 83, -7, -38, -31, 60, -54, -17, -16, -43, 209, 4, -119, 109, -7, -95, 20, -150, 91, 136, 29, 78, -37, 37, 174, 34, -14, 84, -59, 56, -89, 0, -39, -147, -220, 91, -62, 9, 9, -49, 191, -156, -14, 0, 11, 188, 42, -84, 47]
6383D7K9k09J01k37K28J28j23J52j4r5J29k47JJ63m9nJ0j73K85j88K1J76j13K5
6407D2k30OL70l09o2L98j78M6n4L1n5n2Q2j17N3P3J17j74L4j07o5K73j07OJ30
6432A51k23Q5J1J24r2J8m2r1M3J02j26L8P4j35J10M2n4J7o5J4J66j84PN8O0N6
6458A64k16j48M84k01j69N8j54J51j4j5J30k7k17L01j24q0L36l01Q6k0l0lK0o5
6482e4Q1J%j32o0K38j28l2P3R5n5Oq0J06k78O2N4R1M3Q1l30L87j32Qr9n8J48J56
6510A92p0q7j31k0J36p9J55l5j12p0J05k4K61j32j49J98j87m5J7j64M02j12j04
6533e5M2r2J67q8r1K9K18j70J01K0lJ05j97L3m2r3K44k03pJ69j58k6QJ89o8k7
6559Ek9R9j18j19R9MJ09j30j11K04j63J74j60J49M3j52l0J07P2j99K19j59J43
$$ y = [47, 76, -133, -32, -269, -41, 87, -36, 116, 102, 7, 136, -111, -110, 53, 4, -1, 9, -164, 121, -67, -46, 130, 17, 42, -188, -182, 188, -121, -183, 215, 37, 83, 29, 60, 5, -47, 35, -82, -29, 44, 161, -13, 21, -86, -151, 122, 15, 21, 151, -72, 13, 24, 148, 56, 74, 32, -59, -16, 86, -40, -2, 72, -63, 47, 89, 35, 52, -13, 1, 167, -17, -10, 48, 108, 164, -52, -200, 284, 83, -86, -28, -182, -31, -45, -60, 70, 43, -174, 127, 3, -77, 259, -42, 44, 24, -6, -9, 11, -54, 27, 28, 28, -104, -164, 74, -54, -86, -13, 82, 27, 33, -47, 59, -219, -157, -103, -12, 31, 112, -218, 169, 37, 45, -54, -112, 36, 192, 122, 35, -96, -116, 20, -59, 96, 61, -51, -121, -16, -40, 221, 89, -60, 138, -49, -94, -77, -241, 161, 49, -55, -13, -105, 62, -26, -117, -88, 130, -40, 61, 81, 78, 183, -14, 19, -23, -116, 128, -75, -82, 87, -71, -97, -89, 100, 32, 5, -24, 75, -43, -162, -63, -59, 50, -80, -191, 13, -150, 24, -136, 13, 56, -96, -126, -19, 53, -146, 73, -86, 57]
6582E7m7k3O7m7J5N1k2j11J34k20K31k14O4L07k01p3J35r5O2m1j60K24p3J06m
6607A22j36Q1O2j36K27k66K1J21j70Q7l1N6J80j85j01J10j24J4J63j35J08k05
6629a37N4L09l02N4R2m2l3j40QK32l8K2J0j9J9j19K8O8k01N0jr2K34nq2K6O2R1
6657A48k40L5j7J39j08j16J79n9K26k47J97k9k05O2j86K66j00r4J79j99j1K90
6679A10k20n2K17On2j73L45k41J21j42m9J41l1J72j65K15j52j40J24M4p6r3M3
6702d8j9L9p1J69K0p1m2q6K2J74k08J75j46j10K10l7l1J20j91J82n0j3K03k28
6726c7N0j49M4J57o4r2J89Q5j64J4q6P7P7k03J06M4j32J19n9P1P8j89k7N7M1m6
6752c9r0J07O4m0q1J15j0J94q3k35o5K17p0J29k16J56r4R3k8k08K44n0p6J80N
$$ y = [57, 10, -13, 54, 7, 22, 73, 51, -60, 74, -146, 85, -129, -65, 242, 41, -32, 103, 8, 70, 29, -131, 93, 20, 126, 122, -14, 67, 129, -7, 220, -46, -25, 96, -74, 13, -18, 38, 218, 33, -68, 42, -82, -68, 95, -40, 68, -137, -83, 226, -76, -22, 70, 28, -5, -145, -137, 95, 57, 79, 89, 70, 89, -30, -2, 66, -135, -85, -86, -178, 56, 51, -31, -5, 57, 148, -92, -57, -74, 65, -43, -159, 20, -39, 187, -60, 137, 108, -97, -35, -221, 45, -55, -149, 30, -169, -180, 110, -110, -162, 55, 61, 9, -164, 181, -60, 61, -81, -130, 11, -20, 152, -13, 202, 50, -90, 34, 78, 2, -91, -48, -67, -28, -99, 70, 90, 19, -23, -109, -87, 87, -121, 54, -92, -202, 8, -29, -60, 60, -131, 51, 1, -12, 191, -37, 13, -136, -92, 65, 1, -91, 98, 183, 19, 33, -53, 24, 101, -102, 4, 48, -84, 35, -24, 47, 125, -64, -91, -34, 7, -39, -129, -22, 42, 2, -79, 36, 26, 220, 137, -98, -163, 54, -16, 113, -103, 53, -41, 52, 24, -184, 60, 10, -66, 114, 119]
6777A19j74j8O6L2J16j45o1J56p7J29p6l17J79n0J30oK5J27j72l6O6j55P4o2J52
6802B2j47J22M3o3L8m6J8j0J1n6l3J38q0O1N8j70Lj76J51J01K7L8n5R1J4j41q7
6829a28J58J47j97R5j93J86j77L8J38K3j79M7O1j33K27k04K20L1k30K59j72p5
6851e8On9J73J6k01J49kO3R7j58J03j14q8J20j23J91l6j15m3J29lO0j93R3n0j4
6877e7j2oj37J46R9k7rkKn0j33J3Q6L5J87j70P3P6j91p5K16l9r0m8K03L4j11j8
6905eO8k1L3j66L5P8k2J66n6l18L05M7l17L98j84m4n9M8P3l6j25K07o9P0qr8p1
6932g1J22j52R8j6OL5j29M1K28j66j0n3j22L79j51Q2j43P5%j40L5K13k95j10K16
6957b8lR8p1J4K6j06K4m1j41J53kJ27k37J42j2J22k40J95Q5k16j6J35j54K24N1
$$ y = [119, -55, -73, -7, 25, 141, -4, -65, 91, 14, 143, 67, -250, -71, -121, 9, 3, 28, 155, -17, -53, 13, -142, -68, -130, 22, -125, -3, 40, -23, 15, -31, -13, -23, -12, -68, -101, 37, -43, 18, 76, -94, -91, -267, -116, -15, 12, 50, -5, 86, 100, -41, -128, 30, 177, -20, 75, -118, 68, -109, -71, 67, 90, -89, -42, 19, -114, 113, -91, 129, 160, -70, 189, 17, -58, -52, -111, 62, 78, -123, 26, 24, 87, 184, 26, 129, 15, -73, 47, -76, 115, 79, -36, -79, 50, 47, 107, -86, 7, -43, -57, -69, -75, -212, -66, 33, 6, -3, -5, -3, -53, -186, -173, -87, -52, 135, -35, 38, 114, -77, -152, 64, 25, -65, -113, 90, 124, 13, -5, 63, 42, 75, -91, -56, 22, 0, 166, 110, -208, 97, 144, -173, 225, 41, -3, -62, -14, 59, 23, -102, 105, 36, 106, 98, 0, -71, 51, -101, -3, -19, -13, 22, -107, -66, 162, -4, -14, -67, -189, 190, 39, 121, -22, 53, 53, -87, -52, 161, -134, -244, -28, -31, 67, -4, 10, 36, -70, -46, -87, -228, -75, -77, 50, -187, -45, -57, 65, -175, 20, 105, -111, -127, 8, -146, 78, 129]
6982A29j17pMm8J20j71K98P1l71K46j63R9j51J1q5J30r6R4M1k01K82k36J46J09
7006A34j81J51m6j04J51j38J09j25n3J28l5NR2n1j43J5k5J85j30J71j00j26K1
7029i5J39k95J59P4j7K11k14K4Np2J34M0j87J9J20k0O7j64J56o9j56L59k41q0
7053a03J62k09K04p3q1K98l22k2J34Mj0L1r2P7Om3R2m7n9L8l17K72J75j59J21
7078G7j26N7n6rJ05Nq3O6N2r7O2M7q4Q1r0K64l98Q6l4j83L23Kj28J25j14j12K27
7105F5l8j14Q5j29lK77j07m4r8j8J18j01K40kk18LJ3J65j25n8j5K11j80J46P0
7130A43k21K42j08N7p0Q3j79R1j43K61l05J70K2j04Q3n9J07L8k96J9K79j69M6
7153a3J83l2j53j95J77J55j14l4j24K24nj51p4K30j24r7J99k3p2oj6O6J28k75
$$ y = [129, 12, 5, 9, -39, 81, -90, 208, 279, -92, 154, -9, 90, -61, -50, -135, -5, -101, -7, 34, -167, 115, -121, 25, 134, -47, 104, 58, -46, 105, -33, 76, -49, -102, 26, -9, -4, 88, 37, -106, -91, -116, 69, -61, 110, 10, -116, -95, 44, -251, -92, -18, -35, 176, -38, -14, -9, -81, 53, 93, -94, -75, 45, 25, 92, -72, 84, 15, -141, 218, -23, -103, 59, -150, 54, -19, -100, 198, -124, -146, -12, -8, -18, 13, -79, -2, 4, -39, 53, 6, -53, -15, -332, -60, 115, -44, 77, -49, 8, -48, -57, 48, 53, -30, 36, 88, -9, 53, 100, 16, 97, 7, 271, -127, -41, -75, -258, 65, 67, -61, 64, -50, -162, 65, 27, -87, -2, -131, -134, 143, 36, -8, -106, -124, -6, -107, 133, 131, -87, -84, -71, 94, -31, -89, -104, 107, -73, 73, 143, -78, 164, 56, 113, 43, 126, -53, 38, -105, 156, -149, 21, 43, -61, 22, -37, 70, 108, -188, -169, 110, -59, -13, 170, 138, -15, -210, -33, 122, 8, -26, -150, 74, 69, -82, -156, 74, -50, -147, 52, 29, -43, -49, -65, 1, 129, -146]
7177a46K86j69J4J04k54J21k7J26k32J08J47M2j65J92j6q1J61j39n3p9P2M9j10
7200d9n3K48o3j40p0J01o3J40M1m8m3j86J76J62j60Q5j94J41j21J51m7q5J94M8
7224A65k17J28p5j70K32j03K0L1J21j15j54J55J79l37J21M1j09J06k9J15j06K8
7246B7o0J20j72N8p4jJ26j41K6J95J0o6l5j95J83J55r5j29j9J03P0r4j13J24N
7271Hn0J16m1l8l7m7K31o1l3j77J10O6L2l0j36k4K06n6l9J36q7j0j26lK02l7o4
7298A1k4r1O9J0j91L63p3j79K43k24J75k27K1k1L8o6K57j95L0K55k40N4J06j48
7322d7J20o7p1Rl7J04j1n2L7J48j58L4K6n5j1k5J29m6j60N5Q2q5N3J19k85K40
7348D6m0R0k00R4Q7l4j87O8J07k12Q8J27O5k31K35r5q3OK4J8K4r6J40p9j3RJ69
$$ y = [-146, 140, -29, -15, 89, -165, -44, -71, 55, -177, -69, 78, 120, -45, 147, 131, 50, 211, 72, 19, -60, 12, 61, -49, -102, 146, 83, -57, -127, -26, -89, 51, 92, 44, 1, -185, -9, 153, -7, 78, -116, 25, -96, 55, 8, -77, 117, 165, -52, 76, 1, -169, 63, -40, -20, 11, 132, 17, -137, 18, 197, -140, -19, 22, -87, 19, -10, 105, -1, 27, -33, 87, -85, -27, -101, -102, 24, -117, -91, 104, 114, 48, 13, -182, 1, 156, 61, -68, -87, 16, 86, -8, -121, 3, 8, -42, 74, 33, -5, -42, -89, 142, 81, 48, -129, -19, 47, 79, 49, -87, -111, 95, 39, 0, 136, 49, 39, -87, -90, 112, 75, 11, -13, -104, -35, -25, -216, 147, 74, -105, 138, -86, 89, -138, -117, -138, -100, -166, 91, -104, -74, 181, -59, -5, 101, -47, 73, 6, -65, -56, -93, 11, 0, -52, -15, 133, -25, 9, 35, -20, -31, -56, 73, 27, -133, -78, 4, -81, -28, 91, -194, 46, 6, 96, -104, -10, 77, 43, -144, -76, 31, -181, -93, 34, 99, -132, 103, 8, -75, -69, -45, -27, -3, -99, 41, -38, -51, -42, 127]
7375A27l03K97j4n8Q8j29j81K14l5m7J79l19L20k50J11oj2j75Q5J48J81k24O7
7398F4m5kJ54k53J49J02k25P2j1j22J16m2k4R0l3J03j54l9nJ18j32K02lp5R2l8
7424E9O6J22k21k31K28L6J67j88q0R5o3j12K01j79K27k23J19J13j40P5j34k45
7446c08L32L9j42K72m04K61Jm7J10q8l7q8L7l1J14r5K2R0L5n8N2j00K52l83J44
7471b0J19k36K15q2o1O6O7N9k54L4K02r0O7O6k23n6J82p4J75O2l32K85l32K20
7495E9Pl25K54M4k36J86J3j22L40l29J5J63q2O2K7j30j0N8j46M6J56J02k05QN6
7520A1L4m9M9k10O1J58k40J34o2J98m6j15N0m0R4J98k55J32r0j25Q8j10J39P8
7544H2j30J0J08j15n5J4n8K49K0j98R7J15j28N1j16J09j6l2q9J2J11N6k92J82
$$ y = [127, -176, 121, 107, 49, 137, 8, -173, 41, 6, -41, 138, -181, 139, -111, 0, -6, -18, -193, -108, 40, 221, -3, 64, 19, 17, 171, -82, 67, 169, -56, 16, 5, -117, -1, -43, -67, 23, -10, 93, -61, -100, -105, 13, -119, 83, 80, 5, 97, 59, 125, 247, 26, -205, 23, 59, 226, 38, -42, 53, -10, -122, 79, -100, 127, -96, 23, 136, -4, 71, -63, -308, 24, 63, -79, 193, -211, 50, 51, 4, 114, 26, -11, -99, -62, -93, 21, -74, -52, 38, 73, 15, 67, -33, 219, -164, -20, 99, -137, 78, -4, -65, 1, 68, 127, -127, -93, 109, 19, 86, 152, -71, -127, 55, -19, 156, 218, -114, 171, -161, 59, 66, -259, -5, 39, -197, -11, 2, -120, 220, -109, -94, 69, -13, 49, 76, -54, -64, -6, -152, -106, 50, 152, -53, -45, 11, 45, -4, 45, -165, -104, 54, -186, -52, -114, 84, 38, -77, -27, -67, 27, 225, -30, 102, 12, -113, -25, -135, 4, 82, -48, -38, 70, -45, -100, -86, -144, 105, 125, -73, 24, 139, 11, 62, -54, 55, 39, 7, -82, -70, 41, 97, -195, -13]
7568a3P8k73Q9M3R8Q3l16J46J08j62J60j00n9k4L6K0J26j81J87R7j83J37k26J34
7592EJ12l59K40J15l17K30M0r6M2L5ll3r0R8Q6l3J2m00J30J27Q4j20J98q2P2m7
7618D6j92K72j74J54o4K9r0rk8Q5P4p2m2k26K09J07q2j2J9n3K2n3J76j95K6K83
7644B10l57J21J31k06M4J59k68K95k17Q3J40k02N5r3P3J52p7j59J30p5l6K77j89
7667iJ96j65q9J68j6j02O5j16j14J63J03p2p7p5J20L4m1k4mP4P7k7p4p1J8K00
7693A42j41J52p4k56J16R9j20J56l4k02J78Q1o1L9j6j3j11K7j4J24p3k2J35j06
7717Fj81K20J60k36J48j32jo7n7J96o0MO0j19J50M6P9k40o8k2O4j40K10l1N7r5
7743d9JRJ57Kk31J13k5o4L62k22j9k35Q8J44k10P4K09j28N2p3M4Mk47J12J86j10
$$ y = [-13, 65, -208, -119, -76, 22, 105, -211, -65, 43, -119, 41, -59, -118, -142, -106, -86, 40, -141, 46, 143, -40, 97, -129, 5, 117, -242, -2, 113, -204, 26, 66, -30, 12, 47, 44, 11, -79, 19, 105, 72, 84, -316, -186, -59, 25, -95, 103, 21, 93, 46, -146, 126, -48, 106, 42, 71, -19, -28, -56, 29, 103, 31, -11, -237, -28, 79, -3, -15, 4, -49, -27, -80, 96, -99, -73, 210, -147, -26, 105, -101, -57, 102, -166, 129, -88, -5, 135, -67, -12, -105, -32, 120, 43, -116, 14, -61, -97, 180, -9, 187, 22, -67, 101, 85, -17, 48, -68, -182, -19, 84, 12, -65, -140, -20, 14, -27, -51, -55, 19, 96, 69, -5, -76, -58, 142, 1, 153, 79, -177, -61, 38, -82, 74, 40, -162, 16, 97, 36, 75, 59, 46, -65, -38, -52, 72, -1, -23, 112, 6, -175, 45, 205, -31, 117, -15, -16, -83, -140, 56, -4, 0, 60, -59, 91, 137, 216, -24, -92, -114, -50, -190, 20, -11, 46, -49, -48, -39, 118, 120, -111, 2, -23, -87, 275, 53, 34, -201, -113, 31, -179, -105, 104, -24, 28, -45, -1, 3, -244, -132, 54, -56]
7769e6L8J61k48J78Nk2qm7j32P9j13J98o4j42K59j23J67j06j2%nj18P6J7O8L7
7795H7j33K01m9o7O0p5R6j27n3O9J33j60l2M7k03K00j57o6K59j02j30J36L8J16
7819H8K1j48j4n3J78j67OO3K4M3N5k45K09O9k74J27j1n1K39k56PJ72p9j24L4q3
7845a70K01k9p8J25j78J55j9j25J99j38p7J96r1P2Oo3Mj58J98M1j92L8J43o3n9
7870f2J34k22L79k87J4J47l6q5RJ1Q6J05k02q4rJ42L0j63J99q1p6J70j70Qj8P8
7896A7p9j12N7K37K8q4l7L6k00R4L5p3q1J65J68r0k55J32k6j4n3M2O1p8J81r3
7922b2J7P9l4o9K9n6L8k7j10J71k23n5M87l01J00o1q6J59J00j82%K08k43J71k08
7947a18J88l6o2n7J01j00K52p8j12P1j31J38j22MJ34m2J20j12O8p4Q7j56n3N3
$$ y = [-56, -18, 143, -105, 73, 78, 56, 48, 1, -131, -52, -165, 33, -31, -173, 86, -37, 130, 24, 12, 12, 7, -111, -35, -18, 50, 87, -46, 155, 106, 39, 99, 24, 120, -7, -60, 9, 142, -18, -50, -3, -206, -6, -163, -229, 30, -72, -202, -66, -28, 88, 109, -39, -53, -106, 72, -95, -89, -26, -2, 41, 96, -149, 60, 129, -145, -18, -29, -80, 159, -97, -90, 82, 3, -121, -87, -170, 31, 2, -76, 49, -129, 26, 7, -118, 81, -57, -134, 62, -29, 43, 49, -14, -10, -168, 30, 71, -121, -83, 60, -3, -62, 72, -150, 229, -58, -44, 103, 67, -18, -9, 2, 88, 193, -9, -93, -102, 40, 70, -93, 106, 25, -51, 119, -51, -43, -61, 17, -62, -174, -117, 120, 148, 64, 27, 63, -137, -43, -8, -81, -162, 3, 171, 81, -174, -42, -68, -82, -135, -93, -32, -110, 71, -22, -5, 74, 40, -29, 0, -56, -18, -45, -155, 16, -207, -262, 225, -76, 24, -37, -123, 36, 136, -46, -46, 162, -81, 90, -118, 70, 34, -28, -85, 16, -84, 168, 90, -22, 49, -82, 56, -66, -62, 72, 30, 150, 38, 106, 32, 119, -37, -90, -37]
7971c7J78k16N3Q8o0J02j74M7J2n0j15R9J01j56mJ98o9K04k71K00q6j08J57k39
7995a46J12j00J16j1J61k23J4K16k11R6J20r9k5K5J62l04j27L58j42Q1j17j8P6
8018A4J45j94K22k22NJ71j79j64Q4j04J75P5j36J9k8J67q1rJ49j48N3j2q6K3j42
8043b03K11j39K01q2N2jn8J02j74K5P6p0J73k01Q2L5L3o7R0k64K42Q4j11Mk39
8068a99J94Q4r3Q9L4j90K98k45M8J20j42K10k07j10J43N8l8L2j93J48m2p9J08
8091B8k4M6m2j40Q2J10j53L6JJ15j1j00J41M3j08R6j44R1J7l26K00j5p6j1R8L1
8117a5J15j21l0J34n7N4n5p3Q8j19r9K27K6j23R1l7PL8jjo6N0j3n8N9J58k14k
8145c7k0o7K3J76r8J2l3O0l8n0J36j31N7O8l3j05L8q0J61Oj49J14q5j19L53k02
$$ y = [-37, 141, -75, -22, 66, 6, 108, -66, -19, -7, -57, -172, -73, 28, -128, -132, 66, -3, 201, -70, 130, 44, -64, 93, -146, -34, -134, -18, -29, 132, -91, -77, 139, -72, 24, 144, 45, 20, 45, 207, -97, -224, 134, -8, 73, -44, -62, 14, 159, -35, 187, -35, -30, 141, -38, -202, -118, -222, -47, 28, -108, -89, -117, 50, -31, -40, 109, -39, 14, 2, -84, -61, -203, 8, -131, 70, -12, 40, 39, -19, 83, -91, -66, 10, -60, 113, -88, -6, 29, 62, -5, 85, -179, 63, 147, 36, 40, -199, -5, 79, -14, 75, 109, -81, 217, -28, 20, 140, -2, 208, 1, -109, 34, 92, 54, 86, -107, 41, -1, -80, 28, 4, 50, 8, -132, -50, 60, -93, -57, -56, 59, 48, -52, 89, 132, 24, 120, -24, 67, 84, -242, -42, -57, -133, -144, -46, -15, 100, -21, -51, 83, 26, 80, 25, -48, 40, -79, -178, 49, 75, -48, 43, 6, 13, 51, 50, 49, -17, 33, 20, -38, 21, 179, -35, -37, -57, -124, -101, 75, -23, -11, -44, 16, -22, -72, 64, -67, -10, 58, 25, -80, -42, -122, 39, 45, -104, 10, -75, -194, 159, -43]
8171d3L5ON5P6k02N9K1l7q7m5K16J32k42P2L7M5j4P1j14j9
$$ y = [-43, -8, -2, 53, 129, -73, -14, 7, -30, -117, -162, 54, 186, -56, 16, 53, 98, 84, 155, 41, 22]
8191B2
$$ Imaginary data points
##PAGE= N=2
##DATA TABLE= (X++(I..I)), XYDATA
0@%%%%%%%%%%%qJ6j6J6k4L2l2M0n6O4p2Q8j04J20j41J66j93K21k54K94l36L80
33B01m30M86n46O14o91P74q62R61j069J184j312J453j607J772j954K155k373K614
51A370k878L171l499L865m274M738n270N883o605P467q509R806j1475J3699j6829
66i340K1587k9706M6968j41566K40068K13156o76848J6275N94789p123l58597
77i0337j87759K58275N15547l50234n27115L82326M05290j79943l49038j14267
87b37255M67365K30379n47424k19498M35756K01982k52350l20588J44916M39780
97C43063j50231m84380J33363M13865j3604l44433j79947L23935L10350l38054
107A3927l37291K68790L17985j13392l56774l3862M31461Q3285m26278q1517L27869
$$ y = [0, 0, 0, 0, 0, 0, 0, 0, 0, 0, 0, 0, -8, 8, -8, 8, -16, 16, -16, 24, -32, 32, -40, 48, -56, 64, -77, 89, -104, 117, -137, 157, -179, 201, -229, 257, -289, 325, -366, 408, -454, 507, -562, 622, -690, 763, -844, 928, -1026, 1129, -1244, 1370, -1508, 1663, -1836, 2029, -2245, 2493, -2777, 3106, -3499, 3968, -4541, 5265, -6210, 7489, -9340, 12247, -17459, 29509, -112057, 128011, 341167, -335681, -319406, 275383, 268260, -90337, -278096, -19821, 495726, 145492, -381623, 703, 405993, 226050, -122988, -237255, 230110, 460489, -86935, -306433, 129323, 331305, 78955, -241633, -96717, 343063, 192832, -291548, -158185, 255680, 242076, -102357, -282304, 41631, 351981, 13927, -323364, -54574, 263411, 150019, -206755, -240617, 190844, 274129, -152149, -233666, 94203]
118I4203J52984k30431k79893K18241L51779k11173l39155J06436L22102L4576
128B19669l64513j18823L73289J36420l01886j88724K02316K76124j53337l14432
138b33897J19195K84423l4177k67768p2730K93646J28617k93490j55328K19602
148a1907K15470j33857k92190R4986L20728n2207k83466l1307K59481J34867k55011
159c4413j84118K32755J97982j64859k25870R3773K64166n0713k80576K939K64068
170A15134O1940k41932j21986K10679J62516j57640j99301J02014K33636o0388
180A04672k36966J1929K09563N8711j94178j24874J93156J45726j66782j54505
190a53548R8167J92636l7043k39539R790K38693K3034j98253r1108J72351J53671
$$ y = [94203, 247187, 16756, -263137, -44896, 306883, 95710, -243445, -137009, 185093, 219669, -144844, -263667, 109622, 246042, -55844, -244568, -42252, 233872, 80535, -233897, -114702, 169721, 135544, -132224, -204954, 88692, 217309, -76181, -231509, -11907, 203563, 69706, -222484, -127498, 193230, 141023, -142443, -173750, 85731, 220598, -34413, -218531, 14224, 212206, 47347, -178523, -84750, 179416, 128703, -151873, -148934, 115134, 177074, -64858, -186844, 23835, 186351, 28711, -170590, -68576, 165060, 104672, -132294, -120365, 89198, 147909, -46269, -171143, 22013, 167739, 957, -153548, -55381, 137255, 100212, -139327, -129537, 109156, 132190, -66063, -157171, 15180, 168851]
201A68851j66884j73206J32045J75530o4155j98743J0957K18146J3862j96604
211h0201m9856J58561J12400j42694j52419J31321J52905p8532j55343O270J84724
222H7136L1643j94339m2383J54140P9683j05321j40925R2230J71356q4760j56701
233a08241L7320J48449K8981j68934o2950J75166P2018j39031r9466R4444J44333
244A22089p2775j63795N1898J55180o923j48043m1664J49350O8090j31726q8917
255a07236R5906J19019o6409j41543M3736J38901m481j31894m4490J35986P2562
266A10057j28171q4216Q9050J10017m9441j46240L2974J51903j6657j28395k9324
277h8443J15540P8748j23605r3367J13082R0472o5319j09448K2584J41618j1616
$$ y = [168851, 1967, -171239, -39194, 136336, 72181, -126562, -115605, 102541, 116403, -80201, -130057, 28504, 140904, -1790, -154209, -22888, 130017, 51485, -103858, -97588, 87136, 118779, -75560, -117943, 36197, 115880, 10559, -130366, -38136, 133220, 48460, -108241, -70921, 77528, 106509, -62425, -125375, 49791, 121809, -17222, -116688, -22244, 122089, 49314, -114481, -62583, 92597, 85674, -62369, -104033, 45317, 113407, -18319, -107236, -11330, 107689, 41280, -100263, -56527, 82374, 77893, -54001, -98491, 37495, 110057, -18114, -102330, -13280, 96737, 47296, -98944, -65970, 85933, 69276, -59119, -88443, 27097, 105845, -17760, -111127, 1955, 92427, 27108, -82340, -59756, 81862, 70246]
288G0246j41110o33J11382M3718r4917q7885R6572R9425p8006r6066L2979J11758
300F7463L723j30167j6735J20239L7208r3692p6904Q0395J04694p4253j05762
311h3791M4572J06411j847j23532k2133J28917L3402j04061n9574P6553R5436
322I0353o7139j08952N4585R9941j8547j01696k0902J13055L6342j06198m5793
333g4951P5593P2717n2669j00425M6428J03973k7462r3602j2139R7391M3281j04493
345b6358n2013Q6891O1960n5173r0106L7149J09935l0102j02844O176R1029L3308
357F9852r4401n4764R5529N8742p0330p1155L7953R6970k3820j05837J3448R0255
369D2442J5548p8519m9861Q1524O3816p3917o3940M4447P6887j5350r5960N080
$$ y = [70246, -70864, -71497, 39885, 83603, -11314, -99199, -2627, 96798, 18792, -77274, -44295, 67463, 71186, -58981, -75716, 44523, 81731, -11961, -88865, -8470, 96224, 21971, -83791, -39219, 67192, 65345, -58187, -80320, 48597, 81999, -22062, -81636, -5083, 90353, 23214, -85738, -31153, 68788, 50241, -51455, -72357, 40698, 77040, -29158, -74951, 642, 73359, 20690, -79735, -33307, 70666, 43204, -50398, -62537, 34854, 78135, -26358, -78371, 8520, 70480, 15307, -74799, -37650, 72285, 42183, -60661, -54485, 36544, 69852, -24549, -79313, 16216, 74958, 4628, -66527, -28574, 68396, 44576, -61261, -47813, 42442, 57990, -20529, -70390, 11134, 74950, 1033, -62907, -18460, 58427, 43077, -52883, -47803]
381d7803R5678O241p9342l5553P0654O1648p0625o9405N3670P2314k4387q7109
393e4019N606R5524K489q3428k2959O7405N3849o7198o8321O3006O3008l5531
405A9431o8176J979Q9495Q781r4631q843P0574L2981m6854o8220M8599Q1014m7518
418A8612o7008J9747O3072J6954p8512l0684Q3789K8919o3058m1780L8929O6640
430E5620l1390p7872K4839P3285m569o9627j9123O9485L2745o1578m5336M6813
442f708N9046l7223o5703K5665O1696k976o3280j9883P2636K7315o7744k9319
454d6478M4355M8922k4781p3945K4066P6590j8312n9010j0753N3006M1150o3152
466h342m6025N9455L9369l2273m9860R041P0205o534p1992K618N6005J9713m8577
$$ y = [-47803, 47875, 54116, -25226, -60779, 9875, 71523, 898, -68507, -14837, 57477, 33090, -54019, -48413, 47111, 49600, -33828, -56787, 10618, 64467, -2731, -71052, -8046, 54962, 19431, -48745, -46766, 42729, 51510, -43121, -51964, 18610, 51591, 4737, -63483, -14884, 66130, 18612, -48396, -28649, 34423, 51377, -27135, -57819, 25970, 54889, -8169, -49949, -11020, 55620, 24230, -53642, -28803, 44482, 39913, -29714, -48837, 20648, 53393, -8185, -53521, -6708, 52338, 15115, -50588, -24923, 36773, 33797, -29483, -49366, 23270, 50585, -17159, -46478, -2123, 46799, 22018, -51927, -27861, 48729, 30417, -28593, -39346, 13660, 54810, -8342, -54367, 5088, 44457, 12184, -37676, -28635, 41570, 35036, -36956, -34338, 21667, 41380, -7197]
479g197m4267N1635M8544m2172m7182J7075N7246j60o6685k817N8017J3113m2945
492g795l4637M1090M8421m3344m5369K9341M5064m420n8785q135O7479J0540n5252
505a5802k3012L8937M4882l3179n5184K8556N2414j2505n1128o030N5202J5647
517C8798n2806k3010M1461L7503l4383m9460K9410M9530j3868m8653r094N5883
529B1311K0667n7977k0544M0792K9228k0859m9151J7412N7022k0230m5626N511
541b2444L7261J9556m6129l0380N2489K6350l7116l2275J5973M9933q746n7612
553c3140O699M7836Q033l9423k7285M1038L3618l7155l3426K1734M1443r238n1851
566c1117N901M9436K790m0075k3150L8828L8293m1454l7042K8419L5547m624m6734
$$ y = [-7197, -51464, 171, 48715, 6543, -40639, -23564, 33682, 33522, -33163, -35980, 22037, 35150, -7795, -42432, -1342, 47079, 3735, -41634, -12293, 32771, 28351, -30434, -38569, 28910, 39450, -15802, -38814, 123, 45005, 11826, -43358, -14802, 37612, 25107, -26021, -32051, 23151, 38798, -14008, -37018, 4443, 41946, 7563, -41897, -12487, 37043, 23175, -25478, -34572, 21311, 41978, -15999, -36543, 4249, 33477, 12618, -36533, -19121, 37901, 17671, -27955, -22444, 14817, 34373, -11756, -42136, 10353, 36703, -413, -32688, -16715, 33218, 24472, -33140, -26441, 21395, 29428, -9995, -37280, 3758, 37376, 221, -33205, -11471, 29972, 20734, -31117, -25216, 24220, 27010, -13065, -36215, 2613, 40906, -548, -37590, -9171, 26376, 21752, -24982]
579b4982o929N5210M975m4629j0795K8567K9937k5366m2943K9708L9776k0446
591A2083l5527R52M2412J2137m7449j6014M1182K2537k9330l3410K1913L9253
603C0739j4712m0168L498M2131N020m3423r699L6108J8976k7565l5069K6931M2231
616C4998k6372l6330R707L4384J3185m5382k0265M9616J4549l2538k0354J2077
628a2725M1514j1011n0642J7874L8288o057k6811j8591L4379L0220m2376k4079
640c0017L0988K3362r553l7236R16M6771k455l9825m224K9051J8892k7148k8372
653b8850K6588K9606j9384l2336R587L6227k425l6751o354L3775J7650l3523k4626
666c0816L0647K5672j8581l0473N323M0505j325m1949N16L1585J1235k3685k7982
$$ y = [-24982, -31911, 23299, 28274, -16355, -27150, 1417, 31354, 5988, -36955, -7247, 32529, 12083, -23444, -22492, 19920, 32057, -15392, -31406, 9776, 32313, 2983, -30427, -8514, 30739, 16027, -24141, -20643, 21488, 26508, -16915, -26614, 9494, 28470, 905, -34164, -7233, 34998, 8626, -27704, -17997, 16387, 29572, -15810, -36075, 13541, 28090, -4448, -24802, -12725, 28789, 17778, -32864, -14990, 23298, 17241, -9570, -28161, 6218, 36438, -5938, -30017, 971, 24333, 14780, -22456, -21540, 25231, 22776, -17049, -21273, 7778, 26670, -478, -28850, -2262, 27344, 7960, -24376, -14789, 21438, 19013, -17738, -24092, 9683, 27333, -6190, -30816, -169, 25503, 6922, -23551, -18228, 22277, 20952, -20997, -20481, 11104, 22339, -1346, -29328]
679b9328K7392L2078k7140k6519J3045K7765M065l8456p971M0746O978k8456j6648
692b2449J8326L1279j8848l4275J7063K8506m465k8713q596L4739J1198l2863
704i098j2675K2301K2499j6590l1921J6425L1792j0221k7472m201L0399J3440
716B4678l4367j3410K7446J7012j6083k7942J1779L4586j1294l0769K575K6767
728A0978J1385k9522j8237L0359J8345k1312k2905J0537L1689o873l3680L824
740a5412K7999O118k5296j6866K7522J9343k4039j9415J3036K5766n276l2754
752a9274M565L0183j37k3286j2075K3196K0357k5149k0013J8635K0210o596k7412
765a6796J122L2363q84k7576n193K1088J7532k1758k3312K1715K1381j2916k2770
$$ y = [-29328, -1936, 30142, 3002, -23517, -10472, 17293, 21358, -17098, -25069, 15677, 22655, -5801, -22449, -4123, 27156, 8308, -25967, -8904, 19602, 15137, -13576, -22172, 12567, 23765, -9098, -21773, 528, 23027, 6437, -25484, -9059, 22733, 12512, -14960, -19161, 11238, 24678, -9689, -23099, 4347, 21359, 5276, -22666, -10887, 23699, 12405, -18364, -15789, 10978, 22363, -7159, -25396, 4963, 23308, 1996, -20909, -10372, 21317, 14444, -19236, -15412, 12587, 18705, -6591, -23457, 4065, 23408, -631, -20046, -7010, 18756, 13480, -19274, -14709, 15474, 15337, -7949, -20024, 3172, 23529, -1620, -21633, -2998, 17212, 10616, -16796, -15674, 16689, 15805, -11771, -16964, 4124, 21656, -102, -23414, -1699, 19682, 6766, -16004]
778a6004J495K9669K496l1581l123K3756J1706j7825k2572J8793K4683j6549k1246
791a6302N886K3052M464k9250o030K7494P161j8474j5666J3367K4445j4344k4179
804a8376J0644K0507O34k3114q161K6829Q852k2584j1743J4836J9940j1861k5216
817a8813J1143K2968m438k1030o101K4464J0363k4764j0840J7810J5759j0515
829F006k3592Q935K5185o887k0932k052J9782J1341k3040j2908K0693J2964j1593
842C902j8583N131K5122n040k3690K117J8152P561j8026j4696K0198J4398j5908
855F38j4204O632K0083k377k4253K292K1125J869j6143j1049J6721J5826j7476
868c16j4360J0928J5930k896k1529N47K2775M84j7790o852J4021J5204j5134j7203
$$ y = [-16004, -14509, 15160, 17656, -13925, -17048, 6708, 18414, 589, -21983, -3190, 21493, 4944, -16302, -10416, 12636, 17100, -12150, -18180, 9314, 16475, -1999, -17665, -4298, 20147, 5803, -18376, -7732, 12775, 13409, -9705, -17866, 8963, 17815, -4769, -16512, -1676, 18264, 6403, -18813, -7670, 15298, 10860, -10170, -16271, 8193, 18556, -6208, -17048, 762, 16521, 6006, -17586, -8651, 16534, 9647, -11285, -13337, 6445, 17786, -5254, -18162, 2531, 15495, 3902, -14681, -9550, 15572, 10532, -13158, -11041, 7111, 14672, -3354, -18050, 2148, 16546, 638, -13566, -6934, 13149, 10772, -13481, -11189, 9936, 11805, -4338, -15387, 1334, 17160, -316, -14676, -3748, 12182, 9286, -12243, -11696, 11079, 11563, -6227, -13079, 942, 16146, 1012, -16191]
882a6191J4023J4661n648j7058j629K2151K547k1195l522J4420J0460j1288j7297
895a5566J2521J7195r904j4362J224J6908M287k0315m215J7301O220j1376j2925
908a3007R679J7160j0218j5004N234J3970K412j7249n523J8726M854j2940r274
921a1180Q427J5856q542j7545P968J4076r48j3605o737J7616P635j6801o908J0093
935e95J1222n050j7313N461J7275m371j3231k284J2806Q192j4644r011J2453R190
949A0100o676j3053L535J6041l251j3670o50J1265O802j2856q798J2926P608p909
963A414r697K264J5447k541j6086K856J1274K948r100j0283J2508J0647j2252
976f01p717N062R726J229j5493l46J5365n48r830m648P129J1466r457j1862Q742
$$ y = [-16191, -2168, 12493, 6845, -10213, -11842, 10309, 12856, -8339, -11861, 2559, 13019, 1731, -15566, -3045, 14150, 4246, -10116, -8892, 8016, 12303, -8012, -12227, 5074, 11294, -82, -13007, -3328, 13832, 3614, -11390, -6156, 7814, 10226, -7023, -12546, 6180, 11034, -1906, -11180, -2753, 13103, 4561, -12984, -5016, 9060, 8112, -5493, -12230, 5386, 13021, -3780, -10688, -595, 10627, 5577, -11736, -6275, 11000, 6629, -6602, -8886, 3920, 12112, -2532, -11543, 910, 10100, 3424, -9629, -6094, 9947, 6696, -6974, -7624, 3641, 10443, -2413, -11211, 1715, 9323, 1414, -8283, -6019, 9428, 6887, -9199, -6343, 4931, 7879, -1221, -11504, 1004, 11651, -601, -8318, -3256, 6470, 7699, -7794, -8140, 7225, 6677, -3153, -7801, -672, 10794, 1337, -10525, -1783]
991a783R329k426j0608k643J3563K948j1897m246P934Q338o573j0797O495R487
1005G121l109r273j394J1914K328j2096k415Q106O364n612j1112O940J0708n812
1019B658p678j32Q522N050j2430l718J1137K417n178o860K727J1884n049j0928
1033g578M286P304K323q262o867J1051N747q890n216L487Q665j305j1519K201
1047d573R292j8o763m663P735O376q763m922N437N785j353r621J207J0319j537
1062C938o991k113N443O585p129p025P296M607k644n937p49R416J03r198K39N835
1078A676L616n128p072O426O657m752n864O40P782J489r584n98P004K410m093
1093F09o749M857P756n485n118J658N068K538q260k460R023P77m609l362J463
$$ y = [-1783, 7546, 5120, -5488, -8131, 5432, 8380, -3517, -7763, 171, 8509, 1936, -8861, -2366, 7121, 4012, -5261, -6655, 5259, 7587, -4509, -6924, 1182, 7546, 1934, -9178, -2238, 8470, 2658, -5020, -5152, 3370, 8420, -4010, -7728, 3409, 5826, 648, -6212, -3485, 8399, 3350, -7578, -3292, 4012, 6335, -1927, -8794, 2257, 8004, -886, -6102, -2615, 6050, 4745, -6774, -4573, 4719, 4701, -2062, -6725, 1010, 7386, -1377, -6299, -862, 4923, 3570, -6051, -4844, 5475, 3938, -3053, -5166, 277, 6862, -267, -7292, 4, 4611, 1967, -3970, -4719, 4697, 4800, -4398, -4159, 1676, 5292, 164, -6908, -482, 6175, 1423, -4441, -3801, 3981, 5470, -4114, -4712, 2292, 4702, 609, -6140, -1283, 6473, 988, -4130, -2472, 2596, 5134, -3126, -5586, 3437, 4214, -395, -3757, -2294]
1108b294Q164l395q243M280M554P2m389m072P101L598p093k240L654L951j141
1123B507p385K471O868j912m988j453N512L829o941l200M802L606j444o699J358
1138c069P603k156n019o22L749M682n744m982O564K655k727l740r33P364M76p957
1154c856J034M069K007k588n694M370N598m406l630J049M197J707o462q31N584
1169B148P36k965l799L131N458m112m134K073L634J363n718j787O706J85l778
1184h59j841J314N684k724o244L973L534r50k933l443O232K986o814j025L122
1199A2K759m60o386J683O366k071l666j023L241L924n085l319M556K385j590m043
1215b717J71O086j261m719Q7L015L051m160l632M609K635k597k847j90N316J16
$$ y = [-2294, 5870, 2475, -5768, -1488, 3066, 3138, -1251, -5323, 1778, 5376, -1717, -3957, -303, 3648, 2507, -4878, -2407, 4461, 2549, -2439, -3892, 1620, 5449, -1492, -4692, 110, 3716, 2272, -4427, -3069, 4534, 2378, -2641, -3263, 486, 5168, -576, -5558, 1006, 3661, 934, -2806, -3739, 3625, 4101, -3856, -2822, 1247, 3254, 666, -5028, -658, 4940, 534, -3096, -2047, 2150, 3857, -2605, -3436, 2148, 2884, -81, -3880, -749, 4709, 597, -3537, -1464, 2170, 3533, -2185, -3972, 2734, 2919, -859, -2700, -1386, 4298, 1574, -4670, -697, 2837, 1887, -1046, -4489, 1743, 4729, -2085, -3110, 12, 2771, 2311, -4075, -2392, 3974, 1903, -1763, -2786, 455, 4379, -706, -4025, 531, 2916, 1326, -2717, -2546, 3540, 2279, -2440, -2353, 662, 3713, -447, -4079, 530, 3165, 568, -2279, -2469, 2847, 2963]
1231B963o212J306L183J214k184m433L925M604m604k507J180L367J636o207n35
1246c304N816p3l028k429J987N457l745m427K806K866O00l999k370N881J260m381
1262a083j402J848L869j422n695K635L953q22k969k255M650K412n272j253L034
1277B28K227p63n066J396N410k418k889j50K637L018m878k407M744J373j673l350
1293b561L86N804j730m881J410K651J887l056m163M884K652l208k201P5M552K85
1309B786n661P42L878M20k209l354L189M206m098k573J676K758Q40m990m97N207
1325B320k56k812j452J503L888l002l452L157K020l80k931j426M897N01m268j80
1341a873J694K828j419n002L205L407j834k488j252M154K015n418p51L445J416
$$ y = [2963, -3249, -1943, 1240, 2454, 270, -4163, -238, 4366, -238, -2745, -1565, 1802, 3438, -2769, -3304, 2512, 2439, -589, -3018, -1031, 4426, 681, -3746, -940, 1926, 2526, -1473, -3843, 2038, 3298, -1083, -2485, -637, 3232, 1810, -3885, -1250, 2703, 1881, -1088, -3343, 1307, 3719, -1553, -2806, 228, 2455, 1692, -3374, -1978, 3432, 1014, -1875, -2025, 612, 3630, -1248, -3655, 1089, 2462, 789, -2561, -2175, 3629, 1899, -2982, -1572, 1079, 2966, -90, -4253, 631, 3283, 75, -2126, -2051, 2501, 2786, -2875, -2133, 1745, 2165, -44, -3398, -209, 3997, -101, -2674, -998, 1760, 2600, -2390, -2887, 2320, 2064, -748, -2200, -697, 3191, 189, -3263, -106, 1914, 1534, -1397, -2823, 2074, 2575, -1693, -1873, -179, 2649, 1230, -3772, -567, 2840, 1006, -1482, -2734, 1420, 3435, -1983, -2734, 711, 2127]
1356B127j165m073J600N191k663l217O44K489K398m381k297M509J075j857k224
1371a844q4M786j018m318J255K311J198k407l281M021K326l391j321N72L199J93
1387B197m908R26L877l18k225k180K835L311m254j848K371K047M4m164q6M928
1403B553j038k903l66J620L172k904l284L197J868o99k607j329M466R81m367k50
1419a890J905K520j467m373K505L609k322j934m75L085J810m753p34L842M77j520
1435B85k750J577L785k554k411J346J691J009l028j523L979L44k122j047J73L549
1451B303r85l886J973J770M09k042k662L961K229l962j107J515K475R3n022J377
1467a561M226j296k357j233K663K533l578j722K757J083n34k670rL972j111k388
$$ y = [2127, 962, -3111, -1511, 3680, 1017, -2200, -1556, 933, 3331, -1050, -3347, 1162, 2237, 380, -1844, -1928, 2858, 1840, -2478, -1223, 1088, 2286, -121, -3402, 619, 2945, -446, -1767, -1195, 2004, 2197, -2711, -1785, 2092, 1774, -451, -2631, 204, 3515, -739, -2587, -216, 1831, 1875, -2289, -2375, 2553, 1515, -1388, -1754, -134, 3038, 134, -3150, 47, 1915, 1216, -1391, -2720, 1746, 2727, -1640, -1890, 15, 2535, 1068, -3305, -800, 2809, 487, -1447, -1922, 1163, 2973, -1780, -2514, 1328, 1805, 285, -2465, -888, 2897, 343, -2068, -722, 969, 1978, -1050, -2573, 1406, 1750, -372, -1419, -1246, 2303, 1318, -2568, -595, 1175, 1584, -458, -3120, 841, 3070, -892, -1999, -484, 1991, 2084, -2938, -1561, 2665, 1369, -988, -2221, 442, 2975, -603, -2325, 432, 1515, 981, -1689, -1698, 2274, 1163, -1225]
1483a225rJ210K294k074k697K822J174j044j192j473L781N32m061P67J762R74
1499A541j038l298K612L287l485j521J018K353O62m109k65M170l70k003j452J463
1515d35L019k356k365J934J285L28k382j060L352K22k029p38K46L201j205l495
1531b478J899J899j77j345k545L586J896m054k19J424J503O6l998J314L939k488
1547B22j571O09J237J651l180j134L223K3j197r73J56K759j010k410Q19J022J299
1564A545j546k222K605J261j438j407m49L257K16l824P32K185O82j408k917K662
1580f6L088l557j076J368J111P25l403K18L595j349j302j99M37K348j998j902
1596a962K433J75j92q26j237K621K90k088q3M22J930n16l144J642J827n86j501
$$ y = [-1225, -1234, -24, 2270, 196, -2501, 321, 1495, 451, -741, -2214, 1567, 2099, -1962, -1195, 567, 1541, 503, -2795, -183, 3104, -381, -1902, -884, 1469, 2131, -1978, -2243, 1927, 1557, -446, -1898, -435, 2584, 228, -2137, -203, 1082, 1410, -972, -2032, 1320, 1542, -487, -1225, -979, 2222, 1017, -2478, -579, 1320, 1143, -202, -2747, 839, 2735, -1319, -1538, -114, 1389, 1455, -2543, -1229, 2710, 222, -1349, -740, 497, 2148, -1032, -2166, 1057, 1080, -117, -1090, -934, 1825, 815, -1595, -776, 246, 1545, -1, -2223, 382, 1643, 205, -1202, -1651, 1606, 1822, -2002, -1270, 915, 1597, 189, -2728, -66, 3022, -535, -1611, -243, 868, 1593, -1810, -1592, 2003, 654, -648, -847, -410, 1938, -60, -1962, 471, 646, 454, -372, -1609, 1012, 1302, -786, -869, -447, 1483, 967, -2177, -535, 1292, 706, -795]
1613g95r55K613J413l946L2K184O71o01l078J786L183k616j331P86J105J318k734
1630i65r97K963k18q91n37k55K176m55k198R49N95J058r88k225K143J425j700
1647a20p55j74K223L98l489P86K433l50j113j839K350J867l185m96J797M36J70
1664I39k348M09L158j724j436O76K52J628j491j769K274J59m50m80j231K155O96
1681A417k248Q1L61J494k48k837J491K051j170j007p81K118J313l310p5K249j2
1698H87o01j937J067K531k237q40J278O4Q24j637o53K369n64j027K35m86J967
1715A240m19k446J412N07M03m88k136K036J603k099p27O63J443M86l222O88K756
1732A700j123j047q02J412J805k698o46J915J84k34j540J18K360j080q59K74q1
$$ y = [-795, -1750, 863, 2276, -1670, -1638, 546, 1217, 616, -2462, -676, 2507, -109, -1440, -654, 451, 1769, -965, -1962, 1001, 783, -108, -645, -900, 1276, 821, -1377, -428, 167, 1225, 237, -1988, 155, 1580, -120, -875, -1049, 1174, 1572, -1917, -1131, 1302, 952, -161, -2000, 350, 2217, -968, -1464, 333, 769, 939, -1409, -1000, 2158, 434, -1002, -326, -74, 1554, 63, -1706, 568, 727, 277, -203, -1434, 721, 1417, -831, -750, -389, 1105, 857, -1980, -489, 1562, 392, -615, -1396, 722, 2035, -1275, -1350, 899, 887, 286, -1651, -584, 1947, -290, -1130, 148, 212, 1036, -601, -1254, 1115, 551, -476, -241, -727, 1240, 821, -1625, -213, 294, 697, 209, -1927, 109, 1712, -387, -1114, -451, 992, 1478, -1744, -1056, 1700, 577, -470, -1272, 140, 1945, -753, -1399, 516, 700, 466, -1074, -956, 1404, 324, -535, -261, -342]
1749c42J432q09j680J761K6j35n4j533J859Q03k369N24M99P59Nk518J616J858
1767A702j874o06P5J211J279l144J82K468p31o06r24N59K203j902j147J565r3
1784B17N52j004j017J973Jq62l49l41J627K78k243P56Q36K45l68j887J428J866
1802A708k131m81P12R24O15k799P11K324j355q85j5O99J462k133p64K091k76m03
1820Do45k97K030n81j452P46o3J043m25j758J543O98p88k32j063J788J023k625
1838a054J26J237N31k86k314J179K479j891j083O54Q82R43k261m58K630q17q62
1855c65l43J30K106j430j411J784j70K02n84j122J938O2j224K24l58J414J11k406
1873a442J023J345m60o15j279J647J741k757m48J576M92Nk454P10K756j454j331
$$ y = [-342, 1090, 281, -1399, 362, 388, 253, 199, -1334, 525, 1328, -1041, -517, -18, 741, 746, -1772, -156, 1702, -172, -778, -703, 508, 1787, -1357, -1175, 1293, 562, -44, -968, -409, 1794, -108, -1255, 310, 217, 769, -235, -1252, 721, 722, -140, -489, -830, 797, 1075, -1168, -412, 424, 669, 301, -1586, -158, 1708, -423, -904, -192, 732, 1347, -1452, -741, 1583, 228, -657, -672, 27, 1489, -644, -1408, 683, 407, 4, -641, -938, 1092, 511, -941, -195, -258, 785, 360, -1398, 145, 843, 55, -177, -1240, 548, 1571, -1054, -928, 309, 840, 554, -1760, -581, 1898, 7, -1076, -422, 460, 1403, -858, -1316, 1314, 497, -365, -708, -578, 1528, 98, -1313, 471, 301, 503, -81, -1203, 735, 797, -427, -203, -561, 853, 964, -1442, -419, 926, 466, -149, -1428, 219, 1960, -797, -1245, 331, 823, 828, -1626, -916, 1840, 386, -945]
1890i45M22O07J218j722j141K309j09o88k97p02K066k69j875J043J89O72l93j772
1908a387J568J029j397j14l85J326O04k486M29J709l55k85j505J024J952k167
1924d40q11J321N77J84j889j63K693r30j392L46L33J440j140j854K085M81o92
1941A49l67r31K049L45k183K76N68Q45q0k221J135J960j304p71m91J420J205k579
1959i75k72K100k05k98j442O14K255j909j093J292K98O34j431r41K649n68j235
1976e27L14j77J263k79k230J749N01l51j69j312J484J345k199l03Q90Q56j46j949
1994a240M72K207j190o60n97J032J700k478n71J726J78j21j322j7K305r91j478
2011a045Q37L38O18p77j447K051K15j127Q3n62J553K51k071P45J045l78j62j311
$$ y = [-945, -523, 84, 1302, -420, -1561, 748, 639, -49, -346, -1048, 1018, 749, -1126, -83, 106, 778, 385, -1387, 181, 1210, -187, -301, -686, 640, 1244, -1242, -813, 896, 541, 256, -1249, -225, 1727, -440, -1251, 70, 647, 831, -1058, -1221, 1472, 542, -850, -504, -171, 1269, 129, -1725, 360, 841, 149, -218, -1149, 900, 1245, -938, -662, -94, 751, 671, -1550, -415, 1545, 241, -530, -1021, 399, 1604, -975, -1247, 853, 648, 350, -1092, -478, 1777, -132, -1225, 67, 365, 999, -432, -1373, 1276, 708, -527, -213, -390, 873, 594, -1636, 113, 614, 263, 94, -1218, 266, 1611, -588, -891, -1, 855, 709, -1240, -768, 1439, 249, -411, -1008, 24, 1724, -754, -1325, 401, 579, 458, -864, -881, 1424, 433, -1045, -208, 130, 748, -29, -1476, 575, 790, -337, -254, -816, 737, 988, -1083, -338, 707, 329, 167, -1144]
2029a144J125J629j848n80O98O53N89k145L4K239o78j032k03N51J530j624j247
2046a453J659L52L3j141o38K341m44j582N68LJ110l44k019J622Q95r27M5j005
2064i25J075J168k182K80J215l90J38j350M69J842j373q56N93O40O51j675m49
2081a129K015m50o18n80K35J765j001j481J427J04K24o05j175K103L9j676M96
2098c07K4R47J36k162J091J191p61n3r10Q19J619k213j71J216j42L37j460kK118
2117A317r43q86J89J68J089j088j012J629R8n04m84k21J510l15j615J059L97J3
2135D01k10j460J711M85j326J28j11R77L28k042N42J378p30q1p50M73J639j478
2153a26p22J166j68N01j015o09J912o22p68J11JJ266p86j293J390L50l84l12q04
$$ y = [-1144, -19, 1610, -238, -818, -120, 533, 1122, -1023, -989, 1250, 572, -460, -663, -112, 1418, -206, -1453, 206, 558, 591, -550, -1188, 1153, 709, -873, -305, -302, 808, 464, -1555, 67, 962, 35, 80, -925, 150, 1318, -864, -584, 631, 241, 379, -971, -502, 1340, -33, -889, -296, 344, 995, -680, -1129, 886, 436, -182, -762, -527, 1238, 237, -1244, 183, 287, 511, -94, -1269, 834, 873, -803, -307, -283, 664, 800, -1362, -271, 920, 159, 106, -804, 15, 1634, -579, -750, 466, 324, 661, -799, -801, 1317, 374, -512, -323, -155, 934, -154, -1166, 463, 561, 57, -427, -648, 862, 547, -1068, -9, 388, 401, 191, -1269, 442, 927, -399, -271, -382, 595, 923, -1119, -577, 801, 71, -10, -760, -287, 1352, -126, -848, 318, 150, 651, -364, -973, 939, 317, -451, -340, -339, 927, 141, -1152, 238, 588, 204, -108, -912]
2172i12J487L25j664N46K40L22J66j685J239R55j251m5j47N78R93j922O9J535
2190H29n94L1q54O0J794j283q30J079n6O51q87j127J764M1j043L08l04J173j93
2209E59j613R87N32k62rj076J194P63j567J85L83J35M79j533M42J326j025r9n7
2228b56R3J049j076p00J586o00J79o34k04J600p01j067Q11K7M61m04j315J552
2246D01K58r92P6j45Q66K45j448O02P69n12J00j048O32J305j323j82K37K54Q77
2265I72j487j42J418p10k23j34k14J560r98q40J211k10J03l18j005J629k25j012
2283f25M30N8N60m0j306R75O83p92J1m32N71O27j535M50P69k67L66j255L30J215
2303G93q59k67K13R0P04r74n33J331l74j21l18m37J305j61j121P69J8K69j19j036
$$ y = [-912, 575, 900, -764, -218, 22, 344, 510, -1175, 64, 1019, -232, -277, -424, 154, 1147, -775, -706, 829, 235, 266, -588, -528, 1266, -17, -847, 232, 176, 827, -60, -1187, 577, 618, -425, -117, -421, 752, 559, -1054, -67, 465, 203, 194, -882, 312, 1075, -492, -307, 76, 211, 690, -843, -401, 925, -100, -199, -256, -163, 886, -190, -890, 696, 96, 275, -359, -563, 1037, 336, -731, 80, 107, 568, 164, -1151, 401, 659, -333, -257, -402, 464, 709, -739, -137, 632, 120, 220, -828, -196, 1109, -214, -396, -159, 95, 972, -515, -657, 761, 51, -172, -306, -520, 1040, 42, -798, 413, 203, 306, -12, -1017, 612, 387, -625, -195, -137, 423, 383, -923, 52, 735, -57, -46, -478, 93, 720, -815, -365, 404, 137, 503, -752, -422, 793, -66, -333, -120, -30, 674, -300, -833, 498, 124, 3, -315, -752, 553, 392, -729, 40, 58, 327, 208, -828]
2323h28J041K65o88J37l47P62M99j656M87R15n70M9n49M57J055j354k4O53l15
2342a1N05j042N3J396q54m38L40j78J122q47p74J049m9k06j18p49J242J49j279
$$ y = [-828, 213, 478, -210, -73, -420, 342, 841, -815, -328, 587, 17, 66, -483, -26, 1029, -325, -349, 304, -11, 494, -548, -495, 901, 47, -391, -51, -229, 893, 46, -728, 321, 272, 66, -52, -801, 441, 590, -689]
$$ [...]
8191g
##END NTUPLES=NMR FID
##END=
