##TITLE=1H_4C1703-HF
 CDCl3
 8 sc, 
 17.3.2023
##JCAMPDX= 6.0         $$ Bruker NMR JCAMP-DX V2.0
##DATA TYPE= NMR FID
##DATA CLASS= NTUPLES
##ORIGIN= UXNMR, Bruker Analytische Messtechnik GmbH
##OWNER= root
$$ XWIN-NMR		Version 3.5
$$ Fri Mar 17 15:46:31 2023 Russian Standard Time (UT+4h)  she@DPX200
##.OBSERVE FREQUENCY= 200.13135
##.OBSERVE NUCLEUS= ^1H
##.DELAY= (6, 6)
##.ACQUISITION MODE= SIMULTANEOUS
##.ACQUISITION SCHEME= undefined
##.AVERAGES= 8
##.DIGITISER RES= 18
##SPECTROMETER/DATA SYSTEM= spect
##.PULSE SEQUENCE= zg30
##.SOLVENT NAME= CDCl3
##.SHIFT REFERENCE= (INTERNAL, CDCl3, 0, 15.7039)
##AUDIT TRAIL= $$ (NUMBER, WHEN, WHO, WHERE, WHAT)
$$ ##TITLE= Audit trail, XWIN-NMR		Version 3.5
$$ ##JCAMPDX= 5.01
$$ ##ORIGIN= Bruker BioSpin GmbH
$$ ##OWNER= she
$$ F:/spectra/data/she/nmr/H-F/1/audita.txt
$$ ##AUDIT TRAIL=  $$ (NUMBER, WHEN, WHO, WHERE, WHAT)
(   1,<2023-03-17 15:45:32.46 +0400>,<she>,<DPX200>,
      <created by zg, POWCHK disabled, PULCHK disabled
       configuration hash MD5:
       00 E9 B6 7A A2 85 ED C7 34 08 36 98 17 FE 4E 26
       data hash MD5: 16K
       8C 8D F0 EC 6E 05 35 66 DB A9 83 A6 94 F2 65 E1>)
$$ ##END=
$$ 
$$ hash MD5
$$ F5 1B B9 33 86 22 C8 FB 12 29 40 41 5D 73 71 37
##$RELAX= 
##$RELAX= 
##$RELAX= 
##$RELAX= 
##$RELAX= 
##$RELAX= 
$$ Bruker specific parameters
$$ --------------------------
##$DU= <F:/spectra>
##$EXPNO= 1
##$NAME= <H-F>
##$PROCNO= 1
##$TYPE= <nmr>
##$USER= <she>
##$AMP= (0..31)
100 100 100 100 100 100 100 100 100 100 100 100 100 100 100 100 100 100 
100 100 100 100 100 100 100 100 100 100 100 100 100 100 
##$AQSEQ= 0
##$AQ_mod= 1
##$AUNM= <au_zg>
##$AUTOPOS= <>
##$BF1= 200.13
##$BF2= 200.13
##$BF3= 200.13
##$BF4= 200.13
##$BF5= 200.13
##$BF6= 200.13
##$BF7= 200.13
##$BF8= 200.13
##$BYTORDA= 1
##$CFDGTYP= 0
##$CFRGTYP= 5
##$CHEMSTR= <none>
##$CNST= (0..31)
1 1 145 1 1 1 1 1 1 1 1 1 1 1 1 1 1 1 1 1 1 1 1 1 1 1 1 1 1 1 1 1 
##$CPDPRG= <>
##$CPDPRG1= <>
##$CPDPRG2= <>
##$CPDPRG3= <>
##$CPDPRG4= <mlev>
##$CPDPRG5= <mlev>
##$CPDPRG6= <mlev>
##$CPDPRG7= <mlev>
##$CPDPRG8= <mlev>
##$CPDPRGB= <>
##$CPDPRGT= <>
##$D= (0..31)
0 1.2 0 0 0 0 0 0 0 0.06 0 0.03 0 0 0 0 0.0002 0 0 0 0 0 0 0 0 0 0 0 0 
0 0 0 
##$DATE= 1679053531
##$DBL= (0..7)
120 120 120 120 120 120 120 120 
##$DBP= (0..7)
150 150 150 150 150 150 150 150 
##$DBP07= 0
##$DBPNAM0= <>
##$DBPNAM1= <>
##$DBPNAM2= <>
##$DBPNAM3= <>
##$DBPNAM4= <>
##$DBPNAM5= <>
##$DBPNAM6= <>
##$DBPNAM7= <>
##$DBPOAL= (0..7)
0.5 0.5 0.5 0.5 0.5 0.5 0.5 0.5 
##$DBPOFFS= (0..7)
0 0 0 0 0 0 0 0 
##$DE= 6
##$DECBNUC= <off>
##$DECIM= 32
##$DECNUC= <off>
##$DECSTAT= 4
##$DIGMOD= 1
##$DIGTYP= 9
##$DL= (0..7)
0 120 120 120 120 120 120 120 
##$DP= (0..7)
150 150 150 150 150 150 150 150 
##$DP07= 0
##$DPNAME0= <>
##$DPNAME1= <>
##$DPNAME2= <>
##$DPNAME3= <>
##$DPNAME4= <>
##$DPNAME5= <>
##$DPNAME6= <>
##$DPNAME7= <>
##$DPOAL= (0..7)
0.5 0.5 0.5 0.5 0.5 0.5 0.5 0.5 
##$DPOFFS= (0..7)
0 0 0 0 0 0 0 0 
##$DQDMODE= 0
##$DR= 18
##$DS= 0
##$DSLIST= <SSSSSSSSSSSSSSS>
$$ [...]
##$SUBNAM2= <"">
##$SUBNAM3= <"">
##$SUBNAM4= <"">
##$SUBNAM5= <"">
##$SUBNAM6= <"">
##$SUBNAM7= <"">
##$SUBNAM8= <"">
##$SUBNAM9= <"">
##$SW= 18.05172834244
##$SWIBOX= (0..15)
0 0 2 0 0 0 0 0 0 0 0 0 0 0 0 0 
##$SW_h= 3612.71676300578
##$TD= 16384
##$TD0= 1
##$TE= 0
##$TE2= 300
##$TE3= 300
##$TEG= 300
##$TL= (0..7)
0 120 120 120 120 120 120 120 
##$TP= (0..7)
150 150 150 150 150 150 150 150 
##$TP07= 0
##$TPNAME0= <>
##$TPNAME1= <>
##$TPNAME2= <>
##$TPNAME3= <>
##$TPNAME4= <>
##$TPNAME5= <>
##$TPNAME6= <>
##$TPNAME7= <>
##$TPOAL= (0..7)
0.5 0.5 0.5 0.5 0.5 0.5 0.5 0.5 
##$TPOFFS= (0..7)
0 0 0 0 0 0 0 0 
##$TUNHIN= 0
##$TUNHOUT= 0
##$TUNXOUT= 0
##$USERA1= <user>
##$USERA2= <user>
##$USERA3= <user>
##$USERA4= <user>
##$USERA5= <user>
##$V9= 5
##$VALIST= <valist>
##$VCLIST= <CCCCCCCCCCCCCCC>
##$VD= 0
##$VDLIST= <DDDDDDDDDDDDDDD>
##$VPLIST= <PPPPPPPPPPPPPPP>
##$VTLIST= <TTTTTTTTTTTTTTT>
##$WBST= 1024
##$WBSW= 4
##$XGAIN= (0..3)
0 0 0 0 
##$XL= 0
##$YL= 0
##$YMAX_a= 122021
##$YMIN_a= -122131
##$ZGOPTNS= <>
##$ZL1= 120
##$ZL2= 120
##$ZL3= 120
##$ZL4= 120
##$ABSF1= 10
##$ABSF2= 0
##$ABSG= 5
##$ABSL= 3
##$ALPHA= 0
##$AQORDER= 0
##$ASSFAC= 0
##$ASSFACI= 0
##$ASSFACX= 0
##$ASSWID= 0
##$AUNMP= <proc_1d>
##$AZFE= 0.1
##$AZFW= 0.1
##$BCFW= 1
##$BC_mod= 2
##$BYTORDP= 1
##$COROFFS= 0
##$CY= 11.3945322036743
##$DATMOD= 1
##$DC= 2
##$DFILT= <>
##$DTYPP= 0
##$F1P= 2.36226072786647
##$F2P= -0.459571619588291
##$FCOR= 0.5
##$FTSIZE= 0
##$FT_mod= 4
##$GAMMA= 1
##$GB= 0.15
##$INTBC= 1
##$INTSCL= 1
##$ISEN= 128
##$LB= 0.24
##$LEV0= 0
##$LPBIN= 0
##$MAXI= 10000
##$MC2= 0
##$MEAN= 0
##$ME_mod= 0
##$MI= 1.114404
##$NCOEF= 0
##$NC_proc= 0
##$NLEV= 6
##$NOISF1= 3.799351
##$NOISF2= 2.8
##$NSP= 1
##$NTH_PI= 0
##$NZP= 0
##$OFFSET= 15.70392
##$PC= 1
##$PHC0= -19103.18
##$PHC1= 10.20075
##$PH_mod= 1
##$PKNL= yes
##$PPARMOD= 0
##$PSCAL= 0
##$PSIGN= 0
##$REVERSE= no
##$SF= 200.130013532006
##$SI= 16384
##$SIGF1= 3
##$SIGF2= 2
##$SINO= 400
##$SIOLD= 16384
##$SREGLST= <1H.CDCl3>
##$SSB= 0
##$STSI= 0
##$STSR= 0
##$SW_p= 3612.71676300578
##$SYMM= 0
##$S_DEV= 0
##$TDeff= 0
##$TDoff= 0
##$TI= <>
##$TILT= no
##$TM1= 0
##$TM2= 0
##$TOPLEV= 0
##$USERP1= <user>
##$USERP2= <user>
##$USERP3= <user>
##$USERP4= <user>
##$USERP5= <user>
##$WDW= 1
##$XDIM= 8192
##$YMAX_p= 0
##$YMIN_p= 0
$$ End of Bruker specific parameters
$$ ---------------------------------
##NTUPLES= NMR FID
##VAR_NAME=  TIME,          FID/REAL,        FID/IMAG
##SYMBOL=    X,             R,               I
##VAR_TYPE=  INDEPENDENT,   DEPENDENT,       DEPENDENT
##VAR_FORM=  AFFN,          ASDF,            ASDF
##VAR_DIM=   8192,          8192,            8192
##UNITS=     SECONDS,       ARBITRARY UNITS, ARBITRARY UNITS
##FACTOR=    0.0002768,     1,               1
##FIRST=     0,             0,               0
##LAST=      2.2672688,     0,               0
##MIN=       0,             -122131,         0
##MAX=       2.2672688,     122021,          0
$$ Real data points
##PAGE= N=1
##DATA TABLE= (X++(R..R)), XYDATA
$$ [...]
1426D10m42j1N13k90n27O39k42m38N58Q8o79J76L14o80M39L62l62j59M52m41j72
1447d92P67k8m89N10lo60M88N36r32L46N44r11j01Q85k21n93Q38l30q08P94L54
1468D94q27L23M68j139J05J002m60k06R23r90o49J216j21o71R25qj199O32Q37
1487F55p45J47Q64j177m06J192m53n57J393p39j151J086K47r78Q55M80j601J06
1505g82J126r04J87J212q02r82J158j47n25J094l1j230L03P00o50L11R25j126
1523a63m24J101p12l36J287j07j124P69j80q52R65N11j070k27N70o23J44J344
1541H73o87o48N93k48m94R10M43q56l4M00p76K68J197o25l82K73n07l78J226K20
1561G68j000L13j65p20N51J013p70j76M24o55k42J305j74o02L66k59q37O58R24
$$ plain form
1426 410 -32 -43 470 180 -347 292 50 -388 170 258 -421 -245 69 -611 -172 190 -172 -331 121 -320 -492
1447 -492 275 247 -242 268 265 -395 93 629 -303 43 587 -324 -425 460 239 -354 484 154 -654 140 494
1468 494 -333 -10 458 -681 -576 426 -34 -240 683 -307 -956 260 139 -532 393 385 -814 -182 655
1487 655 -90 57 921 -256 -662 530 77 -480 913 174 -977 109 356 -622 233 713 -888 -782
1505 -782 344 -560 -373 839 37 -945 213 66 -459 635 604 -626 -323 377 -273 38 963 -163
1523 -163 -587 514 -198 -534 753 646 -478 291 111 -741 224 735 -335 -562 8 -615 -471 873
1541 873 186 -462 131 -117 -611 299 742 -114 -148 252 -524 -256 941 316 -66 207 -300 -678 548 768
1561 768 -232 81 -84 -804 -253 760 -10 -186 238 -417 -659 646 472 -130 236 -23 -860 -202 722
1580G22n72j39L91j085K8J238j66n30P20m58r33Q77P54r22L59K54j217P2J049
1599D42m03l15P19q31p98J285O1m31P90j24j413P61R76p99L85O12j018n36J098
1618D61k72l61R38k96j134M99N70n35N48K32j264O7N18j58J7O92m57r02O04J99
1638c4k63P90J28j137K61L73l39K97N98m71n79J82N5N2P19j80n80K1K57l40L19
1659A29M31n92j62M3j31lO43j1n95n8J02j80M37J99k70k21J10j44R7N16M2m33
1681e1N5J2j74J31M60l12p8O6l98K43M47j07m97L12k95k72K86O02m83j05J73m97
1703d82O4O50k45j41K78k99j62L72K72m26K29K09n34L87J25k96O8K33m79j43M67
1724A47P4n84M87n2n36K41N39k49q8K74m74q7L86k3m5R8K76o95L63K28k84J80
$$ plain form
1580 722 150 11 402 -683 -655 583 417 -113 607 149 -784 93 847 -75 284 538 -679 -607 442
1599 442 39 -276 443 -388 -1186 99 160 -271 519 395 -1018 -257 719 -80 305 917 -101 -637 461
1618 461 189 -172 766 470 -664 -165 405 -130 418 650 -614 -547 -29 -187 -170 522 65 -837 -233 -34
1638 -34 -297 493 621 -516 -255 118 -221 76 674 203 -376 -194 -139 -87 632 452 -128 -107 150 -190 129
1659 129 560 -32 -194 -151 -282 -285 358 347 -248 -306 -204 -384 53 252 -18 -239 -129 -273 -176 340 382 -51
1681 -51 4 16 -158 -27 433 121 43 109 -289 -46 401 294 -203 109 -186 -458 -172 430 -53 -158 15 -482
1703 -482 -418 232 -13 -154 124 -175 -337 35 307 -119 110 319 -215 172 297 1 69 302 -177 -320 147
1724 147 221 -363 124 72 -464 -223 316 67 -21 253 -221 -308 78 55 10 108 384 -311 52 280 -4 176
1746A76K11m27j30L96k23j59K79j43j87QJ52N1J24p1k49R2J13j44Q9J39k25q5
1768b13J89k52L17j91K17k18J97J12r0K35r9j29l9K6K8p5J39K7k58%J26J0r5j1
1792d7l3q3L60k59j77K02l9k11J41Q8m9J71M9r0p2K80j97k41K65np6P8Jj67J98
1817H7o3k28J45J61q2j02J1J62j75L29k81r2J58N5k74LL48l52J56J43j82n2L14
1840A89k49O2J85j44J6J5O2j61l7J38j79J0J22j41j39K51j20K6J37pm5J67j67
1863ik0K96j36j88R1j6M9k5O4j46pN5o6R9N1J5j3P7m3k47J40j24Q9N2j43L2Q9
1890A6R3k62PJ56J34j80L5N1q6P5k0n9K2J22l6P8r7J4j90K73r9J6J81r2k19J03
1916C6j08J5j55K42r0PR1j86J5K11q0o1J81j06k78L03J05j47o9O3p0l7K49k26
$$ plain form
1746 176 387 -40 -170 226 3 -156 123 -20 -207 -199 -47 4 128 57 -192 -100 13 -131 -42 97 -128 -213
1768 -213 -24 -276 41 -150 67 -151 46 158 68 303 204 75 36 62 90 15 154 181 -77 -77 49 59 -36 -47
1792 -47 -80 -163 197 -62 -239 -37 -76 -287 -146 -58 -107 64 113 23 -49 231 34 -207 58 53 -23 55 56 -111 87
1817 87 24 -204 -59 102 20 -82 -71 91 -84 245 -36 -128 30 85 -189 -186 162 -190 -34 109 -73 -125 189
1840 189 -60 2 187 43 59 74 136 -25 -62 76 -103 -93 29 -112 -251 0 -120 -94 43 36 -9 158 -9
1863 -9 -29 267 131 -57 34 18 67 42 106 -40 -47 8 -58 41 92 107 94 171 128 -119 21 -103 -14 38 -105 -73 16
1890 16 109 -153 -146 10 144 -36 -1 50 -36 39 19 -40 -18 104 68 146 49 63 -127 146 47 63 244 152 -67 36
1916 36 -72 -57 -212 30 -60 -53 38 -148 -133 78 -2 -63 118 12 -266 37 142 -5 -74 -11 -81 -118 131 -95
1940i5P8O7p5q3K19K4j42O5N0k54P5J55k54J71J69l70n3L14J3k02K48j73j66J56
1964f3J97o2j40J45k91K3K78k16J03K06k09j75L45Q7r6mr2k40J44lLl8J60j48
1988h6j16L17j20J0J74p0m31K56J16k60J87K84l85r9L51j26j21M69j69l55K53
2009G9rr7K37O2l43j87L64l14q6O37k48k72N6K8j82L92O1l02k7K14k42R6N59m03
2033G3j44M0jj18N35Pn62K20j0l53J75O04m76m4K17l05o7N65j18n40M63k82k82
2056d03M81K91m95J36Ql16J45M69l85j55M50k94l82P51qk66J20J83o41K73N14
2077D76l78j63K04m30m0M08K06n56M04p8m45L15K87j81L2K30o21J86K62k8j70
2098h0M23l66m70M92J83j21MM49q25O3M16k92J4L89k04m13M13k41pL63J89o33
$$ plain form
1940 -95 -17 50 -25 -108 111 135 -7 58 108 -146 -71 84 -170 1 170 -200 -253 61 74 -128 120 -53 -219 -63
1964 -63 134 72 -68 77 -214 -191 87 -129 -26 180 -29 -204 141 228 132 128 36 -204 -60 -63 -60 -98 62 -86
1988 -86 -202 115 -5 5 179 109 -322 -66 50 -210 -23 261 -124 -223 128 2 -119 350 181 -174 79
2009 79 70 -27 210 272 -71 -258 106 -208 -294 343 95 -177 -121 -93 -275 117 178 -124 -151 63 -179 -83 476 73
2033 73 -71 -31 -32 -150 385 392 -170 50 40 -313 -138 466 -10 -54 163 -142 -209 356 238 -302 161 -121 -403
2056 -403 78 369 -126 10 18 -298 -153 316 -69 -224 226 -68 -450 301 293 27 147 330 -311 -38 476
2077 476 98 -65 139 -291 -331 77 283 -273 131 53 -392 -77 210 29 61 291 -330 -144 118 90 -80
2098 -80 343 -23 -493 -1 182 61 65 514 -311 -248 168 -124 -110 279 75 -338 75 -166 -173 190 379 -254
2120b54QN92o32K21N32n24l15M40l4k35L76K1m44L63jk86K15K63m33o7M07l73
2142a60n3N22l51j96L29l2k86K95L11n39r8M68m60K54L49l50k96L98j08l34O44
2163C07J5m66J74J79m31L74J05k61j76K59k18k1L04o5k69J83mm56N24P5m10K35
2185d3J59m52Q1L92j89k12M91l08j68L27N4k48K01O9l18K34J43k25Q2N7j27j25
2207a25K93j31j82K89M6m65J74L36m17K94N2k04k18K88O8j95J33M3k93K24J82
2228A92l42J67K03l48Q8J40q4P0l6l0j36J86j7j51K20j70j34J24Q1o9P6j25l8
2251a33n8J78%r4J69j84N9J57j18j38L21N5q7l1M2l49J95P1k0k42K43J57l85J53
2275c9K2k0j29K29j67J99j33J6o9K41p2j58K15k54J19qM0j2j27K11p6j49K31j37
$$ plain form
2120 -254 -246 346 -286 -65 467 -57 -372 68 34 -201 175 196 -248 115 114 -172 43 306 -127 -194 213 -160
2142 -160 -213 309 -42 -238 91 59 -227 68 379 -160 -258 210 -250 4 353 3 -293 105 -3 -337 307
2163 307 322 -144 30 209 -222 152 257 -4 -180 79 -139 -160 144 79 -190 -7 -11 -467 57 132 -278 -43
2185 -43 116 -336 -255 137 -52 -264 227 -81 -249 78 132 -116 85 154 -164 70 213 -12 70 127 0 -125
2207 -125 168 37 -145 144 190 -275 -101 235 -182 112 164 -40 -258 30 98 -97 36 79 -214 10 192
2228 192 -150 17 220 -128 -40 100 16 86 50 20 -116 70 53 -98 122 -48 -182 -58 23 -46 30 -95 -133
2251 -133 -191 -13 -13 -107 62 -122 -63 94 -24 -162 159 214 127 96 138 -211 -16 55 35 -207 36 193 -192 -39
2275 -39 -17 -37 -166 63 -104 95 -38 -22 -91 150 78 -80 135 -119 0 -8 32 20 -107 104 28 -121 110 -27
2299b7NJ55r7m8P4k29J61M7k67L57j80O5jR0l9m8L5j16N3J29j2j89KJ49O6j64
2325b9K26j33j05K00q3m1j11K34j87Q1oq8K9r3L5m4K39p1j09j69L01j49r7K93
2349A23k59K51j86oO4k0p8L4J12Q6j3no0j6n9j4l5R4J15n3j39P2q0l4Q6M3q5o6
2377a28q4K97j35Q7k02qK26r7k1J06m3J04q8J26j21p1n7Q7R7r4K4q9J56j37P6
2402A1Mj05J85m5r0k11J52N4n9Mm2K55r4k4J62k93J62q4J62j00K12k72K23j11
2426E6o3n6K53j93J9j51J17j16OQ4l3J63k8j7l8j7q3J08j90J80nJ34k3k03K12
2451A16j26j0J68j64J56j4n4J02l37K31k4n7L1o1j50J87m7o2J29L3N5j70k5j4
2475a07L9J16l5j11o6J56M6N9N9j41k7R5n1p4N6J2o7j10K50k68K65J07k39p3R6
$$ plain form
2299 -27 -22 133 36 -12 62 -167 -6 41 -226 131 -49 16 15 105 66 18 53 -63 -10 119 107 -82 -80 69 135 -29
2325 -29 197 64 -41 159 76 35 -76 158 -29 52 46 -42 -13 -106 -71 -115 124 53 -56 -225 76 -73 -170 123
2349 123 -136 115 -71 -77 -13 -33 -111 -77 35 121 108 103 43 27 -32 -46 -81 13 128 75 -64 8 -72 -106 -20 23 -62 -128
2377 -128 -212 85 -50 37 -165 -173 53 -44 -65 41 -2 102 14 140 19 -52 -109 -22 75 -19 5 -84 72 -65 11
2402 11 15 -90 95 50 -40 -251 -99 -45 -104 -100 -142 113 19 -5 157 -136 26 -58 104 4 216 -56 167 56
2426 56 -7 -63 190 -3 16 -135 -18 -134 -128 -44 -77 86 58 41 3 -14 -97 11 -179 1 -4 130 107 -96 116
2451 116 -10 -20 148 -16 140 126 72 174 -163 68 44 -13 18 -43 -193 -6 -53 -115 14 47 102 -68 -93 -107
2475 -107 -68 48 13 -98 -164 -8 38 97 156 15 -12 83 32 -42 14 26 -41 -151 99 -169 96 203 -36 -109 -13
2500a3J0N6R0o9k97L12j47R2j5l3j9P5l5n0j96N47k45j75J53M3k31J58K00m05
2524a94L35O1k52LL23k51j04P3m9j34K74m5j19J47P5l39K36J6Lj24K05j84m3K64
2548A77q0j63N4M5l00L74M7j84Q7P6k93J43L27k55j62J09J0l09M77k42k1L04k88
2571f7j22J43P8J1KJ78l59q5L77j65J24j5J07l91J17K76k49J72L1k78q7L73k45
2594g4J50Or5j6j03Q1q8M55l04k74J47J89n4o8L31j36k08O3M5r3K94k86n3n5K68
2619A22j93qK19k51o6J64m4J7K89k81j76J68k3j13K34L2j83r5K03j39j5L51j92
2642B0j5O3m2j54J72J51k42J97k8k94J90J01j0k99K48j40m2J26M3k60J24K26k00
2665f5P7m8q2K7J4r5L8K23p8m6OK60l93K43R4j82N3J66k21j93L76n8j23J21l3
$$ plain form
2500 -13 -3 53 143 74 -223 89 -58 34 19 -14 -33 42 7 -43 -239 308 63 -112 41 84 -147 11 211 -194
2524 -194 141 202 -50 -47 276 25 -79 -6 -55 -189 85 40 -79 68 143 -196 40 56 59 -65 140 -44 -87 177
2548 177 97 -66 -12 33 -267 107 154 -30 57 133 -160 -17 310 55 -107 2 12 -297 180 -62 -83 221 -67
2571 -67 -189 -46 32 43 45 223 -136 -221 156 -9 115 100 207 -184 -67 209 -40 132 163 -115 -202 171 -74
2594 -74 76 82 -13 -29 -132 -51 -139 316 12 -262 -115 74 20 -48 283 147 -61 2 47 -46 248 -38 -91 -146 122
2619 122 -71 -79 140 -111 -177 -13 -57 -40 249 -32 -208 -40 -63 -176 58 90 -93 -188 15 -124 -139 212 20
2642 20 5 68 26 -128 44 195 -47 150 122 -172 18 119 109 -190 58 -82 -124 2 45 -215 -91 135 -65
2665 -65 12 -36 -118 -91 -77 -172 -134 89 11 -35 -29 231 -162 81 175 -7 46 212 -9 -202 174 116 -7 114 81
2690H1m51K27K37k30J40k10J69r9J30k26J19K96j03l24L29J3k64L32j73j97K38
2711C4%j1R4j79jL6J20j03L7J27j34j10J83oj31K47p4l92Q8J70J2P7l0k4o8J00
2737F2k6o0K06j82O1o3J63l35m2L72r8j18J51m1m7K0K6j56n1K04n5J17q0m8J38
2762A18j19k23R0K84j47r2k1K24q5R1J12k65m9J52k92K38N7o5r5J35q7l3Q7J58
2786A73k02o1m8J93j18j2J60j43p7%mJ31J45k42l9J98k8k46L57m81L83J31l2j98
2810f0qL9J52k45J42p3J03L0j77P0Ql6J40k78J94m2jN3O3m8K6k05J66Q6j84m9
2836a34J03Q4J46j99RJ4P1K4k48J33P6m2j4J7l5P3N6l20J64J58j0n3j7k4J71k21
2862a8R7k40J62k3k5j29J09J9K22j60l3J60p5L9r2q1J31j10J36k0o2L7R0l9j57
$$ plain form
2690 81 -370 -143 94 -136 4 -206 -37 -136 -6 -232 -113 183 80 -244 85 98 -166 166 -7 -204 34
2711 34 34 23 117 -62 -63 -27 93 -10 27 154 20 -90 93 87 -44 203 129 -263 -175 -5 7 84 54 30 -38 62
2737 62 36 -24 182 0 61 -2 161 -174 -216 156 58 -60 91 50 3 23 49 -107 -158 46 -9 108 28 -20 118
2762 118 -1 -224 -134 150 3 -89 -110 114 29 120 232 -33 -82 70 -222 16 73 8 -87 48 -39 -72 15 173
2786 173 -29 -90 -138 55 -63 -75 85 -58 -135 -135 -139 -8 137 -105 -144 54 26 -220 137 -344 39 170 138 -60
2810 -60 -68 -29 123 -122 20 -53 50 80 -97 -27 -19 -55 85 -193 1 -41 -42 11 74 26 52 -153 13 99 -85 -134
2836 -134 -31 53 199 0 9 23 94 118 -130 3 79 37 23 40 5 78 134 -186 -22 136 126 73 56 32 203 -18
2862 -18 79 -161 1 -22 -47 -176 -67 -48 174 14 -19 141 66 105 13 -68 63 -47 89 69 7 44 134 95 -62
2887f2K07l78J71L0L1j11k5M1J49j08J34k9o1%j8P4N9k50R1m1J46j32Q6j0mJ17
2913A07J8j59m5M6pj6j30J52m7k9J14m2K7K00k42mK00k5p6O4q6p1K14j4j43P3
2939G9j2n5M0N4k31J15J10M1k01P2j29j13J65N7q0J79jn6l7Q4j11J78j48o1J3
2964d8O5j5L2R1k9J9k07J32M0K4j2j05M4Q4p4m6Q9j69K14j47n6j03M0K43k2q4
2990@n4R7M9M0k44mJ90k17J39N1j9k07J96j41Q6K5J15j63K67j82%p7J13q8QN2
3016C2J26j47j25R0M6Q8j28P7l1J02n5q8J59l17O7L12L3j42J62l28j16K66L7o8
3040E2j37Q2M%O5Q2j87j54K57k08R2L6j29J30K29k87k11L78j8k59L09P3m26K35
3064HL6j33K32J2k57K1J18O5j9ork16J85r1N4J46j2l48J50J04j35R1O0j18mR5
$$ plain form
2887 -62 145 -233 -62 -32 -1 -112 -137 -96 53 -55 79 50 -11 -11 -29 45 104 -146 -55 -96 50 -82 4 -6 -10 107
2913 107 125 -34 -79 -33 -40 -56 -186 -34 -81 -110 4 -38 -11 189 -53 -57 143 118 42 106 20 -51 163 149 6 79
2939 79 67 12 52 106 -125 -10 100 141 -60 12 -117 -230 -65 -8 -88 91 90 34 -3 81 -30 148 0 -61 -48
2964 -48 17 2 34 125 96 115 -92 40 80 104 92 -13 31 115 41 -5 84 -85 129 -18 -74 -177 -137 106 84 0
2990 0 -54 43 92 132 -112 -116 74 -143 -4 47 28 -179 17 -124 -38 -13 102 -61 206 24 24 -53 60 -28 -20 32
3016 32 158 11 -114 -24 22 110 -18 59 28 130 75 -13 146 -171 -104 208 241 99 261 -67 -183 83 120 52
3040 52 -85 -3 1 1 66 148 -39 -193 64 -144 -52 -16 -145 -15 214 -73 -284 94 76 -183 126 199 -227 8
3064 8 44 -89 143 155 -102 -81 37 102 83 77 68 -148 37 -54 0 146 134 -214 -64 40 -95 -4 56 -62 -66 29
3090B9n8j6R1n4n1J49p5k15K13K28k84k9kJ98j00J39k6r0K9J1k02K06Q4k59J54
3115G0l3j09P0J63k10k3N5k83L19J06r5o7n1R6j01j0K40n5j14K9l5j01L23j81
3139CJ82J1k57m7K52K6k57J60r0k65J82K73m2j67N0l3o9K62k55J10L5O1k31J39
3163C3M8K4j81J75k12k6L57l35K2R0L5J1l1J34m3q0olj48J03R4j35J59j80n4K34
3189H5R4k04O6K2q5p6J93n3r5J89m8p7J8qq4K17l5j98oK18k56O4K81l10K5l7k8
3216a28K7J05K12j94r6nj64K78q5j10o6L87j79J68J3p0k42K91k43J9J61L6l52
3239b37J37L9m2K1J3K17j23L9j54O7J07j65K6L9M6l8j57K80j01r1m7M7R5P4j0
3264H2j18k8l9k9K79o9L3o1j40Q7R6p8Kml7J17k15J66K0L3k2k14J76R9q8q2j2
$$ plain form
3090 29 -29 -45 46 -8 -59 90 15 -200 13 241 -43 -72 -74 124 24 163 137 47 76 87 -115 91 175 -84 70
3115 70 37 -72 -2 161 -49 -72 -17 -300 19 125 30 -37 -88 8 -93 -103 137 82 -32 -3 -38 -139 184 3
3139 3 185 196 -61 -108 144 170 -87 73 -17 -282 -100 173 131 -36 14 -19 -88 174 -81 29 64 125 -106 33
3163 33 81 105 -76 99 -113 -139 218 -117 -95 -5 30 41 10 144 101 21 15 12 -136 -33 61 -74 85 -95 -149 85
3189 85 179 -25 41 63 -22 -98 95 42 -53 136 88 11 29 21 -63 154 119 -79 -85 133 -123 -59 222 -88 -63 -100 -128
3216 -128 -101 4 216 22 -74 -79 -243 35 -50 -160 -226 161 -18 150 163 93 -149 142 -101 -82 79 115 -237
3239 -237 -100 -61 -103 -82 -69 148 25 64 -90 -23 84 -81 -55 -16 30 -8 -165 115 14 -77 -124 -77 18 92 82
3264 82 -36 -64 -103 -132 147 78 111 50 -90 -3 93 15 17 13 -24 93 -122 44 64 97 75 -139 37 136 48 -34 -46
3291d6o7N9J17K6j21J21k25K29j72l3J51J07j85r6J56K60j83j43q5J03oJ0K78
3314B55l30N3J91o6j18K6oJ10j76J31j67K17qj50K21j9J1j50rK4j0m5n4J7q4J49
3340A3O6m7L9j9r5o1K34k26K73j86J2o6JJ05kP5n7l9n2J47j08j51J27J69j33Q4
3366A03Lp2l0j7m3Q3j35J39j2p0r9J82p9Q2n8p9J76M4n9k08O4K85k08K0J4J12
3392A38j37K11l7k42J48o4L8q3J84j70Q8O6l84J74N6q2K4q2J09L8j0l2P9l5ll8
3418d6L9P1J32k40r7K0M3J41pj50k8N0J83k82L23j59k00J38K14k93K77k09J3J13
3442D6j07J16k2l2n6J00M6j09j11J44J7p5M7o1oQ7R0r8j04j4N3n2K6J81j66n3
3468a13N9pJ4O6k00J93p1j36K47j13J06N3j87nJ61o1L4j14M7P5m0J8j4r8J71J23
$$ plain form
3291 -46 -113 -54 63 89 -32 89 -136 93 -79 -112 39 146 -39 -135 21 281 98 -45 -130 -27 -33 -23 255
3314 255 -75 -22 169 103 -15 11 5 115 -61 70 -97 120 112 -38 183 164 175 25 16 40 30 -15 -69 -52 -136 13
3340 13 79 32 71 52 -43 -104 130 -96 177 -9 3 -63 -62 43 41 116 59 20 -32 115 7 -144 -17 152 19 103
3366 103 106 34 4 -13 -56 27 -108 31 19 -51 -150 32 -47 35 -23 -102 74 118 59 -149 -85 200 -8 12 26 138
3392 138 1 212 175 -67 81 17 55 -28 156 -14 74 140 -244 -70 -14 -96 -72 -154 -45 -7 -17 -49 30 -5 -8 -46
3418 -46 -7 64 196 -44 -141 -121 -78 63 56 -94 -122 -72 111 -171 152 -7 -207 -69 145 -148 129 -80 -67 46
3442 46 -61 55 33 1 -55 45 91 -18 -129 15 32 -43 4 -57 -63 24 114 16 -88 -102 -49 -101 -75 106 -60 -113
3468 -113 -54 -61 -47 19 -181 12 -59 -195 52 -61 45 98 -89 -94 67 6 40 -74 -27 48 8 26 12 -86 85 208
3494B08l83J89J41j30J10j77N9n8j34L58j51%N0k3j30J51k86K68J7j61P2L8k2
3517FK9l5L3J4j67L46k52K64k84l1jK43k82O9Q8P0j24l0L9j02N6L8k9r9J91p9
3543b9J45o9M9k22K39j7Jj7Lq5q3L25j66j9k2l6o3P0N6l9j46M10m97J11J84r1
3569hJ11p1j27lJ69j4l7M9R4l04J57j13j22K20K09k69j2M3P2lJ01m9k89L93k49
3594e2n4K02p2k23J55M9n3L9Ll4j81K92k11j04P9J25J7J4O2m0J27j61oL3K2j10
3620h2L2R7L2j40p7K91j76k5Lj9j8J92k76M4J72j18Q8P1j91j23K83j9Jj31J56
3645F7j15K0K90k27j52K14m0j45K03N0k57J58L0k19Q3K08l05J26J62j01m9R4L1
3668A26q5L3M7k24J06O0l5K7j17O4j01J64n3j2J33l20K05J03k7k36K28m5j08o9
$$ plain form
3494 208 -175 14 155 25 135 -42 17 -41 -175 183 32 32 82 59 -71 80 -206 62 79 -82 -10 28 6
3517 6 35 0 33 47 -120 226 -26 238 -46 -77 -78 165 -117 -48 40 110 -14 -44 -5 -107 -51 -13 -42 -141 50 -29
3543 -29 116 47 96 -126 113 96 97 80 83 -2 -85 240 74 55 33 -3 -66 4 60 21 -125 285 -212 -101 83 -8
3569 -8 103 32 -95 -98 71 57 20 69 163 -141 16 -97 -219 1 210 -59 -71 -28 44 41 142 93 -196 197 -52
3594 -52 -106 96 24 -199 -44 5 -48 -9 -6 -40 -221 71 -140 -244 -165 -40 -23 -9 53 13 140 -21 -27 6 28 -82
3620 -82 -50 47 79 -61 -138 153 -23 -48 -45 -64 -82 110 -166 -122 50 -68 20 91 -100 -223 60 41 42 -89 67
3645 67 -48 -28 262 35 -117 97 57 -88 115 165 -92 66 96 -123 -40 168 -137 -11 151 50 1 95 126
3668 126 41 74 121 -103 3 63 28 55 -62 2 -99 65 12 0 133 -187 18 121 94 -142 86 41 -67 -136
3692a36K43k06P0J00j01r3J32j5jq6k2K57j54J78j50M1J29n4l13J45j27Q6J27
3715E0j69N1J52m0k47J79m6K7LJ25j42J04P6q5k79K94j26J27q5J42ll50L13j71
3739a00J40mM6j30P5N2j77J12j65n7K37O1q1J12n7j99L9K85j46j7j35J23J19j55
3763b2R6j05RO4j68J11n3L9N1k4P8j23pR2j30O2J24l68L06l7Oj20P5O5O4k31J01
3790d5J81j88J64q4q1n8J32j04NpJ69j32J24P1m0j02nJ73j59r5K15j06l4J5r6
3815h7O0m3J69j52O9j7k49K10m7J97j55J6j05K06k25J83p9j2KO4P6Q5r6j93P1
3840e2K15k58J68k44J11N3K0L8j50J44j64J50j0k1m5j4O0L1m9J65k52J7J24L0
3864F7j15Mm8M5m8rJ56j4m9j62L55k76j49K30N6o7k9J22j51J89n5P7l67k7L66
$$ plain form
3692 -136 107 -99 -29 71 -30 -123 9 -6 -7 -93 -115 142 -12 166 16 57 186 132 -181 -36 -163 -77 50
3715 50 -119 -68 84 44 -203 -24 -70 -43 -40 85 -57 47 123 38 -241 53 -73 54 -31 111 108 -242 71 -100
3739 -100 40 36 82 -48 27 79 -98 14 -151 -208 29 90 9 121 64 -135 -96 189 43 26 -109 14 133 -22
3763 -22 74 -31 -22 42 -126 -15 -68 -29 22 -2 76 -47 -54 38 -92 -30 94 -274 32 -5 1 -119 -44 21 85 -146 -45
3790 -45 136 -52 112 28 -53 -111 21 -83 -78 -85 84 -48 76 147 107 5 0 173 14 -81 134 28 -6 9 -87
3815 -87 -27 -70 99 -53 16 -1 -250 -40 -87 110 -45 -29 -134 72 -153 30 -49 -61 -59 5 81 166 70 -123 -52
3840 -52 163 -95 73 -171 -60 -7 13 51 -99 45 -119 31 21 0 -45 -59 1 32 -17 148 -104 -87 37 67
3864 67 -48 -44 -92 -47 -95 -104 52 38 -11 -173 182 -94 -243 -13 43 -24 -53 69 -82 107 52 129 -238 -265 101
3889A01Pj06K0p2J09m5K2k7M5l3j12K28k51Q5Q0%j29J01J28o9n8J46j67l5M9m
3915A3J18j60J45p3r5m8J0J12p4m3J30j20j2Q6n7J3J7K8k3J17o4N7o5L2J4j85
3941a27J24k5Q1n5m7mJ02q6p8J82o0N8j52q0m0K40m7ko4J81nj47r3J66m4J53j00
3968C1k3RR8j48j04J99o9R4j6N3Ko3n1k84K87j47R3j06J90j13K6J3J10j79J97
3993I9o2p4J33o4q7M6J60j69J3Q3m5qp6J34L4k24J58q4lN4q9r0K22j37p4o0J93
4020a7MJ46Jq8k52K73m8j9L9j30j0Q3J32j71J29n0j23l8J90Mk9J08j34j9m1J38
4046G8j69L1L1r9R9j0o2jJ74k9k43L77k63l3J54m4j61K22j49K10r8Ro2nJ99j94
4072c8O1r1J95k73J83J30l54K64p8j20K4M2m4J07p6J09K8o7m3m3K29k27P6J24
$$ plain form
3889 101 108 2 22 -50 59 14 36 9 54 21 -91 137 -114 -29 51 51 -78 23 151 82 24 170 3 -32 17 13
3915 13 131 -29 116 43 -52 -100 -90 22 -52 -95 35 -85 -97 -11 -68 -55 -38 -10 -33 84 20 77 12 44 58 -127
3941 -127 -3 -28 53 -2 -49 -53 49 -37 -115 67 7 65 -87 -167 -207 33 -14 -16 -80 101 96 -51 -144 22 -22 131 31
3968 31 8 17 115 -33 -137 62 -7 87 71 124 126 63 12 -272 15 -132 -39 -145 45 -68 -42 -29 81 -98 99
3993 99 37 -37 96 32 -55 -9 151 -18 -5 78 33 25 -51 83 117 -107 51 -33 -36 18 -71 -161 61 -76 -150 -210 -17
4020 -17 -13 133 134 46 -206 67 19 0 39 -91 -101 -18 114 -57 72 22 -101 -139 51 55 26 134 0 -19 -60 78
4046 78 -91 -60 -29 -128 -29 -39 -101 -102 72 43 -200 177 -86 -119 35 -9 -170 52 -97 113 15 24 -38 -43 156 -38
4072 -38 23 -68 127 -146 37 167 -187 77 -1 -121 -97 -55 -99 8 -68 41 69 2 -41 -84 145 -82 -6 118
4096A18O2j30M6M3k41No6K15J2j37M5m5J26K03k79p2J93q3k9O3j20q5K03k8k49
4121b30K43o9R6J66j36L6q0o8l2Q5J2J68j31m0j37J37M1N0k80L07q1j82Q0N0K6
4146C1k2R7k37l4J89J07k23OPQJ51m1n2k58L93j91K28k18P6K3lJ44k26M9l7r6
4172a29Q9Qo7O4o0N1j5R4o0j35J11j4R5J51j62k5o0J49k75J44K92k24k4J17k77
4197a62J74j7J20o5j14J32j24Q7l3r9N4p5o5K36k3L5Pm6n1Qj08K02M3o9j02J75
4223A20j73K20r5L3j6M8k60J52P1j58M25l79m1P2R0k20L9J85j92r1K32r2l1R8
4247C7k52N2J21K2k9J26p4M9j56J26L6j4Q1j06J8Ml5jr2n4l8N4J92L3j66Q6j01
4274h1J41j67p1K22j33K12k80R7Q8p5J4L4J00j42P2p9m3J12j79R3Q6o7n1P6Q1
$$ plain form
4096 118 180 50 96 139 -102 -97 -163 52 64 -73 -28 -73 53 256 -23 -95 98 15 -14 49 -71 -156 47 19 -230
4121 -230 13 -56 40 206 70 106 26 -42 -74 11 23 191 60 20 -117 20 61 111 -169 138 57 -125 -45 5 31
4146 31 9 106 -131 -165 24 131 -92 -86 -79 -71 80 39 -13 -271 122 -69 159 -59 17 40 37 181 -45 4 -33 -129
4172 -129 -40 -32 -99 -35 -95 -44 -59 35 -25 -160 -49 -63 32 183 21 -4 -64 85 -190 -46 246 22 -2 115 -162
4197 -162 12 -5 115 50 -64 68 -56 31 -2 -101 -47 -122 -187 49 26 61 68 22 -29 -21 -129 73 116 47 -55 120
4223 120 -53 167 72 105 89 137 -123 29 100 -58 367 -12 -53 19 109 -111 -72 113 -79 -170 62 -30 -61 37
4247 37 -215 -163 -42 -20 -49 77 3 52 -104 22 58 44 125 19 37 41 6 5 -87 -141 -179 -125 67 100 -66 20 -81
4274 -81 60 -107 -178 44 -89 123 -157 -60 28 -47 -33 1 101 -41 31 -48 -91 21 -158 -65 21 -46 -97 -21 60
4299F0J1N7k48pM5L57m05R7n0J09L6j23J1k0J53N1j68n5J86j28J16j66J47K6j10
4324a8j5M7m2k9R6Mn2r9R4J73j95N1j38K8n8J19Q6o0K8LL2r5j45J99j27O7J50
4351A04p5j28J45M3j88R1J37k22J54K4L3o0j1n8J5O1j55J63k86L84o2J3k21J93
4375I4j76K9j10L26j93n4P4q7J41p3P5j31R8N7j56J3M7P1o4L4N8j29J78j69J33
4400H6r8J58j84q4O0J40P7r3j86j1K69r5K2l7l7J7l6K27k86J71m2ok8J7n9K30
4426A92j39M7j26L9p2L8P2p8nR9q9j22J07J69r9J7o1L3N8r3Q2m4R5j68pJ08P7
4453A30k23O8R8q7j2Q0j37N3o3n7K85j47N4j34K23k79J53P7j61Q3j82K42j07l4
4477g7J45j63K06q4J44k97P9O5O2j20O4M7k22R2K05l20J30J30oo4J01k05J00K0
$$ plain form
4299 60 71 128 -120 -127 -82 275 -130 -33 -83 26 62 -61 -50 -70 83 134 -34 -89 97 -31 85 -81 66 92 -18
4324 -18 -33 14 -28 -57 39 43 -9 -108 -14 159 -36 15 -123 -95 -153 -34 52 -8 20 23 55 -40 -185 14 -113 -46 104
4351 104 29 -99 46 89 -99 -8 129 -93 61 85 118 58 47 -11 4 65 -90 73 -213 171 109 122 -99 94
4375 94 -82 -53 -163 163 -30 -84 -10 -97 44 -29 46 -85 13 70 -86 -73 -26 45 -19 15 73 -56 122 -47 86
4400 86 -12 146 -38 -122 -62 78 155 62 -124 -135 134 39 61 24 -13 4 -32 195 -91 80 38 32 4 21 -38 192
4426 192 53 100 -26 13 -59 -21 51 -27 -32 67 -22 -144 -37 132 33 50 -11 22 80 -13 69 25 120 -48 -55 53 130
4453 130 -93 -25 73 -14 -26 54 -83 -30 -93 -150 135 -12 42 -92 131 -148 5 82 -79 4 -178 64 -43 -77
4477 -77 68 -95 111 27 171 -126 -47 18 80 -40 24 71 -151 -59 146 -174 -44 86 80 16 117 -88 12 32
4501C2m5Ql4J79j14l9r6J32k6rR2M7o7k75J20L47k38q5K11k02J17o8Q2oj16J47
4527I4l07J80K23k39J66k19O1K87k49J3Q5o5k8r6Q6m1q6J09o3K03r0O0p5J35j76
4552c2L4J33k07J19j17J89k9j00K1j59R1n2O3n5K31k50J42n1j7k3L4n9K7q0K44
4577I7k5n8n9J24Q8k38J04Q5k29J04o4M8L3r3J18p9Q2j72K87j26l1j62O6k6P3
4602e3J28l6j32J22m8K9N9JO9j53J29k16J31o7o6M4K24j78p9J26K0K3lJ6o1j6
4628A3j37J25m8Q6j11L9m0n9j3J12j5m4N0J94k96r4Q5R9MJ57j95J86j61L7KJ8
4654fj9k0J44j18K33r0j34j54K23l0J3o7p7J22n3j18K86l19K31j7j79P1P7j03
4678a04J61Mmj09J81o3J14k81jk3J91k07k4p1K78p9L2n8j45L26p2n8L5k2K9k2
$$ plain form
4501 32 -13 -5 -39 140 26 -13 -109 23 -3 -12 80 127 60 -215 -95 252 14 -71 140 -62 55 -13 69 63 -53 94
4527 94 -213 -33 190 -49 117 -102 -41 246 -3 10 95 30 2 -94 -8 -49 -135 -26 -89 114 24 84 9 144 -32
4552 -32 2 135 -72 47 -70 119 90 -10 11 -148 -57 -109 -46 -101 130 -120 22 -29 -46 -69 -35 -94 -67 -147 97
4577 97 72 14 -45 79 167 -71 33 118 -111 -7 -71 -23 10 -83 35 -44 38 -134 153 27 -4 -166 -100 -126 -53
4602 -53 75 39 -93 29 -19 10 69 70 139 -14 115 -101 30 -37 -103 -59 165 -13 -92 34 54 77 74 90 29 13
4628 13 -124 1 -47 39 -72 -33 -73 -132 -145 -33 -48 -92 -42 152 -144 -238 -153 -54 -50 107 -88 98 -63 -26 -24 -6
4654 -6 -25 -45 99 -19 214 124 -10 -164 59 29 42 -25 -102 20 -33 -151 135 -184 47 30 -149 -78 -1 -104
4678 -104 57 61 57 -52 129 66 180 -101 -102 -125 66 -141 -165 -236 42 -37 -5 -63 -208 118 46 -12 23 1 30 8
4704HrN7N4j65N2J22k71J43J88l26J76j72O0k7K02j59p8L25m4j21M4j70J68j19
4728f2J06j14J1P2p4N6J54o3j06O9M0l3q8j4J17N4n5j5m3N6p2J33j25j44J81J7
4754E8k0j5q5O2m8j02J54j61J36jm0j9J51n5P8ok03R4L8P6q1r5J05M5k35K13Q1
4781A25N5k92K08j71K02r8J27l86K30q3N1j03J9N0LO1O1q7j86K57j77K53j0N4
4805A63j98K71k04o4k9K4Jj08J91p1o0l6M2J25j20l0K26k98J48o0J8M4k1K4k9
4830e1L3Q8n3j46J83p1p0J3P6Qk0N0j07N1K67k95M2%P1pL5m6o1j2K08k19J69r2
4858D4l5J4M5L2q3qJ3q0J81j13j5j58O2oJ68l5l5j62K48k28K53q2L6O4m7o8j67
4885a62K68k14R9j54J90O9j32J86k41o3J46L1J08j25Oj6o7m4K13Nk30J29R8p8
$$ plain form
4704 8 -1 56 110 -55 -3 119 -152 -9 179 -147 29 -143 -83 -110 92 -67 -145 180 136 15 59 -111 57 -62
4728 -62 44 -70 -59 13 -61 -5 149 86 -20 49 89 56 -32 -46 71 125 70 55 12 68 -4 129 4 -140 41 58
4754 58 38 23 -62 0 -48 -150 4 -157 -21 -22 -62 -81 70 15 93 87 -116 -22 16 92 11 -84 21 66 -169 44 125
4781 125 180 -112 96 -75 127 29 156 -230 0 -83 -32 -135 -116 -66 -63 -2 59 -28 -214 43 -134 119 109 163
4805 163 -35 236 32 -32 -61 -37 -36 -144 47 -24 -84 -120 -78 47 -73 -103 123 -175 -27 -87 -69 -25 -46 -22 -51
4830 -51 -18 70 17 -129 54 -17 -87 -74 2 10 -10 40 -67 -16 251 -44 -2 -2 69 62 97 51 -10 -22 186 -33 136 44
4858 44 9 23 68 100 17 9 22 -58 123 10 -5 -163 -101 -107 61 26 -9 -171 77 -151 102 20 56 120 73 5 -162
4885 -162 106 -108 -9 -163 27 96 -36 150 -91 -154 -8 23 131 6 12 -4 -71 -115 98 103 -127 2 100 22
4909B2J53k80L0J25j42Q9K03j59J53l59J02J29N0j29J4r1nJ45q3kl2M6j27J35
4933a3n6K3J10K5m9L3j52J65L9l5k11J88l7J0L5j3r5k3J34L1J9l59J37n7J73J7
4959C9K8p6m3NJ22o8L2j41J33Q1n8j50J08L8j11P9J29j88j49K21l4R0l4j48O3
4984c2K8l5J99j40K2r9jJ52q9J7K1j08O1m9J1J05o8PO1j15J28q4P3p3J0qOJ25
5012A25j14J43j73j7J2Q4N5k24K54k68J81r0j08P3J94j43K1r2J62j14R8j50K18
5035A27l1p4j71J90j83N2J64J15j11K2M6l86J97L4j10P2J24ql8Mq7O1o7mK39k35
5061e8K15k99J6K98j17q4J24k24J02J5n3K10p6o9N7j18Q3m5Q0M2k01OJ85p0J0
5086B9J51k59J96q5P2l37K53j06J8Q1j33K01j40J13K7j53m0J19PM5p6n7j5J08
$$ plain form
4909 22 175 -105 -75 50 -92 -3 200 41 194 -165 -63 66 116 -13 1 -90 -95 50 -33 -35 -67 -21 -148 -13
4933 -13 -69 -46 64 89 40 73 -79 86 125 90 -121 67 30 40 75 62 -33 -56 78 109 128 -231 -94 -151 22 39
4959 39 67 -9 -52 -47 75 7 39 -102 31 112 54 -96 12 50 -61 18 147 -41 -190 31 -3 87 53 -95 -32
4984 -32 -4 -39 160 20 42 -57 -58 94 5 22 43 -65 -4 -53 -42 63 -5 2 63 -52 76 -8 65 -8 2 -6 0 125
5012 125 11 154 -19 -36 -24 60 115 -109 145 -123 58 -32 -140 -67 127 -16 5 -87 75 -39 59 -91 127
5035 127 96 22 -149 41 -142 -90 74 189 78 100 146 -240 -43 -9 -119 -47 77 69 31 35 -52 9 -58 -62 177 -58
5061 -58 157 -142 -126 172 55 -29 95 -129 -27 -12 -65 145 69 0 57 -61 22 -23 57 99 -102 -96 89 19 29
5086 29 180 -79 117 32 104 -233 20 -86 -68 13 -120 81 -59 54 81 -72 -112 7 14 59 -17 -74 -89 19
5110A9M3nm6M8j06N4j58J01P2j1lO8M9j00j09K7R7j72K70l07J77J58j21J14j70
5135a1J1J7kj9J11p1O4m8j42J27k17K80j70P1rn6L4k03K78l7qj07K7J0J3m7L0
5162g4J00nj49P5K9M9p0M4J70j73m1lN6O1Q8k29k6R4j21J71j26M5J24j07p2J31
5188D1p9j6o5J34lP8m3R8k42r2K88k84R1P6J40J12k22K4K7n5k8K9K9m3q2Q8J5
5215A6J5j30J20K4j88N4P2N7L9p2K7m5%N3p6O5j3J67o7lr6MJ0k03K48j00j4K8
5243hq3J32k12J27J30r3j99K35J20k61OQ5j78K43O3l09K14j28L0j03J17O4o9J70
5267I3j42J13j72K41o4j78N9N6K3q4j06J70M5j27M4J40p2m6N3N6Q3j82J6l4mJ11
5293I2L1j48Jk8L9k5O2n3J48N4j57j57J1J65K06k68n5n4J43J6k52K87M0j91L4
$$ plain form
5110 19 62 57 11 59 -47 7 -151 -50 22 11 8 76 125 25 -84 -57 40 -132 138 -169 8 166 45 159 -11
5135 -11 0 17 15 -4 107 36 100 52 -90 37 -180 100 -70 1 -8 -64 -30 -233 45 8 0 -107 -80 -70 -57 -104 -74
5162 -74 26 21 -128 -53 -24 25 -45 -1 169 -4 -45 -48 8 69 157 -72 -98 -4 -125 46 -80 -35 89 -18 -90 41
5188 41 -38 -54 -119 15 12 90 47 145 -97 -189 99 -185 -94 -18 122 234 12 36 63 8 -20 9 38 -5 -87 1 16
5215 16 31 -99 21 45 -143 -89 -17 40 79 7 34 -11 -11 42 -34 31 18 185 118 115 19 23 33 -170 78 -22 -36 -8
5243 -8 -91 41 -171 -44 86 -7 -206 29 149 -112 -106 -21 -199 44 107 -202 12 -116 -86 -189 -72 -8 -77 93
5267 93 -49 64 -108 133 69 -109 -50 6 29 -55 -161 9 54 -73 -29 111 39 -7 46 102 185 3 19 -15 -19 92
5293 92 123 -25 -24 -52 -13 -38 24 -29 119 173 16 -141 -130 35 241 -27 -82 -136 7 23 -229 58 98 -93 -59
5318e9J27Kq4J9k0P5n5J2O0k39M2J76rj38R1L7L6r9M3P1j29Mj20J19K16k59J17
5345C6o0r8J20k4P0k55NJ53n1J66Rr5N4K7J01p4r5Oj00O8qJ5J02j71J37J36j55
5372A9k5L1k0pK8j44P7O9j49Q4NJ92j40jR6j57r4n2J96k3r3P6J5O3j45M8j07J53
5400eJ01o4J67k03J07Q8k07J62j71j31J25nK3l6k11J40J36k3M6k8o3L1Q1j65J93
5425H8j06N3o7M9K7O8l8k47J38J50r5o9O7j03RJ69o7M4j10j2J50j59l6J01p0p
5451g3kK6K5O2m7j14M0J34J26p5o9o9J71N7l79Q6J79o8j2M3L2r0L3l6J07j74K40
5478A53j29m0N8m2M4O5k70J67N2J2o7O4k9k38J53k5Q7j53L5J26N8Lp5k2N6L0J65
5505B38k01j71J64k36J83Q7r4J58j40o9l0N8J57k02J33j96J84q8N6J29%j41j1
$$ plain form
5318 -59 68 70 -14 5 -15 60 5 17 77 -162 -120 56 47 -91 0 37 73 -26 17 88 -41 -37 -157 -38 178 -81 36
5345 36 -24 -122 -2 -26 44 -211 -206 -53 -104 62 71 -24 30 57 158 84 -11 -5 -105 -37 -45 -30 72 -99 38 174 19
5372 19 -6 25 5 -2 26 -118 -41 28 -121 -37 -32 160 20 19 115 -42 -136 -188 8 -15 -108 -32 -17 46 -99 -51 -158 -5
5400 -5 96 32 199 -4 103 191 -16 146 -25 -156 -31 -36 -13 -49 -260 -120 16 -7 39 11 -52 -21 60 -105 88
5425 88 -18 35 -32 17 44 112 74 -173 -35 115 20 -49 18 -85 -76 93 26 70 -40 -52 98 -61 -97 4 -66 -73
5451 -73 -75 -49 -24 38 -9 -123 -83 51 177 102 33 -36 135 192 -187 -101 78 10 -2 41 73 -17 16 -20 87 -87 153
5478 153 24 -16 42 0 44 109 -161 6 58 70 3 67 38 -200 -47 -72 15 -138 -103 23 81 84 9 -13 43 73 238
5505 238 37 -134 30 -206 -23 64 -30 128 -12 -81 -111 -53 104 -98 35 -161 23 -65 -9 120 120 -21 -32
5528c2J6J09j1Pj81l7P4q4J24rL4n1J0n4J9Q1j12K60o2n1j58J79j07J47k07Q0
5554a6J91n2J5%p0j12j38J52p3J05R1k1M3o1k28K29r7P5k6Mn3J83k88J61K44m46
5580a88M4L7M7K50k30NN8Qp0K12j72L0m3Q7J14J30l12l0M1Q3R4r9j63O5M8o8q7
5607a09R0K4Qr5l3J99r0m2O4o4p9L2J91j53N9j55N3L09l20J15Jn8Q0j10Q6J83
5633A86j87l0O3q3M9R9k56K34l3j73J88K6p8q2M8L3M6j71K31k32K72j56j30R6
5657d0L1q1l9K01j76Q6Q1j35J24o3j16L00k37O7l2K0j3j7j6J9J22j10K4j8J19
5682A01J6j90j80J96rj00J41N1q1M1l1pJ32j14k9j7J33P4k95J84m7J62j56Q7o9
5707gr1J25j22k6J45J03k63J47q7j72L70j69p6K36j59k5J98o7L6j61N1m7P9q5
$$ plain form
5528 -32 -16 93 82 89 -92 -129 -55 -139 -15 -24 10 -41 -31 -85 -66 15 -97 163 101 50 -108 71 -36 111 -96 -16
5554 -16 175 123 138 138 68 -44 -182 -30 -103 2 93 72 115 54 -174 55 -42 33 7 11 -42 141 -147 14 258 -188
5580 -188 -144 -107 -60 190 -40 -35 23 31 -39 173 1 31 -12 75 189 319 7 -23 18 101 195 96 -67 -2 46 -22 -109
5607 -109 -19 5 13 -82 -115 84 -6 -48 16 -48 -127 -95 96 -57 2 -153 -100 209 -111 4 5 -53 27 -83 3 186
5633 186 -1 -31 32 -51 -2 97 -159 75 42 -131 57 83 5 -77 -29 4 50 -121 110 -122 150 -6 -136 -40
5657 -40 -9 -90 -129 72 -104 -18 63 -72 52 -11 -127 173 -64 3 -29 -9 -22 -39 -55 -36 86 -24 0 -18 101
5682 101 117 -73 -253 -57 -66 -166 -25 26 -55 -14 -45 -52 80 -34 -63 -80 53 127 -168 16 -31 131 -25 62 -7
5707 -7 -98 27 -95 -121 24 127 -136 11 -76 -248 122 -47 -123 113 -46 -71 127 60 96 -65 -14 -61 18 -67
5731f7O9o3O6L9Q6q8J0k25K77o9k37J69J05o0r9j0K23j53K8p8K09j07j06J26R5
5756A40k94J20k0j6J4J46o9r8R3j21R2P7l00K31j6K5j91K11O5j30oQ1J1j93K14
5781F6p6M3p9J49n0l7n7j24j8K24j7k8J9oM0m6N4j68lK0J54k25K13l8k0j01L32
5808B21j75j5J26j6k03J61q3Rn4K0o3Q6J4n5J22j91J21l08K05P8j36J42j03mP7
5833b4J28m9P3M6k95L5L8R0k22K51j03P2j41K27j44M8j14K25j37M9j59P2R3j70
5857a11K15n7p1J66k58P9R4k01R6J2m9M7J43j62J56J4n9j09Q0m0j90J35O6k9j1
5882d4J12L3j6j1j68J07L5M8o5j51K18j14j1r8M8K03j96Q0m5L0M6j27J82k36J93
5907E3oj60K13K0p6j32J01PJ16r3l6N1j64K32j04K5r1j8J46j02J5Q1O8M8k68Q7
$$ plain form
5731 -67 2 -61 5 44 130 42 52 -173 104 35 -202 -33 72 12 -87 -97 126 -27 1 -77 132 25 -81 45 140
5756 140 -154 -34 -54 -70 -56 90 21 -77 16 -105 -13 64 -236 -5 -21 4 -187 24 89 -41 -47 34 45 -148 66
5781 66 -10 33 -46 103 53 16 -41 -165 -183 41 24 -4 15 9 49 3 57 -111 -114 -94 60 -165 48 10 -10 -111 221
5808 221 46 31 157 141 -62 99 16 25 -29 -9 -72 14 28 -27 95 -96 25 -283 -78 0 -136 6 -97 -101 -24
5833 -24 104 55 128 174 -121 -86 -48 42 -180 71 -32 40 -101 126 -18 30 -84 141 4 53 -106 -34 59 -111
5857 -111 104 47 -24 142 -116 -37 57 -144 -48 -36 -85 -38 105 -57 99 113 54 -55 25 -15 -205 -70 -4 -33 -44
5882 -44 68 101 85 74 -94 13 48 96 31 -120 98 -16 -27 -125 -77 126 -70 10 -35 -5 41 -86 96 -140 53
5907 53 47 -113 100 120 44 -88 13 20 136 43 7 58 -106 126 22 47 -44 -62 84 -18 -3 78 146 194 -74 13
5933A3J66j83m6JO2j58J62L1j40L4J22m6L8j60P7O7j06j8J71j45J28k51K88j77
5957g0J18j07m4J01nq1J39j47Q5l0P3Q1j14o5R2Oq1J9J6O5j7k3q0J86j27R4j34
5984e0J02Np7J35M0j42j11J09Pq0J38j15j2M7mo3Q7j53J20R9l3j5J67j63j00j1
6010g3J50j9m6J24qp8m7j39J70n2J19j46q5J76k6q7k4J63j11J3J64k16oQ3j64
6035a65L31o9j41l8N4p5M7pJ86k28J59o4j12K80j92J20j37m3M3J20p5%L3j23J19
6060B3K6r9J23m1n9n2K24Rk89J79Oj2j01O3jp7J42j94J75k8j31K53j75M4j05N0
6086d7J07j77J61J41n9j55m9J96j45j3J21o8O1l1Kj14J99J03j80O3j02R8k39K06
6110G9l5J04j10l4J6j8J2P0O7l04J11J76j94J33j3k27J85j39J2K54j83L0j55J16
$$ plain form
5933 13 179 -4 -50 -49 13 -145 17 48 -92 -58 64 18 56 -104 -27 40 -66 -84 87 -58 70 -181 107 -70
5957 -70 48 -59 -103 -2 -7 -88 51 -96 -11 -41 32 113 -1 -66 26 32 -49 -30 -14 51 34 11 -69 117 -10 84 -50
5984 -50 52 57 -20 115 155 13 -98 11 18 -62 76 -39 -51 -4 -8 -71 16 -137 -17 82 49 34 201 38 -62 -73
6010 -73 77 58 12 136 128 50 3 -136 34 -18 101 -45 -130 46 20 -67 -91 72 -39 -26 138 -78 -84 -1 -165
6035 -165 166 97 -44 -82 -28 -103 -56 -63 123 -105 54 -10 -122 158 -34 86 -51 -94 -51 69 -6 -6 27 -96 23
6060 23 49 -50 73 32 -27 -79 145 154 -135 44 50 38 -63 0 -1 -78 64 -130 45 17 -114 139 -36 8 -97 -47
6086 -47 60 -117 44 185 126 -29 -78 118 -27 -40 81 13 74 43 45 -69 130 233 53 116 14 112 -127 79
6110 79 44 148 38 4 20 2 14 84 151 -153 -42 134 -60 73 60 -167 18 -121 -109 145 -38 -8 -163 -47
6134d7J24k09L19l08O8l2K08j25r8P8N5K0n1J65j87m2P4rj02J89j02J5L0j32J02
6159Cj1j40R1K02j39qL7Pj27N1J0M7o3JJ53k06k5J72K5J81k97J65j67Qn1P9k1
6186b3n2n2O6J8O7q6J7J14L2j19J06k36K07o2K6J83k43k8J78J2j92J41j71o3J40
6211b0O8M4j24P8j01J06j17J9p5OL5J08M2l57J98N5N2%j73J09m9J20m0J00j12
6236b8r1P6J92o6k1j10O8m4J17j61L9p3J93k19l4R3J91J45j58k53K98j68J01j02
6260a5j09K63rq8r8J59p3j5k5M2J06k12Q2J3jk9n5J46p8%j31K02r3K6j9K31k12
6287HL0m6m4K6Q7R9k72J05n3l5J74n3Q5j56N2p6J17j64L6J07k24K07M0n8P5J11
6313A78r2k17J10m9Q9q9J37j00M3k8R5Jk00K99j48O7m0k2jo9P3j9m3K2N3J90l18
$$ plain form
6134 -47 77 -132 187 -121 -53 -85 123 -2 -100 -22 33 53 2 167 -20 -62 12 3 -99 90 -12 3 33 -99 3
6159 3 -8 -148 -57 145 6 -2 35 42 -85 -34 -24 23 -40 -39 114 -92 -117 55 80 261 -36 129 -38 -30 -81 -2 -23
6186 -23 -75 -127 -61 -43 24 -62 -45 69 101 -18 88 -148 59 -3 23 206 -37 -65 113 125 -67 74 -97 -160 -20
6211 -20 48 92 -32 46 -55 51 -66 -47 -122 -116 -81 27 69 -288 -90 -35 17 17 -156 -47 -96 24 -16 84 -28
6236 -28 -119 -43 149 83 62 -48 20 -24 93 -68 -29 -102 91 -128 -162 -69 122 267 109 -144 154 -14 87 -15
6260 -15 -124 139 130 42 -56 103 30 15 -10 32 138 -74 8 21 20 -9 -64 82 4 4 -127 75 -18 8 -11 220 8
6287 8 38 -8 -52 -26 61 160 -112 -7 -60 -95 79 26 111 -45 7 -69 48 -116 -80 27 -197 10 50 -8 67 178
6313 178 86 -131 -21 -70 19 -70 67 -33 10 -18 77 78 -122 177 29 96 56 34 33 -36 37 18 -25 -3 50 240 -78
6340g8j38J73K7J76j57j93J88j14J27Q6j61k0L8J72q7j8M8q4j91K35p8l0R7Ol7
6365a3J13k39K04J1m0k6l3j6J25k02P2J33K2k75J39ML0N5j59Q2J4l0O6j67L4q
6391a04J02J6m0K8r3P8Mr1J37j3L4j03K1O3L1J2l6j58P2n1LK29j00o9j14K35J27
6418B20k51N1N4j79j05K21J72j16j84j0J83r3L4q3j2N0J20p1k00J56J74P0n9r3
6442D9j46J75o6Q0nj7n4J40k98O9QJ83k20K79j05l3j24j8J8Q5kJ77l23J34k0L8
6468Dj4N9j94L0jR8L0j8p6L25k62J19r7j04J23j55P1K5O0j2n5J01r0L3JL8pp6
6496d4lJ02r4J31r4k2L8j82L41l51J17nO4nJ33k1r7%Q5O5r6j6P1j48R2j7Np7j61
6525a89J78J85k17J70j20l3P7k46L6KK73r5l0J09o1K0J10j28r4Q8M8Kj18J84j82
$$ plain form
6340 -78 -216 -43 -16 160 3 -190 -2 -116 11 97 -64 -84 -46 126 39 21 69 -15 -206 29 -49 -79 18 24 -13
6365 -13 100 -139 65 76 36 10 -23 -39 86 -116 -44 89 111 -164 -25 -21 9 64 -95 -13 1 -29 37 -130 -96 -104
6391 -104 -2 14 -26 2 -91 -13 -9 -100 37 24 58 -45 -24 39 70 82 46 -112 -40 -91 -88 141 41 -28 -142 93 220
6418 220 -31 20 74 -105 -210 11 183 67 -117 -127 56 -37 -3 -86 -98 -48 72 1 -199 -43 131 201 142 49
6442 49 -97 78 12 92 87 70 16 156 -142 -73 -65 118 -102 177 72 39 -85 -103 -85 0 -2 175 -148 -14 -34 4
6468 4 -10 49 -145 -115 -116 -18 12 -6 -82 243 -19 100 3 -101 22 -133 -62 -37 23 11 -44 57 -33 0 1 39 32 -44
6496 -44 -47 55 -39 92 -2 -24 14 -168 173 -178 -61 -66 -2 -7 126 105 8 8 93 158 62 46 117 -31 61 44 49 -28 -189
6525 -189 -11 174 -43 127 7 -26 51 -195 -159 -157 116 21 -9 100 39 59 169 41 -53 35 83 85 -33 151 -31
6550c1j3mN7j04L53l49J27n3k1O4j51J27J60j17O3q5pk4q1R2j7q2l8J46J22j4
6576A20k00m1J69j23j4J17j95J45J05r6j69L2J87k17J36QJ70k01nM4P2L7j6q3
6600a8J1M2j01Q0p7K2m2m3J79k7j%q1J94j81m5J4m1J82J4o0j1j35j7J11n2K21
6627A38O8j66j78O2J69k58J10J06J02j73k7K06j25p7Q8J12k5P3j36j8j6o0n7l1
6651a13L8L9j0j10K25j06k9L2N2l0J86j71J8K14j65j39J09q5k9O4RJ8JJ65j50
6676C3j23K12l3j85J00p4q2K11p1j5J20L8k36J41O9j86J97k87kK06J3J8k2P1j58
6701d5J14m5l3N0q6j03R8n9J73j40o1L93k55Q4l2j73P0J01M0L6k6J01n3k03L2
6726b2k6M9R9j20J53k10J66n6j75K35j23M0LK9j21O9N0k8j16m7l4J15j2O5L8J33
$$ plain form
6550 -31 -44 -48 9 -95 258 -91 36 -17 -38 26 -125 2 162 45 108 23 16 -8 -89 3 -14 -96 -134 12 134 120
6576 120 -80 -121 48 -75 -89 28 -167 -22 83 -13 -182 -150 37 -180 -44 -36 134 -67 -72 -28 44 81 65 -18
6600 -18 -7 35 -66 14 -63 -41 -83 -126 53 26 25 25 -56 138 -43 -88 -74 -115 67 81 21 10 -125 -142 -31 -83 138
6627 138 206 40 -138 -76 93 -165 -55 51 153 -20 -47 159 34 -43 45 157 132 205 69 51 35 -25 -82 -113
6651 -113 -75 -36 -46 -156 69 -37 -66 -34 18 -12 174 3 21 235 70 -69 40 -45 -74 -10 -1 17 18 183 33
6676 33 -90 122 89 -96 4 -70 -152 59 -12 -27 93 131 -105 36 105 -81 116 -171 -173 33 46 64 42 113 -45
6701 -45 69 24 -9 41 -45 -148 -50 -109 64 -76 -137 256 1 85 53 -120 -50 51 91 127 101 202 149 -54 -22
6726 -22 -48 1 100 -20 133 -77 89 33 -142 93 -30 10 13 42 -79 -10 40 12 -104 -151 -185 -70 -82 -17 21 154
6752A54k07J16m3o5rM9J33j08r7J58J2j0j79K3P8m2k19L30j79K9J24J11o5q3P8
6777H9j71j1L15k16p3J15R3p7m2K9m5%q8m6J86J01k7k73K24k54J67M1m7q9J77
6802G8j02j9lj5OJ27j29J7J47o5j50J30P8l8m3Q1q0j02R3j19N3J01N5o5j76J80
6828D0lLj07M9O4j76L89j86m0pJ07K3k92l7J99R3m5l8r6m3J38J5K0k8om4P2j78
6856a14j31J81J33q1j08J34j0L9j63j6J90j11J19m0j41J19R0n8j43J24Q6j9p2
6879Hl4k6Q5j22K24k20J45k8O0j90J41j20L0J6J81j26j64M1J10j01J27j1R0n3
6903F3j13j1qK01j77K34k63J88j56J39j62J3J39J6p0J4j55K91k21N0J74j76l9
6926b9Q6j46O3P5l8J68j24j25P0j9n6R4j21Q6P8M8r1j42J71k7N3l7l2K3M6o9j4
$$ plain form
6752 154 -53 63 20 -45 -54 -5 128 20 -77 81 93 83 -96 -73 5 -37 -256 74 -105 -76 48 159 94 11 89
6777 89 -82 -93 222 6 -67 48 141 64 22 51 6 6 -82 -128 58 159 132 -141 83 -171 -4 37 -10 -99 78
6802 78 -24 -43 -46 -61 -55 72 -57 -40 107 42 -108 22 100 62 19 100 20 -82 11 -108 -55 46 101 36 -140 40
6828 40 37 40 -67 -18 46 -130 259 73 33 26 133 156 -136 -173 26 119 74 36 -60 -103 35 50 70 42 36 -8 64 -114
6856 -114 -245 -64 69 -12 -120 14 4 43 -120 -136 54 -57 62 22 -119 0 90 32 -111 13 99 80 8
6879 8 -26 -52 33 -89 135 -85 60 32 92 -98 43 -77 -47 -31 150 24 -140 -99 11 -90 37 26 116 63
6903 63 -50 -61 -69 132 -45 189 -74 114 -42 97 -65 -52 87 103 33 47 -108 183 -38 12 186 10 -29
6926 -29 57 -89 -26 49 11 179 55 -70 0 -19 -75 19 -102 -16 62 110 19 -123 48 21 74 37 5 28 74 5 -9
6953iq1J45o8J65Ql04J35M8m7N2j60L24o9n4n6m8J86j66j6k27L87j34O2J6k45
6978a56J37MK0oJ03j80J33j63R7o3J5N0k0nl6n1R3J07j69J68P7j43l7J05j49q9
7004a58K12k4k0N1M0j25K08k50J78Qr5KN2o7r1J19j51nK28o5j86J68m3r9K13j37
7030c7J35j10P9j1N1j67m0J47j46J91j95K14m5o6K5J30k42J36o3j60K06rk63L71
7054A31M7j87m1P4j32J70l4N1J1q5R9j31j5j4J15o0P0j30M4j5J44p9n7l9J75m1
7080G1m7n4Q1o6O1m0Or9J93m8j18J48Q8j85k6j1J31j4P5l52J04O6r5K86k29J06
7106C2o3M5r1j0K17k29J28O4j61J36j15K44q4j72J9m6L39j85J9m1n5j18J05m4
7130f6J0J09p5K5J14qq9j60P6R8n6Q8j90R3N7qq4J36n5j40J79j29O7n7J30o7J48
$$ plain form
6953 -9 -90 55 -13 152 160 -144 -9 39 -8 44 -116 208 139 85 29 -19 167 1 -15 -242 145 11 73 89 -156
6978 -156 -19 -15 5 -1 102 -78 55 -108 -11 -74 -59 -9 -29 -34 -70 -121 -28 79 -90 78 155 12 -25 80 -69 -158
7004 -158 54 30 10 61 101 -24 184 -66 112 120 25 27 79 12 -79 40 -111 -116 112 47 -139 29 -14 -113 100 -37
7030 -37 98 -12 67 56 107 -60 -100 47 -99 92 -103 111 66 0 25 155 -87 49 -14 -174 32 23 -240 131
7054 131 178 -9 -50 24 -108 62 28 79 90 5 104 -27 -42 -56 59 -1 69 -61 -17 -32 112 33 -24 -63 112 71
7080 71 24 -30 51 -15 46 6 12 -87 106 58 -60 88 176 -9 -35 -46 85 71 146 -206 -102 -36 -131 155 -74 32
7106 32 -31 14 -77 -87 130 -99 29 93 -68 68 -47 197 113 -59 -40 -86 253 68 87 46 -9 -127 -22 -66
7130 -66 -56 53 -22 3 117 109 20 -140 -64 34 -22 66 -124 -31 26 18 -66 70 15 -125 54 -75 -8 -65 65 -2 146
7157A46n5j50PR3M5j71J41k9j01j0N0J7Q6l9p3l5N8O7l2N9j87NM1R6J50j38j01
7184f0p7J72j30J07lJp7K6J81k69J16P8r0L3j04k7Q3Q6p2N9l9m3n2J62k38J94
7210A7r2N2J6L3P1N3r7j36q7L01o3J1j47O8J07o4o3m0l8J35qj61J57J6J30j91
7236b0j09J58j86R2o0qJ03J41k56J76J94k21J6L9j75N5P6QLn6J15p2MJ37j71R3
7262G6j54J19K3L3r3l2k6J74l57Q7J34L3j1O3K4k74L79j98j22J99M1j35J27l2
7286G8Jq5J9m2J72o7r0K6Q1j4k8q8P2r9J09L3j18J04r5Q9j07n7K16j61m3J31j67
7313a30O6K0J2k9JM1j28MK6J54j34O1R5j91K63n9O3J0j60N6J26k15J9l6Om1J14
7340A4j08J74l0r5P0m6N1j97R6j49J41jO4J40k42J86q9m5J57j34J36l19K64k1
$$ plain form
7157 146 91 -59 -52 41 86 -85 56 27 -74 -84 -34 -17 69 30 -43 -78 -20 47 15 74 -113 -108 -67 29 179 41 -60
7184 -60 -137 35 -95 12 9 10 -67 -41 140 -129 -13 65 -25 8 -96 -123 -40 46 -26 33 -6 -49 -101 61 -177 17
7210 17 -75 -23 -7 26 97 150 53 -83 -170 131 68 79 -68 0 107 43 -20 -60 -98 37 29 -132 25 41 171 -20
7236 -20 -129 29 -157 -65 -125 -133 -30 111 -145 31 225 4 20 59 -116 -61 15 23 26 -30 85 13 17 154 -17 76
7262 76 -78 41 64 97 4 -28 -54 120 -237 -150 -16 17 6 69 93 -181 198 0 -122 77 118 -17 110 78
7286 78 79 -6 13 -29 143 76 -14 12 93 79 51 -37 35 -64 45 78 -40 64 -31 58 -49 -106 110 -51 -94 37 -130
7313 -130 -64 -44 -32 -61 -60 -19 -147 -143 -117 37 -97 -36 59 -132 131 72 135 145 -15 41 167 -48 -29 -65 -59 -100 14
7340 14 -94 80 50 -45 25 -21 30 -167 -71 -220 -79 -80 -16 124 -118 68 -21 -66 91 -43 93 -226 38 17
7364A7K6Kp3M5j21K66R4l61K53j68K1L4j28K10r0r0j74J66J09M5m4j27l1K54j32
7389CJ24j87J79o4K4m2pq4J03r4L6j09O7O5j7N5j31K58k1j00o1l2N3O0n7m5j93
7416b17J90J60j72m5J85j58K6P8q8p5K53j15K8L4j6Q1j16k6P7j45o6R3N8r8K39
7441A65j78M3L5o4k3J08k73M0J00M3L5N2Lr0j4l3P1m1Rj30M5R6qm9J63jl6j68
7469a00K38j22N3J4k4l0m6R7j57J53j39J82j16m5L5J01r3j24J15kJ09l3j13O0
7493A3R5j53j7J29n4k8r6N4l2K17mj52Q3l8O7j33m3O1nk9J2o5J40j56O7J65j08
7520a0j7O3m2J12L2k56J85j14R2J27j73k11K19l9p7K23j75j26Q8J06n3J72j89
7543f3O3j29J66L9o6K0L7q4j7L8N0l3Q6k1j36K6j01N2J3R1ON4O0j68J97j44N0
$$ plain form
7364 17 43 45 -28 17 -104 162 256 -105 148 -20 1 35 -93 117 27 -63 -237 -71 38 83 39 -88 -119 135 3
7389 3 127 -60 119 55 79 37 30 -54 49 -45 -9 -118 -51 14 -3 52 -79 179 158 58 -3 -35 18 78 21 -24 -217
7416 -217 -27 133 -39 -84 101 -57 -31 47 -41 -116 137 22 50 84 68 149 33 7 84 -61 -127 -34 24 -74 165
7441 165 -13 30 65 1 -22 86 -187 -147 -47 -4 31 83 86 -4 -18 -51 20 -21 -12 -142 -97 -1 -9 -58 105 104 68 -100
7469 -100 138 16 69 83 59 29 -17 80 -77 76 -63 119 3 -42 -7 94 1 -123 -8 -10 99 66 -47 13
7493 13 108 -45 -62 67 13 -15 -111 -57 -89 128 124 -28 55 17 84 -49 -92 -31 -36 -65 -53 -118 22 -134 -67 98 -10
7520 -10 -27 36 -6 106 138 -118 67 -47 45 172 -1 -212 7 -32 -109 114 -61 -187 -99 7 -46 126 -63
7543 -63 0 -129 37 76 10 30 67 -17 -34 4 54 21 107 86 -50 -24 -125 -73 -60 31 37 91 151 -17 180 36 86
7570H6J12j58K7l6m6k3L8L6j28L36k55Q9J2jk39O4J21n8Q3J7j40m9R1L08k49k4
7596A4P2j43j43Q9P0Q9n8Q0j51O8N1j63J2J94l2k48J08J11j20L8j9M4k04L81j43
7621cN2k35J05K29j13mq5J77j02L3j55J66j16J20k8M6k21lK57o9r1M9N6k10J60
7646A5K8p7Mj4J36o5j24J65r6O6j74L3J67j81K29Q1k98M2P4J2l5M9l3q6O6J35
7672A19k56Q5K8J84j88j14J52j17K04j21j19K67l8M6k38J76j05nn8K7J98j88J73
7695A12n9oL9j01Q0q7j7Rml3M2o1J58j74P5m7o5L93j95l9J6j2n6M2J69k04p3Q3
7723a5J0M0n7J91j87Q0k62K38K9K2m4p5k07J72O9j05K3M0R5m0m5j30m8J92J17
7748A03l2j49J65q6P3j05J6P7j50J66l7j24J21p9J43j0j93J62r0M9j73K9J64l0
$$ plain form
7570 86 198 40 67 31 -15 -38 0 36 -92 244 -11 78 90 89 -150 -86 35 -23 60 77 -63 -112 -21 287 38 14
7596 14 86 -57 -200 -111 -41 48 -10 70 -81 -13 38 -125 -113 81 49 -199 -91 20 -100 -62 -81 -37 -241 140 -3
7621 -3 49 -186 -81 148 35 31 -54 123 21 54 -101 65 -51 69 41 87 -134 -137 120 51 -40 9 65 -145 15
7646 15 43 -34 -30 -44 92 27 -97 68 -28 38 -136 -103 64 -117 112 193 -105 -63 11 23 -12 37 4 -82 -16 119
7672 119 -137 -52 -24 160 -28 -142 10 -107 97 -24 -143 124 86 132 -106 70 -35 -40 -98 -71 127 -61 112
7695 112 53 47 86 -15 65 -22 -39 -30 -34 -67 -25 -86 72 -102 -27 -74 -139 254 59 20 36 24 -32 10 179 -25 -98 -15
7723 -15 -5 35 -22 169 -18 62 -200 38 67 89 45 -30 -237 -65 4 -101 -78 -38 57 17 -28 -158 -206 -14 103
7748 103 71 -78 87 1 74 -31 -15 62 -88 78 41 -83 38 -41 102 92 -101 61 -29 20 -153 -124 40 10
7772A0j49J43K7j00M6J23J8k02K32l6m9j11P1m8J9j07K03r2j53J65J32j57J99
7795A84j24j18J41j58N9pP8j48O1l9n9J42KK8N8j08n2L3j9J27l8r7N8o5R5L5m6
7822B3j43Q7PQ9j7k32J99j00N4k2J21k28K80j97p6J72j72L51l16N1j8l1Q0r6L33
7847A99k36M3J11j10p1N7R3l9k24L4J5J88j29qJ4J77O1j43J41j54P1q0O6j32J4
7872d2Q0m7J19q3j19JR1p6j8Q3k75K28k5p9O4L39j97m4L9n7Q3L8j41J9K1n8K10
7899A54j93nM9P7j08j6O6O0j22m2L9J37j32k4J36k72K44M4j11R0r9jj09K5OK16
7925A09k47j44L82j44J15j31kL1OJ03r8l4R5J03j41rJ2P2p8J07j38o3k8J09J14
7950A01r9p0L6P7p0R1k6P8p6J31j0q1q1j0J2Ol7j8M3k8L4Nn7J17k08O2R8NmQ3
$$ plain form
7772 10 -139 4 31 -69 -23 100 118 -84 148 112 63 -48 23 -25 -6 -113 90 -2 -155 10 142 -15 184
7795 184 60 -58 83 -75 -16 -23 55 -93 -32 -71 -130 12 14 42 100 -8 -60 -27 -46 81 43 -54 4 -61 34 69 23
7822 23 -120 -33 -26 63 46 -186 13 -87 -33 -55 66 -162 118 -79 -155 17 -155 196 -120 -69 -87 -118 -38 -134 199
7847 199 -37 6 117 7 -64 -7 86 47 -177 -143 -128 60 -69 -77 -63 114 175 32 173 19 90 10 76 -56 -42
7872 -42 38 -9 110 27 -92 -91 0 -76 -94 -11 -286 -58 -83 -162 -98 241 44 0 39 -18 65 103 -38 -19 2 -56 154
7899 154 -39 -44 5 82 -26 -42 24 84 -38 -80 -41 96 -36 -60 76 -196 48 92 -19 71 -28 -29 -138 -113 -107 109
7925 109 -138 -282 100 -44 71 -60 -62 -31 -25 78 -20 -54 41 144 3 -6 6 78 0 107 -31 -94 -122 -13 101
7950 101 2 -68 -32 45 -25 66 40 118 42 173 163 82 1 -9 3 9 -28 -46 -3 -31 3 8 -49 68 -140 -78 20 25 21 104
7980A04NN1r6M9k08m5J76O4k55Q8J67p9jj45J34m1M5j4j79K50o2R0o2O1j82r0
8006a75J41M8q9J00j1K1K9j81J52k8R1m9p0j4J51n3j35J17n1NM1R3r8p5r8K83
8032A45k19J37L3j32j4J46k7o6Q3k14J36J22p1j59M7R8n1L8r8K3P7j7P3j93J34
8057C1l1J7r1J29Lm9m7N7Ro4Q6l3Nj0N7l9n8M6NN2j92J8J3P0j8L9j27J7N1j7P9
8088HJ2K9q4k2P7l2J30l9j9p5j06K07j69J60l8K1r1L4o6J45q1K15j83n9P4j9J39
8115A68k84O3N0J37q1k68K15K7k40K29M6j54J78J8j81O5r7jJ28M5j82O7J49j42
8139d5R0m9J70j66K1K8J7o6k8M9p5o6Q9N4j8K7j03K35j47j91P1O7O6l21K84j40
8165a47K32k2Kj00j37K78j49k15M12k50L6J84j99J79O9j85N3K5lj1N2n6l5p6P4
$$ plain form
7980 104 109 160 64 113 -95 -140 36 100 -155 -67 100 21 20 -125 9 -32 13 -1 -180 70 8 98 36 97 -85 -175
8006 -175 -34 14 -75 25 14 35 64 -117 35 7 98 49 -21 -35 116 63 -72 45 -6 -1 40 133 35 -40 -138 145
8032 145 -74 63 96 -36 -50 96 69 3 86 -128 8 130 59 -100 -53 45 -6 32 -66 -43 34 17 90 -103 31
8057 31 0 17 -74 55 58 9 -38 19 28 -36 50 17 22 12 69 30 -28 18 23 75 -117 -99 -86 -16 -34 5 -122 -105 -54 -71 8
8088 8 20 49 -35 -57 20 -12 118 79 60 -15 -121 86 -83 77 39 60 -31 3 -63 82 1 216 33 -26 48 29 168
8115 168 -116 -53 -3 134 53 -215 0 27 -213 16 62 -92 86 104 -77 -12 -109 -110 18 63 -119 -52 97 -45
8139 -45 45 -4 166 0 21 49 66 0 -28 21 -54 -120 -31 23 5 32 -71 164 17 -174 -103 -36 30 -291 -7 -147
8165 -147 85 63 65 -35 -172 106 -43 -258 154 -96 -60 124 -75 104 173 -12 41 66 63 52 104 48 13 -63 11
8190A1R8
$$ plain form
8190 11 109
8191A09
$$ Imaginary data points
##PAGE= N=2
##DATA TABLE= (X++(I..I)), XYDATA
0@%%%%%%%%%%%%%%%%%kJ0j6J6j6J6j6K1k9L2l4M2m8N3o1O9p7Q8j01J11j24J40
39G4j56J72j90K10k30K55k86L15l44L78m18M62n06N57o16O79p53Q37r35J052j188
60f31J353j556J817k165K644l356M510o675J2018m5744n2042J59515j5092o0040
74e444J22825M640j17462N4707Q286j09117M9103M0128j27871Q361P9129q2342
86g5057l20J12846n8549n6715R6976J666m3438Q0587r14q0878M0589J5223o6264
99c4248N0072M9066p5135J057N2468n9580j9062O5861k6045m2368L4034j7127
111b1007l3024M6168O967l8199L0058J5821l1069M0525N0376l1275j0538K2568
123D7371l0334k1037K5590j0026k7949K314j5566k4220J8116J4331r467J7187
$$ plain form
0 0 0 0 0 0 0 0 0 0 0 0 0 0 0 0 0 0 0 -2 8 -8 8 -8 8 -8 13 -16 16 -18 24 -24 29 -32 37 -40 48 -53 58 -66 74
39 74 -82 90 -100 110 -120 135 -151 164 -180 198 -220 242 -264 293 -323 356 -397 440 -495 557 -631
60 -631 722 -834 983 -1182 1462 -1894 2616 -4059 7959 -37785 -89827 69688 54596 -5444
74 -5444 117381 122021 4559 59266 67552 -41565 7538 47666 -80205 -71844 7285 -75057
86 -75057 -75377 37469 -21080 -77795 19181 20847 -22591 57996 57082 -23796 16793 32016 -34248
99 -34248 15824 64890 -10245 -9188 43280 -16300 -35362 30499 4454 -37914 -3880 -21007
111 -21007 -54031 -7863 -896 -39095 -9037 6784 -24285 16240 66616 35341 24803 47371
123 47371 17037 -4000 21590 11564 -16385 -14071 -29637 -53857 -35741 -21410 -30877 -13690
135a3690K1163j0816M875L1451L227j5649L732l785k1374J992J3108j1766j1276
148h808Q33j4579n771K3985O463r907J5314L306k4415R016K1198j8974n079J9484
162A2066j6695j2948K6809j750j6376K0070k143k5599K2303J5868k6632Q430J4582
175A7985l5611l846L0643j6236p955K9781j3787j9876K9180K29k0880K4966L630
188A8223l1751J5022J4488k9664O939J9931k8828l745K7200j4573m988K8819j2341
201D732j7194K4164l435j8024K2981J630k6899J2482Q245k3552J0297J6005k1734
214a0302J571J9053j6275j593K2515j3204j0504J9735q458j4080K0493j428j9134
227a1611J3791L074j9407J2077J0586j8173N403J2874j6091R86J7543j1469m671
$$ plain form
135 -13690 7473 -3343 1532 32983 36210 20561 24293 20508 -866 1126 14234 2468 -8808
148 -8808 -7975 -22554 -28325 -4340 2123 -7784 7530 10836 -13579 -4563 16635 -2339 -7418 12066
162 12066 -4629 -17577 9232 7482 -8894 11176 9033 -16566 5737 21605 -5027 3403 17985
175 17985 -17626 -21472 9171 -7065 -15020 14761 974 -18902 10278 10507 -10373 14593 18223
188 18223 -13528 1494 15982 -13682 -6743 13188 -15640 -19385 7815 -6758 -11746 17073 4732
201 4732 -12462 11702 8267 -9757 13224 14854 -12045 437 8682 -14870 -4573 11432 -10302
214 -10302 -8731 10322 -5953 -7546 14969 1765 -8739 10996 2538 -11542 8951 7523 -11611
227 -11611 2180 5254 -14153 -2076 8510 -9663 -4260 8614 -7477 -6491 11052 -417 -5088
240e088J6272q091q959J5817k583j2327J0922j08j4636P724M466j2393M262P055
254B333j0573J643J0092o307n55R927m986l387Q474k280n090N329j697o777L755
269i9O62n424L629K313m645K321K978l359J524L407k798M85K552k893q34K180
285A999k805r26K620j395j276K927r39k639J791l59k296J780R59j711J257J470
301D57j354Q40K086M5N87J895k44o35n1j261j965j215r57j088j125J20n8n50M03
320d070J320R12J213K231J435J78J032K09j556o08l20j658j549N57j241j487O50
337b752K08o62J215J758L36R17J900nr24R67j23j975N1P27k136j374J383j700
355b189k257K596kk015K614K387k994J549L076l214Q4M422k623j936M644j771
$$ plain form
240 -5088 11184 3093 -5866 9951 7368 -4959 5963 5855 -8781 -1057 3409 -8984 -4722 2333
254 2333 -8240 -6597 3495 -2812 -3367 6560 1574 -1813 6661 4381 -709 4620 2923 -3854 -99
269 -99 563 -4861 -1232 1081 -3564 -1243 1735 -1624 -100 3307 509 994 3546 653 -181 1999
285 1999 -806 -1732 888 -507 -1783 1144 205 -2434 -643 -1002 -3298 -1518 -559 -2270 -1013 457
301 457 -897 -57 2029 2074 2661 4556 4312 3677 3626 2365 400 -815 -1772 -2860 -3985 -3865 -3923 -4473 -4070
320 -4070 -2750 -1838 -625 1606 3041 3219 4251 4460 2904 2296 1976 318 -1231 -674 -1915 -3402 -2752
337 -2752 -2544 -3206 -1991 -233 103 1020 2920 2915 1991 2958 2835 860 911 1638 -498 -1872 -489 -2189
355 -2189 -4446 -1850 -1852 -3867 -1253 1134 -1860 -311 2765 -449 -365 4057 1434 -502 4142 2371
371B371m051M502L78n695L507K313o546J728M406o440o22N547n217k118P542k313
387g08m101P295k00n692O682K535o573L863L516q410J091N344p605j284O170n915
403c992k956Q088j913l662P907j85o125O616K413o850M010K682q750L17M721o497
419d176n40O380n132l079P177j416k885P388j8o110M417J666n185L359K787o126
435a493q81L916l286q8N779k265l526L061J6k668L058J407m624j492J615k049
451c520j55M093j49l159J513K019j387K628M112l256l259K662j374k792M760L97
467C133o916J032K941m574L076P043n717l033O121l604l053R299j529r103M633
482b51O63q276O953O888r512P69O737q223R68J2334n870o083Q298n171p967J1890
$$ plain form
371 2371 -1680 2822 3200 -2495 1012 3325 -3221 -1493 2913 -3527 -4149 1398 -3819 -5937 1605 -708
387 -708 -4809 2486 2286 -3406 3276 5811 -762 3101 6617 -1793 -702 4642 -2963 -4247 1923 -3992
403 -3992 -6948 1140 -773 -4435 3472 3287 -2838 3778 6191 -659 3351 6033 -2717 -2400 2321 -4176
419 -4176 -4716 1664 -3468 -6547 630 -786 -3671 3717 3699 -2411 2006 3672 -1513 1846 4633 -1493
435 -1493 -2374 1542 -1744 -1832 3947 1682 -1844 1217 1233 -1435 1623 3030 -1594 -3086 -1471 -3520
451 -3520 -3675 418 269 -2890 -1377 642 -745 1883 5995 2739 -520 2142 768 -2024 2736 3133
467 3133 -3783 -2751 190 -4384 -1308 5735 18 -3015 3106 -498 -3551 5748 4219 -4884 -251
482 -251 412 -7864 -911 5977 -3535 -2766 3971 -4252 -3284 9050 3180 -2903 5395 224 -7743 4147
498D147J353j0888O202J408j1756P143R904r517J236P403j1155r74J3416n206
512B716n565R463o885r850J2044J984r084P957Q62j3550O209Q790q425L436P666
527G768j2275k324J1904m199k215J0624o806r480R465P11n968Q514K61j2447L090
542c377M781o536M808N982r513k918O595l413R02R052l783o361M326n57j964P548
558E572J012o909L15p2k956M357L546m120k024j008k831K712M246p76q76j620
574a432k832K276M196M81J390r31n390M44L485r60J616J300p015k755M399r04
590b632Q10O004m353n296N283J048j701P564K2q943K221K381n111M476M605q724
606b346k324M599m763J116R118m277n997N415j999l807R189J484q016K652J027
$$ plain form
498 4147 5500 -5388 814 2222 -9534 -2391 7513 -2004 -768 6635 -4520 -5494 7922 2716
512 2716 -2849 6614 -271 -10121 1923 3907 -5177 2780 3642 -9908 -3699 5091 -3334 102 7768
527 7768 -4507 -6831 5073 874 -1341 9283 2477 -7003 2462 3173 -2795 5719 5980 -6467 -3377
542 -3377 1404 -5132 -324 5658 -3855 -6773 -178 -3591 -2689 6363 2580 -3781 545 -12 -1976 5572
558 5572 6584 -325 -10 -82 -3038 1319 4865 745 -1279 -2287 -5118 -2406 1840 1064 188 -1432
574 -1432 -4264 -1988 2208 2689 4079 3148 -2242 -1798 1687 727 2343 3643 -3372 -6127 -1728 -2632
590 -2632 -1822 4182 -171 -5467 -184 864 -837 6727 6749 -2194 27 2408 -2703 1773 6378 -2346
606 -2346 -4670 -71 -4834 -3718 5400 1123 -4874 541 -1458 -5265 3924 5408 -2608 44 1071
621A071o330N717O153o489m20L546o393L56Q543l172m159L718l988m351O971J469
637B242m329K710m07n514M109N186l309J258J743n757p15N135j586j219K021l499
653a931k920L185J481j13K367j043k682J634J944L33J140m41k745j438j80Q30
669e79J199m36j382n09j366M31L438p2q24J256j409j856L535P24k799J927m39
686H39m295K785L506l569J008K961n157n49N567k451j940M860l460m568N585K97
702A419m975N058J226p120L215M672n574J278N358o622j406O572l700k695O720
717C426k729n745N932P36n161N454K377o886K476M026n586R85N275n267j797N426
733B942l601k927N837j790m858M852N09m479M341K032n288J995K917m700J162
$$ plain form
621 1071 -5259 458 6611 122 -298 3248 -3145 -2789 5754 2582 -1577 2141 -1847 -6198 773 2242
637 2242 -2087 623 216 -5298 -1189 3997 688 1946 3689 -2068 -2783 2352 766 -453 1568 -1931
653 -1931 -4851 -1666 -185 -298 2069 1026 -1656 -22 1922 2255 3395 2954 209 -1229 -1409 -579
669 -579 620 184 -1198 -1707 -3073 -2642 796 724 -100 1156 -253 -2109 1426 2150 -649 1278 839
686 839 -3456 -671 2835 -734 274 3235 -1922 -2471 3096 645 -1295 3565 105 -4463 1122 1419
702 1419 -3556 1502 2728 -4392 -1177 3495 -2079 -801 4557 -2065 -3471 3101 -599 -3294 3426
717 3426 697 -5048 884 1620 -3541 1913 4290 -2596 -120 3906 -1680 -695 4580 -687 -2484 2942
733 2942 -659 -3586 2251 461 -4397 455 964 -3515 826 2858 -2430 -435 2482 -2218 -1056
748a056M375l944q19M002k773k218M627j283k891L481k6l376K677J145l317J093
764c03J976k927M20K550k217n66K180j773j432K838o88j340J684K16j831J068
780a45Q97j500O11J150r87j44J088o03n65N80J78p50N54L39o02J38J58p02k23
799e28M22J84m97J51L21m65j88M60j59n35Q47J37o41P21L52r21K78O50o87M4J106
820A052o43n89Q22l23q56Q79P3q50P83J78q98L73J73q83J50P04o65r0Q22m90m13
841f91Q77l76k99O65Q0l68N27O4l94J71Nm13K58M37n29K68J14m23NL19l23M2K66
864B82k55k42L24l22m10L60J40o22M24K82l26K26J67m5k12N10k1k89N89ll64K18
886D11R6l86n8O59m88k39J04r2p61M57M04p21L02L99p70L9J068n50l36J035n22
$$ plain form
748 -1056 3319 -625 -1444 2558 -215 -2433 2194 911 -1980 1501 1475 -1901 776 1921 -1396 -303
764 -303 1673 -1254 -834 1716 -501 -1067 1113 -660 -2092 746 58 -1282 402 618 -1213 -145
780 -145 752 -748 -137 1013 26 -118 970 367 -198 382 560 -190 364 703 101 239 397 -305 -528
799 -528 -106 78 -419 -268 53 -412 -600 -140 -299 -834 13 150 -491 230 582 -339 -61 589 -98 -54 1052
820 1052 409 -180 642 319 -537 342 415 -435 348 526 -372 1 174 -709 -559 145 -520 -610 212 -278 -691
841 -691 186 -190 -489 176 256 -112 415 479 85 256 261 -152 106 543 14 282 396 -27 -22 297 -26 16 282
864 282 27 -215 109 -213 -623 -263 -123 -745 -321 -39 -365 -139 28 -17 -229 281 260 -29 560 557 193 411
886 411 507 121 63 722 234 -5 99 7 -754 -297 107 -614 -312 87 -683 -644 424 -126 -462 573 51
907E1p44R91J38r58P24K90j257P53O22r02L96Q35j169j45J077l10o14J124o07
926B95j568J287K65j032Q82N49j727K77J217j222M38J310j353n45J288m79q15
943i33J882l20j614J224K70r48J234P55j770k76J133r13K79J243q94j516J144
960b0n45o33J644M44j813L47P99j512J030J555j211r35J139o66o20J778J99j596
978f16M89M28j267J009J865j180j067J005q28r72K202M63k216N61J73j891J114
995g28K312j951q24J825j647o64L080j21k434J523j3k899K486K593k861J00J941
1012A718l482j65M398j470k113K897j519l191L641J455l672J992J336m820J449
1027a546M302l282l73L448l723k508N285m63k987M085j012n134L423K786m123
$$ plain form
907 51 -693 298 436 -522 202 492 -765 -12 610 -292 104 939 -230 -375 702 392 -222 902 295
926 295 -1273 14 279 -753 129 678 -1049 -772 445 -777 -339 971 -382 -927 361 -118 -933
943 -933 949 629 -985 239 509 -439 795 1550 -220 -496 637 -276 3 1246 352 -1164 -20
960 -20 -565 -1198 446 890 -923 -576 223 -1289 -259 1296 85 -850 289 -377 -997 781 980 -616
978 -616 -127 301 -966 43 1908 728 -339 666 -162 -1134 1068 1531 -685 -124 49 -1842 -728
995 -728 1584 -367 -1191 634 -1013 -1677 1403 1282 -1152 371 358 -2541 -55 2538 -323 -223 1718
1012 1718 -1764 -1929 2469 999 -1114 1783 264 -2927 714 2169 -1503 489 1825 -2995 -1546
1027 -1546 2756 -526 -899 2549 -1174 -3682 1603 1140 -1847 2238 1226 -3908 -485 2301 -1822
1042a822K300K895n622j67N052k759q82M780l187m057M821o0l452M334M14o053
1058c465K104L084l999J815L908n063j568M781k559j199N348j802m494L852M26
1073A169l633M122K084n475O89K870l572P86M589l269k779L408j532k119M811
1088B149J74m300J854R35l655K599L488l564j206K803k470r54M380p54k991K027
1104E15j48k985K790K461l210N3J593k562o0L833r08k274J926p37k511K641J868
1121B285k752M71J081l124L76L371j589j433K278j528k501L349J380k505J140
1136B99J029l344J061L386k046n25K568k860k034M066l84k482K774j96m058K211
1152e35K272k838J068K108l763o70M000j978r93L727j960l300L607N37k926K623
$$ plain form
1042 -1822 478 3373 -2249 -2416 2636 -123 -1005 3775 588 -3469 1352 1292 -2160 2174 2588 -3465
1058 -3465 -1361 1723 -2276 -461 3447 -1616 -3184 1597 -962 -2161 3187 1385 -3109 743 1169
1073 1169 -2464 1658 3742 -1733 -1044 1826 -1746 -960 3629 360 -2419 989 -543 -2662 2149
1088 2149 2323 -1977 -123 812 -2843 -244 3244 -320 -1526 1277 -1193 -2147 2233 1479 -1512 515
1104 515 367 -2618 172 2633 -577 -524 1069 -1493 -1553 2280 1372 -902 1024 287 -2224 417 2285
1121 2285 -467 4 1085 -2039 -1663 1708 119 -1314 964 -564 -3065 284 1664 -841 299
1136 299 1328 -2016 -955 2431 385 -140 2428 -432 -2466 1600 1216 -1266 1508 1312 -2746 -535
1152 -535 1737 -1101 -33 2075 -1688 -2358 1642 -336 -1329 2398 438 -2862 745 1282 -1644 979
1168I79J211m547J414K805l003O92L286l489j498L745j678j605L940r93l560K698
1184C97P73k925K138J835l677J81K569k578J16L315k281j767K887j075j818L012
1200A102J15k657J689Q66k489J581J837k421j16J897k113k04K439r85j720K005
1216H26n87j867J783Q28j651L88P87j580N82J496j230l09J107p35q16J533l07
1233B48o92P00n5r11Q21O52q30J64M09o48m7Q95m57k91M87k96o05M13M6m03L81
1254a9K76o88l5N52j30mJ96l94j38M22J02j44K3L34m94J01M22l95JK64j22r2L55
1277C93j44l70K59J56p03K14J76l38J09N50m71k44O28k13l55O56k16m84N96J65
1297C64p12M44N4m30K24M88o41K1O42m67M1M06l88j20M21j15n14M64m6n04L25
$$ plain form
1168 979 2190 -2357 -943 1862 -1141 -449 2837 -652 -2150 1595 -83 -1688 2252 1259 -2301 397
1184 397 1170 -1755 383 2218 -1459 -1278 1291 -1287 -1171 2144 -137 -1904 983 -92 -1910 1102
1200 1102 1217 -1440 249 1115 -1374 207 2044 -377 -493 1404 -709 -913 1526 541 -1179 826
1216 826 239 -1628 155 983 -668 -280 507 -1073 -491 1005 -225 -534 573 -162 -978 555 248
1233 248 -444 256 201 -710 111 763 -67 97 506 -142 -189 706 249 -42 445 149 -456 -43 3 -400 -19
1254 -19 257 -431 -466 86 -44 -48 148 -246 -384 38 140 -4 19 353 -141 -40 382 -13 -12 252 130 38 393
1277 393 249 -121 138 294 -409 -195 -19 -357 -248 302 -169 -413 215 2 -353 303 87 -397 199 364
1297 364 -348 96 150 -280 -56 432 -209 -188 454 -13 28 434 46 -74 347 232 -282 182 136 -368 -43
1318d3Ol93K16L63m57K60K72m77J9M40k40l47O72k59l62O99k65l11L55J96l79
1339c5L45Q9m20N2L19l73J8L37n25j16J91M5l52K31jm5Q1J5J02J54M6k17O6L08
1363C15l47o4K21j74J93J37j12j18o7K48k43P4K18k90l1q6o4J1Q9l2Rj40K33J76
1387A56j89J69N6k02n9L21j98j35J37J02k51J3J41j94K45J33k98N3L61m24J68
1408A05K83l10j02J56j99j51M07n4n92J34J14j76J21N13m06k82O73k20k84N86
1428C16k67k79N31p2m08N63J59o23j08N40n14N9N05l86n78O65k80l22N70P2p57
1449f14N22K67o20J77R17o57l67O99o10q8Q76j83p53N98Jr09Q50O81j020K56M56
1470D79q31P7J014m63o13P62l66r83J188K44j118O51L34j272M83J164r32k27Q44
$$ plain form
1318 -43 -37 -430 -214 149 -308 -48 224 -253 -234 206 -34 -381 291 32 -330 369 104 -207 148 344 -35
1339 -35 310 399 -21 31 350 -23 -5 332 -193 -309 -118 -73 -425 -194 -195 -240 -159 -144 -42 112 158 -59 7 315
1363 315 -32 -96 125 -49 144 281 169 51 -16 232 -11 63 281 -9 -40 -126 -190 -179 -90 -122 -113 -253 -20 156
1387 156 -33 136 192 -10 -69 252 54 -81 56 158 -93 -80 61 -133 112 245 -53 0 361 -63 105
1408 105 388 78 -24 132 -67 -218 189 135 -457 -323 -209 -385 -264 249 -157 -439 234 14 -270 316
1428 316 49 -230 301 229 -179 384 543 -80 -188 352 -162 -103 402 16 -562 103 -177 -499 71 143 -614
1449 -614 -92 175 -445 -268 649 -8 -375 324 -286 -374 502 319 -434 164 165 -744 106 787 -233 23 479
1470 479 -352 -275 739 276 -337 425 59 -924 264 508 -610 41 375 -897 -414 750 -182 -409 435
1489D35q87m95J517j62q71R60j36j267J005P59j023K83P17j358l8J287o43n25
1507d42J118p30j046J233M18j122R43J83j456M37J003p41L8J129j132q60J236
1524B09O7o23R32o0j328N40P52n78M33O48j183m57R65l49l00J206n29j244N07
1543c92L47m45P90N86j340j01P34m80j5J092m69r18O34k42l29R47O07j243p2O55
1563C46p69L69J191q92q24O94m43k45J065K54j109M5K73p08P33R61q20l77M88
1582B32n70m61J383K7j089M22j82o35P57J126q45l27N24p35j29J476k59r20O43
1601D38n09p73J172K86o02J27N1j139L14J220n73k69O01o66n89J164J29o41N43
1620B84o1r67N72P75l70K1M22j095r6R79k11m12N91l29q80L87O58k55J33P8o29
$$ plain form
1489 435 -452 -947 570 408 -463 497 361 -906 99 858 -165 118 835 -523 -561 726 83 -442
1507 -442 676 -54 -1100 133 551 -571 372 555 -901 -464 539 -202 -164 965 -167 -1027 209
1524 209 276 -347 585 525 -803 -263 489 -89 344 992 -191 -648 317 -32 -332 874 345 -899 -392
1543 -392 -45 -490 300 886 -454 -555 179 -301 -316 776 307 -611 23 -219 -548 399 1006 -237 -309 346
1563 346 -423 -54 1137 245 -579 115 -328 -573 492 746 -363 -318 -45 -753 -20 941 121 -256 232
1582 232 -338 -799 584 611 -478 -56 -238 -873 -116 1010 165 -162 362 -373 -502 974 715 -205 438
1601 438 -71 -844 328 614 12 139 190 -949 -635 585 12 -257 344 -322 -911 253 382 -259 284
1620 284 223 -744 -172 603 233 254 676 -419 -515 464 253 -159 432 103 -777 -390 268 13 146 224 -405
1641d05j48O26J04m9M79o39o92O11L2pL69p0m77j20M96j69K42L35m81k50J97J99
1663A83l5L19j44m69j48L12j39L50J55l91l04J08R4QQ9J00k13l24M05l2J44L71
1685D39l44m26J35K21k44O49j22m15oJ39j02N4M82m24j99K07k00l5M25j33m14
1706c13K83k0l25L92L23n26L6J26k42kO61k01l66L73o9l47M19L48p82J58K74k79
1728g9j49O20l74j28N6j04k27M35n4j55L4J57l67J89L78k50j5K45j66j56L54j94
1750E0j3k2P1l81K37J69j94Q9K14m00R9L50j94p9J30pl18J23M4o2j05J79q5j06
1774b11M80k30k31K47m1j63K95k3j94J87R9l06K56N7k66N0J98j10o4K6L7j93J2
1797h8J18j14k6J81r5l36L23j28J10J51o7op4P6l19K60J10k86M22j00l61J85J70
$$ plain form
1641 -405 -553 73 177 128 607 -32 -724 -113 -81 -88 281 211 -266 -386 110 -59 183 518 37 -213 -16 183
1663 183 148 467 323 -146 -294 18 -121 229 384 -7 -311 -203 -109 -101 -12 88 -125 -449 -44 -76 68 439
1685 439 95 -331 -196 25 -219 430 308 -107 -113 26 -76 -22 460 36 -163 44 -156 -191 234 101 -313
1706 -313 -30 -50 -375 17 340 -186 -150 -24 -266 -268 393 192 -174 199 130 -217 202 550 -232 -74 200 -79
1728 -79 -228 392 18 -110 -54 -158 -385 50 -4 -159 -125 32 -335 -146 232 -18 -33 212 46 -110 244 50
1750 50 37 15 86 -295 -58 111 -83 6 220 -180 -81 269 75 -4 126 119 -199 -76 -32 -94 -199 -20 -105 -211
1774 -211 269 39 -192 55 14 -149 146 123 -71 116 215 -91 165 222 -44 6 204 94 30 56 93 -100 -88
1797 -88 30 -84 -110 71 -24 -360 -37 -165 -55 96 29 23 -51 25 -294 -34 76 -210 212 112 -249 -64 106
1820A06k13M3L05j02j60J26J13k88J62l9j48L6K25k48K2K81k74j71K88k27j62
1841c25K25lJ61j67J75m6OJ27j23J18k7m8j36L35k28p4N7jk9n7rMlL2j61KK26
1868C1O4p6j24J63k1l2j15j84J94J09p7l0Q1qp8J20k3j00L44l17Q1J83k08l0J71
1893A18j99L8J75l2j37K37j65k69K11j8j32P4L17m05nJ94N2j03q7K75j95P2J72
1916A88m8JM3j79j53J74j8J3m1lj04J31j80J12j21K44k03N3Q4R5j01L0o2k3J95
1941A27l22L8L17j51J39r3J40j55j36K01k7j05J17j21P3N0j74K3J23j40j72J50
1963i8J00q5L9J52k77J9K75j02j05J68k20j60M30j85Q4J41n9j74j49M64j14j76
1985c2J88j60j47J73K7j19R4J56n00K17Q3m6rK72l06k04L67l0k94L14N6l83J94
$$ plain form
1820 106 -107 -64 241 139 -21 105 218 -70 92 53 -95 -59 166 -82 -60 221 -53 -224 64 -163 -325
1841 -325 -100 -103 58 -109 66 20 26 153 30 148 121 73 -63 272 44 -30 27 26 -3 -60 -69 -65 -68 -36 -197 -195 31
1868 31 95 19 -105 58 37 5 -110 -294 -100 9 -68 -98 -17 -25 -103 17 -6 -106 238 -79 2 185 -23 -53 118
1893 118 -81 -43 132 100 -37 200 35 -234 -23 -41 -173 -99 218 -187 -192 2 54 -49 -136 139 -56 16 188
1916 188 140 141 184 5 -148 26 8 21 -20 -23 -127 4 -176 -64 -185 59 -144 -91 -7 88 -13 17 -45 -68 127
1941 127 -195 -157 160 9 148 55 195 40 -96 105 78 -27 90 -31 42 92 -82 -59 64 -76 -248 -98
1963 -98 2 -83 -44 108 -169 -150 125 23 -82 86 -134 -294 136 -49 35 176 117 -57 -206 258 144 -32
1985 -32 156 -4 -151 22 49 -70 24 180 -320 -103 -20 -66 -75 197 -109 -313 54 24 -270 44 100 -283 -89
2008h9L31j90o7M03m74j59N78l08j05L92j42o06L54L28m02K23J39n59J42M30k77
2029e8J50K15r0n91K84rj18K69J71m79J60J96j78n6O44n89j01L49j10k22M36j3
2051B60m52%K51l20L41L47m68k68M53l98J52M06k75l53M14j44k05N11J02m70m3
2072a59M37p31J08Q74k58m60L71l65J2L97J23m39K36n0l40J52L77l77OJ56l68
2093b98j06O22p3k93K83j77m02M44K51k04k0R2m13J25L03p3k32M42j57n85M55
2114a6K77k71J52J64o13M4N93n26J54L47l81n55P16J33l69K47Q7m96Q4M26l99
2135b02K12K42m11l24P27r6k26K77M9o51L61J72k14K83O3m93pL49k70N8N10l90
2157A9l71K35J62l53M92p2k76q1M05k33Q1K37k73j00K61j73j56L96l1l26M8J72
$$ plain form
2008 -89 242 52 -15 388 -86 -245 333 25 -80 312 170 -436 -82 246 -156 67 206 -353 -211 219 -58
2029 -58 92 307 217 -374 -90 -99 -217 52 223 -256 -96 100 -78 -134 510 -79 -180 169 59 -163 273 260
2051 260 -192 -192 59 -261 80 427 -41 -309 144 -254 -102 304 29 -324 90 -54 -259 252 354 -116 -159
2072 -159 278 -453 -345 529 271 -189 182 -183 -171 226 349 -90 146 96 -244 -92 285 -92 -86 70 -298
2093 -298 -404 218 145 -148 135 -42 -444 0 251 47 27 119 -294 -169 134 61 -171 271 114 -471 -16
2114 -16 261 -10 142 306 -307 -263 330 -196 -42 305 -76 -631 85 218 -151 96 183 -313 -229 197 -202
2135 -202 10 252 -159 -483 244 148 -78 199 248 -403 -42 130 -84 199 262 -231 -238 111 -159 -101 409 19
2157 19 -352 -117 45 -308 184 112 -164 -245 160 -73 8 245 -28 -128 133 -40 -196 200 169 -157 -109 63
2179F3k89L75O8j45j69J94k12j21O34l86k76K45P8k84M1L68l79J22J68l92K12
2200h5L05j27j58K92l59l7K88O5k66K44J2k87J28L20l46m8N9J5l35L32L9k03J87
2223C5O1l38J31K22q1M5L4l37Q7L65j65o8K54k55n5J48J42j62o2J32k12RJ96n7
2247F9M6J86l40k02K75l3p1J56q6k33J51J38j81N1K36k59j03J50m2L0J71n8m6
2270EN9K1l19K42N8M7j98J93j5j06R7k64O6O7M0m0n5J30n6l6L4j29N9l9O0J42
2296F3l8j47n0Q8J85mJ6j28p9Q5J5K6j75J3J7J04J36j88j1R8J7k71K19N9j68J03
2322a5J0L2l4K4L0O9j39N8j12N2M4O1O5j85J02qJ33j72q1j76K97j21k5k0QR1J27
2349A15k67J09j64K48k15O7J08L1M9r8pO5j08R5K1r2M9k6q9K76j09o4n5k0J66
$$ plain form
2179 63 -226 149 217 72 -97 97 -115 -236 398 12 -264 -19 59 -225 -184 184 -195 -73 95 -297 -85
2200 -85 220 93 -65 227 -132 -169 119 184 -82 162 174 -113 15 335 -11 -59 0 15 -320 12 51 -152 35
2223 35 96 -242 -111 111 30 75 109 -228 -141 224 59 -9 245 -10 -65 83 225 63 1 133 -79 -70 126 69
2247 69 115 301 -39 -241 34 1 -70 86 0 -233 -82 56 -125 -74 162 -97 -200 -50 -92 -62 109 51 5
2270 5 64 85 -234 8 66 113 -85 108 93 -13 84 -180 -114 -47 -7 -47 -102 28 -28 -64 -30 -159 -100 -139 -79 63
2296 63 25 -122 -172 -84 101 97 113 -15 -94 -9 6 32 -143 -130 -113 -9 127 -61 -72 26 43 -228 -9 50 -118 -15
2322 -15 -5 27 -7 17 47 116 -23 35 -77 -25 19 80 145 -40 62 54 187 15 -66 -242 55 -66 -91 -111 -103 -12 115
2349 115 -152 -43 -207 41 -174 -107 1 32 81 -17 -24 41 -67 28 49 -43 6 -20 -109 167 58 -6 -61 -81 85
2374H5J2j36k2J04J2K7m6%K0o4k6j13J10m9J1J5J25j76J12K13j76O4J9j22nO8
2400F2O6k4qk24K71j60o8O7L7J9j16OL9k9On3J66o9P3j19j12J29O9l1j71K00P2
2427I8J53j40r3j2Q7M3j54q7J95k74K83j55n1J77n9Lj11J92k91J06J42j78L4K04
2451A12m0r8J02o5j0P7J07k80J01J01j09j87K46j58J49J28l18%J78J1k1K03j31
2474I8p8JQ7j05j15J36p6r8K51k9l24J61po3J61J01l76K86J13k38K19J16j06k43
2498a28K70q4o3J54o4j56OO6O2k0J67k64oL6j78Q4N14l27l75M07k7k64K10K98
2522C18l29q3K05j95j1M08k28j53j26K92j41P5R3l04K3L13l00P8L04l08j64M12
2544A79l05jR4l8j06J17M2n9J88J71l55l8K2m0J07K42k00j10L91l26l04M18J39
$$ plain form
2374 85 97 -39 -61 43 55 82 36 36 56 -8 -34 -147 -37 -86 -75 -60 65 -111 1 214 38 102 121 -1 -6 62
2400 62 128 104 96 -128 143 -17 -85 -18 19 38 -78 -72 -33 -62 -56 -109 57 -12 61 -58 -170 -41 28 -3 -174 26 98
2427 98 251 111 18 6 93 136 -18 -105 90 -184 99 -56 -107 70 11 14 -97 95 -196 -90 52 -126 -92 112
2451 112 72 -26 76 11 1 78 185 -95 6 107 -2 -189 57 -101 48 176 -142 -142 36 47 26 229 98
2474 98 20 21 108 3 -112 24 -52 -150 101 72 -252 -91 -98 -161 0 101 -275 11 124 -114 105 221 115 -128
2498 -128 142 58 -5 149 85 -71 -65 1 63 43 210 -54 -60 -24 -202 -118 396 69 -306 101 74 -190 20 318
2522 318 -11 -94 111 -84 -95 313 85 -68 -194 98 -43 32 125 -179 -156 157 -143 -65 239 -69 -233 179
2544 179 -126 -127 -33 -71 -177 -60 -18 -77 111 282 -73 -111 -89 -129 -22 220 20 -90 301 -25 -329 89 228
2567B28k05M7J7j75N3J09o1K1M8j38j18L55j4k91L2l1p2K16L3q6l4J75k00p0L04
2592A43j30p3J77j52j59J01K62m8k25K11l00N4K48N4l14K43O5m12J33N0L7J44
2614A09J01k58j48K30j38J99J85j98j31K63n9k41K96j69l03K07J88j68k1K45l87
2635a98q4K99j3j23M53l64N8l6j48J68o1J45k12P5n2J65j48K62j77L4K2N9k48
2658a24J36K97k68j05K58l26J1K95k49k0R5j29l0K14K48l88l3J87l36K90J51j66
2680HO5n5rq3L77j94n3q8j1j3K4J24L6j00J01l54P7M17k83L3N5o2j39J41O9j29
2706d6K19j43k27J94O6j12M2oj02k1M5J77m3m6k0J06j87J52j2O4j06J16l41J71
2730f0J44n8p0N6j36k1J36M5j12Q1j07O8l5J61k25J61K59j47q0j63J03L8Q8l9
$$ plain form
2567 228 23 70 87 -88 -35 74 13 34 82 -56 -174 181 167 -124 -92 -123 -195 21 54 -32 -66 109 -91 -161 143
2592 143 13 -60 117 -35 -194 -93 169 121 -104 107 -193 -139 109 163 -151 92 157 -255 -122 -72 -35 109
2614 109 210 -48 -196 34 -104 95 280 82 -49 214 155 -86 210 41 -262 -55 133 -35 -56 189 -198
2635 -198 -282 17 4 -119 334 -30 28 -8 -156 12 -49 96 -116 -41 -93 72 -76 186 9 43 65 124 -124
2658 -124 12 309 41 -64 194 -132 -121 174 -75 -95 0 -129 -159 55 303 -85 -118 69 -267 23 174 8
2680 8 73 18 9 -74 303 109 56 -32 -43 -56 -32 92 128 28 129 -225 -148 269 -14 19 74 12 -127 14 83 -46
2706 -46 173 30 -197 -3 63 -49 -7 -13 -115 -136 -91 86 43 -3 -23 83 -104 48 36 100 -6 110 -231 -60
2730 -60 84 26 -44 12 -124 -145 -9 36 -76 5 -102 -34 -69 92 -133 28 287 140 60 -103 0 38 126 87
2754H7j11k3J4P7j10Ln6J89j13o1J26j17J9J10j77M3J29l1j49R0M7L1L0j02J75
2779A20l4K8j92J21j36J15j50O5J75o5kJ09j56J6J5M7m4M2j5k10J11l2J81l07
2803a98J07J88j60R6q8l0J43m6J18j10J5j56P1L2M4j5J05j09l0m0Q4K5O0q6j5
2828EL8P9j70L1K9j3m7M1K76k50l3j29J35J02j0j63J81J45k40J6K00k03JJ9J9
2853E9q0M8j58J21r4J40n2K2PJ71j4j70o9n3J02p1R0q3J44o1Mo2R7j14J15l1o9
2880f1J39q7K7J26p1j07J46j56pJ29k18O7J56Jl3j08J9oM8N9j7j14J95j27O5k6
2906C9L9p6n1R1j58J8K78k61Q9J7m2O5k7j2o1q8J16j8kJ35j42J15R0j89J50j74
2932e9j13J16RP7j48J85k11Q6j29J51k9o8J64o3R5l0L1N5o5q9O3j28K42m13K02
$$ plain form
2754 87 -24 -47 -33 44 -66 -63 -119 70 -43 -104 22 -95 -76 34 -143 -100 29 -2 -151 -61 -14 17 47 -55 120
2779 120 86 114 -78 43 -93 22 -128 -63 112 47 45 154 -2 14 29 76 32 74 59 -151 -40 -72 109 -198
2803 -198 -91 97 -63 33 -55 -85 58 12 130 20 35 -121 -50 -18 26 11 116 7 -23 -63 21 46 106 20 5
2828 5 43 122 -48 -17 12 -1 -48 -7 269 19 -14 -143 -8 94 84 -79 102 247 7 23 223 20 21 40 59
2853 59 -21 27 -131 -10 -104 36 -16 6 13 184 170 0 -69 -122 -20 -91 -1 -84 60 -1 3 -59 38 -76 39 8 -61
2880 -61 78 -9 18 144 73 -34 112 -44 -51 78 -140 -73 83 84 51 -57 -38 -44 4 63 46 -68 127 0 65 39
2906 39 78 2 -49 42 -116 -98 180 -81 8 25 -17 48 21 9 -52 -140 -24 -42 -44 91 -51 64 154 -35 115 -59
2932 -59 -172 -56 -47 30 -118 67 -144 -58 -187 -36 -65 -133 31 -32 63 33 64 119 54 -35 28 -100 142 -271 -69
2957f9K21l21o1K50j1k50K80q0M3j43J52J3o4Nk39K74K12j92K6N7q6J53j62jJ09
2982A16j57qJ56K1j37Po7J53l1j67K57k60mJ95L5j76J40Q6k81Q5O7j01J01J6m3
3007CJ6j65J28pJ69j65n5Q3O2j12NR2j42QJ99j32p1R5m2o7L4j09O4K33n3%k24
3034a53Q3j52Q4J20J81j31J54q2j23m0J00j02N5J43j84J8N4R0l8J1j35K2P8m9
3058DMj3p7k05K81K83l52K9J24j15m4J30j48K51j63J12j60q7K20r6J01J1k06q
3082a24K38j9l0j2o6j09J17p1k1L00j40k19kK02l5J1K14l61k4J63O8J44j60L7
3106A01k53J71J92l26L11j50l18J43o5L52j39J34k03p1J95q1l1L2J27l17K21q3
3128e8L2l07M65j24q4J98l29J97J85P1m54L82j07j35K5J19p9j70J41l9J21K2r4
$$ plain form
2957 -69 152 -169 -230 20 9 -241 39 -41 2 -141 11 24 -40 -35 -274 0 212 20 46 103 17 170 8 7 116
2982 116 -41 -49 107 128 -9 -2 -69 84 53 -114 143 -117 -121 74 109 -67 73 159 -122 -37 30 -71 30 46 3
3007 3 19 -146 -18 -25 144 -21 -76 7 69 -43 -38 54 -88 -80 119 -13 -84 11 -31 -98 -64 -173 -109 124 71 71 -153
3034 -153 -70 -222 -138 -18 163 32 186 104 -19 -59 41 -61 -6 137 -47 -29 25 115 77 88 -47 -25 53 4
3058 4 8 -5 -82 -287 -6 277 -75 -46 78 -37 -81 49 -99 152 -11 101 -59 -146 74 -22 79 90 -116 -124
3082 -124 114 95 65 53 -13 -122 -5 -76 -97 203 63 -156 -158 44 9 20 234 -127 -151 12 80 224 64 101
3106 101 -152 19 211 -115 196 46 -272 -129 -194 158 19 153 -50 -121 74 -7 -38 -6 121 -196 25 -58
3128 -58 -26 -333 132 8 -76 122 -207 -10 175 246 -208 174 67 -68 -43 76 -3 -173 -32 -71 50 72 -22
3151b2l9J59n3o7kJ06k26J6K20j97J62J95m3k28L0J43k31K23m7k44K91j12PL5
3175G6O7k36J06J50j86j43J94L7k40K86k36PrK13P5r7Q1j53j63K55O5l01K96j07
3199C7n1O7N1j57N5J28j10k9J38M4J8K4k87j31L65j18j93K01J10l50J52J12l2
3222D4M7R8l01jP6R9r4P1q0n5J02J6k14J04J07q1j2M7J28m7N6j32j06J95Oj34
3248f1J5j1Q0j81K47j74J17q9M5j47O0P3l9K30j0l57J56L0K1J8j14J65j67J24
3272C1k14R6K39r4q5o3O2n3P9lj9K9J3j86J56m2N3L0mJ2j89J53q0R4l6K7o3M1
3300a6K9J12q7J27j45j20J51p2j12J15Mr0J12M1m3j47Q2M3K77k17J4j12K33j19
3324F0O4p3k49K26N3Oj24J24L3k90K21l2J45j45J88k73J73k3j41N7M3j3lr5J84
$$ plain form
3151 -22 -61 98 45 -22 -24 82 -144 -128 92 -105 57 252 209 -19 11 154 -77 146 99 -145 146 34 41 76
3175 76 143 -93 13 163 -23 -166 28 65 -175 111 -125 -118 -127 86 161 64 145 -8 -171 84 149 -152 144 37
3199 37 -14 53 104 -53 2 130 20 -9 129 173 191 215 -72 -203 162 44 -149 52 162 -188 -36 76 44
3222 44 91 189 -112 -113 -37 62 -32 39 -41 -96 6 22 -192 -88 19 -62 -74 -27 101 54 110 -22 -128 67 73 -61
3248 -61 -46 -57 23 -158 89 -85 32 -57 -12 -159 -99 -26 -65 165 155 -202 -46 -16 5 23 -91 74 -93 31
3272 31 -183 -87 152 58 -27 -90 -28 -81 -2 -5 -24 5 18 -168 -12 -54 -1 29 25 37 -152 1 -79 15 -21 6 -57 -16
3300 -16 13 125 38 165 20 -100 51 -21 -133 -18 -14 -104 8 49 6 -141 -59 -16 261 44 58 -54 179 60
3324 60 124 51 -198 28 81 87 -37 87 120 -170 51 19 164 19 207 -66 107 84 -57 0 43 30 27 -68 116
3349A16k19K39j06N7K9K0p1j21J42r1m4K22p8j47O1k6k0J02l8o3p4J8K03o1Or5
3375c9N7P7j29N4jN3o9q3o8R5R3m0Q4K2k4j78J35K5j02O5p2J9kJ7M7L5Q1n3j49
3404e0K1J72k57J04j3P4n9j54Q2M7J19j86R0O1J46k31R1n6Mj1R4r6O1Rn3J26k68
3431a33K58j58j4M2O2j61J18M9j25L6J50j8L2k38L0J46r9lp9O8Q8j4J7jj07J01
3457D7r5M3rM7J80j34m0J6n4j8k1O8K5k5M4k03J37L2j5L9n1k05J63J38l79L01
3483C1lJ51j59J70l19n4K34j03M7j7r1K66j81J26J2l42L50j84kK28j32MQ0p3k19
3508a80K76J42k45M6k03K0K86r9j24O7Lm7j63K69q5L9J2k08K98j74J09j09R5K6
3532E1J8j17L34l22M2j5K3j30O2R3m1j17Q5n6J80J7j40l0K10j60q3K72l50J24
$$ plain form
3349 116 -103 136 30 87 116 136 65 -56 86 -5 -49 173 95 -52 9 -17 -37 65 27 -36 -110 -92 111 50 56 -39
3375 -39 18 95 -34 20 19 72 3 -80 -148 -53 40 0 84 106 82 -96 39 64 -38 27 -45 -26 -28 -11 36 71 152 99 -50
3404 -50 -29 143 -114 -10 -23 51 -8 -162 -80 -33 86 -100 -10 51 197 -34 57 1 5 -6 88 -8 53 62 9 135 -133
3431 -133 125 -33 -47 -5 57 -104 14 63 -62 -26 124 106 138 -100 -70 76 -23 -26 -105 -37 51 37 54 53 -54 47
3457 47 -48 -5 -14 33 213 79 39 55 1 -17 -38 30 55 30 74 -129 8 40 25 64 13 -192 -29 109 -270 31
3483 31 28 179 20 190 -129 -183 51 -52 -5 -22 -113 153 -28 98 110 -232 118 -66 -68 160 28 32 112 39 -180
3508 -180 96 238 -7 39 -164 -144 142 43 -81 -14 -11 -58 -221 48 -37 2 14 -194 104 -70 39 -70 25 51
3532 51 69 -48 286 -36 6 -9 14 -116 -54 39 -2 -119 -34 -90 90 107 -33 -63 147 -13 -96 176 -174 -50
3556e0K05j4l29J54J85n7m8j4j61J35P8J5q7O9j04j97K29K7j99J96Q6k52J43J
3580A1Kj50J57L6r4J03k39J46J77J00m30L5L19j61J35ok11J17jj04J32m3j26m6
3604a41J83r1o7J42o3j57J94K0q3J48k8j39O0R2O9k36L03j30j8k8R2j60M9K03
3628B14k93K07q0J3k12K40j2j75Q3P6k08J74Q7j16lNK9mM0m4p9J37m4j82J94q0
3654c3l5R0J03k17k7K95j45j65R9Oj06J43M4r2o6J13j3q7kN0n9K1R0j22Q0P1l8
3681bJ17k50q1J30J26k6J13J7j20J2J65j72J0J74k31q5K10j14k7j03L50j94m9
3704c0N9K5N8j01J44k10N3l0n0K09m9n2j14O7J0L7N7j18n6o5L1J84J19p8k00J62
3730F2j52J40K3K3k84j3L01k85K20J08J2j25j6j5j45J50Q3l0j02K5J1J79o7n8
$$ plain form
3556 -50 155 141 -188 -34 151 94 46 32 -129 6 84 99 12 81 -23 -220 9 36 -163 33 119 -133 10 11
3580 11 13 -137 20 56 -38 65 -174 -28 149 249 -181 -146 173 12 147 141 -70 47 46 -58 74 31 -95 -141
3604 -141 42 -49 -116 26 -37 -194 0 20 -63 85 57 -82 -22 70 139 -97 206 76 58 30 122 -38 11 214
3628 214 -79 128 48 61 -151 89 77 -98 -15 61 -147 27 114 -2 -5 0 29 25 65 21 -58 79 35 -147 47 -33
3654 -33 -68 22 125 -92 -119 176 31 -134 -35 -29 -135 8 52 -40 -106 7 -6 -93 -95 -45 -104 -83 7 -115 -35 36 -2
3681 -2 115 -135 -216 -86 40 14 127 144 24 36 201 29 39 213 -18 -103 107 -7 -34 -137 213 19 -30
3704 -30 29 54 112 11 155 -55 -2 -32 -82 127 78 26 -88 -21 -11 26 83 -35 -91 -156 -125 59 178 100 -100 62
3730 62 -90 50 73 96 -188 -201 100 -185 35 143 155 30 14 -1 -146 4 87 57 -45 -20 -9 170 103 45
3754D5KJ0O1p3R0n8j11Qj4p8J85j26R0m8k7j25J33M8l5N1j4J25k35J00r4J14p0
3781d6QJ04Mj67J70j26m3Q5M4K5K9m5k4m0P5p5J85r0l3j5o8J02k76L10k66J80
3807Go7o0K13k59K18K7m3K40l92J61k03K27Q0j24j63Q6Q5j12n1J38j5O4P2j78
3831d9q8J13J82k75J43or9r9J75j72K54r7J77k33L3K27j85J43k99K30N1l10K27
3854D3p%M0k93L15q5r7O9M7q8J1J20q0N2R0m7j08K3j00P8R6J9j92J01ML4Kl3l3
3883a9L2m6p9O3J72r2k1K2Q0q1j43J47j4oj2j64J32J17k50Q5R9pj45QK22k84K64
3910H0j23Mm7J18k1M3J70k88J80j23P2j2j04P2j84K29r8Q6j10O4P8l04M38j61
3934E9r5MJ8j15J85J61k09N8J19l48oJ03P9Q9j20KQ6J0mj22M2JKJ06j2n8M9Q3
$$ plain form
3754 45 47 57 118 45 135 77 -34 -26 -40 -118 67 -59 31 -17 -44 -169 -36 12 -23 28 14 139 -96 4 -90 24 -46
3781 -46 -38 66 70 -97 73 -53 -96 -11 33 58 87 42 18 -22 53 -22 163 73 40 25 -43 59 -217 93 -173 7
3807 7 -60 -120 93 -166 52 79 36 276 -116 45 -158 69 149 25 -138 -52 33 -79 -130 8 -7 57 129 -49
3831 -49 -137 -24 158 -117 26 20 -79 -178 -3 -175 79 -18 159 -74 -41 186 1 144 -155 75 126 -184 43
3854 43 36 36 76 -217 98 13 -84 -15 32 -56 -45 75 -5 47 137 90 -18 5 -95 -17 79 98 -94 7 11 45 47 14 -19
3883 -19 13 -33 -112 -49 123 31 10 32 112 31 -112 35 21 15 3 -161 -29 88 -162 -77 22 15 -130 -122 100 -184 80
3910 80 -43 -39 -86 32 11 54 224 -64 116 -7 65 53 -51 21 -163 66 -32 54 -56 8 86 -218 220 59
3934 59 -36 -32 -14 -129 56 217 8 66 185 -163 -169 -66 13 102 -18 -16 70 80 76 -46 -4 -3 -1 105 93 35 84 167
3962A67m12M10j75j71J88m7q8J30p4J01O0n9j28N7Nk0L9J0Q2n0k59K86J1j84L17
3987A96j16p7p6J29r2Q3J3j30J54lj63P9m0j70K60k25K78J4m8l7n2M8J37o4q8
4012A0l4m3R2j7Qm6N5L0P7l7q6j6Q7j21J66j69K6L6n2J12p7m4L7p9l3M8J68k03
4040a05o9J80m0%J60r9J44j50j8k5J66j8mj15k1l6R2o2N9o7l1k5N6J66l57J39
4066h0P5J8l7j2J14k65J72J92k94L44j46j50J00K3J4o8J35m7n8K7k37K7K33o0
4090B0m3M4%O1n7J24j61m8K07k06o6OJ41j62K10N6o5l6l3K6j41K00j04QJ81k20
4116e8M9K5J05j80Q7k01J37O9j25K26j93K28k25R2m0O7j03n1m5P1J62P2j32j53
4140a16R2L0J7K6j02K4J24l4j02K9K06k74J60J15l69J55J71k12q8J34m0O7J61
$$ plain form
3962 167 -245 165 -10 -181 7 -40 -128 2 -72 29 89 30 -98 -41 -36 -56 -17 -7 75 25 -234 52 63 -121 196
3987 196 80 3 -73 56 -36 47 60 -70 84 81 -82 -3 -43 -213 47 -178 100 114 66 29 -23 25 162 98 10
4012 10 -24 -67 25 8 16 -30 25 55 132 95 9 -7 80 -41 125 -44 -18 18 -34 78 1 -43 -6 -85 -118 -70 98 -105
4040 -105 -174 6 -34 -34 126 27 171 21 3 -22 144 126 122 7 -14 -50 42 -20 39 -28 -59 -84 -28 138 -219 -80
4066 -80 -5 13 -24 -36 78 -187 -15 177 -117 227 81 -69 31 54 68 0 135 88 30 57 -180 -153 80 20
4090 20 -23 21 21 82 25 149 -12 -60 147 -59 -125 -119 22 -140 70 126 61 25 -8 18 -123 77 -27 -19 162 -58
4116 -58 -9 16 121 -59 28 -173 -36 33 -92 134 -59 169 -56 36 -4 63 -40 -91 -136 -65 97 169 37 -116
4140 -116 -24 6 23 49 -53 -29 95 61 -41 -12 194 -80 80 195 -174 -19 152 -60 -148 -14 -54 13 174
4163A74r2J7k57L37k12J50j19J35j88O9lj08P3j4KP8q5k6R9J4n8N7l7m1p7JR3
4190a8J22M0j79O9l3r0J26p7J13j3m5OM1j51R0o4P4J17l9k42J69j7j37J5L15k01
4216iL3j1O0j63K3K17j52K5j01k9J0K66j81P1j8K6j95J90l0m1J26J1j28j87J36
4241e1J85m1k36J69k7J01j5L0Kmj90o7j8J37j76J84o2p6K87j04k31M22k91K15
4265A43O1j98R1Km8j87J13k7J32o0Nj42L1k4o0K12l0M2r4RJ0L8N4p0m6K4l5O3
4293IJ21j56J45j66L7n1n9J21mm6PJ13q5J03q2q5J14M2j89J23O1q4r2R1J4j47
4319a45K24k08J75j4j29J46K5j25Q3J22k31P3P8P4k52MJ64O8j86J60K6q1J0N6
4343A17q2NO5k55J14q5J96j09l4J62M7k91K50k1k18K46o4j3n2q2K9J98j89P6q4
$$ plain form
4163 174 82 99 -158 179 -33 117 -2 133 -55 14 11 -97 -24 -38 -36 42 -43 -69 30 44 -14 43 6 -35 -112 -111 -18
4190 -18 104 144 -35 34 1 -89 37 -40 73 60 15 21 62 -89 1 -63 11 128 89 -153 16 -1 -138 -123 192 -9
4216 -9 24 13 73 -90 -67 150 -2 23 -78 -107 -97 169 -12 59 41 67 -128 62 32 -9 117 128 0 -187 -51
4241 -51 134 93 -143 26 -1 100 85 115 117 113 -77 -144 -162 -25 -201 -17 -79 -155 132 28 -203 219 -72 143
4265 143 204 6 97 99 51 -136 -23 -50 82 22 27 -115 -84 -108 -168 44 14 56 -38 -29 -19 19 73 3 -43 -19 -54 9
4293 9 130 -26 119 -47 -10 -61 -120 1 -3 -49 -42 71 -14 89 7 -78 36 78 -111 12 73 -11 -103 -12 2 -145
4319 -145 79 -129 46 32 -97 49 74 -51 32 154 -77 -4 74 148 -104 -100 64 132 -54 106 132 51 61 117
4343 117 35 40 105 -150 -36 -121 75 -34 -68 94 141 -150 100 79 -139 107 43 30 -22 -104 -75 123 -66 10 -74
4368g4R6J19j45p7L13k43n8J58j80J46M7l1j75L3J3K9m9P9l7m5J35j59R2l7J6
4393c4J62k55J82Nq5l4o4J10N7j59R3q4R9q9J94p1J64Q0j54q0j66K55n7j54QR2
4419A5j%l2j03Q3O9J03n0l6R7q2K8k1R1k41K10k35P5j8J09ko8l3L8m4J95k8rl1
4448G9o8j09K2Q8rl7J82j26j48K58l22J20pN9q9J83J85j96j08j4J53j88m1J49
4472A6J0J52k27M5M3j60J85r2L4j60K21j46N8J49k79K6N1r2K43j83K23l1j25O2
4496B3p0J87o0r3j21J69m6J9J1J3M0j64MP8J02j83N0L4K00k08J78j00l0k2j81
4521a70K94j43J57r1j64K03Q5j54n3n8R9J21j89m4R2K4N1j72L4J13R7j82K05j92
4545c7J21j28p1P5J02J10r5J8j46K37k37J03j10J25j44J1J3n3J48r5J10n3J16
$$ plain form
4368 -74 22 141 -4 -81 232 -11 -69 89 -91 55 102 71 -104 -71 -58 -29 -78 1 -36 -81 54 -105 -13 -50 -34
4393 -34 128 -127 55 60 -25 -59 -123 -13 44 -115 -22 -106 -7 -96 98 27 191 271 117 37 -129 126 69 -85 -77 15
4419 15 14 14 -18 -121 -38 31 134 84 48 145 63 91 70 161 -80 130 -105 -30 -48 61 59 -9 -42 -4 -48 147 119 110 79
4448 79 11 -98 -76 12 3 -34 148 22 -126 132 -190 -70 -77 -18 -107 76 261 65 -43 -57 96 -92 -133 16
4472 16 26 178 -49 -4 39 -121 64 -28 6 -154 67 -79 -21 128 -151 -125 -74 -166 77 -106 117 86 -39 23
4496 23 -47 140 80 -13 -134 35 -11 8 19 32 72 -92 -88 -10 92 -91 -41 -7 193 -15 163 63 33 11 -170
4521 -170 124 -19 138 47 -117 86 171 17 -36 -94 5 126 -63 -107 -15 9 60 -112 -78 35 132 -50 155 -37
4545 -37 84 -44 -115 -40 62 172 77 95 -51 186 -51 52 -58 67 -77 -66 -53 -106 42 -53 57 4 120
4568A20q1R7j80Q0j80J80j44M2Q2j88J67J04L6q8o7j07J57r2lP0J13k43MK6J20
4593B5r3q5K35l9PJ5O4k22L23k24j81J79j01L8K13o2j16M1o6n2J11j1j19K09p0
4618A9P5m2ko9J18j06k7o6K64q6O8j80rJ28j22r1J79J5o9p3N9p9K16k04M8K45
4644B09l62JK13j18jJ7J01j76R4JJ00j11j09J75O7j06r0K04m3j1N0k68L19j17
4668C9mQ8M0j64m5P4J4m4m0r1J59r1n4jJ02J01j14Nj09J54m3J2n3P9O4M0j77j9
4696g8J56p4j49KK36n0j2L9J4m8j38J43j86P5n8J60k21J24J63j11k13J60P8L8
4720E0j47O8J40j10l3R1J25o1m9r3K5Ol5O6nj58J52Rj73M8J00j41P5j17J41R6
4746G0Oj33R3j03Q3K3Lj49k2Q6L3j4j2j01N6K6P3Q8j25M0j56K1J52J04n2p4j24
$$ plain form
4568 120 39 136 -44 36 -144 36 -108 -66 16 -172 -5 99 135 47 -20 -127 30 -62 -65 5 118 -125 -121 -95 25
4593 25 -68 -153 82 43 50 65 129 -93 230 6 -175 4 -97 -59 154 92 -24 17 -49 -101 10 -1 -120 89 19
4618 19 94 52 50 -19 99 -7 -34 -100 164 78 146 -34 -43 85 -37 -128 51 66 -3 -76 -17 -96 120 -84 -36 209
4644 209 -153 -152 61 -57 -58 -41 60 -116 -22 -21 79 -32 -141 34 101 -5 -95 109 66 55 105 -163 156 39
4668 39 35 123 163 -1 -46 28 42 -2 -42 -133 26 -65 -119 -120 -18 83 -31 -26 -135 19 -24 -12 -65 14 78 118 -59 -78
4696 -78 78 4 -145 -143 93 43 31 70 84 36 -102 41 -145 -70 -128 32 -189 -65 98 -13 -226 -66 12 50
4720 50 -97 -29 111 1 -32 59 184 123 74 -19 6 12 -23 43 38 -120 32 41 -132 -84 16 -125 -50 -167 -26 70
4746 70 76 -57 36 -67 16 39 42 -107 -129 -43 -10 -24 -36 -137 -81 -55 18 106 -19 21 -135 -114 38 142 90 16 -108
4773a08L15k87mL5l6O1P4j59k9L30j96J6P4j80R9M6j88L50k80J04p3J58k03j9
4797a00K06j56K0r1K74j52j43J94j95K07o0m9q2J78j96jJ1K6j5J12l7n1J04P9
4821H3k57J71o4Q3L8l0M1J3K9j93Q6J07j57J60pr4J03j34R8q8R3J80j94j51J14
4846C0J71j94O3j3p1k7J94k10kJ34n1l6j21R4m9J69Oj75J03mPQ4r7m3p1j2k5N8
4874h8K0N9j01J96K6k96L68j56m9O9N8j11L4j47K20j72J25P3j03p4p9K10J6o5
4898C3R7k61J98k33J51n1Q1j98K35k7j00k8J60j12K9J06k3j33O0J9R4p8R2r0M5
4923F6j55J4o1J7O1n3P2J21j20qJ7PJ8k6J64k1L9k42J41r5J06j68K14j42J11q4
4949gJ1P7m2Jq2l2J11m5j8J45j53N2P0j43O2L2j14J04J01k47R9n2j19K05K11j72
$$ plain form
4773 -108 207 -80 -84 -49 -85 -24 50 -109 -138 192 -4 12 86 -94 5 51 -137 213 -67 37 -36 122 -81 -100
4797 -100 106 -50 -30 -121 153 1 -142 52 -143 64 4 -45 -127 51 -145 -146 -135 -109 -124 -12 -49 -100 4 83
4821 83 -174 -3 -67 16 54 24 65 78 107 -86 0 107 -50 110 103 9 112 -22 76 -12 81 261 67 -84 30
4846 30 201 7 70 57 -14 -41 153 -57 -59 75 24 -12 -133 -39 -88 81 87 -88 15 11 18 102 5 -38 -109 -121 -146 -88
4874 -88 -68 -9 -110 86 112 -184 184 28 -21 48 106 -5 29 -118 102 -70 55 128 25 -49 -128 82 98 33
4898 33 130 -131 67 -166 -15 -66 15 -183 52 25 -75 -103 57 -55 -26 80 57 -76 -16 3 97 19 111 21 66
4923 66 -89 -75 -136 -119 -58 -111 -39 82 -38 -46 -29 -22 -4 -30 134 113 152 -90 51 -44 62 -106 108 -34 77 -7
4949 -7 4 81 39 40 -42 -74 37 -8 -26 119 -34 18 88 -55 7 39 -75 29 130 -117 -18 -70 -189 16 227 55
4975E5J21j08o0k27J42J92j66J03j51K27j70k7%k2q3J59J22j48J0O8j47M4Rl3
4999i0J19J9r6K2J04l7J62l18Q3k7J7Q4r9J01j01Q2j10j13L14k60J56n2Q2j35
5023i3J10M4K1K0k16J49p0Q6j7l5l4j0MPr1m6J14K40j71Ll5P6J44j03L2k47J89
5050G1j71R3J00O8q5J19k31K7pq5J72n3l1K6r2R4n9J27%k10M5J5j4J9P3N8N0k00
5078h1K12o8P0j64r6o5K94N0j27M3j29J25o5l3PL9M4oj81J19j19O6R8Kjo8o0J44
5106E0Q2k84J46jL8K8r9N6P8j68J36j23j1P9j46J61j22K06N2n8l9k01L4J50o5
5131b1K75k67N5o8L1p2N2M3p5K54o6q2m0P1j04m4J45k50Q6J18j20J28K6j18J29
5156H6J4q8k6O4N4l49L32l1o2rK4M7j55J95n2j12N4O6q4M0m1rn0J09k05J00J33
$$ plain form
4975 55 176 68 8 -219 -77 115 -51 52 -99 128 -42 -69 -69 -91 -174 -15 107 -41 -31 37 -110 -66 -57 -90
4999 -90 29 48 -48 -26 78 41 203 -115 -32 -59 -42 42 -57 44 -57 25 -85 -198 116 -144 12 -40 42 -93
5023 -93 17 61 82 102 -114 35 -35 51 34 -1 -35 -45 -41 -34 -125 -171 -57 183 12 15 -20 56 200 97 129 -118 71
5050 71 -100 -7 93 161 76 195 -36 -9 -16 -101 71 18 -13 13 -79 15 -44 83 83 -127 -82 -67 -81 -62 11 69 119 -81
5078 -81 131 63 133 -31 -127 -192 102 152 25 68 -61 64 -1 -34 -27 12 56 50 -131 -12 -131 -65 33 35 34 -34 -94 50
5106 50 132 -152 -6 -7 31 59 -40 16 94 -74 62 -61 -72 7 -139 22 -100 106 158 100 61 -140 -106 44 -21
5131 -21 254 -13 42 -26 5 -67 -15 28 -47 207 141 59 19 90 -14 -58 87 -163 -77 41 -79 49 75 -43 86
5156 86 100 12 -14 50 104 -245 87 56 -6 -15 9 56 -99 96 44 -68 -14 52 -32 8 -33 -42 -92 17 -188 -88 45
5183D5o2Q7j85J43J09j26J08k39J26J3p6O1k39K16p1J63n3M3m7q3O0n2k4J62M
5208H3j11n8k9K35k8j10Q8J0k74K68j31m2r0J36P0NP3k68K65j45J86j98J03k0
5232A8j93K15l8l3R0j19L5J17j90j5J24M5j27J09l5qK41k26l8J68j12l3l4j3l5
5257h7KK9O3j59J19j8%J9Q6r8k9LK0J29j57J50N7l9j85K60l02K55L0k22R7j6M4
5284E1r5N4J15m6j00O5N2k45J16J36j48P8j7J48j71Oo5n8K31j96M0J31k88J19
5308h7J23o8kR7k46P0J32R7p6L5l0r9LK19l66J08J68j42J34m4QJ07j28N3n4j1
5334AQ9j01J03j7l9p0oM6LO0m5Q8K5l3q4L7j24R5N5j52P1j20N4j4J01p3J24m8
5362B6jj25J20l7q5J62k1m2j22J51P4r5M5j94P7K1J46q1j4R8L4r7nj85J10ok4
$$ plain form
5183 45 -17 70 -115 28 137 11 119 -120 6 19 -57 4 -235 -19 -90 73 20 63 16 -67 -7 -59 -83 79 83
5208 83 -28 -86 -115 120 92 -18 70 80 -194 74 -57 -99 -189 -53 17 22 95 -173 92 -53 133 -65 38 18
5232 18 -175 40 2 -31 59 -60 -25 92 -98 -113 11 56 -71 38 3 -5 236 10 -28 140 28 -5 -39 -52 -87
5257 -87 -85 -56 7 -152 -33 -51 -51 -32 54 -44 -73 -70 -50 79 -78 72 129 90 -95 165 -137 118 148 -74 23 7 51
5284 51 -44 10 125 79 -21 44 96 -149 -33 103 -45 33 16 164 -7 -1 -66 -124 107 -89 -49 82 -206 -87
5308 -87 36 -32 -34 63 -183 -113 19 116 40 75 45 -54 -51 168 -198 -90 78 -64 70 26 34 141 13 66 12 1
5334 1 90 -11 92 75 36 -34 -40 6 9 69 24 112 137 104 20 57 -67 28 83 -69 2 -118 -64 -78 23 -50 74 26
5362 26 25 -100 20 -17 -102 60 39 -3 -125 26 100 5 50 -144 -67 -46 100 19 5 103 137 40 35 -150 -40 -46 -70
5389g0J58o7J07q4j05L9q0O6L2jJ19k16R8J46o9j36Q1Q9Q2l6j94J97k63J75m6
5414B2r4J28j09J96Kq0j04O7k2q5J8rJ18n0J17j74Q7n9P2o3n0o6J93k04Q8J89
5440A28k40l4R2J07p7N6l9Jj20K1N3M2L6M9j06k3j72L52j3q9O7lj4o5jm3N7j66
5468a44RK34J64j22p3j2j05L6r7K9J91p7j70L30l11K11n1J6j5n3j85L41k50J84
5492H0q5l9M5Q5j92J68j80J80j28L0o2J51k5j17J0k8L3N3J02q8Q0n1m5O5M3Q0
5518A65L1l02J68j11J16j34j15K94k49P5J57m2Lo6K1K7R1j49N2rP5o0R6k30J61
5543F5Qj33j6l9K15j09J77l46K03m1M1m9O0J33k05O8o2O6L8jk51J27lR1o9j26
5569a58L24j38Q8j39l3k3J47Q4k87J45o4J05k7J24r9m1Kq3J30N1k2m5N5J0M5q6
$$ plain form
5389 -70 88 21 128 44 -61 -22 -102 -36 -4 -5 114 -102 -4 142 73 -63 18 107 189 153 -41 156 -107 68 22
5414 22 -72 56 -53 143 145 65 -39 28 6 -79 -61 -70 48 -2 115 -59 28 -31 41 -22 -72 -138 55 -149 -61 128
5440 128 -112 -146 -54 53 -24 32 -7 -6 -126 -105 -52 -10 26 75 -31 -54 -226 126 113 24 91 88 74 9 8 -35 22 -144
5468 -144 -135 99 263 141 68 56 -49 -13 -110 -81 110 33 -137 193 -118 93 42 58 43 -10 -195 146 -104 80
5492 80 -5 -44 1 86 -106 62 -118 62 -66 -36 -98 53 28 -89 -79 -107 -74 -21 81 -7 73 22 -23 42 85 165
5518 165 196 -106 62 -49 67 -67 -182 112 -137 -62 95 53 56 -10 11 38 129 -20 32 23 98 38 134 -96 65
5543 65 73 -60 -76 -115 100 -9 168 -178 25 -16 25 -24 36 169 -36 32 -30 36 74 73 -178 -51 -54 37 -32 -158
5569 -158 166 28 116 -23 -56 -79 68 152 -135 10 -54 51 24 148 49 8 10 -73 57 108 86 41 96 106 151 65
5595F5O0j66p2J15R3j4j22o7J52n3M2M3J01j35J16j18P6j18j16K2J35j43O7J6
5619b1j12K32j71K01k47J21J1n5k9J97J1j34L7j4L1n4j61J40J04j46J10j79K44
5642A16j12j14K47j99P6j21J3R4J1K6J7O1Oj91J16j16r6Q5j01K35l9q9N7n6P0
5667dM8j18J94k09R9n3L3q2R2L6J13r8l2J6O8m2j68O5q2J28m2PO3r1J41P9j75
5694a4N0r4L2O9j52L6j8J84l3j36K6J66r2NJ63r5j32R0N0j22O6j57N6p9K26o6
5720B9J0j25J23J1K3j37J59p9Mp7J05o3lP3p3L3J35l76K61k6n6Q3J1Qo6p9j2K0
5748h4J74P7j28r1J09K4j16O2Q9j00Q7j10M0P1r6Q9j21J4J1j1O7M0j62Q0k6j43
5774a54J99J2J1pk94J47K28o9k2o4M8k98K52l1J46j90J50M7n1k1n1l7L3l7J96
$$ plain form
5595 65 125 -41 -113 2 95 81 -41 -108 44 -9 33 76 177 42 158 40 116 -2 -118 -96 39 -104 -37 -21
5619 -21 -133 99 -72 129 -118 3 14 -41 -70 127 138 4 41 27 58 4 -157 -17 87 -59 51 -128 116
5642 116 4 -110 137 -62 14 -107 -94 0 11 37 54 115 121 -70 46 -70 -166 -81 -182 53 14 -75 -18 -74 -4
5667 -4 44 -74 120 -89 10 -43 -10 -92 0 36 149 51 19 35 103 61 -107 -42 -124 4 -38 -31 32 -59 82 161 -14
5694 -14 36 -58 -26 43 -109 -73 -91 93 60 -76 -50 116 24 29 192 97 -35 55 105 -17 49 -108 -52 -131 95 29
5720 29 39 -86 37 48 71 -66 93 14 18 -59 46 -17 -20 53 -20 13 148 -228 33 7 -49 34 45 53 -13 -92 -104 -84
5748 -84 90 167 39 -52 57 81 -35 27 116 16 103 -7 33 104 8 97 -24 -10 1 -10 57 97 -65 15 -11 -154
5774 -154 45 57 68 61 -233 -86 142 73 51 -13 35 -263 -11 -42 104 -86 64 111 60 39 -12 -49 -16 -53 143
5799A43j06j89J02K12N9k60O5j37Q0K9k1L8j6K8j53O4N4l4j8J26p7PJ24j93N4
5824a9K4R2K7k50K5L64k63J12L6j00q0O0j98K10j53R1j56K25j05K2J9o3Q8n6L0
5849a8Q9j16J8L6j14M8R6J4M4n0j31k9J22L4o5Rk6R4M3j22j58K6J79j36K60q2
5875F5j09m1M5M7r0JJ0j4N4R2j24mN3k5P9o6J71j37k7j9J82o4j09j32J96j27k4
5902a17J97L8j23P6Q2l7k20K26l18K14J44l59J45l4L1p6K02j48K4J63k15K16p1
5925D0m3r1J02N2j02Q4j94P9J03P2n6Q1j53J05j22P6P7m2Q4n7r4K0K0L3J1j65
5951h0M0Q1or8k8R8N5j66J77jM1j8o5Q5j11J47j41r2K16j45q1L0L8J48O5k84J58
5978F3r9j17M9J10J9R4l0j79N8rN2p2J04jn5J03j56L2N0M0p4k2L7j1N2q0K1J60
$$ plain form
5799 143 37 -152 -50 162 221 -39 26 -111 -31 -2 -23 15 -1 27 -126 -62 -8 -42 -60 66 -11 -4 120 -73 -19
5824 -19 5 97 124 -126 -101 263 0 112 148 48 -32 28 -170 40 -113 -22 -178 47 -58 -36 -17 -80 8 -48 -18
5849 -18 71 -45 -27 9 -105 -57 39 53 97 47 -84 -113 9 43 -22 -13 -39 55 98 -24 -182 -156 23 -113 147 65
5875 65 -44 -85 -40 7 -83 -82 -72 -86 -32 60 -64 -68 -15 -40 39 -27 144 7 -20 -39 143 79 -30 -162 34 -93 -117
5902 -117 80 118 -5 71 153 116 -104 122 -196 18 162 -197 -52 -86 -55 -131 71 -77 -53 110 -105 111 40
5925 40 -3 -94 8 60 -42 42 -152 -73 30 102 46 127 -26 79 -43 33 110 68 152 95 1 21 41 74 85 -80
5951 -80 -40 41 35 -63 -91 7 62 -104 73 72 113 95 30 115 4 151 10 -82 134 -11 -92 -62 -24 124 189 -95 63
5978 63 -36 -153 -104 6 25 119 89 -90 -32 -41 11 -61 43 42 -13 90 -66 -34 16 56 -18 -40 -3 -14 38 -42 -21 139
6006A39k40J77kj66M8MJ03j27L2J92j74L8n9L4P2Q2k02Q3O5j55l3J99j83J77j12
6031hMj11p9K61j8K7l3k22J28ll6K55l09J22K7LN6j12R5L3j37Q4Q1j0J0j31J52
6058A29j71j30K19j60K36j26n4K95k37J09j84P8p2j02J38m6O8o6j67J66P0K4p4
6081e7M6j13K47Q4k78P0N5rO2j32M7K05j86M8J09j39n2kj42J62K2K3l5N2j57L9
6107c1J00p9K3j19K97k49J31K8L7j16P8k56rL71j98l9j5P6K4k5k6l5P8J32k46
6132f8p0J66Q9j57L4J5j54L30q3k1j3j57K9j5K53j95J17l6r1r3J23j8J31o2j63
6157a09J60pj39k0L21l06l0J62k7k6o5K21q5j9R0j72N1O4J21m6j00k12J29J68
6181A24L4j16j85K20n8j33J22M3l5lj18J93j68J60m7qj33K36p8Pk75J40J47K5
$$ plain form
6006 139 -101 76 74 -92 -44 -40 63 -64 -32 160 -14 24 -35 -1 71 153 -49 34 99 -56 -89 110 -73 104 -8
6031 -8 -4 -115 -194 67 49 76 43 -179 -51 -54 -90 165 -144 -22 5 8 64 -48 47 80 -57 27 108 98 108 -23 129
6058 129 -42 -172 47 -113 123 -3 -57 238 1 110 -74 4 -68 -170 -32 -78 -10 -76 -243 -77 -7 17 -57
6081 -57 -11 -124 123 207 -71 -1 54 45 107 -25 22 227 41 89 198 59 7 5 -137 25 47 70 35 87 -70 -31
6107 -31 69 -10 13 -106 191 -58 73 101 138 22 100 -156 -165 206 8 -31 -46 30 54 29 3 -32 46 178 -68
6132 -68 -138 28 117 -40 -6 9 -145 185 102 81 68 -89 -60 -75 178 -17 100 64 -27 -120 3 -15 116 54 -109
6157 -109 51 44 -95 -115 206 -100 -130 32 5 -21 -86 135 50 31 121 -51 0 64 185 139 39 -173 -44 124
6181 124 158 42 -143 77 19 -114 8 51 16 13 -105 88 -80 80 33 25 -108 128 50 57 -218 -78 69 94
6205I4k4nj3r4J41q8j40J38R5N2Kj05Lo3J24j97J08R3k22O3m5J43j40J87r5j05
6231i3ML2J17o8J02j07P8r0J55r8j00J27pk7J9o8k7j3L4p8J7L3O4J81j56k3J22
6258A30j13K3o2J12m3P8r6l5k5M4p4P5K05k62Q4j45J45m3J1l5l1R7n6M0Q9j48
6284c5O1j47L3K39k50J00j21K18q8P7J32k58O7j26J92K5j18j69J07J27l11M05
6306A60p3j44l7J22L3r0no5J81O1j43L5r3J5J09j48q9L00l33J66J2LK6p0k9K89
6332A93j33Jm4j33K81k60J46k7N5j77j19K50l6N2J4J08r1j61K04o2k22K21q7K2
6356eJ8rJ3k05J74O2oK5Pl5j96J63j35j1J23J49o4j70J61o0j0Jk53K74j10K36
$$ plain form
6205 94 70 65 52 -42 99 11 -129 9 104 156 158 53 56 -7 117 -80 28 121 -101 -38 -83 60 -80 107 12 -93
6231 -93 -89 -57 60 -8 94 -13 65 -25 130 32 -68 59 52 25 44 -24 -51 -64 -30 -108 -91 -58 6 187 31 8 130
6258 130 17 40 -22 90 47 125 29 -6 -31 13 -61 14 219 -43 41 -104 41 -2 9 -26 -57 40 -16 24 113 -35
6284 -35 26 -121 -88 151 -99 1 -120 98 10 87 219 -39 28 -98 94 119 1 -168 -61 66 -245 160
6306 160 87 -57 -94 28 61 -29 -34 -99 82 143 0 35 -58 -43 66 -82 -171 129 -204 -38 -26 -23 3 -67 -96 193
6332 193 60 61 17 -116 165 -95 51 24 79 -98 -217 33 -3 49 63 171 80 -81 123 61 -161 60 -27 -5
6356 -5 13 4 17 -188 -14 48 42 67 74 39 -157 6 -129 -140 -17 132 68 -102 59 -1 -11 -10 -263 11 -99 137
$$ [...]
8191A33
##END NTUPLES=NMR FID
##END=
