##TITLE=1H_4C1403-HBr
 CDCl3
 8 sc, 
 15.3.2023
##JCAMPDX= 6.0         $$ Bruker NMR JCAMP-DX V2.0
##DATA TYPE= NMR FID
##DATA CLASS= NTUPLES
##ORIGIN= UXNMR, Bruker Analytische Messtechnik GmbH
##OWNER= root
$$ XWIN-NMR		Version 3.5
$$ Wed Mar 15 13:57:59 2023 Russian Standard Time (UT+4h)  she@DPX200
##.OBSERVE FREQUENCY= 200.13135
##.OBSERVE NUCLEUS= ^1H
##.DELAY= (6, 6)
##.ACQUISITION MODE= SIMULTANEOUS
##.ACQUISITION SCHEME= undefined
##.AVERAGES= 8
##.DIGITISER RES= 18
##SPECTROMETER/DATA SYSTEM= spect
##.PULSE SEQUENCE= zg30
##.SOLVENT NAME= DMSO
##.SHIFT REFERENCE= (INTERNAL, DMSO, 0, 15.7039)
##AUDIT TRAIL= $$ (NUMBER, WHEN, WHO, WHERE, WHAT)
$$ ##TITLE= Audit trail, XWIN-NMR		Version 3.5
$$ ##JCAMPDX= 5.01
$$ ##ORIGIN= Bruker BioSpin GmbH
$$ ##OWNER= she
$$ F:/spectra/data/she/nmr/H-F/1/audita.txt
$$ ##AUDIT TRAIL=  $$ (NUMBER, WHEN, WHO, WHERE, WHAT)
(   1,<2023-03-15 13:56:57.39 +0400>,<she>,<DPX200>,
      <created by zg, POWCHK disabled, PULCHK disabled
       configuration hash MD5:
       00 E9 B6 7A A2 85 ED C7 34 08 36 98 17 FE 4E 26
       data hash MD5: 16K
       CA 51 AA 6F 55 E7 C4 05 0E 9D 41 F4 EF 50 85 4C>)
$$ ##END=
$$ 
$$ hash MD5
$$ 95 81 DF 19 56 8D 10 51 1C 9B 03 BD A0 B2 4A 5A
##$RELAX= 
##$RELAX= 
##$RELAX= 
##$RELAX= 
##$RELAX= 
##$RELAX= 
$$ Bruker specific parameters
$$ --------------------------
##$DU= <F:/spectra>
##$EXPNO= 1
##$NAME= <H-F>
##$PROCNO= 1
##$TYPE= <nmr>
##$USER= <she>
##$AMP= (0..31)
100 100 100 100 100 100 100 100 100 100 100 100 100 100 100 100 100 100 
100 100 100 100 100 100 100 100 100 100 100 100 100 100 
##$AQSEQ= 0
##$AQ_mod= 1
##$AUNM= <au_zg>
##$AUTOPOS= <>
##$BF1= 200.13
##$BF2= 200.13
##$BF3= 200.13
##$BF4= 200.13
##$BF5= 200.13
##$BF6= 200.13
##$BF7= 200.13
##$BF8= 200.13
##$BYTORDA= 1
##$CFDGTYP= 0
##$CFRGTYP= 5
##$CHEMSTR= <none>
##$CNST= (0..31)
1 1 145 1 1 1 1 1 1 1 1 1 1 1 1 1 1 1 1 1 1 1 1 1 1 1 1 1 1 1 1 1 
##$CPDPRG= <>
##$CPDPRG1= <>
##$CPDPRG2= <>
##$CPDPRG3= <>
##$CPDPRG4= <mlev>
##$CPDPRG5= <mlev>
##$CPDPRG6= <mlev>
##$CPDPRG7= <mlev>
##$CPDPRG8= <mlev>
##$CPDPRGB= <>
##$CPDPRGT= <>
##$D= (0..31)
0 1.2 0 0 0 0 0 0 0 0.06 0 0.03 0 0 0 0 0.0002 0 0 0 0 0 0 0 0 0 0 0 0 
0 0 0 
##$DATE= 1678874216
##$DBL= (0..7)
120 120 120 120 120 120 120 120 
##$DBP= (0..7)
150 150 150 150 150 150 150 150 
##$DBP07= 0
##$DBPNAM0= <>
##$DBPNAM1= <>
##$DBPNAM2= <>
##$DBPNAM3= <>
##$DBPNAM4= <>
##$DBPNAM5= <>
##$DBPNAM6= <>
##$DBPNAM7= <>
##$DBPOAL= (0..7)
0.5 0.5 0.5 0.5 0.5 0.5 0.5 0.5 
##$DBPOFFS= (0..7)
0 0 0 0 0 0 0 0 
##$DE= 6
##$DECBNUC= <off>
##$DECIM= 32
##$DECNUC= <off>
##$DECSTAT= 4
##$DIGMOD= 1
##$DIGTYP= 9
##$DL= (0..7)
0 120 120 120 120 120 120 120 
##$DP= (0..7)
150 150 150 150 150 150 150 150 
##$DP07= 0
##$DPNAME0= <>
##$DPNAME1= <>
##$DPNAME2= <>
##$DPNAME3= <>
##$DPNAME4= <>
##$DPNAME5= <>
##$DPNAME6= <>
##$DPNAME7= <>
##$DPOAL= (0..7)
0.5 0.5 0.5 0.5 0.5 0.5 0.5 0.5 
##$DPOFFS= (0..7)
0 0 0 0 0 0 0 0 
##$DQDMODE= 0
##$DR= 18
##$DS= 0
##$DSLIST= <SSSSSSSSSSSSSSS>
$$ [...]
##$SUBNAM2= <"">
##$SUBNAM3= <"">
##$SUBNAM4= <"">
##$SUBNAM5= <"">
##$SUBNAM6= <"">
##$SUBNAM7= <"">
##$SUBNAM8= <"">
##$SUBNAM9= <"">
##$SW= 18.05172834244
##$SWIBOX= (0..15)
0 0 2 0 0 0 0 0 0 0 0 0 0 0 0 0 
##$SW_h= 3612.71676300578
##$TD= 16384
##$TD0= 1
##$TE= 0
##$TE2= 300
##$TE3= 300
##$TEG= 300
##$TL= (0..7)
0 120 120 120 120 120 120 120 
##$TP= (0..7)
150 150 150 150 150 150 150 150 
##$TP07= 0
##$TPNAME0= <>
##$TPNAME1= <>
##$TPNAME2= <>
##$TPNAME3= <>
##$TPNAME4= <>
##$TPNAME5= <>
##$TPNAME6= <>
##$TPNAME7= <>
##$TPOAL= (0..7)
0.5 0.5 0.5 0.5 0.5 0.5 0.5 0.5 
##$TPOFFS= (0..7)
0 0 0 0 0 0 0 0 
##$TUNHIN= 0
##$TUNHOUT= 0
##$TUNXOUT= 0
##$USERA1= <user>
##$USERA2= <user>
##$USERA3= <user>
##$USERA4= <user>
##$USERA5= <user>
##$V9= 5
##$VALIST= <valist>
##$VCLIST= <CCCCCCCCCCCCCCC>
##$VD= 0
##$VDLIST= <DDDDDDDDDDDDDDD>
##$VPLIST= <PPPPPPPPPPPPPPP>
##$VTLIST= <TTTTTTTTTTTTTTT>
##$WBST= 1024
##$WBSW= 4
##$XGAIN= (0..3)
0 0 0 0 
##$XL= 0
##$YL= 0
##$YMAX_a= 211173
##$YMIN_a= -241478
##$ZGOPTNS= <>
##$ZL1= 120
##$ZL2= 120
##$ZL3= 120
##$ZL4= 120
##$ABSF1= 10
##$ABSF2= 0
##$ABSG= 5
##$ABSL= 3
##$ALPHA= 0
##$AQORDER= 0
##$ASSFAC= 0
##$ASSFACI= 0
##$ASSFACX= 0
##$ASSWID= 0
##$AUNMP= <proc_1d>
##$AZFE= 0.1
##$AZFW= 0.1
##$BCFW= 1
##$BC_mod= 2
##$BYTORDP= 1
##$COROFFS= 0
##$CY= 11.3945322036743
##$DATMOD= 1
##$DC= 2
##$DFILT= <>
##$DTYPP= 0
##$F1P= 2.36226072786647
##$F2P= -0.459571619588291
##$FCOR= 0.5
##$FTSIZE= 0
##$FT_mod= 4
##$GAMMA= 1
##$GB= 0.15
##$INTBC= 1
##$INTSCL= 1
##$ISEN= 128
##$LB= 0.24
##$LEV0= 0
##$LPBIN= 0
##$MAXI= 10000
##$MC2= 0
##$MEAN= 0
##$ME_mod= 0
##$MI= 1.114404
##$NCOEF= 0
##$NC_proc= 0
##$NLEV= 6
##$NOISF1= 3.799351
##$NOISF2= 2.8
##$NSP= 1
##$NTH_PI= 0
##$NZP= 0
##$OFFSET= 15.70392
##$PC= 1
##$PHC0= -19105.54
##$PHC1= 13.60074
##$PH_mod= 1
##$PKNL= yes
##$PPARMOD= 0
##$PSCAL= 0
##$PSIGN= 0
##$REVERSE= no
##$SF= 200.130013532006
##$SI= 16384
##$SIGF1= 3
##$SIGF2= 2
##$SINO= 400
##$SIOLD= 16384
##$SREGLST= <1H.CDCl3>
##$SSB= 0
##$STSI= 0
##$STSR= 0
##$SW_p= 3612.71676300578
##$SYMM= 0
##$S_DEV= 0
##$TDeff= 0
##$TDoff= 0
##$TI= <>
##$TILT= no
##$TM1= 0
##$TM2= 0
##$TOPLEV= 0
##$USERP1= <user>
##$USERP2= <user>
##$USERP3= <user>
##$USERP4= <user>
##$USERP5= <user>
##$WDW= 1
##$XDIM= 8192
##$YMAX_p= 0
##$YMIN_p= 0
$$ End of Bruker specific parameters
$$ ---------------------------------
##NTUPLES= NMR FID
##VAR_NAME=  TIME,          FID/REAL,        FID/IMAG
##SYMBOL=    X,             R,               I
##VAR_TYPE=  INDEPENDENT,   DEPENDENT,       DEPENDENT
##VAR_FORM=  AFFN,          ASDF,            ASDF
##VAR_DIM=   8192,          8192,            8192
##UNITS=     SECONDS,       ARBITRARY UNITS, ARBITRARY UNITS
##FACTOR=    0.0002768,     1,               1
##FIRST=     0,             0,               0
##LAST=      2.2672688,     0,               0
##MIN=       0,             -241478,         0
##MAX=       2.2672688,     211173,          0
$$ Real data points
##PAGE= N=1
##DATA TABLE= (X++(R..R)), XYDATA
$$ [...]
1429C88r68P23N54j191j08J192j001m02J467m66j199P27N69q24Q02O30j144j65
1447d16P52l56m1M57l99o32P54K3m18Q16p1r06O82M19j239N18J296j213m99J023
1467E50p27q80J432L01j577J70Q55j006L67J495q47r34R86j88j80Q01n3r91O94
1486B68K0p58R02L11j211M56P50j358J65J496p25q94J215m53j606J533P99j347
1504d37J32Q83j650K04J674o11o38P58p64l24J348o4o58O80l62q22J127L56j219
1523c87P62M65j490K00J297q86o32J529p69j177J156L66o75N16J37j259J67P82
1541A02j83L40M4j050J05Q41j18J81O87j240m30J388n4r22J211m46j252O15P81
1560F00j064K73O87p04l64N40j95j11Q45k93o45J90j81n2J002M7j143K57O21r89
$$ y = [388, -580, 143, 697, -494, -602, 590, -411, -813, 654, 188, -1011, -284, 285, -539, 263, 893, -251, -416, 336, -20, -61, 396, -3, -635, 119, 142, -276, 540, 469, -437, 245, 664, -575, -57, 1239, 26, -473, 550, -177, -1057, 375, 676, -901, -731, 124, -882, -515, 980, 133, -801, 185, -3, -183, 618, 565, -426, 268, 288, -470, 432, 743, -468, -12, 738, -620, -455, 1041, 316, -578, 637, 184, -1422, 111, 910, -437, -305, 578, -1072, -868, 806, 195, -443, 315, -449, -773, 575, 511, -147, 533, 171, -651, 476, 832, -387, 375, 840, -650, -450, 847, -39, -671, 858, 89, -1088, 68, 434, -241, 275, 412, -847, -680, 102, -81, 259, 303, -747, -642, 199, 81, 262, 949, -291, -721, 667, 613, -309, 902, 456, -796, -181, 600, -464, -191, 496, -208, -572, -32, -227, -338, 507, 214, -431, -241, -422, -474, 528, 575, -568, -311, 310, -679]
1580f79P66J376j618p30J501n62q27J699K30j986P32R92j399OJ603j041p37Q89
1598B15m07p32J206K76j270P31J57j416J344J184j623j52J366j571r7K463j051
1615F23j892J807K74k326J822J513k646K06J858j809m84K375j052j684K084k46
1631D23j810J544R89k044Q63J032k215M22K228j597o13J870j333j424K738q6k186
1648a199J426Q51k320J020K206k408j99J864j407j227K372n22j688J748m8j813
1664a344J258Q50j572N41J448j807k94J944q75q99J628p32j553J684N72j389O19
1681G9R82j560r3J729r89p63J449m49j392J333N34j394L23Q16j295J00J083p72
1699b79k97J033o17q21J274R2q96Q66L56j450L75R51p64k27J149o93p42J276J80
$$ y = [-679, 87, 1463, -155, -885, 616, 54, -773, 926, 1156, -830, -98, 894, -505, -499, 1104, 63, -674, 215, -192, -924, 282, 558, -712, 19, 176, -1240, 104, 1288, -335, -487, 879, -692, -789, 1674, 623, -1269, 538, 812, -1514, 308, 1821, -825, -619, 1239, -570, -1054, 1321, 269, -1415, 669, 423, -1387, 157, 1146, -898, -35, 997, -1218, -796, 1432, -165, -778, 1092, -241, -1665, 1073, 987, -1199, 227, 1078, -1242, -222, 1984, -424, -623, 1241, -166, -1393, 979, 457, -1231, 517, 469, -1344, -86, 764, -808, -267, 1181, -626, -920, 1024, 149, -750, 878, 146, -1407, 277, 849, -540, 79, 1061, -499, -592, 1137, 148, -615, 834, 385, -1007, 326, 860, -534, -211, 605, -690, -590, 493, -279, -576, 457, -160, -981, 293, 385, -511, 355, 711, -739, -364, 587, -177, -404, 745, 52, -690, 586, 766]
1718G66j275O77N22j348L68J023j093j32J003o39n44O96L4m94N99R1q88L89N87
1737C42m90K02N06p32j04O42l10k93P98j45p10L94L43n15J24N25r07nN20l42q9
1758b46K51K9m43K14K80k45R2J58l65m9J00L25k80K47J21k64L53j2j62j6L89m26
1780E1j58K96p4j00j28K76k37j05K52p8j13K60J10n89L43j46j76O5K17l36O8L21
1802A9o2K2K49M6j32J18p2j16pJ39m93J04K66r4j17K05M3j25O7L15m74m2O2j23
1826b02j33K55M5m17L31J64m00L18K44j48j97K75k7k84K73ok67J70J09j19M1K92
1848C17j67j6M0k14k6r6nk34J65R1k69K33M84m02r3K50r1j3J50K7l89J58R3l95
1872d02L21K75j22r8J20N8j31K69j05j30Q8K0k99J39L1l16J24J44j93Q0K87l70
$$ y = [766, -509, 168, 690, -658, -290, 733, -360, -492, 511, -128, -672, 24, 58, -436, 163, 254, -634, -245, 342, -148, 54, 560, -172, -276, 366, 56, -237, 561, 416, -294, 100, 443, -72, 52, 577, -330, -335, 185, -157, -246, 5, 34, -409, -195, 85, -160, -68, 90, -275, -324, -224, 101, -179, 68, 189, -75, 278, 266, 104, 88, 477, 51, -107, 189, 115, 15, -113, 163, -74, -179, 73, -5, -118, 142, 252, -337, 6, -140, -316, -251, -34, -370, -302, 19, -43, -21, 228, 274, 142, 260, 188, 72, 65, 204, -289, -185, 81, -13, -130, 75, 118, -7, 60, 375, -99, -141, -79, -202, -335, -80, -35, -452, -121, 43, -357, -39, 205, 57, -140, 135, 108, -176, 97, 91, -176, -6, 103, -16, 25, 317, 150, 134, 174, -40, -66, -162, -167, -401, -236, -145, -414, -181, 303, -99, -192, 58, -33, -46, 104, 131, -258, -100, -7, -402, -81, 194, 72, -26, 94, 152, 21, 290, 185, 55, 143, 163, -136, 3, 34, -282, -158, -14, -207, -127, 160, -210]
1894b10P1L17j86l43M17N7k07K13L26m31k14M61j10J6L5l1k27l6K81k99J25j54
1916a29l0J72K01k60j3J33p5j60N26m89j78L26k2k93K62K9k02J57K65k04m9K53
1938B20M2k67L70k45p1l1J26j39r2j7k39J54K14j69q8K54k04o8M73k9n20L77L7
1961H8m46M70K70n57j05N46k52k33L74J40l94L74J07n04J62K22k79J54j4l45J08
1982a14K46l04O4L60m95l03O56K4o12O54L9o95K40N39l96l02P17m03k27O48P8
2003D14m32K43Jl59k8J86l5J61J03m63k08L85k35M0O34n39n65Q91L2q41O93M30
2025E08j037K36Q69o35j80P06l79o07P10J75p05L56M12o24J00L89n33L12M43m84
2045C2l02N51o42r3J164m60r50O77J97q74P74O32j113k52J173m21n60O98J77p25
$$ y = [-210, -139, 178, -8, -351, 66, 123, -84, 129, 455, 24, -190, 271, 161, 177, 212, 181, -46, -82, 199, -100, 25, -129, -159, 13, 214, -46, -59, 74, -1, -161, 365, -124, -302, 24, 2, -291, -29, 0, -202, -45, 220, 16, -33, 220, 262, -5, 365, 120, 49, 18, 144, 5, -87, -104, -343, -189, 25, -144, -232, 22, -182, -250, 223, 194, -326, 51, 88, -358, 112, 382, -175, -280, 266, 14, -219, 155, 295, -99, 275, 382, -122, 40, 262, -17, 137, 123, -222, -114, 132, -172, -108, 252, -243, -546, 110, 134, -478, 176, 215, -480, -240, 299, -97, -399, 318, -85, -312, 336, 414, -18, 225, 226, -133, -161, 25, -10, 151, 254, -209, -417, -32, -267, -227, 407, -132, -697, 194, 226, -615, 78, 508, -529, -293, 576, -59, -239, 467, 88, -519, 191, 366, -339, 17, 429, -195, -95, 294, -239, 73, 516, 32, -270, 281, -361, -454, 710, 250, -700, -23, 174, -700, 74, 706, -407, -659, 514, 93, -467, 231, 408, -317]
2065c17M76J64n60K22M13o00j3M88m40r3N91m13j77O29n68m09Q71L40j010L13
2085i3L64q05L24Q01q40l16P58k04n37Q66K97r81L73K19m65K68N20m89r3L64l19
2106A2k62N89k05l58M78j15o36N35J94n79O8M12m65jP89l96l96M56P6n96M91K24
2128C15l16k0J12k38l3L83j49j5K39l39R3J0r8PK72k04l46L02N4k01J70L77o89
2151c14O8L25k10L6K79j82k22J86K90k86J36J26m89K81J54l46K05K06j63k11L82
2172B51j54l27L64j41j42K53l5k97L10J82m48J20J02j61J8J37n8k7K20k8k26J47
2194F0R6j66J92kl11K24K7j72J52R6m21P4J95n4k54K77p6k80K48K87l81J66J36
2217A13l50K5N70n52M6K81j64p6M06j78l42M74n6m27K17L83m91J31J83l14j55
$$ y = [-317, 159, 323, -237, -15, 398, -202, -215, 273, -167, -260, 331, -82, -259, 370, -198, -607, 264, 604, -406, -93, 271, -534, -210, 591, -249, -565, 193, -11, -548, 318, 615, -366, 7, 226, -239, 29, 549, 60, -33, 331, 12, -250, 339, 134, -224, 254, 139, -497, 38, 232, -347, -279, 133, -332, -333, 456, 60, -336, 120, 196, -400, 91, 315, -1, -21, 91, -147, -180, 203, 54, 39, 278, -61, 32, 42, -56, -49, 223, 19, -327, -25, 29, -172, -2, 375, -314, -246, 79, -131, -95, 184, 2, -220, -34, 256, -30, 106, 232, -257, 24, 178, -168, 37, 243, 80, -131, 251, 97, -230, 134, -7, -149, 104, 69, -228, 82, 264, -184, -64, 38, -123, -105, 32, -26, -53, 167, 139, -87, 60, 156, -10, 182, 180, -131, 93, 120, -52, 100, 196, -225, -151, 44, -10, -264, 13, -63, -343, -95, 192, -189, -23, 113, -237, -212, 358, -194, -148, 133, -31, -107, 299, 121, -221, 253, 197, -230, -13, 370, -121, 10, 193, -121, -276]
2238b76M06q0l99M93j4m87K35L73n30K26J35j45j53L47l85N6L51m3k75L62J57
2259C54p87L16J91j4j49M36m45n4L07l47r9L65Q7l60K11K04l78L26J5k70j04J68
2281b7J0l27L91q9J2k1P4n8K3K92k54k5J38k5k66M46r5k52J72l7j00j19K53l38
2305b22K36l2Kj40J73n4k02L74Rl12L15l9j69k0K49j58k80M32j25j56L15j22j70
2328i6K85N2l37K08J13j99k20K38k15m6M16k55ON0J45l58L13jj83j4J20K0n4J22
2352A10L6k24J80n2J0p9P3m4N1J2j29J15RJ25k50N1m2p7J55r2n5J75p4q3j56K28
2378b7j49K77k22K47Ok15K94j60j16K42k00J52qj58J8N5r2J10j55k2O2J99l28
2401a90J77O4j49MJ01P9p4M8j31M5j53J75J46l4r2l8r3Q2L7p0J39m3k01L94j27
$$ y = [-276, 130, 50, -349, 144, 130, -357, -122, 251, -279, -53, 82, -63, -216, 131, -254, -198, 153, 110, -165, 197, 354, -433, -117, 74, 60, -89, 347, -98, -152, 155, -192, -291, 74, 161, -199, 12, 216, -162, 164, 179, -91, -195, -27, -17, -344, 47, -42, -30, -51, 23, -35, -12, 280, 26, 1, 139, 114, -152, 294, 199, -53, 119, 82, -18, -137, 116, -222, 14, -18, -16, -156, 17, -37, -239, 135, 144, -168, 147, 108, -61, -81, 168, 10, -270, 162, 37, -119, 196, 74, -96, 189, 241, -96, 112, 225, 26, -194, 44, -171, -217, 199, -56, -50, 0, 145, -213, 100, 99, -84, -98, 22, 42, -12, 110, 146, -78, 102, 50, 60, -19, 54, 10, 61, 73, -56, 59, 68, 193, -57, -6, -48, -125, 30, -62, -117, 58, -16, -99, -255, -27, -176, 101, -121, 126, 132, -83, 211, 51, -65, 177, -23, 129, 121, -37, -19, 36, -56, 54, -101, -123, -61, 138, -190, -13, 51, -98, -94, 7, 86, 12, 60, -71, -26, -179, -4, 142, 108, 16, -22, -115, -33, 4, -66, 73, 30, -171, 223, 96]
2426I6m6N4j64j10R5R2j89M5J47O1k67K25Jk98J63N0K6J59p6j27JM1q7P3J97j73
2452a1pM01l00j85P6R5j82K32J31k90k03K89j02j64J57J1p9R8J72l40PJ25k7J17
2476B1M4j86K9J6J21q7L47k53l33M41J2m20M78j33j36Q5J97m78K18K34k80k2J76
2499I1k63k8O4K03k12J74j78J10J69j10j92K48j26%KK33q5k93L55j04r8M9J16
2522A25l32K51K01k46j20K35o9j41K08O7k54l6J78k22J38Jo8J97p3l7N2l5k24
2545b04J35J57q7k26L42j20j64J14K91k12k43M04k35L0J55j18j47L37k17p7K8
2566e7Q3k65L27L8k05R1N4l54L12J18k34p8L86j19j63J49M7k98L36J12l61j31
2588b12N49m09l5J47j2k77L73j36m1L9P6j19N9M5l85K66J05J7k34M04l08j51L92
$$ y = [96, 50, 104, -60, -170, -75, 17, -172, -127, 20, 81, -186, 39, 40, -258, -95, -45, -19, 140, 64, -63, -62, -21, -108, -35, 162, -11, -18, 383, 83, -102, -26, 69, -113, 119, 250, -40, -243, 46, -56, -220, -63, -52, -131, -33, 139, -201, -194, -69, -96, 21, 65, -121, -92, -76, 45, -42, 305, 52, -281, 160, 172, -248, 230, 97, -39, 46, 243, -235, -17, 217, -63, -85, 91, -172, -200, -136, 67, -145, 29, -149, -39, 130, 20, -172, 76, -50, -50, -48, 185, 100, -193, 162, 58, -40, 9, 125, -207, 44, 245, -1, -121, 114, 45, -96, 112, 179, -75, -111, 67, -155, -17, -16, -84, 113, 40, 3, 55, 20, -204, -69, 88, 1, -225, 117, -3, -167, -53, 238, 26, -217, 187, -48, -18, 137, 19, -128, 209, -8, -85, -57, 26, -239, 88, 126, -79, 12, 66, -288, 24, 142, -92, -170, 216, 97, -66, 83, 130, -168, 168, 280, -81, -212, 337, -72, -107, 40, 28, -249, 124, -12, -53, -14, 62, -57, 2, 47, -338, -72, 33, 50, -184, 220, -88, -239, 153]
2611A53K5j68K72p5l76M89j32l34m0M31l45q1L90k02j16J35M7l14M51j41l87K74
2633d4K89m73J26L92l15m7L87j77l32K85J7k48K73J70m31J21K45l18k8K64k7k86
2655a57J27Ok3J15J59m73L11q1j62P9J62k31Q1K70l30k3L62%l64L56n2k23K11
2678A20j2k14pK90j96k33M12j27j49J88Q5j82m2J86k58Q6J14j03M4k1p4O1J46
2701A14j36j11K78p2k17K17K13l75p3M16j82m0K69j11k83J51n4r0j8J77l01J0
2723b18K57j19j37K99j86M5K47k28k8J56l0k71K64P2k88K73J01l04J79J77l21
2744f0J49j55J09q9k6J73k42J70n6j24O4K20r8j09P6k6j31J01N7j94K21j54r5
2767b19N7Q0rJ04P1n9O1J9k4L3j48k8k5K13o0j20K04j49P3o0N2l3k43K42j13j6
$$ y = [153, 178, 10, 282, 207, -169, 320, 188, -146, -186, 245, -100, -181, 209, 7, -109, 26, 73, -241, 210, 69, -318, -44, 245, -228, -102, 290, -25, -72, 315, 138, -194, 91, 108, -140, 133, 303, -128, -7, 238, -80, -108, 156, 129, -157, -30, -24, -47, 68, 227, -246, 65, -16, -178, -99, 63, -168, -87, 183, -147, -170, 192, 192, -172, 184, 132, -91, 120, 108, -106, -113, 177, -19, -252, 160, 33, -116, 72, 157, -25, -67, 119, -139, -53, 61, -42, 2, -19, -93, -32, 114, -22, -133, 145, 73, -144, 73, 286, -89, -162, 254, 72, 32, 301, 190, -93, 58, 4, -86, -104, 73, -228, -218, 39, -80, -217, 82, -104, -59, 188, -40, -68, 88, 58, -213, 51, 123, -165, 108, 209, -95, 84, 261, -60, 89, -66, 43, -46, -72, 101, -141, 29, -27, -151, -87, 133, 35, -74, 2, -24, -155, -54, 3, -191, 30, -124, -219, -162, -82, -91, 13, 84, 25, 86, 105, 81, 114, -34, -62, -87, 126, 66, -54, 150, 1, 74, 14, 66, 33, -210, 32, -81, -97]
2793i7N5m4L2J3j68J17J53o4q0N5K7J49N1j24j00k9J4J63j00J48j5p2l7J5q2J25
2819A05j24j14R4r8K12m0o3qj8R5j55J62o1N2K6j18K30m30K53J5j1N2J13r2j31
2844e4j70K17l3KM9o4M1j39J55n8j1j1P1J47k87N7J78r5p2J48k33J47J00j6J37
2869B06k73O9J13O7j59m8J0K8r7M3j00JR3o4OO6J56J01k84O0J07k79J48l3j63
2894b26J53J23j09J21N5R8l22P7K11j07L4j41J40j04J2R4o0o1m0J0Q7j11kpO6
2919iOj36J51J03j27O6j42M1k9J08j99J93J00np7Km5l13L92P0n4j77j34J69J33
2944H7kj65J52N2l02R4O3o9j74K31lj2M7R8q0j1K1M6o7M3J2j41J08n9k8K8Q8N2
2972A09l2J17k33O1p1J18m0m8J0r8K44k97O4Q8k4J36m6Pj34j38K35Lj27K67l79
$$ y = [-97, -42, -86, -54, -41, -209, -92, 61, -3, -83, -28, -1, 148, 199, 75, -25, -54, -40, 123, 23, 171, 156, 84, 47, 62, -20, 105, -19, -133, -39, -137, 75, 35, -28, -36, -54, 41, -114, 48, -13, 39, 65, -53, 177, -253, 0, 15, 4, 56, 169, 77, -54, -224, -7, -40, -38, 11, -53, -12, -151, 4, -54, -65, -76, -5, 142, -145, -88, 90, -5, -77, 71, -162, -15, 85, 69, 206, -67, 2, 115, 182, 23, -25, -15, 13, -84, -41, -141, -140, -47, -111, -105, -39, 117, 218, -66, -6, 101, -178, -30, -63, -226, -73, 50, -59, 62, 117, 215, -107, -30, 181, 74, 108, -33, 107, 3, 15, 109, 49, -12, -52, -42, 45, -66, -68, -75, -9, -3, -139, 12, 115, -12, 54, -88, -47, -76, 32, -167, 26, 126, 121, 44, 46, 1, -312, 80, 150, 96, -81, -215, -46, 87, 85, -80, 72, 124, -178, -84, -21, -90, -264, -33, -36, -48, -1, 97, 17, 6, 27, 73, 6, 49, 61, -80, 28, -31, -59, -31, 57, 109, 77, 194, -39, 22, -49, 69, 29, -19, -9, -107, 137, -160, -96, -8, -32, 104, 58, 65, -69, -207, 28, 31, -96, 171, -208]
2997b08J77J20P7k11P7l6%J15j92MJ18O0j62QN0j10K0J00n2P4J6r9r2J16R9q1
3023a2N4J2n6Qrj32J37Q8m6O4n9R1j09P8J64l44K1jk08J21K89k65JL04k01j86
3049a96N15k81p9j4J61l7k05J18l6r4L43j53j85J54M4p4M6Rr9J51Qj03j04J85
3073G4j97K9K65k24l4K47k99J1K35Pl23L45Q4j70l3l4L2k57L07j0j23K15Rk84
3097a28J87k1j92J89j16n2J17K80m68J38K10q6j97J28J7k47L63k3l26J06J9M9
3119e3m4K59n4k27J82pj02O8N9p0j9L5n3KK02j49k6K28k25r4K30r5r1K9K9k66
3145b52L58L6l26Q9N2j58P1J34j14K6J75j24J43J35j05k23K22M9j84j02J20r9
3167g7J45J55m66Q3L45k52M9N1L2l2m4N3q2P7J65j88k00J30Q5l9Q6r4o4J31j9
$$ y = [-208, -31, 89, 166, -45, 32, -4, -4, 111, -81, -77, 41, 101, -61, -53, -3, -113, -93, 7, -45, 29, 45, -54, -146, -30, 69, -12, 42, 54, -2, 6, -3, -135, 2, 90, 44, 108, 49, 140, 31, 109, 273, -71, -50, -51, -259, -138, 151, -114, -113, 191, -10, -196, 319, 38, -41, -55, 106, 69, -136, -18, -54, -148, 195, 42, -143, 11, 55, -19, 27, 36, -63, 88, 96, -7, -111, 74, -123, -94, 171, -53, -87, 160, -139, -128, 107, 114, -209, 136, 220, 50, 17, -17, 15, -242, 65, 55, -68, 147, 156, -128, 59, 38, -154, 35, -81, -133, -16, 264, -204, -66, 144, 58, -139, -11, 6, -241, 122, 99, -227, -121, -102, -53, -97, 162, 108, -119, 63, 56, -46, 22, 81, 11, -8, 27, -26, -24, 178, 29, 3, 231, 6, -88, 142, 47, -44, -15, 14, -252, 106, 142, -184, -95, -43, -201, -130, 4, -110, -84, 91, -33, 110, 245, 140, -83, 139, 188, 4, -98, 22, -77, 68, 223, -243, -160, 185, -67, -18, 33, 65, 33, -11, 42, -40, 37, 202, 14, -186, -56, 29, -10, 76, -18, -82, 49, 30]
3192C0r9R4j20J62j52J08K0r1L30l32p0J72J03k05J80Mm49K45J42j29J7L4j06
3215a12Q6J59r4n9L3j19N9k3J12j42K53j2j22l3j8J22k17L32q9m0M4j07j27J13
3239aJ17j22j1O5r9jJ73j38n1J81j56j5J06j4k02K21m6n1J78j13oQ5J52k59k0
3264b7J50j70oJ02j0n2J99j07j71J3J15j15J22Q3j71N3J35k12K8J67m4j94K05
3287I3J6j2k44K88q1j01J90N8rk89N6J9m9J26j84J59J32k52Q9l1n9NO4J21j50
3312d5N8J16k28Q8k3q1J78j38j00K21m8K0j97Q9J6J30p2j61J20k7M2p7j53L27
3336E5j04N0Nqm8n3J04o8J0N3j70Q1QQ8Om4J59k30L04j67k06K56l7p4K05p2p2
3363C1j25O5K5m3L3l3j17K26M4l40O8J92m0n1m3J24j02P6L2j21L7j92K00P8Lo4
$$ y = [30, -69, 25, -95, 67, -85, 23, 43, -48, 282, -50, -120, 52, 155, -50, 130, 134, -315, -70, 72, -57, -40, -6, -112, -26, 133, 39, -20, 13, -106, -47, -70, 42, -100, 153, 141, 19, -14, -32, 90, -127, 205, 116, 76, 120, 13, -114, -1, 116, -6, -17, 48, -51, -52, 121, -17, -68, 113, -43, -58, 48, 34, -168, 53, 7, -44, 134, 21, 15, 100, 252, -7, -27, 123, -47, -53, 49, 39, -13, 186, 79, -92, -79, 36, -79, 43, 126, -45, 8, 143, -69, -41, 126, 82, -112, 93, 109, 97, -147, 141, 60, -41, 149, 207, 198, -91, -35, -16, -65, 61, -123, 36, 168, -84, 5, -26, -85, -80, -16, 105, -45, 13, 129, -99, -11, -34, -115, 63, -75, -175, 46, -2, 18, -179, -90, -74, 56, -16, -177, -57, -84, -42, -119, -272, 55, -49, 1, 6, -2, -50, -103, 1, -67, -57, -4, -174, -93, -85, 3, 9, -35, 124, -106, 198, 31, -175, 81, 44, -30, 175, 103, 31, -94, -29, -4, -47, -14, -47, -164, 62, 106, -234, -166, 26, -14, -65, -108, 16, -86, -10, 22, -99, -62, -254, -54, 24, 27, -37]
3389c7L9q1J09n5J09J0k20J87k16K4P7J8Q7Q9j81j5l6M7K4r2j3J58q0J13o6R9
3415I8q3L0oo6O3M3L1k25L8N9L24m62P8J6O5m1j1J78j99N2J18p9L1q8j76J23N1
3442c8O0j9p0J87j4k08J28m7J64m9l8pk1k32K56J75k91J25j10O0M6m9J05k08M
3467i1K68j18Op7o8J72j3j57j7j8Q3K9J71k55N0K02j72j02J09o6K3j50L10j47
3491b8j92L07l72L17LJ7M6l07K12J39k20J46j4l8m2N6j70J16n7J38R4j61K6J72
3515A88k23j38J79Nj05K11R6j32j17J65n4k84J70j0J20j71J36l7J31Nj90J07j20
3538f8l8lJ3J37KN3j85n8J53j3L6N7J04k33O3m0l4K3k0j69J83Nm7j06K07j2j23
3565a13K21k33J10j2P7k03J82P0q8MM5j4k01J65n2L2K04j21l27L12p0k22J67O9
$$ y = [-37, 2, -79, 30, -25, 84, 94, -126, 61, -155, -131, -54, -36, 51, 140, -41, -56, -92, -45, -21, -113, -126, 32, -48, 65, -1, 98, 15, 45, 39, -27, 36, 79, 110, -115, -77, -18, 306, -156, -78, -62, 3, -38, -49, 129, -70, -18, 100, 21, 52, -36, -212, -89, -38, 22, 3, -67, 120, 106, -102, 26, -21, 143, 94, 56, 49, 28, -204, 52, 227, -64, 61, -49, 11, 57, 8, 113, -95, -91, 177, 59, 65, -12, -80, 92, 79, -78, -95, -113, -30, -1, 170, -85, -35, 167, -5, -107, 2, -64, -41, -191, 119, -28, -220, 87, -285, 32, 35, 52, 98, -209, 3, 142, -78, 68, 54, 16, -26, 30, -140, -24, -81, 57, 151, -10, 16, 188, -35, -173, 6, 11, -94, 117, 213, 81, -36, 129, 75, -209, -39, -49, 71, -100, 36, -1, 130, 135, -55, 52, -68, -106, -109, -96, 41, 43, 96, -89, -147, 6, -7, 29, 86, 190, -43, 20, -20, -54, -31, -51, -220, -37, -32, -79, -185, 22, 10, -113, 108, -125, -15, -27, 50, -153, 29, 99, 11, 15, 60, 46, -155, 10, -42, -10, 194, 73, -254, 58, -12, -234, -67, 2]
3589Bl1N0j65M2n8K06M2j78O0O9j83J34J43q8l6L7%QJ63k43J04k9Mk06Q4J16o0
3616a3K00j24j37L6k13J99J07J79j86k28L07j55o5J61K1j68J04L3k90K68J13l43
3638a94J88K9n7k8J08k6j72J17%pj0J22q2j16L11l9j34J61j40l24K03J1R9p9O6
3663Gn0j5J27j21P1N2j19O0M4J18k64K57j79K4j7Q7j27Q6j16J02J08r2k2j0M9
3688F0q0j30J97J01l75K28k9l8J17Kj92N4N7m2K3M8K9j17K63k54k7J18m0O6n0
3713a1k0L3M1o3l7n1J34j7j26R3M2J5L9p9K3J0m1j1ON8j16P5j21Q1OKk2p9J56
3742B0o8Q4j14J47M6k53Q9L7J25p2J4j14r1R5q3O6J6J34l7j3n6j06O3no5K57q3
3769C3q9k1R9J99k10K74k71o6P4n4L8J05k66J53P3J30j28j74J52j74K11m4j05
$$ y = [2, -29, 21, -144, -102, -160, 46, 88, -90, -30, 39, -144, -10, 133, 45, 9, 46, 46, 54, 217, -26, 78, 49, 53, -153, -69, 47, -13, 187, 63, -74, -38, -251, -52, 55, 234, 48, -180, 127, -28, -93, 68, 89, -79, 25, 58, -232, 36, 149, -194, -6, 23, -34, -62, 46, 20, -152, -35, -35, -42, -52, 70, -12, -128, 183, 144, 10, 171, 31, -293, -90, -79, 20, -59, 7, -43, -58, 69, -52, 19, 71, -48, 12, 56, 174, -90, 167, -12, 12, -5, 82, -45, 41, -75, 27, 135, 43, 21, 11, 60, -20, -150, 47, 148, -227, 1, -28, -66, 51, 53, -139, -85, -28, -70, -47, 1, 30, -87, 176, -78, -105, 13, -27, 39, -11, -31, 2, 43, -20, -57, -108, 26, 9, -117, -24, 18, 33, 72, -7, 16, 26, -15, -26, -20, 38, -78, -3, -124, -43, -37, -35, -57, -136, 20, -48, 36, -78, 69, 115, -138, -49, -12, 113, 41, 55, -59, -150, -55, -138, -72, -56, 78, 41, 28, -28, -134, -71, -76, -141, 116, 33, -56, -77, 22, 221, 11, 285, 14, -52, 22, -32, 6, 111, -155, -2, 71, 201, 73, -101, 51, -123, 88, 44, -61]
3792f1k8J51j04n5K09J27k16m4J62j00J68r3j50L36k74l8J9N0m0P4j83J83J8j28
3816a7J09k4k01K29j26M5J30k19J12j45M9J37r2q5M3J67n1j80K0K28k28J03P7
3839H1r6O1n8j22J28J45k22J25nj82J97K8%r5p6P4Q6l63K38M2M9MJ1n0L6m3m2
3866d9j0J55l25J5L32L7k33J4Q5n9M6r5K05k11N4J11j28O7q7q0J41Q5k06K7K73
3891A64o6j00J33j79lJ59j59R9J83j33m9n5j2j3M9J30r6Rj38OJ0jn1J17o0P2q5
3918f9K63p5p2k1J31k05p1J09K9%k7k8q9L18r2r4Q8r9Q1j32Q6k0n1J34n2J21k27
3945f4P0PP3k50J15J9ml6J30qj1j10J70j36j01J48n9K38j48K1o4J30k78J69N4
3970G5qJ3N8k40m7J74N2j26m1J69r5M6o7J92l17J82P7j66q6J52P3r3J16q3j04
$$ y = [-61, -89, 62, -42, -97, 112, 239, 23, -21, 141, 41, 209, 116, -34, 302, 28, -10, 9, 59, 19, 93, -90, 93, 111, -17, 92, 68, -133, 96, -30, 15, 145, -74, 38, -107, -58, 79, -13, -98, -55, 112, 61, -119, -99, 129, -99, 4, 81, -15, 46, -12, -134, -6, 139, -83, 42, 37, -145, 52, 80, 80, -15, -91, -17, 69, -294, -56, -14, 35, 39, 50, 0, 36, -7, -49, -59, 96, -229, -214, 118, 155, -78, -64, 21, -38, 8, -87, 118, -93, -39, 72, -56, 11, -76, -156, -15, 70, -136, -109, 164, 98, -2, 131, -48, -51, 108, -51, 48, 231, 98, 49, -6, -18, -31, 18, 148, 52, 61, -77, -71, -61, -62, -113, 4, -56, 16, -69, 194, 119, 47, 26, 157, -48, -119, -10, 19, 19, -8, -36, -125, 193, 101, 7, 95, -4, 77, -55, 31, 11, -40, 94, 42, 163, -64, 6, 13, 86, -164, -49, -30, -34, -70, 60, 52, 41, -69, 101, -35, -136, 12, -47, 191, 43, 64, 0, 130, -148, 21, 75, 67, 80, 138, -102, -149, 25, 77, -49, -90, 79, -16, 30, -37, 155, -162, 20, 97, -69, -155, -3, 70, -23, 93, 10, -94]
3995i4J9J45p7Q2j06JJ14K0p2Q2m8r4J86q0r0j59K08j47Q5K11j90j09J70J3K4
4020I4j43R1j08n8M5J24q8r7k6K50j0p5pO9j95J07J8o2K20k31L29m57R3J89r9
4045b7Q5l6J32r3j03J05j12L4R5m0j19K24L6j83p8M0J59o1m2O2jl1k8J23j79l3
4071g1J08n6k1r2L22j55J5K8k1o2L3Nl9J6K5k19K5R2r3O9J59r5Q1j7l9J76M0k41
4099b7r2K65j5k27k1K8M5o5J06k7k0O5P6j44K3M4k70J51J03l1j3J43j31KJ82j79
4125b9J26j1j48j49K40J85j49l3N6k13K3K87k53P4l3K1o0J0Mm9J20J4n5J7Q4j07
4151b8r2LJ4J49l8R5q9P8j07o5N6j52L17l07M25n05K00M8mJ6j27R3j97R6K08J19
4177B06j94Q2k80Q9P5p8o5L35k43Q6l8J29k04K97j87p6N1N0p3J05L0R5k05o7J02
$$ y = [-94, -75, 70, -7, 75, -31, -30, 84, 104, 32, 114, 66, -28, 158, 78, -12, -171, 37, -110, -25, 186, -4, -113, 57, 70, 94, -49, 42, -66, -124, -79, 45, -43, -140, -166, 84, 74, -1, -8, 61, -134, -27, -9, -71, 149, -82, 247, -210, -117, 72, -27, 58, 22, 154, 61, -42, 63, -49, -15, 80, 40, -79, 145, 181, -2, -80, -40, 119, 58, 16, 78, 77, 46, 18, 141, -38, -71, 37, -19, -40, -132, 190, 35, 50, 78, 57, -5, 28, 33, -6, 10, 35, -184, -159, -67, -160, -91, 68, -27, 54, 37, -2, 174, 214, -27, -119, 146, 131, -96, -117, -89, -44, -109, -3, -30, -50, 15, 91, -53, -30, 14, -256, -105, -2, -33, -46, 97, -34, -32, 150, -29, 97, 86, -62, -211, 29, 214, 65, 32, 88, -125, -102, 185, -68, 6, -27, -6, -66, -56, -52, -101, 19, 33, -22, -5, 79, -28, -120, -117, -103, 46, 8, 103, 14, 92, -15, -80, -24, -176, 141, -166, 259, -246, -46, 2, -2, 14, -113, -20, -217, -121, 87, 206, 12, 94, -186, -97, -22, -100, -165, 170, -73, 13, -25, 104, -100, 197, 10, -66, -15, 35, -38, 67, 97, 192, -13, -80, 22]
4202B2q9O5J0O0j03N1pJ12j70J28n5L6j84JN5p5O5P3q0Q3J2m0m0L01j15k17J67
4229F6m8K8j08K32k01p8J00n0R0J3p6o9o5J99k3Q4p4m0m3J77j04k00J03K74j11
4254G6j28L2M0M6L2j82r6J36j0N9M4n0j7J71m5j67J7l8P0J03j9k20R2l1J9M3P
4281a6L6L0n2l2M3L6L5j22J40Q1j90j18mK87j28j33J48pp4l7N0j05K8J36n5P7
4307E4l6p1j09J31P2q0j0j6J01MJ44j00o5j64J36J23k2K5k33J44j55J0N8J0j00
4332a49L6J79j09Kq9N2K43r7j06K7j79K40j21J67q5k24K86j15J12j16J19j14k5
4355f6K1O4q5J28j44J28o8K9K25q5k17J72j08o9K03j25j09Q4L4P7j31R0n3l1J2
4380b4J3j1P8O7o0L9j38k6L2J03J6k15K01j44l8J15KN8o6j34P8P6m1J14J6k8j28
$$ y = [22, -67, -2, 8, 68, -35, 16, 9, 121, -49, 79, 24, 60, -124, -123, -68, -143, -78, -5, -85, -2, 10, -30, -70, 231, 116, -101, 66, 18, 46, -62, 170, -31, -109, -9, -59, 31, 44, -32, -101, -166, 33, 10, 94, 20, -20, -63, 114, 10, -190, -87, 187, 76, -52, -20, 20, 66, 98, -84, -180, -44, -54, 5, 49, -1, -18, 153, 108, -59, -42, -80, -10, 93, 74, -146, -54, -85, -66, -23, -16, 20, 50, -2, -34, 9, 45, 80, -42, 98, 179, -11, -129, -133, 154, 26, -107, 41, 34, -40, -77, -27, -132, -104, 32, -23, 54, 18, -53, -162, -31, 41, -39, -49, -65, 36, 40, 184, 84, 19, -145, -9, 114, 92, 117, -116, 28, -127, -117, -59, -49, -149, -113, 66, -43, -41, -130, -78, 165, 68, -38, -11, -190, 50, -71, 96, 11, -213, 73, -42, 70, -46, 73, -41, -66, -45, 19, -66, 62, -82, 46, -22, 7, 232, 147, -70, 102, -6, -75, 128, 3, -106, -22, 12, 89, -42, 48, -5, -36, -24, -11, -22, 56, 123, 63, 102, -36, -62, -30, 73, 89, -126, 75, -69, -107, 8, 10, 68, 2, -132, -54, 22, -19, 95, 111, 83, -45]
4407d5K6j45J78q7J59n4J12r1Nj96L0%K06k02J01J38j08j91K91k34Q3P2j19K00
4431A29k47J64o0k2l6N8N6j41J01R4r0Mn3J85j90j02K22p4o2J68m8q1m1Q9p0M0
4457gJ83k30O8k2R3j7qn9K2K55j68L3k08J46l4j41Q5p1K06j73Q8n7Q3j47n1K13
4483H2J5O0k15N9P2m2R3j37m5J98m9k5n7k3J18o8k42K78j9n3J2oJ04l3n9J17k2
4510A13j52J35k69K61l1J9P9j01K5j29M9J7Q7m5k5Mj05J23M4Mk82R3J90k31J31
4535Dj30J19n8l8Q7N3q7M6J74j39j05NQ6N1j92J20Nj41K37p7K5J69k27M3q9J37
4561G8R6k04k9J5j0Q7k39P5K69j51K40j59Pj04J61p5l9p1O0Q7l4N1p9O2j59Kl8
4588a01r6L4K93Kj45J5q3J10k9j38J33J0o1N6K1j43J95M4k28K09j0j50K5p4N7
$$ y = [-45, -19, -164, 14, -73, 86, 32, 144, 53, 58, -138, -108, -108, 98, -104, -3, 135, 27, -164, 127, -107, -24, 48, -71, 129, -118, 46, -14, -36, -72, -14, 42, -99, 2, 96, 6, 10, -43, 142, -48, -150, 72, -2, -64, 104, 56, -25, -66, 23, -47, -7, 176, -54, 14, -8, 85, 68, 60, 1, 23, 278, 110, 143, -65, 81, 47, -94, -9, -80, 126, -47, 41, -16, 67, -80, -131, 82, 97, 157, -58, 1, 73, 31, 124, -13, -58, 140, 91, 66, 9, -14, 104, 36, -206, 72, 53, 0, 12, 6, 110, 77, 18, 135, 113, -39, 96, -173, 88, 57, 76, 155, 54, 79, -50, -1, 16, 103, 58, 33, 37, -68, 55, 99, 103, -179, -86, 104, -127, 4, -126, -7, -65, -103, -16, 37, -50, -4, 170, 31, -74, -69, 17, 68, -124, -4, 1, -140, 97, 20, 45, 214, -13, 30, -59, 78, 174, -30, -59, -44, -54, 33, -206, -131, 138, -13, 227, 68, 75, -29, 132, 57, 18, -53, 7, 94, 60, 111, 32, 94, -65, -63, -101, -197, -163, 130, 132, -13, 2, -81, 29, 0, -138, -5, 5, -56, 0, 21, -122, 73, 117, -111, 98, 88, -62, -37, -111, -54]
4613e4M0R5k04N1J01n3k9K5pJ08j22k1J08j46J43j72M8J33k28K55k5q4r3N1J09
4638B9k9j04J02J20j39Jn0J39j11l6J8r5K3K6L22k58K0j55MQ1J49n7l8R9j45P4
4664a0RL4j0p8N2mq9J5R7KK0j88J77j0P9j45J25Rn6j36K60p9j39M0l1o2O5P1o0
4693d2O5nl8n4m9J95o4M2p6J23nJ9j12L4O0k69K05l1J38k24J11pJ9O3k01J25k9
4720go5K3L7J1Q1j65O8j1J50q5J32j42K22l41J69j71K28k25N9J81j87J49j4l4
4744F3L9kp8Jo8J19j50J1M3NJ8N2l1p0K25j13m1j16J54j67M3M6K1N1o2p7P0J23
4772A09r2kk2J09q8J42j23j6P3k7q7QpN4j4N0o9Q3r2Q6j23jj13Q4O2J13n4j46
4800a03J18P3m0N2j19P2p1j07J96j6QJj51J51j83K21l14K75j40j1J7j30K03o2
$$ y = [-54, -14, 81, -123, -72, 29, -24, -53, -28, -35, 73, -49, -70, 38, -108, 35, -137, -89, 44, -184, 71, 46, -38, -131, -80, 29, 0, -104, -2, 118, -21, -20, -70, 69, -42, -78, -60, -155, -132, -106, 216, -42, -22, -177, -173, -92, 57, 0, -38, 61, -84, -10, -1, 33, 23, -55, -3, -7, -96, -81, 16, 18, 38, -150, 27, 17, 96, -49, 76, 85, 29, -107, 153, 74, -65, -25, -56, -118, -53, 18, -42, 23, 18, -20, -74, -123, 72, 8, 50, -26, 97, 92, 111, -1, 33, 93, -176, 29, -2, 136, -88, 23, 16, 35, 98, -103, 22, -7, -72, -49, -12, -1, 80, -85, -17, -28, 122, 37, 169, 27, 249, -92, 77, -94, 134, -91, -32, 149, -38, 111, 97, 63, 102, 100, 22, 23, -45, 74, -76, -65, -22, -17, 1, 53, 22, -48, 177, 64, 23, -93, 61, -106, -63, -17, 4, 55, -7, -84, -14, 109, 17, 15, -7, 102, 14, 156, 33, 17, 90, 63, -24, -16, -23, 31, 17, 67, -2, 81, -11, 75, -48, -49, -162, -78, -16, 97, 43, -103, 15, 88, 48, 100, -19, 53, -18, -125, 71, 55, 63, 64, -87, 64, -119, 102, -212, 63, -77, -88, -71, -201, 2, -60]
4824f0Q1N5J31j99P9M2j17M4o5Q4n9P7j10J19j62J51k5o5K13q1m1o9J5p8j23M0
4850a23Q0Q5O7j20J01j55n8K03K4o0P6Qq0j01R5j67K07m0k1K5j02Q0q3Lp5K78
4876A47o7o3M9Pjj29J55m9j0n0M2Q6k12L0J39j63k4J72l5M3M3l0m7L3j05J0R4
4903F5r3k5K4k9P4l0J73l11J63J08j42O8M9p2m2Q1k3L8j38J86j39L6J14j79j5
4928e9k3o3N2m6J06J05j06J38j51j35L10n9j16J04J71l11J40j38k1J7J16O7j75
4951g7J93j50m8O8O1P2q6lj6M7r6j9Pj05J57j84JK90j12J93j72k9J94j81k43K97
4977E9r0j77K50m6N9q7J52j9r6L5p6N8j42J41J2O2n6j79P1m4R0k3J22j41M8j1
5003b8N6p7opL02j54j17P5j03K13k01M6n7J54k33q2J90o1J1J64M3j84M7J8N7j41
$$ y = [-60, 21, 76, 207, 8, 87, 129, 12, 56, -9, 75, 16, 93, -17, 102, -60, 91, 66, 1, 214, 133, 92, 23, 38, -40, -163, -123, -43, 42, 109, -11, 90, -65, -123, 80, 104, 44, 120, 128, 48, -53, 42, -125, 82, 42, 21, 46, -56, 24, -59, -56, -131, 147, 80, 17, 66, 73, 72, -57, 98, 49, 39, -11, 31, 117, -95, -65, 74, -89, -113, 59, 24, 67, 110, 80, 33, 66, -39, -29, 65, -28, -53, -29, -58, 16, -14, 159, -152, 11, 119, -23, 45, 94, 22, -20, 61, 38, 76, -62, 124, -15, 21, 135, -44, -59, -82, -145, -93, -139, -33, 72, -34, 104, -47, -182, 128, 69, -47, 57, 228, -83, 57, -81, -102, -85, 31, 98, -77, 116, -34, -82, -14, 47, 119, 33, 30, 14, 61, -35, -54, -47, -152, 5, -179, -178, 112, 0, 193, 21, -8, 186, 5, -238, 59, -31, -208, 42, -4, 55, -32, 120, 101, 5, 40, -36, 22, -120, 21, 33, 95, 39, -140, -69, -113, -23, -46, 76, -65, -17, -28, 28, -49, -55, -62, 240, 86, -31, 44, -59, 154, -47, -1, -58, 96, -137, -219, -29, -90, -79, 85, 128, -56, -9, 9, 66, -75]
5029g5r8L19m5k53K12j28o6J33M4j54J05J41j86o4J37q6lj34J54J27Q8j86pjQ2
5054E6m4L2J8k5j8ML9j39J39k08J30J18k1Qk13L5O3PN5j27L9R5j77J66m1K55k28
5081A8j00j9O7J13n7J52m6R1j53q1pP5O0q9m5J30j22K6Q5p1k9M7j24PJ16j15J
5108g0O7r1K35k20J40L4j34p3L6Q4j13J55q2J58j30Lj26R6Npr4N1M5J24k09L10
5134A94l06o2J31k2J49mJ06j76J16k18K46o7l7J5j1pk7j33K24j33n8J98o4m0K6
5159D0N0L5p0J38k20k7J6j46J69j55K18j46P1j26M2J65q6J00Lj53J05J00r0n1
5183a8m5n1Pn5L85j01k45J04M6lj3J51k56J12P1m1l7r7l3R8N4P0k2j08q0N5r9
5210a51J95O5N4j75o3J44j43J2J46q1n6K1o9J75K5l15J75L3J30Oj60K6j20L1J03
$$ y = [-75, -173, 146, 101, -152, 60, -68, -134, -1, 43, -111, -6, 135, -51, -115, 22, -64, -67, -201, -47, 80, 168, -18, -25, -26, 56, 12, 44, 62, 37, 19, 23, 62, -77, 62, -146, -16, 102, 81, 89, -124, -89, -26, -19, 36, -91, -52, 43, -134, 32, -9, 246, 18, -82, -101, -34, 79, 22, 174, 128, 219, 66, -15, -22, 53, 113, 24, -21, 109, -13, 13, 98, 27, -2, 45, -79, -72, 44, -71, -70, -3, -94, 141, -79, 61, 95, -39, -112, -76, 8, -105, 50, -32, 126, -4, -1, -127, -31, -26, -33, -127, -76, -31, 93, -116, 194, -112, -174, -43, -65, 84, 80, 186, 10, 126, -92, 154, 87, 50, 65, 54, 47, 20, -113, 111, -22, -80, 118, 54, 14, 40, 90, 125, 55, 193, -27, -54, -38, -184, -15, -170, 48, -98, -27, -153, -111, 54, -32, 68, 71, -82, 23, 123, 33, -18, -63, -114, -107, -162, 223, 122, -123, -19, 27, 24, 11, 162, -94, 18, 89, 48, 11, -86, -119, -21, 33, 103, 81, -27, -107, -52, -151, 44, 109, 163, -12, -75, 69, -74, -62, 84, 3, -53, -32, -101, 74, 99, -216, -41, -8, 122, 128, -32, -6, -126, -95, 8]
5235HK8k00K18p3J07j08O5M5j83J93p8J3q3J01m4L5m7M6n6J0J27k26O7J45j54
5260d4N7o6l5P6p2O0j06K48j53J00j08Q5j95J19J03o6P2j26L9L3q7K77k74P9P0
5285H6n4k7J75j14k69K40o1oK58k52J0P1o0L5j08J27Kl89L78j00J37r0J6j31R6
5310c0j1J7J17Om6nj43qJ36n3PR8j16M0j35J71Kn6L1lM5j42J55L4j90R7j49J18
5338a3J06j56k4J04p5OJ51p0p1O3L7r5R1N5j65P1J5j14m4J93Q9n8l7k99L37j25
5364b8J3j49P8K03J1j67O8Km2L7j08Q2M8N0j30j19J96j30K2P5N2k06P4N3J75j83
5390b3n3K7K7r8J10QR6k78O5J52nj93K32j88J14L4j19J80p3P6n6P8j1j49K5R1
5416F9j8K8k93L00k15J26R0j35K4j74J30J59r3j08J41k19O7M7J02p4MM1q9M3k8
$$ y = [8, 36, -164, 54, -19, 88, -20, 45, 90, -93, 100, 22, 35, -48, 53, 9, 44, -3, 43, -13, -3, 124, -102, -35, 110, -44, 13, -53, -88, -12, -84, -24, -130, 118, -35, 65, -43, 42, -153, -34, 69, 3, 75, -51, -12, 21, -66, 211, -63, 16, 86, 32, 5, 180, 66, -203, 37, -24, -30, 228, -24, -14, 57, -3, 32, -76, 51, 53, -336, 42, -58, 79, -11, 5, -126, -30, -41, -24, 93, 99, 53, 48, -95, -103, 33, -20, -13, 85, -31, 9, -126, 45, 47, -9, 22, 19, 64, -78, 77, 111, -79, 18, -131, -13, 93, -63, -87, 17, -58, -52, 99, 29, -42, 21, 58, -37, 54, 109, -56, 15, 30, -84, -128, 65, 154, 96, 59, -240, 97, -28, -15, -164, -86, 117, 128, -39, 29, 31, -11, 26, -82, 0, 48, 98, -32, -151, 45, -85, -63, 12, 64, -142, -68, -15, 160, -23, -76, -49, -22, -120, -10, -2, 94, -184, -119, 33, 28, -165, 67, -121, -7, 27, -92, 88, 15, 91, 35, 113, 102, -47, -22, 69, 51, 79, -214, 86, -129, -3, 87, -48, -24, -198, -68, 91, -2, -110, 31, -188, -121, -74, 28, -46, -42, -1, -90, -47, -75]
5441g5K13k92J01n6J12j4q2l3J51L8l1J17j25J21k47J93j32l3R4m8N0r8P9p6l6
5466a09J66q6O1N4j22J04P2j37N8n5K09k55qJ44j27p2Q2J63l03K41j58J73k02
5489a07J73r9J41j46O5K6j95O0k7J8L18k95J22J45j70p5J49j1k86K39j6j65J94
5512E8o4N2M8m2N6j26N9j7l2J0J55k50p5R2j0J69k08J45J9N7r1K5J03j04P6O6
5538A71j55j6K8M2j89J34qj25R5P1m4J14k49J71n7JM3j03R3q6J38n4r7jO7R4j01
5565b3P3M0j32L7O1k3p0L7KJ9p9m0K15p7j24J31q8M4m6P5J57k46K01k11K4N3R8
5592A08j66J02J18j89%J46%q7j24J07R5j80k6k8M6J62n2j2O4r2M1o4o5K8M5N5
5618C2q1K18l23K63k42J90l1p2J33q8K6o5M1mJ66l55J76J6j12R0M8p7J93j17j85
$$ y = [-75, 138, -154, -53, -109, 3, -11, -93, -126, 25, 63, 32, 149, 24, 145, -102, 91, -41, -74, 20, -28, 22, -76, 3, -73, -109, 57, -29, 32, 86, -36, 68, 140, 3, 61, 6, 215, -40, -48, 96, -31, -103, -21, 142, -161, 80, -78, 95, -107, 66, -33, 108, -38, 27, 53, -142, -82, -109, -91, 227, -68, 54, 199, 29, -46, 103, 92, -194, 45, 29, -136, 58, -6, 46, 94, 52, 108, -18, 41, 24, -8, 2, 157, -93, -168, -76, -86, 83, -125, 20, 39, 96, 5, 30, 133, 29, 105, 171, 16, 0, 28, 70, -119, 15, 7, -118, -23, 48, 4, 118, -131, 40, -17, -16, 27, -76, 17, -69, 69, 15, -82, -83, -16, 78, -23, 50, 90, -42, -5, 56, 33, -37, 0, 2, 21, -58, -98, 117, 40, -84, 47, -41, 3, -43, 32, 189, -57, 144, -67, -43, 10, 108, -58, 44, 162, -27, -27, 119, 119, 32, -92, 15, 110, -70, -96, -124, -78, 84, 32, 20, 84, -8, 33, -31, -96, -68, -23, 32, -49, 169, -154, 109, -133, 57, 26, -46, 87, -1, 25, -40, 1, -3, 163, -192, -16, 0, -112, -22, 26, -51, 142, 25, -160]
5643a60K09k65K12N3p8Q1L8r5j6j04k6M14l05P0q8R6N7m6r4pJ09J42j98n7J37
5668G9oJ25j60j5m0kK7j17n2L09j92J04p2R4p4k5L06r9k79N5o0J01J05j88j5K44
5694A53k64N2J36k53J94k8K1Q2q8M8k49J25J44J15p1j24K00j56J7L4j01k8N8l8
5718b1J13m5J11k03M0j08N6Kj26J16R8j68J14l8l1J35l1l6o0J52J39j44j14j39
5742a88K00j4O7o3k7L0M5j50K33j82O1l8J3q1J64n5j42M0J29o5J48j46mQ5k0L8
5768G8q8j46R7j2p2O9J02j7J23n1j90j03J80O1j3K5p6jJ10q5l6R5q2L4j22K04
5794H4j30J60j92K2L4N9m7MK5j63J79j92K62k17K15r7j0n2J70p1p0l2P4Lp0J61
5820A09O6j55N2j01O7J25j46j57N2P9p0K45j51qr5K01J3k65J09J57Rk17K69k70
$$ y = [-160, 49, -216, -4, 49, -29, 52, 90, -5, -21, -125, -151, 263, -42, 28, -60, 36, 93, 47, -47, -54, 55, 197, -1, -58, 79, 73, 198, 38, 23, -17, -19, 8, -109, -161, 148, -44, 60, -12, 82, 8, -17, 289, 190, -89, -34, -94, 7, 112, -76, -91, 153, -111, -59, 77, -176, 18, -10, 11, 93, 5, 53, -196, -71, 73, 188, 117, -7, 193, 37, 54, 88, -13, -41, 17, -21, 92, 47, 158, -45, -5, -113, -57, -55, -181, -65, 33, -135, -21, -59, -90, 45, 14, -22, -82, 70, 209, 65, -49, -188, 12, -2, 65, 2, -25, 5, 50, -100, 133, -49, 12, -26, -13, -94, 70, 15, -127, -87, 42, -23, 125, -21, -25, 60, 40, 78, -10, -156, -59, -71, -143, -74, 28, 11, 134, 83, -107, -210, -30, 31, 18, 43, -33, -34, 76, -9, -45, 50, -32, 2, -120, 84, -46, 114, -78, -56, -22, 37, -10, -6, 19, -144, 35, -157, 105, -112, 103, 6, -4, -56, 114, 43, -27, -59, 15, 18, -52, 109, 175, 20, 72, -29, 38, 163, 17, -140, -88, -9, -79, 166, 15, 7, -88, 113, 126, -139, -30, 127, 136, -81, 188, -82]
5844h2J26n0jJ01r0P1k21K99k65K46j16N8k60J15J52r8O9j00%J31j32n6P3l1R7
5869C6j9nj38J32k64L25j37r9K41O9q2o0r0KK17j48k9K32k99K06k16R4P0l5N2
5894E5N9Lk75K99j23q3%J54J0r2J6K0n0J3q2J02K14j88L6j20J10j05J10l7j32
5919h6J69O6k52J45L9k59P7K02j35LJ32q3K5k4J94k23M4j03K2O1K2lp3M3j68K17
5945E2j12R3j52R2P4Q6k2j06o2J45j34N0L0J3p1L8J69j83J0P4k9Q4k35J15N2l1
5971D0J83k43R8k26K81m6Q4k21q0K00j76Q7q2pn7K15j2n6j3Rm1Rm1m3M6L1M4j9
5999c6M6ol7O4k43j9K41J09l0j51p2J72Q6K7j83l2Q3J5m9m3J96j5k21P1o6J88
6025I5k20J48o7J93j88P9l3m2J06j71P3j32L1L35j69l4J4j8q7N2oQ7o6R9N9j68
$$ y = [-82, 44, -6, -7, 94, 4, 75, -146, 153, -112, 134, 18, 76, -184, -69, 83, -15, 54, -46, -46, 85, -47, -103, -30, -61, 36, 17, 12, -126, 6, -258, 67, -70, -169, 72, 141, 59, -1, -91, -89, 128, -20, -49, 183, -116, 90, -126, -32, 38, 3, 55, 114, 117, -158, 141, 18, -65, -65, 89, 99, 7, 23, 43, -7, 6, -76, 26, 240, 52, 88, -32, 78, -27, 83, 46, -86, 83, 149, -103, 42, 81, -178, -101, 101, -34, -31, 101, 18, 43, 19, 213, -10, 34, -69, -47, 14, 36, 33, -40, 3, -165, 52, -60, 33, -119, -27, 47, 133, 111, 5, -57, 88, -46, 4, 34, 47, -24, 14, 183, 0, 10, 84, 55, 139, -96, 19, 71, 40, 223, -20, 78, -148, 133, 87, 171, -50, -130, 70, -106, -19, -101, -108, -165, 50, 38, -18, -31, -22, -63, -54, -95, -138, -92, -61, -17, -36, 10, 4, -33, 31, -212, -231, 10, 119, 89, -62, -134, 38, 124, 151, -32, -64, 19, 34, -15, -58, 138, 123, -98, -27, -93, 95, -125, 23, -44, 149, -39, 40, 7, -35, 71, -100, -27, -159, -128, 207, 38, 4, 18, 0, -87, -35, -41, 46, -20, 79, 138, -30]
6051c0N9k44K61r9J27k36K58J10k35J0k69K65P4Q4j49l8L4M7k6KJ61j39RK9k38
6076a73M6M7J46j95J54l6N3p6K6n2J08j02O4J28j85R9r3K27Oq9j15Jl4L8JN5n5
6103fQ9j70J89j61pK8N5j80K00j7r0K0J06p0j39Q9M1O1q5N0j21L6R7j63J30J8
6129@r7K24j95M4P9kj21o0R0J09m2P4o2j93J15Jk4O3N9j17J83k54K3J61j06L3
6155a5M4J16L9j15J45j02k6j96K0J14M2Q6j91J03J3j16M1q0K5j0J5N2r8J72n9
6180A9J5M3n4r7J00J9K3o1L3R2j62j61J72l1kl6Q1l7Pj44K03k1o9J23p0j09J32
6207Hk4Ok44K28l7M9p4J08q7K2l2R7j1N4n8J2q9N4l5J22j17J4P8r5K16k44JJ29
6235E1L6n5k43K13O5q7k5K8L7K9j12K4O0q0Q3mj46R8n2o8J73m0P3l4J97j32q9
$$ y = [-30, 29, -215, 46, -53, 74, -162, 96, 206, -29, -19, -288, -23, 51, 135, -14, -52, -18, 29, 3, 5, 166, 27, 36, 65, -173, -127, -80, 66, -129, 25, -11, 42, -34, -8, -60, 48, -54, 10, 138, -47, 52, -41, 186, 192, 103, -12, -11, -45, -7, -6, 49, -6, 83, -87, 102, -59, -66, -38, 17, -163, 37, 20, -70, -50, 56, -14, -153, -64, -23, 38, -47, 3, -118, -82, 15, -148, -18, 0, -97, 127, -68, -24, 55, 53, -68, -128, -38, 71, 29, 103, 41, -152, -37, -36, -60, 3, 62, -55, 128, -126, -103, 58, -48, -15, 29, 145, 184, 69, 214, 112, 86, -110, -90, 24, 66, 152, -39, 64, 77, -39, 2, -78, -53, -63, -48, 4, -94, 78, 19, 34, 77, 23, -74, 26, 45, 68, 7, 40, 132, -30, -191, -19, -50, -52, -88, -7, -44, -37, -181, 22, 1, -68, 55, -15, -124, 8, -16, -10, -254, -26, -63, -14, -88, 20, -67, -45, -77, 20, 9, 63, 5, 17, -72, -18, -53, 69, -48, -34, 44, -51, 165, -79, -78, 51, 87, 32, -211, 2, 67, -20, -45, -17, 20, 49, -63, -39, 21, -59, 24, 20, -126, -28, -80, -148, 25, -15, 58, 24, 221, 89, 0]
6262@j26R1J57k03mN4Jo6P0R8K7j16L0j38N7J96n7j02J0p2K36k44L0J05N2k40
6288a54K40N9k48J41P1r4J07L1o5p5N0j55N8L7O0N1j4j58n2R4kJ13j26J14k68
6313a85J34J15r8J05l8k38J94N5L9k8q4R3k44L04m8j56J66j16Q9o7m0Q9j00J1
6337d8J42r0R1j45J31q0Q8q4K23k07J18k28J00Nm6K7L4J46k79JP1l2J10q4J01
6362F5j4M6P6k44J13j6k58L24j34o7J97j67J43qL2q0j36K22j24P9J8K8q6j8J9
6387A0K5l2J05Om4pL7o8k5K4j16P7p1N7N0k9J70o5k19J4K17j85N4j1J39M5j57
6414Ao8J60p1j33o7Q9J13Mm1J4j09J40J75k28kl0n4L9J7Ro3K3J92j92J83k89L29
6441A41p4q2O7p4J48j89jJ82j91J13j66J03L7J9O7l11L06q9QJ09j15J08j8l9N4
$$ y = [0, -126, -35, 122, -81, -85, -31, -30, -96, -26, 72, 99, -17, 13, -125, -68, 128, 71, -31, -21, -93, 143, -101, -71, 34, 86, -154, 86, 145, -103, 38, 109, 15, 122, 153, 88, 13, 63, -92, -34, 3, 63, 114, 100, -58, -110, -16, -18, 95, -31, 83, -185, -51, 64, -34, 71, 33, -205, -11, 44, 83, 55, -29, 64, -180, 124, 76, -80, 86, -30, 59, -8, -48, 41, -59, -48, 94, 4, 95, -50, 81, 1, 89, 5, 228, 21, 139, -89, 11, 16, -30, -3, 31, 177, -102, -101, -30, -62, 48, -36, 65, 51, 97, 173, -71, 42, 26, -232, 92, -42, -109, 88, -79, 64, 56, 88, 8, -128, 94, -30, 49, 67, 95, 9, -9, 10, 35, 3, 108, 114, 70, 63, 100, 32, 7, 31, -85, -8, -79, -22, 28, -1, 169, 104, -115, -101, 116, -69, -15, -26, 113, 158, 1, -67, 93, 22, -111, -178, -89, 24, 28, -13, 1, -108, 32, 207, -21, -23, -53, -107, -68, -51, -42, -105, -82, 110, -82, 101, -188, 141, 67, -15, 52, -22, 126, -63, -64, 118, -73, 40, -126, -23, 14, 33, 100, -211, 95, 6, 14, 123, 8, 116, 98, 59, 113]
6466A13j51J3J05l8n3q9J01J35j43jo6Q9j58K46j15j83J33N4O2K3M3j67N8M6M1
6491I8p3o0M4r3J31Rm6J32r2j47J28o1k3J28o0p9J52m9J7r5LP3k5K33j42k47J73
6518B9M2l7K2j96J36K7o6L0j17J50m8K4N4q1R7J9%o7M4N4j00o5R3l6m2L9J23k16
6546h8K5P3j5J27j13rJ68k41J7K37j37nm5j2O2j00K23k57j18J05J03J9j36m3R6
6571f4J36p5L1Q0k42J50J19k73L7N2l2K18j21K4M7N0j1o5J14k55J02J47k18l2
6595h1J16j39J30p2J28q6j07J52k2k9j05N5J17R3k91K34k11j1J05P0j28J07j39
6618a14J13N8j57N9R4j42J04l8J66j37K3j6O5j38J8P8Q9N1j88M6o7J20m9O2pj13
6644b0O8O2j56J42P0q5p3j01K13j42p5J88K5k54J63R9k51J55m1m3K05k71m8J26
$$ y = [113, -38, -25, 80, 42, -11, -100, 1, 136, -7, -8, -74, 15, -143, 103, -12, -195, -62, -8, 54, 77, 120, -47, 11, 57, 98, 25, -35, 9, -84, 47, 56, 10, 142, 50, -97, 31, -30, -53, 75, 15, -64, 88, 39, 56, -39, -36, 37, 12, 245, 103, -144, 29, 71, 34, 56, -140, -4, 23, -43, -13, -130, 20, -28, -4, 50, -31, 66, 85, 85, 18, 62, 116, 16, -49, 44, 8, -34, 5, 128, -88, -63, 10, -5, 122, 9, 0, 168, -73, -56, 181, 44, 39, -6, -18, 44, -56, 167, -90, -208, -103, 0, 19, -117, -160, -64, 72, -3, 28, 108, -134, 16, 135, -138, -101, -49, -81, 137, 16, 40, 87, 137, 126, 61, 175, -80, 22, 169, -49, -81, 35, -104, 26, -46, 82, -4, -111, 41, 19, -10, -115, -60, 57, 150, -141, 93, -118, -129, -24, 46, -82, 25, -114, -1, 57, -100, -41, 53, -89, 15, -23, 143, 6, 29, 13, 78, -60, -42, 36, 125, 176, -12, 34, -33, 87, 38, 100, 93, -20, 48, 110, -46, 96, 166, 81, 8, -93, 120, -22, -97, 91, 116, -138, 25, 124, -127, 28, -13, -56, 149, -122, -170, -44]
6668d4K5L7O3j47P7l2K6N6o0J16p7n4j05M2m7J61o0NP4Nj83J16L4j24J11j44J87
6695E8j16Q9k4K5N0j54L9Q6j3K3j32J34L1j88K58m7l9j81J07J31k38J32M6j6J0
6720G1r2j36N6N3j05J32J8l0J11n5j2j59J56j11J5J04r6K06j4l50J98J14M7j91
6744g0j44J52L5J0PJ2L5K6j24rn1PN9Q5K4J86l87J45j93J62J2p3O4J9J51k03N2
6771a1J01m6Nj31n3K22j84J47j11R4j30J45p9k6o3N7J29n6NJ6M6k21K09o4q6J50
6797F5j14Q3j4n3N3n9l1n8J14P9j15J60m0l4j05O8j00L8M2j42K69j60J10j06L8
6822a2M8J30J38l18p8J48L1k5j15Lj88J87j4l2J75j84K26j75K8l5J31j06K0R1
6846G4L9q1j9q3J23j80K30r6m6N1O7Rj4O1k04L9M5o5M2M3j02l2%J15q0N0K7k18
$$ y = [-44, -19, 18, 81, -66, 11, -21, 5, 61, 1, 117, 40, -14, -119, -77, -124, 37, -23, -18, 56, 61, -122, -6, 28, -96, 15, -129, 58, -58, 31, 7, 32, 82, -72, -33, 53, 40, 63, -69, 65, 96, -92, 166, 119, 80, -101, 6, 137, -101, 31, 77, 61, 71, -21, -157, -101, -48, -153, -21, -3, -33, 78, 23, 11, -148, 8, -103, -88, 16, -80, 126, 112, -238, -40, 74, 121, -70, -214, -62, -27, -17, -10, 2, 37, 63, -61, -70, -121, -114, -55, 30, 54, 240, -147, -2, -195, -33, -21, -94, -30, -11, 140, -63, -11, 90, 44, 49, -82, -135, 87, -97, 50, -61, 33, -97, 48, -31, -57, -120, -63, 66, 10, 15, 31, 77, -144, 65, 1, -85, 65, -49, 34, 20, -33, 20, -39, -70, -128, -14, 65, -50, 110, 70, 36, -69, -1, -101, -63, -21, -163, 106, -54, 56, -50, -12, 36, 166, 304, -14, -92, 56, 87, 62, -53, -50, -238, -51, -65, -97, 78, -106, 120, -55, -27, -62, 69, -37, -17, 74, 113, 32, 13, -70, 53, -127, 103, 7, -39, 12, 79, 88, 74, 135, -69, -30, 15, -50, -8, 35, -67, -99, -99, 16, -64, -14, 13, -205]
6874b05L35q5q2L7N2J28j42q9p1M0K7n7N4J17J8o1j58J30QR5o6j27J73r2J44k2
6900A01j71P9M6j00R4j76Q8LJ63j32K6J25j16Kn4N3o4k5k9J90j29N4n2l4J2m2
6926h8J42j8j14J72j10P1N4j07l1L5j42K55j17P0k8l1Qj1K8j07L7O5j51L8J52
6951G2o7Pn6M7O9j66J12j93J27j4R0O2j46L8r5J8O6j54K94m5r2J72k38K01L0j36
6977Cj9P5L5j5J27k09M4k1k4M9l6j06Q0q7Q7j73R2L03j87P7k05P6O0O9k11K42
7003A26r0k8J37j51J10k24QJ39J0Q8j5o8r9q1N9R8m7J6n2J69Q1m1k41J47K6L6
7029A13K9pj41o4J01k41K19R1j7K4j28J7R3n5M5k64J51L1r1J22K08l05O3M1q8
7054e3M0J7K19k82J15j5k16J82K2q9J21J3o5J4M3Pk6o0P7j02K0r1Q4n0L4O8K8
$$ y = [-205, 130, 45, -37, 0, 52, 180, 38, -51, -122, -82, -55, -112, -58, 59, 77, 16, -142, -12, -4, 91, 25, -102, 71, -21, 123, 101, -70, 9, 55, -45, 49, -127, -39, -36, 127, -5, 21, 146, 30, 32, -22, 31, -33, -58, -87, 103, -26, 28, -24, -58, -46, -88, 54, 36, -78, 94, -16, 55, 109, 2, -29, 6, -136, 119, 2, 72, 44, 13, 21, 10, 38, -69, -32, 33, -118, -80, 72, 5, 12, -44, 3, 72, -94, 18, -175, -48, -62, 28, 90, -56, -18, -113, -95, -29, -183, 111, 66, -26, 146, -92, 109, 139, 3, -16, 59, 94, 79, 206, -3, 41, 20, -4, 45, 9, -97, -17, -104, -17, -190, -98, 205, 18, 95, -110, -34, 26, 95, -116, 126, 36, 8, 145, -6, 104, -120, -112, 27, 37, 125, 110, 42, -57, -138, -79, 19, -28, -12, -64, 105, 186, 145, -96, 51, 77, 113, 142, 135, -6, -70, 31, -210, 9, 100, 83, 107, -21, -4, 89, 34, 79, -185, -34, -3, -94, 28, 236, -69, -6, 35, -53, -13, 4, 223, -59, 56, 41, -175, 7, 29, -60, 61, 74, 9, 23, 66, 73, 47, -13, 64, -38, -18, -109, -25, -75, -41, 27, 55]
7081E5j0K8o7J12qj47l0M6NN2O0l3m2j83K15O3j67O6j27J0L9m7O1l7R7R3M3j60
7109a3j41J26q9L01j16j09j61J73Lk4Q0K1pj63J4L7R1J3j5j4J04O7mk43J32j43
7135h0J31J09j97k0N1L4l6m1k8K81o3m8n4J16q3j08Q9j4k7P0m3J56k77L1l3l5
7161a19J32k32L29j4J05j41j47J38K0j58J61j25O6P7q7o5j10L13k88J20M6Nj8
7184HK0j20J47J26k33P7%r6j5J13j97J12J28r9J65k15j1l1P9O8J8j17J18J22k77
7209a10J30J3p6k0j21L92l33K37o9k35J18J07oRm3L9J1J18k02P7Q7j29p2J36J01
7234A59j34l2p1J06j52J18k3K4O3N7p2M0j44q8R0R7o3l9J6J05j07k8O2J52j38
7259bN2J8k69J65Q1N3o9p7J31o9qq3K34j04j88j21K83j39L9J44j26R7l4J86j50
$$ y = [55, 45, 73, 6, 118, 110, -37, -67, -21, -16, 36, 96, 63, 21, -162, 53, 116, -51, 15, -112, -102, -63, -110, -49, -86, 11, 104, 147, -13, -154, -28, -117, 184, 68, -41, -202, -29, -26, -50, 30, 51, 44, -119, -105, -68, 23, 36, 21, 7, 111, 178, 174, -69, 63, -80, 51, 160, -37, -57, -6, 28, -8, -49, -77, 204, 141, 93, 39, 155, 72, -36, 53, 39, 12, 82, 39, 195, -82, -51, -84, -119, 13, -219, 110, 96, 201, 60, -87, 51, 71, -87, 74, -51, 15, 92, 5, -60, -170, 143, -145, -25, 21, 26, 8, 28, -92, 55, 181, -52, 25, 25, -71, -86, 27, -170, -58, 70, -29, 136, -79, -90, -121, -42, 26, 44, -73, 45, 167, -110, 20, 33, -43, -63, -184, 208, -125, 112, 43, -192, -74, 33, 27, 36, -7, 32, 43, 161, -41, 36, 123, -6, -78, 58, 159, 25, -7, -78, 28, -124, -6, -29, -5, 58, 115, 43, 83, -61, -149, -59, 38, -25, -64, -48, 57, -50, -78, -16, 136, -2, 50, 68, -201, -36, 45, 98, 29, -48, 83, 14, 6, -77, 157, 53, -135, -256, 27, -112, -73, 71, -55, 42, 8, 194, 44]
7284D4N4m06L05R2j06n0N9J38k60P2J30RJ8k2j81K36k9k3j0m3o4%J7N8Oj36O0
7311c2O3J87j86L5M9j53K3l9P5kl1M2J32j40j48J75k34J21m2K24r9J4o5j29J13
7336d7J18p8J7J3n9J20jk03J09j1j9L3j40J56O4m5j13N9L7lN6n4q4N6JN0m0k6
7364c4q3n0J81L7k66L40j76J9j23K60j0l52J61J17q8P9Nj2L3j56mol3q5K91k65
7390b20K64n2j31K05j01RKj5J5K7k8R1n8j03rL7o0o0K15q3R6j46K30k23O1J38
7416A01j75J15j5m9M9O5Lq7Oj44J25q2J54j82N6L0K3k6M8M5j24P3j32O6J71j01
7442A3l2J12L7j29Rj27R5N8p4J73k8q3no4j1j8j1M5P7N6n0p1j27L41k14R0j75
7469a13N2L7K06j82o4K0J1k3O5k17K10q4k9J69k0Q2j64J90j49R5j27J47M0j43
$$ y = [44, 98, -308, -3, 89, -17, -67, -8, 130, -130, -58, 72, 81, 99, 77, -104, 132, 103, 80, 70, 27, -37, -37, -20, 38, 44, -92, -32, 31, 218, 32, 67, 116, -37, -14, -53, 22, 20, -11, 31, 163, 23, -125, 50, -184, -63, -105, 119, 20, 34, -31, -160, -47, 71, -7, 10, 23, -36, 84, 83, -120, -11, -22, -41, -8, -148, 8, 72, 27, -86, -27, 10, 7, 63, 9, -75, -19, -18, 32, -8, -34, -117, -167, 14, 51, -215, 125, -51, -32, -155, 105, 95, -257, -96, 21, -67, 12, 17, 5, 38, -118, -122, -128, -161, -246, 45, -220, 44, -8, -139, 66, -35, -26, -24, -39, -24, 3, -25, 66, 8, -95, -104, -67, -127, -187, 28, -55, 41, -105, 125, -98, -37, 101, -74, 41, 26, -23, 26, 91, 94, 7, 13, -131, -6, -88, 66, -116, -60, -30, -7, -33, 15, 60, -64, 9, -123, -57, 114, 13, -19, 93, 130, 1, 10, -117, -22, 36, -38, 135, 107, 24, 19, -45, -56, -74, -85, -40, 37, 93, 43, -28, -155, 186, -28, 62, -113, -61, -24, 182, 0, -64, -44, -33, -56, 9, -208, 2, -82, -111, 58, 38, 120, -44, 146, -3, 92, -35, 112, 152, 9]
7493IPKk2j74K18l3j2q9J5Q4p7J20J25k19n4J62r5p7K18o7jJ05j45P3J5j8K2j08
7521a6q0L3O4k6n0J92j87l9j4J13j79J57O1Q2N5o9mL3j14j15rK0K26r9r4j21J81
7548Aj6L9r8M6m5J54j58Q0j02J03R3p4k4O8m7j14oK30p3n4n6o7M6P9R4j43l5O7
7576a2J85j92o0J30M0r0j64K3K37k6j45QJ03L5L6j02m9k8J29l9k33J83J60n2j2
7601F5K1m9k7k0q3J49PN3j49Q2J12k83K45j09J9L5j08lN6j44J50Q0n4J30j90L
7627a2OM2r1k22L10q1J92k18NJ68k0j8RJ3l0k1j59K17k63J40RJ05m1k02N0M8Q0
7654A6M9r0J6p4J44m0k9Lj33K09J9j32Q2n1k6Q7l3j2n4J34o7Nm9j26Q8J59k38
7681a43K70k21Q3Q3k07P7J0p5J50j37J55q7N5PQ3j34R0p8j22J66J9nj8k2k0K9
$$ y = [9, 16, 18, -4, -178, 40, 7, -5, -94, -79, 5, -72, 48, 173, -46, -100, 62, -33, -110, 108, 41, 40, 145, 0, 73, 88, 70, 92, -16, -96, -63, 1, -25, -75, 117, -70, -109, -123, -10, -189, -32, 29, 111, 166, 97, 93, 126, 12, -103, -112, -92, 134, 35, -59, -180, 1, -15, 24, -74, -28, -73, 81, -77, 3, -99, 4, 97, 23, -1, 67, 20, -94, -100, 130, 57, 3, -53, -120, -74, 5, 99, -44, -79, -12, 173, -19, -79, 51, 91, 1, -163, -140, 97, 71, -74, -66, 37, 72, 108, 6, -43, -71, 58, 19, -214, -31, 129, 77, 65, 86, 37, 10, -10, -93, 56, 63, 116, -33, 49, 161, -122, 123, 14, 33, 68, -40, -43, 13, -131, 19, 99, 45, 175, -15, -12, -6, 36, -55, -277, 33, -48, 144, -74, -69, 99, 79, 61, 70, 83, 53, 32, -127, 90, -173, -33, -24, 81, 40, -162, -112, -64, 16, 65, -25, -9, -83, 61, 21, -8, -5, -138, 71, 90, -42, 40, -11, -37, 50, 17, 5, -49, 85, 18, 23, -26, -152, -64, 95, -143, 127, -94, -11, 72, -135, -58, -48, -123, 27, -110, 45, -42, 13, 20, 103, -31, 59, -19, -141, 25, 44, 39, 21, -1, -21, 8]
7707HM6k55J48j4m1J49j3J0l8P4j73O8K1l7R7Rj84p5M7J78Q4j03o5J31j20J35
7733H7O3q4j2n5j58K33o6k80K99L7j33J04J14j17M6pM7j34k2R7M6k12P2R3n1l0
7759b3J55n2k10K00n8j94K65l61K38P5j88J18Q9j99J91m5j20J0O7L6j7QJ65j61
7783a1J09j30noJ62L8j96J76j82J06j07m6K30o1o2P6L0k68N8J9L9q5N9N1J51j28
7809A7m5L4N8Lk8J57j26J8j41J30j2J85j73pl01L53k4n6j6J1Ml6R8j3M5j04ml1
7837dQ0j03J14r9j40J98j94J98o1l3j46K31k21P8K83l05K75j93K2M5O6j27K71
7860B35l07J18j68Q5J17n9n2J14L2O1j72J79j73j85K11j49P9n3K08j26J06J2k0
7883I3K4k13K29o8j27M4L0m0J53J52l65J6J7Q9l7N1L5r5P9M3kj39J03j88J94j90
$$ y = [8, 54, -201, -53, -67, -108, 41, 28, 38, 0, 74, -99, -31, -10, -47, 50, 59, -125, -200, -153, 25, 109, 6, -59, 72, -48, 87, 150, 66, 54, -1, -159, 74, 8, -272, 27, 64, -69, 35, 149, 32, 78, 71, 118, -16, -38, 59, 105, -107, -35, 58, 7, -23, 132, 80, -130, 70, 12, -182, 83, -278, -40, 35, -153, -35, 54, -145, 46, 1, -119, -109, -42, -6, -23, -15, 150, -11, 98, -32, -37, -43, 119, 157, -39, 137, -45, 61, -46, -92, 138, 77, 15, 91, 121, -147, -89, -70, -31, -116, -57, -6, 145, 17, -28, 6, 64, 67, 39, 196, 70, 88, -53, 77, 65, 250, 77, 70, -231, 122, 98, 42, 26, 37, 41, 5, 103, 90, 135, 31, 27, -4, 76, -27, 87, -12, -152, 46, -148, 50, -11, -44, -190, 41, -180, -102, 181, -124, 151, -42, -20, 25, 91, -36, 235, -72, 46, -122, -37, 80, 21, -31, 83, 115, 176, 4, 183, 10, -175, 36, -113, -34, -87, 121, -5, 101, 113, 93, 117, -96, 133, 65, -62, -18, 12, -28, 125, 277, -88, -72, -55, 34, -3, 48, 83, -12, 67, 110, 108, -31, 72, -116, 78, -112]
7909a12L7n1J09L6p5m0R3m6O5j34K01O2k65R0l2J44p4j53J65L3j02P5j0K1l2k7
7935b2J5j20J01J76j70O6M1pp5l2J21r4l9J32o5N0Kk3J9qj53n9J71J28j45J6j
7962B5On7J43k03O1L5j6K00p1j16R3m2oj05Q0p7N0m4mR4l2j38J23r7J59j31j04
7989a74K46j82K13j74K25k58qQ6O5p4K11j00o6K3q7J94j19P2j21J5R7r4l2J03
8013F1j10O6J5m7L4o3J28M3rj51q4J15K18k27M9r0k1J25N1k00O4R9q3O2O3j48
8039d0J31j35q7J60l9MO2k4j50O6J90j34l8Q0J07r2j66Q4L0r4J30mR4j35M4mp
8066C3k1j76P7j7J00N8k59J89M3j8j52J31rQ4o8O6O4l38K28L8j56K14j22l0oJ04
8092E7P7Q2l60K19qj23m2l7J82l8j2r1P2J04j08Pn5P6j63J27J0k4O0J2K3m4rR
$$ y = [-112, -75, -126, -17, 19, -56, -96, -3, -49, 16, -118, 83, 145, -120, -30, -62, 82, 8, -145, 20, 53, -49, 26, 16, 37, 5, -22, -7, -127, -26, 150, -20, 46, 87, 80, 5, -27, 94, 0, -39, 93, 28, 78, 80, 57, 76, 68, -85, -144, 27, 155, 10, 26, 25, 31, -26, 117, -86, -25, 10, -6, 194, 123, 7, 100, 58, 52, -53, 27, -50, 0, -44, -48, 46, 14, -124, -1, -98, 61, -70, -174, 72, -110, 103, -71, 154, -104, -112, -26, 39, -35, 176, 76, 10, 33, -54, 140, 21, 93, -28, -13, 84, -10, -42, 61, -49, 17, 32, -15, 19, -44, 84, 127, 118, -33, -117, -2, 216, -11, 38, -52, -73, 52, 103, -97, -33, 66, -17, 45, 108, -40, 91, -44, -131, 29, -10, -6, 56, 32, -118, -52, 138, 4, -34, 46, 153, 61, -105, -21, 9, -85, 45, 41, 135, 0, 44, 40, 33, 12, -164, -87, -104, -4, 54, -205, -16, 27, 9, -143, -12, -21, 63, -5, 61, 125, -213, 15, 53, -103, 111, -11, -41, -47, 57, 134, 216, -144, 75, 67, -56, -98, -135, 47, 9, -3, -94, -22, 82, -26, -19, -74, 2, -161, -34, -24, -48, 12, 24, 47, 3, -6, 3]
8120CJk9N5K7j00J16j53J15j25P6L6n4L8J62j62q9J53Lk65J78K0j21J09j47J23
8145c0N1j54J02Q6n3O4j06p1J19j06J59J19j57J31l25K05r7J21Q3j91P5j83J62
8168Dj3jJ70j69P9m5l3J14j48J32j10k5J6J68j68Q4Qn7k3k44L07k42J33
$$ y = [3, 4, -25, 30, 57, -43, 73, -80, 35, -90, -14, 22, -32, 6, 168, 6, -83, 70, 73, -192, -14, 6, -115, -6, -153, -30, 21, -133, -31, 55, 2, 66, -40, -111, 8, -98, 61, 180, 23, 154, -171, 34, -63, 58, 141, -50, 25, -158, 4, -9, -10, 160, -9, 70, 25, -8, 106, -42, 90, -20, -45, -29, 139, -29, 55, 63, 6, -17, -261, 46, -196, -63]
8191f3
$$ Imaginary data points
##PAGE= N=2
##DATA TABLE= (X++(I..I)), XYDATA
0@%%%%%%%%%%%%%%%qJ6j6J6j6K4l2L2m0M8n3O1p2Q3r2J05j20J37j56J76j97K21
37A17k47K76l08L41l78M20m65N15n67O24o89P59q37R20j012J117j234J366j513
56g95J682j879K107k379K709l118L639m329N288o709R022j3391K4283r6722j35465
71b16057L13011O8357q2692J28554n6436k06723J24453N0839k20836J0676R2408
82E554j57903J0151J64122p7427k1658J87136k3097j06133Q2215k387p6521R6949
94H1001J2232j43356L1217Q4403q4459j3892Q3476m6099n8926M2266r770k4578
106d6485O1078J2507n9377J2373M1583j2757J1700M8791j0203m2184O554J4155
118C7735k7725k0337n200l3176k0589J9121m059K052O3599K4588l9849J9283L5739
$$ y = [0, 0, 0, 0, 0, 0, 0, 0, 0, 0, 0, 0, 0, 0, 0, 0, -8, 8, -8, 8, -8, 16, -16, 16, -24, 24, -29, 32, -40, 43, -49, 56, -64, 73, -83, 93, -104, 117, -130, 146, -162, 179, -199, 221, -244, 271, -296, 328, -361, 398, -439, 481, -531, 586, -648, 718, -795, 887, -992, 1115, -1264, 1445, -1673, 1966, -2363, 2925, -3784, 5238, -8153, 16130, -80592, -216057, 96954, 165311, 82619, 211173, 154737, -51986, 72467, 123306, -97530, -86854, 5554, -152349, -142198, 21924, -55503, -77161, 109975, 86878, -19255, 62960, 60573, -15948, 81001, 93233, -50123, -18906, 65497, -18962, -32854, 50622, 4523, -54403, -12137, -21907, -46485, 14593, 27100, -32277, -19904, 21679, 8922, 20622, 69413, 59210, 17026, 23580, 37735, 10010, -10327, -15527, -48703, -69292, -50171, -54230, -52178, 11421, 36009, -3840, 15443, 51182]
131E1182l0890J643K7256n2624l5353L2047k3690k2793N4990p072n2587M3441
143a4450L0658l7976L3493M3775m6221j1113K4408l8852m296M0575l7131k9342
155d6472M3233n505j7113M9690L793l6548K3330j40l9809K7130J9953m1513R500
168a0471K5352l4932N686M1738k0278j2840K3449j9195r957L3406r133j8941K1638
181A5522j1259k3494K4871M858j8701J8587K42k6386J9024J3006k5232Q763J1185
194A0986k8461M864K3546j6003K492K1594j8386n634K1278j5099p827K3644j4663
207B331j9043K2354m163j6616K5336j634k8707J9619J1421k6198J5207J8290k8510
220a0313M077K3991k3937m592K7357j7224j4421K4419j0954j8061K6663m87k4630
$$ y = [51182, 20292, 21935, 49191, -3433, -38786, -6739, -30429, -53222, 1768, -5304, -57891, -14450, 16208, -21768, 11725, 55500, 9279, -1834, 22574, -16278, -20574, 20001, -17130, -46472, -3239, -8744, -25857, 23833, 27626, -8922, 14408, 14268, -25541, 1589, 21542, -19971, -10471, 14881, -20051, -14365, 27373, 7095, -5745, 17704, -1491, -11448, 21958, 12825, -6116, 15522, 4263, -19231, 5640, 10498, -8203, 10384, 10626, -15760, 3264, 16270, -8962, -199, 10986, -17475, -12611, 10935, -5068, -2576, 19018, 632, -5002, 16276, 1177, -6650, 16994, 2331, -16712, 5642, 1479, -15137, 10199, 8565, -20142, -523, 10898, -15300, -93, 18197, -10313, -6236, 17755, -6182, -10774, 16583, -641, -15062, 9357, -1597, -19658, 7005, 6518, -18112]
233a8112J8077Q046k1837J5075J6021k2365L634J8950j8302n383J9917j1390j3267
246a0936J5209l852j4101J3464N125j2899N803Q160q545J073P638o160m193N162
260I48j706n551K786M029k014j01M613l00l796L867K687p825j237O010n666l113
276f369R339k916p662J0073K130j0549O820O489j2302K570J0207j1410l520J1980
290D880q010p610J3188k205r975J2201M005j1091P446O851j1858J784R282r508
304f20k704J0083m956n171Q781j708p396O183J278o856L325M138n088J256M249
319D794l983j458L053j794k434K197J02r80J717J179o27k18M24l60r04n06L14
336E16l00m93P42M76j323J53J123p29o69J098k13r94P1j16j592j480K87q83j408
$$ y = [-18112, -35, 8011, -13826, 1249, 17270, -5095, -1461, 17489, -813, -6196, 13721, 2331, -10936, 4273, 421, -13680, -216, 4909, -7990, -2187, 5973, -2572, -1499, 6139, -21, -4214, 948, -758, -6309, -3523, 506, -1508, -1609, 3004, 2704, -1092, 2775, 5462, -2363, -3600, 2410, -3256, -6369, 2970, 54, -7608, 2465, 4595, -5954, 866, 7355, -4947, -2377, 7830, -3580, -7100, 4880, -3130, -10740, 2448, 243, -9732, 2469, 6474, -4617, 2829, 9680, -2178, -394, 8888, -620, -3324, 6759, 1803, -3368, 5413, 3705, -3691, 2492, 3770, -3086, 239, 4377, -711, 545, 4794, 811, -647, 2406, 612, -1822, 375, 477, -503, 1214, 2393, 1766, 1548, 1972, 1612, 708, 202, 516, 216, -277, 465, 941, -382, -229, 894, 165, -504, 594, 381, -613, -542, -658, -2250, -3730, -3443, -4326, -5734]
355e734J963J524j052J821L362j796n00L262k878l408L744o06n474L653K433n749
371e435L580O079o240m03P907m605m240Q111l149q486O995J005r217N852N545
386C299q400L185Q772p283o15R935o050o027Q657l365q324Q596J589r361N999
401F07N685q517L172R114o694l386P517m293o423P014M91q347J994L779m989O82
417b594O434k642m345M594J061n228L068L927n570q91N923m137l381Q803j334
432C688q000O306J478j0243O115Q113j3219n19J1622j0933m269J8055n361j3560
446a0727J5657P62j7177J3862Q797k1426L796J3915j8293M80K0610j4119p960
459a1823K0956q536j3180K2621j299j9357J7552M231k4702J3349J5284k4187K850
$$ y = [-5734, -3771, -2247, -3299, -1478, 1884, 88, -412, 2850, -28, -3436, 308, -298, -5772, -2119, 314, -5435, -1855, 4224, -2016, -2419, 5488, 883, -3357, 4754, 1605, -6881, 114, 1119, -8098, -2246, 3299, -5101, -1916, 6856, -427, -1042, 8893, 2843, -3184, 5473, 2108, -6216, 2380, 3969, -5392, 607, 6292, -2225, 947, 10061, 3367, -19, 7498, 3205, -3218, 3796, 4287, -4060, -2066, 1713, -3276, -2594, 3840, 1198, -3147, 1447, 2508, -2720, 348, 4275, -1295, -2186, 3737, -400, -3781, 5022, 3688, -4312, 1994, 3472, -6771, -656, 7457, -5762, -6281, 5341, -5592, -9861, 8194, 2833, -10727, 4930, 5692, -11485, 2377, 11174, -10252, -6456, 7459, -10834, -10354, 10256, -3863, -11823, 9133, 597, -12583, 10038, 8739, -10618, 6934, 11165, -13537, -188, 15096, -9091, -6241]
472f241J9049k2398m271K7549j1266j4185K2099n405j9534K0346O136k1373R679
485A85R112j9849N857J6047j4968r95J4799j2646n846J7485n354r419J4735k570
499F573j5288J0384N757j2289N369O896j3229j444J1691l176l230O876l070p554
513e734L788N028j528j430j07j584j844K066L198j274k060J662j767k025M937
528A326J487l160K953J40o433L341M660n152K309L851j0950j080J1317m541n506
543e438R583m858j0587J1062N714q612N084L345j1052L285R312p117j372O127
557D476p393k282P398l086m48P130o028l867Q581l745m778J0684j924j0256M595
572i43Q77n409Q525K042j0587L704L777p237O954N885j0812O38N047r359N161
$$ y = [-6241, 12808, -9590, -13861, 13688, 2422, -11763, 10336, 4931, -14603, 5743, 11879, -9494, 185, 9297, -10552, -4695, 11352, -3616, -4611, 10188, -2458, -8304, 9181, 3827, -5592, 9143, 6573, -8715, 1669, 7426, -4863, 506, 7402, -5827, -7271, 4420, 1244, -1986, 4890, 1820, -5734, -1946, 3082, 1554, 124, 17, -1567, -3411, -1345, 1853, 579, -1481, 181, -1586, -3611, 1326, 2813, -347, 2606, 2746, -3687, -346, 4314, -838, 1471, 5322, -5628, -6708, 4609, 68, -5438, 4145, -713, -11300, -238, 5476, -3136, 1948, 5293, -5759, -2474, 6838, -279, -1651, 4476, -2917, -5199, 2199, -887, -1335, 5795, -233, -4100, 4481, 736, -4042, 6642, 4718, -5538, -943, -66, -5475, 3050, 5092, -5495, -1791, 1986, -5251, 1703, 7588, -3224, -2586, 2461, -6898, -1737]
587a737J0944j3476k118J5237j0899p110J9803m224j4743J4164j27j7352J3545
600A907P702j8474P427J1559j9663K070J9987j2608n944J5747j2199r693K0364
613H182m578j4949J7344o19k0897J6390J3357k0895M482J5140j8194k295J9343
626A1811j1629r063J7803o284j5531J5956M921j4926Q465P941j4498J788J0148
639F902r072p71R737r917p234J2792J27q223Q275L415j0993K609Q784o466k309
654b344P113n512p300R102K989r072M441P671r060k647J1304l392p220Q408j353
669C128j0890O483M364j0863M834Q489j2134n53J4337o623n439J3279n552j1472
683h612J2971R89j4218J0467O039j7436N646J4423j4216j944J6525j0584q299
$$ y = [-1737, 9207, -4269, -6387, 8850, -2049, -9159, 10644, 6420, -8323, 5841, 5714, -11638, 1907, 9609, -8865, -1438, 10121, -9542, -7472, 12515, -93, -6037, 9710, -2489, -12182, 8182, 3604, -11345, 5999, 5380, -15517, 873, 14230, -6665, -2183, 12957, -5237, -7532, 11811, 182, -8881, 8922, 2638, -12893, 3063, 7984, -6942, 1523, 9464, -5034, -3246, 6902, -2170, -2941, 6796, -3121, -10355, 2437, 2564, -5659, 2616, 6031, -4962, -2353, 6431, -35, -2344, 4769, -743, -8043, 1059, 4048, -5024, -583, 7088, -1972, -4619, 6685, 3293, -3927, 4481, 3128, -7762, -1279, 3085, -7778, -2944, 5545, -6589, -7142, 7195, 572, -4867, 8412, 2860, -8612, 4359, 5348, -8870, 1597, 7636, -9800, -4154, 10269, -3947, -5891, 10634, 50, -8249]
696h249J6071m135j2387J4230N75j5798J0189O945j4969N483J0963j3293q57J2440
710G208r204m251J3007n962r045J2096q8j0389R224M528j1228L879P364q882o1
725a804P936o884l497P559k860m917O048N52n305L181K301l861J153K598k778
740e78p69K062j308j453J806M31j513o5J799l00r03J460R69k473P10K294k662
757d93q70L525j987k775M132k74m155L175J853m891J535L792m709k09N017l705
773a039k211N298j816l601M993K03m959L619K425n028J767L722m630J76M374l253
789D0j578M033j728k757L487J3l280K262J227l177J235J634k354L6J862j512m19
806i76J305k68p31P12J78m57J59M29m0j19J54O56l04n01Q86j99j053O69K41j263
$$ y = [-8249, 7822, 3687, -8700, 5530, 6105, -9693, 496, 7441, -7528, -2045, 8918, -4375, -5232, 7208, -1996, -6247, 6760, 798, -8247, 3849, 3761, -6628, 2596, 7124, -4104, -225, 7139, -1743, -1804, 6132, -752, -4249, 3310, 450, -4467, 1581, 2133, -3172, 9, 2310, -1551, -398, 2200, -578, -1347, 715, -593, -2046, -240, 191, -1322, -1387, 412, 112, -791, 669, 1638, -835, -125, 2169, -493, -1363, 2162, 175, -2600, 1532, 1258, -2897, 278, 2131, -2760, -1225, 2567, -2142, -2351, 2666, -1039, -3250, 2048, 232, -3369, 1624, 1827, -3132, 487, 2912, -2116, -349, 3373, -1257, -1081, 3293, 40, -1538, 2495, 767, -1990, 1497, 1510, -1770, 492, 1719, -1458, -223, 1411, -943, -907, 955, -557, -976, 329, 61, -670, 42, 220, -237, -78, 351, 311, 192, 346, 1002, 698, 197, 1083, 884, -169, 500, 741, -522]
826e22L17R87j339j83J146r47p32J605k16j145J419K15j480R37O34j922M40J120
844C34j300k85J713p98l20J494O0p24R28L02j057J67M96r98m91M66n89m21O07
863d16J0n37P69K82k98P7P69n77m84O06k03p40L05N58n27PJ264o60m41J082k55
884E91q34P08J51q70K13P69o64K28N27m00Q0K40m78m28n2p89p3K38m22m36Q14
905h87L68N9J358L80o12O36J99m16k88m42r23j06j87O7L03R7l42J564J47p41O07
926H41O41j475j18R97j555j053J032L05r32Q40N10o69N86P09k6m84jj54j82K05
946A7l4l1R2N4N08O63j71n66J97K09o19q37M13o32j096J103J082j745O9K548r08
967C16j307K632n86k973K103J468l044K59K182k598J37L774k022j444L290j266
$$ y = [-522, -205, 782, -557, -740, 406, -541, -1273, 332, 116, -1029, 390, 605, -875, 62, 696, -1226, -786, 334, -966, -1251, 462, -336, -656, 838, 898, 174, 1102, 1404, 347, 514, 1010, 12, -479, -13, -602, -1023, -416, -406, -943, -174, 108, -190, -113, 656, 79, -405, 201, -2, -742, -437, 121, -406, -399, 865, 205, -236, 846, 591, -243, 465, 616, -254, -41, 728, 64, 292, 819, 419, 499, 739, 261, -167, -219, -1008, -1081, -843, -1265, -1701, -887, -519, -460, 898, 1278, 666, 1302, 1501, 1085, 797, 355, -568, -674, -861, -794, -491, -394, -736, 828, 975, 234, 841, 1482, 7, -111, 886, -669, -1722, -690, -385, -1317, -477, 33, -636, -50, 659, 633, 149, 148, -6, -188, 17, -17, -48, 44, 98, 606, 1269, 1098, 532, 729, 938, 319, -518, -105, -737, -1833, -730, 352, -1393, -1324, 1224, 316, -991, 1641, 1055, -1918, 185, 1653, -1391, -1132, 1050, -1548, -1411, 2363, 341, -1103, 2187, 921]
983I21k049L464j221l666L240O41m639L268K203n270J970N358n370j357O386l961
999h2l657O828j498o834N305K294o427L540L897o352J385O251m861j024N875m388
1015B52l056O709k410n418N994r4o599N199K864p694K281O475o660j275P560m458
1031c30m281P904m78o663M733K189o030K739M523n936j098N095l192j721N018
1046B472k119l719M931M99m418L523K424n184J054M530m865k086N839k228m950
1061d297N072M15o370L933M973n964m52O027m079k305P154j133n898M315J566
1076B957o089L714L361o706O91N117n287p55O661m096l405P182j735o297O944
1091B257J516p638M232M286q566R43P628n774k391O718l621n010P709O12o273
$$ y = [921, -1128, 2336, 1115, -2551, 689, 1330, -3309, -41, 2162, -3108, -1138, 4220, -1150, -2507, 3879, -82, -3739, 3089, 1591, -5243, 62, 2356, -4071, -531, 3366, -2986, -1601, 4650, -211, -1235, 4640, 252, -2804, 3905, 1495, -3923, 2071, 1977, -4622, 577, 3441, -4253, -1972, 4503, -2157, -3432, 4128, -330, -4611, 3293, 2815, -3848, 885, 3074, -2956, -217, 4306, -1630, -2728, 2367, -825, -2546, 2472, 353, -3366, 1565, 2064, -2354, 1169, 3593, -1591, -537, 3993, -872, -2958, 2881, 653, -4297, 775, 1190, -5180, -1247, 3726, -2238, -2690, 3337, -742, -3047, 4107, 2974, -2924, 1391, 2957, -3132, 582, 3943, -2763, -2072, 3045, -2242, -2997, 3664, -432, -3837, 3345, 1610, -4687, 2257, 3773, -3865, 367, 4653, -3913, -2970, 4658, -1116, -3507, 3211, -410, -5420, 2289, 2901, -3372]
1106c372M428J795n994L220M290n560O63L838m734n62N153l181k733M886j775
1121C62m209M674N23m083L127K202n035J104L633k625m54L003k215k226K662J57
1137F00j033J376n45j780J217Q72q45P47J19j287O69L29p01Q82K96j483k22N99
1155a90k85j36Q02P6m14o26lQ01Q7k85L21M0j249R85J303r48l6O74j187n47J688
1176H71Q1j084M35J59r20M01L97l7k60k76k27K21n7K21L0q4k88j02r1L10N13N6
1198B69m18Q2J39k14Q25k84l02K52n51o00J435K17j541P38R15j783L81J846j467
1217f1r23J935j023j514K001o8k014J819O24k570J556J582k166N89J816k207l97
1234a021K875j776j577L094j130k473K938O28l174K263J097l045R96K248k745
$$ y = [-3372, 1056, 2851, -3143, 77, 4367, -1193, -530, 3308, -1426, -1988, 3165, -16, -2749, 2137, 362, -3847, 827, 1350, -2733, 394, 2596, -2439, -1335, 2298, -327, -781, 2222, 7, -2219, 443, 600, -433, 943, 398, -1382, -165, 707, -138, 609, 728, -559, 110, 439, -262, 620, 916, -567, -789, -190, -475, -611, 191, 267, -147, -773, -776, 25, 112, -173, 148, 188, -1061, -76, 1227, 279, 243, 917, -270, -817, 871, 952, -132, 303, 462, -458, -57, 340, 303, 43, -233, -460, -239, -296, -75, -45, -129, -417, -519, -610, -300, 213, 269, -149, -67, 72, -142, 683, 399, 97, 349, -202, -802, 633, 850, -691, 47, 962, -821, -440, 1406, -61, -984, 951, -72, -1586, 415, 347, -1667, 152, 776, -1794, -238, 1344, -822, -233, 1583, -624, -1021, 1854, 78, -1499, 1595, 465, -2008, 930, 1558, -1616, 647, 1744, -1301, -305, 1943, -802]
1249h02m56K861j909j621K924o04k313K417L44k776J847J523k797Q57K254k155
1265d06m83K449j382j131K093m43j771J643M80k021R14J306j796k19J736j104
1281a35p96J443k90j009P26O55j372N32Q39j142k41J072m15q44R34L95j126R28
1299A54O39p39p6J123p97o47J309l83j265J148K30j644P46Q65j312p7J375j017
1317c68n17J602n47j242J528J11j520J057M76j233L36Q82q68j24J351p75o47J265
1335G67l58p34Q32J49p75L72M21r63q2Q41q51j20Q22l99m12M76N4n29K85K11n64
1356e57L60K86k33k4N88l74k07J71J51M4nqK0J4J72m14L64j58j44M7n0l4k67K18
1380d0j40J10j09O4k53J40l1L03j65Q0L1J51M4j35J87lk83J44J63k65J24L05k28
$$ y = [-802, -1258, 1603, -306, -1927, 997, 393, -1920, 497, 841, -1935, -88, 1435, -1362, -505, 1749, -406, -889, 1560, 178, -953, 1140, 697, -1074, 569, 1049, -972, -58, 1248, -548, -767, 969, -135, -931, 512, 222, -787, -61, 594, -778, -246, 593, -549, -790, 282, -133, -977, -43, 352, -774, 154, 793, 54, -22, 1101, 304, -343, 966, 583, -682, 466, 696, -948, -202, 663, -649, -726, 649, -368, -885, 717, 170, -1072, 456, 567, -953, 104, 580, -653, -317, 565, -303, -427, 924, 149, -498, 767, 409, -325, 507, 656, -119, 253, 674, -289, -371, 470, -381, -501, 321, -78, -490, -14, 40, -489, -204, 7, -557, -197, 89, -144, -168, 420, 46, -161, 10, 161, 205, 200, 192, 212, 226, 398, -16, 348, 190, 46, 93, 43, 9, -258, -40, -180, -70, -179, -115, -368, -228, -259, 44, -121, -41, -10, 141, 185, 50, 237, 234, -49, 95, 258, -7, 117, 422, 194]
1403A94m20N59p1p81L94N32p16K60L65o74M6L43k13k64J67l1r6M53r6l48O62j0
1425B55q27P78L81j019O01Q03j090l03J146m82q41J170m5j537O15J055j045L65
1443b0O44q43m69R63j73n11N01l27l97P52J13n44M63kq04M45Q17r69J81J232p54
1464B98q73J218j28j119J151N96j696j03J212q94k32J413r79j071Q90L22m30O47
1482B22r4p95K56O47m79M16O52j268P7J048q69m11J550m45j408J208L67j617J131
1501A88J212j599m54J256p89o97J760l08j314M26j12m41J281jr16R2L30o64Q67
1520A17O91j217N4J032j025L0J315n78j097J457m12j326R81Q70q86J25M03j191
1538f57M9J235L4o77J5o78N0Q10j44j82L18p56m99J655J7r65P16L98j478N98J121
$$ y = [194, -226, 333, 262, -519, -125, 407, -309, -49, 316, -358, -312, 31, -182, -446, -279, -310, -406, 47, -49, -397, 265, 255, -572, 206, 587, -432, 169, 972, -118, -421, 725, 243, -598, 572, 527, -1010, -395, 660, -385, -20, 624, -219, -688, 275, 102, -409, 92, -235, -632, 120, 233, -311, 152, 150, -654, -209, 608, -361, -180, 1052, 298, -575, 643, 515, -604, 547, 1143, -553, -656, 556, -338, -570, 843, -136, -1207, -317, 5, -425, 222, 128, -667, -411, 236, -243, 173, 825, -443, -366, 682, -187, -598, 952, 507, -901, 307, 674, -943, 188, 1400, -199, -653, 603, -186, -883, 877, 569, -745, -319, -431, -872, 409, 408, -508, -416, -86, -750, 117, 808, -409, -355, 677, -348, -318, 997, 419, -678, 779, 367, -959, 22, 892, 6, 131, 534, -657, -608, 627, 661, -16, -1, -679, -629, 181, 37, -145, 173, -583, -1082, 573, 590, -375, 341, 739, -739, -141, 980]
1559I80q17o32J178m23r55Q67K89o44O45M1j052K03L42k82O91J64j414J98R51
1578C30o43K37J100j177j086J341N06j276J119N04j791J93J841j178n34J690q03
1595C73j244J289K01j198J135L34j507J34Q15j000K78J625j770n61J516p47o97
1612a024K113k91k400J519R93k020R46J950k297o72K333r25j194K189k73k330
1628a383J581Q74k122Q05J669k058l8J585j540k74K334j051j762K086n42j869
1644a705K328O13k602R36J618k178L87K445j855j291K269m50j690K195K75k545
1660a250J382R62j898N57J493j594k78J424j185p71J889l84j334J250J95j587
1676a129J006J330j865J84J231j330m26J991o44j163J065J81j375R76J094j230
$$ y = [980, 163, -469, 709, 286, -669, 198, 487, -157, 488, 529, -523, -320, 22, -260, 431, 595, -819, -621, 330, -313, -76, 1024, -153, -1239, 102, 608, -668, 451, 955, -836, -643, 1198, 20, -514, 1176, 373, -871, 418, 619, -579, 556, 890, -617, -483, 332, -668, -390, 1235, -535, -1096, 420, -327, -1024, 1089, 798, -1602, -83, 910, -1110, -164, 1786, -511, -1183, 1150, 225, -969, 1220, 947, -1383, 198, 1072, -1050, -245, 1424, -634, -672, 913, -627, -901, 1433, 382, -1380, 706, 164, -1705, 623, 1236, -1366, -430, 1188, -990, -603, 1842, -13, -1304, 965, 515, -1175, 1020, 1295, -1250, 132, 1094, -804, -247, 1246, -348, -626, 798, -387, -1158, 731, 347, -987, 263, 458, -1129, -123, 1207, -658, -474, 757, -573, -999, 992, 348, -815, 250, 431, -944, 32, 1126, -104]
1692a04k38J246j204m16J524m14j209J222l19j008Q79O05j081M63P09j259J28
1709d76J264p04n44R82m71r74J193L51j258O09P46j075l8J255m08p87R08l77q89
1728f93J012J85j015N07K64p82J83O07l38k42N50m17l85Q70l1q29Q23m1p40J85
1748c27O03k58R4O10o15m72N58j44k69L41L2m81K91K39q0k20M27m20j74K49J20
1769A04k13l5J06l28P9J94M8k01L38J50j85L2J30p5m5L17m82j49L07%k73L33J51
1792C03l79J63K71l17j20K10k62k09L82j28l38L03J39l97K54L66k14MK97j85k20
1813g7K37j15k69J27K29l60R2M27m32N2M21o9k70L08l40l54K95J08j82o8M10l40
1835a70m6K74k7j83K08J14k79j2J52j25J1J82on5K25J00k56J34J24m96K77L3l35
$$ y = [-104, -342, 904, -300, -716, 808, 394, -815, 407, 88, -920, -41, 564, -517, -54, 655, -604, -476, 788, 84, -460, 522, 51, -923, 270, 621, -637, -28, 718, -357, -395, 860, 452, -335, 573, 196, -693, 319, 504, -511, -4, 260, -522, -339, 268, -70, -312, 238, -179, -564, 306, 275, -554, 269, 228, -512, -327, 276, 18, 112, 722, 107, -365, 193, 49, -220, 121, 153, -328, -37, 202, 122, -98, 329, -91, -265, -16, 104, -109, -144, -38, -366, -287, -93, -45, -246, 92, 242, 57, 89, 219, 144, 99, 416, -66, -215, 92, 92, -181, 152, 303, -76, 87, 358, 41, -79, 131, -131, -340, 42, -86, -424, -121, 18, -379, -125, 241, 27, 31, 328, 143, -77, 160, 45, -224, -97, 132, -228, -136, 291, -141, -89, 332, 263, -7, 301, -39, -393, -98, 10, -172, -240, 170, -170, -216, 58, 31, -152, 56, 170, -109, -121, 31, -94, -83, 99, 93, 38, 263, 363, 107, 241, 365, -131, 146, 179, -156]
1858a56Jj9n0j34L94jl65L93M8o7P8O7l29j27M76l59j5L5J73k19K23J44k54J66
1882A03J48k24J19J98l49m8R0N0k40K67o6l19L46J71m43L5J54l53N8K90j19k40
1904c72L42O9o1P7J06j01k0P9k32J4Q6J17j88R6J8n6K29k81M9K24j09l63K59P9
1928F1j97P8J55k17j94N38l29l12M0O62m74K18J34k94J81J51P8j61j39k9P3K48
1950B71j69k62J51l9L1K02n7l67K19Q8l82L00K31k43l17L90R9n68M67Q0l48R3
1972a30L42j83n4Q7K2J4J33l23NM03l68j31L09k93k95Q24j6p67L15K51l41j7O11
1995C98o22l08M48J66n15N09p3l02O2M99l66j37M98j95J18K39n35j9O64n57j95
2016b23O03k11r57P43O07q24J10O77r52o0R27n26m47P41k9o19M04M74p25K74K41
$$ y = [-156, -155, -174, -224, -358, 36, 35, -330, 63, 111, 44, 122, 189, -140, -267, 209, -150, -165, -130, 43, -176, 47, 191, -63, 103, 251, 27, 146, 344, -5, -53, 37, 87, -153, 114, 48, -271, 75, 246, -197, -162, -8, -361, -303, -13, -132, -372, -30, 39, -22, 55, 161, 60, 40, 119, -113, -99, -13, 104, -84, 12, 30, -26, 203, -78, -29, 195, 86, -277, -18, 61, -136, -58, 97, -120, -314, 224, -105, -417, -377, 285, -189, 29, 163, -131, 50, 201, 279, 118, -21, -50, 23, 271, 102, -160, -9, -48, -17, 185, 128, -239, -20, 68, -314, -14, 217, -26, -343, 47, 146, -422, 45, 125, -223, -130, 212, 29, -25, 62, 84, 98, 231, -92, -87, 316, -52, -183, 126, -167, -462, 362, 346, -421, -106, 145, -196, -213, 398, -224, -532, -84, 82, -433, 76, 3, -299, -237, 262, -104, -241, 257, 62, 180, 419, -116, -135, 529, -28, -223, 380, 169, -788, -45, 562, -262, -152, 525, -427, -487, 440, -86, -533, 208, 179, -440, -36, 438, -287, -13, 228]
2037B28k38j36K56k25L9O22m64l01N30j01l09O21Nr52M56L62o79K35M96p39m66
2058g60J024j32m84M91J00p21K29O97r57L71O58n82j56O14m97j44O85k14o27M55
2078E0l4n55R02M50j163R5N36n59r5Q90o44o51R19M7n52M36L69q73K50M51l69
2099a00j70N84l83j30K87r1k65O57j24l96L26r2n20M79N07o25k70M72n11j36P80
2120B79O7q06L86K61o63O28K28n27o1L56k89qJ97J99l76J39J0k47L54R8j74M2
2142I3R1m17K11L49l52n8K00j40k24L49Rk07J45l8k64K47O2j41N3j07l8P5K67
2165A65k28O8K18l76R2K49j06r9J64N5m46K23J70k98J60N9j77J43K71k54r6K67
2187B24k85l24K74J60k40mL07m02K73J68l84K66L05m64N5K61k34j13M84j32k75
$$ y = [228, -10, -146, 110, -115, -76, 546, 82, -219, 311, 210, -99, 522, 527, -425, 31, 393, -286, -51, 445, -294, -760, 264, 132, -352, 139, 239, -482, -253, 444, -513, -142, 516, -66, -222, 392, -105, -249, 436, 222, -405, 50, 16, -539, 363, 813, -350, -255, 281, -278, -373, 517, -127, -778, 141, 188, -364, 72, 441, -432, -182, 269, -100, -270, 314, -69, -199, 88, -3, -268, 389, 265, -131, 195, 103, -417, 62, 569, -56, -326, 146, -365, -501, 279, 346, -460, -74, 187, -476, 152, 380, -147, -208, 148, -141, -149, 48, 247, -129, 10, 20, -227, 127, 225, 51, 93, 184, -233, -22, 327, -25, -83, 117, -23, -247, 102, 111, -96, 49, 11, -253, -6, 56, -85, -32, -139, -177, -102, 165, -63, 5, 223, -153, -61, 188, 82, -17, 147, 202, -244, -21, 149, -149, 11, 70, -107, 36, 307, 53, -43, 224, -61, -385, -111, 49, -191, -195, 112, -290, -17, 151, -233, 33, 338, -126, -71, 190, -44, -157, 327, 195, -80]
2208h0l3J95l03K26J94k53RK54l50j01M94k69j54J80J26m22M15j10k35J43L37
2229B63m88P6M46k33j56K63l5l32L37Q7n06L15K0j96R9L39m03r2L68j75j77J86
2251FM0l49L19Q1l53L23O2l15J03K15m3j93K88m4j46J81K8k52J38J00l73K0M01
2274B37k80r4K78m6j55K36j8k02K0K2j63j8K26j94p2K58j10j10K11K9j34J62J99
2297B82n21J84K27k58%L06k4l03L23j79k30K03L4k09J00K38j93L3J76j64l8J5
2319B%k35J30J67j22J54q8J5j26K95k13NK32k44p2J51o9k23K50P4j24J53jk80
2343a69J28L6R1j74j44M9J8J90J30k11N9L5m1j22K05k43Q5O0K2j2O2j01rJ46R
2368I9j51J56R0j57k20J80P5k73K40r6J15j95N8l9J35k04K09j25J38l5p6PP4Q4
$$ y = [-80, -113, 82, -221, 5, 199, -54, -45, 209, -141, -242, 252, -17, -171, 9, 135, -287, 128, 18, -217, -74, 263, -225, -149, 297, 64, -92, 171, 136, -196, 141, 228, -278, 37, 57, -139, -40, 299, -104, -196, 172, -3, -180, 6, 46, -303, 16, 97, -256, 67, 129, -186, -83, 132, 89, -104, 184, 140, -6, 175, 203, -49, 89, 189, -184, -164, 237, -43, -137, 141, 95, -60, 176, 158, -44, -24, -2, -165, -183, 43, -151, -223, 35, -75, -185, 26, 55, -79, 83, 282, -239, -55, 172, -86, -86, 220, 196, -107, 216, 37, -193, 10, 44, -165, -65, 173, -20, 13, 189, 25, -13, 2, 2, -233, -103, 64, -58, 96, 8, 23, -103, 192, -21, -16, 216, -28, -100, 51, -18, -241, 9, 83, -41, 112, 111, -169, -41, -5, 86, -88, -232, -183, -165, 25, 155, -56, 3, 38, -3, -125, 80, -163, -78, -18, 4, -8, 54, -47, -56, 90, 99, -52, 104, 194, 37, -183, -3, 72, -201, 39, -57, 58, -137, -79, -118, 17, -187, 22, -103, 35, 0, -76, -69, 5, 89]
2392H9j9j51J46j71O9K39j40n8J9k4J28l7o8R5j23m7J41j73K2P7q1N9Nj25J95
2417F7lj21J35J7o3lJ1M1j58O5R2O9j01P0j19k40J48K70r0j42R3k20L52o1j29
2442b0Q0j24P0M6P2p2p5O6N3k30K87j40k74L12J06k03J63J19j89j49M13j45k02
2465c6R5N6o5j75J85l52J78P4n8K11k66kK05k25J70o1K9j36J08K82k95o7J11J42
2489A08l55K58K05l36J7K24jm7KQ7q3j27K16r3o3n7m9K9J36j93n7J68j40J91P6
2514A16l62l3L87j4k67J40K32m29O4L84k75J43j5J36k99J68j8j48J51mJ5p4K5
2537B3L3O6j82l3J2q4lj18N41j57k31K28j5k62J86J33m98L5O24j28j83R9N1l23
2561a86L59O9m48K20J27n0pmr3j59K90p4l8J87m25K44K45k32l03L35K8l50L20
$$ y = [89, 70, -81, 65, -106, -37, 202, 62, 4, 23, -1, 127, 90, 22, 117, -6, -53, 88, -85, -63, 14, -67, -8, -3, -128, 67, 64, -57, 78, 95, 32, 29, 40, 81, -77, -12, 80, 149, 48, 118, -1, -241, -93, 177, 87, -55, 38, -182, 170, 109, -20, 60, -64, 6, 52, 124, 52, -23, 43, 96, -134, 153, 13, -261, 51, 157, -46, 117, 236, 47, -102, 311, 166, -36, 59, 115, 50, -125, 60, -292, -114, -40, -98, 113, -153, -155, 50, -175, -5, -66, -37, -173, -65, 217, -78, -145, -34, 108, -247, 11, 216, -120, -103, 121, 120, 73, 75, 162, 79, -48, 168, 75, 12, -45, -94, -65, 71, -122, -179, -11, -151, 40, 116, -246, -279, 108, 94, -173, -33, 199, -230, -166, 218, -57, 86, 71, 207, -92, 76, 58, -90, 61, 57, 72, -2, 23, 56, 122, -60, -93, -81, -165, -168, -286, 255, 98, -133, 95, 80, -182, 4, 137, -361, -326, 298, 170, -13, 86, 137, -186, 173, 242, -206, 14, 141, 91, 84, 80, -13, -172, 118, 44, 6, 193, -232, 12, 257, 25, -278, 57, 85, -265, 55]
2584E5J23k68n0K38O5j11ml5o9J05n3j82Q6j0j82K80P2l55K75K93l17M6L96l64
2608C4l66M77j25k46L16k9m25J73O60m88k07O52m98q7L57j9m84K88K47l55P8K06
2630A59m57J82K69l25N6K94l34P2L41j35n08K31L75n81N20J8l10o0O10n40mL45
2652B18j76l04M37J20m09O2J97j61Q0P4k20m5J98Jj85K14j58j93L25J76n06K24
2674c1J6n3JL16l88K6K84o7k11K07pk54J73L12k98k9J47k29Q4K25l16p3K52Qk63
2699a68J51n4J6O4J48k19K2L17m96m5K29r4K27n9Qj66K30j20j48J01L37m26L1
2722a14M66l80j22L14l70J47K52j63q3J29l7j14J48J15l41K8K58l20M1J03LrJ69
2745A20K6j02k9M9j54K26n4j45M3J44l9J5J15k08q9J91K7k23R7Q1j96L1L9KO3
$$ y = [55, 178, -90, -140, 98, 163, 52, 48, 13, -56, 49, -4, -186, -100, -110, -292, -12, 60, -295, -20, 273, -44, 2, 398, 34, -332, 145, 20, -226, 90, 61, -364, -191, 469, -19, -226, 426, -72, -159, 198, 179, -305, -17, 230, -125, -47, 159, -298, -116, 153, -172, -116, 178, -156, -84, 257, 122, -386, -155, 220, -361, 159, 177, -133, -193, 417, -123, -127, 218, 42, -262, 175, 295, -114, -52, 145, -16, 64, 138, -82, -127, 71, 72, -113, 101, -57, -250, 75, 251, -255, -31, -15, -68, -67, 249, -139, -113, 171, 104, -107, 100, 93, -161, 12, 324, 26, -3, 144, -85, -1, 224, -92, -165, 87, 95, -168, -17, -71, -55, 9, 157, -62, -40, 277, -219, -264, -35, -129, 98, 39, 47, -119, 111, -9, -157, -56, 281, -145, -114, 352, -28, -150, 164, -206, -59, 193, 30, -53, 76, 39, -75, 73, 188, -153, -125, 133, -187, -146, -43, -40, -49, 120, 146, 44, 15, 64, -90, 136, 82, -63, -20, 124, 85, 100, 215, 7, -82, 109, 136, -87, 10, 91, -105, -74, -35, -33, 30]
2770C0l4M0k9J39j17j57J87M1k38O7P5m5K20q0j9r8N5k2J00o8k2j03J84j40P5
2795D1p4j7j58J59K1p2J32r3P9p1Oo9mrO6M4J99j75P4J51k12Qj53Q0J37J2p0k9
2823Cr0o8K24q0J15k31Q8o1L0J1J22l0m3l1J50k8k74L90j56k2J67j59Q3p3j1M5
2849G1J28k1j77L5n8n2j0K72j33j72J52J25j89L4k6j55K25R1j58j36J78o3j23
2872a62J69M3k4k45K75j28R3J07j75J65j56K19k52J38j63J22m7M9j7rp9N0j26
2895a53R9r5J99j29K54j94mK10l22l6K80j93M1J19L0n1p2N7N5O9k1n1j93K24k36
2920a13R7J80j11r5M8nm3O7j52N9M6J44l38J85J04j63K54o5j41K59l78J99MO1
2944A03l6j27k2J59M1o4l1p1P5l2j53J26J20l61K13K22j57j3J07k05j09K97K5
$$ y = [30, -4, 36, 7, 146, 29, -128, 59, 100, -138, -71, 4, -41, 179, 99, 80, -18, 37, 15, 115, 47, 25, -78, 106, -34, 41, -33, -50, -208, -49, -28, -100, 32, -61, 18, -53, -47, -116, -120, -129, -63, -19, 180, 5, 79, 230, 18, 26, -127, -47, 90, 102, 32, 3, -87, -155, 69, -11, 104, -127, -39, -100, -70, -59, 63, 33, -10, -41, 109, 81, -193, 197, 41, 19, 186, 27, 110, 37, 26, 71, 199, 178, 1, 36, -22, -74, -84, 188, 55, -117, 35, 160, -29, 5, -21, -176, 49, 140, -18, -154, 24, -39, -162, 7, 50, 26, -219, 56, -72, 21, 128, -47, 118, -38, 181, -71, 67, -96, 26, -21, 28, 11, 2, -77, -27, -153, -54, -149, 50, -79, 175, -19, -23, 187, -135, -171, 109, -84, -43, 76, 106, 55, -17, 40, 95, 164, 143, 92, -101, 123, -113, -16, 164, 53, -42, 6, 1, -42, 25, -127, -68, -22, 122, -216, -31, 73, -90, 164, 99, -42, 217, -161, 38, 42, 103, 67, -60, -82, 77, 118, 54, 23, -48, 27, -5, -158, -32, 88, -273, -60, 162, 5, -8, 99, -106, -215, 82, 107]
2967A07j84j7K14j30Q7r8N5N6pj7r0J11j1r2K89l37p2J80k0O6R1m9j85k49L01
2992aJ44k58O1Q1l05L62Jj98O4L9o9O3J34j64J3K53k07j07J51j66J64P9l7n20
3016d23N46J1l39L32q4o5j36P8K48k97K66o9l42R2L9J35q1J05j38J30J90l34K70
3039A34M2j19j22J54k55m3M41N2l88RK17q9OL31k40l19K21p5J5M9j3n5j32K39
3063F0K3j12K53k24J49nl52K82Q2r9o2J67k11j55M38j99k52O2L23k61QK58M8l88
3087a67L04K4l13K75j12j55k8J27p6J40p5j57N2M25l59N7J35Kj20NL3j78J36J5
3111a0n2J05Q2j79n2K87j73M1J3j64o6J48J26l19K26rj20K53r7j66J49J19j31
3134A1oK31k77J2J35o8j22n8L26l62J62J33j44j3J31k06n0K31l0k44P6R8j3P1
$$ y = [107, -77, -94, 120, -10, 77, -21, 34, 90, 83, 66, -24, 87, 76, -16, 273, -64, -136, 44, 24, 90, 181, 132, -53, -302, -1, 143, -115, -54, 27, -278, 84, 85, -113, -49, -10, -79, -16, 118, -46, -33, 220, 13, -94, 57, -109, 55, 134, 97, -423, 123, 134, -205, 127, 43, -22, -158, -80, 168, -129, 137, 68, -274, -182, -143, -8, -89, 16, -122, 8, 198, -136, 134, 176, 57, -65, 89, -166, -209, 232, 284, -104, -95, 122, 33, 39, 370, 130, -189, 32, -43, -28, 21, 8, -47, -179, 60, 83, -29, 224, 0, 149, 144, -208, 74, 156, 57, -5, 162, -49, -204, 234, 35, -217, -155, 168, -93, -85, 173, 221, -167, 137, 161, -152, 123, 11, -144, -172, -45, -121, 19, -56, -213, -161, 264, -95, -38, 97, 99, -21, -16, 17, -161, -25, -10, -62, 43, 125, -54, -106, 181, 8, 49, 62, -102, -168, -20, 106, -213, 13, 4, -116, 137, 40, -126, 23, 142, 11, 5, 236, -41, -29, 106, 38, -84, -142, 184, -178, -16, 117, -27, -40, 91, -115, -165, 66, 36, -208, -132, -34, -47, 24]
3158B4J08j86J27P4j47J08K8k24P5J02n7l5k6J36k54K37j92r8R7L31k90m4M7L8
3182b1j48K27J47k99K11j81j04J71n2r6L04j33j10P9O7j11R3P2k91kK32l3m7J76
3206A51L5j50Nl3L4j79K45j89J96J1m2j83K03o6p3l0P1k9J18j31q7J51P0k89N
3231a86K64k6j57L06q5q4j16K51q2k21J02o0J8K61r3j95O7J66j56J14J36l88K22
3254E8N8k5j06P1j82J17R7j68j43K12j14j16L59N9k92J57J17k28m1J35Oj03K31
3277A59j98k9L5J52l20K53q9j91K12l3NM8J57j74l4qJ50j47J88j4k40J50J81k78
3301f5K4O0n1J8k8n5M6p4L07k65m8P2j10J05p8O2jO6NO3l8K32k90P6R5l4j70P0
3329fRk07K35J17k40J51j47J10q7k7j09K42p0K5p3m2K10m8J0p0Q8j08N6M2p7J2
$$ y = [24, 132, -54, 73, 147, 0, 108, 136, -88, -13, 89, 32, -3, -29, 107, -147, 90, -102, -200, -103, 228, -62, -106, -59, -21, -169, 58, 205, -94, 117, -64, -168, 3, -49, -145, 159, 26, -84, -5, 62, -49, 44, 116, -175, -177, 55, 22, -25, 151, 186, 36, 41, 8, 42, -137, 108, -81, 115, 126, 84, -99, 104, 38, -35, -65, 6, -23, 95, -36, -123, 28, 98, -191, -186, 78, 52, -105, 201, 116, 32, -84, 167, 85, -136, -34, -94, -76, 185, 92, -103, -36, 130, -26, 88, 224, -164, 58, 116, 91, -15, 56, -126, -9, 88, -80, -223, -11, -125, -241, 118, 177, -115, 42, 159, -69, -110, 25, 31, -72, 159, -39, -68, -33, 119, -201, 52, -37, -228, -16, -49, -44, 4, 161, -13, -47, -55, 95, -52, 136, 122, -118, 32, 213, -65, -41, 19, -32, -14, -42, -97, -51, -125, 182, -83, -131, -59, -169, -64, -142, -80, -81, -15, -10, 53, 15, 247, -43, 33, 128, 94, -76, -6, 3, -204, 31, 148, -92, 59, -88, 22, -65, -92, -201, 41, -29, -4, -77, -119, 91, 43, 53, -17, 71, -37, 19, 61, -16, -4]
3355dR4j36K02j22K9J58l41J72l3l3P1J1J28l02J94O0j52n7j9J06P0j86J76j04
3379a8q7Q6mJ81or7lj73R3Q9p6j1J75J8k15j01K10j45J38j45K4J33o3J51j31j22
3405i9l0J63K3q7K4l2o5K2qlQ6N1p8J38k69K24m3J6r3R3o5R3j43P0j1K7n3J5O2
3434B8Q3q2R7j22Opj20n6J77n1N7L7l7k1q0J12N5k81R8K50k09J08J8q3p9K40m2
3461I6m3j53J40j39J87K2j2o9j10l6J38n8k9Q6Jj87K16L5k91K06J36k1O2nj87
3486a5o9J12N5O6k82K44l11J22J40R4k36K46j58O5J11j82n5p4L19j87K0j8r5Q8
3510@K9j98l4K22p0j50L23l3k82Q1L43k92o8J39jJ39n9j70P3j57l8M7J36Q5m6
3535A9j7j72M6Q5J08n4p4K48k23L3m9K36j82K0R7j87k1O8m5Q6J07j10k8n1j47
$$ y = [-4, 90, -46, 156, 34, 63, 221, -120, 52, 19, -14, 57, 68, 196, -106, 88, 148, -4, -61, -80, 26, 96, -90, 86, -18, -105, -19, -23, 158, 152, 55, 52, -121, -28, 61, -15, -26, 149, 167, -48, -149, 61, -84, 54, -91, -67, 66, 3, 154, 23, -99, -129, 34, 57, -30, -6, -38, -103, -81, -89, -92, -6, 45, -33, 105, -164, 60, 17, 33, -60, 33, -32, 61, -82, -12, -23, 4, -49, -34, 28, 111, 29, 126, 4, 10, 3, -117, -173, 4, -47, 10, 47, 10, -11, -91, 21, 76, -205, -107, 143, -66, 42, 60, -23, -102, 138, 96, 53, -100, 40, -99, 88, 110, 98, 29, -81, -117, 21, -37, -66, 20, 21, -166, 50, 85, -206, 0, 136, 115, 177, 172, -15, -84, 28, 83, 149, -133, 111, -200, -78, 62, 156, -80, 166, 8, 73, 184, 2, -53, -127, 192, 5, 25, 7, -88, 0, 29, -169, -203, 19, -51, -201, 122, 89, -193, -112, 231, -61, -129, 10, 9, 148, 89, -81, -8, -165, -203, -156, -20, 65, 19, 2, -170, -124, -39, 69, 15, -59, 189, -34, -1, -50, 186, 4, 24, 121, -66, -87, -19, -64, 22, 129, 19, -9, -60, -207]
3560b07K96o1j11nP1L0l6Q7k0n6J4Ro4lj6J37j38J35m1q8m3K66k3r3n4K28k61
3587d7J76K9p0j35L5j0K07j26Nk35J59n1MJ36n7j08K18j66K6J21L8k45J02J65
3611A71k76L51l36J48j01J32j44LK82j15j2n7p1l2J45O3j41mk6l8P7J36o6q8O3
3636F4j63M7J01r5j42L07ok34j2K50j28j7K83k58j36J09J51n2l8m8l0k9K54k14
3660c6J99j81p6J09K0p3p1J58j04O3K2J71k26Q6N6j30J53j35mj89K29n7o4K92
3684B12k38O4j5l8j6O3J71l71K91q7k21l6L08qj31J49N9k27M8J35j5j64N2n0j76
3709b41L80j9l56J29L3J06j54J78p3Nrj44K49k7j28J89j41j4K2%L4K5L0L8k10
3734i8j5J06q2qJ07j64J12PJ41O5k13J46r6J8k6k4J03J23j46L9m0Q3p1l7N4j66
$$ y = [-207, 89, 28, -83, -88, -17, 13, -23, 64, 44, -12, 2, 11, -53, -56, -72, 65, -73, 62, 21, -67, -110, 156, 133, 40, -14, 214, -47, 129, 158, 88, -47, -12, -22, 185, 59, 64, -171, -12, -63, -59, 77, 20, -88, 130, -36, -10, 111, 149, -96, 6, 171, -105, 246, -90, 58, -43, 89, -55, -52, 230, 115, 103, 46, -25, -57, 88, 151, 10, 6, -20, -58, 19, 155, 89, 1, 64, -99, -52, 49, -46, -188, 119, 113, -121, -133, 117, -11, -28, 255, -3, -139, -30, 121, 69, 31, -17, -47, -76, 178, -36, 163, -18, -94, 15, 35, -38, -109, 49, -55, 8, 30, 201, -25, 61, 117, -13, 140, 5, 1, -188, 41, -16, -80, 212, -26, 38, 23, -15, -31, 32, 203, -168, 123, 36, -185, -221, 87, 79, -52, 97, 156, -71, -23, 112, 97, -67, -15, -65, -241, 139, 120, -236, -107, -74, 32, -122, 56, -17, -12, -21, -165, 84, 57, -71, 118, -23, -37, -15, -15, 19, 44, 74, 112, -98, -113, -7, -89, -97, 10, -154, -42, -35, 106, 171, -42, 104, 8, 26, 0, -24, 79, 202, 56, 95, 55, 138, 67, 30, 84, -82]
3760h2Q3o6j07K00j80R8P6K1J12k7k28p1N3J67j55J21J13j73L2P8J11j5p7N0L5
3785A69n9q3J0j51R9N1pj0j64O8M3J7l0L1L8pJ16r9j55o8K54j59O4K9K7N9k1j58
3813i6m8L43k20j1MK5m8p2J75j30J25j16j3j07L11q2M8j49k2J26j11R4q0J33o0
3838A9r6P6O5K0j4j73K45k29OR6j51R4NK77k21L7o1j17J22mK3K8j30J2Q8O0J67
3865B44k22j32Q9J0j42Q3K5q1Q9j16J34J13n8J1J5n8J09L6o8j07J46j29k9L4k0
3890b4k58J65J02l2q7J48K3L4j60Rn2K36k23J40jj2p4r2J24O6nq2L4Q4nj3kL6
3918G9j16J22j89K8Q8j54K35j64mJ23r9J23j46J36k1R4P8j70m2n4J19K4m7R6N0
3943A89k32k6J38m7o0j44K79o2P2q1r4OJ13k77J01O7l7J22pj27J84k4r8L4R5j49
$$ y = [-82, 1, -65, -172, 28, -152, -54, 22, 43, 155, 128, -100, -171, -118, 49, -106, 15, 128, -45, -13, 65, 176, 161, 84, 134, 169, 110, 27, 37, -114, -15, 36, 29, 19, -145, -77, -34, -17, -47, -16, 22, 15, 131, 32, -123, -191, 63, -96, -32, -3, 24, 83, 62, -96, -144, 199, -21, -32, -28, -3, -51, -123, 52, -78, 47, -69, -82, -189, 122, 40, 88, -61, -83, 43, -68, 26, -54, 79, 19, -77, -1, 64, 84, 70, -103, 142, -87, -81, 15, -136, -42, -37, 240, 19, 56, -5, -122, 0, -4, 19, 47, -83, -71, 17, 77, 244, 22, -110, -21, -11, -153, -70, -45, -126, -37, -153, -19, 94, 36, 47, 62, 4, 113, 149, 81, -26, 120, -9, -38, -4, -24, -282, -117, -15, -47, -134, 14, 37, 71, -89, -80, -132, 104, -119, 21, 20, 8, -66, -158, -34, 32, 27, -55, -21, 63, 58, 45, 43, 79, -37, 85, -104, -76, 12, -142, 93, -71, -75, 48, -51, 72, -74, 62, 41, 135, 213, 43, 1, -53, 66, 90, 43, 139, 189, -43, -69, 69, 22, -38, -182, 97, 35, 107, 26, -68, -62, 51, -226, -125, -58, -95, 27, 20, -107, 77, 53, -45, -11, 84, -65]
3969f5J98l02Q5N1k1m1M0J0p6J79Qo3J75l29K02j64J46m4q3K33o7nj65J30j87
3994a55l3J60l8J05NJ2N9q5nM7j59J4o6J41q6M3M0k0N7j2p2N9R0j24O7o6R5j39
4022f6M5k7p3l4m1K38m6P5m2jk9j30k4L00m4k35Q1J18p4l1K7K20k18R7K3k52l0
4049a73J70n9m7P1O6j37L0K57j27j64J18Rn9J7pN9j11qO6J25k21R2J79k66L20
4074B00r7j17J30j89R6M1m9p4p6J98J03j82o0rP2j06R9O2p5l8L5R4j1j05K9L9
4100A0J07%r8l3K29k43J20k60lJ96L5n3k1J60k28nJ70j64R8q1K9j6onJ9L6L4k11
4128a84O5K52j58M9J23q9k23K87k28N0J50o8o5n2J28j00pJ60mj42N0j01Q5K67
4152B45j85j88R1j01J63o6N0q8L0R2k10K98Jo4j16J80l6q5om6J38O1j60J76l61
$$ y = [-65, 133, -169, -84, -33, -54, -95, -55, -45, -121, 58, 66, 3, 178, -151, 51, -113, 33, -11, -94, 139, 72, 67, -98, 32, -155, -188, -28, -66, 39, 44, 56, 115, 30, 25, 72, -87, -73, -139, 2, -84, -41, -1, -21, 36, 24, -48, 11, 101, -23, 44, -22, 73, -66, -21, -48, -121, -155, -196, 42, -4, 71, 29, 28, -1, -131, -155, 145, 101, -134, -53, 65, -9, -40, -13, 207, -11, 86, 109, -143, -173, -3, -62, -109, -38, 28, -109, -79, 178, 51, -113, 5, 14, -45, -28, -35, 24, -87, -95, -29, 96, -125, -33, 146, -120, 200, 103, -14, 116, -73, 23, 64, 15, -59, -135, 63, 166, -16, -76, -85, -13, -119, -20, 42, -33, -71, -36, 58, 47, -58, -29, 10, 117, 117, 19, -14, 215, -28, 92, -168, -171, 25, 60, 7, -14, 146, -82, -87, 83, -81, 17, -64, -35, -51, -57, -62, -43, -7, 27, -184, -119, 133, -25, 24, 147, 58, -165, 122, -106, -56, 94, 26, -39, -91, 37, -63, -70, 90, 86, -56, -6, -107, -22, 245, 60, -128, -37, -138, 25, -41, 9, -79, -49, 43, -167, 131, 132, 68, -48, 132, 96, 11, 5, -41, 97, 158, -2, 174, -187]
4177a87K68q1M2l2m7J22q3Q8j15J59K6j56L5L9j29l3K11j76K4j79R0J41K0J28
4201A75q1l3l1Q3j24n9p0K45oj69M7K4J8m0J15j22j19K84j29J4o2J29K3m6q1L6
4227B1p2j3K7QQ9lk9k7m7NK60j68l9j8J60j04j88K60q2m1O1p1J4j66J22r9L07
4254A67k7p8j87J73P0j20J04k52J33M5K03k07j8n5J46j79Pm5K30j70j2o3J23P8
4278F6n0l5r0J95k13J77k28J84j97J02J25r9J0J77l6l3n2o2J91j18j05P6M0J80
4302B05p2J5k12J9J02M8l7j7o1r1J25k95K84J61k70m0J64J08j72M6J74j20m0J9
4326D3j1K6q2j3L8j57P7j32J76J04J7j77L02j25j50qJ24j58K5K2M1J16k08J54
4350D4p8Q1j46J47l7j51J44J58k01j6J45j05o9J24j03K2J09j18j30K51l4l1rP
$$ y = [-187, 81, 0, 42, 10, -37, 85, 2, 90, -25, 134, 160, 4, 39, 78, -51, -84, 127, -49, -25, -204, -114, 27, 47, 175, 94, 61, 30, 113, -11, -70, -140, 105, 99, -70, -23, 1, 19, -21, 94, -28, -147, 137, 8, 22, -40, 89, 112, 66, -15, 21, -51, -64, -37, -29, 60, 57, 28, 1, -46, -41, 219, 51, 12, -6, 154, 50, -138, 122, 40, -1, 60, -11, 3, -163, -41, -140, 167, 140, 62, -125, 48, 118, -2, 102, -150, -17, 28, 231, 24, 6, -49, 97, -82, -75, -120, 110, -60, -72, -135, -12, 66, 16, -19, -109, 86, -127, 50, -178, 6, -191, -89, 36, -63, -53, 124, 88, 55, 3, -59, 132, 14, -91, -15, 25, 205, 133, 148, -64, -45, 57, 105, 68, 51, -10, -101, 24, -271, 13, 174, -96, -136, 28, 136, -36, 10, 184, 64, 24, 43, 32, 58, -24, -37, 1, -156, -79, -211, -35, 69, 86, -91, 211, 86, -64, -72, 52, -106, -81, -59, -18, 98, -110, 44, -34, 47, -99, 48, 11, -140, 4, 162, -39, -55, 90, -15, -84, 40, -63, -41, 68, -50, -180, 71, 37, 6, -3, 4]
4374DJ1M8j35P7R3j28j0O5N5q7jl7P7K2j22J10K1j2j18N8r0Q0J71k01R3l1L4o5
4402a8j44J16K57j74P8k37LK3J00ol7m3M2P0k32L69k9j10l5l0K3J37j83J02j88
4427a46J00J47j21O2K7J17k26j77J81N5j3l1K03k17J97k27k2R7r3L1q7MK38k11
4451a12kj59M13p8j33J11K5j08r3J86J12j99O1nP8N3j90J55k20J21p6J62k04L9
4475f3L1j1J61n4l7L8Q4o5Jj37JmQ9J17k07J81j07j55N2P8N5No2j9k0K59k69R9
4503D1Oj5m7L9j0K26j93k7j38N5P7K67l07m0J41J4K0q4Q9k34O9K8J50r8P1o7R5
4530A28r1n1K8m7r4Q6K4j05j1J17J94j38j50K03j14m9M4P5n2q0p1P6J00N7j37
4555e8J23J8j66K03j04J3r4O5j91J62m1M8k59K80qL6p1O6M8m6J6r5P1K0o4j06
$$ y = [4, 15, 63, -72, 5, 98, -30, -40, 25, 80, -7, -8, -45, 32, 54, -68, 42, 63, 51, -67, -9, -99, -19, 152, -49, 44, 13, 47, -18, -162, -46, 211, 37, 115, -122, -119, -96, 4, -2, -39, -82, -40, 30, -202, 167, 138, 28, -7, -37, -14, 123, -60, 42, -146, -46, 101, -20, 42, 69, 186, -40, -217, -36, 19, 6, -25, 178, -39, 158, -69, -91, 6, -87, -56, -143, -139, 99, -112, -114, -273, 140, 62, -71, 40, 65, -43, -136, 50, 162, -37, 24, 19, 97, 150, -40, 115, -105, 16, -60, 102, -102, -63, -32, -43, 118, 64, 27, 65, 149, 84, 85, -52, -51, -55, 34, 151, -56, 125, 18, -137, -85, -7, 48, 53, -9, -28, -48, 211, -58, 41, 47, 32, -15, 24, 14, 240, 47, 20, -118, -63, 14, 281, -26, -66, 75, 89, 109, 25, 114, -120, -51, -23, 127, 29, 100, 33, 128, 37, -14, 14, -33, -127, -41, -17, -122, -133, -16, 178, 40, -110, 93, -21, -70, -26, 49, -3, -83, -154, -78, 22, 79, -58, 65, 83, -83, 120, 16, 29, -65, 0, -191, -29, -70, -22, -281, -1, -9, 27, -44, 22, 70, 24, 40, -55, 16, 36, -28, -134]
4581a34J77o3q8K45k77J96r2r5J23l5Q2q0J00o2J13j69P3J55m0j33l2K5M0J19
4605A48k91J52L5K7j4m6j24k2J24N7j81J75n2O6n2J36j51m1J55mr0j15J1JM8K2
4631b6J12j18j02K47j69J96j00qL9m0j59J20k2k9M4L4Rkj12J54n8Q8j20J18k27
4656a31R8M5Rm6R3k7k2j53J0L1O2J11j30j30K89k65J00j23K32m6K8J9k4o9R1k9
4682B3P7p8n4j04Q3O7M4j15l5J31Q7Qn7M7j61L1M6R9o8k8Jj4k5p6M2R1J48k25
4710a5r5J50O6j01J1K7j4O5j77N7O3qL6j87J79m5j6J18J3Rj75ol0j9P7k0J40j34
4738c1O9Q7k11J84j56j5P7J66j11O9j81O9r7J96k5j5l7k63K61k06J56q1R7Lj9
4763a4n2J61j21O6m5RL3Q2j05L3p0Q0o4k1J54j40O4Rj25L1P0n3K14j56r3J78O
$$ y = [-134, 43, -20, -108, 137, -140, 56, -36, -131, -8, -43, 39, -41, 59, -3, 110, -59, 14, 169, 129, -4, -36, -11, 29, 148, -143, 9, 44, 71, 57, 11, -113, -135, -11, 46, -135, 40, -12, 54, 2, 138, -13, -54, 101, 97, 7, -108, -97, -96, -48, -26, 86, -32, -134, 113, -56, 140, 40, 32, 71, 31, -128, -8, -30, -59, -15, 19, 28, 26, -86, 68, 10, 98, -22, 96, -131, -33, 12, 21, -25, 68, 41, 19, -134, -124, -93, -31, 80, -50, -180, 109, -156, -56, -179, 53, 7, 35, 54, 30, -39, 52, 23, 100, 22, -32, -136, -53, 14, 58, -57, -92, 39, 126, 134, 77, 124, -37, -6, 40, 139, 71, 43, 44, 30, 5, -71, -29, 62, 210, -15, -110, 40, 106, 5, 16, 43, 29, 94, -83, -26, 37, 29, 65, -122, 57, 12, -4, 114, 127, 136, -39, -45, -75, -94, -17, -37, 103, -31, 38, 125, -86, 98, -58, -73, 4, 170, 59, 128, -53, 16, -81, 115, 90, 75, 38, -225, 36, -170, -14, -95, 2, 5, -14, -66, 95, -26, 40, -5, 4, 37, 119, 14, 47, -23, 57, -7, -28, 126, -14, 50, 59, -66, -35, 35, -18, 196, 40, -53, 125, 131]
4790A31j10p9N9k47K24j7O2p4M9L7j40K25j08q7QJ61k04J54J3nj25j95K50k0p5
4815a13K00K3k9N3j27p9J70n3O3k5Qj90J17q4k9J42K51l49J08k10K95j80p9j10
4839b27L81p7r0J8J8J21j85J18j79K39j95M7k8M6n8K8J5n6M9%m6J17p6J7K5K9
4865E1R%j1q0N1J23j34J56j74j39K99l5K8K3j20Q1l20J96P2j38M0J4n1J33m2p
4891B5o0K37k11k2o1J88L7k36K05j78J21l6q3Q1J44n4r5j2n1mK5K6J7n1Lr3J80
4918D2j61Q9L4O8m2q2J52j38NP3j0j74K65j65ON8MMN0p4K3L2j2j68oJ09j7R8P2
4947A35m1j56R7jmq1K7j4K57j76J9j15K75k11j5O7j29l7J51Q5k63J94j09Q0l1
4972DK14l05K4L2J87j91O2j07J14J38k24OJ95l5r5n1Om9J89n7p0J72k38K21k35
$$ y = [131, 21, -58, 1, -246, -22, -39, 23, -51, -2, 35, -105, 120, 12, -75, -67, 94, -110, 44, 57, 52, -73, -268, -18, -38, -113, 87, 110, 81, 134, 7, -72, 98, 45, 108, 83, 91, -99, 18, -66, -95, 47, 298, -51, 57, -153, 142, -38, -117, -227, 154, 77, -13, 5, 23, 144, -41, 77, -102, 137, -58, -11, -39, 7, -51, -23, -8, -64, -15, -15, -61, 56, -20, -3, 22, 51, 60, 60, 49, -31, 20, 143, 9, 165, -9, -148, 151, 116, 144, 167, 47, 128, -192, 4, 76, -62, -22, -8, -59, 74, 32, 25, -35, 202, -9, -31, -92, 96, 133, -103, 102, -76, 45, 9, -74, 7, 151, 97, 2, -10, -61, -65, -40, -14, 3, -48, -45, -138, 42, -119, -30, 4, 72, 30, -52, 100, -38, -33, 40, 30, -144, 121, -44, -38, 20, 24, 28, 78, 4, 27, 59, 47, -121, -127, -18, -35, 63, 135, 94, -62, 35, 34, 30, -51, -24, -38, 219, 43, 62, -53, 222, 11, -4, 63, -66, -103, 48, 133, -130, 64, -45, 35, 4, 218, -87, -63, -31, 156, -35, 27, -80, 34, 172, -52, -46, 149, 114, 19, -32, -26, -75, 114, 57, -13, 159, -79, 142, -93]
4997i3J76J1j5kj09J24k30J31K3j19J32j44K37j13J03j74N0J1J70j45J32k30P3
5020aj2Q2p5J18k23K79j15j48L9J57R7j24n1L0J61m69K71Ml2O3m5J94j46o0m8
5045e4K4m8J25j12M5k2jj19N7k4J49M2j37O8n7P6J2O0j58J61j49J05l3j88J09
5070f9P0Q6j13j56K87o7qr1P4j31J61j0N9l3j43P5n6P9j2k8j15Q7J20j15N2r6
5096i3K7J70k5q8N7q1mj8J42j37L1L1j33J98j81O5N7O0l9k17K30j19J71N5j41
5121A8jN2L6k99J36P7j59M6K66k69j56K17oK27o9M0k26L26p3l13J57l3k0j0Q7
5146E1Lj55J18L3j57K29j38P9o0P2j31J36O1J8k30M8l3J29l3j84K14r7R2q6O2
5171D1r2O8K5l1P1m7m0k8O1P4J4m3j35nJ54j16J83n6n5j14J20J1n7J95k50M0J30
$$ y = [-93, 83, 94, 79, 77, -32, 92, -138, -7, 16, -103, 29, -115, 122, 9, 112, -62, -12, -1, 169, 24, 156, -74, -1, -13, 69, -6, 112, -111, 168, 53, -95, -56, 101, 198, 74, 23, 53, 214, -255, 16, 20, -12, 51, 6, 200, 54, -6, -54, -30, -78, 47, -65, -20, -42, -43, -162, -105, -129, 20, 62, -75, -7, -64, 12, 24, 84, -74, 87, -62, 43, 10, -178, -69, 1, 87, -26, -182, 105, 38, 30, -61, 13, -118, 43, 33, 92, 59, -84, -9, -65, 14, 2, -26, -141, -54, 66, -49, 3, -93, -66, 104, 79, -9, 48, -33, -37, -55, 87, -50, -19, 12, -121, 77, -104, -39, 18, 78, 39, -178, 52, -67, 104, 159, 18, 17, 69, 105, -194, -58, 19, -140, -94, 172, -97, -253, -36, -42, 185, 116, 156, -70, 256, 183, -130, 27, -6, -26, -36, 51, 54, -101, 17, 50, -107, 122, -16, 63, 3, 75, -56, 80, 141, 159, -71, -23, -56, 73, 40, -144, 70, -27, 65, -21, 41, -51, 17, 42, 11, 82, 35, -5, -33, 28, 102, 116, 73, -62, -67, 87, -29, 154, 98, 43, -71, 49, 60, 3, 198, -52, -12, 118]
5198A18j62K46j83J35k51L9k3N4j3m5P9J17j64P2p0n1M9q1R4jj2j36J9K32n2q9
5224g9R2L0k1J41q9r6n3K34K4l61M7K65j62Jp0J24r2N1J9j27P5P2q3J0J3j23J12
5251d6J43j62N7L2p4J09K6kk61J39O0j04J9k2J88l1L4j1j87n8J73k02J84l3R9
5276G0J2p5j44J16J46l8j81P0O5n1k05K01l0J17n8p2L2N8N7p7o1k56K19LJ97k88
5302a73K03J7j43K7K20r7M4r7k10J99j3R7oJ10j13k39J47p8K02j79Q7o3k0M2J11
5327G5K0l29K77k8R8j8J31k37oO4N7p5j79J34Lj39J16rJ36p9K25k80J63k05L42
5352B57m26K53J32j34m5j64n0J41Q0p8J09j06J33p5j06r3J66L3j54j1J96o2j57
5375a61J41J19k46J55P8p0L6j83J79j13lJ2N1q5K93j59N3j80R9N1M8r9j4M1J8
$$ y = [118, -44, 202, 19, 154, -97, -58, -81, -27, -40, -85, -6, 111, -53, 19, -51, -102, -53, -134, -40, -41, -53, -189, -170, 62, 10, -79, 13, 43, 22, 163, 74, -22, -75, 159, 183, -178, -131, 134, -28, -27, -97, 27, -65, -14, 5, -122, -47, 25, -58, -48, -35, -158, -46, 97, -65, -8, 24, -50, 59, 85, 83, -178, -39, 21, -83, -64, -86, 102, 71, 105, 94, -93, -151, 22, -180, 4, -29, 70, 82, 7, -137, -21, 125, 87, -94, -24, 41, -10, -215, -14, -44, 73, 15, -57, -25, 33, 90, 13, -48, -304, -85, -82, 115, -173, 30, 47, -96, -69, 151, 54, 98, 1, -209, -10, -23, 74, 68, 178, 65, -174, -27, -105, 97, -82, 5, -58, -78, -36, 75, 95, -234, 43, 15, 113, 95, 226, -11, -17, 47, 104, 29, -150, -16, -13, -152, -36, -45, 91, 12, 237, -43, 120, -85, 257, -169, 84, 216, 82, 37, -127, -177, -36, 44, -34, 75, -31, 102, 27, -79, -172, -6, 27, -127, -138, 58, -4, -161, -20, 99, -147, 8, 86, 16, 52, -131, 48, -65, -68, -56, -5, -90, 203, 44, 97, -83, 16, 67, 115, 16, 2, 43, 61]
5400F1l1L3j98J73n2n1j0K14k13J7J07j10J0lP6p5r3O3K58j75M2j25k0J4J91j42
5426c9n0J3QJ22j60J52O9q7J4q3M0J54k19J42m8o7rPP6Qj05J63n4J36j76J9j63
5453a37J00K4M8k8k3K28k25O1R9k35J24m6L9o8N4qp2m5Q0j19mO3J11j37k7J18
5479b5L5p5q2K52k17J77m6K10k67P0m6l9K9j48J26L3m0n2K26j90J63j39j1OJ17
5504F7q0O7J6Pj7j80J96m6Q2j18M2o5j38LJ6J54j27L6Q4j04J36J09j06J28m8j55
5530d1k5QL6n0J00j52J46P1j23J39j31L7j22pJ42oP9M8l4qq2j11P3J61j85M9j34
5557a22L21j72l8N8L9j29L3L6J07k24J59K25l83J55r0Jn2J54j1j73K90k65j4M9
5581d6J69n9L2rj25J88k94L2K37r3p3L6Rm7M0q7J55j52k7J30j73R1L6k2N8J19
$$ y = [61, 30, 63, -135, 38, -14, -65, -75, 139, -74, -57, 50, -60, -50, -53, 23, -52, -145, -82, 176, 1, 43, -82, -102, -88, 103, -39, -89, -76, -68, 54, -106, 46, 115, 28, 42, -41, -1, 153, -66, 76, 28, -39, -48, -41, 35, 43, -62, 101, 47, 183, 7, 26, -137, -37, -13, 35, 7, -16, 212, -13, 48, 147, -88, 36, -10, 29, -39, 15, 7, -65, -110, -30, -149, -153, -90, 21, -116, -143, -25, 10, -65, -147, 105, -112, 65, 19, 229, -38, 32, -14, -53, -24, -172, -46, -13, -53, -105, 121, -69, 94, -45, -56, -50, 67, -13, 54, 70, 77, 60, -120, 76, 30, 112, -6, 36, -29, -167, -164, -148, 6, -121, -85, -1, -105, 31, 140, 34, 162, 114, -41, -66, -58, -22, -72, 28, -124, 22, 93, -30, 109, -22, 15, -107, -114, 28, 22, 101, 149, 115, 107, 25, -86, -13, 148, -37, 12, -122, 199, 27, -11, 47, 86, -43, -10, 26, 133, -91, 68, 293, -90, 65, -25, -24, -76, 78, 67, -106, 184, -81, -95, -46, 123, 64, 96, 87, -38, 150, -144, -112, 125, 32, -41, -5, 4, -43, -3, -90, 65, -87, -114, 16, -157, -66, -30, -52, 6, 125]
5607A25J61l08J2j7o0J08M4j20j07J07N1PJ88j98L1j5j1j92j4K16n5K2l2J12l8
5632A7j35M1J49m2o1R3j16k2K13j83j0N9R2n4j3n3P6p6J51o8R1k89J06R1n0l1
5658b4J7N2J11j57q5J7J17N8k35O8M8P0l9m2l6J48k0j00K64j27j23k6Q2l0M8j28
5684g2J1M7J47Nj56o2M0j1J84j64%M3j72J56K7KN3j1j8j63N7N6P5o1k0J25j40
5711b2%K04j11j9k34K11m8J25j10M7o9K4L9M4j14J04m0k01J68n9Q6J56m01K24
5735Dj45L02p1l6k4L9n8P6j23O2j57J7K01K6j24KL1R8j76J97j61k13K54O4O9j34
5761B0k37J92l7N9R0Op2j18J18j18K11j74M0J22p8N2J17j56j11Q9L3j07K1M8j8
5786hJ5J04j68k9J34qj61L8J63j83J68j09m3J22K7j93J10l3J45j21K3j3M3J5J02
$$ y = [125, 286, -22, -10, -27, -87, 21, 65, -55, -162, -55, -4, 3, 191, -7, 24, 9, -2, -194, -208, 8, -47, -25, -57, 55, 17, -118, -77, 72, 30, -31, 62, -54, -76, 137, -46, -56, 3, 95, 41, 28, -25, 51, -25, 126, 58, 149, -140, -34, 57, 7, -24, -7, 45, 156, -1, -86, -69, 48, 106, -129, -61, -13, 57, 18, -24, -60, 88, 68, -32, 232, 105, -18, -44, 38, 8, 56, -72, -61, -14, 133, 138, -18, -80, -40, -51, 133, -31, -31, 12, -160, -4, 23, 25, 78, 67, 49, -114, -57, -1, 74, 13, -7, 118, -22, -22, 182, 71, 52, -182, 29, -19, 106, -4, 43, -26, -2, 37, 81, -33, 71, 31, -170, -2, -61, 25, 181, -220, 4, -141, 161, 90, 54, 30, 69, 11, 87, -36, 26, -131, -114, 87, 113, -11, -9, 22, 120, -56, 141, -20, -233, 21, 85, 154, 20, -217, -25, -62, -3, 87, 93, 21, -97, 21, -97, 114, -60, -20, 102, 24, 76, 193, 37, -74, 15, 48, -59, -38, 10, -8, 7, 111, -57, -86, 48, 40, -121, -83, 80, -103, 65, -44, -87, 35, 62, -131, -21, -54, 91, -30, -7, -20, 23, 38, 140]
5811A40k28J39Q7r5Q5l14J20K31k50N4J69k28J01j8p8J14j17J18r2J31O9j84n4
5834a00O3n5K16k25J22J6k4mO0p5J1j6m8Q9jJ37n6q8r6MK48j66J1j14M7J16j50
5861g8o7K86o2j97L8J1J72l3J16k27P8O5J7n7k30L0J57K3l7J37p5M8j26Q3n4q8
5887g0Q2Q1n0r3M3j29J36N0p3R8k39M2Q6lJ5J27j22K5P9j03L4J1r0oJ4O0q3J45
5915F7k5l3kN8j87R2J48j39p9J6J72j59J65o8M3nN9j70J32j36J10p3j62J77M4
5940D5J9j05J7p2Q7R7l1j55J16J60j25J04j69K08j91n6p4O9k7J12P5r6J5q4O3
5965BO3m0r0J20q8m1N0J32n7l7k9KJ48L6j44k04K41l9L9N9k24J18L2M6j81K54
5991A68j68j32J14N2o0oQ0j15Q7J8K3j01QMQ1k48Q4J18n7P9L5k37J77l8n2L9J23
$$ y = [140, -88, 51, 138, 43, 128, -186, -66, 165, -85, -31, 138, -90, 11, -7, -85, 29, -88, 30, -62, 69, 138, -46, -100, -37, -92, 124, -101, 21, 37, 13, 9, 69, -6, 5, -11, -59, 30, 29, 166, 110, 22, -74, -70, 178, 12, 23, -91, -44, 72, -78, -145, 141, 79, -118, -80, -69, 103, 70, 186, -41, 37, 102, 119, 62, -168, -138, 19, 42, 5, 142, 67, 115, -11, 72, 18, -70, 12, 93, 43, -50, -7, -136, 0, 50, -23, 75, -164, -122, -36, -39, -24, 103, -19, 6, 85, -18, 16, 27, -63, -69, -55, 5, -78, 67, 42, 9, 7, 65, -122, -30, 118, -21, -100, -84, 88, -71, 94, 26, 69, 64, 123, -47, 85, -51, 59, -14, -176, 1, 45, 64, -41, -24, -96, -9, 88, 57, -98, 18, 178, 53, 157, -12, 196, 5, -51, -125, -56, -83, 29, 104, 8, 23, -61, 2, 65, 25, -65, 55, -33, -74, -24, 108, 51, 14, -15, -13, 135, 171, 27, -177, 64, 25, 64, 123, -101, 17, 49, 95, -86, 168, 0, -132, -18, 34, -26, -32, 48, -67, 20, 38, 61, -40, -32, -28, 53, -195, -111, 7, -50, 29, 64, -173, 4, -34, -86, -47, 76]
6018G6j61K5N5J0Pk6o1K6jq2OQ1J31k8J03j95j5J88j49K33k55J39J6j84l2R1K3
6045B1Q2j54P4M9J9j52l1NJ15L3K4j33lP0p1r2M3K86o0o1j08R1m4k3j0oJ85j31
6073A8J58j88J15j98O4J01l6K83k60j24Q7l5Q3M8r1P0N4r1Q3l0N4p6k0l5j21L6
6099e1J17j36M1n8K52o8n4K2N1k08Q4j9j7P4j43l2J16N6j8o1Q8j17L46j61L2j27
6125Im0K0j00M7M2k5J14j13Q2m7L0n5J70k84k1K83J0q2j2jk15J56j1O4j15K09
6151A15m9j39Q4j08R3L5j84L30j94M5j29K24l61L40j4N2m2k32J36M1j36L34j95
$$ y = [76, -85, -60, -5, 5, 12, -14, -75, -49, -50, -132, -126, -45, 86, 58, 161, -34, -49, 139, -10, 223, -32, 107, 123, -61, -93, -2, 21, 103, -51, 23, 72, 91, -61, -92, -87, 28, 61, 85, -48, -51, 19, -52, -144, -101, 185, 125, 64, -44, 47, 3, -20, -30, -36, 149, 18, 176, -12, 103, -95, -31, 70, 34, 317, 57, -67, 20, -15, 68, 116, 25, 95, 149, 58, 141, 111, 165, 89, 69, 34, -87, -51, 66, -70, -29, -87, 165, 97, 43, 65, 116, -92, -8, -27, -44, 30, -113, -145, -29, 27, 9, -52, 36, -81, 265, 104, 136, 9, -31, -11, -111, -64, -22, -47, 67, -46, 36, -11, 19, -36, 134, -150, -171, 112, 122, 40, 28, 27, -188, -32, -43, 21, -94, 115, 66, -73, 11, -97, -4, 31, -153, 177, -17, 28, -101, 123, -238, 102, 88, 140, 98, -134, 2, 43, -93, 241, 46]
$$ [...]
8191f4
##END NTUPLES=NMR FID
##END=
