##TITLE=1H_4C1011SA
 aceton-d6
 8 sc, 
 11.11.2021
##JCAMPDX= 6.0         $$ Bruker NMR JCAMP-DX V2.0
##DATA TYPE= NMR FID
##DATA CLASS= NTUPLES
##ORIGIN= UXNMR, Bruker Analytische Messtechnik GmbH
##OWNER= root
$$ XWIN-NMR		Version 3.5
$$ Thu Nov 11 11:51:51 2021 Russian Standard Time (UT+4h)  she@DPX200
##.OBSERVE FREQUENCY= 200.1313468511
##.OBSERVE NUCLEUS= ^1H
##.DELAY= (6, 6)
##.ACQUISITION MODE= SIMULTANEOUS
##.ACQUISITION SCHEME= undefined
##.AVERAGES= 8
##.DIGITISER RES= 18
##SPECTROMETER/DATA SYSTEM= spect
##.PULSE SEQUENCE= zg30
##.SOLVENT NAME= CDCl3
##.SHIFT REFERENCE= (INTERNAL, CDCl3, 0, 15.7039)
##AUDIT TRAIL= $$ (NUMBER, WHEN, WHO, WHERE, WHAT)
$$ ##TITLE= Audit trail, XWIN-NMR		Version 3.5
$$ ##JCAMPDX= 5.01
$$ ##ORIGIN= Bruker BioSpin GmbH
$$ ##OWNER= she
$$ F:/spectra/data/she/nmr/H-F/1/audita.txt
$$ ##AUDIT TRAIL=  $$ (NUMBER, WHEN, WHO, WHERE, WHAT)
(   1,<2021-11-11 11:50:37.40 +0400>,<she>,<DPX200>,
      <created by zg, POWCHK disabled, PULCHK disabled
       configuration hash MD5:
       00 E9 B6 7A A2 85 ED C7 34 08 36 98 17 FE 4E 26
       data hash MD5: 16K
       4D 9A 74 6F A5 D4 28 32 73 42 6E 90 2A 50 6E 97>)
$$ ##END=
$$ 
$$ hash MD5
$$ C0 D5 C0 DA E7 5E AC 08 A7 C6 B6 86 BF 87 2B E5
##$RELAX= 
##$RELAX= 
##$RELAX= 
##$RELAX= 
##$RELAX= 
##$RELAX= 
$$ Bruker specific parameters
$$ --------------------------
##$DU= <F:/spectra>
##$EXPNO= 1
##$NAME= <H-F>
##$PROCNO= 1
##$TYPE= <nmr>
##$USER= <she>
##$AMP= (0..31)
100 100 100 100 100 100 100 100 100 100 100 100 100 100 100 100 100 100 
100 100 100 100 100 100 100 100 100 100 100 100 100 100 
##$AQSEQ= 0
##$AQ_mod= 1
##$AUNM= <au_zg>
##$AUTOPOS= <>
##$BF1= 200.13
##$BF2= 200.13
##$BF3= 200.13
##$BF4= 200.13
##$BF5= 200.13
##$BF6= 200.13
##$BF7= 200.13
##$BF8= 200.13
##$BYTORDA= 1
##$CFDGTYP= 0
##$CFRGTYP= 5
##$CHEMSTR= <none>
##$CNST= (0..31)
1 1 145 1 1 1 1 1 1 1 1 1 1 1 1 1 1 1 1 1 1 1 1 1 1 1 1 1 1 1 1 1 
##$CPDPRG= <>
##$CPDPRG1= <>
##$CPDPRG2= <>
##$CPDPRG3= <>
##$CPDPRG4= <mlev>
##$CPDPRG5= <mlev>
##$CPDPRG6= <mlev>
##$CPDPRG7= <mlev>
##$CPDPRG8= <mlev>
##$CPDPRGB= <>
##$CPDPRGT= <>
##$D= (0..31)
0 1.2 0 0 0 0 0 0 0 0.06 0 0.03 0 0 0 0 0.0002 0 0 0 0 0 0 0 0 0 0 0 0 
0 0 0 
##$DATE= 1636617036
##$DBL= (0..7)
120 120 120 120 120 120 120 120 
##$DBP= (0..7)
150 150 150 150 150 150 150 150 
##$DBP07= 0
##$DBPNAM0= <>
##$DBPNAM1= <>
##$DBPNAM2= <>
##$DBPNAM3= <>
##$DBPNAM4= <>
##$DBPNAM5= <>
##$DBPNAM6= <>
##$DBPNAM7= <>
##$DBPOAL= (0..7)
0.5 0.5 0.5 0.5 0.5 0.5 0.5 0.5 
##$DBPOFFS= (0..7)
0 0 0 0 0 0 0 0 
##$DE= 6
##$DECBNUC= <off>
##$DECIM= 32
##$DECNUC= <off>
##$DECSTAT= 4
##$DIGMOD= 1
##$DIGTYP= 9
##$DL= (0..7)
0 120 120 120 120 120 120 120 
##$DP= (0..7)
150 150 150 150 150 150 150 150 
##$DP07= 0
##$DPNAME0= <>
##$DPNAME1= <>
##$DPNAME2= <>
##$DPNAME3= <>
##$DPNAME4= <>
##$DPNAME5= <>
##$DPNAME6= <>
##$DPNAME7= <>
##$DPOAL= (0..7)
0.5 0.5 0.5 0.5 0.5 0.5 0.5 0.5 
##$DPOFFS= (0..7)
0 0 0 0 0 0 0 0 
##$DQDMODE= 0
##$DR= 18
##$DS= 0
$$ [...]
##$SUBNAM2= <"">
##$SUBNAM3= <"">
##$SUBNAM4= <"">
##$SUBNAM5= <"">
##$SUBNAM6= <"">
##$SUBNAM7= <"">
##$SUBNAM8= <"">
##$SUBNAM9= <"">
##$SW= 18.0517286264689
##$SWIBOX= (0..15)
0 0 2 0 0 0 0 0 0 0 0 0 0 0 0 0 
##$SW_h= 3612.71676300578
##$TD= 16384
##$TD0= 1
##$TE= 0
##$TE2= 300
##$TE3= 300
##$TEG= 300
##$TL= (0..7)
0 120 120 120 120 120 120 120 
##$TP= (0..7)
150 150 150 150 150 150 150 150 
##$TP07= 0
##$TPNAME0= <>
##$TPNAME1= <>
##$TPNAME2= <>
##$TPNAME3= <>
##$TPNAME4= <>
##$TPNAME5= <>
##$TPNAME6= <>
##$TPNAME7= <>
##$TPOAL= (0..7)
0.5 0.5 0.5 0.5 0.5 0.5 0.5 0.5 
##$TPOFFS= (0..7)
0 0 0 0 0 0 0 0 
##$TUNHIN= 0
##$TUNHOUT= 0
##$TUNXOUT= 0
##$USERA1= <user>
##$USERA2= <user>
##$USERA3= <user>
##$USERA4= <user>
##$USERA5= <user>
##$V9= 5
##$VALIST= <valist>
##$VCLIST= <CCCCCCCCCCCCCCC>
##$VD= 0
##$VDLIST= <DDDDDDDDDDDDDDD>
##$VPLIST= <PPPPPPPPPPPPPPP>
##$VTLIST= <TTTTTTTTTTTTTTT>
##$WBST= 1024
##$WBSW= 4
##$XGAIN= (0..3)
0 0 0 0 
##$XL= 0
##$YL= 0
##$YMAX_a= 396186
##$YMIN_a= -397894
##$ZGOPTNS= <>
##$ZL1= 120
##$ZL2= 120
##$ZL3= 120
##$ZL4= 120
##$ABSF1= 10
##$ABSF2= 0
##$ABSG= 5
##$ABSL= 3
##$ALPHA= 0
##$AQORDER= 0
##$ASSFAC= 0
##$ASSFACI= 0
##$ASSFACX= 0
##$ASSWID= 0
##$AUNMP= <proc_1d>
##$AZFE= 0.1
##$AZFW= 0.1
##$BCFW= 1
##$BC_mod= 2
##$BYTORDP= 1
##$COROFFS= 0
##$CY= 11.3945322036743
##$DATMOD= 1
##$DC= 2
##$DFILT= <>
##$DTYPP= 0
##$F1P= 2.36226072786647
##$F2P= -0.459571619588291
##$FCOR= 0.5
##$FTSIZE= 0
##$FT_mod= 4
##$GAMMA= 1
##$GB= 0.15
##$INTBC= 1
##$INTSCL= 1
##$ISEN= 128
##$LB= 0.24
##$LEV0= 0
##$LPBIN= 0
##$MAXI= 10000
##$MC2= 0
##$MEAN= 0
##$ME_mod= 0
##$MI= 1.114404
##$NCOEF= 0
##$NC_proc= 0
##$NLEV= 6
##$NOISF1= 3.799351
##$NOISF2= 2.8
##$NSP= 1
##$NTH_PI= 0
##$NZP= 0
##$OFFSET= 15.70392
##$PC= 1
##$PHC0= -15424.71
##$PHC1= 11.20081
##$PH_mod= 1
##$PKNL= yes
##$PPARMOD= 0
##$PSCAL= 0
##$PSIGN= 0
##$REVERSE= no
##$SF= 200.130013532006
##$SI= 16384
##$SIGF1= 3
##$SIGF2= 2
##$SINO= 400
##$SIOLD= 16384
##$SREGLST= <1H.CDCl3>
##$SSB= 0
##$STSI= 0
##$STSR= 0
##$SW_p= 3612.71676300578
##$SYMM= 0
##$S_DEV= 0
##$TDeff= 0
##$TDoff= 0
##$TI= <>
##$TILT= no
##$TM1= 0
##$TM2= 0
##$TOPLEV= 0
##$USERP1= <user>
##$USERP2= <user>
##$USERP3= <user>
##$USERP4= <user>
##$USERP5= <user>
##$WDW= 1
##$XDIM= 8192
##$YMAX_p= 0
##$YMIN_p= 0
$$ End of Bruker specific parameters
$$ ---------------------------------
##NTUPLES= NMR FID
##VAR_NAME=  TIME,          FID/REAL,        FID/IMAG
##SYMBOL=    X,             R,               I
##VAR_TYPE=  INDEPENDENT,   DEPENDENT,       DEPENDENT
##VAR_FORM=  AFFN,          ASDF,            ASDF
##VAR_DIM=   8192,          8192,            8192
##UNITS=     SECONDS,       ARBITRARY UNITS, ARBITRARY UNITS
##FACTOR=    0.0002768,     1,               1
##FIRST=     0,             0,               0
##LAST=      2.2672688,     0,               0
##MIN=       0,             -397894,         0
##MAX=       2.2672688,     396186,          0
$$ Real data points
##PAGE= N=1
##DATA TABLE= (X++(R..R)), XYDATA
$$ [...]
$$ plain form
1194 2542 1594 -1238 -2613 -717 2204 2212 -435 -2549 -1578 1547 2651 432 -2223 -2222 679 2752 1268
1211 1268 -1655 -2569 -274 2477 2014 -923 -2645 -1179 1921 2565 -64 -2505 -1935 1111 2776 870
1227 870 -2033 -2405 170 2664 1734 -1319 -2656 -788 2189 2413 -460 -2638 -1560 1467 2767 481
1243 481 -2319 -2220 579 2763 1405 -1753 -2596 -320 2428 2158 -929 -2778 -1145 1851 2615 4
1259 4 -2598 -1853 1077 2768 923 -2134 -2418 256 2590 1773 -1413 -2717 -622 2162 2365 -483 -2750
1276 -2750 -1459 1533 2666 481 -2426 -2135 778 2675 1318 -1798 -2614 -85 2422 2003 -986 -2827
1292 -2827 -978 1998 2466 -82 -2676 -1748 1343 2691 769 -2195 -2390 477 2637 1514 -1495 -2723
1308 -2723 -411 2353 2131 -674 -2748 -1301 1834 2525 160 -2457 -2044 1052 2677 991 -1919 -2503
$$ packed form
1194B542r48k832j375J896K921Qk647k114R71L125J104k219k655JK901K073j484
1211A268k923r14K295K751m63k937j722J466L100O44k629k441N70L046J665j906
1227H70k903l72K575K494r30l053j337J868K977K24k873k178J078L027J300k286
1243D81k800R9K799K184j358l158q43K276K748k70l087j849J633K996P64k611
1259Dk602P45K930J691j845l057k84K674K334q17l186j304K095K784K03k848k267
1276b750J291K992J133k185k907K91K913J897j357l116q16K529K507m19k989j841
1292b827J849K976M68k548k594R28L091J348j922k964j95K867K160j123l009j228
1308b723K312K764k22k805k074J447L135O91k365k617M13L096J625j686k910n84
$$ plain form
1324 -2503 172 2608 1709 -1231 -2766 -755 2238 2299 -434 -2634 -1617 1571 2700 410 -2330 -2233
1340 -2233 746 2789 1210 -1791 -2598 -173 2555 1934 -1054 -2699 -1051 2041 2495 -265 -2590 -1729
1356 -1729 1307 2717 618 -2174 -2248 408 2698 1481 -1580 -2571 -443 2341 2147 -818 -2629 -1225
1372 -1225 1746 2592 87 -2430 -1887 924 2713 1031 -2033 -2401 133 2515 1751 -1330 -2638 -640
1388 -640 2089 2303 -461 -2602 -1428 1444 2587 411 -2289 -2019 727 2536 1222 -1733 -2418 -68
1404 -68 2254 1889 -920 -2565 -861 1795 2247 -64 -2422 -1559 1190 2389 703 -1970 -2108 428
1420 428 2304 1394 -1312 -2444 -361 2050 1900 -577 -2442 -1111 1582 2168 152 -2125 -1769 913
1436 913 2306 852 -1609 -2164 152 2193 1437 -995 -2262 -623 1828 1860 -344 -2125 -1313 1247
$$ packed form
1324b503K675K436q99k940j535K011K993O1k733k200J017L188J129k290k740R7
1340b233K979K043j579l001q07K425K728o21k988j645J648L092M54k760k325Q61
1356a729L036J410k099k792p4K656K290j217l061r91K128K784j94k965j811J404
1372a225K971Q46k505k517N43K811J789j682l064l68K534K382p64l081j308J998
1388f40K729K14k764k141J174K872J143k176k700K70K746J809j314k955o85K350
1404f8K322l65k809j645J704K656M52k311k358Q63K749J199j686k673j38K536
1420D28J876r10k706j132K083K411j50k477j865J331K693N86k016k277L56K682
1436I13J393j454k461n55K316K041p56k432j267J639K451L2k204j781Q12K560
$$ plain form
1452 1247 2128 400 -1789 -1818 593 2184 964 -1316 -2011 -176 1944 1497 -738 -2048 -897 1532
1468 1532 1935 -120 -1897 -1423 946 2118 525 -1562 -1706 256 1992 1151 -1081 -1901 -433 1707
1484 1707 1644 -546 -1913 -948 1223 1920 83 -1714 -1359 584 1912 774 -1331 -1720 -33 1739
1500 1739 1359 -834 -1844 -587 1326 1699 -164 -1747 -1094 821 1834 523 -1541 -1524 310 1802
1516 1802 1071 -1079 -1756 -250 1481 1478 -432 -1772 -831 1064 1700 210 -1651 -1287 613 1717 776
1533 776 -1221 -1622 55 1529 1185 -663 -1759 -556 1255 1553 -59 -1687 -1101 856 1669 481
1549 481 -1351 -1499 317 1606 991 -860 -1752 -331 1425 1363 -347 -1772 -885 1117 1607 214 -1456
1566 -1456 -1360 566 1678 720 -1077 -1667 -57 1631 1185 -636 -1740 -617 1325 1476 -114 -1571
$$ packed form
1452A247Q81j728k189k9K411J591j220k280o95J835K120m47k235j310J151K429
1468A532M03k055j777M74K369J172j593k087j44J962J736q41k232q20J468K140
1484A707o3k190j367R65K171O97j837j797L55J943J328j138k105l89J687J772
1500A739l80k193j010J257J913L73j863j583O53J915J013j311k064J7J834J492
1516A802p31k150o77J506J731lj910j340R41J895O36j490j861L64J900J104r41
1533G76j997m01J677J474l44j848j096J203J811K98j612j628N86J957Q13j188
1549D81j832j48J816J289o15j851q92J421J756o2j710j425Q87K002M90j393j670
1566a456R6J926J112r58j797n90J610J688m46j821j104J123J942J51j590j457
$$ plain form
1582 -1571 -1178 827 1697 468 -1303 -1545 213 1742 963 -937 -1692 -374 1476 1392 -416 -1661 -941
1599 -941 1051 1753 146 -1565 -1396 549 1849 668 -1234 -1612 -47 1677 1228 -775 -1750 -650
1615 -650 1369 1676 -225 -1759 -1110 914 1867 381 -1504 -1441 304 1807 1012 -1111 -1767 -296 1623
1632 1623 1548 -601 -1892 -823 1217 1827 72 -1723 -1323 653 1917 750 -1454 -1757 120 1839
1648 1839 1305 -1014 -1980 -423 1575 1706 -334 -1998 -1039 1124 1953 372 -1787 -1612 611 2005
1664 2005 973 -1381 -1975 -24 1817 1446 -741 -2096 -745 1472 1860 -52 -2025 -1384 1031 2069
1680 2069 585 -1687 -1833 383 2020 1190 -1106 -2118 -396 1843 1747 -472 -2167 -1091 1425 2042
1696 2042 171 -1903 -1639 772 2181 884 -1499 -2062 2 2129 1453 -922 -2217 -696 1747 1876
$$ packed form
1582a571L93K005Q70j229j771k42J758J529p79j900p55J318J850q4j808j245P20
1599i41J992P02j607j711J69J945J300j181j902l78J565J724m49k003r75J100
1615f50K019L07j901j534O49K024R53j486j885O3J745J503p95k123o56J471J919
1632A623p5k149j291J069K040O10j755j795M00J976J264j167k204l03J877J719
1648A839n34k319r66J557J998J31k040j664R59K163Q29j581k159J75K223J394
1664B005j032k354n94J951J841l71k187j355J351K217L88j912j973O41K415J038
1680B069j484k272j46K216J637q30k296j012J722K239r6k219j695J076K516O17
1696B042j871k074K64K411J409j297k383n63K064K127o76k375j295J521K443J29
$$ plain form
1712 1876 -278 -2054 -1334 1146 2147 474 -1761 -1859 438 2229 1098 -1326 -2096 -301 1948 1649
1728 1649 -669 -2081 -1012 1427 2076 29 -1969 -1595 824 2274 722 -1631 -1915 138 2110 1377
1744 1377 -1069 -2107 -581 1723 1916 -395 -2143 -1185 1225 2160 276 -1887 -1631 539 2115 1024
1760 1024 -1394 -1980 -158 1889 1602 -805 -2128 -791 1478 1977 -98 -2001 -1347 861 2036 705
1776 705 -1651 -1828 256 1968 1323 -1121 -2085 -351 1704 1696 -447 -2064 -1012 1204 1937 310 -1802
1793 -1802 -1560 635 2019 897 -1360 -1931 31 1809 1366 -743 -1973 -673 1401 1730 -51 -1884
1809 -1884 -1284 971 1894 556 -1510 -1695 321 1840 1091 -978 -1910 -372 1601 1543 -392 -1875 -1003
1826 -1003 1202 1818 187 -1603 -1437 615 1820 761 -1177 -1740 -64 1732 1274 -709 -1786 -684
$$ packed form
1712A876k154j776P20K480J001j673k235r8K297J791j131k424p70J795K249k99
1728A649k318j412J069K439O49k047j998L74K419J450j552k353k84K053J972p33
1744A377k446j038J526K304J93k311j748R58K410R35j884k163K56K170J576j091
1760A024k418n86J822K047k87k407j323J337K269M99k075j903O54K208J175j331
1776G05k356j77K084J712o45k444r64J734K055qk143j617J052K216P33j627k112
1793a802K42K195J384j122k257n71J962J778m43k109j230J300K074L29j781j833
1809a884O00K255R23j338k066j85K016J519p49k069r32J538J973n8j935j483Q72
1826a003K205O16j631j790J66K052J205j059j938n63J676J796m58j983j077J102
$$ plain form
1842 -684 1369 1584 -144 -1633 -1186 818 1743 462 -1332 -1543 171 1734 1018 -918 -1707 -396 1453
1859 1453 1430 -381 -1627 -944 986 1699 210 -1434 -1350 402 1748 770 -1119 -1538 -114 1521 1233
1876 1233 -633 -1612 -666 1143 1585 -42 -1552 -1114 646 1681 517 -1271 -1404 111 1519 1015
1892 1015 -782 -1564 -435 1220 1409 -231 -1548 -862 840 1574 319 -1338 -1238 330 1508 876
1908 876 -947 -1474 -175 1314 1248 -464 -1575 -652 1003 1427 84 -1415 -1089 548 1476 639 -1105
1925 -1105 -1392 59 1351 1006 -674 -1523 -418 1107 1272 -145 -1450 -874 723 1422 395 -1194
1941 -1194 -1250 311 1373 779 -801 -1409 -177 1215 1129 -329 -1408 -681 929 1338 153 -1269 -1074
1958 -1074 504 1401 547 -972 -1335 24 1294 914 -519 -1417 -492 1038 1216 -113 -1326 -890 685
$$ packed form
1842f84K053K15j728j489M47K004R25j281j794k11J714J563p16j936p89J311J849
1859A453k3j811j246O83J930P13j489j644Q4J752J346r78j889m19J424J635k88
1876A233j866r79R46J809M42j627j510M38J760J035j164j788j33J515J408n04
1892A015j797p82J129J655J89j640j317O86J702P34j255j657J00J568J178o32
1908H76j823n27J299J489o6j712j111R23J655M24j343j499L26J637R28q37j744
1925a105k87J451J292l45j680q49J105J525J65j417j305N76J597O99j027j589
1941a194n6J561J062n94j580o08J232J392q6j458j079P27J610M09j185j422J95
1958a074J578Q97q54j519l63J359J270l80j433q98R25J530J78j329j213M36J575
$$ plain form
1975 685 1352 286 -1048 -1197 246 1323 719 -726 -1289 -272 1165 1062 -332 -1278 -679 861 1268
1992 1268 79 -1153 -989 391 1325 538 -869 -1217 -57 1258 896 -553 -1290 -477 997 1181 -150
2009 -150 -1204 -808 598 1295 286 -1042 -1070 163 1258 692 -721 -1198 -228 1057 1018 -329 -1202 -584
2027 -584 723 1225 100 -1101 -911 387 1219 511 -839 -1077 -7 1094 852 -496 -1191 -400 865
2044 865 1078 -93 -1155 -729 544 1171 313 -946 -1005 208 1088 667 -673 -1130 -161 958 942 -282
2062 -282 -1178 -498 740 1057 63 -1047 -809 388 1104 462 -772 -1024 78 1025 748 -467 -1089 -305
2080 -305 846 922 -105 -1032 -660 611 1034 230 -914 -927 214 1054 541 -602 -1035 -115 941 786
2098 786 -321 -1037 -460 707 953 44 -941 -728 453 1026 335 -737 -920 70 991 627 -479 -985
$$ packed form
1975F85O67j066j334j49J443J077o04j445n63J017J437j03j394r46N99J540M07
1992A268j189j232J64J380R34p87j407l48J160J315l62j449p37Q13J474J84j331
2009a50j054L96J406O97j009j328k8J233J095n66j413m77R70J285l9j347q73O18
2027e84J307N02j125j201J90J298Q32p08j350k38J070J101k42j348o95P91J265
2044H65K13j171j062M26J273O27q58j259n9J213Q80m21j340m57R69J119j6j224
2062b82q96O80J238L17r94j110K38J197P16o42j234k52J102R47k77j215o22P84
2080c05J151P6j027r27L72J271M23q04j144j3J141Q40n13j143m33R20J056j55
2098G86j107p16N77J167K46r09r85K13J181N73o91j072j83R90R21l64j106n06
$$ plain form
2116 -985 -277 826 832 -158 -954 -586 578 979 183 -816 -787 218 966 458 -594 -908 -95 856 706 -306
2136 -306 -968 -389 664 868 -18 -898 -624 378 961 278 -736 -827 63 902 568 -491 -886 -182 734
2155 734 759 -203 -887 -460 542 858 84 -782 -682 276 896 384 -628 -810 -28 802 627 -376 -869
2174 -869 -306 622 777 -66 -832 -533 404 822 239 -700 -712 155 806 473 -485 -814 -102 687 670 -222 -836
2195 -836 -355 557 760 25 -748 -569 322 782 287 -590 -741 65 770 499 -366 -765 -217 625 635 -108
2215 -108 -782 -423 483 727 115 -653 -628 231 738 338 -455 -712 -32 673 497 -249 -712 -294 516 657
2235 657 -24 -659 -454 368 713 174 -565 -591 125 695 371 -421 -639 -90 631 533 -222 -648 -317 453 658
2256 658 -17 -598 -493 253 683 192 -513 -567 28 658 405 -364 -645 -151 551 550 -153 -632 -313 402 603
$$ packed form
2116i85P08J103Or90p96L68J164M01p96r99K9J005P48n08j052l14Q13R51j50j012
2136c06o62N79J053K04q86q80K74J002N83o83j014r1Q90Q39l34j059l95P04R16
2155G34K5r62o84M27J002L16p74q66J00R58O20n12j012j82P82Q30j75j003m93
2174h69N63R28J55q43p66K99R37M18n83r39j2Q67O51l33r58l29P12P89j7q92o14
2195h36M81R12K03p35p73J79Q91M60m95q77j51Q06P05k71q65l99N48Q42J0p43
2215a08o74L59R06K44o12p68K5Q59N07m00p93k57O80P05j76p46m63M18Q10J41
2235F57o81o35K05Q22L45n39p39k6P16N70l24p92k18N49P21r8p55m26L31P70K05
2256F58o75n81J05P46M30m91p05n4N95O30k53p69k81M94P02jp03m79L19P15K01
$$ plain form
2277 603 76 -561 -515 218 634 258 -414 -567 -10 567 422 -254 -604 -197 453 562 -75 -565 -358 304
2297 304 586 151 -491 -483 124 566 306 -335 -572 -66 495 473 -172 -596 -224 380 528 7 -537 -406 223
2318 223 529 214 -420 -501 67 500 337 -279 -551 -129 402 436 -55 -524 -315 329 479 108 -440 -417 146
2339 146 510 243 -307 -478 -42 452 329 -168 -509 -204 407 432 0 -464 -329 264 480 135 -409 -438 90
2360 90 476 275 -256 -458 -85 413 392 -121 -450 -209 305 472 42 -427 -376 162 482 183 -317 -437 -24
2381 -24 445 320 -193 -443 -160 349 404 -62 -472 -283 218 454 59 -368 -380 91 456 252 -267 -424 -85
2402 -85 414 377 -159 -462 -203 286 451 52 -403 -311 171 480 166 -372 -436 8 457 345 -232 -475 -129
2423 -129 372 406 -70 -455 -272 237 480 122 -424 -400 114 479 250 -307 -459 -60 413 424 -167 -536 -202
$$ packed form
2277F03n27o37M6P33M16l76o72j53N57N77j45o76l50M07O50J09o37m90K07O62
2297C04K82m35o42QO07M42k60o41k37N06N61k2o45m24L72O04J48n21n44J31O29
2318B23L06l15o34q1N68M33j63o16k72M22N31L4m91m69K09O44J50l71n48K3N63
2339A46L64k67n50j71M36M94j23m97l41L05O11K5m32m64J35N93K16l45n44k9N28
2360I0L86k01n31k02L73M98k1n13l29K41N14J67m30m69N1N38L20k99n00j20M13
2381b4M69j25n13k50K83N09N5m66m10J89N01K36l95m27j2M71L65k04n19j57L39
2402h5M99l7n36l03K59M89J65l99m55R2M82L09l14n38o4M44M49j12n77k43L46
2423a29N01L4m76l85J83N09K43l58n46K4N14L65k29n57j52L99M73J1n91l69L34
$$ plain form
2444 -202 351 453 18 -509 -352 183 491 181 -369 -456 71 471 328 -230 -501 -123 408 425 -100 -505 -266
2465 -266 288 466 80 -463 -441 180 528 244 -331 -501 4 486 346 -213 -545 -202 404 476 -15 -501 -358
2486 -358 271 540 138 -449 -489 108 555 327 -311 -546 -103 483 437 -132 -577 -303 382 536 5 -520 -443
2507 -443 210 579 200 -420 -529 20 524 369 -283 -587 -192 476 491 -94 -566 -325 310 586 95 -489
2527 -489 -459 111 600 237 -386 -578 -76 547 450 -222 -604 -200 446 557 -34 -542 -374 286 606 169 -474
2548 -474 -501 79 604 348 -379 -587 -95 515 483 -190 -610 -275 395 570 22 -586 -434 225 629 201 -478
2569 -478 -549 36 567 409 -300 -623 -167 485 534 -104 -621 -336 360 614 104 -562 -491 159 631 277 -417
2590 -417 -596 -33 562 458 -249 -663 -237 444 554 -23 -648 -415 328 639 184 -509 -566 123 617 373
$$ packed form
2444b02N53J02m35n27J57N35L08l10n50q7N27M00j43n58k71L78N31J7n25m05K39
2465b66N54J78l86n43K2O21L48k84n75j70N05M82j40n59l32L43O06P2m91m86J43
2486c58O29K69m02n87m0N97M47k28o38k35M43N86m6n69m45K74O85J54n31n25P7
2507d43O53L69l79o20j09N49N04j55o52l04L95O68J5n85m72K41O35K76m91n84
2527d89L0N70M89l63o23j92N02O23r7o72l82M04O46J11n91n08J68O60L20m37o43
2548d74k7N80N25k56p27k08M92O10l2o73m20L35O70J75n48o08J52O59M04m28o79
2569d78p1N85N31j58p09l23M56O52M9o38n17K85O96K54n10o66P1O50M72l54o94
2590d17j79N63N95j04p07m14M26O81J10n77o25K33P43L11m55o93n7O89M94k44
$$ plain form
2610 373 -333 -623 -86 554 491 -171 -656 -287 434 611 37 -551 -476 230 657 248 -454 -590 16 596 412
2631 412 -299 -669 -189 504 546 -92 -614 -388 354 641 108 -545 -539 157 626 296 -398 -593 -46 586 491
2652 491 -230 -629 -290 463 610 9 -605 -454 274 648 196 -500 -578 54 607 388 -320 -609 -150 509
2672 509 540 -135 -598 -334 362 618 80 -535 -499 161 605 270 -420 -585 -53 579 461 -222 -618 -224 461
2693 461 576 -73 -611 -377 286 609 164 -506 -538 90 572 365 -346 -575 -119 495 493 -147 -610 -296 344
2714 344 559 48 -544 -430 176 608 263 -452 -585 24 528 415 -240 -595 -188 465 551 -38 -572 -377
2734 -377 289 590 149 -460 -504 90 574 303 -350 -578 -94 511 449 -150 -606 -274 387 578 52 -518 -428
2755 -428 202 587 214 -435 -574 -15 556 401 -250 -580 -238 451 485 -45 -556 -374 319 573 134 -480
$$ packed form
2610C73p06k90N37O40o3o62m85L69P21J77n74n88P5P06M27m09p02j36O06N80j84
2631D12p11l70M80O93M2o38n22K26P42K87n33o53OO96M69l30o94j95N47O32r5
2652D91p21l99L39P53J47o01o14J51P28L74m52o96p8O32N53k19p08k89M59O59
2672E09L1o75m63K64O96K56n38o15L6O60M44l35o90j65N32O32j18o83l96L94O85
2693D61J15o49n38K34O63L23m45o70l2O28M82k07p11k29M56O14ko40m63L14O40
2714C44K15n11n92J14O06M32l45p15j33O09N04j13o55l55M07O53Q6n89n34J95
2734c77O66L01m41o09m4N94M84k71o53k28M84O05o2n99m56L32O61J91n26n70R0
2755d28O30L85l73o49j39N59N71j55o51l30L42O89L4n30n11J82O93K54m39o14
$$ plain form
2775 -480 -500 97 605 310 -320 -578 -98 521 477 -126 -591 -285 389 578 45 -520 -451 176 617 232 -379
2796 -379 -528 -24 563 441 -231 -589 -241 429 545 -35 -548 -391 271 592 177 -468 -534 88 573 379
2816 379 -316 -571 -141 503 521 -110 -595 -316 344 591 105 -529 -460 158 602 307 -381 -589 -32 546 451
2837 451 -220 -595 -247 406 585 -2 -591 -398 246 642 231 -451 -535 38 590 396 -286 -630 -152 507
2857 507 553 -97 -636 -364 346 613 112 -523 -511 170 633 352 -377 -625 -61 588 517 -184 -674 -264 448
2878 448 598 35 -626 -487 239 639 250 -458 -612 56 611 429 -302 -661 -176 516 554 -75 -645 -417
2898 -417 362 635 147 -545 -593 164 688 349 -385 -649 -94 601 539 -176 -686 -307 484 639 19 -642 -512
2919 -512 272 691 242 -496 -636 22 676 440 -319 -702 -180 563 631 -88 -693 -401 347 691 146 -588
$$ packed form
2775d80k0N97N08k95o30k58M80O19m4o03m65L06O74J89n33n65O9O27M41l85o11
2796c79j49N04N87j22o72l58L48O70J16n80n13J57O62L21m15o45o6O22M85j94
2816C79o95k55M30O44J8o31m85K79O60K47m86o34O9O18M44k95o88k08N57N78r5
2837D51o71l75L48O53J79n87n89J93O44L96m11o82q4N73N52j94o82l44M78O59
2857E07M6o50n39K72P10K67n01o35J2O81M63k81p29k48N64O49p1p01m90M10P12
2878D48J50n63o61J39P26M00l89p08j54O68N55j82p31l59M85O92L8o29n70K28
2898d17P79K73m88o92m8P57N24l39p34k64N55O95o2p15n10L79P91J55o20o61J30
2919e12P84M19m49p38j40O58O54k36p59l83N22P43O8p19o05K92P48L44n45p34
$$ plain form
2939 -588 -587 145 722 396 -406 -700 -108 648 573 -186 -706 -335 454 667 29 -651 -513 266 708 288 -500
2960 -500 -624 24 694 477 -322 -714 -232 537 621 -98 -690 -448 335 695 151 -576 -595 130 680 426 -391
2981 -391 -706 -98 600 579 -200 -709 -330 460 694 47 -634 -530 231 708 316 -514 -660 39 654 490
3001 490 -345 -708 -231 519 635 -60 -682 -407 368 671 203 -565 -593 143 654 396 -402 -681 -114 575
3021 575 550 -167 -679 -356 450 644 60 -596 -517 235 637 292 -467 -619 12 638 465 -272 -651 -208 491
3042 491 579 -42 -628 -458 336 640 164 -518 -560 132 642 348 -367 -645 -136 560 536 -159 -619 -326 423
3063 423 606 60 -553 -511 190 650 267 -425 -594 -28 603 447 -253 -595 -253 455 551 -20 -545 -429 253
3084 253 657 181 -454 -535 89 594 356 -327 -575 -138 494 483 -127 -578 -332 337 581 89 -501 -445 130
$$ packed form
2939e88JP32N77l26q02k94N92P56p5p59n20L71P89K13o38o80J38P79M42m20p88
2960e00j24O48O70k17p99l92M82P69Q4p19n92K42P83L60n44p27j9P25N50k54q17
2981c91l15O08O98k1p79n09L79P90K34o47o81J04P61M77l92q30j46O99O15j64
3001D90q35l63M77P50J16o95o22K75P75L03m68p68k8P36N11k58p98k79N67O89
3021E75k5p17n12L23Q06J94n84o56P9P52M02l45p59j52O31O26j73p37l79M43O99
3042D91Q8o21n86J70P94L04m76o82m2O92N10k94p15k78N09O96k4o95m60K93P49
3063D23J83n46o13M2P01M60l83o92j69N66O31j56p00l42L42P08R6n71n25J16O82
3084B53M04m76o35q1O24N05k38o83k48M37O32j1o10m51K46O69K44m92n90N6N75
$$ plain form
3105 130 604 286 -391 -524 -34 529 462 -215 -557 -231 403 546 -3 -549 -413 211 592 162 -423 -510 12
3126 12 539 367 -294 -599 -161 442 477 -66 -571 -306 299 533 126 -485 -438 98 546 320 -335 -557 -75
3147 -75 464 439 -143 -549 -225 345 519 64 -481 -378 201 528 240 -387 -509 16 485 353 -187 -548 -174
3168 -174 392 480 -21 -512 -336 264 532 161 -433 -440 81 513 280 -296 -554 -148 437 438 -104 -543 -289 332
3190 332 497 59 -452 -439 165 504 264 -324 -491 -13 471 388 -184 -515 -220 352 478 -25 -478 -361 217
3211 217 480 146 -355 -479 18 513 320 -254 -527 -152 438 434 -97 -488 -329 293 506 81 -422 -435 121
3232 121 507 264 -310 -483 -71 478 397 -167 -492 -236 349 507 22 -471 -377 168 533 195 -363 -484 -2
3253 -2 500 334 -243 -514 -170 414 469 -64 -494 -315 246 518 93 -437 -409 97 505 247 -321 -513 -63
$$ packed form
3105A30M74l18o77j33M90N63o7o77l42L26O34J43n49n46J36O24L81m30n85q7N22
3126A2N27j72o61l05M38O03L5n43n05K65O05K34m07o11M7N36M48k26o55k22M82
3147g5N39k5n82m06L24N70J74m55n45J03N79L27k88o27j22N25M69j32n40l61L74
3168a74N66Q8n01m91J76O00K68l71n94pN21M32k33n76k58M06N85Jn42m39K54O21
3190C32J65m38n11J3O04L39k40n88j67M78M84q3n72l31K95N72J26n03m53J17N78
3211B17K63l34n01j24M97M95j93n74k73L75N90mn31l91J59O22K13m25n03j3N56
3232A21L86k43n74j73M12N49q1n64l25K56N85J58m85m93R4N45L65l38n58j21M82
3253bN02j66n77k71L44N84N5n33m30J79N61K72m25n30K8N06M08k58n68j92M50
$$ plain form
3274 -63 425 431 -173 -505 -208 331 483 17 -483 -377 165 513 204 -369 -463 12 486 353 -232 -518 -138
3295 -138 386 461 -59 -479 -279 282 495 139 -445 -444 106 481 245 -296 -502 -28 437 371 -147 -538 -199
3316 -199 315 468 34 -470 -382 192 497 198 -402 -483 49 459 305 -213 -474 -137 401 423 -55 -474 -317
3337 -317 278 506 102 -413 -419 84 492 229 -288 -489 -98 428 364 -152 -503 -230 315 454 5 -460 -346
3358 -346 152 452 162 -361 -423 12 466 329 -239 -466 -148 372 423 -94 -475 -276 252 453 78 -373 -373
3379 -373 79 481 224 -273 -433 -73 412 368 -160 -464 -188 323 471 -10 -436 -306 156 465 140 -346
3399 -346 -415 16 429 281 -234 -446 -94 336 386 -82 -429 -247 240 421 62 -387 -352 104 429 238 -313
3420 -313 -415 -26 394 346 -136 -457 -187 284 407 1 -404 -278 152 404 119 -328 -403 49 393 279 -213
$$ packed form
3274f3M88Oo04l32K97N39J52m66n00J06N42L48l09n73r4M75M74j33n85k86L80
3295a38N24P5n20m20K00N61K13l56n84JN50L75k36n41k06M74M65o6n18l91L39
3316a99N14J53m34n04Q8N74L05k99o00q1N32M10j54n18k61L37N38K2m78m19J57
3337c17N95K28m04n15oN03M08k63n17k01L91N26o4n16l51K73N45J39m49m65J14
3358c46M98L00k90n23o2M35M54j37n68k27L18N20N1n17l81J99N28K01l75m51%
3379c73M52M02k57m97j60L60M85m4n28l04K76N11J48m81m26J30M62L09l25m86
3399c46o9M31M13j48n15k12L52M30N0m68l47J82M87J81l59m49L5M56L25j91n51
3420c13j02L89M20m8m82l21K70M71J23m06m05J26M30K52k85m47p5M52L44j14m92
$$ plain form
3441 -213 -418 -80 327 325 -61 -412 -223 236 413 93 -342 -317 112 413 201 -235 -384 -27 340 294 -125
3462 -125 -412 -157 258 366 2 -357 -290 178 401 138 -295 -364 48 370 234 -157 -394 -133 305 333 -55
3483 -55 -377 -224 215 408 55 -288 -335 86 403 194 -226 -358 -62 352 276 -110 -364 -146 274 340 5
3504 5 -343 -279 141 366 148 -274 -361 -5 352 235 -176 -352 -134 300 304 -64 -343 -220 167 373 85 -295
3526 -295 -309 52 358 175 -213 -362 -51 307 260 -74 -341 -173 236 322 37 -301 -228 91 324 147 -242
3547 -242 -287 6 306 245 -138 -335 -117 246 298 -33 -321 -218 149 335 98 -272 -266 67 320 204 -165 -304
3569 -304 -49 239 280 -58 -334 -172 190 313 45 -272 -244 89 308 123 -197 -304 -33 264 250 -129 -300
3590 -300 -125 218 289 4 -292 -207 132 284 129 -243 -292 26 301 196 -147 -289 -100 263 287 -28 -282
$$ packed form
3441b13k05L38M07kl86l51J89M59J77l20m35K5M29L01k12m36j49L57L67m6m19
3462a25k87K55M15J08l64l59O7M68K23k63m33o9M12L22j36l91k37K61M38K8l88
3483e5l22J53M39J93l53l43m7M21L17k09m20j32K96M14p6l86k54K18M20O6l35
3504El48O4M20K25k18m22q7L56L57j17m11j76K18M34Ml68k79J23L87K06k88l80
3526b95j4L61L06j83l88j49L11L58m7l34k67J68M09Q6k85l38P3L19K33j77l89
3547b42m5K93L00o1l83j97K18L63N2l31k88J03L67J86k37l70OL33K53j16l69j39
3569c04K55K88M1l38k76J62L62J23k68l17K8L33K19j85l20j07K71K97j4l79j71
3590c00J75L43P1k85k96Q5L39J52j55l72m9L18K75j05l43j42J89L63K4l15k54
$$ plain form
3611 -282 -182 189 299 91 -243 -254 58 288 140 -174 -284 -35 270 221 -85 -274 -136 227 266 -3 -260
3632 -260 -246 96 299 105 -206 -297 -25 281 170 -124 -308 -101 216 258 -43 -265 -205 121 284 49 -244
3653 -244 -253 37 317 159 -174 -287 -49 275 235 -51 -291 -145 183 294 5 -247 -219 111 315 132 -207
3674 -207 -266 -18 262 186 -145 -296 -122 192 249 -9 -260 -187 137 321 55 -256 -243 27 301 177 -164 -311
3696 -311 -49 238 238 -98 -261 -97 177 279 16 -302 -216 92 288 151 -184 -260 16 255 193 -122 -298 -73
3718 -73 209 251 -35 -280 -162 136 253 103 -235 -234 41 241 187 -128 -268 -23 195 218 -57 -277 -118 177
3740 177 269 48 -238 -174 111 263 121 -196 -256 17 253 164 -98 -269 -72 198 208 -29 -283 -166 133 238
3762 238 65 -199 -203 62 241 141 -110 -243 -26 189 173 -61 -221 -137 136 223 37 -210 -198 115 255 82
$$ packed form
3611b82J00L71J10k08l34j1L12K30j48l14j10K49L05m9l06j89J38L63L9k69k57
3632b60J4L42K03j94l11r1K72L06j11k94j84K07L17M2l01k22O0L26J63k35k93
3653b44rK90K80j58l33j13K38L24m0k86k40J46L28J11k89k52K8L30K04j83l39
3674b07n9K48K80p6l31j51J74L14N7k58k51P3L24J84k66l11J3K70K74j24l41j47
3696c11K62K87%l36j63J64K74J02k63l18Q6L08J96j37l35p6K76K39o2l15j76K25
3718g3K82M2k86k45J18K98J17j50l38JK75K00n4l15j40K45K18K3k75k20J59K95
3740A77R2k21k86O4K85J52j42l17o0K73K36q9k62j71J97K70J0k37k54J17K99J05
3762B38j73k64mK65J79j00k51j33K17K15j6k34j60Q4K73Q7j86k47J2L13J40j73
$$ plain form
3784 82 -168 -241 9 222 170 -90 -246 -91 194 214 10 -196 -148 134 222 30 -185 -188 36 240 116 -133 -197
3807 -197 -23 183 191 -60 -183 -114 124 211 -7 -179 -163 77 221 78 -145 -181 -3 213 141 -88 -180 -61 159
3830 159 210 -50 -164 -103 105 208 53 -174 -152 15 195 112 -101 -181 -48 146 154 -52 -209 -64 97 186 20
3853 20 -173 -92 71 183 88 -127 -165 -5 138 144 -77 -173 -57 118 157 14 -139 -105 71 162 85 -117 -128 26
3877 26 144 91 -87 -156 -16 139 111 -35 -149 -97 66 124 23 -130 -129 13 149 80 -74 -166 -4 123 100 -13
3901 -13 -157 -53 106 140 22 -119 -109 45 138 51 -66 -136 25 126 79 -34 -132 -25 106 108 -21 -128 -90 72
3925 72 160 25 -65 -119 35 128 67 -57 -145 -22 109 123 -27 -91 -65 108 123 -14 -88 -87 40 128 61 -67 -90 -20
3951 -20 141 137 -47 -134 -47 84 100 -15 -150 -79 63 124 26 -105 -89 -7 145 77 -67 -102 -27 96 109 -43 -113
$$ packed form
3784H2k50p3K50K13n2k60j56J55K85K0k04k06M8K82Q8j92k15lK24K04j24k49o4
3807a97J74K06Qk51j23O9K38Q7k18j72J6K40J44j43k23l6J78K16p2k29r2J19K20
3830A59N1k60j14O1K08J03j55k27K2J67J80q3k13q0J33J94Qk06j57J45J61Q9j66
3853B0j93Q1J63J12r5k15l8J60J43Ok21r6J16J75L9j43j53L4J76R1p7k02j1J54
3877B6J18n3j78o9J40J55k8j46j14N2J63N8j01j53JJ42J36o9j54r2J62J27k3j13
3901a3j44J04J59L4j18j41J0J54R3q7j17p0J61J01m7j13r8J07J31Kj29j07L8J62
3925G2Q8j35r0n4J54R3o1j24q8J23J31J4j50o4K6J73J5j37p4JJ27Q8o7j28k3P0
3951b0J61mj84q7Q7J31J6j15j35P1J42O1r8j31J6Q2J52o8j44l5P5J23J3j52p0
$$ plain form
3976 -113 -80 59 126 5 -96 -58 56 115 94 -111 -104 -2 112 90 -32 -134 -39 90 116 -19 -109 -83 45 134
4000 134 53 -94 -90 1 102 105 -70 -126 -22 108 87 -36 -118 -93 65 116 22 -132 -79 27 108 77 -53 -125 -26 93
4026 93 105 -10 -136 -45 103 114 20 -114 -86 52 98 49 -87 -119 6 109 64 -69 -126 -47 83 86 -10 -111 -71
4051 -71 72 118 46 -95 -74 32 118 53 -63 -78 24 107 69 -35 -108 -52 84 80 13 -80 -78 52 95 21 -84 -81 31
4078 31 98 72 -66 -111 -26 112 120 -34 -98 -61 76 87 6 -83 -93 25 114 47 -75 -77 22 128 54 -65 -77 -23 86
4105 86 78 -30 -99 -56 44 91 1 -80 -41 55 108 73 -26 -76 21 82 91 -53 -71 -21 50 99 -5 -75 -39 25 102 7 -46
4134 -46 -61 9 62 34 -69 -99 15 55 69 -48 -95 -35 58 67 13 -72 -57 46 80 40 -25 185 58 -101 169 -27
4160 -27 -127 55 20 46 -11 -55 -30 66 85 8 -112 -54 34 61 38 -78 -70 7 79 49 -6 -121 -91 3 44 -13 -90 -21
$$ packed form
3976a13L3J39O7j21j01L8J14N9k1k05PJ02J14k2j22j02R5J29K6j35r0K6J28Q9
4000A34q1j47MR1J01Lj75n6J04J30k1j23q2K5J58N1r4j54N3J06Q1l1j30p2R9J19
4026I3J2j15j26R1J48J1r4j34K8J38M6m9j36l2J25J03m5j33n7P9J30Lr6j01M0
4051g1J43M6p2j41K1J06Q6o5j16j5J02Q3l8j04p3N6J36mo7r3KJ30M3p4j05LJ12
4078C1O7k6j38m5Q5J38Qj54o4L7J37J1q1q9j0J18Q9o7j22kR9J06p4j19j2N4J09
4105H6qj08o9M3J00M7r0q1L9R6N3l5r9n0R7O1Rj44j8N0P1M9j04p0L6O4P7r5n3
4134d6j5P0N3k8j03l0J14M0J4j17m7O0R3Rn4q5J5J03L4m0o5K10j27j59K70j96
4160b7j00J82l5K6n7m4K5R6J9p7j20N8Q8K7k3j16QP7P2l0n5j15L0R4M1n7p7O9
$$ plain form
4188 -21 81 60 25 26 12 -59 62 -21 -224 -84 39 20 63 -8 -52 -15 51 84 -57 -85 3 -7 58 12 -48 -132 -31
4215 -31 77 127 -76 -138 -27 52 41 -28 -42 -14 42 77 -2 -51 -34 23 109 -10 -54 -11 6 51 24 -15 -42 7 38 11
4243 11 -25 -75 2 14 40 -22 -78 -22 17 52 10 -81 -36 38 41 17 -30 -39 3 30 53 -17 -23 -6 39 19 9 -65 -42 31 24 -5
4275 -5 -30 -13 20 46 21 -34 -46 22 46 26 -16 -23 -11 29 35 -1 -32 -11 50 46 6 -13 -23 30 36 -14 -42 -35 4 30 18 -12 -49
4308 -49 -8 50 21 -19 -37 -35 47 51 -14 -41 -29 15 29 35 -22 -23 23 32 21 11 -23 0 -1 31 9 -32 -7 18 12 25 -28 -40 17 22
4342 22 34 -58 -21 -4 15 12 -13 -54 -1 31 28 12 -21 3 39 27 11 11 -18 45 42 31 -1 -36 32 38 34 14 -26 -11 36 45 16 -15
4376 -15 -14 9 20 -2 -22 0 8 6 15 11 -27 -21 23 13 25 -13 -10 47 26 1 -30 -43 6 0 25 1 -7 -7 33 18 3 10 -9 29 23 1
4412 1 3 -13 24 26 13 -14 -26 12 27 22 -31 -10 -2 39 15 -32 -9 -14 26 40 11 -33 -33 -2 14 -15 -18 -24 -15 29 38 3 -11 3 24 69
$$ packed form
4188b1J02k1l5Jj4p1J21q3k03J40J23j9M3p1m4L7O6L3j41k8Q8j0O5m6o0q4J01
4215c1J08N0k03o2J11P9j1o9j4K8N6L5p9m9J7N7Q6j19m4M3J7M5k7l9k7M9L1k7
4243A1l6n0P7J2K6o2n6N6L9L5m2r1M5P4Lk4m7rM2K7K3p0oJ7M5k0j0p4K3P3pk9
4275ek5J7L3K6k5n5j2O8K4k0m2pJ2M0Ol6l1K1O1mm0j9j0N3On0k8PL9K6j2l0l7
4308d9M1N8k9m0j8KQ2Mo5k7J2M4J4On7jM6Rj1j0l4K3jL2k2m1K5K5oJ3n3j2N7N
4342B2J2r2L7J7J9lk5m1N3L2lj6l3K4L6j2j6%k9O3lj1l2l5O8Omk0m0J5M7Rk9l1
4376a5JK3J1k2k0K2QkRml8OM4j0J2l8LN7k1k5l1j3M9oK5k4q%M0j5j5Pj9L8ok2
4412AKj6L7Kj3k7j2L8J5nn3K1QM1k4m7K3nM0J4k9m4%L1J6k9loRM4Rl5j4J4K1M5
$$ plain form
4448 69 -21 -16 -15 25 30 -11 -17 -9 12 18 33 -5 -31 12 15 38 5 -11 5 22 15 -8 -13 -20 -2 26 16 -29 -10 -30 21 28 -39 -40 -30 2
4484 2 31 -10 -24 -11 36 40 -6 -17 -20 -1 20 26 -9 -7 -2 20 7 -21 -8 -14 7 37 35 -57 -24 -2 22 -4 -49 -61 0 39 23 11
4518 11 -48 -19 3 54 -3 -46 -22 12 37 50 -19 -32 19 47 38 -18 -20 -10 49 25 -32 -57 -6 47 62 4 -41 -9 26 57 33
4549 33 -25 -42 -13 17 1 -15 -25 -37 39 45 -16 -49 -43 30 29 15 -46 -38 36 48 24 -41 -50 -6 90 56 7 -42 -34 35 76 -2 -14
4582 -14 -25 9 43 13 -57 -36 30 82 39 1 -26 5 35 45 -18 -61 -21 70 28 11 -41 -20 57 50 -5 -24 -28 -9 49 38 -6
4613 -6 -74 -12 65 50 9 -72 2 43 76 2 -66 -22 32 69 47 -34 -62 27 32 43 -26 -59 -8 39 31 8 -43 -46 33 46 -11 -49
4645 -49 -55 26 49 25 -15 -58 -22 60 48 -5 -50 -28 14 57 13 -24 -45 23 51 15 -23 -34 0 67 56 -22 -44 -17 51 57 -4
4676 -4 -55 -31 41 53 -12 -47 -30 -27 31 40 -58 -51 12 56 26 -20 -61 -41 62 73 26 -65 -54 18 39 3 -24 -47 0 59 36 -21
$$ packed form
4448F9r0NJM0Nm1oQK1OJ5l8k6M3LK3l3j6J6J7pk3npJ8K8j0m5J9k0N1Po7jJ0L2
4484BK9m1j4J3M7Mm6j1lJ9K1Ol5KNK2j3k8J3oK1L0kr2L3K2K4k6m5j2O1L9j6j2
4518A1n9K9K2N1n7m3K4L4K5J3o9j3N1K8rn6kJ0N9k4n7k5N1N3J5n8m5L2L5L1k4
4549C3n8j7K9L0j6j6j0j2P6Oo1l3OP3jj4o1QP4J2k4o5rM4R6l4m9m9QO9M1p8j2
4582a4j1L4L4l0p0K1O6N2m3l8k7L1L0J0o3m3M0R1m2j7n2K1P7pn5j9mJ9N8j1m4
4613fo8O2P7j5m1q1P4M1L3p4o8M4N4L7k2q1k8Q9NJ1o9l3N1M7qk3n1lP9J3n7l8
4645d9oQ1K3k4m0m3L6Q2j2n3m5K2M2M3m4l7k1O8K8l6l8j1L4O7j1p8k2K7O8Oo1
4676dn1K4P2J2o5l5J7LN8Rr8PO3M4l0m6m1K0J03J1m7r1J1P2K1l6k7k3M7N9k3n7
$$ plain form
4708 -21 -60 -11 25 62 -45 -47 -30 9 60 17 -75 -16 21 46 -6 -66 -51 -19 31 50 -30 -43 -4 33 38 -22 -65 -18 53 52 -17
4739 -17 -36 -21 -16 71 24 -30 -42 10 54 21 4 -30 -25 61 52 2 -75 -54 3 48 0 -38 -62 9 56 18 -32 -40 -14 34 64 -16
4771 -16 -47 -27 33 71 4 -58 -32 22 73 7 -32 -59 7 49 50 7 -37 8 33 40 -15 -26 -18 32 47 35 -53 -48 30 31 11 -6 -43
4804 -43 3 33 36 -17 -78 -16 61 29 17 -44 -48 12 44 39 0 -42 -11 81 50 -14 -27 -5 30 59 -10 -18 -43 12 79 -9 -51 -38
4836 -38 11 76 30 -57 -51 -22 15 33 -20 -73 -75 48 45 15 -17 -50 -15 39 39 -46 -47 -32 40 64 -31 -50 -39 9 40 -1 -57 -39
4868 -39 25 65 -6 -63 -54 9 62 41 -36 -73 -35 26 33 -33 -64 -22 24 45 31 -49 -35 13 63 31 -17 -63 -15 55 29 -18 -57
4899 -57 3 23 59 24 -50 -22 13 47 31 -33 -17 23 21 22 -15 -70 -44 16 45 17 -65 -37 31 61 14 -43 -43 1 44 20 -37 -62
4931 -62 6 53 9 -17 -57 -28 24 52 12 -45 -46 27 41 10 -38 -72 14 69 31 4 -43 -52 54 88 -1 -54 -23 28 73 15 -39
$$ packed form
4708b1l9M9L6L7j07kJ7L9N1m3r2N9L7K5n2o0J5L2N0J9q0j3L9L7No0m3M7P1jo9
4739a7j9J5NQ7m7n4j2N2M4l3j7l4NQ6rn0p7K1N7M5m8l8k4P1M7l8n0qK6M8L0q0
4771a6l1K0O0L8o7o2K6N4N1o6l9k7O6M2Jm3m4M5K5Pn5j1QN0J5j2q8NP8Jk0j7l7
4804d3M6L0Ln3o1O2P7l2j2o1mO0L2nl9m2L1R2l1o4j3K2L5K9o9qk5N5O7q8m2J3
4836c8M9O5m6q7OK9L7J8n3n3kJ23ll0l2l3L5N4%q5jJ5P2K4r5j9J1M8L1m1n6J8
4868c9O4M0p1n7RO3N3k1p7l7L8O1Po6l1M2M6K1j4q0J4M8N0l2m8m6M8P0k6m7l9
4899e7O0K0L6l5p4K8L5L4j6o4J6M0kJl7n5K6O0K9k8q2K8O8L0m7n7%M4M3k4n7k5
4931f2O8M7m4k6m0K9N2K8m0n7jP3J4l1m8l4Q6N5l8k7m7rJ06L4q9n3L1N1M5n8n4
$$ plain form
4962 -39 -65 7 23 14 -44 -56 5 44 29 -36 -56 -39 23 58 -3 -29 -61 41 57 20 -42 -59 12 53 52 -25 -40 -33 68 54 10
4993 10 -22 -18 34 83 18 -58 -42 11 60 26 -29 -61 1 54 64 7 -78 -53 40 89 0 -30 -60 22 52 30 -56 -51 -11 34 71
5024 71 -12 -69 -11 45 58 8 -50 0 37 81 21 -37 -37 -22 68 42 -18 -45 11 48 58 -27 -71 -71 17 58 2 -54 -75 32 86
5055 86 18 -67 -66 20 54 46 -16 -100 -5 48 77 4 -70 -43 70 71 32 -51 -57 25 85 47 -20 -77 3 85 53 -29 -58 -14 53 55
5087 55 -8 -53 -75 14 86 25 -56 -79 -11 92 24 -51 -92 -19 65 53 -9 -72 -24 36 55 0 -57 -49 33 62 30 -28 -64 -6
5117 -6 62 20 -9 -46 -4 49 50 -34 -64 -26 16 47 16 -69 -61 20 50 36 -37 -55 -23 51 58 -27 -81 -47 29 76 0 -52 -42 27
5149 27 76 13 -36 -26 18 56 48 -16 -52 -9 56 38 4 -52 -34 39 47 17 -51 -45 1 86 64 -23 -81 -7 42 55 -20 -55 -32 19
5181 19 28 16 -86 -73 38 47 -9 -88 -50 -15 70 68 -21 -45 -16 54 51 19 -39 -42 53 52 29 -55 -70 0 56 43 -11 -71 8 33
$$ packed form
4962c9k6P2J6rn8j2O1L9j5o5k0J7O2L5o1k6l2J02J6l7o2j7P1M1jp7j5PJ01j4m4
4993A0l2MN2M9o5p6J6N3M9l4n5l2O2N3J0n7q5K5R3M9q9l0l0Q2L0k2q6NM0M5L7
5024G1q3n7N8N6J3n0n8N0L7M4o0n8%J5R0k6o0k7N6L7J0q5m4%Q8M1n6n6k1J07N4
5055H6o8q5JQ6L4qo2q4R5N3K9p3p4K7J13Jl9q3oQ2O0l8o7n7Q0Q2l2q2k9M4O7K
5087E5o3m5k2Q9P2o1q1k3O8J03o8p5m1P3Q4j2o2o3M8O0J9n5n7QQ2K9l2n8l6N8
5117fO8m2k9l7M2N3Jq4l0L8M2L1l1q5QQ1L0j4p3j8L2P4Pq5n4L4P6M7p6n2J0O9
5149B7M9o3m9J0M4L8qo4l6M3O5j8l4n6J8P3Ql0o8OM6Q5k2q7n8P4M9J3p5l5K3N1
5181A9Rj2j02J3J11Rn6p9L8L5Q5kq9k4K9P0ll2n8lR5jk3q4j5P0N6j3n4o0P9K5
$$ plain form
5213 33 49 -27 -68 -31 21 21 -4 -42 -94 11 25 25 -13 -85 -1 41 16 -43 -75 -50 46 69 -13 -61 -22 27 56 0 -45 -49 23
5244 23 54 50 -19 -45 -34 71 38 3 -52 -57 0 60 23 -40 -42 17 59 13 -37 -41 -15 38 27 -28 -51 -25 40 48 -15 -47 -31 -7
5276 -7 64 29 -54 -64 -4 40 27 -6 -6 -20 23 44 0 -54 -31 19 72 19 -27 -42 -7 45 47 -36 -58 2 43 26 -1 -60 -35 19
5308 19 40 22 -58 -16 3 63 37 -23 -50 -34 41 32 -18 -62 -3 27 45 -1 -64 -37 41 70 24 -62 -44 21 43 22 -47 -55 2
5339 2 59 58 -6 -66 -50 11 33 32 -60 -70 18 29 27 -24 -56 22 53 34 -15 -76 -33 79 59 -20 -57 -52 50 22 19 -12 -27 4
5371 4 43 49 -4 -57 3 60 35 -34 -60 -37 25 65 -10 -54 -52 19 54 26 -45 -44 -26 17 18 -45 -35 -15 48 37 7 -35 -38 25 26 -19
5405 -19 -32 -32 -2 51 43 -30 -42 -9 64 64 -14 -62 -23 11 37 -9 -49 -46 -3 63 5 -59 -31 -3 51 24 -25 -54 -34 33 50 35
5437 35 -66 -33 26 15 17 -25 -26 20 52 11 -32 -50 2 41 39 -3 -59 18 20 33 9 -41 -42 -11 48 38 -47 -49 13 51 39 -25 -37
$$ packed form
5213C3J6p6m1L7N2%k5l8n2J05J4%l8p2Q4M2k5n9l2K5R6K3q2m8L9M9K9n6m5mP2
5244B3L1mo9k6J1J05l3l5n5nN7O0l7o3kN9M2m6n0mK6N3j1n5k3K6O5Qo3l2J6K4
5276gP1l5q3j0O0M4j3l3%j4M3K1m4n4K3N0N3n3m6j5L5N2Kq3k2O0M1j7k7n9K5N4
5308A9K1j8q0M2J9O0k6o0k7J6P5rn0m4N9L0J8m6o3K7P8K9m6q6J8O5K2k1o9qN7
5339BN7jo4o0J6O1K2jr2j0Q8J1kn1l2P8L1j9m9o1M3J12k0p9l7NJ02k8ll1j5L1
5371DL9On3n3O0N7k5o9k6K3O2M0p5m4KP1L5k8p1JJ8M3Jo3J0K0O3j1l0m2lO3Jm5
5405a9j3%L0N3qp3j2L3P3%p8m8L9L4K6m6m0LM3O6n8o4K8K8N4k7m9k9K0O7J7j5
5437C5j01L3N9j1Km2jM6L2m1m3j8N2L9km2n6P7KJ3k4n0jL1N9j0q5kO2L8j2o4j2
$$ plain form
5470 -37 -13 25 39 -24 -60 -52 28 50 3 -46 -71 -6 29 9 -25 -57 22 32 35 -5 -34 -33 46 53 -11 -43 -41 3 47 0 -48 -49 -14
5503 -14 57 22 -38 -40 -33 33 8 -8 -31 -34 40 38 -13 -49 -48 -1 51 9 -25 -34 -7 39 24 -17 -74 -27 20 42 -3 -17 0 30 55
5536 55 2 -41 -25 12 40 31 -9 -36 -4 40 26 -11 -41 -30 10 24 8 -37 -33 -17 48 37 -34 -43 -11 25 51 -25 -37 -41 24 43
5568 43 -8 -29 -52 19 35 19 -41 -45 0 34 28 -20 -51 2 23 13 -11 -47 -22 -1 54 2 -47 -55 1 23 5 -42 -50 -10 19 37
5600 37 -22 -61 -38 33 29 16 -19 -13 -3 50 2 -18 -34 24 40 -1 -4 -74 12 34 4 -2 -43 -36 33 38 -3 -17 -42 21 49 11 -18
5633 -18 -29 6 25 24 -6 -49 -26 22 25 -3 -27 -61 -4 62 30 -17 -24 3 30 28 -16 -26 -9 40 29 -15 -33 -41 29 47 13 -23 -45
5666 -45 15 29 10 -25 -50 -43 33 29 -25 -23 -4 24 23 -9 -50 -31 12 21 -12 -40 -35 -30 29 29 -4 -48 -3 19 32 4 -49 -33 22 49
5700 49 18 -43 -22 17 31 0 -30 -30 3 37 15 -35 -41 0 31 24 -1 -43 -36 33 14 -14 -44 -33 -13 27 22 -4 -16 -5 21 40 0
$$ packed form
5470c7K4L8J4o3l6QQ0K2m7m9k5O5L5k0l4l2P9J0Lm0k9JP9Po4l2KM4M4m7m8jL5
5503a4P1l5o0kPO6k5j6k3lP4kn1l6JM7N2m2l4rK7M6j5m1n7M7M7K2m5j4J7L0K5
5536E5n3m3J6L7K8rm0k7L2M4j4l7l0J1M0J4j6m5MJ6O5j1p1rL2L6K6p6j2mO5J9
5568D3n1k1k3P1J6j6o0mM5L4om8l1N3K1j0k4l6K5K1N5n2m9qN6K2j8m7qM0K9J8
5600C7n9l9K3P1mj3l5OJ0N3m8k0j6N8J6m1lp0Q6K2l0om1PO9Nm1j4k5O3K8l8k9
5633a8j1L5J9jl0m3K3M8Lk8k4l4N7O6l2m7pK7K7km4j0J7M9j1m4j8qP0J8l4l6k2
5666d5O0J4j9l5k5PP6mn4KJ9K8jl2m1J9M3Rl3k8NNN9%l3m4M5K2J3k8n3J6N5K7
5700D9l1o1K1L9J4l1l0%L3L4k2n0oM1L1pk5m2PO9j9k8l0J1K0M0nk6j2J1K6J9m0
$$ plain form
5733 0 -28 -13 12 10 36 -36 -6 35 50 -9 6 -50 26 22 38 14 -32 15 -2 44 -7 -13 -25 23 46 9 -25 -56 -20 21 14 -12 -48
5766 -48 -24 38 25 12 -37 -13 42 28 -23 -19 -29 -5 50 19 -20 -16 18 36 5 0 -29 -3 18 30 7 -45 -12 -24 42 8 -41 -43
5798 -43 4 42 36 -37 -26 -25 6 6 -9 -41 -1 3 25 -21 -29 -11 2 38 46 -22 -29 -15 44 29 -7 -32 -36 40 50 -5 -31 17 5 24
5832 24 25 -12 -10 8 28 38 -25 -32 5 5 27 -30 -45 -20 5 11 -1 -28 -28 13 7 -14 -28 -43 -1 32 18 -6 -24 -2 27 7 15 -42
5866 -42 -18 15 39 -1 -17 -23 27 25 18 -4 -23 -16 42 29 -21 -31 -19 16 17 15 -38 -28 1 45 -26 -31 -47 6 8 14 -9 -26 -9 41 15
5901 15 14 -39 -15 18 -8 12 3 1 -1 49 20 -39 -16 -27 18 35 5 -32 -8 11 34 -6 -15 -26 21 62 -22 -34 -30 -2 41 11 -18
5934 -18 -32 -37 -2 13 -6 -48 5 7 44 -7 -11 -17 25 25 18 -12 -4 38 25 12 -23 -19 17 45 47 -29 -45 -17 6 47 15 -16 -9 6 30
5969 30 26 -11 -49 -21 1 15 -18 -43 -4 21 48 10 -24 -20 28 46 10 -14 -32 9 35 7 -9 -22 13 11 28 26 -27 -22 4 38 7
$$ packed form
5733@k8J5K5kK6p2L0M1J5n9J5n6P6mJ6k4m6M7j7M6n1oj2M8K3l7l4l1L6M1pk6l6
5766d8K4O2j3j3m9K4N5j4n1Mj0K4N5l1l9ML4J8l1nk9K6K1J2k3n2L3j2O6l4m9k
5798d3M7L8op3J1JL1%j5l2M0MK2m6qJ8J3L6Qo8pJ4N9j5l6k5mP6J0n5k6M8j2J9
5832B4Jl7KJ8K0J0o3pL7%K2n7j5K5K5Oj2k7%M1ok1j4j5M2L3j4k4j8K2K9k0Qn7
5866d2K4L3K4m0j6oN0kpk2j9PN8j3n0j0J2L5Jkn3J0K9M4p1nj6N3KOk3j7J7N0k6
5901A5jn3K4L3k6K0rkkN0k9n9K3j1M5J7l0l7K4J9K3m0rj1M7M1q4j2MK8M3l0k9
5934a8j4nL5J5j9m2N3KL7n1moM2%pl0QM2j3j3l5ML6K8Kp6j6K8K3M1l2l1PJ5K4
5969C0ml7l8K8K2J4l3k5L9K5K7l8l4MM8J8l6k4j8M1K6k8j6j3L5kJ7kn3NK6L4l1
$$ plain form
6002 7 -2 -29 8 37 17 -42 -33 -8 5 -7 13 -30 -22 -4 16 -4 -43 -23 18 10 -4 -10 -14 28 42 28 -16 -20 5 37 18 -1 0 -13 25
6037 25 27 21 -22 -23 11 63 33 20 -41 -4 26 27 13 -15 -12 19 45 -5 7 -32 5 22 -1 -16 -11 -2 12 12 -13 -22 -15 21 40 0 -17
6072 -17 -16 21 35 16 -6 -24 -8 30 33 -2 -46 9 11 16 -24 -27 -21 -12 19 -3 -28 -23 -1 26 19 -38 -20 -18 -6 20 -23 -40 -23 49 29
6107 29 -10 -34 1 13 27 -11 -3 -14 -4 32 25 -33 -24 -28 -6 10 -1 -27 -3 26 20 -12 -20 -29 18 23 39 -22 -18 -28 20 17 -32 -45 -48 12
6143 12 28 5 -46 -9 9 21 6 -15 -39 -5 17 33 15 -16 -6 37 28 18 -37 -22 45 1 -3 -22 1 4 5 9 -10 -32 -16 18 23
6176 23 -14 -50 -15 8 19 3 -35 -57 -12 17 16 -10 -34 -1 20 33 4 -14 -24 24 25 20 -16 -6 0 31 15 15 -16 10 48 12 -38
6209 -38 -34 -10 33 -12 -18 -10 11 16 23 -3 -27 -21 1 16 8 -7 -45 -3 8 22 2 -37 -14 31 40 -3 -20 -11 8 15 2 -15 -12 37 19 32
6245 32 11 -40 -10 33 16 -6 -25 -31 20 22 -2 -44 -56 -3 10 9 -33 -28 -5 19 11 -17 -31 -12 9 31 -12 -34 -29 27 19 3 -26 0
$$ packed form
6002Grk7L7K9k0n9RK5J3j2K0m3QJ8K0k0l9K0M1qj4omM2J4j4m4mK5L2j9j9Jj3L8
6037B5Kom3jL4N2l0j3o1L7L0Jj4k8LL1K6n0J2l9L7J7k3j5NRJ4%k5rPL6J9m0j7
6072a7JL7J4j9k2j8J6L8Ll5m4N5KNm0lORL1k2k5NK2K7pn7J8KJ2K6m3j7J7P2k0
6107B9l9k4L5J2J4l8Qj1J0L6pn8RmK2J6j1k6K4K9ol2qrM7NJ6o1Mj0M8lm9j3lO0
6143A2J6k3n1L7J8J2j5k1k4L4K2J6j8l1J0M3rj0n5J5O7m4mj9K3LJMj9k2J6L4N
6176B3l7l6L5K3J1j6l8k2M5K9jk6k4L3K1J3k9j8j0M8Jnl6J0OL1j6%l1K6L8l6n0
6209c8MK4M3m5oQK1NPk6k4OK2J5qj5l8M2J1J4k0l9K3M5Rm3j7RJ9Pj3j7LM9j8J3
6245C2k1n1L0M3j7k2j9oN1Kk4m2j2N3J3jm2NK3K4qk8j4J9K1K2m3k2NN6qj6k9K6
$$ plain form
6279 0 1 30 8 -37 -12 -1 36 16 21 -27 -4 33 66 5 -34 -28 22 27 -7 -31 -50 -2 25 -3 -8 -39 -12 18 10 3 -20 -23 22 22 3
6314 3 -40 -15 26 14 5 -31 -24 -8 47 21 10 -45 -1 -2 27 9 -26 -11 6 32 32 -26 -20 -27 3 35 -5 -18 -11 5 26 -31 -21 -34
6348 -34 -7 23 1 -44 -9 3 52 28 -21 -28 -12 39 31 -5 -16 -1 38 22 13 -4 -12 31 22 35 -27 -24 14 36 -6 -25 -34 4 22 26
6382 26 -3 -35 -31 19 27 -1 -40 -21 20 21 27 -15 -55 -32 31 -7 -11 -29 5 2 10 -24 -8 -16 -2 22 20 1 -8 25 34 53 -17 -12 9 15 20
6419 20 -6 -55 -22 12 18 11 -20 -33 -7 8 35 -43 -34 5 24 22 -38 -37 -44 -4 11 6 -17 -13 20 33 29 -41 -15 14 40 20 4 -11 13
6454 13 10 47 9 -16 5 -8 52 30 -29 -12 -15 24 25 -22 -27 -30 16 12 -20 -42 3 -10 18 10 -13 -41 10 31 18 -18 -36 -18 31 15
6488 15 18 -36 -27 -8 11 16 -9 -26 13 26 17 -23 -7 18 28 21 -51 -40 -22 8 2 -22 -66 -53 8 17 8 -24 -26 -11 13 22 -17 -31 -23 6
6524 6 28 -9 -21 -2 18 56 19 -30 8 12 48 16 -14 -23 -5 32 15 -33 -3 -22 24 9 -3 -36 1 12 44 -19 -29 -36 -6 32
$$ packed form
6279@JK9k2m5K5J1L7k0Nm8K3L7L3o1l9ON0Nl4k4j9M8K7k8nl1K7L0qpk3lM5%j9
6314Cm3K5M1j2rl6PJ6N5k6j1n5M4jK9j8l5J5J7K6%n8OpL0L2m0j3PJ6K1n7J0j3
6348c4K7L0k2m5L5J2M9k4m9pJ6N1ql6j1J5L9j6rj7qM3rJ3o2LL8K2m2j9rL8J8M
6382B6k9l2MN0Qk8l9J9M1JOm2m0K3O3l8mj8L4lQl4J6qJ4K4kj9rL3RJ9p0NK1ON
6419B0k6m9L3L4Opl1j3K6J5K7p8RL9J9ko0JpM0J5nk3ML3J3mp0K6K9K6k0j6j5K4
6454A3lL7l8k5K1j3O0k2n9J7lL9Jm7nlM6ml2k2M5j3K8qk3k8N1K1j3l6j8J8M9j6
6488A5Ln4RJ9J9Nk5j7L9J3rm0J6K5J0pp2J1J8L0ok4m4J3O1Rrl2kJ5K4Rl9j4QK9
6524FK2l7j2J9K0L8l7m9L8ML6l2l0rJ8L7j7m8L0j9M6j5j2l3L7J1L2o3j0pL0L8
$$ plain form
6556 32 -18 -18 -21 -31 21 12 -6 -43 -25 -7 26 4 -8 -11 -2 29 28 -5 -22 10 24 21 -5 -18 -18 2 26 -5 -47 -26 18 47 11 -18
6590 -18 -22 13 38 6 -35 -21 -18 1 43 -19 -29 -3 2 -17 -2 -32 -23 5 17 12 -2 -32 16 11 49 10 -12 5 13 17 -9 -15 -20 27 38
6625 38 17 -20 -34 -14 -4 -2 -14 -17 -25 23 4 -21 -2 -36 32 29 -10 -18 -16 2 22 -26 -30 -26 -18 12 10 2 -30 15 32 18 0 -6 16 21 34
6662 34 -22 -32 14 -2 33 22 -26 2 -6 29 32 6 -27 -28 -22 7 -35 -28 -11 -4 25 23 -7 -33 6 31 24 -18 -30 -15 23 18 -3 -37 18
6697 18 -13 0 3 18 -5 6 13 20 6 -2 -13 -6 26 -3 -17 -17 21 22 -1 -29 -44 2 6 13 -38 -28 9 -20 -9 -28 -25 -13 15 14 0 -20
6733 -20 -5 2 14 9 10 14 0 18 41 20 -37 9 36 37 -3 -18 -7 27 23 7 -26 -34 16 -6 3 -15 -19 4 27 20 -9 -32 -17 21 22 12
6769 12 -27 -36 12 6 2 2 -27 18 10 25 -14 -38 5 20 0 18 -30 -10 34 31 1 2 -24 7 33 11 -11 -5 -15 18 3 3 -5 -26 16
6804 16 1 -8 -25 -12 -10 38 1 -27 -43 7 15 25 30 -10 -24 -15 31 7 -26 -3 27 25 11 -6 -10 14 8 19 -20 11 -2 8 3 2 -5 7
$$ packed form
6556C2n0%lj0N2rj8l7J8J8L3k2j2lRL1jl3j7L2J4lk6j3%K0K4l1m2K1M4K9l6k9
6590a8mL5K5l2m1J4LJ9M2o2j0K6Nj9J5l0RK8J2nj4l0M8nL8l9k2J7QMk6onM7J1
6625C8k1l7j4K0J0Kj2lqM8j9k5J9l4O8ll9qKJ8K0m8mMQL0kql2M5J7j4j8oK2NJ3
6662C4n6j0M6j6L5j1m8K8qL5Lk6l3jOK9m2PJ7PK9kl0k6L9K5pm2j2J5L8nk1l4N5
6697A8l1J3LJ5k3J1PPj4qj1PL2k9j4%L8Jk3k8j5M6MPn1J0L7k9J1j9LJ2K8jj4k0
6733b0J5PJ2nJMj4J8K3k1n7M6K7Jm0j5J1L4mj6l3qN0k2Rj8mK3K3pk9k3J5L8Jj0
6769A2l9rM8om%k9M5qJ5l9k4M3J5k0J8m8K0M4ll0Jk6L1K6k2k2Oj0L3j5%qk1M2
6804A6j5rj7J3KM8l7k8j6N0QJ0Nm0j4RM6k4l3K3L0kj4j7mK4oJ1l9L1j3J0njpJ2
$$ plain form
6840 7 9 44 0 -14 -14 -20 9 -7 -25 -31 -3 0 -11 -8 -37 -4 22 39 10 -13 20 -12 21 4 -3 -24 -6 13 -6 -11 3 -4 11 37 -28
6875 -28 -19 -5 19 12 2 0 3 2 1 -13 -29 -59 20 -10 22 41 -26 -7 7 17 -4 -17 -17 0 16 10 5 -33 -14 23 27 -33 -4 18 16 0
6911 0 27 12 -20 32 12 6 -23 -33 -12 36 -12 -18 -24 -24 13 0 -16 -28 -29 -13 4 -40 -19 -27 -18 -2 -15 -17 -18 6 39 35 -6 -13 6 12 23
6948 23 -6 2 -34 11 18 41 6 -16 16 32 19 -9 -17 -16 2 16 -10 13 4 -19 32 6 -9 -8 15 -4 1 -10 -8 3 4 38 -43 -7 -7
6983 -7 -13 -1 8 15 -2 8 37 15 7 6 27 -4 21 10 -12 -7 27 6 -11 -20 6 5 41 -4 -34 -32 10 -4 0 -27 -22 -19 19 -14 -18 -17 -2 5
7021 5 -9 16 -23 -18 32 25 14 17 13 29 19 0 -12 -3 -9 -3 9 -11 -26 -12 2 -11 -5 -16 -20 -8 9 16 -14 -40 -40 9 -9 -20 -31 -26 10
7058 10 23 10 -11 -32 8 8 27 -6 7 16 24 20 19 -8 -15 -12 7 30 -18 4 21 25 -3 3 -26 20 5 5 -31 23 4 18 -6 -30 0
7093 0 5 9 -7 -10 -16 -1 -14 25 -1 16 -32 -2 37 6 10 7 -14 -1 22 23 -24 4 11 22 14 -2 -12 17 24 27 11 -8 6 18 16 10 12 7
$$ packed form
6840GKL5m4j4%oK9j6j8oK8Lj1Lk9L3K6J7k9k3L3l2L3j7pk1J8J9j9nJ4pJ5K6o5
6875b8RJ4K4pj0kLjjj4j6l0P9l0L2J9o7J9J4J0k1j3%J7J6onl8J9L7Mo0K9K2kj6
6911@K7j5l2N2k0ok9j0K1M8m8oo%L7j3j6j2jJ6J7m4K1qRJ6j3kjK4L3mm1pJ9OJ1
6948B3k9Ql6M5PK3l5k2L2J6j3k8qJJ8J4k6K3rk3N1k6j5JK3j9Nj1KJ1JL4q1L6%
6983goJ2RPj7J0K9k2qjK1l1K5j1k2NL4k1j7rK6jL6m5l0KM2j4Mk7NLL8l3mJJ5P
7021Ej4K5l9NN0pj1LmJ6j0j9j2RoOJ2k0j5J4J4j3Oj1mJ2J7Pl0k6%M9j8j1j1NL6
7058A0J3j3k1k1M0%J9l3J3RQmjk7pLJ9K3m8K2J7Mk8Ok9M6j5%l6N4j9J4k4k4L0
7093@NMj6loJ5j3L9k6J7m8L0L9l1Mlk1J3K3Jm7K8PJ1qj6j0K9PLj6j9J4J2koKn
$$ plain form
7131 7 4 -7 -4 -14 -30 4 -15 -21 -8 -18 -13 -16 23 -38 -17 -12 4 -9 15 -20 -4 2 26 28 11 3 18 8 9 3 26 11 20 8 -15 -21 -16 -28
7169 -28 14 -4 16 0 15 -5 35 -7 -2 18 -18 19 -19 -15 -19 23 -37 -13 -4 -3 21 -1 10 -1 2 1 18 1 2 18 5 -1 18 15 -24
7204 -24 8 15 -7 8 7 1 -11 4 -9 -9 -8 -6 -7 -7 -17 -34 -11 8 2 3 -30 0 -5 19 0 -19 -6 -17 0 4 -34 -20 9 4 9 -5 17
7241 17 17 21 -7 -7 23 -1 3 -17 -16 -17 -1 13 7 -7 -6 14 -18 13 5 -38 -27 -25 -11 24 19 -24 -28 5 2 15 0 17 2 13 2 26 -12
7278 -12 10 12 15 2 15 -3 -4 1 22 9 0 -20 15 19 -14 -19 -19 -17 -1 2 0 12 21 41 18 7 -13 -10 6 -28 -6 -39 -11 -17 -9 -3 2 34 7
7317 7 6 -13 10 4 8 0 20 -20 1 3 33 22 30 -38 24 8 -3 3 -18 -18 -20 -9 1 -15 -10 29 -17 3 -17 -9 -17 -11 18 4 7 -6 3 0 17
7356 17 -4 3 -2 2 -7 7 -7 20 30 25 10 13 15 6 4 20 22 0 19 27 1 -17 10 -40 12 16 17 -9 -5 0 -31 -30 -22 -29 4 -18 -7 18 1
7395 1 9 34 3 3 3 21 0 -4 -12 11 -22 17 -4 5 1 -9 8 35 29 19 -4 -14 26 -5 -7 -13 -5 1 0 -1 -36 2 -23 -2 1 -14 -20 -30 2
$$ packed form
7131Glj1Lj0j6L4j9oJ3j0NlL9o1K1NJ6j3K4l5J6OK4Kj7qJ5j0JoK3j5Rj2k3oNj2
7169b8M2j8K0j6J5k0M0m2NK0l6L7l8MmM2o0K4RJK4k2J1j1LjJ7j7JJ6j3oJ9ll9
7204b4L2Pk2J5joj2J5j3%JKj%j0j7K3J9oJl3L0nK4j9j9J3j1J7Ml8J4K9nNj4K2
7241A7%Mk8%L0k4Mk0JjJ6J4oj4JK0l2L1qm3J1KJ4L5nm3mL3lJ3j5J7j5J1j1K4l8
7278a2K2KLj3J3j8jNK1j3rk0L5Ml3n%KJ6LkJ2RK0k3j1k0LJ6l4K2l3K8oQONL2k7
7317Gjj9K3oMqK0m0K1KL0j1Qo8O2j6j1Ok1%kJ1J0j6NL9m6K0k0QqOK9j4Lj3RlJ7
7356A7k1PnMrJ4j4K7J0nj5LKrkJ6Kk2J9Qk6j8K7n0N2MJk6MNl1JQpL3k2J1K5j7
7395AQK5l1%%J8k1mqK3l3L9k1Rmj0J7K7oj0k3j0M0l1koQOjjl5L8k5K1Lj5oj0L2
$$ plain form
7434 2 10 -7 12 1 -19 -1 -3 -1 14 9 5 8 -11 2 27 22 15 -4 3 12 21 -8 16 13 17 25 7 15 -10 21 25 10 8 -33 -1 -17 -12 -21 -33 -24 -10
7475 -10 1 6 -22 3 -5 -5 -11 -12 17 7 9 3 -2 9 7 1 8 1 -3 13 -1 -22 12 -16 -11 -3 14 17 -5 18 4 -11 -15 23 -28 -3 7 -15 -22
7514 -22 3 5 -9 -9 -11 27 -9 -21 11 13 2 -15 -6 22 2 10 -25 -6 -2 0 30 24 -5 0 -3 2 -30 29 21 -15 -10 -15 1 -4 -2 -22 0 -8 -19
7553 -19 2 -15 23 -6 -14 6 7 -26 -4 -4 8 -8 -7 -13 -16 4 15 -7 11 -23 -4 19 -4 -1 9 -12 -18 1 -4 5 9 18 13 11 7 -31 -3 -1
7591 -1 29 -35 -7 -19 11 -10 -30 -35 -38 -30 -23 -33 -32 8 -9 -33 -15 9 -25 10 -3 27 -1 31 19 -13 10 3 -3 -11 32 -2 27 -12 -12
7626 -12 5 7 -7 -26 4 -7 0 13 15 1 -14 23 15 -15 -13 0 -11 -15 9 -51 6 40 2 8 -9 3 -1 16 -4 20 11 -5 32 16 42
7661 42 3 29 28 18 11 20 6 -14 25 1 6 -1 8 19 -19 14 -18 15 1 3 22 -18 13 1 0 -31 -12 -3 -14 26 17 -11 -20 -13 16 2
7697 2 17 7 6 26 3 -8 12 -4 5 4 50 -6 -3 -4 16 27 -14 12 5 19 1 -12 -2 5 -4 3 -19 -3 15 -7 12 1 27 -2 -31
$$ packed form
7434BQj7J9j1k0J8kKJ5nmLj9J3K5npj9PRRk9K4lMQj8Qk5L1Mj5km1L2j6Nrj2RJ4
7475a0J1Nk8K5q%ojK9j0KonJ1koPpmJ6j4k1L4k8NQJ7Lk2K3j4j5mL8n1K5J0k2p
7514b2K5Kj4%kL8l6j2L2Kj1j7RK8k0Ql5J9MKL0ok9NlNl2N9ql6NnJ6nKk0K2qj1
7553a9K1j7L8k9qK0Jl3K2%J2j6JolK0J1k2J8l4J9K3k3LJ0k1oJ9nRMRnkml8K8K
7591aL0o4K8j2L0k1k0nlQPj0JM0j7k4J8K4l4L5j3L0k8L2j2l2K3poqM3l4K9l9%
7626a2J7Kj4j9L0j1PJ3Kj4j5L7ql0KJ3j1mK4o0N7L4l8Oj7J2mJ7k0K4rj6L7j6K6
7661D2l9K6jj0pRj4k0L9k4NpRJ1l8L3l2L3j4KJ9m0L1j2jl1J9Rj1M0rk8rPK9j4
7697BJ5j0jK0k3j1K0j6RjM6n6LjK0J1m1K6pJ4j8j3J0PrPk2J6J8k2J9j1K6k9k9
$$ plain form
7732 -31 23 -4 29 -2 4 10 -4 7 -15 5 7 -2 0 28 31 8 19 7 17 32 -21 -11 13 -12 -5 20 -27 -29 -9 -21 -17 -9 5 -9 -5 4
7768 4 -23 -21 -16 0 8 28 -14 15 -11 -17 -1 30 10 -10 19 -28 -2 36 15 8 5 31 45 -11 24 -5 -3 38 7 -12 -20 -20 13 1 -17
7803 -17 -11 -20 -14 2 -16 13 19 -10 9 -26 -1 11 11 -6 8 1 15 1 14 14 11 29 0 38 -9 12 17 1 -4 15 14 24 -12 -21 6 18
7839 18 -6 -8 21 6 -1 4 3 -7 -22 4 -14 -8 7 -8 25 7 -12 -7 -11 10 19 15 7 -3 7 -8 23 18 -1 29 12 -3 15 34 19 37
7875 37 18 30 3 16 29 13 38 -7 8 -6 4 6 -29 0 -25 8 11 -12 5 -13 8 13 5 2 0 -2 0 14 15 -17 22 10 11 0 21
7910 21 20 33 19 17 -36 -7 -3 16 -9 3 23 0 -11 14 10 -27 -1 17 -6 3 0 15 -21 -17 -5 -22 4 0 16 -1 20 21 6 38 -3
7945 -3 1 -17 -4 5 25 -13 -8 -5 20 -6 -12 -27 12 -12 9 -17 -25 -19 -11 11 11 2 3 -4 -18 17 -26 8 -4 7 -2 23 -3 12 -9 -9 -12 9
7983 9 10 13 -27 12 6 12 -2 -22 22 -16 -5 -5 41 9 -5 20 19 2 20 9 -13 -15 -2 11 -14 -3 -5 -25 -15 -28 -25 11 -8 -1 -23 -6
$$ packed form
7732c1N4k7L3l1OOj4J1k2K0KrKK8Lk3J1j2J0J5n3J0K4k5PK5m7kK0j2MQJ4j4MR
7768Dk7KNJ6QK0m2K9k6oJ6L1k0k0K9m7K6L8k1plK6J4n6L5k9KM1l1j9q%L3j2j8
7803a7OrOJ6j8K9Ok9J9l5K5J2%j7J4pJ4j4J3%lJ8k9L8m7K1Nj6nJ9jJ0l6rK7J2
7839A8k4kK9j5pNjj0j5K6j8OJ5j5L3j8j9NmK1Rmqj0J0j5L1nj9L0j7j5J8J9j5J8
7875C7j9J2k7J3J3j6K5m5J5j4J0Kl5K9k5L3Lk3J7j8K1NqlkkKJ4Jl2L9j2Jj1K1
7910B1jJ3j4kn3K9MJ9k5J2K0k3j1K5ml7K6J8k3RlJ5l6MJ2j7K6mJ6j7K1Jj5L2m1
7945cMj8J3RK0l8NLK5k6oj5L9k4K1k6qOQK2%rJpj4L5m3L4j2J1rK5k6J5k1%lK1
7983IJLm0L9oOj4k0M4l8J1%M6l2j4K5jj7J8j1k2kJ3J3k5J1kk0J0j3LL6j9Pk2J7
$$ plain form
8019 -6 1 -22 -4 -14 24 -5 -7 28 -34 8 9 7 9 12 22 3 9 4 16 -5 9 -2 23 5 -26 12 -19 11 6 -22 -3 7 -18 -14 -16 -1
8055 -1 -20 3 -11 12 11 -16 -17 1 -38 11 -21 15 19 11 17 21 34 -3 -9 24 -5 19 32 -25 20 -11 -35 -4 12 -3 -7 12 15 10 -21 -15
8091 -15 -7 -2 11 4 -29 -11 1 -14 -20 24 -12 1 3 -1 -6 -19 17 -19 11 4 24 14 6 23 4 14 1 6 2 20 -16 2 0 -24 20 18 -2
8128 -2 15 -1 -17 -7 23 0 -2 1 -11 6 -14 -6 1 -17 2 9 -16 -12 13 8 -5 -9 -14 -21 18 -19 1 -4 15 5 4 2 22 7 -32 0 -13
8165 -13 0 33 7 14 14 4 -12 -7 11 9 9 -9 -31 5 -24 -20 2 12 21 0 -18 -27 -12 -2 -6 -7
$$ packed form
8019fPk3J8j0L8k9kL5o2M2JkKLJ0j9OnJ2k1J4j1K5j8l1L8l1L0nk8J9J0k5MkJ5
8055aj9K3j4K3jk7jJ8l9M9l2L6MqOMJ3l7oL3k9K4J3n7M5l1k4L1J6j5mJ9Lnl1O
8091a5QNJ3pl3J8J2j5oM4l6J3Kmnj3L6l6L0pK0j0qJ7j9J0j3NmJ8l6J8kk4M4kk0
8128bJ7j6j6J0L0k3kLj2J7k0QPj8J9Pk5MK5nj3mnpL9l7K0nJ9j0jkK0j5l9L2j3
8165a3J3L3k6P%j0j6NJ8k%j8k2L6k9MK2J0Rk1j8rJ5J0mj
8191g
$$ Imaginary data points
##PAGE= N=2
##DATA TABLE= (X++(I..I)), XYDATA
$$ plain form
0 0 0 0 0 0 0 0 0 0 0 0 -8 8 -8 8 -8 16 -16 24 -24 32 -40 48 -56 64 -79 89 -104 120 -140 160 -184 208 -240
33 -240 268 -304 342 -384 428 -482 536 -594 663 -736 813 -899 994 -1095 1209 -1331 1466
50 1466 -1614 1781 -1961 2166 -2392 2651 -2943 3280 -3674 4135 -4695 5384 -6251 7393 -8964
65 -8964 11273 -15007 22090 -40303 189239 343196 -120367 -357983 -186720 292243 368065
76 368065 30325 -330191 -272662 151910 396186 135633 -241495 -332193 19604 358586
86 358586 237655 -150039 -334124 -105363 283020 301803 -36788 -311359 -200231 181789
96 181789 334640 64286 -256152 -259525 71548 319658 160855 -179980 -287291 -34997
106 -34997 271908 231203 -86973 -284094 -126792 198212 272338 6345 -251260 -191498 109937
$$ packed form
0@%%%%%%%%%%qJ6j6J6j6K4l2M0m8N6p2Q8j04J20j43J68j93K24k60L00l44L92m48
33b40N08n72O46p26Q12r10J018j130J257j399J549j712J893k089K304k540K797
50A466l080L395l742M127m558N043n594O223o954P809q830J0079j1635J3644j6357
65h964K0237k6280L7097o2393K29542J53957m63563k37616J71263M78963P5822
76C68065l37740l60516N7529M24572K44276k60553l77128r0698L51797L38982
86C58586j20931l87694j84085K28761L88383J8783l38591k74571J11128L82020
96A81789J52851k70354l20438l373L31073K48110j58803l40835j07311K52294
106c4997L06905m0705l18176j97121J57302L25004P4126k65993k57605N9762L01435
$$ plain form
117 109937 272788 94977 -189972 -233047 17346 246597 164336 -116440 -244717 -64616
127 -64616 195309 207027 -36710 -228933 -131227 129037 221683 39955 -188099 -180218 54132
138 54132 215094 105526 -134146 -205300 -16768 185473 150992 -68434 -203537 -82462
148 -82462 137905 177972 -1363 -179955 -133899 79786 184626 58471 -139618 -164746 18736
159 18736 169886 104536 -86427 -172279 -41785 137017 137787 -29478 -161739 -92152 93322
170 93322 153442 23360 -133845 -126129 41472 150354 69436 -93158 -142761 -12896 130885
181 130885 106243 -46851 -143107 -60885 98502 127949 -402 -125881 -96679 54554 132772
192 132772 44285 -95449 -119067 6621 122494 81458 -57857 -125684 -37231 97938 105742
$$ packed form
117A09937J62851j77811k84949m3075K50393K29251q2261k80776j28277J80101
127f4616K59925J1718k43737j92223R7706K60264R2646j81728k28054P881K34350
138E4132J60962j09568k39672p1154J88532K02241l4481k19426j35103J21075
148h2462K20367M0067j79335j78592M6056K13685J04840j26155j98089k5128J83482
159A8736J51150o5350j90963q5852J30494J78802P70j67265j32261O9587J85474
170I3322O0120j30082j57205P716J67601J08882q0918j62594m9603J29865J43781
181A30885k4642j53094r6256Q2222J59387K9447j28351j25479K9202J51233P8218
192A32772q8487j39734k3618J25688J15873m1036j39315o7827Q8453J35169P804
$$ plain form
203 105742 -16388 -115777 -73009 61299 116191 25967 -93630 -98616 19862 112844 62529
214 62529 -62906 -109882 -20592 94511 89017 -25369 -106463 -56749 64265 103953 14092
225 14092 -91193 -84066 28403 105238 49136 -65859 -98270 -8977 91636 76481 -32301
236 -32301 -99435 -44303 66705 93903 3785 -89124 -71731 35086 97948 37233 -67778
247 -67778 -87855 29 88205 65392 -38061 -92917 -33816 67947 84671 -5123 -86739 -60897
259 -60897 40170 91305 27196 -69286 -78924 7995 85564 55668 -43808 -87341 -23436 69788
271 69788 75754 -14391 -84898 -49722 46006 84609 16174 -71679 -69304 17412 82721 44070
283 44070 -50556 -80601 -11364 71262 64882 -24117 -81568 -37326 51384 76291 4924 -72438
$$ packed form
203A05742j22130r9389M2768J34308N4892r0224j19597m986J18478R2982n0315
214F2529j25435m6976Q9290J15103n494j14386q1094M9714J21014L9688q9861
225A4092j05285P127J12469P6835n6102j14995l2411Q9293J00613j5155j08782
236c2301o7134N5132J11008K7198r0118r2909J7393J06817O2862o0715j05011
247f7778k0077Q7884Q8176k2813j03453n4856N9101J01763J6724q9794q1616K5842
259f0897J01067N1135o4109r6482r638Q6919P7569k9896r9476m3533O3905R3224
271F9788N966r0145p0507L5176R5728L8603o8435q7853K375Q6716O5309l8651
283D4070r4626l0045O9237Q2626o380q8999n7451M4242Q8710K4907p1367p7362
$$ plain form
295 -72438 -58530 26312 78296 32199 -55363 -72329 4 70955 53535 -32064 -76671 -25356
307 -25356 55351 67317 -5398 -71765 -47443 34462 72836 20345 -58717 -63103 10851 69512
319 69512 41834 -38835 -70474 -13603 58263 57448 -15073 -69416 -35924 41233 65845 8629
331 8629 -60131 -52894 20256 66140 29864 -43830 -62888 -2773 59061 46849 -23456 -65173
343 -65173 -24616 45987 57744 -1922 -59572 -42434 27877 61590 18790 -47096 -54571 6894
355 6894 58612 36629 -30265 -59865 -13864 49171 49412 -11221 -57698 -31966 34180 56174 8392
368 8392 -49087 -45603 15622 56584 26265 -35648 -53220 -3742 50351 40398 -18943 -54144 -21803
381 -21803 38234 49443 -757 -48975 -36438 22190 52612 16784 -38840 -45954 4416 49311
$$ packed form
295g2438J3908Q4842N1984m6097q7562j6966P2333P0951j7420q5599m4607N1315
307b5356Q0707J1966p2715o6367K4322Q1905L8374n2491p9062m386P3954N8661
319F9512k7678q0669l1639N6871P1866q15p2521n4343L3492P7157K4612n7216
331H629o8760P237P3150M5884l6276p3694j9058O0115O1834j2212p0305m1717
343f5173M0557P0603J1757n9666n7650J7138P0311L3713m2800o5886p475O1465
355F894N1718k1983o6894k9600M6001O3035K41o0633m6477K5732O6146K1994m7782
368H392n7479L484O1225M0962l0319o1913j7572M9478N4093r953n9341l5201L2341
381b1803O0037J1209n0200m8218J2537N8628L0422l5828n5624p114N0370M4895
$$ plain form
393 49311 31639 -24718 -49648 -12912 40213 42418 -8330 -47764 -27777 27058 47852 8300
405 8300 -40672 -38496 11470 47196 23398 -29112 -44428 -4673 40932 35245 -14614 -45202 -19295
418 -19295 30341 42219 979 -40723 -30882 16861 43607 15877 -31549 -38509 2161 39851
430 39851 28143 -19004 -41507 -11868 31739 36167 -4781 -39434 -23881 20515 39317 9316
442 9316 -32703 -32806 7680 37817 21394 -22339 -37555 -5325 32233 30016 -9875 -37558 -17178
455 -17178 23440 34527 3058 -32991 -26699 12627 35009 14551 -24690 -32659 910 31721
467 31721 23384 -13989 -34348 -10596 25292 29104 -2510 -31827 -20381 16477 31373 8095
479 8095 -25768 -27311 6158 30377 16982 -17122 -30574 -4617 26220 23612 -7440 -29980 -14410
$$ packed form
393D9311j7672n6357k4930L6736N3125K205n0748l9434J9987N4835K0794l9552
405H300m8972K176M9966L5726k3798n2510j5316L9755M5605n687m9859l0588K5907
418a9295M9636J1878m1240m1702R841M7743K6746k7730m7426o960M0670L7690
430C9851j1708m7147k2503K9639M3607M428m0948l4653J5553M4396J8802l0001
442I316m2019j03M0486L0137j6423m3733j5216L2230L7558k217l9891k7683K0380
455a7178M0618J1087l1469l6049O292L9326K2382k0458l9241p969L3569L0811
467C1721q337l7373k0359K3752L5888L812l1614k9317J1446L6858J4896k3278
479H095l3863j543L3469K4219j3395l4104j3452K5957L0837k608l1052k2540J5570
$$ plain form
492 -14410 19394 27567 2160 -25987 -21938 10453 28425 10915 -19458 -26299 524 26192 18203
505 18203 -11449 -27265 -8919 20866 23325 -2775 -25072 -16686 13167 25651 5821 -20386
517 -20386 -21777 4259 24906 13515 -13931 -24005 -4486 21071 19433 -6322 -23515 -11962
529 -11962 14820 22833 1736 -20674 -17530 7285 23275 9397 -15831 -20818 -429 20746 15643
542 15643 -9254 -21753 -7528 15933 19638 -1808 -20293 -13293 9672 20917 5607 -16668
554 -16668 -17339 2879 19549 11881 -11057 -19336 -3723 15997 16227 -4334 -19151 -9568 11064
567 11064 18244 2575 -16579 -14203 5275 17949 8683 -12076 -17067 -719 15752 13131 -6242
580 -6242 -17765 -6466 12033 15701 -54 -16131 -11294 7223 16263 5582 -12513 -14580 1792
$$ packed form
492a4410L3804Q173k5407k8147M049L2391J7972j7510l0373o841K6823K5668p989
505A8203k9652j5816J8346K9785K459k6100k2297Q386K9853J2484j9830k6207
517b0386j391K6036K0647j1391k7446j0074J9519K5557j638k5755j7193J1553
529a1962K6782Q013k1097k2410L144K4815J5990j3878k5228m987K0389K1175n103
542A5643k4897j2499J4225K3461L705k1446j8485P000K2965J1245j5310k2275
554a6668o71K0218J6670p668k2938q279J5613J9720K30k0561j4817R583K0632
567A1064P180j5669j9154K376J9478J2674r266k0759m991J6348J6471k621j9373
580f242j1523J1299J8499L668j5755j6077M837J8517R040j0681j8095k067J6372
$$ plain form
593 1792 15041 10005 -7602 -15865 -3698 12313 12922 -2156 -15013 -8522 8347 14229 3003
606 3003 -12298 -12125 3543 13966 7300 -8340 -13915 -1562 12196 10538 -3789 -13821 -6271
619 -6271 9067 12445 783 -11997 -9876 4964 12959 4875 -9016 -11980 386 11930 8211
632 8211 -5260 -12417 -3992 9509 10548 -1228 -11381 -7546 6018 11593 2654 -9233 -9908 1966
646 1966 11238 6083 -6246 -10965 -2053 9505 8747 -2794 -10721 -5516 6805 10343 779 -9417
660 -9417 -8109 3371 10637 4161 -7214 -9624 -206 9645 7054 -4312 -10076 -3500 7602 9007
674 9007 -1075 -9453 -6226 4744 9833 2262 -7893 -8168 1557 9492 5281 -5533 -9200 -1630
688 -1630 8064 7608 -2583 -9267 -4509 5772 8970 641 -8351 -6844 2988 9247 3731 -6544 -8407
$$ packed form
593A792J3249n036j7607q263J2167J6011O09j5078j2857O491J6869N882j1226
606C003j5301J73J5668J0423o666j5640n575J2353J3758j658j4327j0032P550
619f271J5338L378j1662j2780K121J4840P995q084j3891k964J2366J1544l719
632H211j3471p157Q425J3501J039j1776j0153L835J3564N575q939j1887o75J1874
646A966R272n155j2329m719Q912J1558p58j1541p927N205J2321L538r564j0196
660i417J308J1480P266o476j1375k410R418R851k591j1366n764O576J1102J405
674I007j0082q378L227J0970N089p571j0155k75R725P935m211j0814l667P570
688a630R694m56j0191o684M758J0281L198q329q992J507R832O259n516j0275j863
$$ plain form
703 -8407 27 8472 6287 -3998 -9069 -2890 6814 8090 -1004 -8709 -5462 4473 8899 2062 -7415
718 -7415 -7382 1715 8669 4852 -5258 -8537 -1184 7568 6963 -2532 -8758 -3926 5640 8246 459 -7988
734 -7988 -6206 3205 8601 3275 -6277 -7826 458 8045 5658 -3902 -8542 -2312 6666 7340 -1182
749 -1182 -8313 -4855 4634 8235 1572 -7152 -6804 2151 8251 4075 -5221 -7964 -561 7410 6059
764 6059 -2818 -8211 -3180 5848 7399 -206 -7552 -5392 3663 7962 2320 -6156 -6931 1099 7668
779 7668 4540 -4138 -7674 -1487 6601 6251 -1827 -7575 -3792 4889 7240 558 -6695 -5598 2664
794 2664 7513 2855 -5232 -6741 270 6979 4739 -3304 -7111 -2058 5743 6137 -1137 -6814 -4003
809 -4003 3926 6859 1055 -5870 -5440 1804 6830 3121 -4418 -6284 -327 6090 4761 -2586 -6494
$$ packed form
703h407Q434Q445k185j0285n071O179R704J276r094p705L247R935M426o837r477
718g415L3R097O954l817j0110l279P353Q752o05r495o226M832R566K606p787q447
734g988J782R411N396n326r552j549Q284P587k387r560m640O230Q978O74q522
749a182p131L458R489L601o663q724L48Q955O100m176r296k743P403P971j351
764F059q877n393N031R028J551p605p346K160R055M299n642q476p75Q030O569
779G668l128q678l536O187Q088l50q078n748L783Q681K351o682p253J097Q262
794B664M849m658q087j509P011O709k240q043l807N053P801L94p274n677K811
809d003P929K933n804o925M30P244N026l709p539j866N957O417j329p347l908
$$ plain form
824 -6494 -2301 4785 5862 -563 -6095 -3955 3058 6303 1454 -5124 -5135 1243 6051 3249 -3686 -5755
840 -5755 -618 5278 4587 -1967 -5884 -2354 4038 5384 -114 -5444 -3744 2522 5592 1652 -4429
855 -4429 -4793 865 5333 3142 -3042 -5285 -846 4527 4223 -1421 -5256 -2335 3408 4820 235 -4671
871 -4671 -3587 2002 4967 1757 -3713 -4415 450 4650 2964 -2398 -4742 -1002 3912 3864 -960 -4602
887 -4602 -2349 2832 4343 437 -3969 -3371 1500 4381 1725 -3047 -3998 114 4025 2773 -1879 -4190
903 -4190 -1194 3290 3482 -642 -3927 -2320 2248 3858 622 -3322 -3105 1037 3831 1728 -2444 -3502
919 -3502 -200 3361 2581 -1395 -3542 -1292 2627 3167 -288 -3282 -2143 1668 3363 756 -2705 -2715
935 -2715 620 3225 1704 -1964 -3026 -375 2742 2370 -1058 -3046 -1238 2073 2775 -111 -2765 -1903
$$ packed form
824f494M193P086J077o425n532K140P013L245m849o578j1O378M808k802o935k069
840e755N137N896o91o554l917L530O392J346n498n330J700O266L070l940o081
855d429l64N658M468k191o184k243M439N373l04n644l835K921N743J412m585m906
871d671J084N589K965l210n470p02M865M200j686n362k344L740M914m8m824l642
887d602K253N181J511l906m406N98M871K881k656m772r51M112L911j252m652k311
903d190K996M484J92m124l285J607M568J610l236l944K17M142K794k103m172j058
919c502L302L561p80l976k147K250L919N40l455k994J139L811J695k607l461j0
935b715L335K605j521l668j062K651L117l72l428j988J808L311P02k886k654Q62
$$ plain form
951 -1903 1284 2857 805 -2260 -2385 430 2703 1576 -1568 -2611 -358 2304 2114 -794 -2670 -1132
967 -1132 1741 2439 95 -2413 -1766 1058 2497 816 -1942 -2199 319 2374 1458 -1300 -2421 -439
983 -439 2048 1948 -590 -2397 -1144 1546 2223 189 -2149 -1722 876 2309 854 -1698 -2136 139
999 139 2175 1484 -1071 -2309 -627 1887 1958 -328 -2251 -1294 1319 2208 384 -1920 -1841 620 2282
1016 2282 1069 -1439 -2209 -160 2064 1685 -808 -2311 -921 1653 2067 -60 -2145 -1585 1005 2301
1032 2301 679 -1745 -2042 235 2262 1357 -1157 -2266 -546 1904 1941 -439 -2228 -1226 1320 2265
1048 2265 330 -1988 -1827 633 2357 1063 -1509 -2170 -161 2100 1704 -826 -2271 -912 1648 2144
1064 2144 -101 -2162 -1542 1002 2342 673 -1798 -1999 252 2273 1399 -1215 -2259 -497 1910 1939
$$ packed form
951a903L187J573k052l065j25K815K273j127l144j043K253K662j90k908j876J538
967a132K873O98k344k508O47K824J439j681k758k57K518K055r16k758j121J982
983d39K487j00k538j807J253K690O77k034k338M27K598J433j455k552m38K275
999A39K036o91k555j238J682K514P1k286j923R57K613Q89j824k304P9K461J662
1016B282j213k508p70K049K224l79k493j503J390K574M14k127k085N60K590J296
1032B301j622k424k97K277K027r05k514j109J720K450L7k380j789J002K546R45
1048B265j935k318J61K460J724j294k572o61K009K261l96k530j445J359K560M96
1064B144k245k061O20K544J340j669k471k01K251K021q74k614j044J762K407K9
$$ plain form
1080 1939 -545 -2265 -1160 1354 2257 254 -2059 -1733 697 2327 1029 -1631 -2121 -27 2144 1670
1096 1670 -985 -2325 -734 1692 2095 -212 -2276 -1369 1163 2289 606 -1941 -1931 493 2253 1262
1112 1262 -1419 -2263 -231 2003 1802 -677 -2350 -956 1599 2176 46 -2191 -1609 999 2325 821
1128 821 -1759 -2114 309 2241 1475 -1142 -2398 -475 1972 1935 -450 -2406 -1293 1485 2289 295
1144 295 -2132 -1928 844 2426 1036 -1610 -2342 0 2273 1642 -978 -2456 -839 1923 2140 -220
1160 -220 -2345 -1597 1291 2459 557 -1992 -2151 464 2519 1304 -1429 -2470 -421 2259 1967 -726
1176 -726 -2469 -1214 1700 2477 103 -2282 -1921 949 2657 923 -1852 -2368 62 2498 1677 -1252
1192 -1252 -2562 -815 2073 2341 -413 -2538 -1585 1370 2679 511 -2227 -2157 543 2680 1386 -1635
$$ packed form
1080A939k484j720J105K514R03k003k313L26K430J630j298k660m90K094K171m74
1096A670k655j340J591K426M03k307k064R07K532J126j683k547J0K424J760r91
1112A262k681q44K032K234k01k479j673J394K555N77k130k237N82K608J326j504
1128H21k580l55K423J932p66k617j256J923K447l7k385j956J113K778Q04j994
1144B95k427K04K772J582j390k646p32K342K273o31k620j478J617K762K17k360
1160b20k125P48K888J168j902k549j59K615K055j215k733j041K049K680k92k693
1176g26j743J255K914P77k374k385L61K870J708j734k775n16K430K436q21k929
1192a252j310J747K888K68k754k125R53K955J309k168k738P0K700K137j294l021
$$ plain form
1208 -1635 -2517 -388 2341 2145 -830 -2650 -1201 1715 2613 123 -2480 -1946 956 2739 1110 -2013
1224 -2013 -2434 116 2559 1895 -1228 -2718 -796 2072 2463 -304 -2702 -1616 1374 2722 671 -2317
1240 -2317 -2261 565 2684 1537 -1644 -2667 -311 2340 2200 -742 -2787 -1225 1799 2595 219 -2534
1256 -2534 -1989 1057 2678 1089 -1987 -2557 149 2540 1862 -1200 -2813 -762 2153 2389 -298 -2720
1272 -2720 -1605 1544 2683 570 -2312 -2308 709 2687 1364 -1664 -2701 -237 2467 2003 -825 -2738
1288 -2738 -1153 1991 2469 1 -2497 -1917 1215 2715 848 -2016 -2440 299 2685 1601 -1317 -2695
1304 -2695 -627 2334 2216 -584 -2680 -1492 1690 2646 295 -2354 -2142 863 2809 1084 -1896 -2509
1320 -2509 -61 2621 1845 -1194 -2684 -923 2097 2426 -386 -2593 -1642 1426 2754 515 -2297 -2197
$$ packed form
1208a635q82K129K729j96k975j820J449K916Q98k490k603N34K902J783j629l123
1224b013m21K550K443o64l123j490J922K868L91k767k398J086K990J348k051k988
1240b317N6K826K119j147l181j023K356K651j40k942k045J562L024P96k376k753
1256b534N45L046J621j589l076n70K706K391o78l062j613K051K915K36k687k422
1272b720J115L149J139k113k882ML017J978j323l028j037K464K704m64k828j913
1288b738J585L144M78k468k498N80L132J500j867k864m24K739K386j084k918j378
1304b695K068K961j18k800k096J188L182R56k351k649K12L005J946j725k980o13
1320b509K448K682p76l039j490J761L020L29k812k207R51L068J328k239k812J00
$$ plain form
1336 -2197 554 2747 1392 -1708 -2552 -308 2427 2101 -946 -2698 -1097 1853 2580 -58 -2557 -1789
1352 -1789 1094 2758 901 -2139 -2388 308 2610 1684 -1508 -2695 -522 2251 2273 -630 -2715 -1287
1368 -1287 1643 2606 317 -2468 -2000 931 2654 1143 -1919 -2475 106 2455 1838 -1151 -2700 -749
1384 -749 2015 2309 -232 -2592 -1561 1418 2540 624 -2171 -2170 622 2519 1339 -1534 -2575 -270
1400 -270 2286 1942 -734 -2622 -1074 1857 2296 25 -2327 -1766 1136 2467 786 -1857 -2229 294
1416 294 2442 1421 -1226 -2455 -511 2081 1929 -522 -2317 -1275 1468 2260 225 -2020 -1839 728
1432 728 2356 944 -1552 -2177 -52 2180 1575 -941 -2198 -785 1714 2003 -241 -2106 -1442 1119
1448 1119 2246 438 -1828 -1811 391 2192 1120 -1339 -2040 -309 1908 1669 -710 -2066 -900 1402
$$ packed form
1336b197K751K193j355l100q44K244K735l26l047j752J601K950P27k638k499P68
1352a789K883J664j857l040k49K696K302r26l192j187K173K773K2k903k085J428
1368a287K930R63k289k785M68K931J723j511l062n56K581K349o17k989j549J951
1384g49K764K94k541k360J031K979J122j916k795JK792J897j180k873j041K305
1400b70K556l44k676j888J548K931M39k271k352N61K902J331j681k643l72K523
1416B94K148j021k647j229J944K592j52k451j795J042K743P92k035k245J81K567
1432G28J628j412k496o25K125K232o05k516j257J413K499K89k244j865O64K561
1448A119J127j808k266J7K202J801j072k459p01J731K217k39k379j356J166K302
$$ plain form
1464 1402 2046 -15 -1962 -1404 816 2074 699 -1579 -1753 120 1923 1345 -1050 -1963 -475 1565
1480 1565 1717 -421 -1984 -1010 1057 1893 314 -1725 -1487 524 1907 980 -1302 -1817 -35 1705
1496 1705 1407 -743 -1942 -615 1339 1679 -25 -1818 -1206 867 1783 572 -1491 -1636 345 1733
1512 1733 1070 -942 -1825 -305 1461 1430 -291 -1787 -962 1081 1689 262 -1527 -1405 586 1711 780
1529 780 -1048 -1715 -78 1589 1263 -568 -1790 -726 1312 1581 -61 -1621 -1193 824 1705 497
1545 497 -1238 -1561 173 1726 1022 -837 -1707 -430 1473 1410 -362 -1598 -943 1014 1643 219 -1387
1562 -1387 -1381 401 1753 783 -1077 -1599 -166 1584 1264 -628 -1644 -727 1186 1585 -32 -1557 -1206
1579 -1206 681 1797 554 -1317 -1505 163 1698 1071 -890 -1652 -454 1381 1547 -334 -1698 -956
$$ packed form
1464A402O44k061j947N58K220J258j375k278j74J873J803n78k395r13J488K040
1480A565J52k138j563R74K067Q36j579k039K38K011J383r27k282n15J782J740
1496A705k98k150j199J327J954L40j704j793O12K073R16j211k063j45J981J388
1512A733o63k012q83J520J766l1j721j496Q25K043O08j427j789J22J991J125r31
1529G80j828o67J637J667l26j831j222J064K038K69j642j560M28K017Q81j208
1545D97j735l23J734J553p04j859q70J277J903o3j772j236O55J957O29j424j606
1562a387OJ782J352r70j860n22J433J750l20j892j016R17J913L99j617j525L51
1579a206J887J116j243j871j88J668J535o27j961p62J198J835J66j881j364P42
$$ plain form
1595 -956 959 1793 216 -1579 -1304 486 1755 815 -1163 -1597 -119 1556 1373 -669 -1802 -653
1611 -653 1263 1698 -68 -1740 -1115 807 1772 585 -1450 -1579 232 1734 1165 -1033 -1847 -328 1567
1628 1567 1560 -442 -1913 -866 1156 1773 251 -1690 -1415 680 1891 828 -1390 -1822 123 1792
1644 1792 1262 -822 -1947 -551 1491 1649 -179 -1912 -1221 1076 1938 443 -1667 -1696 518 1941
1660 1941 953 -1169 -1979 -218 1799 1527 -593 -2064 -914 1480 1923 -12 -1920 -1478 936 2098
1676 2098 622 -1549 -1863 222 2036 1278 -1036 -2096 -524 1855 1761 -513 -2063 -1143 1305 2057
1692 2057 220 -1799 -1654 586 2201 929 -1446 -2037 -126 2052 1548 -901 -2088 -798 1602 1986
1708 1986 -147 -2007 -1432 1008 2243 584 -1778 -1854 346 2161 1219 -1278 -2087 -377 1826 1779 -569
$$ packed form
1595i56J915Q34j577j795K75J790J269r40j978m34J478J675j83k042j133J149
1611f53J916M35j766j672O25J922R65j187k035j29J811J502n69k198q14J519J895
1628A567pk002j471J047K022O17j522j941K75K095J211j063k218m32J945J669
1644A792n30k084j125J396K042J58j828j733O91K297Q62j495k110k9K214J423
1660A941r88k122q10J761K017k72k120j471J150K394M43j935j908M42K414J162
1676B098j476k171l14K085J814p58k314j060J572K379r4k274j550R20K448P52
1692B057j837k019J45K240J615j272k375n91J911K178n04k449j187J290K400L84
1708A986k133j860N75K440J235j659k362p6K200J815r42k497q09J710K203m7k348
$$ plain form
1725 -569 -2186 -1073 1380 2142 142 -2032 -1586 781 2152 844 -1598 -1942 71 1973 1521 -961
1741 -961 -2173 -652 1637 1938 -297 -2173 -1214 1131 2073 485 -1799 -1761 470 2065 1202 -1303 -2114
1758 -2114 -206 1893 1666 -675 -2165 -871 1436 1948 73 -1985 -1492 868 2075 779 -1549 -1948
1774 -1948 240 2002 1283 -1020 -2079 -458 1672 1689 -303 -1989 -1164 1196 1980 332 -1749 -1665 606
1791 606 2027 922 -1240 -1912 -137 1819 1468 -633 -1968 -852 1425 1856 -19 -1829 -1373 867
1807 867 1957 565 -1428 -1728 184 1861 1152 -936 -1896 -483 1596 1607 -409 -1815 -1035 1109 1822
1824 1822 188 -1535 -1446 466 1880 863 -1156 -1726 -162 1702 1373 -674 -1753 -717 1249 1715
1840 1715 -50 -1634 -1216 687 1846 587 -1360 -1567 144 1739 1132 -948 -1733 -410 1376 1497
$$ packed form
1725e69j617J113K453P62k000k174M46K367J371j308k442l44K013J902m52k482
1741i61j212J521K289L01k235j876R59K345R42j588k284L8K231J595q63k505q11
1758b114J908K099k27k341j490J294K307N12j875k058M93K360J207j296k328l99
1774a948K188J762p19k303j059J621K130J7j992j686Q25K360P84j648k081Q4K271
1791F06J421j105k162o72J775J956l51k101j335J116K277M31j875j810M56K240
1807H67J090j392j993l00J912J677p09k088r60J413K079J1k016j406P80K144P13
1824A822j634j723Q9J912J414j017k019n70J564J864l29k047j079J036J966M66
1840A715j765j584M18J903J159j259j947k07J711J595o07k080p85J323J786J21
$$ plain form
1856 1497 -325 -1684 -976 921 1741 295 -1524 -1374 421 1699 842 -1089 -1565 -153 1438 1294
1872 1294 -526 -1662 -686 1068 1573 71 -1572 -1129 608 1606 641 -1194 -1456 91 1474 1136 -695
1889 -695 -1665 -433 1219 1415 -158 -1588 -935 816 1518 403 -1302 -1341 338 1492 890 -896 -1589
1906 -1589 -193 1325 1222 -386 -1572 -736 998 1421 154 -1355 -1163 555 1476 656 -1010 -1434 45
1923 45 1393 1032 -537 -1498 -516 1102 1301 -62 -1343 -1007 726 1459 401 -1130 -1322 245 1436
1940 1436 816 -755 -1416 -295 1262 1166 -303 -1419 -789 887 1373 116 -1208 -1106 432 1438 574
1957 574 -904 -1288 -106 1308 986 -530 -1348 -539 1044 1290 -103 -1273 -915 602 1432 380 -1041
1974 -1041 -1184 125 1354 814 -726 -1322 -293 1145 1154 -347 -1317 -686 756 1316 164 -1185 -1016
$$ packed form
1856A497j822j359P08J897Q20j446j819J50J795J278q57j931m76J412J591j44
1872A294j820j136R76J754N05j502j643M43J737R98r65j835k62J547J383l38j831
1889f95r70J232J652J96j573j430O53J751P02j115j705l9J679J154o02j786o93
1906a589J396J518j03j608j186Q36J734M23j267j509J92J718R21q20j666m24J479
1923D5J348l61j569r61R82J618J99j363j281L36J733P33j058j531j92J567J191
1940A436o20j571o61J121J557r6j469j116O30J676M86j257j324J02J538J006q64
1957E74j478l84J182J414l22j516q18Q09J583K46j393j170L58J517Q30j052j421
1974a041j43J309J229n40j540n96J029J438Rj501r70O31J442N60j152j349J69
$$ plain form
1991 -1016 365 1383 610 -931 -1210 -60 1177 973 -515 -1272 -472 919 1204 -40 -1222 -827 533
2008 533 1257 402 -1021 -1072 155 1213 810 -713 -1236 -242 995 1056 -256 -1275 -629 718 1224 172
2026 172 -1123 -947 335 1204 581 -843 -1203 -47 1077 893 -450 -1221 -406 877 1085 -26 -1153
2043 -1153 -772 552 1138 366 -902 -1052 199 1101 675 -596 -1144 -233 979 910 -237 -1111 -606 707
2061 707 1092 117 -988 -915 367 1108 488 -721 -1080 -31 1069 749 -426 -1132 -373 834 952 -81
2079 -81 -1028 -717 531 1104 265 -829 -916 216 1076 560 -561 -1014 -206 938 837 -251 -1001 -499 672
2098 672 986 50 -926 -773 335 1040 439 -723 -896 -9 969 693 -473 -986 -321 769 907 -134
2116 -134 -943 -584 493 1004 205 -814 -803 175 987 520 -583 -927 -107 877 763 -307 -956 -395 631
$$ packed form
1991a016J381J018p73j541k79J150J237k04j488p57Q00J391K85j244j182L95J360
2008E33P24q55j423n1J227J058m03j523n23R94J237O1j312j019O46J347N06j052
2026A72j295J76J282Q69o23j424l60J156J124j84j343p71Q15J283K08j111j127
2043a153L81J324N86p72j268j50J251R02m26j271n48R11J212o9j147q74N05J313
2061G07L85r75j105P3J282P41o20j209l59J049J100l20j175p06P59J207J18j033
2079h1r47L11J248N73q39j094q7J132Q60n16j121m53Q08J144j01j088p50N02J171
2098F72L14r36r76J53J108P05o01j162j73Q87R78k76j166n13O65J090J38j041
2116a34q09L59J077N11p99j019J1R78Q12m67j103l44Q20R84j14j070o49N61J026
$$ plain form
2135 631 912 40 -873 -642 346 914 332 -717 -857 61 886 611 -439 -924 -231 684 789 -121 -918
2154 -918 -520 494 889 145 -815 -710 248 864 457 -551 -847 -45 786 663 -285 -900 -313 640 780
2173 780 -14 -817 -576 413 835 250 -680 -801 144 840 487 -442 -850 -157 713 686 -197 -832 -434 521
2193 521 769 73 -733 -647 263 821 317 -560 -792 -4 749 506 -315 -780 -241 612 700 -91 -741 -466 412
2214 412 785 137 -655 -630 178 753 365 -450 -724 -104 672 554 -267 -723 -329 519 676 -20 -684 -489
2234 -489 298 715 208 -572 -620 80 681 425 -380 -687 -168 589 596 -174 -700 -343 402 673 37 -620 -472
2255 -472 246 675 279 -488 -604 36 618 458 -311 -652 -154 509 567 -84 -633 -368 350 646 116 -592
2275 -592 -548 152 608 306 -407 -603 -40 555 466 -208 -642 -214 426 547 -17 -576 -402 300 602 164 -469
$$ packed form
2135F31K81q72r13K31R88N68n82j049j40R18Q25k75j050m85O93R15J05r10p97
2154i18L98J014L95p44r60J05R58O16m07j008k96Q02Q31j23r48o15N87R53J40
2173G80p94q03K41R89M22n85r30j21R45O96l53r29m08O93Q70k7q83o35L98R55
2193E21K48o96q06Q6R10N58n04q77k32P88P53k43q21m65N39Q53Q8p91o50K75Q78
2214D12L73o48p92K5Q08N75l88q15k74O20P76j18q21m56L94Q48J57o96o64J95
2234d89P87M17n07p80m8P00O01k56q05l07N19P57Pp70n26L57P45K71o36o57J48
2255d72P18M29l96p67j16O40N82j60p69l41M98O63N8o51n49K65P18K96n30p08
2275e92M4P00M56l02p13j96N63N95q9o74m34M28O40J21n64n59J74P02L02m38o33
$$ plain form
2296 -469 -526 93 604 339 -324 -575 -79 542 459 -120 -585 -282 379 523 64 -497 -424 218 524 212 -377
2317 -377 -496 36 505 342 -259 -553 -159 432 435 -57 -474 -357 316 526 111 -407 -432 108 529 248 -319
2338 -319 -490 -75 430 384 -197 -492 -205 349 478 -10 -452 -337 219 494 138 -361 -417 45 494 300 -229
2359 -229 -458 -102 430 404 -110 -478 -236 256 484 38 -402 -350 113 481 246 -324 -410 -41 437 368 -165
2380 -165 -455 -143 331 416 -34 -425 -269 227 477 153 -370 -367 60 445 285 -270 -463 -66 364 377 -105
2401 -105 -454 -243 280 444 69 -426 -335 166 458 203 -344 -426 -8 448 326 -183 -493 -162 345 430 -32
2422 -32 -449 -285 250 446 117 -408 -398 88 486 284 -289 -493 -79 429 398 -116 -514 -259 315 446 38
2443 38 -473 -379 174 495 165 -353 -473 30 473 321 -199 -505 -131 428 444 -56 -500 -321 297 522 112
$$ packed form
2296d69n7O19N11k65o63k51M96O21q3n79m65L03O61J44m59n61P3O42L06l12n89
2317c77j19N32M69j63o01k94L94N91Lm92m17J17O73K10m15n18k5N40M21k81n67
2338c19j71M15N05m6n81k95K87N54J29m88m42J15N56K75l56m99n6M62M49j94n29
2359b29k29L56N32k6n14l68K42M92K28m46m40N2M63L68k35n70q6L69M78o9n33
2380a65k90L12M74Q5m50l91J56M96K50l24n23LM27L85j60n55j93L97M30J3m82
2401a05l49K11N23J64l75m95R1N01K92k55n47q2M18M56j22n09l10L31N07Q5m62
2422c2m17J64N35J96l29n25J0M86L98k02n73k04M14N08l1n14l98K55N74J31m08
2443C8n11R4N53L21l30n18j20N03M43j52n20l06L74N59J6n00m44J79O18K25m10
$$ plain form
2464 112 -415 -432 114 520 265 -321 -523 -56 490 393 -173 -520 -232 392 483 -19 -492 -407 242 542 166
2485 166 -418 -495 56 546 331 -275 -525 -146 472 469 -122 -554 -274 329 551 87 -486 -402 206 586 266
2506 266 -365 -508 -14 523 410 -239 -578 -191 428 522 -49 -559 -353 287 555 111 -475 -483 80 579 321
2527 321 -374 -578 -82 522 454 -176 -576 -222 392 554 4 -571 -396 258 581 220 -455 -517 73 572 383
2548 383 -322 -598 -118 510 505 -109 -620 -306 354 588 93 -577 -473 210 600 231 -435 -596 31 586 438
2569 438 -248 -630 -204 491 538 -82 -619 -376 321 609 134 -522 -537 158 644 324 -399 -615 -68 591 472
2590 472 -212 -616 -255 437 583 -8 -605 -458 275 628 202 -512 -557 64 629 381 -348 -657 -137 538
2610 538 512 -137 -637 -317 406 622 74 -561 -486 186 657 265 -439 -579 -10 605 444 -275 -637 -215 497
$$ packed form
2464A12n27j7N46M06k55n86k02M67N46r7n66l47K88O24R1n02m73Q5O49L00l76
2485A66n84p7N51M90k15o06k50L79O18ln91m32K80O03K22m64n73Q4O08L80l20
2506B66o31j43M94N37j13o49l39L87O19R4n71n10K06O40K68m44n86qN63M99k58
2527C21o95k04M96O04o8o30m00L54O14J62n50n75J75O54L23l61o75o2N90M99j89
2548C83p05k76M80O28no14n11L14O60K34m95o70J04O83L90l69o66j61O27N55j48
2569D38o86l82M26O95M7o20n37K43O97K88m75o56j5O95M86l20p23k16N47O59j19
2590D72o84m04L61O92J46n91n97J47P33L53m26p14m5O21N65k48p29l09N20O75
2610E38k6o49n00L20P23K16n48o35P5O72M71l92p04j40N69O15j61p19l62M22P12
$$ plain form
2631 497 578 -82 -602 -407 310 643 153 -507 -519 87 649 353 -388 -602 -95 572 525 -190 -638 -300 405
2652 405 631 18 -591 -457 226 654 238 -487 -553 32 618 412 -304 -644 -165 508 564 -116 -639 -334 338
2673 338 655 141 -536 -481 134 663 338 -402 -607 -29 530 435 -226 -612 -235 443 560 -15 -613 -403 271
2694 271 605 181 -465 -540 77 598 375 -294 -619 -132 494 503 -138 -615 -353 381 579 73 -539 -467 187
2715 187 615 274 -417 -560 0 563 408 -221 -597 -203 467 521 -27 -561 -369 278 576 164 -477 -511 92
2736 92 571 336 -303 -609 -98 520 491 -131 -561 -302 388 562 61 -511 -460 188 617 272 -394 -547 -38
2757 -38 549 427 -208 -582 -231 447 537 -17 -561 -388 291 615 167 -460 -522 77 552 348 -314 -566 -145
2778 -145 490 496 -147 -567 -332 327 589 66 -509 -459 181 608 293 -373 -517 -27 534 466 -202 -581 -247
$$ packed form
2631D97Q1o60n20J95P17L33m90o60j2O06N62k96p41k14N07O67m7p15m48L38P05
2652D05K26o13o09J34O83M28m16p25o6N85N86k06p16l40M79O73N6o80n23L05O72
2673C38L17n14o77N5O15N29l25p40k05N78N59r5o61l86L77O78J17n75n98K10O74
2694B71L34m24o46p5O17N21k23o69l25M87O26Ro41m77K62P34J98n06o12P2O54
2715A87M28l41o91j43N60N63j55o29l76L94O70N4n48n34J92O47K98m12o41l4O03
2736I2M79k35o39l06N11O18k9o22m30K59O90J74n01n72N1O48M29l45o66j53N09
2757c8N87j22o35l74L51O78R0n54n44J73O79L24m48o27o2N99M75k04o62k52M21
2778a45O35Oo43m20K35O59K62n23n75N0O40M27l15o66j44M90N61o8o68l79L34
$$ plain form
2799 -247 407 549 -10 -558 -399 240 605 183 -436 -523 70 544 383 -282 -604 -154 465 524 -141 -608 -331
2820 -331 351 584 119 -498 -464 145 601 324 -380 -569 -42 514 451 -161 -601 -245 416 599 55 -574 -427
2841 -427 245 617 247 -451 -577 36 584 399 -271 -651 -175 504 549 -78 -631 -375 334 620 123 -502
2861 -502 -518 127 626 340 -348 -615 -120 552 496 -168 -637 -326 416 619 40 -594 -477 243 632 244 -433
2882 -433 -600 13 650 450 -252 -659 -214 526 597 -58 -634 -405 337 670 138 -516 -570 104 660 336 -399
2903 -399 -650 -105 592 530 -211 -665 -310 444 653 44 -616 -512 248 696 269 -482 -647 21 662 502
2923 502 -291 -676 -229 526 642 -73 -660 -410 343 701 194 -571 -571 106 696 414 -386 -715 -113 592 562
2944 562 -179 -725 -333 437 689 81 -658 -519 244 707 326 -503 -640 11 664 530 -300 -689 -228 519
$$ packed form
2799b47O54J42n59n48J59O39L65m22o19q7N93M74j61o65l22M50O19N9o65m67K77
2820c31O82K33m65o17L4O09M56k77p04j89N27N56o3o12m40L56O61J83n44o29J47
2841d27O72L72l70o98j26O13N48j85o70l80M76O79M5o27n53K56P09K86m97o25
2861e02j6O45M99k86o88k67M95O72n6o64m69L11P42K03n79o34J17P20L89l88o77
2882d33j67O13O37k00p02m07M45P40P1o55n76K29P42L33n32o54n4O74N56l24p35
2903c99k51N45O97o2p41m54L55P54K09o09o60J04P60M48m27p51j65O68O41j60
2923E02p93l85M47P55J16p15n87K50P53L58n07p65%O77N90k82q00l29O02P05l0
2944E62p41n46L92P70K52o08p39J39P63M63l81q29j37O51O53j34q30l89M61P47
$$ plain form
2964 519 638 -28 -702 -473 332 690 208 -579 -609 114 683 406 -385 -720 -128 610 561 -174 -702 -347 441
2985 441 689 98 -656 -525 258 702 317 -458 -661 -6 663 496 -278 -709 -240 526 626 -45 -647 -439
3005 -439 331 690 212 -529 -635 126 694 372 -358 -705 -139 587 546 -139 -679 -366 432 659 72 -588
3025 -588 -522 207 671 298 -450 -650 -17 626 482 -228 -659 -271 484 621 -47 -613 -431 301 655 181
3045 181 -511 -567 51 638 395 -340 -648 -149 563 552 -146 -613 -365 368 623 77 -542 -492 138 613 285
3066 285 -419 -611 -41 561 472 -238 -623 -264 424 593 0 -596 -447 248 637 199 -474 -543 53 568 387
3087 387 -315 -594 -130 466 494 -82 -589 -340 313 607 125 -510 -484 140 588 314 -362 -574 -76 522 455
3108 455 -193 -629 -244 416 551 14 -581 -426 205 543 225 -411 -533 21 540 389 -229 -578 -143 439
$$ packed form
2964E19J19o66o74K29Q05L58m82p87l0P23N69k77p91l35N92P38m9p35n28L55P88
2985D41K48n91p54J31P83M44l85p75k03O55O69j67p74m31M69P66J00o71o02K08
3005d39P70L59m78p41j06P61N68l22p30l47N66P26m1o85n40L13P98K27n87o60
3025e88O6P29M64l73p48k00O33O43j44p10m31L88P55J37o68n66J82P32L54m74
3045A81o92n6O18N87k43p35l08M99P12j1o98m67K48P33K55n46o19N0O30M75l28
3066B85p04j92N70O02q9p10l85L59O88J69n93n96J49O95L89m38o73o9N96N15j81
3087C87p02k79M64N96K8n76n07K49O53K94m82o35K6O24M48k74o76k12M98N98o7
3108D55o48m36L85O60J35n37n95J55O31L38l18o36j22N54N19j51o18l49M35N82
$$ plain form
3128 439 480 -37 -531 -335 305 544 162 -439 -513 122 526 307 -297 -565 -111 502 431 -130 -548 -284 333
3149 333 501 65 -485 -424 156 544 237 -363 -529 -16 470 364 -193 -547 -191 393 483 -51 -491 -391 238
3170 238 549 137 -404 -477 72 537 300 -218 -492 -152 443 450 -93 -529 -293 302 497 98 -457 -462 123 544
3192 544 249 -304 -508 -101 476 386 -166 -543 -226 370 487 29 -455 -351 178 557 205 -385 -454 40 490
3213 490 327 -245 -495 -124 401 457 -73 -500 -317 264 518 134 -435 -442 98 523 318 -301 -471 -76 444
3234 444 415 -132 -517 -252 283 501 34 -478 -384 174 506 217 -366 -486 14 490 364 -211 -499 -165 385
3255 385 479 -58 -502 -307 270 534 135 -436 -438 112 488 303 -270 -533 -90 443 425 -139 -517 -254 310
3276 310 493 31 -461 -397 148 500 232 -356 -519 -1 483 337 -193 -516 -184 409 431 -22 -472 -312 254
$$ packed form
3128D39M1n17m94J96O40K39l82o01p4O35M04k19o04k68M54O13p1n61m18K64O17
3149C33J68m36n50O1N80L88l07o00j66N13M86j06n57l54L56N84R0n34m40J00O29
3170B38L11m12n41p3N49M65k37n18k74L40N95Pn43m36K36N95J95l99n55nN85M21
3192E44k95n53k04M07N77r0n52l77L17N96J17m58m84J04N29L79l52n90o9M94M50
3213D90j63n72k50L71N25N6n30m27J83N81K54l84n69pN40M25k05o19j70L95N20
3234D44k9n47l85K65N35K18m67n12R4N58L32k89n83j20N00M76j26n75k88L34N50
3255C85R4n37m44J95N77K64l99n71kN50L76j85n73k63M43N33j8n64l78K63N64
3276C10J83m62m92O4N45L52k68n88j63N18M84j46n30l23L32N93K2m53m50J60N66
$$ plain form
3297 254 492 150 -392 -454 115 499 282 -271 -514 -68 434 371 -131 -481 -253 325 473 34 -451 -416 165
3318 165 519 218 -316 -481 -17 482 322 -189 -497 -198 384 460 -78 -470 -336 245 507 94 -392 -399 91
3339 91 480 267 -257 -479 -112 436 384 -136 -480 -216 284 464 64 -427 -333 129 462 232 -352 -463 0
3360 0 444 311 -213 -481 -149 337 433 -50 -467 -267 225 486 107 -401 -410 88 459 278 -302 -422 -46 405
3382 405 398 -118 -457 -198 301 455 11 -421 -323 167 470 212 -334 -410 23 405 344 -199 -472 -148 311 399
3404 399 -32 -439 -268 250 418 126 -377 -395 92 413 208 -256 -443 -50 376 330 -105 -448 -166 301 407
3425 407 29 -376 -326 169 421 157 -323 -389 21 400 252 -194 -430 -155 308 352 -36 -392 -253 229 414
3446 414 62 -338 -361 93 377 199 -256 -403 -35 371 304 -130 -395 -200 296 395 13 -360 -291 159 395
$$ packed form
3297B54K38l42n42o2N69L84k17n53k43M46N02o3n02l50K28N78J48m39m85L5N81
3318A65L54l01n34j65M64M99j60n11l08K99N82P6n38l92J34N81K62m13m86pM90
3339I1L89k13n24k22L67N48n2n20l44K64N00J80m00m91R4M62L33k30n84j11M63
3360@M44j33n24k68L32M86R6m83m17K00M92K61l79n08rM98L71j81n80j20L76M51
3382D05pn16l39K59M99J54m44m32R8M90L03k58n46p6M33L82o1n43k73L24M59Q8
3404C99m31m07J71N18J68k92n03j8M87L21k05m64j87L93M26m6m35l43K82M67J06
3425D07l78m05N0M95K52k64m80o6M10L79j48m46k36K75M63M4l88l56J39M82J85
3446D14l52m00k3M54K84j78m55j47L68M06o7m34k65J95M96R9l82l73O9M50K36
$$ plain form
3467 395 167 -279 -351 -5 390 232 -168 -415 -142 295 322 -70 -358 -243 176 395 62 -309 -290 32 372
3488 372 196 -230 -370 -40 344 307 -117 -384 -174 246 378 5 -324 -272 107 378 172 -289 -311 -2 331
3509 331 240 -154 -376 -98 282 343 -33 -338 -230 173 344 95 -284 -315 38 341 231 -203 -328 -60 272
3530 272 308 -69 -342 -172 187 335 26 -330 -284 117 346 193 -226 -297 4 285 258 -84 -327 -117 231
3551 231 271 -8 -316 -216 163 309 86 -257 -323 35 293 209 -130 -332 -76 259 290 -60 -335 -189 184
3572 184 292 69 -272 -254 97 318 164 -203 -327 -16 304 227 -84 -304 -139 226 301 36 -285 -218 119
3593 119 302 94 -194 -298 16 283 199 -132 -287 -81 245 232 -33 -272 -192 126 304 52 -243 -220 40
3614 40 277 139 -180 -287 -79 260 222 -74 -298 -160 188 284 9 -257 -206 94 312 127 -170 -276 -16
$$ packed form
3467C95k28m46p2L46L95j58m00k47K73M37K7l92k88J15M19K19l33l71J9L22L40
3488C72j76m26j40L30L84l7m24k67K10M20J32l73l29N2L79K71k06m61k2L09L33
3509C31r1l94k22K78L80O1l76l05J08M03J71k49l79l1L53L03j10m34j25K68L32
3530B72L6l77k73J70L59J48l09l56M6M01K29j53m19p1L01K81k7l42k43K10L48
3551B31M0k79l08J00L79J46k23l43o6L58K58q4l39k02K56L35L1l50k75J46L73
3572A84J08k23l41J8L51K21j54l67j24L11L20p7l11k20J65L65P5k65l21O7L37
3593A19J83k08k88j04L14K67q4l31j55K06L26j3k65k39Q0L18J78k52k95K3K60
3614D0K37j38l19j07K08L39l8k96k24J38L48R6k75k66N1L00K18j85k97j06K60
$$ plain form
3635 -16 286 219 -127 -275 -90 207 289 -24 -276 -208 119 308 53 -254 -255 50 260 191 -175 -265 -79 229 272
3658 272 -66 -309 -125 181 263 33 -260 -229 69 280 160 -180 -271 8 267 218 -109 -278 -87 204 260 -1
3680 -1 -314 -175 147 261 78 -226 -255 39 262 147 -179 -301 -64 200 236 -79 -297 -128 157 266 40
3701 40 -252 -203 49 264 154 -197 -294 -8 256 221 -104 -267 -105 198 246 -1 -269 -184 141 255 97 -218
3723 -218 -258 31 248 162 -135 -306 -59 215 201 -60 -270 -190 177 255 27 -228 -235 62 235 130 -141 -255
3745 -255 -36 237 179 -91 -256 -91 219 252 -9 -227 -174 132 269 68 -201 -231 26 244 126 -124 -245
3766 -245 -63 207 203 -62 -227 -156 136 243 -3 -229 -185 84 254 103 -180 -218 -15 229 159 -103 -228 -83
3788 -83 169 225 -42 -231 -118 90 231 46 -180 -153 35 235 138 -130 -215 -25 192 183 -78 -241 -113 129
$$ packed form
3635a6L02o7l46j48J85K97Q2l13k52O8L27J89k55l07jL05K10o9l66r0J86L08M3
3658B72l38k43J84L06Q2k30k93L1K98K11j20l40r1K79K59m9l27j69J91K91N6k61
3680al13J39L22J14j83l04k9K94K23j15l26j22K37K64L6l15k18J69K85J09k26
3701D0k92M9K52K15j10l51r7K86K64l5l25j63J62L03M8k47k68Q5L25J14j58l15
3723b18m0K89K17q6k97j71K47K74j4k61k10Q0L67P8k28k55pK97J73j05k71j14
3745b55K19K73n8k70j65J65L10L3k61k18N3L06J37k01k69l0K57K18j18k50j21
3766b45J82K70mk65j65P1K92J07k46k26M4K69J70j51k83l8K03K44p0k62j25J45
3788h3K52N6k67j89J13K08J41j85k26K7J88K00r7k68q5J90K17rk61j63J28K42
$$ plain form
3810 129 218 1 -217 -174 53 181 83 -168 -177 -21 173 131 -118 -229 -67 136 195 -14 -207 -109 107 176 72
3833 72 -142 -185 31 166 88 -117 -192 -60 159 155 -21 -190 -100 109 179 19 -164 -151 66 158 77 -134 -191 -7
3857 -7 159 119 -52 -191 -93 126 145 8 -159 -119 68 155 36 -114 -138 35 159 100 -63 -156 -33 121 134 -32
3881 -32 -148 -104 92 135 9 -117 -149 30 164 60 -87 -148 -36 127 132 -45 -144 -76 97 122 4 -122 -125 49
3905 49 135 16 -108 -135 -7 150 51 -57 -128 -69 100 141 -31 -139 -90 91 128 18 -107 -109 0 125 72 -74
3929 -74 -118 -52 89 121 -29 -126 -79 50 114 -5 -110 -90 24 133 39 -86 -96 -3 110 85 -53 -141 -35 56 109
3954 109 -16 -107 -67 41 112 56 -105 -106 0 98 84 -71 -105 -11 95 134 14 -129 -64 103 132 31 -121 -99 25
3979 25 98 78 -76 -127 -21 75 72 -50 -139 -71 63 107 20 -135 -95 47 131 56 -84 -107 39 132 89 -43 -109 -20
$$ packed form
3810A29Q9k17k18M3K27J28r8k51rJ56J94m2k49j11J62K03N9k09j93R8K16O9j04
3833G2k14m3K16J35p8k05p5J32K19mj76j69R0K09P0j60j83J3K17R2q1k11n7J84
3857gJ66m0j71j39R8K19J9j37j67M0J87Q7j19j50k4J73J24n9j63r3J23J54J3j66
3881c2j16M4J96M3j26j26l2J79J34j04j47o1J12J63Nj77r9O8J73K5j18j26lJ74
3905D9Q6j19j24k7J28J57r9j08p1N9J69M1j72j08M9J81L7j10j25kJ09J25n3j46
3929g4m4O6J41L2j50r7M7J29O4j19j05K0J14J09r4j25j0R3J13k5j38q8J06R1N3
3954A09j25r1M0J08P1n6j61jJ06R8j4j55l4R4J06L9j20j43O5J67K9j01j52K2J24
3979B5P3k0j54n1J06R6lj22q9O8J34M4q7j55M0J42Q4p5j40k3J46R3m3j32o6Q9
$$ plain form
4005 -20 101 91 -6 -136 -67 69 115 38 -122 -116 14 108 64 -65 -91 -19 113 74 -31 -122 -86 62 108 16 -108 -97
4031 -97 41 116 44 -66 -135 1 79 78 -64 -127 -24 98 120 -24 -108 -59 66 117 32 -86 -109 10 118 43 -61
4056 -61 -112 -62 100 62 -41 -124 -54 76 113 6 -99 -91 36 87 43 -90 -107 -12 87 57 -64 -85 -35 74 94 -42
4082 -42 -120 -58 67 130 31 -86 -53 16 107 54 -73 -89 -12 74 74 -59 -120 -44 87 70 -29 -111 -59 44 102 29 -107
4109 -107 -101 17 77 52 -64 -109 -11 93 88 3 -108 -35 56 71 33 -84 -48 55 93 29 -68 -103 34 93 46 -43 -101
4136 -101 -9 93 77 3 -98 -60 30 66 4 -75 -65 29 49 26 -87 -96 -3 76 52 43 -167 -57 115 27 -37 -52 -131 23
4164 23 67 -27 -95 -47 17 22 29 -62 -92 28 91 56 -15 -75 -61 36 61 -10 -5 -42 76 46 41 -54 -66 46 4 41 -121 -123 2
4195 2 16 26 -34 -43 -3 45 64 -13 -81 -27 23 117 -8 21 -33 -106 83 69 -111 -41 54 114 -4 -113 -71 -52 49 33
$$ packed form
4005b0J21j0r7j30O9J36M6p7j60OJ30R4m4j29k6P2J32l9j05r1L6J48M6r2j24J1
4031i7J38P5p2j10o9J36P8jj42o3J03J22K2j44q4M9J25N1q5j18k3J19J08p5j04
4056f1n1N0J62l8j03q3P0J30L7j07j05QJ27N1m4j33j7R5R9l0j21k1N0J09K0j36
4082d2p8O2J25O3r9j17L3O9R1n3j27j6P7Q6%j33o1P6J31j7r9q2N2J03N8p3j36
4109a07OJ18O0k5j16m5R8J04nq5j11P3R1J5l8j17L6J03L8o4r7l5J37N9m7q9n8
4136a01R2J02j6p4j01L8R0L6o2p9J0R4K0k3j13rR3P9k4rk10J10J72q8o4j5p9J54
4164B3M4r4o8M8O4NPr1l0J20O3l5p1o0J4R7K5p1Nl7J18l0nr5j2J12m2L7j62kJ25
4195BJ4J0o0rM0M8J9p7o8N4N0R4j25K9n4p3J89j4j80P0R5O0j18j09M2J9J01j6
$$ plain form
4223 33 -10 -81 -31 29 35 1 -75 -56 23 33 6 -38 -34 -22 30 12 -1 -68 -30 33 7 -21 -55 -48 28 50 -1 -36 -64 16 68 37
4255 37 -13 -52 -5 27 33 -26 -33 -14 25 27 -24 -83 -33 27 24 -26 -67 -81 0 52 -4 -35 -54 -29 47 19 -21 -24 -10 20 36 7 -66
4288 -66 -48 10 49 -8 -29 -15 0 65 21 -20 -34 -17 28 18 -27 -48 -18 35 35 -11 -29 -2 -5 26 3 -47 -57 -12 24 19 -27 -47
4320 -47 -5 17 17 -25 -32 27 22 28 10 -58 -27 -2 53 16 -33 -18 17 35 37 -23 -39 -8 37 -7 -33 -15 -26 14 10 8 -42 -35 13 -11
4354 -11 -9 -23 -34 0 2 5 3 -45 -6 41 -21 -33 -21 -28 27 17 -6 -28 -49 -13 39 -7 -19 -26 23 29 14 -26 -8 11 24 28 9 -17
4388 -17 -30 21 37 -17 -40 -39 22 41 0 -31 -14 0 23 24 -21 -20 -12 -5 13 17 -17 -24 6 4 -7 -26 -31 -8 30 -13 5 -27 -3 19 24
4423 24 -1 -31 -15 10 41 7 -20 -17 14 26 -3 -22 -11 -24 9 16 -11 -41 -16 -9 37 -1 -35 -38 0 11 -12 -29 -53 26 40 30
4455 30 -24 -19 -20 19 1 -21 -45 -37 -8 14 5 -24 -43 22 17 31 -26 -31 -8 17 30 -16 -18 13 -5 25 -9 -51 -9 -7 -5 5 -34 -42 -4
$$ packed form
4223C3m3p1N0O0Ol4p6J9P9J0k7m4MJ2N2j8j3o7L8O3k6k8l4PP6K2n1l5k8Q0N2l1
4255C7n0l9M7L2On9pJ9L9Kn1n9N0O0ln0m1j4Q1N2n6l1j9K5P6k8m0lJ4L0J6k9p3
4288f6J8N8L9n7k1J4J5O5m4m1j4J7M5j0m5k1L0N3%m6j8K7lL1k3n0j0M5L6nm6k0
4320d7M2K2%m2pN9nOj8o8L1K5N5l7m9J5L5J8Ko0j6L1M5m4k6J8j1M0mkn0PM8k4
4354a1Kj4j1L4KLkm8L9M7o2j2J2pN5j0k3k2k1L6N2m6j2pM9Oj5m0J8J9J3Mj9k6
4388a7j3N1J6n4k3JO1J9m1l1J7J4K3Jm5JQPJ8Ml4pL0kj1j9nK3L8m3J8l2K4K2N
4423B4k5l0J6K5L1l4k7LL1J2k9j9J1j3L3Pk7l0K5PM6l8l4lL8J1k3j7k4P9J4j0
4455C0n4NjL9j8k2k4QK9K2rk9j9O5nJ4n7nK3K5J3m6kL1j8L0l4m2M2KKJ0l9qL8
$$ plain form
4490 -4 10 3 -14 -42 -7 29 13 21 -31 -25 -13 49 19 -36 -42 8 45 11 -4 -31 -6 8 18 -31 -47 -23 29 -1 5 -24 -72 19 40
4523 40 7 -29 -44 7 54 6 -32 -37 -8 9 50 -12 -50 -32 33 31 -9 -29 -42 21 49 14 -45 -21 10 40 24 5 -34 -14 43
4554 43 37 -17 -16 -19 38 37 -32 -29 -49 -4 48 1 -51 -68 14 41 50 -3 -62 -13 25 55 -15 -40 -31 10 60 34 -36 -38 -9 69 6 -43
4588 -43 -52 1 66 47 12 -38 8 60 57 -11 -41 -45 9 45 -6 -51 -55 16 44 10 -22 -58 -18 9 51 12 -63 -23 4 28 -13 -13 -32
4621 -32 15 36 23 -30 -66 -2 33 35 -10 -35 -28 34 31 -16 -58 -31 25 52 27 -61 -48 5 52 42 -61 -63 -2 54 34 -20 -67 -20
4653 -20 36 49 12 -49 -65 8 35 5 -6 -42 -17 71 53 -30 -55 -27 49 39 -2 -20 -27 29 74 -14 -54 -38 21 50 37 -28 -81
4684 -81 -2 62 15 -13 -69 -37 41 56 -15 -36 -42 5 33 17 -60 -40 -12 61 34 -67 -79 -17 27 52 -20 -55 -42 30 43 30
4714 30 -36 -17 41 61 17 -49 -48 -11 54 58 -25 -56 -26 2 38 24 -65 -23 15 62 -5 -52 -51 -6 43 36 -10 -45 -5 33 54 -21
$$ packed form
4490dJ4pj7k8L5L6j6Qn2OJ2O2l0n5oN0L7l4j5k7K5J4J0m9j6K4N2l0Ok9m8R1K1
4523D0l3l6j5N1M7m8l8nK9J7M1o2l8J8O5km0k0j3O3K8l5n9K4L1L0j6j9l9K0N7
4554D3on4JlN7jo9Lk0M5N2m7n2j7Q2K7Rn3n9M9L8L0p0k5RM1N0k6p0kK9P8o3m9
4588d3rN3O5j9l5n0M6N2lo8l0mN4L6n1m5mP1K8l4l2l6M0K7M2l9p5M0K7K4m1%j9
4621c2M7K1j3n3l6O4L5Km5k5PO2lm7m2K7N6K7k5q8J3N3M7j0j03kO1N6k0n4m7M7
4653b0N6J3l7o1j6P3K7l0j1l6K5Q8j8q3k5K8P6j0m1j8pN6M5q8m0J6N9K9j3o5n3
4684h1P9O4m7k8n6L2P8J5p1k1oM7K8j6p7K0K8P3k7j01j2O2M4K5p2l5J3P2J3j3
4714C0o6J9N8K0m4o6JL7O5Mq3l1L0K8L6j4q9M2L8M7o7m7JM5M9pm6l5M0L8K1p5
$$ plain form
4746 -21 -61 -4 46 36 18 -63 -55 8 56 33 -11 -61 5 59 63 -45 -76 -9 60 52 1 -56 -38 28 84 16 -55 -56 9 42 -8 -20
4778 -20 -38 -4 52 27 -29 -47 -60 52 43 6 -39 -32 16 48 12 -28 -45 2 54 47 -38 -30 -29 19 51 20 -35 -36 30 73 -6 -75 -30
4811 -30 12 60 6 -36 -60 5 51 23 -42 -63 -38 -1 64 -50 -64 -29 3 75 36 -15 -30 39 81 55 -37 -33 -14 33 49 -6
4841 -6 -56 -24 48 44 0 -53 -43 -2 40 22 -34 -26 -9 57 32 -34 -58 -21 -11 41 20 -56 -37 5 41 13 -18 -52 -18 54 19 -33
4873 -33 -50 -18 32 54 3 -67 -31 29 35 28 -44 -46 43 70 25 20 -60 -20 47 37 -16 -72 -42 34 30 -2 -17 -82 12 51 38 -11 -54
4906 -54 12 32 38 -25 -80 -43 48 53 26 -68 -64 30 48 30 -12 -55 2 40 37 -9 -48 12 31 41 4 -84 -31 16 39 -2 -62 -63 -5
4939 -5 54 30 -31 -75 -2 15 39 -27 -55 -22 29 54 -20 -35 -37 -4 57 25 -9 -47 4 48 25 -54 -29 -24 43 45 -6 -43 -34 21 59
4972 59 15 -68 -62 22 43 23 -44 -65 -6 32 48 -16 -60 -44 17 60 -43 -80 -53 7 71 0 -39 -50 -10 36 75 -35 -46 -12
$$ packed form
4746b1m0N7N0j0j8q1QO3M8k3m4n0O6N4Mj08l1O7O9qn1n7J8O6N6o8p1jO5L3n0j2
4778b0j8L4N6k5n6j8j3J12rl7m5PM8L2l6m0j7M7N2pq5QJM8L2l1n5jO6M3p9o9M5
4811c0M2M8n4m2k4O5M6k8o5k1K5L7O5j14j4L5L2P2l9n1j5O9M2k6r2MJ9M7J6n5
4841fn0L2P2mm4n3J0M1M2j8n6QJ7O6k5o6k4L7J0N2k1p6J9M2L6k8l1l4L4P2l5n2
4873c3j7L2N0K2n1p0L6O0Opp2kQ9K7m5nq0M0O7j0n3n6L0P6ml2j5o5R4L9j3m9m3
4906e4O6K0Oo3n5L7R1Nk7r4MR4J8j8m2m3N7L8lm6l9O0J9J0l7q8N3M7K3m1o0jN8
4939eN9k4o1m4P3J7K4o6k8L3N1K5p4j5kL3O1l2l4l8N1M4k3p9K5NO7Kn1l7RN5L8
4972E9m4q3OQ4K1k0o7k1N9L8J6o4m4J6O1M3j03l7K7O0O4p1l9j1M0M6L9j10j1L4
$$ plain form
5002 -12 17 65 -12 -59 -5 54 32 18 -43 -58 22 69 9 -37 -44 -7 13 46 -44 -77 -24 51 53 -6 -69 -56 31 40 16 -52 -66 4
5034 4 45 46 -18 -94 -22 58 66 3 -60 -35 36 55 19 -67 -32 53 71 31 -41 -43 -14 65 58 -37 -80 -30 57 39 -18 -67 -57 0 39
5067 39 -28 -48 -69 12 73 35 -31 -62 -30 64 37 -21 -82 -25 16 62 1 -52 -44 17 84 21 -32 -83 -3 74 58 -46 -80 -25
5097 -25 40 47 -6 -73 -56 25 73 -10 -73 -59 -8 76 47 -66 -52 -21 42 24 -36 -70 -17 21 45 -2 -68 -20 41 77 26 -56
5127 -56 -42 8 64 50 -44 -50 2 53 51 -39 -61 -42 6 47 0 -60 -53 22 52 47 -24 -69 -8 59 23 -19 -63 -17 44 56 19 -81
5159 -81 -33 5 30 26 -39 -42 17 43 16 -44 -66 -24 44 60 -7 -55 -41 63 87 -6 -49 -41 17 53 18 -39 -72 -1 29 36 -46 -93
5191 -93 -30 27 35 -24 -46 -39 8 49 10 -19 -19 3 61 27 -30 -42 -11 32 56 -2 -95 -59 29 45 -6 -23 -31 15 52 30 -43 -71
5223 -71 -16 68 24 -8 -62 -42 35 33 -1 -44 -36 16 42 12 -45 -33 -26 42 36 -35 -73 -14 45 52 -2 -37 -48 34 31 6 -34 -64 0
$$ packed form
5002a2K9M8p7m7N4N9k2j4o1j5Q0M7o0m6pL7K0L3r0l3N3P5Kn9o3J3Q7Rk4o8j4P0
5034DM1Jo4p6P2Q0Qo3o3K5P1J9l6q6L5Q5J8m0p2kK9P9pr5m3N0Q7j8n7m9J0N7L9
5067C9o7k0k1Q1O1l8o6l1L2R4k7n8o1N7M1M6o1n3QO1O7o3n3n1Q0P7j6j04l4N5
5097b5O5Pn3o7J7Q1M8q3o3J4N1Q4k9j13J4L1O3j8o0l4N3L8K4m7o6M8O1L6n1q2
5127e6J4N0N6j4r4oN2N1kr0k2J9M8M1m7o0PP5L0np1m5O1O7l6m2m4M6O1J2l7j00
5159h1M8L8K5mo5lN9K6k7o0k2M2O8J6o7m8J4J04K4r3m3QN8L6l5n7l3P1L0Pq2m7
5191i3O3N7Qn9k2PM7M1l9k9%K2N8l4n7j2L1M3K4n8r3L6Q8J6n1j7qM6L7k2p3k8
5223g1N5Q4m4l2n4K0P7kl4m3QN2K6l0n7J2PO8op1l8N9N9Pn4l5j1Q2lk5m0l0O4
$$ plain form
5256 0 52 15 -38 -37 -19 26 32 -44 -48 -21 11 51 -6 -64 -33 12 53 27 -56 -38 -40 54 31 -13 -49 -23 22 40 -4 -71 -49 -3 35
5289 35 20 -67 -36 27 53 21 -15 -65 -7 39 45 15 -80 -28 41 63 9 -33 -38 16 21 12 -25 -64 -6 57 29 22 -73 -39 11 54 -10
5322 -10 -61 -22 47 24 28 -48 -51 3 38 11 -39 -80 -24 29 54 8 -73 -19 36 69 27 -38 -50 10 51 12 -2 -75 -7 54 46 -13
5354 -13 -31 -39 14 54 -22 -48 -18 3 47 5 -69 -52 9 49 49 -39 -33 -17 47 62 -23 -56 -33 65 48 12 -17 -43 18 65 29 -57
5386 -57 -19 -7 38 19 -31 -38 -41 24 36 1 -40 -39 -8 61 42 -56 -70 -8 71 20 -25 -77 -19 62 31 15 -55 -45 10 73 5 -49
5418 -49 -30 24 19 21 -31 -54 -26 54 62 -47 -81 -17 46 15 -2 -54 -42 26 40 29 -55 -46 -17 48 -6 6 -78 -43 46 42 3 -59
5450 -59 -33 18 39 -13 -70 -59 8 49 40 -21 -42 20 58 53 -13 -52 -2 45 38 0 -54 -27 -5 44 24 -57 -60 8 28 26 -6 -68 -14
5483 -14 39 49 -27 -34 -22 25 49 -16 -48 -40 -2 44 22 -63 -32 -10 72 37 -11 -64 2 18 32 22 -35 -26 18 60 2 -55 -58 -19
$$ packed form
5256@N2l7n3JJ8M5Op6mK7L2M0n7n8L1M5M1k6q3J8kR4k3m4l6K6M5J8m4o7K2M6L8
5289C5j5q7L1O3K6l2l6n0N8M6Ol0r5N2O9K2n4m2nN4Nrl7l9N8O3k8pr5L4N0M3o4
5322a0n1L9O9k3Mp6lN4L5k7n0m1N6N3K5m6q1N4N5L3m2o5j2O0M1l9j4p3O8O1qn9
5354a3j8qN3M0p6k6L0K1M4m2p4J7O1M0%q8OJ6O4J5q5l3K3R8j7l6k9k6O1M7l6q6
5386e7L8J2M5j9n0plO5J2l5m1JL1O9j9r8j4O2P9n1m5n2N8Q1l1j6p0J0N5O3o8n4
5418d9J9N4nKn2k3K8Q0Qj09l4O4O3l1j7n2J2O8J4j1q4RK9O5n4J2q4L5Q9ml9o2
5450e9K6N1K1n2n7J1O7M1ro1k1O2L8no6l9N0M7pl8n4K7K2M9k0q1lO8K0kl2o2N4
5483a4N3J0p6pJ2M7K4o5l2QL8M6k2q5L1K2Q2l5m8n3O6J6J4j0n7RM4M2n8n7lL9
$$ plain form
5515 -19 49 31 -60 -63 -6 4 3 -3 -65 -16 -12 36 -17 -78 -33 24 32 41 -31 -31 2 25 9 -15 -51 -17 30 44 16 -48 -47 14 55 1
5549 1 -47 -56 18 36 -1 -17 -44 -12 38 34 5 -49 -28 27 51 24 -60 -55 13 23 1 -47 -56 -7 16 33 -20 -55 0 27 43 -12 -46
$$ packed form
5515a9O8j8r1lN7J0joo2M9MM8n3o1M5N7QRp2%L3K3j6k4l6L4M7J4k8o4JO1M1n4
5549Am8rP4J8l7j6k7L2N0mk9n4K1N5K4k7q4NO8J0k2m8rM9K3J7n3l5N5K7J6n5l4
$$ [...]
8191b8
##END NTUPLES=NMR FID
##END=
