##TITLE=1H_4C1011RSA
 CDCl3
 8 sc, 
 17.11.2021
##JCAMPDX= 6.0         $$ Bruker NMR JCAMP-DX V2.0
##DATA TYPE= NMR FID
##DATA CLASS= NTUPLES
##ORIGIN= UXNMR, Bruker Analytische Messtechnik GmbH
##OWNER= root
$$ XWIN-NMR		Version 3.5
$$ Wed Nov 17 10:52:59 2021 Russian Standard Time (UT+4h)  she@DPX200
##.OBSERVE FREQUENCY= 200.131346
##.OBSERVE NUCLEUS= ^1H
##.DELAY= (6, 6)
##.ACQUISITION MODE= SIMULTANEOUS
##.ACQUISITION SCHEME= undefined
##.AVERAGES= 8
##.DIGITISER RES= 18
##SPECTROMETER/DATA SYSTEM= spect
##.PULSE SEQUENCE= zg30
##.SOLVENT NAME= Acetone
##.SHIFT REFERENCE= (INTERNAL, Acetone, 0, 15.7039)
##AUDIT TRAIL= $$ (NUMBER, WHEN, WHO, WHERE, WHAT)
$$ ##TITLE= Audit trail, XWIN-NMR		Version 3.5
$$ ##JCAMPDX= 5.01
$$ ##ORIGIN= Bruker BioSpin GmbH
$$ ##OWNER= she
$$ F:/spectra/data/she/nmr/H-F/1/audita.txt
$$ ##AUDIT TRAIL=  $$ (NUMBER, WHEN, WHO, WHERE, WHAT)
(   1,<2021-11-17 10:51:46.12 +0400>,<she>,<DPX200>,
      <created by zg, POWCHK disabled, PULCHK disabled
       configuration hash MD5:
       00 E9 B6 7A A2 85 ED C7 34 08 36 98 17 FE 4E 26
       data hash MD5: 16K
       B9 EE 50 E1 7E 30 C0 52 18 B6 91 21 DD EA 3D 70>)
$$ ##END=
$$ 
$$ hash MD5
$$ 52 DD 06 4F 96 88 05 23 DE A2 C2 71 84 20 49 2A
##$RELAX= 
##$RELAX= 
##$RELAX= 
##$RELAX= 
##$RELAX= 
##$RELAX= 
$$ Bruker specific parameters
$$ --------------------------
##$DU= <F:/spectra>
##$EXPNO= 1
##$NAME= <H-F>
##$PROCNO= 1
##$TYPE= <nmr>
##$USER= <she>
##$AMP= (0..31)
100 100 100 100 100 100 100 100 100 100 100 100 100 100 100 100 100 100 
100 100 100 100 100 100 100 100 100 100 100 100 100 100 
##$AQSEQ= 0
##$AQ_mod= 1
##$AUNM= <au_zg>
##$AUTOPOS= <>
##$BF1= 200.13
##$BF2= 200.13
##$BF3= 200.13
##$BF4= 200.13
##$BF5= 200.13
##$BF6= 200.13
##$BF7= 200.13
##$BF8= 200.13
##$BYTORDA= 1
##$CFDGTYP= 0
##$CFRGTYP= 5
##$CHEMSTR= <none>
##$CNST= (0..31)
1 1 145 1 1 1 1 1 1 1 1 1 1 1 1 1 1 1 1 1 1 1 1 1 1 1 1 1 1 1 1 1 
##$CPDPRG= <>
##$CPDPRG1= <>
##$CPDPRG2= <>
##$CPDPRG3= <>
##$CPDPRG4= <mlev>
##$CPDPRG5= <mlev>
##$CPDPRG6= <mlev>
##$CPDPRG7= <mlev>
##$CPDPRG8= <mlev>
##$CPDPRGB= <>
##$CPDPRGT= <>
##$D= (0..31)
0 1.2 0 0 0 0 0 0 0 0.06 0 0.03 0 0 0 0 0.0002 0 0 0 0 0 0 0 0 0 0 0 0 
0 0 0 
##$DATE= 1637131905
##$DBL= (0..7)
120 120 120 120 120 120 120 120 
##$DBP= (0..7)
150 150 150 150 150 150 150 150 
##$DBP07= 0
##$DBPNAM0= <>
##$DBPNAM1= <>
##$DBPNAM2= <>
##$DBPNAM3= <>
##$DBPNAM4= <>
##$DBPNAM5= <>
##$DBPNAM6= <>
##$DBPNAM7= <>
##$DBPOAL= (0..7)
0.5 0.5 0.5 0.5 0.5 0.5 0.5 0.5 
##$DBPOFFS= (0..7)
0 0 0 0 0 0 0 0 
##$DE= 6
##$DECBNUC= <off>
##$DECIM= 32
##$DECNUC= <off>
##$DECSTAT= 4
##$DIGMOD= 1
##$DIGTYP= 9
##$DL= (0..7)
0 120 120 120 120 120 120 120 
##$DP= (0..7)
150 150 150 150 150 150 150 150 
##$DP07= 0
##$DPNAME0= <>
##$DPNAME1= <>
##$DPNAME2= <>
##$DPNAME3= <>
##$DPNAME4= <>
##$DPNAME5= <>
##$DPNAME6= <>
##$DPNAME7= <>
##$DPOAL= (0..7)
0.5 0.5 0.5 0.5 0.5 0.5 0.5 0.5 
##$DPOFFS= (0..7)
0 0 0 0 0 0 0 0 
##$DQDMODE= 0
##$DR= 18
##$DS= 0
##$DSLIST= <SSSSSSSSSSSSSSS>
$$ [...]
##$SUBNAM2= <"">
##$SUBNAM3= <"">
##$SUBNAM4= <"">
##$SUBNAM5= <"">
##$SUBNAM6= <"">
##$SUBNAM7= <"">
##$SUBNAM8= <"">
##$SUBNAM9= <"">
##$SW= 18.0517287032376
##$SWIBOX= (0..15)
0 0 2 0 0 0 0 0 0 0 0 0 0 0 0 0 
##$SW_h= 3612.71676300578
##$TD= 16384
##$TD0= 1
##$TE= 0
##$TE2= 300
##$TE3= 300
##$TEG= 300
##$TL= (0..7)
0 120 120 120 120 120 120 120 
##$TP= (0..7)
150 150 150 150 150 150 150 150 
##$TP07= 0
##$TPNAME0= <>
##$TPNAME1= <>
##$TPNAME2= <>
##$TPNAME3= <>
##$TPNAME4= <>
##$TPNAME5= <>
##$TPNAME6= <>
##$TPNAME7= <>
##$TPOAL= (0..7)
0.5 0.5 0.5 0.5 0.5 0.5 0.5 0.5 
##$TPOFFS= (0..7)
0 0 0 0 0 0 0 0 
##$TUNHIN= 0
##$TUNHOUT= 0
##$TUNXOUT= 0
##$USERA1= <user>
##$USERA2= <user>
##$USERA3= <user>
##$USERA4= <user>
##$USERA5= <user>
##$V9= 5
##$VALIST= <valist>
##$VCLIST= <CCCCCCCCCCCCCCC>
##$VD= 0
##$VDLIST= <DDDDDDDDDDDDDDD>
##$VPLIST= <PPPPPPPPPPPPPPP>
##$VTLIST= <TTTTTTTTTTTTTTT>
##$WBST= 1024
##$WBSW= 4
##$XGAIN= (0..3)
0 0 0 0 
##$XL= 0
##$YL= 0
##$YMAX_a= 61496
##$YMIN_a= -65760
##$ZGOPTNS= <>
##$ZL1= 120
##$ZL2= 120
##$ZL3= 120
##$ZL4= 120
##$ABSF1= 10
##$ABSF2= 0
##$ABSG= 5
##$ABSL= 3
##$ALPHA= 0
##$AQORDER= 0
##$ASSFAC= 0
##$ASSFACI= 0
##$ASSFACX= 0
##$ASSWID= 0
##$AUNMP= <proc_1d>
##$AZFE= 0.1
##$AZFW= 0.1
##$BCFW= 1
##$BC_mod= 2
##$BYTORDP= 1
##$COROFFS= 0
##$CY= 11.3945322036743
##$DATMOD= 1
##$DC= 2
##$DFILT= <>
##$DTYPP= 0
##$F1P= 2.36226072786647
##$F2P= -0.459571619588291
##$FCOR= 0.5
##$FTSIZE= 0
##$FT_mod= 4
##$GAMMA= 1
##$GB= 0.15
##$INTBC= 1
##$INTSCL= 1
##$ISEN= 128
##$LB= 0.24
##$LEV0= 0
##$LPBIN= 0
##$MAXI= 10000
##$MC2= 0
##$MEAN= 0
##$ME_mod= 0
##$MI= 1.114404
##$NCOEF= 0
##$NC_proc= 0
##$NLEV= 6
##$NOISF1= 3.799351
##$NOISF2= 2.8
##$NSP= 1
##$NTH_PI= 0
##$NZP= 0
##$OFFSET= 15.70392
##$PC= 1
##$PHC0= -15673.14
##$PHC1= 15.20081
##$PH_mod= 1
##$PKNL= yes
##$PPARMOD= 0
##$PSCAL= 0
##$PSIGN= 0
##$REVERSE= no
##$SF= 200.130013532006
##$SI= 16384
##$SIGF1= 3
##$SIGF2= 2
##$SINO= 400
##$SIOLD= 16384
##$SREGLST= <1H.CDCl3>
##$SSB= 0
##$STSI= 0
##$STSR= 0
##$SW_p= 3612.71676300578
##$SYMM= 0
##$S_DEV= 0
##$TDeff= 0
##$TDoff= 0
##$TI= <>
##$TILT= no
##$TM1= 0
##$TM2= 0
##$TOPLEV= 0
##$USERP1= <user>
##$USERP2= <user>
##$USERP3= <user>
##$USERP4= <user>
##$USERP5= <user>
##$WDW= 1
##$XDIM= 8192
##$YMAX_p= 0
##$YMIN_p= 0
$$ End of Bruker specific parameters
$$ ---------------------------------
##NTUPLES= NMR FID
##VAR_NAME=  TIME,          FID/REAL,        FID/IMAG
##SYMBOL=    X,             R,               I
##VAR_TYPE=  INDEPENDENT,   DEPENDENT,       DEPENDENT
##VAR_FORM=  AFFN,          ASDF,            ASDF
##VAR_DIM=   8192,          8192,            8192
##UNITS=     SECONDS,       ARBITRARY UNITS, ARBITRARY UNITS
##FACTOR=    0.0002768,     1,               1
##FIRST=     0,             0,               0
##LAST=      2.2672688,     0,               0
##MIN=       0,             -65760,          0
##MAX=       2.2672688,     61496,           0
$$ Real data points
##PAGE= N=1
##DATA TABLE= (X++(R..R)), XYDATA
$$ plain form
0 0 0 0 0 0 0 0 0 0 0 0 0 0 0 0 0 -8 8 -8 8 -8 8 -16 16 -16 24 -24 32 -32 40 -48 56 -62 71 -80 88 -97 112
37 112 -125 139 -156 173 -192 213 -236 261 -288 317 -351 388 -427 469 -517 571 -627 693 -769
56 -769 853 -951 1064 -1196 1358 -1552 1799 -2121 2562 -3200 4220 -6093 10726 -47573 -50190
71 -50190 6349 -48857 -1772 31564 -17374 -2388 61496 25538 23597 60970 13459 -17762
83 -17762 35082 8404 -36236 5277 568 -52515 -11454 18168 -21721 -6307 21100 -21237
95 -21237 -20590 12573 -13594 -16371 22479 -2923 -25511 12919 9518 -13125 27044 40696 6546
108 6546 16977 28847 -1730 -431 12124 -17254 -27546 -13851 -31906 -34894 -5378 -10603 -23632
121 -23632 1835 10899 938 22831 38762 21567 16819 18737 1197 -4482 4356 -4017 -12410 -7485
$$ packed form
0@%%%%%%%%%%%%%%%qJ6j6J6j6J6k4L2l2M0m8N6o4P2q8J04j18J33j51J68j85K09
37A12k37K64k95L29l65M05m49M97n49O05o68P39q15Q96r86J088j198J320j462
56g69J622j804K015k260K554k910L351l920M683n762P420j0313J6819n8299k617
71e0190N6539n5206M7085L3336m8938J4986O3884l5958j941L7373m7511l1221
83a7762N2844k6678m4640M1513m709n3083M1061K9622l9889J5414K7407m2337
95b1237O47L3163k6167k777L8850k5402k2588L8430l401k2643M0169J3652l4150
108F546J0431J1870l0577J299J2555k9378j0292J3695j8055k988K9516n225j3029
121b3632K5467R064r961K1893J5931j7195m748J918j7540n679Q838q373q393M925
$$ plain form
135 -7485 -15406 -24059 -9068 1220 -5168 -469 7264 -1489 -3004 10354 9638 -1702 -1204 -1832 -7961
150 -7961 1657 13004 5731 2542 6523 -2581 -3045 13324 9387 -5399 -924 -4109 -19021 -9322
164 -9322 1630 -11824 -10541 2880 -4936 -2666 15875 8313 -801 13270 8554 -4295 10043
177 10043 10099 -10540 -3821 3092 -14694 -9729 5824 -7257 -7289 10504 325 -6511 10449 4119
191 4119 -7036 9191 7613 -9590 1049 4947 -11660 -2960 8228 -7207 -5163 8344 -3425
204 -3425 -4346 11482 1556 -7082 6381 974 -8555 6461 6223 -8272 452 4230 -8582 -3
218 -3 9672 -3990 -3366 6056 -5151 -5563 8077 -371 -7280 3992 -302 -7155 6016 6202 -5262
233 -5262 1848 4636 -5408 1453 8211 -3469 -3490 3596 -4575 -4632 5333 -1166 -6329 2225 216 -4086
$$ packed form
135g485p921q653J4991J0288o388M699P733q753j515J3358p16j1340M98o28o129
150g961R618J1347p273l189L981r104m64J6369l937j4786M475l185j4912R699
164i322J0952j3454J283J3421p816K270J8541p562r114J4071m716j2849J4338
177A0043N6k0639O719O913j7786M965J5553j3081l2J7793j0179o836J6960o330
191D119j1155J6227j578j7203J0639L898j6607Q700J1188j5435K044J3507j1769
204c425r21J5828r926q638J3463n407r529J5016k38j4495Q724L778j2812Q579
218cR675j3662O24R422j1207m12J3640q448o909J1272m294o853J3171J86j1464
233e262P110K788j0044O861O758j1680k1P086q171n7R965o499n163Q554k009m302
$$ plain form
249 -4086 4520 4293 -3650 979 3963 -1781 1745 5232 -2101 -2314 2565 -1293 -2058 1950 -2163 -4973
265 -4973 -429 -503 -2424 466 -234 -3267 -54 2513 1424 2855 3355 654 1447 3454 1996 1337 701
282 701 -1955 -2321 -1062 -1541 -2282 -2627 -3830 -3444 -992 174 735 1286 498 434 2327 3007 2660 2529 1096
301 1096 -46 843 988 -31 -790 -2081 -2978 -1864 -554 -509 -768 -1329 -1793 -830 839 1366 1414 988 205
320 205 907 1917 1714 1282 420 -806 -342 558 266 -517 -1534 -2855 -2697 -1150 -330 -526 -556 -864 -791
339 -791 959 2415 2136 1806 1736 1402 1878 2528 1677 -425 -1629 -1802 -1991 -1575 -961 -2374 -3589 -2391
357 -2391 -1307 -672 1217 1762 327 1053 3013 2398 2117 2989 477 -1331 901 680 -1435 -208 -1062
374 -1062 -3909 -1617 832 -1258 -434 1320 -1562 -1467 2344 576 -1301 1537 65 -2122 2088 2560
$$ packed form
249d086Q606k27p943M629K984n744L526L487p333k13M879l858p65M008m113k810
265d973M544p4j921K890p00l033L213K567j089J431N00k701P93K007j458o59o36
282G01k656l66J259m79p41l45j203L86K452J166N61N51p88o4J893O80l47j31j433
301A096j142Q89J45j019p59j291q97J114J310M5k59n61m64R63J669N27M8m26p83
320B05P02J010k03m32q62j226M64R00k92p83j017j321J58J547Q20j96l0l08P3
339g91J750J456k79l30p0l34M76O50q51k102j204j73j89M16O14j413j215J198
357b391J084O35J889N45j435P26J960o15k81Q72k512j808K232k21k115J227q54
374a062k847K292K449k090Q24J754k882R5L811j768j877K838j472k187M210M72
$$ plain form
390 2560 -1225 853 1796 -1675 687 3440 -1015 -1903 863 -2448 -2988 1576 -931 -3868 412 229
406 229 -1830 3088 3691 -1182 1217 3328 -442 1432 3876 -1973 -3427 299 -2444 -3184 1642 -1139
422 -1139 -4711 190 898 -1358 3140 3670 -1700 218 3088 -435 721 3470 -1507 -3276 1047 -304
438 -304 -1757 2468 893 -3206 191 1635 -1561 525 1916 -2666 -2533 992 -1206 -1851 1735 169
454 169 -2211 1482 2295 -529 1785 3226 -418 -190 2208 -912 -2357 861 -283 -2884 169 441
470 441 -3183 -477 2704 -494 -50 3033 -943 -2488 2641 1471 -2054 1249 292 -4815 -464 3438
486 3438 -1228 71 3256 -2806 -2705 4629 1720 -1577 3244 -564 -5968 1264 3257 -3085 648
501 648 2200 -5874 -1978 5463 -463 -919 4849 -2443 -5053 4748 2324 -3247 3557 1015 -7364 711
$$ packed form
390B560l785K078R43l471K362K753m455q88K766l311n40M564k507k937M280j83
406B29k059M918O03m873K399K111l770J874K444n849j454L726k743p40M826k781
422a139l572M901P08k256M498N30n370J918K870l523J156K749m977j769M323j351
438c04j453M225j575m099L397J444l196K086J391m582J33L525k198o45L586j566
454A69k380L693Q13k824K314J441l644K28K398l120j445L218j144k601L053K72
470D41l624K706L181l198M44L083l976j545N129j170l525L303r57n107M351L902
486C438m666J299L185o062J01P334k909l297M821l808n404P232J993o342L733
501F48J552q074L896P441n926m56N768p292k610R801k424n571O804k542q379Q075
$$ plain form
517 711 4629 -3529 741 4734 -5410 -3202 5753 -1398 -2657 5771 -1430 -6486 4009 1968 -4870
532 -4870 3987 3852 -6201 745 5331 -4104 225 6809 -3600 -3904 4903 -2544 -5000 5360 314
547 314 -6660 2219 1024 -6469 2579 5592 -4124 76 4821 -4066 -942 7816 116 -2669 4484
562 4484 -1576 -5318 4566 2970 -4565 877 521 -7069 -470 4881 -2585 -1710 2569 -4161 -3308 5520
578 5520 2146 -1669 3254 145 -4121 2908 4837 -961 794 1605 -4245 -2003 3620 -116 -1988
593 -1988 966 -2491 -4376 1326 2081 -1445 615 975 -2859 -362 3741 1015 -7 2422 -398 -2346
609 -2346 1963 2048 -1403 418 725 -3459 -1911 1583 -1306 -1702 1858 -973 -3165 1617 1541 -1404 2566
626 2566 3058 -2174 41 3090 -1167 -64 3898 -1293 -3685 1331 -877 -3433 2504 1172 -4773
$$ packed form
517G11L918q158M270L993j0144K208Q955p151j259Q428p201n056J0495k041o838
532d870Q857j35j0053O946M586r435M329O584j0409l04Q807p447k456J0360n046
547C14o974Q879j195p493R048L013r716M200M745q887L124Q758p700k785P153
562D484o060l742R884j596p535N442l56p590O599N351p466Q75M279o730Q53Q828
578E520l374l815M923l109m266P029J929n798J755Q11n850K242N623l736j872
593a988K954l457j885N702P55l526K060L60l834K497M103k726j022K429k820j948
609b346M309Q5l451J821L07m184J548L494k889l96L560k831k192M782p6k945L970
626B566M92n232K215L049m257J103L962n191k392N016k208k556N937j332n945
$$ plain form
641 -4773 -516 1402 -3290 1147 4740 -2180 -1982 3168 -959 -991 5714 1305 -3663 1840 762 -3384
657 -3384 2860 3301 -4358 -1550 1409 -3988 -960 4207 -2134 -3610 2191 -1182 -2543 4529 2087
672 2087 -3209 1812 1947 -2754 2238 3968 -2733 -1018 2379 -2740 -1499 3542 -1204 -3064 1837
687 1837 -604 -2969 2434 1385 -2729 1252 1880 -2417 685 2681 -1822 -363 2571 -1261 -1395 2028
703 2028 -738 -1882 1736 8 -2336 790 433 -1928 1016 1529 -1571 -44 1293 -903 344 2339
719 2339 -147 -982 841 -334 -771 1482 373 -1567 -384 -290 -1226 495 845 -1016 -755 216 -388
736 -388 306 1371 163 -698 105 207 207 1143 734 -534 -452 -3 -40 273 345 -272 -812 -369 137 72 41 52
758 52 -514 -481 454 579 6 197 -99 -668 70 702 -61 -202 79 -451 -314 817 230 -474 213 22 -316
$$ packed form
641d773M257J918m692M437L593o920J98N150m127l2O705m409m968N503j078m146
657c384O244M41p659K808K959n397L028N167o341j476N801l373j361P072k442
672B087n296N021J35m701M992J730o701J715L397n119J241N041m746j860M901
687A837k441k365N403j049m114L981O28m297L102J996m503J459K934l832j34L423
703B028k766j144L618j728k344L126l57k361K944N13l100J527J337k196J247J995
719B339k486q35J823j175m37K253j109j940J183R4r36J721L50j861K61R71o04
736c88O94J065j208q61Q03J02%R36m09j268Q2M49l7L13P2o17n40M43N06o5l1J1
758E2n66L3R35J25n73J91k96n69P38O32p63j41K81n30J37J131n87p04O87j91l38
$$ plain form
779 -316 748 709 -586 -195 211 -454 194 756 -443 -741 75 -329 -236 722 -165 -827 108 86 -299 602
799 602 271 -769 -54 430 -14 585 713 -548 -291 564 -11 91 722 -489 -835 295 -13 -330 376
818 376 -218 -1025 1 448 -137 285 257 -775 -239 713 58 10 414 -582 -559 490 313 -141 196 -142
838 -142 -497 405 713 18 9 69 -451 -51 708 147 -284 -121 -472 -353 341 276 -285 -304 -167 -243 152 333
860 333 -17 -344 -171 30 259 441 268 -220 -314 137 352 307 290 -54 -477 -138 298 22 -2 -108 -518 -385
882 -385 255 195 -156 -58 -264 -406 212 470 -111 -68 49 -373 5 552 -17 -221 79 -129 -89 541 280 -322
904 -322 22 82 -168 395 520 -402 -392 139 -165 32 504 -264 -716 -90 41 -190 315 79 -790 -354 415
925 415 34 211 596 -410 -516 569 526 88 560 36 -804 -4 740 -17 12 300 -796 -766 613 234
$$ packed form
779c16J064l9j295L91M06o65O48N62j199k98Q16m04R3R58q87o62R35k2l85R01
799F02l31j040P15M84m44N99J28j261K57Q55n75J02O31j211l46J130l08l17P06
818C76n94q07J026M47n85M22k8j032N36R52o55m8M04r96K3J049j77m54L37l38
838a42l55R02L08o95rO0n20M00P59n61m31J63l51J19O94o5n61j9J37p6L95J81
860C33l50l27J73K01K29J82j73m88r4M51K15m5j7l44m23L39M36k76k4j06m10J33
882c85O40o0l51R8k06j42O18K58n81M3J17m22L78N47n69k04L00k08M0O30k61o02
904c22L44O0k50N63J25r22J0N31l04J97M72p68m52O26J31k31N05k36q69M36P69
925D15l81J77L85j006j06J085m3m38M72n24q40Q00P44p57K9K88j096L0J379l79
$$ plain form
945 234 -457 408 -187 -1089 263 841 -445 14 573 -829 -458 1175 99 -624 741 -108 -1021 773
963 773 711 -883 280 689 -1101 -160 1233 -693 -624 1283 -312 -1029 1187 46 -1448 956 727
980 727 -1361 392 746 -1588 -155 1547 -835 -679 1226 -846 -1119 1821 493 -1242 1019 292
996 292 -1695 1028 1672 -1161 -47 868 -1689 -543 2060 -306 -1081 1048 -904 -1757 1635 929 -1459
1013 -1459 532 266 -2028 537 1992 -805 -338 1025 -1387 -817 2131 320 -1056 1072 -302 -1747
1029 -1747 1243 1266 -1199 254 673 -1753 -237 1657 -518 -593 1057 -816 -1301 1314 455 -1106 761
1046 761 393 -1556 155 1127 -825 -94 1132 -768 -902 1018 98 -589 1133 461 -1180 183 680
1063 680 -723 406 1186 -724 -984 515 -313 -548 1176 213 -1459 -169 306 -797 618 1266 -988
$$ packed form
945B34o91Q65n95r02J352N78j286M59N59j402L71J633j076p23J365q49r13J794
963G73o2j594J163M09j790R41J393j926O9J907j595p17K216j141j494K404k29
980G27k088J753L54k334J433J702k382J56J905k072k73K940j328j735K261p27
996B92j987K723O44k833J114R15k557J146K603k366p75K129j952q53L392p06k388
1013a459J991k66k294K565J455k797M67J363k412N70K948j811j376K128j374j445
1029a747K990K3k465J453M19k426J516J894k175p5J650j873m85K615q59j561J867
1046G61l68j949J711R72j952P31J226j900j34J920r20o87J722o72j641J363M97
1063F80j403J129P80j910k60J499q28k35J724r63j672J290M75j103J415O48k254
$$ plain form
1080 -988 -974 560 -376 -214 1678 294 -1449 177 347 -746 1082 1362 -1248 -751 685 -707 -87
1097 -87 1782 -389 -1588 458 -129 -948 1333 937 -1675 -200 747 -1151 384 1796 -920 -1011 1032
1114 1032 -528 -826 1797 263 -1540 712 447 -1408 856 1345 -1342 -152 1237 -1220 -442 1748
1130 1748 -546 -1055 1251 -399 -1541 1123 432 -1371 828 830 -1727 50 1297 -984 -58 1513
1146 1513 -1021 -1080 1415 -94 -751 1413 123 -1607 606 742 -932 770 1070 -1457 -534 1047
1162 1047 -641 -148 1372 -681 -1402 668 0 -660 1055 298 -1366 45 667 -557 401 979 -887
1179 -887 -623 829 -90 -132 967 -154 -936 326 392 -320 478 363 -822 -247 446 -191 27 466 -464
1198 -464 -555 331 24 -349 250 99 -459 15 318 -204 46 326 -208 -130 351 46 -296 228 162 -233 191
$$ packed form
1080i88J4J534r36J62J892j384j743J626J70j093J828K80k610M97J436j392O20
1097h7J869k171j199K046n87q19K281l96k612J475R47j898J535J412k716r1K043
1114A032j560k98K623j534j803K252k65j855K264M89k687J190J389k457P78K190
1130A748k294n09K306j650j142K664o91j803K199Kk557J777J247k281R26J571
1146A513k534n9K495j509o57K164j290j730K213J36j674J702L00k527R23J581
1162A047j688M93J520k053p21K070o68o60J715p57j664J411O22j224R58N78j866
1179h87K64J452r19m2J099j121p82J262O6p12P98j15j185N75O93o37K18M39r30
1198d64r1Q86l07l73N99j51n58M74L03n22K50K80n34P8M81l05l42N24o6l95M24
$$ plain form
1219 191 283 -303 -175 276 -21 -64 242 -132 -539 119 164 -205 166 79 -608 -165 431 -27 -61 339 -274 -423
1241 -423 442 302 -160 289 99 -602 188 571 -201 32 289 -574 -226 551 4 -354 212 -302 -572 401
1261 401 324 -423 71 102 -539 171 589 -217 -119 277 -286 -86 617 7 -308 287 -84 -261 437 214 -405
1282 -405 25 94 -391 225 380 -362 -210 152 -178 -51 359 -181 -381 119 -26 -159 325 -13 -433 68
1302 68 127 -103 252 222 -355 -26 257 -51 184 314 -207 -125 310 20 -51 228 -163 -422 141 112 -149 131
1324 131 -57 -441 -84 180 -110 13 69 -235 -99 288 126 27 107 -86 -160 244 216 11 65 -95 -188 62
1346 62 193 -31 -109 -132 -198 -21 182 37 -116 -98 -152 44 183 122 1 -114 -140 -7 123 121 5 -40 -121 -17
1370 -17 174 115 20 -9 -64 -5 143 204 -23 -39 -83 -147 114 102 -104 -154 -126 -182 51 175 -52 -181 -43 -33 50
$$ packed form
1219A91R2n86J28M51k97m3L06l74m07O58M5l69L71q7o87M43N96m58l4M00o13j49
1241d23Q65j40m62M49j90p01P90L83p72K33K57q63L48P77n47l58N66n14k70R73
1261D01p7p47M94L1o41P10M18q06R8L96n63K00P03o10l15N95l71j77O98k23o19
1282d05M30O9m85O16J55p42J52L62l30J27M10n40k00N00j45j33M84l38m20N01
1302F8N9k30L55l0n77L29K83l08K35J30n21Q2M35k90p1K79l91k59N63k9k61K80
1324A31j88l84L57K64k90J23N6l04J36L87j62r9Q0j93p4M04k8k05N4j60r3K50
1346F2J31k24p8k3o6J77K03j45j53J8n4J96J39o1j21j15k6J33J30kj16m5q1J04
1370a7J91n9r5k9n5N9J48O1k27j6m4o4K61j2k06n0K8n6K33J24k27j29J38J0Q3
$$ plain form
1395 50 241 87 -184 59 60 9 247 143 -137 -85 97 32 89 184 -77 -215 0 70 -94 79 -84 -358 -60
1418 -60 124 -52 16 47 -278 -211 258 79 -24 194 -64 -262 220 315 -51 84 75 -261 44 450 20 -159
1440 -159 117 -156 -209 451 222 -247 28 -17 -438 122 360 -231 -177 173 -358 -228 523 55 -422 192 23
1461 23 -406 383 398 -368 -15 345 -328 45 590 -189 -331 341 -42 -372 362 100 -552 132 202 -539 42
1482 42 352 -501 -140 462 -215 -279 452 -136 -420 525 210 -479 274 237 -486 225 608 -380 -183 377 -359
1503 -359 -140 655 -52 -532 221 -34 -469 414 407 -553 -120 270 -406 11 648 -244 -467 284 -56 -278 631
1524 631 314 -561 9 232 -323 262 675 -386 -408 395 -133 -215 610 78 -638 70 217 -444 200 436
1544 436 -593 -299 402 -311 -227 661 -137 -583 443 175 -471 398 436 -556 39 558 -439 -107 688 -244
$$ packed form
1395E0J91j54k71K43Jn1K38j04k80N2J82o5N7R5k61j38K15P0j64J73j63k74K98
1418f0J84j76O8L1l25O7M69j79j03K18k58j98M82R5l66J35rl36L05M06m30j79
1440a59K76k73n3O60k29m69K75m5m21N60K38n91N4L50n31J30P51m68m77O14j69
1461B3m29P89J5p66L53L60o73L73N45p79j42O72l83l30P34k62o52O84P0p41N81
1482D2L10q53L61O02o77o4P31n88k84R45l15o89P53l7p23P11L83r88J97N60p36
1503c59K19P95p07m80P53k55m35Q83pr60M33L90o76M17O37q92k23P51l40k22R09
1524F31l17q75N70K23n55N85M13j061k2Q03n28q2Q25n32p16P08J47o61O44K36
1544D36j029K94P01p13Q4Q88p98m46J026k68o46Q69L8r92N95N19r97L32P95r32
$$ plain form
1564 -244 -359 584 -81 -680 472 203 -657 306 409 -767 -64 609 -413 -207 694 -370 -736 555
1582 555 42 -489 638 180 -868 212 591 -430 215 661 -752 -470 740 -168 -304 775 -168 -862
1600 -862 455 360 -528 444 266 -988 -133 661 -390 -55 666 -570 -662 641 52 -395 666 84 -830
1619 -830 350 509 -459 293 579 -664 -275 690 -213 -251 615 -205 -701 453 148 -496 330 248 -682 52
1639 52 388 -392 -35 474 -305 -258 507 -33 -460 442 207 -364 239 216 -509 68 453 -260 -83 389 -314
1660 -314 -290 441 140 -291 236 6 -526 128 294 -261 -53 131 -401 -221 420 -4 -218 188 -79 -399
1680 -399 274 377 -141 31 157 -293 -42 505 29 -147 153 -115 -329 365 227 -295 -45 -37 -427 15 392
1701 392 -227 -197 138 -122 -208 353 120 -308 137 83 -282 229 309 -264 -27 303 -135 -21 354 -96 -220
$$ packed form
1564b44j15R43o65n99J152k69q60R63J03j176P03O73j022K06R01j064l66J291
1582E55n13n31J127m58j048J080L79j021O45M46j413K82J210r08j36J079r43o94
1600h62J317r5q88R72j78j254Q55P94j051L35P21j236r2J303n89m47J061n82r14
1619h30J180J59r68P52K86j243L89R65r03l8Q66q20m96J154l05o44Q26q2r30P34
1639E2L36p80L57N09p79M7P65n40m27R02k35n71O03k3p25N77L85p13J77M72p03
1660c14K4P31l01m31N27k30n32O54J66n55K08J84n32J80O41m24k14M06k67l20
1680c99O73J03n18J72J26m50K51N47m76j76L00k68k14O94j38n22K50Ql90M42L77
1701C92o19L0L35k60q6N61k33m28M45n4l65N11Q0n73K37L30m38J14L75m50j24
$$ plain form
1722 -220 310 -25 -249 277 66 -361 52 224 -220 77 180 -302 -115 276 -98 -120 208 -134 -229 290 93
1743 93 -240 129 97 -255 107 316 -141 -67 122 -230 -38 306 -29 -197 52 -138 -162 210 100 -252 -62
1764 -62 -35 -224 108 199 -161 -120 61 -106 90 234 22 -125 77 -61 4 275 5 -85 -21 16 -61 124 95
1787 95 -144 -99 35 -81 36 67 -123 -132 16 -45 78 67 -81 -132 -47 -14 68 88 19 -39 14 50 14 131 26 -39
1813 -39 13 73 65 69 24 -95 -70 -44 53 59 39 -86 -109 -20 101 2 39 -108 -116 17 32 16 62 -52 -62 41 44 78 66
1842 66 41 -100 12 86 77 12 -58 -131 -8 107 -38 -27 -71 -120 -42 -10 50 -42 -24 -92 -71 71 14 39 -17 -29 -13 58
1870 58 116 41 -30 18 -126 8 79 75 29 -69 -94 -56 84 42 -90 -75 6 -101 5 81 -123 -98 -22 -45 -5 111 15
1897 15 -69 -39 2 79 109 115 -31 -22 60 32 71 46 -32 -73 2 26 -25 24 -28 -153 -56 43 50 -29 -11 -142 -121 77 40 -48
$$ packed form
1722b20N30l35k24N26k11m27M13J72m44K97J03m82J87L91l74k2L28l42r5N19j97
1743I3l33L69l2l52L62K09m57P4J89l52J92L44l35j68K49j90k4L72j10l52J90
1764f2K7j89L32R1l60M1J81j67J96J44k12j47K02j38O5K71k70r0O4L7p7J85k9
1787I5k39M5J34j16J17L1j90rJ48o1J23j1j48n1Q5L3Q2K0o9n8N3L6l6J17j05o5
1813c9N2O0qMm5j19K5K6R7Ok0j25k3Q9J21r9L7j47qJ33J5j6M6j14j0J03LL4j2
1842F6k5j41J12P4ro5p0p3J23J15j45J1m4m9P8L2O0r2J8o8K1J42n7K5n6j2J6P1
1870E8N8p5p1M8j44J34P1mm6r8k5L8J40m2j32J5Q1j07J06P6k04K5P6k3M0J16r6
1897A5q4L0M1P7L0Oj46RQ2k8L9k5p8m1P5K4n1M9n2j25R7R9Pp9J8j31K1J98l7q8
$$ plain form
1927 -48 5 10 -109 39 142 -21 9 107 -70 2 213 94 -118 44 -28 -83 147 124 -93 -91 44 -140 23 140
1951 140 -102 -200 48 -32 -106 147 59 -200 45 87 -99 75 165 -199 -47 168 -41 -58 178 -24 -185 129
1973 129 141 -153 88 80 -188 -36 140 -85 -85 116 -120 -203 162 44 -158 113 65 -190 50 252 -90 -58 224
1996 224 -155 -48 255 -6 -235 141 14 -175 202 108 -241 -11 136 -193 26 275 -154 -191 143 -43 -154
2017 -154 216 37 -311 67 194 -159 140 235 -281 -91 307 -46 -90 328 -16 -268 186 178 -193 156 123 -363
2039 -363 -38 298 -171 -44 241 -258 -281 247 26 -267 244 55 -398 119 228 -201 64 327 -250 -80
2059 -80 380 -121 -186 330 -52 -280 293 159 -350 103 187 -356 31 295 -267 -168 327 -142 -145 338 -91 -346
2081 -346 249 164 -305 155 163 -368 3 311 -213 -76 287 -155 -225 313 45 -198 234 65 -365 191 254 -215
$$ packed form
1927d8N3Nj19J48J03j63L0R8j77P2K11j19k12J62p2n5K30k3k17KJ35j84J63J17
1951A40k42r8K48q0p4K53q8k59K45M2j86J74R0l64J52K15k09j7K36k02j61L14
1973A29J2k94K41qk68J52J76k25%K01k36q3L65j18k02K71m8k55K40K02l42L2K82
1996B24l79J07L03k61k29L76j27j89L77r4l49K30J47l29K19K49m29l7L34j86j11
2017a54L70j79l48L78J27l53K99R5n16J90L98l53m4M18l44k52M54ql71L49l3m86
2039c63L25L36m69J27K85m99k3N28k21k93N11j89m53N17J09m29K65K63n77J70
2059h0M60n01o5N16l82k28N73j34n09M53Q4n43L87K64n62R9M95m69lM83m29k55
2081c46N95q5m69M60Qn31L71L08n24J37L63m42p0N38k68k43M32j69m30N56O3m69
$$ plain form
2103 -215 29 247 -290 -108 316 -55 -224 162 -32 -288 185 176 -269 92 115 -272 11 351 -113 -139 221
2124 221 -85 -189 300 81 -232 119 65 -249 128 200 -252 -128 196 -186 -128 251 -101 -276 114 40 -171
2145 -171 137 133 -224 -18 233 -78 -39 274 -46 -164 216 62 -135 223 101 -247 89 163 -180 -46 184
2166 184 -215 -133 279 -59 -210 181 -26 -282 175 128 -270 -5 114 -281 24 279 -92 -158 153 -43 -112
2187 -112 261 100 -187 156 130 -173 147 180 -164 -116 136 -123 -59 158 -36 -231 97 -20 -171 116 86 -190
2209 -190 22 130 -140 -17 163 -113 -105 136 -22 -34 166 68 -201 115 87 -114 112 83 -170 -36 146 -104
2231 -104 -56 84 -97 -92 98 -30 -92 63 -40 -104 61 130 -55 -45 72 -51 -36 149 13 -44 15 -28 -44 51
2255 51 34 -88 -67 5 -81 -14 65 -105 -46 22 -28 -25 35 -16 -96 -44 42 -3 81 35 -6 -54 62 80 9 114 18 -71 -1
$$ packed form
2103b15K44K18n37J82M24l71j69L86j94k56M73rm45L61K3l87K83L40m64k6L60
2124B21l06j04M89k19l13L51n4l14L77P2m52J24L24l82N8L79l52j75L90p4k11
2145a71L08ml57K06K51l11L9L13l20j18L80j54j97L58j22l48L36P4l43J34K30
2166A84l99Q2M12l38j51L91k07k56M57m7l98K65J19l95L05K55l71o6L11j96o9
2187a12L73j61k87L43k6l03L20L3l44M8K52k59O4K17j94j95L28j17j51K87l0k76
2209a90K12J08k70J23J80k76QK41j58j2K00r8k69L16k8k01K26k9k53J34J82k50
2231a04M8J40j81NJ90j28o2J55j03o4J65O9j85J0J17j23J5J85j36n7N9m3j6R5
2255E1j7j22K1P2q6O7P9j70N9O8n0LO0n1q0N2Q6m5Q4m6m1m8J16J8p1J05r6q9P0
$$ plain form
2284 -1 88 24 7 11 -90 -4 60 -53 -59 -3 -115 -67 -26 68 -63 -99 -9 -65 9 110 -30 -65 -13 8 27 99 22 -32 2
2313 2 -9 8 33 32 -39 -55 -22 12 -11 -15 -32 -28 -14 -29 -3 5 -75 -63 -48 15 -33 -15 -19 -63 -30 33 44 35 -30 -20 -27 77 -1 49
2347 49 -6 -20 -54 7 50 37 -43 -47 -78 -25 86 -31 35 3 -59 -63 -23 40 33 -75 24 -8 51 60 31 -15 -5 -13 37 75 -18
2378 -18 16 7 -73 12 6 -22 32 -38 -81 -41 3 -5 -3 -41 -57 -38 -38 -12 -3 11 -10 25 57 28 9 -32 -44 40 51 26 34 49 -34 29
2412 29 43 40 -3 -7 -48 -23 -23 -52 -51 -15 -97 -35 12 1 -43 -24 -36 -62 43 42 -9 -31 3 40 -2 96 80 11 4 57 -6 -24 64
2445 64 -32 -56 6 15 5 80 -22 -118 3 -4 -56 -4 5 -93 -57 56 -18 -33 51 -94 -68 66 42 -7 109 38 -119 -2
2473 -2 115 -43 10 118 -35 -102 85 18 -46 30 9 -90 41 104 -130 -32 41 -182 7 93 -48 -57 110 -57 -30
2498 -30 135 49 -138 22 8 -77 44 142 -87 -78 78 -30 -4 122 -60 -177 14 7 -124 43 22 -196 -31 84
$$ packed form
2284aQ9o4j7Mj01Q6O4j13oN6j12M8M1R4j31l6R0n6P4J01j40l5N2K1J9P2p7n4L4
2313Bj1J7K5jp1j6L3L4k3mj7MJ4j5K6Qq0J2J5O3m8J8mm4L3O3J1ro5J0pJ04p8N0
2347D9n5j4l4O1M3j3q0ml1N3J11j17O6l2o2mM0O3pj08R9l2N9Rk9m6J0qN0L8r3
2378a8L4rq0Q5ok8N4p0m3M0M4qKl8j6J9%K6RJ4k1L5L2k9j9m1j2Q4J1k5QJ5q3O3
2412B9J4lm3mm1K5%k9JL6q2O2M7j1m4J9j2k6J05jn1k2L4L7m2R8j6o9pN3o3j8Q8
2445F4r6k4O2Rj0P5j02r6J21pn2N2Rr8L6J13p4j5Q4j45K6J34k4m9J16p1j57J17
2473bJ17j58N3J08j53o7J87o7o4P6k1r9J31O3k34R8P3k23J89Q6j41rJ67j67K7
2498c0J65q6j87J60j4q5J21R8k29RJ56j08K6J26j82j17J91pj31J67k1k18J65J15
$$ plain form
2522 84 -68 0 144 -67 -30 139 1 -79 204 69 -137 5 124 -83 -25 126 -55 -68 110 -39 -94 58
2544 58 -59 -133 78 62 -143 7 33 -136 -33 153 -110 -82 110 0 -44 146 -5 -90 85 118 -82 100 100
2567 100 -98 -24 101 -55 -12 144 -129 -193 140 55 -130 97 59 -217 -24 148 -133 5 111 -141 -169 102
2589 102 -32 -76 160 43 -130 101 145 -74 50 86 -136 -75 165 -49 -115 136 -23 -196 127 47 -147 25
2611 25 45 -150 22 148 -135 -97 152 -94 -122 183 0 -158 98 49 -94 72 103 -169 -7 190 -82 -35
2633 -35 127 -44 -144 76 -33 -110 133 29 -235 5 88 -66 -20 144 -136 -107 130 0 -96 155 -30 -115
2655 -115 151 147 -131 1 43 -129 -20 243 -48 -114 81 -127 -122 83 47 -138 55 -26 -131 -12 77 -101 -60
2678 -60 91 -100 -66 156 -12 -112 129 4 -55 93 50 -95 -12 85 -103 -7 149 -64 -111 93 -15 -75 88
$$ packed form
2522H4j52O8J44k11L7J69j38q0K83j35k06J42J19k07N8J51j81j3J78j49n5J52
2544E8j17p4K11j6k05J50K6j69J03J86k63K8J92j10m4J90j51q5J75L3k00J82%
2567A00j98P4J25j56M3J56k73o4L33q5j85K27l8k76J93J72k81J38J06k52k8K71
2589A02j34m4K36j17j73K31M4k19J24L6k22O1K40k14o6K51j59j73L23q0j94J72
2611B5K0j95J72J26k83L8K49k46k8L05j83j58K56m9j43J66L1k72J62J97k72M7
2633c5J62j71j00K20j09p7K43j04k64K40Q3j54M6J64k80K9K37j30r6K51j85q5
2655a15K66mk78J32M2j72J09K63k91o6J95k08NK05l6j85J93q1j05J19Q9j78M1
2678f0J51j91L4K22j68j00K41j25n9J48m3j45Q3R7j88R6J56k13m7K04j08o0J63
$$ plain form
2701 88 34 -112 29 56 -83 30 25 -92 -48 97 -23 -49 85 -14 -126 34 80 -50 23 5 -90 32 75 -19 -9
2726 -9 40 -59 -39 69 22 -34 14 -6 -80 60 98 -75 -19 37 -35 -8 62 1 -18 36 -7 -90 99 61 -77 15 58 -38
2754 -38 3 97 -65 -55 31 -26 -64 43 -13 -51 -6 25 -73 -42 -12 -82 -2 44 7 -84 73 52 -41 33 16 -10 -15 21 -54
2783 -54 -3 107 6 -30 48 -16 -14 84 -24 -48 -36 -6 -82 40 6 -64 -45 -22 -50 4 22 -23 -80 14 -1 -3 37 29 -34 -21
2813 -21 2 30 8 3 -39 -16 -18 4 64 8 34 -70 -18 -49 -38 63 -11 -80 -1 4 -9 38 -30 -20 1 -34 9 18 -23 58 -32
2844 -32 -24 59 7 -16 -25 4 23 -3 -28 -28 -13 -82 -1 -2 22 -15 12 -53 -35 11 -22 -29 -26 -8 -37 61 34 19 -5 -30 23 -45 -8
2877 -8 21 -15 2 6 -51 57 26 23 -16 5 11 -12 -34 -23 -72 -53 -9 23 3 23 -2 -35 65 68 -18 -10 2 -46 48 67 28 20 23
2910 23 -20 13 30 20 -32 -21 10 16 -31 -54 -23 -28 32 -56 26 37 -22 -63 -22 -25 -7 72 -14 -41 10 32 16 11 38 -24 -26 35 6
$$ packed form
2701H8n4j46J41K7j39J13nj17M4J45j20k6J34r9j12J60M6j30P3j8r5J22M3r4J0
2726iM9r9K0J08m7n6M8k0p4J40L8j73N6N6p2K7P0o1j9N4m3q3J89l8j38R2M3r6
2754c8M1R4j62J0Q6n7l8J07n6l8M5L1r8L1L0p0Q0M6l7r1J57k1r3P4j7k6nL6p5
2783e4N1J10j01l6P8o4KR8j08k4J2L0p6J22l4p0J9K3k8N4J8m5n7R4j5kM0qo3J3
2813b1K3K8k2nm2K3kK2O0n6K6j04N2l1J1J01p4o9P9Nj3M7o8J0K1l5M3Rm1Q1r0
2844c2QQ3n2k3rK9J9k6k5%J5o9Q1jK4l7K7o5J8M6l3pLJ8k9R8k7j5k4k5N3o8L7
2877hK9l6J7Mn7J08l1ll9K1Ok3k2J1m9J9M4L2k0K0k5l3J00Lq6QJ2m8R4J9l9qL
2910B3m3L3J7j0n2J1L1Om7k3L1nO0q8Q2J1n9m1M1lJ8P9q6k7N1K2j6nK7o2kO1k9
$$ plain form
2943 6 27 62 14 -62 86 31 -14 -5 23 -75 29 60 -66 -21 -56 -22 -101 -6 8 -60 44 -34 -86 26 26 -25 35 26 -45 -33
2973 -33 47 53 -21 62 -44 -57 2 49 -64 -11 50 -78 41 12 -48 -12 52 -38 49 24 6 -50 29 43 -50 54 5 -2 12
3002 12 49 -39 -36 29 -26 -101 -7 37 -14 2 2 -90 20 49 -48 -43 16 -65 -37 22 48 -31 80 15 -95 29 76 -29 59
3031 59 80 -84 18 106 17 -13 53 -3 -51 83 27 -16 21 -37 -83 29 91 -102 -30 115 -49 -43 92 0 -30 40 -42
3058 -42 -47 -14 56 -100 -10 26 -48 -26 56 8 -64 73 24 -64 38 -7 -89 18 78 -17 -36 23 -99 -10 76 -47 -83 27
3086 27 -41 -108 23 84 -98 -3 97 -146 8 78 -40 -76 22 -75 -137 125 51 -92 19 -3 -142 27 63 -95
3110 -95 -43 68 -46 23 116 51 -33 38 14 -64 77 49 -101 -10 98 -67 6 94 -43 -139 64 -9 -96 97 23 -113
3136 -113 39 -15 -50 -23 83 -39 -82 45 -66 -73 30 -3 -48 83 55 -118 -35 56 -61 7 63 -81 -83 68 14
$$ packed form
2943FK1L5m8p6J48n5m5RK8r8J04L1j26M5l5L4p9R5J4o8J04p8n2J12%n1O0rp1J2
2973c3Q0Op4Q3j06j3N9M7j13N3O1j28J19k9o0L6O4r0Q7k5j8n6P9J4r3J04m9pJ4
3002A2L7q8LO5n5p5R4M4n1J6%r2J10K9r7NN9q1K8N9K6p9J11o5j10J24M7j05Q8
3031E9K1j64J02Q8q9l0O6n6m8J34n6m3L7n8m6J12O2j93P2J45j64OJ35r2l0P0q2
3058d2nL3P0j56R0L6p4K2Q2m8p2J37m9q8J02m5q2J07O0r5j9N9j22Q9Q6j23l6J10
3086B7o8o7J31O1j82R5J00k43J54P0j18l6R8r7o2K62p4j43J11k2j39J69L6j58
3110i5N2J11j14O9R3o5q4P1k4p8J41k8j50R1J08j65P3Q8j37r6K03p3q7J93p4j36
3136a13J52n4l5K7J06j22m3J27j11pJ03l3m5J31k8j73Q3R1j17O8N6j44kJ51n4
$$ plain form
3161 14 -3 91 -13 -80 -12 -4 -76 24 30 -67 -17 65 -71 -36 52 -67 -89 -15 -64 -41 47 13 -60 -26 14 -39 28 67 -61
3190 -61 -58 100 67 -7 96 17 -52 35 11 -49 29 38 -39 -49 20 12 -7 21 33 -44 22 9 -56 25 -15 -15 40 76 -67 1 81
3221 81 -46 -49 80 24 -54 50 -5 -47 47 39 -39 -6 19 -80 15 56 -36 -83 42 -18 -28 36 68 -54 27 19 -50 67 46
3250 46 -39 2 61 -49 -40 62 33 -40 -10 30 -56 4 -14 -53 -1 21 -34 -21 -8 -55 -48 -22 21 -40 6 7 -96 38 87 -18
3280 -18 16 21 -74 5 48 -7 19 -9 24 -22 61 36 11 7 -22 -60 10 11 -41 -36 -16 8 -29 -28 -30 -88 -48 -38 -4 -9 54 -33 27 -32
3314 -32 44 41 31 -26 -3 -21 -5 -29 8 16 -60 -40 65 13 -32 26 -71 41 4 3 12 -31 -39 17 -70 -54 -61 -25 23 -19 -12 63 31
3347 31 -43 -13 -39 -23 -42 23 -24 -20 20 -23 -9 10 26 -29 31 -12 -62 -6 -30 -28 -59 -19 7 -17 -1 -50 -13 64 -11 -32 12
3378 12 5 -11 11 52 -59 22 -42 -22 -30 -29 -47 -21 -26 -14 -27 0 29 31 -14 -51 -21 -32 37 33 20 15 -9 9 -29 -20 20 -10 -18 -9 -15
$$ packed form
3161A4j7R4j04o7O8Qp2J00Or7N0Q2j36L5Q8j19k2P4m9K3Q8l4p3L4M0n3O7L9j28
3190f1LJ58l3p4J03p9o9Q7k4o0P8Rp7j0O9qj9K8J2p7O6j3o5Q1m0%N5L6j43O8Q0
3221H1j27lJ29n6p8J04n5m2R4qp8L3K5r9R5M1r2m7J25o0j0O4L2j22Q1qo9J17k1
3250D6q5M1N9j10RJ02k9p3L0M0q6O0j8l9N2K2n5J3J3m7PK6M3o1M6Jj03J34M9j05
3280a8L4Nr5P9M3n5K6k8L3m6Q3k5k5mk9l8P0Jn2NK0K4l7Jkn8M0J0L4nO3q7O0n9
3314c2P6lj0n7K3j8J6k4L7Qp6K0J05n2m5N8r7J12l7jRm3qN6q7J6pL6M8m2PP5l2
3347C1p4L0k6J6j9O5m7MM0m3J4J9J6n5O0m3n0N6k4Kl1M0K6k4J6m9L7P7p5k1M4
3378A2pj6K2M1j11Q1o4K0qJj8K6nJ2j3K7K9Km5l7L0j1O9mj3nk4J8l8RM0l0qRo
$$ plain form
3413 -15 25 -17 -5 -25 3 18 -14 -48 -26 4 -7 -31 7 -30 -37 -27 37 -32 18 -35 -6 -29 17 26 12 26 -6 16 25 73 -26 24
3445 24 -51 -32 -4 8 -15 2 -55 -51 24 -35 43 -37 9 -17 -48 10 32 3 -42 -34 -11 -5 -42 0 23 45 40 -40 29 -33 -50 23
3477 23 -5 -8 -32 44 -67 3 21 -80 -19 38 -16 22 32 10 -25 -16 12 -61 15 18 10 0 57 -26 -21 21 -56 -39 -1 -66 -55 39
3509 39 1 -63 -15 -1 -11 -44 30 -3 -45 4 -26 -100 -35 -46 -28 8 -59 -98 18 87 -32 -53 16 -22 -4 75 13 19 -2 24
3539 24 -41 42 78 -48 -18 -5 -94 -40 26 -37 -4 -24 -4 -78 9 33 -74 -34 -2 -32 -23 49 -9 -28 52 9 -67 37 -1
3568 -1 -18 4 53 -89 17 44 0 -42 10 -52 -32 113 13 -68 -7 21 -91 2 -22 -48 -27 82 14 7 51 -14 27 19 13
3597 13 -35 15 -11 -6 23 37 -49 -21 30 -72 -26 11 -42 -20 47 23 -62 -7 12 -102 -72 14 -19 23 83 -17 -9 21 9 -10
3627 -10 80 -18 -81 -7 9 -35 12 56 -31 -16 6 1 -3 74 -40 -63 30 -7 -62 -27 48 -68 -12 63 -13 -27 26 -25 -6 27
$$ packed form
3413a5M0m2J2k0K8J5l2l4K2L0j1k4L8l7pJ0O4o9N0n3K9k3M6Rj4J4l2K2RM8r9N0
3445B4p5J9K8J2k3J7n7MP5n9P8q0M6k6l1N8K2k9m5QK3Ol7M2K3K2nq0O9o2j7P3
3477B3k8lk4P6j11P0J8j01O1N7n4L8J0k2l5RK8p3P6Lqj0N7q3NM2p7J7L8o5J1R4
3509C9l8o4M8J4j0l3P4l3m2M9l0p4O5j1J8L6o7l9J16O9j19k1O9l8J8P9o2Ok1K6
3539B4o5Q3L6j26L0J3q9N4O6o3L3k0K0p4Q7K4j07M0L2l0RP2n8j9Q0m3p6J04l8
3568aj7K2M9j42J06K7m4m2N2o2K0J45j00q1O1K8j12R3k4k6K1J09o8pM4o5M1qo
3597A3m8N0k6NK9J4q6K8N1j02M6L7n3K2O7k4q5N5J9j14L0Q6l3M2O0j00QL0j2j9
3627a0R0r8o3P4J6m4M7M4q7J5K2nmP7j14k3R3l7n5L5P5j16N6P5p6j4N3n1J9L3
$$ plain form
3657 27 -3 -21 62 3 6 16 -29 -47 -30 65 23 -28 27 -19 -48 47 36 -7 26 42 -42 5 -6 -84 0 40 -41 -14 21 -26 35
3688 35 33 -33 -13 22 47 -2 -6 45 -50 -44 18 6 -14 41 -34 -22 8 -11 -17 -36 1 -27 35 50 -18 -2 16 5 -57 28 -42 -33 -27
3721 -27 -5 -47 18 42 -24 19 2 -18 -12 68 -33 -41 66 30 -66 -10 -28 12 16 29 32 -28 24 20 -53 24 -21 11 73 -13 -50 12
3753 12 38 2 -6 -36 -74 28 17 14 50 26 10 -40 -41 -22 -11 -20 -40 11 -5 20 -9 -6 -7 -11 -55 36 -47 -34 5 17 -14 47 -31
3786 -31 5 79 31 -48 -5 18 -9 -14 -3 -7 -31 30 43 15 24 12 -17 14 -14 21 -43 -55 7 -31 -19 4 -26 26 -63 -49 16 -4
3818 -4 -9 34 1 16 -30 -19 26 8 15 5 29 -47 4 14 -12 4 53 -11 -9 -26 20 -31 26 8 -56 11 -24 70 25 -9 10 -23
3850 -23 22 18 17 -19 24 24 15 -44 26 -41 -66 1 52 -10 20 19 13 18 -5 62 0 7 46 39 1 39 -4 -5 55 -56 36 26 3 -30 -20
3885 -20 44 -15 24 6 -47 -24 6 -30 -6 14 1 -22 21 -39 -36 -35 15 -47 -15 14 -26 21 -3 6 26 -9 -7 0 8 32 -34 45 11
$$ packed form
3657B7l0j8Q3n9LJ0m5j8J7R5m2n1N5m6k9R5j1m3L3J6q4M7j1p8Q4M0q1K7L5m7O1
3688C5ko6K0L5K5m9mN1r5OO2j2k0N5p5J2L0j9oj9L7k8O2J5o8J6J8j1o2Q5p0RO
3721b7K2m2O5K4o6M3j7k0OQ0j01qJ07l6r6N6j8M0MJ3Lo0N2mp3P7m5L2O2q6l7O2
3753A2K6l6ql0l8J02j1lL6k4j6n0jJ9J1rk0N1j6K5k9Ljmm4R1q3J3L9J2l1O1p8
3786c1L6P4m8p9M3K3k7nJ1mk4O1J3k8Rj2k9L1k8L5o4j2O2l8J2K3l0N2q9J4O5k0
3818dnM3l3J5m6J1M5j8Pj0K4p6N1J0k6J6M9o4Kj7M6n1N7j8o4O7l5R4m5l4J9l3
3850b3M5mjl6M3%rn9P0o7k5O7N1o2L0joNk3O7o2PL9pl8L8m3jO0j11R2j0k3l3J0
3885b0O4n9L9j8n3K3L0l6K4K0j3k3M3o0LJN0o2L2K9m0M7k4RK0l5KPQK4o6P9l4
$$ plain form
3918 11 -39 -41 -55 -2 -4 -18 29 -20 -15 4 -46 -14 -9 17 -15 -27 -33 26 2 -20 5 -17 -5 20 -45 -15 -11 7 2 -23 29 -24 -3 14
3952 14 34 12 17 -45 -32 -26 -3 2 38 38 2 28 -17 -4 -48 68 31 -24 -8 -6 -36 20 -28 -54 -6 -55 -24 -54 -14 31 -1 41
3984 41 46 -21 53 38 -32 -65 -36 -15 -32 19 1 19 28 -15 -32 16 18 -31 31 29 13 -23 22 18 16 33 68 -28 26 -16 -56 -10 -5 -44
4018 -44 -49 -35 2 19 33 -4 -17 -52 11 -36 26 -5 -10 54 -35 25 5 38 -11 27 -16 -33 -9 29 -28 -35 0 -14 42 15 -8 17
4050 17 -33 70 -61 -24 7 -57 -18 -26 25 -55 8 15 19 13 13 8 -27 20 -3 9 15 -60 -44 54 53 -11 21 -16 -46 22 84 -35 -14
4083 -14 -10 32 -32 -19 1 -12 -4 -1 -22 -43 -25 12 12 28 -72 17 17 22 55 -28 58 4 32 44 -33 2 -20 -14 27 -2 14 -17 22
4116 22 -33 -102 35 -19 16 -36 16 -60 61 33 2 36 10 -6 -3 14 -3 -10 -33 -39 -44 -14 41 -23 -51 -16 -13 -1 -38 22 -33 17
4148 17 -105 -29 -26 -31 -13 -37 22 -96 30 22 -32 53 27 14 -9 30 -8 21 28 27 -15 47 52 -46 25 76 -2 16 -26 -79 52
$$ packed form
3918A1n0kj4N3kj4M7m9NJ9n0L2NK6l2j2oN9k4k2K5k2J2K5o5L0MJ8nk5N2n3K1J7
3952A4K0k2No2J3OK3NL6%l6K6m5J3m4J16l7n5J6Kl0N6m8k6M8m9L1l0M0M5l2M2
3984D1No7P4j5p0l3K9K1j7N1j8J8Rm3j7M8Km9O2kj6l6M5mkJ7L5r6N4m2m0M6Nl9
4018d4nJ4L7J7J4l7j3l5O3m7O2l1nO4q9O0k0L3m9L8m3j7K4L8n7pL5j4N6k7k3K5
4050A7n0J03j31L7L1o4L9qN1q0O3PMo%nl5M7k3J2Op5J6R8jo4L2l7l0O8O2j19K1
4083a4MM2o4J3K0j3QLk1k1J8L7%J6j00Q9%NL3q3Q6n4K8J2p7L5k2OM1k9J6l1L9
4116B2n5o9J37n4L5n2N2p6J21k8l1L4k6j6LJ7j7pk3onL0N5o4k8L5LJ2l7O0n5N0
4148A7j22P6LnJ8k4N9j18J26qn4Q5k6j3k3L9l8K9Pjm2O2Nr8P1N1p8J8m2n3J31
$$ plain form
4179 52 12 26 -7 -8 16 -55 31 -19 21 -17 -21 -3 63 14 -23 -7 5 6 -36 48 -7 6 -28 -9 -49 65 -30 2 -18 -7 -55
4210 -55 0 22 -40 50 52 46 -53 16 -5 -9 -32 36 -46 4 -32 -25 -27 -12 -68 -47 -11 -16 -28 11 -19 -37 -22 5 -26 -36 9 -4 -33
4243 -33 -4 -13 4 9 26 19 6 -3 -5 -2 24 3 40 -10 0 13 -8 51 -58 -4 18 -36 13 13 5 -9 33 -12 -8 31 -13 -2 -26 -87
4277 -87 8 2 14 -54 -6 37 -2 18 -10 -27 -64 23 49 20 8 49 -36 -8 -8 -23 17 76 -45 -50 -27 -8 24 14 -37 -39 6 48
4309 48 -24 -50 -8 -15 7 -52 8 -10 41 -24 -6 -12 -7 0 11 20 5 10 14 28 43 5 24 19 -16 -18 -39 20 57 21 37 19 8 57 18
4344 18 -25 -10 31 42 7 20 14 26 24 -43 -27 4 -37 -27 29 12 -32 -3 46 -38 -16 -19 -23 -11 20 35 -14 38 13 30 -1 -7 -11
4377 -11 -17 6 62 -7 70 18 16 -23 54 -18 -16 26 -5 -31 -24 -46 30 -18 -4 -9 -41 -48 18 -18 -4 -30 -5 24 0 24 -2 -1 -50 31
4411 31 -59 5 40 54 -3 -4 0 18 55 -23 12 -9 -17 6 -23 11 43 26 -12 11 -5 23 -28 -1 -6 4 -51 -21 17 -28 -7 1 8
$$ packed form
4179E2m0J4l3jK4p1Q6n0M0l8mJ8O6m9l7J6J2Jm2Q4n5J3l4J9m0J14r5L2k0J1m8
4210e5N5K2o2R0Kor9O9k1mk3O8q2N0l6PkJ5n6K1L6nj2L9l0j8J5K7l1j0M5j3k9
4243c3K9rJ7NJ7pj3rkLK6k1L7n0J0J3k1N9j09N4K2n4M9%qj4M2m5ML9m4J1k4o1
4277h7R5oJ2o8M8M3l9K0k8j7l7Q7K6k9j2M1q5K8%j5M0N9j21nK3J9L2j0n1kM5M2
4309D8p2k6M2pK2n9O0j8N1o5J8oNPJ1Rj5NMJ4J5l8J9nl5kk1N9L7l6J6j8j1M9l9
4344A8m3J5M1J1l5J3oJ2ko7J6L1m1J0N6j7m4K9M9q4K2lmJ2L1J5m9N2k5J7l1om
4377a1oK3N6o9P7n2kl9P7p2KM2l1k6Pk2P6m8J4nl2pO6l6J4k6K5K9k4K4k6Jm9Q1
4411C1r0O4L5J4n7jMJ8L7p8L5k1qK3k9L4L2j7l8K3j6K8n1K7nJ0n5L0L8m5K1QP
$$ plain form
4444 8 -22 -42 37 -33 -9 -10 -18 -18 77 -28 -2 26 -64 59 31 -25 -29 -19 -53 -20 -13 -50 -14 47 25 54 38 -22 -8 8 -18 -14 -12
4477 -12 5 -30 19 10 12 -44 -42 26 24 -3 -4 -9 -12 74 -42 -22 10 14 -49 -33 36 38 -51 -20 44 4 -20 -25 -32 25 49 -27 -7 16 -18
4512 -18 10 -9 -79 28 16 -16 -30 -13 58 -13 23 -2 -27 22 11 20 -40 -6 -28 32 -46 8 -25 -7 4 22 44 9 -6 58
4542 58 -27 -37 65 34 18 -4 16 -14 -7 -12 30 -58 -19 4 21 38 5 -64 -12 -15 -32 19 30 -1 55 3 -29 -21 -40 19 -1 53
4574 53 -22 -36 -11 1 5 8 15 -44 6 11 -3 -32 13 24 -24 1 9 -13 -9 7 -33 -45 9 -12 29 -43 -21 -39 15 -21 -24 -22 -48 -42 -8
4609 -8 48 -16 -10 45 -52 -17 -10 2 42 -28 -11 6 47 6 7 11 -33 -16 5 27 7 24 79 27 -37 49 -9 -53 -8 32 -19 -76 -2
4642 -2 -95 -10 -9 -1 -54 40 -30 -26 -2 -58 -17 6 -28 -15 45 12 0 4 27 -9 17 -2 1 -3 41 -1 -11 -24 5 15 -37 13 -36 -78
4676 -78 11 -55 -13 9 25 9 -23 23 -3 50 8 1 25 12 17 21 -27 27 -81 16 7 37 -16 10 17 -1 -3 -26 3 28 -85 -4
$$ packed form
4444Hl0k0P9p0K4jq%R5j05K6K8r0J23k8n6mJ0l4L3Pl7L6O1k2K9j6o0J4J6k6MK
4477a2J7l5M9rKn6KO8kk7jnlQ6j16K0L2Mo3J6O9Kq9L1O4m0k4npN7K4p6K0K3l4
4512a8K8j9p0J07j2l2j4J7P1p1L6k5k5M9j1Ro0L4k2O0p8N4l3J8J1J8K2l5j5O4
4542E8q5j0J02l1j6k2K0l0PnM2q8L9K3J7J7l3o9N2lj7N1J1l1N6n2l2Qj9N9k0N4
4574E3p5j4K5J2MLPn9N0Nj4k9M5J1m8K5Qk2MJ6m0j2N4k1M1p2K2j8N4l6lKk6OL4
4609hN6o4ON5r7L5PJ2M0p0J7J7M1m1JMm4J7K1K2k0J7N5n2o4Q6n8m4M5M0n1n7P4
4642br3Q5JQn3R4p0MK4n6M1K3l4J3O0l3j2MK3l6K6j9LmM4m2j0j3K9J0n2N0m9m2
4676g8Q9o6M2K2J6j6l2M6k6N3m2pK4j3NMm8N4j08R7rL0n3K6Pj8kk3K9K5j13Q1
$$ plain form
4708 -4 -8 -5 14 7 17 -22 -10 59 -10 64 -35 63 3 -35 -16 18 33 -62 3 31 13 -8 -31 -6 -46 -15 7 0 -43 -6 21 -35 8
4741 8 8 12 31 -37 57 21 -11 -33 16 18 2 31 12 -15 13 6 36 24 40 6 28 -7 19 4 6 62 3 2 22 -4 -64 -39 12 14
4775 14 -31 16 14 14 -46 -16 -15 42 -11 13 2 25 -14 7 17 44 -17 35 15 8 22 53 21 19 -9 -26 24 23 -45 -14 14 -30 24
4808 24 5 -52 3 -47 5 -19 16 41 9 41 -6 -1 -8 16 -45 4 -4 -27 -19 14 24 -24 12 51 -4 -72 -30 -40 -70 -35 8 34
4840 34 -28 -32 3 27 39 -9 17 -17 19 -5 -14 -12 3 -10 -13 -45 -7 -37 22 -23 -14 -34 7 13 18 35 7 14 17 10 12 13 34 -14 53 37
4876 37 -42 8 18 15 -35 7 33 14 -33 -6 18 19 0 12 -44 25 -1 -33 3 46 -25 -4 -2 -1 -46 13 -27 -12 -33 27 33 15 27
4909 27 56 29 -52 58 -19 2 17 12 55 34 -23 14 -23 -16 -34 65 -67 31 7 -10 -13 6 14 28 -23 5 -56 45 -18 -27 9
4940 9 8 -25 -70 -86 -15 39 7 13 -54 -70 -2 50 24 -17 69 -11 -17 2 -6 -8 -28 51 29 -16 28 22 -44 1 35 16 11 17 -6 -41 34
$$ packed form
4708dmLJ9pJ0l9J2O9o9P4r9R8o0l8J9L4J5r5O5K8j8k1k3K5m0L1K2pm3L7K7n6M3
4741H%MJ9o8R4l6l2k2M9Kj6K9j9k7K8pL0j2J6l4K2l5K6j5KN6n9jK0k6o0K5N1K
4775A4m5M7k%o0L0JN7n3K4j1K3l9K1J0K7o1N2k0pJ4L1l2kk8j7N0jo8L1K8m4N4
4808B4j9n7N5n0N2k4L5K5l2L2m7NpK4o1M9qk3QL3J0m8L6L9n5o8M2j0l0L5M3K6
4840C4o2mL5K4J2m8K6l4L6k4rKJ5j3ll2L8l0N9m5Rk0M1ONJ7k8PLpKJK1m8O7j6
4876C7p9N0J0ln0M2K6j9m7K7K4Jj9J2n6O9k6l2L6M3p1K1KJm5N9m0J5k1O0Oj8J2
4909B7K9k7q1J10p7K1J5nM3k1n7L7l7Pj8R9j32R8k4j7lJ9QJ4n1K8o1J01o3rL6
4940Ijl3m5j6P1N4l2Oo7j6O8N2k6m1Q6q0oJ9qkk0P9k2m5M4oo6M5L4j9nOk3l5P5
$$ plain form
4975 34 4 -36 17 37 -15 51 20 -17 10 -17 -27 -32 0 -11 10 -35 4 -24 10 36 -17 -5 28 0 48 -46 5 -1 12 26 9
5006 9 33 -60 36 -29 -23 4 8 -25 -6 33 37 -22 15 -18 7 -41 -18 -31 -65 23 3 -25 -4 -5 -11 -5 -16 1 -6 28 19 -4 76 74 -21
5041 -21 3 -22 -11 -22 20 10 5 5 -44 4 35 9 -73 -17 -16 47 -45 23 -8 9 -11 29 -26 -5 -72 1 -26 -1 1 3 0 -34 16
5074 16 44 -38 -9 20 -36 -10 -9 26 -9 -7 9 -48 -3 -7 10 29 16 2 -42 20 -25 -42 29 23 -17 -8 8 -32 -9 -29 -35 31 6
5107 6 5 0 14 -17 -13 1 -11 -11 8 25 -11 9 -46 14 46 47 20 -33 -6 -12 0 0 14 -44 19 -7 31 38 14 -40 -11 55 -37 -33 15
5142 15 5 18 27 9 -20 8 -21 -29 35 -9 -23 -7 18 11 -31 -12 -44 -24 -20 -7 -10 11 -15 -46 27 39 -21 -2 62 22 22 12 17 56
5176 56 -20 16 -37 6 -4 -60 -62 -14 24 -16 -4 13 -62 -14 -35 -3 7 30 -84 -15 23 39 -28 22 36 7 -20 -22 -57 26 17
5207 17 -2 -5 13 30 -28 54 48 -13 -12 -14 40 -4 -74 3 -8 -25 -39 22 -10 -8 -24 -44 4 15 20 -14 -25 -62 -2 -29 -33 30 -36 -17
$$ packed form
4975C4l0m0N3K0n2O6l1l7K7k7j0nL2j1K1m5L9k8L4K6n3J2L3k8M8r4N1oJ3J4j7
5006IK4r3R6o5OK7Ml3J9L9Mn9L7l3K5m8K3j3l4Q8k0k8K1joOj1J7pL4rk3Q0kr5
5041b1K4k5J1j1M2j0n%m9M8L1k6q2N6JO3r2O8l1J7k0M0n5K1o7P3k7K5KKll4N0
5074A6K8q2K9K9n6K6JL5l5KJ6n7M5mJ7J9j3j4m4O2m5j7P1om0RJ6m0K3k0oO6k5
5107FjnJ4l1MJ4j2%J9J7l6K0n5O0L2Jk7n3K7oJ2%J4n8O3k6L8Pk4n4K9O6r2MM8
5142A5j0J3Rj8k9K8k9qO4m4j4J6K5pm2J9l2K0MJ3lK1k6l1P3J2o0J9O4m0%j0NL9
5176E6p6L6n3M3j0n6kM8L8m0J2J7p5M8k1L2J0K3j14O9L8J6o7N0J4k9k7kl5Q3r
5207A7j9lJ8J7n8Q2oo1JkN4m4p0P7j1j7j4O1l2Kj6k0M8J1Nl4j1l7O0k7mO3o6J9
$$ plain form
5241 -17 -19 1 -5 -27 -34 -23 69 18 -17 23 53 14 -25 45 1 6 15 -21 -24 10 17 -18 19 -21 -11 28 -3 -28 12 -23 56 12 -2 15
5275 15 -26 -28 -1 -15 -20 -62 -12 11 2 18 17 40 -11 -14 44 -17 14 34 -8 3 16 -23 5 -1 -65 -8 66 -15 -11 -10 -3 -1 9 21 18 -15
5311 -15 -5 0 20 23 -25 17 -55 28 20 -61 -36 -31 -23 17 -7 -1 -16 -14 2 -59 -39 14 -62 22 -51 34 -19 -40 -16 26 52 -31 9 55
5345 55 -29 26 15 -3 14 -22 -8 -22 7 42 30 -7 -47 -42 -24 44 -25 -33 -26 -56 -53 -13 3 -22 -30 10 64 -8 16 -2 -33 30 -29
5378 -29 -3 24 -13 -28 74 -11 16 -15 24 17 12 -24 -35 -28 -35 -57 -20 -5 13 -59 55 -11 -10 -12 -11 -12 20 -2 -16 -50 -37 3 9 -21
5412 -21 31 1 9 -9 24 -20 19 9 20 -30 22 16 -11 8 13 74 -44 -5 25 7 -17 -2 -30 -36 60 -23 -51 0 -8 5 -4 -29 -84
5445 -84 -4 -14 -22 -12 28 -17 21 17 15 -44 25 37 14 23 -10 17 -20 20 18 18 -56 -15 46 -10 32 46 -4 20 29 24 45 12 -33 -2
5479 -2 -49 -80 -38 1 2 3 15 -32 -51 30 -17 -79 -22 20 -65 5 -36 -21 -39 -8 25 57 54 -41 31 -16 -34 -33 -63 18 34 0 7
$$ packed form
5241a7kK0ok2pJ1R2n1l5M0L0l9l9P0m4NRl6lL4Pl5L7m0J0L9l1k5M0l5P9m4j4J7
5275A5m1kK7j4nm2N0K3rJ6jK3n1lN8o1L1K0m2J1J3l9K8oo4N7P4q1MJPKJ0J2ll3
5311a5J0NK0Lm8M2p2Q3qq1K5NQM0k4Oj5KJ6o1K0N3p6Q4p3Q5n3k1K4M2K6q3M0M6
5345E5q4N5j1j8J7l6J4j4K9L5j2l7m0NJ8O8o9qPl0LM0J6k5qM0N4p2K4j8l1O3n9
5378b9K6K7l7j5J02q5K7l1L9pnl6j1Ppk2L7J5J8p2J14o6JkJjL2k2j4l4J3M0Ol0
5412b1N2l0Qj8L3m4L9j0J1n0N2ok7J9NO1j18L9L0j8k4J5k8oR6q3k8N1qJ3rk5n5
5445h4Q0j0qJ0M0m5L8mkn9O9J2k3Rl3K7l7M0k%p4M1O1n6M2J4n0K4RnK1l3m5L1
5479bm7l1M2L9JJJ2m7j9Q1m7o2N7M2q5P0m1J5j8L1L3L2lr5P2m7j8Jl0Q1J6l4P
$$ plain form
5512 7 17 -23 -43 36 -23 -16 -68 26 28 21 -25 8 -8 2 7 -17 -66 -50 20 -1 -57 -41 -43 -17 22 -24 -19 -2 11 -3 -4 -31 -49 5
5546 5 -7 -29 45 37 20 -15 46 -16 -53 9 -25 22 5 -19 -21 8 -26 -10 -26 29 -37 -57 -1 -17 -5 -23 5 16 -17 41 -44 -26
5578 -26 31 2 19 -23 0 41 5 -3 7 43 -17 -27 -7 23 53 11 28 11 5 1 -54 8 37 -17 14 6 -2 -19 -6 1 -8 -40 -6 -34
5612 -34 -17 48 -28 -18 11 -50 -9 -1 0 -49 51 9 31 24 -27 -55 43 74 -50 21 4 -1 -46 -8 13 -20 -14 -14 -3 11 38 16
5644 16 15 -38 10 -3 -62 -45 -3 -46 -48 38 -15 16 12 -31 -18 -13 26 17 -15 -32 14 14 8 51 -22 -14 34 14 22 -15 -20 39 -21 -7 -2 -49
5680 -49 27 22 -48 9 31 -56 1 -17 -11 -31 -33 -29 -65 -34 28 12 15 -20 32 -15 -13 37 46 -56 -13 -28 16 -21 -27 15 -1 25 -19 28
5714 28 28 30 19 -42 42 -2 -35 7 -39 -16 1 40 -52 14 6 21 -65 -12 10 -54 5 -19 18 -37 -17 -42 -23 4 13 17 48 29 -9
5747 -9 30 26 -14 35 31 -20 64 -21 12 26 -23 -28 -6 21 38 -22 8 6 -4 -35 16 0 11 -11 -53 40 -14 -39 46 52 -38 -46 -20 24
$$ packed form
5512GJ0m0k0P9n9Pn2R4Kpm6L3j6J0Nk4m9J6P0k1n6J6kK6L9m6NJ7J3j4jk7j8N4
5546Ej2k2P4qj7l5O1o2l7O2l4M7j7k4kK9l4J6j6N5o6k0N6j6J2j8K8J1l3N8q5J8
5578b6N7k9J7m2K3M1l6qJ0L6o0j0K0L0L0m2J7j7omn5O2K9n4L1qqj7J3Prl2L4k8
5612c4J7O5p6J0K9o1M1QJm9J00m2K2pn1k8R8L1j24P1j7nm5L8K1l3O%J1J4K7k2
5644A6jn3M8j3n9J7M2m3kQ6n3L1mm3J3NL9rl2j7M6%oM3p3QM8k0Ql7nN9o0J4Nm7
5680d9P6np0N7K2q7N7j8Ok0kMl6L1O2j6Ll5N2m7KN0Rj02M3j5M4l7oM2j6K6m4M7
5714B8%Kj1o1Q4m4l3M2m6K3J7L9r2O6qJ5q6N3K2o4N9k4L7n5K0k5J9K7RML1j9l8
5747iL9mm0M9mn1Q4q5L3J4m9nK2K7J7o0L0kj0l1N1j6J1k2m2R3n4k5Q5Or0qK6M4
$$ plain form
5781 24 6 -23 -25 36 -13 -5 43 -12 0 -4 -28 8 21 6 42 13 9 35 -3 -21 16 -5 -55 17 6 52 -4 30 16 24 -33 -30 -16
5814 -16 29 -5 -17 -19 -23 7 -65 7 -31 -14 35 14 -5 -45 -12 -13 -28 51 -10 -26 1 53 48 4 2 23 -24 22 -16 33 -19 20 -23
5847 -23 59 6 45 1 -6 52 -15 -24 2 -23 52 -83 -11 57 -20 -17 27 33 -17 9 15 2 19 30 22 -16 51 3 -59 4 6 -24 8
5880 8 24 27 -37 26 38 5 71 53 -5 7 3 8 -9 -1 39 -43 -64 42 28 -8 -8 -44 -43 -35 -1 0 13 -7 -44 -5 -25 -9 0 -43 -26
5915 -26 -9 29 42 -1 13 29 1 -11 -38 -79 1 -26 30 -17 19 -20 32 16 -6 -11 23 -35 -67 22 -33 10 0 4 -53 -3 -57
5946 -57 6 21 31 -7 15 -65 7 40 26 -9 -17 -34 -50 17 -27 34 26 13 38 76 -28 -21 -11 58 -32 -8 26 37 31 35 -5 -29
5978 -29 -38 -18 8 -33 9 50 -25 -17 22 -16 -6 1 56 9 16 -15 -4 10 -5 -46 -27 -67 -23 -23 -6 13 27 -2 11 -6 -26 -7 50
6011 50 17 9 3 5 33 -12 -7 36 -28 -9 -20 42 65 -6 -19 -66 -35 -22 22 -35 -31 -16 -22 -23 18 -16 -33 -25 -3 -22 -43 31 -17 7
$$ packed form
5781B4j8k9kO1m9QM8n5J2mk4L6J3j5L6k9mK6l8j8L7k1n0P2j1M6n6L4j4Qn7LJ4
5814a6M5l4j2kmL0p2P2l8J7M9k1j9m0L3jj5P9o1j6K7N2nm4kK1m7M6l8M9n2L9m3
5847b3Q2n3L9m4pN8o7rK6k5P5j35P2O8p7LM4On0K6Oj3J7J1ql8O7m8o2O3Kl0L2
5880HJ6Lo4O3J2l3O6j8n8J2mNj7QM0q2k1J06j4l6%l6JQL4JJ3k0l7L9k0J6Rm3J7
5915b6J7L8J3m3J4J6k8j2k7m1Q0k7N6m7L6l9N2j6k2nL4n8l2Q9n5M3j0Mn7N0n4
5946e7O3J5J0l8K2q0P2L3j4l5qj7j6O7m4O1qj3K5L8j04PJ0O9r0K4L4J1oMm0k4
5978b9rK0K6m1M2M1p5QL9l8J0PN5m7Pl1J1J4j5m1J9m0M4%J7J9J4k9J3j7k0J9N7
6011E0l3qoKK8m5NM3o4J9j1O2K3p1j3m7L1J3M4n7MJ5ojM1l4j7QK2j9k1P4m8K4
$$ plain form
6045 7 -5 13 30 12 52 -40 -9 5 -6 42 -13 6 -28 69 19 -10 9 8 -18 -52 -2 16 -8 -29 39 -57 -14 1 -5 14 -17 9
6077 9 -7 -58 -14 2 18 24 12 1 12 -1 -3 -29 -27 -19 -43 34 -11 6 -33 32 -9 15 9 2 9 -10 22 -5 18 -23 16 -16 -19 -6 -17
6112 -17 -49 -54 -4 -27 -8 -55 -24 3 -1 1 -2 10 3 -4 24 -19 0 14 21 52 -13 0 3 -3 -27 -30 4 16 -47 15 -65 23 -14 25 -23
6147 -23 -12 -37 -36 -10 17 5 -35 27 -15 -15 -15 -4 4 2 2 -3 8 0 5 -11 -3 26 10 26 -1 -5 11 40 -9 8 -39 -19 5 14 -30 -29 -47
6184 -47 -59 13 7 3 -56 31 -27 19 -24 -2 -12 -62 38 12 -62 3 17 -33 17 -6 -39 -2 -57 10 -43 26 -6 -11 25 15 4
6215 4 48 -26 3 -23 -28 -24 62 29 -67 19 -8 16 -18 30 -7 24 0 6 -55 -71 -3 -37 4 1 -15 -36 -34 37 -37 -19 -19 -26 23 -18
6249 -18 25 -34 -30 -14 -18 -7 49 -12 53 -5 30 55 32 18 9 -8 0 62 -28 -1 -13 51 -28 -11 61 -62 -4 -35 3 -30 -33 1
6281 1 26 -36 17 -64 -11 -13 -14 33 1 -2 -11 15 -31 -21 -1 1 16 -23 -17 61 30 17 -5 13 14 -5 22 15 -6 19 -8 -30 -13 -28 -17
$$ packed form
6045Gj2J8J7j8M0r2L1J4j1M8n5J9l4R7n0k9J9jk6l4N0J8k4k1O8r6M3J5oJ9l1K6
6077Ij6n1M4J6J6Oj2j1J1j3kk6KQk4P7m5J7l9O5m1K4opPj9L2k7K3m1L9l2lJ3j1
6112a7l2nN0k3J9m7L1K7mKlJ2ppK8m3J9J4PL1o5J3Lok4lL4J2o3O2q0Q8l7L9m8
6147b3J1k5JK6K7j2m0O2m2%%J1Qk%nJ1qNj6QK9j6J6k7mJ6K9m9J7m7K0K4Rm4Jj8
6184d7j2P2omn9Q7n8M6m3K2j0n0J00k6p4O5J4n0N0k3l3L7n5O7n3O9l2nL6j0j1
6215DM4p4K9k6nMQ6l3r6Q6k7K4l4M8l7L1k4Oo1j6O8l4M1lj6k1KP1p4J8%pM9m1
6249a8M3n9MJ6mJ1N6o1O5n8L5K5k3j4rj7QO2r0K7j2O4p9J7P2j23N8l1L8l3lL4
6281AK5o2N3q1N3kjM7l2lrK6m6J0K0KJ5l9OP8l1j3k2J8Jj9K7pk1K5k7k2J7j5J1
$$ plain form
6316 -17 38 -31 -19 -16 -64 38 -33 -14 -7 -59 -12 -23 -10 -11 8 -11 -24 2 -38 18 -42 -7 8 21 -19 36 12 -47 -14 7 41
6347 41 -22 -36 -9 -18 2 1 24 13 17 -16 -68 1 -27 8 -19 6 -11 -11 -58 -15 -28 -2 51 -38 -43 -17 14 -40 24 -20 -21 25 -17
6380 -17 13 -8 28 2 22 -50 40 -16 9 21 2 -22 1 38 -9 35 -44 9 -21 33 -29 10 -8 24 -69 3 8 -3 -40 0 -53
6411 -53 -15 29 -46 42 -14 4 14 -21 61 -20 49 43 -10 41 20 39 -26 -3 -37 2 -51 9 56 2 7 10 33 -26 -23 24 -29 -59
6443 -59 -7 -17 -33 4 -6 10 8 30 -26 -12 15 5 -66 -29 -12 -25 -14 19 -16 2 -4 -46 -39 1 15 -25 25 -18 0 25 4 7
6475 7 30 0 -18 9 -6 21 25 -2 3 -44 9 -13 -24 16 -38 1 5 2 12 6 -39 -54 -3 -34 -34 24 -16 9 -14 26 -3 -11 3 -3 -23
6510 -23 35 -13 -3 -16 40 43 1 46 27 14 22 -17 18 -18 16 -39 57 13 13 -44 -17 -23 12 15 9 -14 32 -48 27 -4 32 14 -12
6543 -12 -13 43 10 41 26 48 17 11 -12 36 -5 -28 69 35 -22 19 27 4 -15 -32 32 -9 -22 32 10 -4 27 38 -54 -42 -9 -34
$$ packed form
6316a7N5o9J2Lm8J02p1J9Pn2M7j1J3jJ9j9j3K6m0N6o0L5J5J3m0N5k4n9L3K1L4
6347D1o3j4K7rK0jK3j1Ml3n2O9k8L5k7K5j7%m7M3j3K6N3q9nK6L1n4O4m4jM6m2
6380a7L0k1L6k6K0p2R0n6K5J2j9k4K3L7m7M4p9N3l0N4o2L9j8L2r3P2Nj1l7M0n3
6411e3L8M4p5Q8n6J8J0l5Q2q1O9on3N1k1J9o5K3l4L9n3O0M7n4NLK3n9LM7n3l0
6443e9N2j0j6L7j0J6kK2n6J4K7j0p1L7J7j3J1L3l5J8om2PM0J4m0N0m3J8K5k1L
6475GK3l0j8K7j5K7Mk7Nm7N3k2j1M0n4L9MlJ0om5j5N1l1%N8m0K5k3M0k9qJ4ok0
6510b3N8m8J0j3N6Lm2M5j9j3Ql9L5l6L4n5R6m4%n7K7oL5Lok3M6q0P5l1L6j8k6
6543a2jN6l3L1j5K2l1ok3M8m1k3R7l4n7M1Qk3j9j7O4m1j3N4k2j4L1J1r2J2L3k5
$$ plain form
6575 -34 -51 -56 -22 -75 35 -21 8 -25 6 -1 18 -5 19 -17 -27 8 19 -23 25 29 16 4 22 0 7 4 30 -32 23 -5 -28 31
6607 31 27 -34 23 -18 -2 17 -4 43 12 53 26 -13 -26 -11 -36 8 -19 -17 4 3 -25 70 40 9 -17 0 43 22 9 -6 -49 7
6639 7 5 38 -15 21 45 25 -2 14 -8 37 -5 -24 17 -1 26 -38 32 -9 15 17 -53 -19 -26 -27 -34 25 16 -16 62 0 -10 -42 -28 27
6673 27 23 -16 -22 -19 84 -6 -19 33 22 -15 -19 12 29 45 -19 -21 -11 22 -27 34 52 50 7 19 2 47 2 -38 4 6 -44 42 -18
6706 -18 -32 -5 34 -5 12 -14 18 -25 11 11 -2 36 -12 55 12 -17 39 14 -16 23 48 -26 29 -39 19 43 -15 -40 -7 28 -20
6737 -20 11 8 16 -10 0 -13 -23 -14 -2 -10 -59 -9 -5 18 -19 -42 -31 2 21 -53 -61 39 -26 19 14 30 1 26 -26 -25 10 -30 17 -44
6771 -44 -4 -3 32 2 32 -14 15 -5 14 -22 -51 0 25 -2 -34 -18 37 -28 47 31 -20 2 -7 -8 -43 25 -15 77 7 -35 -25 -27
6803 -27 1 33 42 -14 -31 41 75 -6 -19 14 49 1 -17 54 -39 -11 -43 -6 37 -13 -39 -13 -58 23 16 3 14 19 2 -20 -1 22
$$ packed form
6575c4j7nL4n3J10n6K9l3L1pJ9k3K4l6j0L5J1m2M8Mj3j2J8k2PlK6o2N5k8k3N9
6607C1mo1N7m1J6J9k1M7l1M1k7l9j3J5k5M4k7KK1jk8R5l0l1k6J7M3k1j3j5m3N6
6639GkL3n3L6K4k0k7J6k2M5m2j9M1j8K7o4P0m1K4Kp0L4pjpN9rl2P8o2j0l2J4N5
6673B7ml9oLJ03r0j3N2j1l7mL1J7J6o4kJ0L3m9O1J8km3J2j7M5m5m0M2Kn0Q6o0
6706a8j4K7L9l9J7k6L2m3L6%j3L8m8O7m3k9N6k5l0L9K5p4N5o8N8K4n8k5L3L5m8
6737b0L1lQk6J0j3j0RJ2qm9N0MK3l7k3J1L3J9p4qJ00o5M5nJ6k9K5n2JL5m0M7o1
6771d4M0JL5l0L0m6K9k0J9l6k9N1K5k7l2J6N5o5P5j6n1K2rjl5O8m0R2p0m2J0k
6803b7K8L2Rn6j7P2L4q1j3L3L5m8j8P1r3K8l2L7M3n0k6K6m5Q1pj3J1Nj7k2J9K3
$$ plain form
6835 22 8 35 -4 60 -35 -83 -2 16 -3 -5 10 58 -19 10 1 7 -16 30 54 16 -5 -2 -9 43 -8 24 -12 0 -11 -2 -8 -19 19 -4
6869 -4 -15 -33 -21 -60 -3 27 -6 3 -32 -13 -5 -28 35 43 -9 39 1 27 71 -26 5 22 -12 55 -14 -39 39 -32 -2 -5 9 0 72
6902 72 5 -7 26 -8 -6 -28 -18 1 34 -21 -15 -24 -3 -34 -18 20 37 8 42 72 -47 -7 -9 -15 -30 53 24 27 -49 -29 -36 24 4
6935 4 -12 -21 -10 -3 2 -8 1 43 -65 -9 -7 19 9 -1 28 -31 13 -3 -23 -27 -33 -12 -11 9 45 17 -17 67 -37 3 -23 3 -40 5
6969 5 27 -5 42 -26 40 -5 44 -52 5 -8 -18 16 58 37 -18 -37 36 -4 76 23 -12 -22 -1 -34 -15 -10 2 -2 -58 -20 12 -7
7001 -7 -9 -15 8 -22 -3 1 33 56 36 3 -33 8 -38 48 17 2 29 13 61 -31 1 16 10 41 -19 -4 -22 -59 -68 -6 27 9 -43
7034 -43 -1 29 -31 -30 16 32 -44 -13 -14 15 24 14 16 26 1 -19 -18 -8 -4 -16 46 -1 45 16 24 3 11 -3 50 3 25 22 -14 1 3
7069 3 -4 3 31 -47 -39 12 -42 3 -32 -25 -8 -1 8 32 -11 1 -11 -14 -45 26 7 14 -25 -33 4 16 26 -29 20 -3 -23 42 47 18 -10 18
$$ packed form
6835B2j4K7l9O4r5m8Q1J8j9kJ5M8p7K9rOk3M6K4l8k1LpN2n1L2l6J2j1Roj1L8k3
6869dj1j8J2l9N7L0l3Rl5J9Qk3O3Qn2M8l8K6M4r7L1J7l4O7o9k5P8p1L0lJ4rP2
6902G2o7j2L3l4Kk2J0J9L3n5OrK1l1J6L8J7k9L4L0j19M0koj5Q3k9Lp6K0pO0k0
6935Dj6rJ1PNj0RM2j08N6KK6j0j0K9n9M4j6k0moK1JK0L6k8l4Q4j04M0k6K6m3M5
6969EK2l2M7o8O6m5M9r6N7j3j0L4M2k1n5j9P3m0Q0n3l5j0K1l3J9NJ2mn6L8L2j9
7001gkoK3l0J9ML2K3k0l3l6M1m6Q6l1j5K7j6M8r2L2J5oL1o0J5j8l7rO2L3j8n2
7034d3M2L0o0JM6J6p6L1jK9Rj0KJ0k5k0JJ0Mj2O2m7M6k9Qk1Qj4N3m7K2ll6J5K
7069CpPK8p8QN1n4M5l5PJ7PRK4m3J2j2ll1P1j9Pl9qL7J2J0n5M9k3k0O5Nk9k8K8
$$ plain form
7105 18 8 14 3 -1 14 12 -17 21 -15 -56 -44 9 33 -14 -40 -13 42 3 -11 9 -26 -48 -7 2 16 9 14 -24 31 21 30 10 14 -30
7139 -30 10 65 29 26 20 -23 22 -4 -18 8 -13 1 28 -25 -40 -27 18 38 5 31 -43 -32 78 18 -15 -22 -30 -33 -7 24 -6 34
7171 34 -36 -9 -23 -25 43 32 11 37 37 30 -28 -4 24 -3 11 -14 73 27 -4 33 14 -35 4 3 -6 -39 -50 -44 11 33 -18 -8 -27
7204 -27 12 17 13 21 -20 39 28 -30 14 -14 -28 38 4 22 20 -28 -15 31 12 45 -19 7 41 -4 47 -30 23 19 10 22 -50 -3 6 -25
7238 -25 -19 23 -20 21 33 2 51 -21 6 -7 -30 26 4 -22 78 6 -2 16 -45 -4 59 48 -8 -19 -21 -22 6 -14 65 18 -55 40
7270 40 33 8 -41 33 38 37 26 22 -31 21 -32 15 -37 -18 -5 -68 2 12 -23 12 -8 -17 -3 -22 -8 20 21 -2 -7 22 -20 28 -10 -2
7304 -2 -47 3 14 -16 14 -35 43 48 53 -21 25 -4 -8 -5 6 -13 20 -47 5 -1 57 -33 20 -10 -46 34 10 -36 -39 -33 -33 8 -43 52 16
7339 16 -37 -15 30 -13 1 26 -4 -25 4 19 46 53 39 28 19 -29 10 3 -2 40 9 31 38 -60 -33 -14 -23 -24 -14 41 -14 -20 -50 -24
$$ packed form
7105A8j0Oj1mJ5kk9L8l6m1J2N3K4m7k6K7N5l9j4K0l5k2M1RJ4pNl8N5j0Rk0Mm4
7139c0M0N5l6lom3M5k6j4K6k1J4K7n3j5J3M5K0l3K6p4J1J10o0l3pqlK6L1l0M0
7171C4p0K7j4kO8j1k1K6%pn8K4K8k7J4k5Q7m6l1L7j9m9L9jrl3j1ON5K2n1J0j9
7204b7L9NmQm1N9j1n8M4k8j4O6l4J8km8J3M6j9L3o4K6L4m5N1p7N3mrJ2p2M7Rl1
7238b5OM2m3M1J2l1M9p2K7j3k3N6k2k6J00p2qJ8o1M1O3j1n6j1kjK8k0P9m7p3R5
7270D0pk5m9P4Njj1mn3N2n3M7n2J9J3o3P0J0l5L5k0rJ4j9J4K8Jk3nK9m2M8l8Q
7304bm5N0J1l0L0m9P8NNp4M6k9mLJ1j9L3o7N2oN8r0N3l0l6Q0k4m6lO%M1n1R5l6
7339A6n3K2M5m3J4K5l0k1K9J5K7Pj4j1rm8L9pnM2l1K2Pr8K7J9rjJ0N5n5ol0K6
$$ plain form
7373 -24 -32 -6 1 -70 -12 -10 41 36 21 -39 -19 4 -35 -14 41 -21 37 -25 1 15 0 10 5 -17 -7 32 42 4 15 61 -8 6 49
7406 49 5 -7 -33 -19 -4 -40 -40 16 4 -27 -18 -40 -5 -85 1 9 7 0 9 17 -4 0 -58 -36 31 2 1 9 -27 -29 40 2 2 10 32 -2 69
7443 69 5 0 -18 6 25 -31 -50 -73 17 -6 28 -37 14 16 5 10 6 -19 4 49 24 -11 -60 11 22 9 -19 -3 29 -6 26 -11
7475 -11 -49 -22 43 15 -43 9 74 49 -13 -2 -13 -13 23 1 26 -8 -1 -25 -12 21 4 -19 -14 -13 -64 -47 -1 -11 -45 -34 -35 -8 -4
7508 -4 -21 37 45 -7 -6 -69 -18 -12 25 -3 28 -14 -29 -3 2 3 -30 16 -33 -52 3 -18 32 -16 11 -42 -33 -17 -13 -6 -11 -39 6 -49 19
7543 19 -40 -2 2 17 -20 -10 16 37 -44 -34 24 -42 14 -4 5 -3 21 8 4 28 23 12 12 -55 19 -29 40 -6 14 -1 -24 43 17
7576 17 -1 -59 31 24 -4 -25 -47 -6 -2 31 14 -33 -41 -36 -57 37 -3 -30 -15 8 -21 23 12 2 12 -39 21 71 -62 -17 -27 11
7608 11 -10 -38 10 3 3 1 5 -38 -6 24 -12 -32 4 -8 -4 -15 28 -22 40 -14 -27 23 -10 -18 -8 -37 -10 1 -24 35 -8 29 -13
$$ packed form
7373b4qK6Pp1N8KN1nj5o0K0K3l9K1N5o2N8o2K6J4j5J0nk2J0L9J0l8J1M6o9J4M3
7406D9m4j2k6J4J5l6%N6j2l1Rk2L5q0Q6QkpRQk1Mn8K2O7k9jQl6kO9l8%QK2l4P1
7443F9o4nj8K4J9n6j9k3R0k3L4o5N1Kj1Nmk5K3M5k5l5m9P1J1j3k8J6L2l5L2l7
7475a1l8K7O5k8n8N2O5k5o2J1j1%L6k2K5l4Pk4J3L3j7k3NJn1J7M6j0l4J1jK7M
7508dj7N8Qn2Jo3N1OL7k8L1m2j5K6NJl3M6m9j9N5k1N0m8K7n3RJ6MPnk8M5n5O8
7543A9n9L8MJ5l7J0K6K1q1J0N8o6N6j8RqK4j3mK4nj1%o7P4m8O9m6K0j5k3O7k6
7576A7j8n8R0pk8k1k2M1ML3j7m7qNk1R4m0k7J5K3k9M4j1j0J0n1O0N0j33M5j0L8
7608A1k1k8M8p%kMm3L2L0l6k0L6j2Mj1M3n0O2n4j3N0l3qJ0k9K7J1k5N9m3L7m2
$$ plain form
7641 -13 94 -7 -26 -24 20 8 32 -8 -6 -22 42 -14 17 21 0 58 34 -5 -3 -7 36 -3 -35 -5 34 -33 16 -4 54 31 4 6
7673 6 -30 4 10 -2 29 34 8 54 12 28 48 21 20 -39 18 -13 -16 43 21 14 -20 -48 -46 11 38 -42 -33 -30 -31 -18 32 8 -33 -35 -8 -67
7709 -67 -26 -13 -42 2 30 -21 -12 -48 -20 -19 -10 31 -18 30 -18 -19 0 -8 14 25 10 -30 2 42 4 -56 21 27 -18 43 15 14 -51 16
7743 16 43 -1 9 24 9 45 -27 -53 -2 13 -19 -42 -38 10 9 27 -20 -13 -3 20 -32 25 -16 -29 13 9 13 -9 55 40 35 -18 -32
7776 -32 -26 20 32 22 2 -19 36 0 48 -10 -10 -44 -12 -41 -8 8 -39 27 -10 -8 26 -35 18 -48 -64 55 -14 69 18 2 -16
7807 -16 39 5 -2 6 -5 5 -15 -65 10 52 -8 -25 17 -14 -17 -33 -40 -62 -4 23 -24 -30 14 10 -12 -31 48 -4 45 16 20 9 -28 20
7841 20 23 26 6 0 24 62 -15 -28 -28 -10 -10 52 15 18 60 -15 25 3 -43 -8 -22 55 -22 -12 27 -34 15 78 -14 30 3 5 5 17
7875 17 -40 26 10 -15 -52 11 -49 -67 -20 -16 1 11 50 -5 -54 47 25 -27 23 -10 29 6 0 24 14 7 35 28 -39 -12 5 34
$$ packed form
7641a3J07j01j9KM4j2K4m0Kj6O4n6L1Mk1N8k4l9KmM3l9l2L0L9o7M9k0N8k3k7K
7673Fl6L4Oj2L1Nk6M6m2J6K0k7jn9N7l1lN9k2pl4k8KN7K7q0RLjJ3N0k4m1kK7n9
7709f7M1J3k9M4K8n1Rl6K8JRM1m9M8m8jJ9qK2J1j5m0L2M0l8o0P7Om5O1k8jo5O7
7743A6K7m4J0J5j5L6p2k6N1J5l2k3MM8jJ8m7PJ0K3n2N7m1j3M2mMk2O4j5nn3j4
7776c2OM6J2j0k0k1N5l6M8n8%l4L2k9L3J6m7O6l7KL4o1N3o6j6J19o9Q3n1j6j8
7807a6N5l4pQj1J0k0n0P5M2o0j7M2l1lj6pk2N8K7m7oM4mk2j9P9n2M9k9Mj1l7M8
7841B0LLk0oK4L8p7j3%J8%O2l7LM2p5M0k2m6L5j4P7p7J0L9o1M9O3r2M4k7K%J2
7875A7n7O6j6k5l7O3o0j8M7MJ7J0L9n5m9J01k2n2N0l3L9k3oK4j0pK8po7K7J7K9
$$ plain form
7907 34 23 -29 19 -29 -30 17 8 16 -60 -43 15 7 10 -16 -17 -4 25 0 14 -17 -30 -7 45 -24 19 25 29 27 -21 -9 9 57 6 -12 25
7942 25 11 29 35 -4 -8 -34 1 9 9 -34 -4 -9 39 -13 -37 -46 -45 4 0 -55 5 49 -10 25 -7 5 9 23 -9 -48 31 -16 5 -24 42
7977 42 20 -16 11 7 -25 5 26 -82 19 6 18 -37 -1 -10 -56 22 17 1 38 4 -40 33 2 -11 27 -34 -1 -51 20 -21 -25
8008 -25 -70 -43 12 -7 2 32 33 25 6 29 3 11 -4 6 64 6 -11 -2 -20 15 -14 17 22 -51 6 -12 -24 7 76 -24 -30 -4 -27
8041 -27 -8 -63 69 21 -7 31 -20 -55 31 -19 -1 12 24 3 21 24 -19 -6 -7 2 0 -1 23 23 -29 -26 27 5 20 19 40 -10 12 -10
8075 -10 -65 6 -5 -14 11 -25 2 4 42 -11 -18 -40 -41 -20 13 28 -8 47 -46 24 -28 48 -21 21 -8 -35 19 68 -4 -54 -5 -3 8
8108 8 51 -29 27 44 19 -19 0 32 17 16 23 24 -18 11 9 -13 -21 -48 15 -20 6 -50 3 -16 -11 -28 22 21 -36 -1 -23 15 30 3
8142 3 -3 10 33 18 2 -20 16 -39 16 53 20 19 25 -6 -57 -29 27 21 -12 -5 -3 49 -54 -23 -27 3 -34 -24 -35 9 -3 10 -36 -23
$$ packed form
7907C4j1n2M8m8jM7rQp6J7N8qLk6jJ3K9k5J4l1j3K3N2o9M3OMkm8J2J8M8n1j8L7
7942B5j4J8Ol9mk6L5Q%m3L0nM8n2k4rJM9mn5O0M4n9L5l2J2MJ4l2l9P9m7K1k9O6
7977D2k2l6K7ml2L0K1j08J01j3J2n5L6rm6P8nj6L7l4m4P3l1j3L8o1L3n0P1m1m
8008b5m5K7N5j9RL0Jqj9K3k6Qj5J0N8n8j7Rj8L5k9L1Np3N7j8j2L1O9j00oK6k3
8041b7J9n5J32m8k8L8n1l5Q6n0J8J3J2k1J8Lm3J3jRkjK4%n2LN3k2J5jK1n0K2k2
8075a0n5P1j1rK5l6K7KL8n3pk2jK1L3J5l6N5r3P0n2P6o9M2k9k7N4M9p2n0M9KJ1
8108HM3q0N6J7k5l8J9L2j5jPJm2K9kk2qk7O3l5K6n6N3j9Nj7N0jn7L5k2L8J5k7
8142CoJ3K3j5j6k2L6n5N5L7l3jOl1n1K8N6ol3PKN2j03L1mL0l7J0j1M4j2J3m6J3
$$ plain form
8176 -23 5 80 -2 10 31 -4 -50 20 -42 23 43 81 36 33 14
$$ packed form
8176b3K8P5q2J2K1l5m6P0o2O5K0L8m5lj9
8191A4
$$ Imaginary data points
##PAGE= N=2
##DATA TABLE= (X++(I..I)), XYDATA
$$ plain form
0 0 0 0 0 0 0 0 0 0 0 0 0 0 0 0 0 0 0 0 0 0 0 0 0 0 0 0 0 0 0 0 0 0 -3 4 -5 6 -6 6 -6 6 -6 7 -8 11 -12 12 -13 13 -16 17
50 17 -18 19 -22 25 -28 31 -35 42 -48 55 -66 81 -103 133 -180 262 -412 756 -1804 9996 42752 -28367
72 -28367 -41344 -4189 -59030 -65760 5087 -11600 -33773 19084 5861 -22517 38793 44197 -9217
85 -9217 24025 40041 -16943 3069 42502 -5635 -15803 18525 -14403 -27963 14364 -129
97 -129 -20916 11762 -4584 -41761 -9669 190 -31019 -3493 20765 -13041 -6654 25800 10662
110 10662 11468 38200 20788 4794 21945 8780 -10399 4881 -6051 -36429 -23928 -12544
122 -12544 -28158 -14798 6442 -6710 -9333 8293 7441 8169 24623 21861 8798 10502 4813 -7670
136 -7670 316 7295 -5890 -9784 -2185 -8040 -10847 2657 4212 -8332 -7780 -2256 -5740 -390 8815
$$ packed form
0@%%%%%%%%%%%%%%%%%%%%%%%%%%%%%%%%lPrJ1j2J2j2J2j2J3j5J9k3K4k5K6k9L3
50A7l5L7m1M7n3N9o6P7r0J03j21J47j84K36l13M42o74J168k560J1800L2756p1119
72b8367j2977L7155n4841o730P0847j6687k2173N2857j3223k8378O1310N404n3414
85i217L3242J6016n6984K0012L9433m8137j0168L4328l2928j3560M2327j4493
97a29k0787L2678j6346l7177L2092R859l1209K7526K4258l3806O387L2454j5138
110A0662Q06K6732j7412j5994J7151j3165j9179J5280j0932l0378J2501J1384
122a2544j5614J3360K1240j3152k623J7626q52P28J6454k762j3063J704n689j2483
136g670P986O979j3185l894P599n855k807J3504J555j2544N52N524l484N350R205
$$ plain form
151 8815 -589 -8343 -948 -1392 -651 16111 16630 650 4439 9383 -3036 928 11470 -4810 -13702
166 -13702 -2044 -8417 -14765 711 -2300 -14440 902 7164 -4162 8533 16843 -2294 -57
179 -57 12936 -2562 -6013 9959 -1684 -11564 4508 -981 -13531 2781 4835 -8857 4817
192 4817 10848 -7251 -869 10019 -5636 -3940 10282 -3685 -9182 6512 -887 -8273 7394
205 7394 2836 -10088 3166 5291 -6983 3968 8712 -7861 -3342 6451 -5128 -2126 10359
218 10359 -1658 -6496 6210 -287 -5560 7795 2960 -8768 1476 2409 -7540 1979 5770 -7447
232 -7447 -3236 5126 -3540 -534 9031 -983 -4606 5518 720 -3450 5957 1744 -7022 631 2025
247 2025 -5034 728 2912 -5917 -2956 3426 -1699 -726 4673 -945 -2540 4484 2598 -260 3880
$$ packed form
151H815r404p754P395m44P41J6762N19j5980L789M944j2419L964J0542j6280q892
166a3702J1658o373o348J5476l011j2140J5342O262j1326J2695Q310j9137K237
179e7J2993j5498l451J5972j1643r880J6072n489j2550J6312K054j3692J3674
192D817O031j8099O382J0888j5655J696J4222j3967n497J5694p399p386J5667
205G394m558j2924J3254K125j2274J0951M744j6573M519R793j1579L002J2485
218A0359j2017m838J2706o497n273J3355m835j1728J0244R33r949R519L791j3217
232g447M211Q362q666L006R565j0014l623J0124m798m170R407m213q766P653J394
247B025p059N762K184q829K961O382n125R73N399n618j595P024j886k858M140
$$ plain form
262 3880 1499 -2646 1649 2342 -1991 -1159 -1330 -5015 -3005 72 -2052 -2056 -495 -1874 -592 3119 2719
279 2719 1979 2769 1816 1784 3425 2554 503 -472 -1855 -2179 -711 -646 -1939 -2294 -2844 -2687 -495 527
297 527 -41 152 32 -37 1638 2417 1409 904 592 415 1562 2353 1378 -122 -1174 -1811 -1320 -431 -857
316 -857 -1876 -2269 -2463 -1369 221 597 477 818 1005 2089 3486 2929 1634 547 -427 -514 349 13
334 13 -1575 -2627 -2929 -2816 -1481 -226 -732 -986 -178 632 1579 2608 2236 956 754 1620 1932 1801 1534
353 1534 -266 -2153 -1411 -573 -1194 -1088 -1223 -2955 -2530 -102 -141 -831 627 55 -807 2208 3291 910
371 910 1495 1813 -835 505 2890 134 -1265 387 -1742 -2828 816 -121 -3154 -546 -40 -2525
387 -2525 756 2475 -1706 -575 2287 -402 538 4119 422 -1746 1992 456 -1699 2161 550
$$ packed form
262C880k381m145M295O93m333Q32j71l685K010L077k124mJ561j379J282L711m00
279B719p40P90r53l2J641q71k051r75j383l24J468O5j293l55n50J57K192J022
297E27n68J93j20o9J675P79j008n05l12j77J147P91r75j500j052o37M91Q89m26
316h57j019l93j94J094J590L76j20L41J87J084J397n57j295j087r74q7Q63l36
334A3j588j052l02J13J335J255n06k54Q08Q10R47J029l72j280k02Q66L12j31k67
353A534j800j887P42Q38o21J06j35j732M25K428l9o90J458n72q62L015J083k381
371I10N85L18k648J340K385k756j399J652k129j086L644r37l033K608N06k485
387b525L281J719m181J131K862k689R40L581l697k168L738j536k155L860j611
$$ plain form
402 550 -4106 -824 564 -3038 -185 1580 -3359 -1807 2796 141 619 4331 258 -1909 3038 1970
418 1970 -1023 2330 406 -4645 -949 1216 -2622 -435 1298 -3701 -2345 2653 192 -405 2974
433 2974 -430 -2946 1951 2157 -1036 1856 1583 -2926 -69 3076 -341 61 2347 -1503 -2384 1802
449 1802 268 -2276 412 -369 -3660 -643 1394 -1669 -478 2355 -456 -757 2727 1128 -987 2140
465 2140 2013 -1640 83 1292 -2573 -1439 2249 -820 -2175 1484 -531 -2615 2503 2813 -1911 233
481 233 1381 -3363 -640 4095 -1038 -2713 1581 -2122 -3432 4266 2889 -2667 1564 1241 -4215 1728
497 1728 5606 -2103 -1590 2380 -4188 -2952 5586 404 -3963 2486 -1095 -5336 4274 4631 -3807 966
513 966 2439 -5809 -64 6691 -2195 -2251 4235 -3653 -4495 6218 1269 -4412 3879 491 -6926 2694
$$ packed form
402E50m656L282J388l602K853J765m939J552M603k655M78L712m073k167M947j068
418A970k993L353j924n051L696K165l838K187J733m999J356M998k461n97L379
433B974l404k516M897K06l193K892k73m509K857L145l417M02K286l850q81M186
449A802j534k544K688p81l291L017K037l063J191K833k811l01L484j599k115L127
465B140j27l653J723J209l865J134L688l069j355L659k015k084N118L10m724K144
481B33J148m744K723M735n133j675M294l703j310P698j377n556M231l23n456N943
497A728L878p709N13L970o568J236Q538n182m367O449l581m241R610L57q438M773
513I66J473q248N745O755q886n6O486p888q42J0713m949n681Q291l388p417R620
$$ plain form
529 2694 4353 -5131 689 4201 -6059 -2034 6282 -2326 -2243 6632 -1258 -4946 5517 1739 -4448
544 -4448 4937 3142 -6708 560 3392 -5641 -189 5410 -4920 -4312 3824 -2960 -3388 6569 848
559 848 -5165 3151 1533 -4046 4830 5879 -3822 -246 3333 -3839 -197 6439 -1569 -4367 1620
574 1620 -2681 -4434 4124 1892 -4886 -366 194 -4219 1851 5467 -1277 -1337 2320 -1706 -660 5539
590 5539 2110 -2306 884 -375 -3114 1789 3029 -2367 -1898 -28 -3070 -1618 2920 309 -2380
605 -2380 579 -63 -2022 2153 3496 -590 260 2102 -1266 -720 3140 494 -2021 900 -699 -3965
621 -3965 110 1415 -2596 -316 1781 -2849 -1598 3411 315 -525 3925 509 -3084 2393 2373 -1913
637 -1913 2104 2369 -4395 -1697 2596 -2333 -988 3383 -2816 -4646 2106 54 -2454 3614 1314
$$ packed form
529B694J659r484N820L512j0260M025Q316q608Q3Q875p890l688J0463l778o187
544d448R385j795r850P268K832r033N452N599j0330O08Q136o784m28R957n721
559H48o013Q316j618n579Q876J049r701L576L579p172L642O636q008k798N987
574A620m301j753Q558k232o778M520N60m413O070L616o744o0L657m026J046O199
590E539l429m416L190j259k739M903J240n396M69J870l042J452M538k611k689
605b380K959o42j959M175J343m086Q50J842l368N46L860k646k515K921j599l266
621c965M075J305m011K280K097m630J251N009l096q40M450l416l593N477k0m286
637a913M017K65o764K698M293m929J345M371o199j830O752k052k508O068k300
$$ plain form
652 1314 -4819 744 3212 -1819 2340 4794 -2947 -1884 3841 -823 -1019 4419 -1151 -5071 1311
667 1311 223 -3634 2148 1508 -5027 -668 2624 -2270 695 4393 -1942 -1918 3611 -163 -1331 3894
683 3894 381 -3590 1487 966 -3086 1158 1913 -3275 -484 2170 -2255 -725 2793 -1241 -1403 2625
699 2625 -278 -1851 2115 663 -1884 1606 1140 -2179 390 1391 -1711 94 1509 -1934 -1311 1245
715 1245 -650 -652 1705 -287 -1676 830 689 -324 1630 1123 -1224 -107 918 -426 385 960 -1183
732 -1183 -1321 168 -237 -302 569 -430 -1389 -181 513 219 639 464 -683 -378 582 560 510 485 -263 -551
752 -551 1 548 240 -144 -126 -471 -490 444 494 -299 -295 -140 -407 113 780 -55 -491 -11 -164 -327 631 206
774 206 -816 -118 259 -270 396 543 -621 -331 560 63 260 865 -186 -714 395 267 -225 584 1
$$ packed form
652A314o133N563K468n031M159K454p741J063N725m664j96N438n570l920O382
667A311j088l857N782o40o535M359L292m894K965L698o335K4N529l774j168N225
683C894l513l971N077n21m052M244P55n188K791K654m425J530L518m034j62M028
699B625k903j573L966j452k547L490m66l319K569J001l102J805J415l443O23K556
715A245j895kK357j992j389K506j41j013J954n07k347J117J025j344Q11N75k143
732a183j38J489m05o5Q71r99r59J208O94k94M20j75j147L05R60k2n0k5p48k88
752e51N52N47l08l84J8l45j9R34N0p93MJ55k67N20O67q35m36M80j53j63R58m25
774B06j022O98L77n29O66J47j164K90Q91m97J97O05j051n28J109j28m92Q09n83
$$ plain form
793 1 -963 19 339 -323 150 131 -985 -377 564 -41 4 405 -625 -569 730 424 20 571 -121 -637 572
814 572 635 -203 259 -19 -848 41 716 -239 -213 120 -701 -407 805 222 -319 205 -334 -578 527 435 -473
835 -473 -155 -80 -492 261 640 -159 -362 99 -127 158 820 269 -404 -40 39 -43 531 359 -391 -329 -83 9
857 9 144 173 -246 -603 -214 74 149 98 -138 -405 -329 137 390 250 111 -46 -211 172 565 260 -6 25 -226
880 -226 -163 443 251 -234 -294 -157 -298 190 460 -211 -378 -19 -205 -3 553 -37 -422 -54 -22 -120 382 204
902 204 -482 -217 292 43 247 462 -312 -406 425 263 89 453 -64 -637 127 429 14 115 22 -765 -382
923 -382 460 31 -303 48 -486 -701 447 565 -200 52 80 -614 135 1045 226 -249 297 -311 -499 874
943 874 578 -578 -30 -9 -841 176 969 -493 -559 449 -557 -571 1025 265 -986 340 271 -976 485
$$ packed form
793Ar64R82L20o62M73j9j116O08R41o05M5M01j030N6J299l06m04N51o92n16J209
814E72O3q38M62k78q29Q89O75r55K6L33q21K94J212n83n41N24n39k44J105r2r08
835d73L18P5m12P53L79p99k03M61k26K85O62n51o73L64P9q2N74j72p50O2K46R2
857IJ35K9m19l57L89K88P5n1k36k67P6M66K53j40j39j57j65L83L93l05k66L1k51
880b26O3O06j92m85o0J37j41M88K70o71j67L59j86K02N56n90l85L68L2r8N02j78
902B04o86K65N09k49K04K15p74r4Q31j62j74L64n17n73P64L02m15J01r3p87L83
923c82Q42m29l34L51n34k15J148J18p65K52K8o94P49R10q19m75N46o08j88J373
943H74k96j156N48K1q32J017P93j462o6J008j006j4J596p60j251J326o9j247J461
$$ plain form
962 485 1041 -841 -183 968 -757 -416 1282 -253 -952 1052 99 -1242 823 612 -1276 521 1249
979 1249 -1181 -177 1233 -997 -551 1689 -438 -1339 941 -195 -1430 1328 766 -1825 198 753
995 753 -1440 512 1988 -1064 -865 1174 -758 -551 2276 238 -1663 679 92 -1413 1414 1474 -1729
1012 -1729 -349 776 -1438 158 2063 -902 -1430 920 -665 -1008 1931 572 -1757 433 405 -1492
1028 -1492 974 1756 -1176 -534 954 -1115 -405 1928 -145 -1234 876 -173 -1319 1138 994 -1221
1044 -1221 198 764 -1265 -94 1463 -484 -666 955 -551 -1216 883 472 -880 553 521 -1280
1060 -1280 -106 1066 -306 -11 1145 -524 -1087 790 497 -439 873 442 -1487 -307 921 -380
1076 -380 119 1093 -968 -1424 716 265 -437 1090 145 -1792 -156 1001 -380 499 1203 -1208 -1111 1190
$$ packed form
962D85N56j882O58J151j725L41J698j535o99K004r53j341K065k11j888J797P28
979A249k430J004J410k230M46K240k127r01K280j136j235K758n62k591K023N55
995G53k193J952J476l052J99K039j932K07K827k038j901K342n87j505K827O0l203
1012a729J380J125k214J596J905k965n28K350j585l43K939j359k329K190k8j897
1028a492K466P82k932O42J488k069P10K333k073j089K110j049j146K457j44k215
1044a221J419N66k029J171J557j947j82J621j506o65K099m11j352J433l2j801
1060a280J174J172j372K95J156j669n63J877k93r36J312m31j929J180J228j301
1076c80M99R74k061m56K140m51p02J527r45j937J636J157j381Q79P04k411R7K301
$$ plain form
1094 1190 230 -264 1543 -130 -1851 516 905 -726 848 1044 -1770 -705 1218 -528 -191 1558
1110 1558 -752 -1634 1028 176 -995 1206 577 -1839 181 1062 -1132 242 1578 -1195 -767 1418
1126 1418 -555 -878 1686 14 -1448 1078 428 -1488 851 1151 -1380 142 1094 -1451 -453 1626
1142 1626 -646 -791 1368 -622 -1491 1274 479 -1219 864 469 -1739 363 1384 -776 103 1145
1158 1145 -1267 -791 1567 81 -531 1143 -341 -1430 795 834 -738 536 415 -1487 -264 1030
1174 1030 -350 -107 758 -792 -904 837 346 -426 642 0 -1075 306 790 -278 171 388 -713
1191 -713 -303 739 49 -180 450 -147 -632 364 351 -381 114 201 -535 -125 383 -215 -267 259 -101 -319 268
1212 268 84 -349 148 275 -108 58 309 -215 -200 333 157 -102 230 40 -381 175 414 -165 -70 157 -442
$$ packed form
1094A190r60m94J807j673j721K367L89j631J574J96k814J065J923j746L37J749
1110A558k310q82K662q52j171K201o29k416K020Q81k194J374J336k773M28K185
1126A418j973l23K564j672j462K526o50j916K339L00k531J522R52k545R98K079
1142A626k272j45K159j990q69K765p95j698K083l95k208K102J021k160Q79J042
1158A145k412M76K358j486o12J674j484j089K225L9j572J274j21j902J223J294
1174A030j380K43Q65j550j12J741m91p72J068o42j075J381M84j068M49K17j101
1191g13M10J042o90k29O30n97m85R96j3p32M95Q7p36M10N08n98n2N26l60k18N87
1212B68j84m33M97J27l83J66K51n24J5N33j76k59L32j90m21N56K39n79R5K27n99
$$ plain form
1233 -442 -183 441 62 -310 48 -208 -479 336 400 -428 -85 110 -448 118 675 -156 -233 325 -226 -199 652
1254 652 195 -462 167 70 -396 407 450 -517 -169 173 -371 61 537 -294 -375 217 -192 -218 512 83 -496
1275 -496 134 145 -244 310 311 -431 -53 317 -167 106 396 -308 -258 291 12 -101 312 -91 -401 208 160 -120
1297 -120 248 50 -470 46 234 -184 55 140 -421 -190 334 -75 -37 224 -215 -187 286 195 -47 208 -5
1318 -5 -257 258 314 -75 17 55 -297 -3 318 -70 -137 -30 -280 -174 257 12 -248 -79 -90 -179 197 241 -86
1341 -86 -3 -14 -40 175 263 48 -110 14 44 83 197 58 -188 -160 -30 35 124 -43 -176 -148 -119 44 149 -10
1365 -10 -107 -78 -72 38 171 16 -115 -133 -49 -4 172 191 -80 -80 61 56 208 192 -50 -129 -14 -4 77 152 -112 -233
1391 -233 -101 -5 -56 38 -66 -300 -44 98 14 69 71 -169 -90 110 113 92 187 -18 -150 95 229 29 63 80 -250
$$ packed form
1233d42K59O24l79l72L58k56k71Q15O4q28L43J95n58N66N57q31p7N58n51K7Q51
1254F52m57o57O29r7m66Q03M3r67L48L42n44M32M76q31q1N92m09k6P30m29n79
1275d96O30J1l89N54Jp42L78L70m84K73K90p04N0N49k79j13M13m03l10O09m8k80
1297a20L68j98n20N16J88m18K39Q5n61K31N24m09L8K61m39K8M73r1k42K55k13
1318ek52N15N6l89R2L8l52K94L21l88o7J07k50J06M31k45k60J69j1q9L76M4l27
1341h6Q3j1k6K15Q8k15j58J24L0L9J14j39k46K8J30O5Q9j67j33K8K9J63J05j59
1365a0r7K9OJ10J33j55j31j8Q4M5J76J9k71%J41nJ52j6k42p9J15J0Q1P5k64j21
1391b33J32R6n1R4j04k34K56J42q4N5Kk40P9K00Lk1R5k05j32K45J34k00L4J7l30
$$ plain form
1416 -250 56 237 -65 -77 11 -186 -163 247 149 -178 -19 -56 -284 149 309 -154 -103 115 -160 -40 429 21
1438 21 -270 70 -14 -178 327 363 -325 -54 218 -253 75 459 -220 -435 212 -84 -152 377 73 -509 -47
1459 -47 203 -329 153 350 -447 -179 395 -171 -105 518 -69 -419 402 159 -337 401 333 -445 87 441 -277
1480 -277 -112 447 -297 -359 482 -114 -475 261 -34 -541 283 243 -537 -41 360 -355 15 604 -233 -337 466
1501 466 -49 -225 609 145 -549 168 341 -338 305 490 -561 -248 468 -119 -201 517 -176 -672 257 130
1521 130 -267 367 182 -718 -224 477 -206 -21 499 -299 -563 421 157 -212 483 172 -634 51 507 -227
1541 -227 58 515 -470 -438 536 -13 -373 428 19 -712 236 332 -556 125 448 -537 -212 608 -261 -341 683
1562 683 24 -549 540 223 -671 332 523 -561 71 573 -588 -259 726 -140 -411 535 -187 -727 532
$$ packed form
1416b50L06J81l02j2Q8j97K3M10r8l27J59l7k28M33J60m63N1K18k75J20M69m08
1438B1k91L40q4j64N05L6o88K71K72m71L28L84o79k15O47k96o8N29l04n82M62
1459d7K50n32M82J97p97K68N74n66O6O23n87l50Q21k43m96P38o8p78N32L54p18
1480b77J65N59p44o2Q41n96l61P36k95n07Q24m0p80M96M01p15L70N89q37j04Q03
1501D66n15j76Q34m64o94P17J73o79O43J85j051L13P16n87q2P18o93m96R29j27
1521A30l97O34j85r00M94P01o83J85N20p98k64R84k64l69O95l11q06O85M56p34
1541b27K85M57r85L2R74n49l60Q01m09p31R48R6q88O81L23r85L25Q20q69q0J024
1562F83o59n73J089l17q94J003J91j084O32N02j161L29R85q66k71R46p22n40J259
$$ plain form
1581 532 369 -641 278 357 -869 -7 781 -336 -243 600 -495 -581 786 220 -528 544 106 -813 449
1600 449 703 -442 117 498 -725 -250 874 -114 -370 543 -355 -779 548 347 -598 291 157 -885
1618 -885 103 695 -418 -95 513 -488 -375 709 85 -422 446 48 -619 417 369 -491 132 413 -484
1637 -484 -114 553 -298 -290 449 -120 -480 353 144 -530 235 308 -488 50 371 -403 -49 532 -127 -286 288
1658 288 -78 -340 367 320 -342 81 237 -361 73 483 -192 -218 171 -151 -231 405 123 -366 19 10 -374 109
1680 109 406 -281 -274 98 -217 -94 512 95 -316 92 72 -227 277 410 -271 -124 216 -155 16 396 -76
1701 -76 -309 158 -34 -251 265 103 -381 -21 139 -325 12 337 -247 -233 272 -57 -176 326 -29 -297 229
1722 229 138 -264 124 230 -295 66 307 -164 -76 259 -202 -171 313 -29 -205 151 -83 -276 183 140 -302
$$ packed form
1581E32j63j010R19P9j226Q62P88j117R3Q43j095q6J367n66p48J072m38r19J262
1600D49K54j145N59L81j223M75J124r88k56R13q98m24J327k01r45Q89j34j042
1618h85R88N92j113L23O08j001J13J084o24n07Q68l98o67J036m8q60O23K81q97
1637d84L70O67q51QP39n69l60Q33k09o74P65P3p96N38L21p74L54N81o59j59N74
1658B88l66k62P07m7o62M23J56n98M34M10o75k6L89l22q0O36k82m89L85rl84M83
1680A09K97o87PL72l15J23O06m17m11M08k0k99N04J33o81J47L40l71J71L80m72
1701g6k33M67j92k17N16j62m84L60J60m64L37L25n84J4N05l29j19N02l55k68N26
1722B29r1m02L88J06n25L61K41m71Q8L35m61L1M84l42j76L56k34j93M59m3m42
$$ plain form
1743 -302 -5 148 -228 31 325 -145 -169 229 11 -82 343 65 -192 143 131 -77 221 222 -224 -116 99 -135
1765 -135 92 221 -204 -182 69 -41 -25 188 -53 -201 -10 14 -26 127 46 -179 -31 97 37 133 110 -124 -23
1788 -23 82 96 64 69 -44 -153 7 69 5 3 -74 -131 -34 29 -22 14 -49 -134 -15 50 39 -4 46 -46 0 31 53 32 -21
1817 -21 -39 -3 109 111 33 11 -18 -2 75 128 1 -45 -78 -55 15 49 32 -50 -39 -65 -11 43 -7 16 -61 -98 50 105 86
1846 86 13 43 -16 75 118 59 9 28 -49 -14 99 71 -10 -46 -63 -95 42 59 -77 -83 -56 -77 24 37 -22 -114 -72 -32 36
1875 36 78 91 -17 -28 43 4 118 111 -21 -9 65 14 71 111 -39 -70 -37 -10 -39 15 -27 -97 -60 -21 0 22 25 -112 -113
1904 -113 74 35 -24 75 -7 -56 84 129 65 44 -8 -52 30 119 46 -31 -31 -61 -13 123 97 -77 -3 -32 -90 27 177
1931 177 -20 -140 28 -55 -27 130 32 -149 -8 -7 -105 81 144 -74 -65 195 39 -26 157 -39 -186 74 62 -125
$$ packed form
1743c02K97J53l76K59K94m70k4L98k18r3M25k78k57L35j2k08K98Jm46J08K15k34
1765a35K27J29m25K2K51j10J6K13k41j48J91K4m0J53q1k25J48J28o0R6k3k34J01
1788b3J05J4l2Nj13j09J60O2o4kp7n7R7O3n1L6o3q5J19O5j1m3N0r2M6L1K2k1n3
1817b1j8L6J12Kp8k2k9J6P7N3j27m6l3K3P0L4j7q2J1k6N4N4n0K3p7l7J48N5j9
1846H6p3L0n9R1M3n9n0J9p7L5J13k8q1l6j7l2J37J7j36oK7k1J01J3n9r2M2M0O8
1875C6M2J3j08j1P1l9J14pj32J2P4n1N7M0j50l1L3K7k9N4m2p0L7L9K1K2Lj37j
1904a13J87l9n9R9q2m9J40M5o4k1n2m4Q2Q9p3p7%l0M8J36k6j74P4k9n8J17J50
1931A77j97j20J68q3K8J57r8j81J41Jr8J86O3k18RK60j56o5J83j96j47K60j2j87
$$ plain form
1955 -125 84 49 -254 -68 124 -69 -49 159 -174 -174 160 97 -122 161 41 -217 117 209 -50 -13 143 -133
1977 -133 -57 263 -10 -103 102 -54 -166 142 136 -239 -42 86 -195 -46 203 -162 -164 136 -70 -123 238 39
1999 39 -232 106 128 -150 177 157 -190 -66 260 -49 -59 253 -114 -250 145 77 -156 97 102 -364 14 235
2021 235 -153 -80 207 -221 -168 283 14 -161 137 21 -316 119 251 -175 75 216 -278 -24 322 35 -111
2042 -111 258 -93 -315 291 176 -296 27 106 -334 -6 324 -249 -209 245 -183 -166 330 9 -309 217 58
2063 58 -318 197 254 -322 -5 277 -219 -61 341 -175 -241 302 26 -277 228 17 -343 121 232 -320 18
2084 18 288 -274 -200 354 -107 -179 266 -73 -287 264 182 -264 119 229 -240 12 382 -134 -93 225 -116 -147
2106 -147 356 -41 -272 194 85 -289 110 213 -293 -107 184 -192 -88 311 -124 -255 170 -15 -208 238
$$ packed form
1955a25K09l5l03J86J92j93K0K08l33%L34o3k19K83j20k58L34R2k59L7J56k76
1977a33P6L20k73r3K05j56j12L08ol75J97J28k81J49K49l65kL00k06n3L61j99
1999C9k71L38K2k78L27k0l47J24L26l09j0L12l67j36L95o8k33K53Nm66L78K21
2021B35l88P3K87m28N3M51k69j75K98j16l37M35J32m26K50J41m94K54L46k87j46
2042a11L69l51k22O06j15m72L23P9m40L28L30n73M0M54m28J7M96l21l18N26j59
2063E8l76N15N7n76L17K82m96J58M02n16o6N43k76l03N05k11l60M64J11n52L38
2084A8K70n62P4N54m61p2M45l39k14N51q2m46L83J10m69K52L70n16M1L18l41l1
2106a47N03l97k31M66j09l74L99J03n06J86K91l76J04L99m35j31M25j85j93M46
$$ plain form
2126 238 143 -295 26 197 -176 109 277 -119 -185 253 -27 -154 148 45 -280 115 152 -123 18 115 -249
2147 -249 -102 229 -94 -172 157 -28 -272 182 165 -204 82 167 -208 14 271 -111 -101 296 -87 -171 270 58
2169 58 -254 82 36 -213 102 198 -225 -122 155 -125 -60 237 -50 -220 199 -5 -176 192 95 -258 43 136
2191 136 -156 4 244 -137 -118 233 -17 -84 179 -47 -248 129 100 -175 84 109 -284 -58 157 -44 -35 91
2213 91 -144 -151 144 89 -157 82 24 -154 103 147 -67 49 39 -122 -27 181 -22 -95 127 -83 -117 111 78 -141
2237 -141 30 27 -147 -31 142 -124 -75 24 -79 -12 95 29 -128 55 -3 -62 86 57 -35 -16 84 22 47 45 -4
2262 -4 -91 51 51 -12 24 -37 -42 -24 -1 -12 -33 -5 -109 -64 9 21 -36 19 -5 -17 38 86 19 -11 -56 -52 12 91 48 -15 -35
2293 -35 -48 21 32 87 -51 -66 -1 10 16 47 -31 -58 -10 -46 -26 34 -2 -55 -44 50 12 22 29 -40 -44 18 65 -6 44 54 -33
$$ packed form
2126B38r5m38L21J71l73K85J68l96o6M38k80j27L02j03l25L95L7k75J41R7l64
2147b49J47L31l23p8L29j85k44M54j7l69K86Q5l75K22K57l82J0L97l83q4M41k12
2169E8l12L36m6k49L15R6m23J03K77k80O5K97k87j70M19k04j71L68r7l53L01R3
2191A36k92J60K40l81J9L51k50o7K63k26k01L77k9k75K59K5l93K26K15k01RJ26
2213I1k35pK95n5k46K39n8j78K57M4k14J16j0j61R5K08k03p3K22k10l4K28l3k19
2237a41J71lj74J16J73k66M9R9j03O7J07o6j57J83n8n9J48k9r2J9J00o2K5km9
2262dq7J42%o3L6o1nJ8K3j1k1K8j04M5P3J2n7N5k4j2N5M8o7l0m5MO4P9m3o3k0
2293c5j3O9J1N5j38j5O5J1OL1p8k7M8l6K0O0l6n3J1R4l8J0Po9mO2M7p1N0J0q7
$$ plain form
2324 -33 41 27 16 55 -38 -68 25 2 -35 -36 -16 -55 -8 55 33 36 33 -13 -41 17 67 1 11 27 52 30 70 86 56 -17 -59 32
2356 32 63 37 -68 19 -58 -45 11 48 -56 -66 -66 -8 -17 31 -19 -20 -2 2 51 44 -30 -63 33 42 36 36 17 -10 -16 2 51 38 23 -29
2390 -29 -9 4 -40 6 33 -5 -29 -4 36 -30 1 -7 -70 -49 50 121 23 -24 -73 4 26 58 31 12 10 -21 23 57 74 -41 -3
2421 -3 -6 -64 20 67 -44 -23 7 -30 -36 -17 -4 -111 -33 13 -48 25 2 -75 -58 84 63 23 59 7 -31 17 88 -15 41 -11
2451 -11 -65 -8 111 -21 14 42 -93 -36 53 19 -73 27 -40 -126 -5 26 -10 41 113 -68 29 92 30 -27 112 -9
2477 -9 -16 140 90 -98 72 58 -86 0 83 -116 -59 96 -44 -34 78 -76 -156 19 54 -96 92 24 -160 16
2501 16 110 -33 -12 113 -74 -59 155 -24 -66 138 69 -143 77 197 -70 29 56 -147 -27 204 -41 -15 128
2524 128 -87 -174 109 99 -133 62 45 -176 7 135 -85 -34 167 -85 -102 152 -20 -118 111 55 -84 68
$$ packed form
2324c3P4j4j1L9r3l0R3k3l7jK0l9M7O3k2Llm6k8N8N0o6J0J6K5k2M0J6l0p3m2R1
2356C2L1k6j05Q7p7J3N6L7j04j0%N8rM8n0jJ8MM9pp4l3R6Ro%j9k7oJ8M9j3j5n2
2390b9K0J3m4M6K7l8k4K5M0o6L1qo3K1R9P1r8m7m9P7K2L2k7j9kl1M4L4J7j15L8
2421cln8Q4M7j11K1L0l7oJ9J3j07P8M6o1P3k3p7J7J42k1m0L6n2l8M8P1j03N6n2
2451a1n4N7J19j32L5K8j35N7Q9l4r2J00o7q6J21L1l6N1P2j81R7O3o2n7J39j21
2477ipJ56n0j88J70j4j44Q6Q3j99N7J55j40J0J12j54q0J75L5j50J88o8j84J76
2501A6R4j43K1J25j87J5K14j79m2K04o9k12K20J20k67R9K7k03J20K31k45K6J43
2524A28k15q7K83j0k32J95j7k21J83J28k20N1K01k52j7K54j72r8K29n6j39J52
$$ plain form
2546 68 48 -86 -79 140 -99 -134 147 -69 -154 129 52 -154 79 62 -162 12 203 -136 -28 147 -106 -50 182
2569 182 -18 -64 126 5 -164 92 97 -107 20 32 -140 -27 135 -108 -91 52 -96 -154 138 6 -149 94
2591 94 75 -109 55 102 -105 -42 139 -59 -46 161 63 -177 93 21 -154 55 125 -179 14 79 -87 -20 117
2614 117 -69 -142 95 -58 -164 82 28 -209 25 93 -125 38 133 -143 -52 179 -8 -71 192 23 -101 106
2636 106 107 -126 71 52 -159 -16 137 -59 -90 78 -46 -112 141 3 -144 79 6 -190 84 158 -105 -30 62
2659 62 -148 -38 171 9 -82 57 -26 -101 144 92 -147 17 93 -103 -16 156 -113 -121 133 -31 -72 94 1 -125
2683 -125 -26 37 -67 8 84 -68 -29 109 -73 3 137 -31 -91 108 19 -139 108 5 -90 16 68 -90 8 1
2707 1 -131 -65 117 -19 -81 4 -2 -120 12 63 -83 -75 67 -57 -11 114 -109 -91 64 13 -35 134 87 -20 43
$$ packed form
2546F8k0j34PK19k39l5K81k16q5K83p7k06K33j7k24J74J91l39J08J75k53N6K32
2569A82k00m6J90j21j69K56Nk04J27J2j72J13J62k43J7J43j48n8K92j32j55K43
2591I4j9j84J64M7k07O3J81j98J3K07r8k40K70p2j75K09P0l04J93O5j66O7J37
2614A17j86p3K37j53j06K46n4k37K34O8k18J63R5k76R1K31j87o3K63j69j24K07
2636A06Jk33J97j9k11J43J53j96l1J68j24o6K53j38j47K23p3j96K74P4k63P5R2
2659F2k10J10K09j62r1J39q3p5K45n2k39J64P6j96Q7J72k69qK54j64m1J66r3j26
2683a25R9O3j04P5P6j52L9J38j82P6J34j68o0J99q9j58K47j03r5J06N2j58R8p
2707Aj32O6J82j36o2Q5oj18J32N1j46QJ42j24M6J25k23J8J55n1m8J69m7j07O3
$$ plain form
2732 43 19 14 17 40 -54 -92 19 7 -64 44 7 -106 -21 -24 -57 21 4 -46 -12 37 71 38 83 -1 -53 65 22 -40 54 29
2762 29 -83 -18 28 -35 5 30 -19 -25 12 37 -63 17 -8 -21 29 -19 -28 -12 15 0 -60 13 -11 -54 22 17 21 58 36 -27 34
2793 34 7 -35 -15 35 -57 -111 -25 -33 3 48 -37 -62 -18 -17 10 36 -22 -34 -11 11 -13 26 5 20 5 -13 72 4 44 7 -71
2824 -71 27 -40 -18 -26 -6 -44 29 -2 14 -47 -30 -35 -1 4 -10 -25 16 -34 -65 48 43 24 -9 -29 3 56 46 37 -4 25 23 18 -2
2857 -2 52 -21 -44 -5 8 -39 12 -62 -18 -51 21 -14 11 -29 -71 -28 -5 38 9 -11 -69 -49 -44 16 58 35 -34 13 11 50 71 47
2889 47 -6 -36 28 23 40 -30 15 -20 21 8 -11 13 5 -55 -19 -9 64 -37 -53 31 11 -12 33 16 -30 -6 41 16 51 -2 -29
2920 -29 -35 62 -15 -17 42 -18 -78 -37 -37 -22 -14 -6 38 -25 20 -18 -27 -38 -41 -11 62 61 -35 57 -39 -78 32 21 -43 23 -15 -38 14 60
2954 60 -9 -84 6 -29 -112 25 -17 -66 -1 5 -72 -11 36 -23 -27 -25 -30 -20 14 85 -18 -25 34 -14 43 12 5 47 68 26 -25 23
$$ packed form
2732D3k4nLK3r4l8J11j2p1J08l7j13Q5ll3P8j7n0L4M9L4l3M5q4n2J18m3o2R4k5
2762B9j12O5M6o3M0K5m9oL7K5j00Q0k5j3N0m8rJ6K7j5o0P3k4m3P6nML7k2o3O1
2793C4k7m2K0N0r2n4Q6qL6M5q5k5M4JK7K6n8j2K3K2k4L9k1J5j5j8Q5o8M0l7p8
2824g1R8o7K2qK0l8P3l1J6o1J7nL4Nj4j5M1n0l1J13nj9l3k0L2N3j0rm1K9knk0
2857bN4p3k3L9J3m7N1p4M4l3P2l5K5m0m2M3K3M3k9k0n8K0NO0M2k3o9M7kL9K1k4
2889D7n3l0O4nJ7p0M5l5M1j3j9K4qo0L6J0P3j01j6Q4k0k3M5j7m6K4M7k5L5n3k7
2920b9oR7p7kN9o0o0M1%J5QQM4o3M5l8rj1lL0P3jr6R2r6l9J10j1o4O6l8k3N2M6
2954F0o9p5R0l5q3J37m2m9O5Op7O1M7n9mKnJ0L4P1j03pN9m8N7l1pM2K1m2n1M8
$$ plain form
2986 23 22 -59 15 8 -80 34 -19 -108 4 9 -56 -44 54 -59 -23 77 -22 15 32 -30 -47 69 58 -8 -12 46 -50 32 177
3015 177 2 3 49 -24 -111 67 -31 -86 14 55 -84 -25 55 -66 -24 -17 -31 -38 55 -21 -69 -12 23 -51 74 60 -62 7
3043 7 32 -69 -14 122 -19 -57 62 -10 -25 50 -4 -71 36 35 -73 30 117 -84 -67 132 -18 -66 95 -39 -45 66
3069 66 6 -103 -15 102 -87 -14 39 -51 -36 66 -33 -83 129 -41 -118 -25 16 -89 49 44 -84 -80 36 -69 -48 137
3095 137 -8 -111 66 -12 -37 71 7 -15 12 56 -37 -1 122 -34 -37 39 -46 -52 70 60 -129 13 -18 -83 -48 84
3121 84 -101 -70 50 -102 -37 88 -30 -112 59 27 -82 65 -11 -91 71 94 -48 -32 104 -26 -44 65 -16 -51
3145 -51 120 7 -53 85 14 -49 -13 53 26 -11 79 -48 -61 65 -14 -37 88 47 -150 -9 47 27 -45 58 -73
3170 -73 -78 26 15 -54 48 -15 -56 39 63 -55 16 47 -101 -5 85 -40 -68 46 -39 -81 64 39 -3 69 39 -57 -7
$$ packed form
2986B3jq1P4pq8J14n3q9J12No5J2R8j13L6J00r9L7J7o2j7J16j1o6mN8r6Q2J45
3015A77j75JM6p3q7J78r8n5J00M1j39N9Q0j21M2Pj4pR3p6m8N7L5p4J25j4j22O9
3043GK5j01N5J36j41l8J19p2j5P5n4o7J07jj08J03Q7k01J7J99j50m8J61j34oJ11
3069F6o0j09Q8J17j89P3N3r0J5J02r9n0K12j70p7R3M1j05J38nj28MJ16j05K1J85
3095A37j45j03J77p8k5J08o4k2K7M4r3L6J23j56lP6q5oJ22j0j89J42l1o5L5J32
3121H4j85L1J20j52O5J25j18q2J71l2j09J47p6q0J62K3j42J6J36j30j8J09q1l5
3145e1J71j13o0J38p1o3L6O6k7l7R0j27j3J26p9k3J25m1j97J41N6k0p2J03j31
3170g3nJ04j1o9J02o3m1R5K4j18P1L1j48R6R0j25k8J14q5m2J45k5m2P2l0r6N0
$$ plain form
3197 -7 25 -15 50 59 -2 -16 33 -54 -27 14 0 -124 -4 57 -46 46 75 -119 -16 23 -74 -88 55 32 -59 14 14 -52 29
3226 29 93 -40 59 38 -46 -13 37 -38 17 -6 -16 -120 -11 5 48 9 -26 -101 -18 19 -34 -34 17 -27 -16 4 21 -47 12
3255 12 35 -26 67 18 18 -10 50 -29 -25 49 -15 -18 38 -45 -31 13 -4 -13 -11 0 -60 -10 67 -38 -64 -30 -65 -18 15 53 -27 44
3287 44 19 31 22 21 -47 -44 54 -8 -20 38 -26 -46 30 4 -13 -73 8 -59 1 -8 9 -21 12 -11 -20 30 11 38 42 23 -31 48 -40
3320 -40 -18 -44 26 7 -9 59 -9 8 17 -20 -56 15 -19 6 -14 -41 4 17 17 -24 -3 -18 -5 23 56 3 -2 -30 -2 50 9 -10
3352 -10 12 -42 54 1 5 29 10 4 -16 51 11 -45 41 -12 -28 60 -5 -9 -32 -66 -39 -1 -6 -14 36 33 -30 -5 76 40 -8 30 -3
3385 -3 40 27 28 -27 1 -46 -31 6 16 -2 -27 15 1 -31 32 -15 -68 -10 -7 -15 -48 31 -63 -46 -67 -43 23 -37 -12 -8 -20 25 -2
3418 -2 13 5 -13 26 43 -19 43 13 17 -17 4 -67 -12 42 -49 -29 37 19 -59 -1 -28 -98 -32 -58 40 -34 36 -17 2 -3 -19 -7
$$ packed form
3197gL2m0O5Ro1j4M9q7K7M1j4j24J20O1j03R2K9j94J03L9r7j4J43k3r1P3%o6Q1
3226B9O4j33R9k1q4L3N0p5N5k3j0j04J09J6M3l9l5p5Q3L7n3%N1m4J1K0J7o8N9
3255A2K3o1R3m9%k8O0p9MP4o4lN6q3J4M4j7rKJ1o0N0P7j05k6L4l5M7L3L8q0P1
3287D4k5J2rjo8LR8o2j2N8o4k0P6k6j7o0Q1o7O0rJ7l0L3k3rN0j9K7Mj9n4P9q8
3320d0K2k6P0j9j6O8o8J7Rl7l6P1l4K5k0k7M5J3%m1K1j5J3K8L3n3nk8K8N2m1j9
3352a0K2n4R6n3MK4j9ok0O7m0n6Q6n3j6Q8o5mk3l4K7L8nqN0lo3K5Q1l6m8L8l3
3385cM3j3Jn5K8m7J5L7J0j8k5M2j4l2O3m7n3N8Lql3P9r4J7k1K4O6o0K5Mj2M5k7
3418bJ5qj8L9J7o2O2l0Ml4K1p1N5N4r1K0O6j8p8N8k7p0O6k6R8p4P0n3J9nj6J2
$$ plain form
3450 -7 28 43 15 51 -42 6 -55 -53 -30 -8 -31 -26 -45 4 -3 -35 12 -35 -63 -11 22 -20 10 51 13 25 -32 -53 32 16 -55 36
3482 36 12 -13 1 43 31 -90 -40 25 -21 -51 37 -45 -21 53 2 -42 36 34 -25 15 -37 -1 30 64 -54 22 40 -65 -16
3511 -16 40 7 -4 42 -22 -33 8 42 5 -39 79 -24 -12 -35 4 -17 42 -13 -79 13 0 -49 85 16 -90 -46 27 -29
3539 -29 32 25 -4 -32 59 -56 -25 66 0 -23 -34 11 -32 -18 -2 -57 -59 8 -27 -26 60 31 -41 38 -35 26 20 -25 -19 36 -9 -75
3571 -75 -13 28 5 -28 31 -12 -4 54 37 -47 32 -22 -33 -40 58 -31 -17 23 -31 -26 -16 38 -5 30 9 -88 13 29 -56 4 62
3602 62 -43 -54 18 12 11 21 -18 -64 -16 11 -15 66 22 -26 -42 44 -60 -5 69 -16 -57 -4 20 -49 -2 6 -55 -20 58 -37 -16
3633 -16 14 -14 -48 53 -11 -86 111 -4 -21 2 3 -37 33 41 18 -30 67 -8 20 51 -55 -30 -2 -21 -8 -32 54 -39 -26
3662 -26 32 -37 -11 63 17 -54 58 -15 -30 37 24 4 16 28 -27 -36 37 -20 -33 5 -64 -12 17 12 -12 51 63 -60 -56 18 33
$$ packed form
3450gL5J5k8L6r3M8o1KK3K2k3Nj9M9pl2M7m7k8N2L3m2L0M1l8J2n7k1Q5j6p1R1
3482C6k4k5J4M2j2j21N0O5m6l0Q8q2K4P4n1m4P8kn9M0n2L6L1L4j18P6J8j05M9
3511a6N6l3j1M6o4j1M1L4l7m4J18j03J2k3L9k1N9n5o6R2j3m9J34o9j06M4P3n6
3539b9O1pk9k8R1j15L1R1o6k3j1M5m3J4J6n5kO7l5JQ6k9p2P9p3O1om5ON5m5o6
3571g5O2M1k3l3N9m3QN8j7q4P9n4j1pR8q9J4M0n4NJ0N4m3L5k1r7J01J6q5O0N8
3602F2j05j1P2ojJ0l9m6M8K7k6Q1m4m8j6Q6j04N5P4q5m1N3K4o9M7Qo1L5P8r5K1
3633a6L0k8l4J01o4p5J97j15j7K3Jm0P0Qk3m8R7p5K8L1j06K5K8j9J3k4Q6r3J3
3662b6N8o9K6P4m6p1J12p3j5O7j3k0J2J2n5rP3n7j3L8o9N2K9nk4O3J2j23MP4J5
$$ plain form
3693 33 21 3 -63 -15 -18 29 -79 -6 -28 -34 -16 0 -55 34 -3 -101 21 17 -19 10 50 -19 -100 40 3 -6 40 7 -24 1 63
3724 63 -24 31 26 -8 -41 13 24 10 20 -17 -29 -1 31 21 8 77 -25 -52 -2 -55 -35 22 -1 -17 -50 -6 -37 -20 19 -32
3754 -32 4 -17 20 19 46 6 -9 27 -45 -18 27 32 -60 -33 29 14 29 40 26 -18 -33 52 2 11 21 -37 2 -18 52 -28 51 -13
3786 -13 -57 20 -4 44 -6 -4 34 -27 -4 -6 25 21 -3 13 5 -20 35 42 14 10 2 2 -2 18 8 -60 1 31 -9 -12 58 17 57 31 18
3821 18 -11 19 11 -6 29 -3 -13 -66 -11 -11 10 -15 -5 -17 -4 -30 -18 -7 22 -35 -41 -52 12 -27 23 27 -27 -25 38 -55 29 26 -47
3854 -47 6 50 21 -11 3 39 4 16 -17 2 28 30 -12 -29 46 -46 -47 -31 -5 -17 -49 -54 -35 7 -13 -31 11 -38 -22 20 -9 5
3886 5 3 -37 -15 -3 -10 37 6 20 -56 -15 17 -10 8 -9 -30 5 19 35 47 0 -29 -2 -54 14 -4 -8 16 -37 21 4 -5 -8 1 2
3920 2 -25 9 -27 20 -22 9 -35 -18 -11 -2 5 36 -13 4 1 19 18 11 -26 39 51 5 -31 9 2 53 -26 23 -18 -14 3 -8 -11 -13 -16 -19 -4
$$ packed form
3693C3j2j8o6M8lM7j08P3k2oJ8J6n5Q9l7r8J22ml6K9M0o9q1J40l7rM6l3l1K5O2
3724F3q7N5nl4l3N4J1j4J0l7j2K8L2j0j3O9j02k7N0n3K0N7k3j6l3M4l1J7L9n1
3754c2L6k1L7jK7m0j5L6p2K7M5Nr2K7O2j5J5J1j4m4j5Q5n0RJ0n8L9k0P0q0P9o4
3786a3m4P7k4M8n0KL8o1K3kL1mk4J6qk5N5Pk8mq%mK0j0o8O1L0m0lP0m1M0k6j3
3821A8k9L0qj7L5l2j0n3N5%K1k5J0j2J3k6J2J1K9n7oj1O4l9N0Mn4KO3r3Q4lp3
3854d7N3M4k9l2J4L6l5J2l3J9K6Km2j7P5r2jJ6K6j2l2nJ9M2k0j8M2m9J6M2k9J4
3886Ekm0K2J2pM7l1J4p6M1L2k7J8j7k1L5J4J6J2m7k9K7n2O8j8mK4n3N8j7rlRJ
3920Bk7L4l6M7m2L1m4J7PRPL1m9J7lJ8jpl7O5J2m6l6M0pN1p9M9m1MJ7j1lkllJ5
$$ plain form
3957 -4 5 15 -80 0 -16 -65 -43 6 51 -38 16 -73 30 -3 -44 7 -58 4 23 50 -22 44 6 -4 18 -16 23 -15 46 8 16
3988 16 -10 3 -18 -6 -7 -35 -55 -17 -2 -12 -10 -6 1 -13 -48 -42 6 11 12 35 1 -30 13 -7 22 -32 21 61 -40 22 0 -21 -17 22
4022 22 17 -43 -7 -15 -12 -2 -37 9 -22 -24 -18 34 -9 7 -6 54 33 -1 -46 17 -32 -19 41 -30 4 22 -18 16 25 9 -47 -8 0 -29
4056 -29 -23 -2 -52 -41 13 -49 41 34 1 19 -9 -4 -22 70 55 23 65 -18 -38 29 10 -26 30 48 -12 11 -34 -24 -61 36 -8 -85
4088 -85 17 -21 -47 -5 -9 -45 -58 -11 22 -42 18 18 -25 55 5 49 31 47 31 62 0 21 13 19 60 -9 23 -56 -6 45 -40 -14
4120 -14 -40 -34 5 -8 23 -56 -35 3 -58 -49 41 2 -43 -17 -43 -24 18 6 -15 -25 16 -39 27 27 -3 92 -38 -4 14 79 55
4151 55 30 -12 20 -87 -61 52 -55 -1 25 5 7 18 18 -2 66 4 -39 12 46 -42 -6 30 -10 8 19 -20 -48 11 -17 -17
4181 -17 7 22 6 26 59 4 -22 7 -38 -27 41 -78 -41 11 4 10 31 -17 2 3 14 -6 47 4 -77 -30 -4 -13 -19 47 -1 -78
$$ packed form
3957dRJ0r5Q0j6m9K2M9M5q9N4q9J03l3m1N1o5O2J9K7p2O6l8j0K2l4L9l8O1l8Q
3988A6k6J3k1J2jk8k0L8J5j0KMPj4l5OM8NJK3l4l1M3k0K9n4N3M0j01O2k2k1ML9
4022B2no0L6qLJ0l5M6l1kON2m3J6j3O0k1l4m5O3m9J3O0p1L4J8m0L4Rj6n6L9Qk9
4056b9OK1n0J1N4o2R0pl3J8k8Nj8R2j5l2M2q3k0O7j9l6N6J8o0K3m5J0l7R7m4p7
4088h5J02l8k6M2ml6j3M7L3o4O0%m3Q0n0M4j8J6j6L1o2K1qOM1o9L2p9N0N1q5K6
4120a4k6OL9j3L1p9K1L8o1RR0l9m5K6k6J9M2j2k1j0M1n5O6%l0R5j30L4J8O5k4
4151E5k5m2L2j07K6J13j07N4K6k0KJ1%k0O8o2m3N1L4q8L6L6m0J8J1l9k8N9k8%
4181a7K4J5j6K0L3n5k6K9m5J1O8j19L7N2pOK1m8J9JJ1k0N3m3q1M7K6roO6m8p7
$$ plain form
4213 -78 -3 -32 -4 36 -8 -42 -58 31 -31 9 44 -28 -37 -37 -12 -43 11 71 44 43 30 7 28 24 1 -10 14 -9 37 -11 -11 -47 -61
4246 -61 3 -46 -5 4 -26 14 -42 20 2 -3 -9 32 42 15 -19 -79 -4 -33 37 2 0 -19 57 -20 -6 37 6 37 -19 29 -31 45
4278 45 -12 1 9 22 -23 -5 1 19 3 18 -11 -37 -4 -23 22 51 -15 -12 8 15 -28 -4 -37 -8 -10 -35 11 -5 62 40 0 25 9
4311 9 15 18 12 -12 -52 40 45 -18 18 27 -41 15 -6 3 30 -4 -2 -22 -4 16 22 -3 7 -45 64 -23 -40 4 11 -27 -49 -18 -2 -9 -12 -39
4347 -39 -9 -14 -1 -3 -24 -15 12 -1 31 -58 -7 -15 3 -46 31 -34 17 16 8 -46 -27 13 -40 3 7 31 -7 -13 -16 -52 -8 2 35 15 -35
4382 -35 -36 29 43 26 17 -15 16 -15 -51 23 13 -29 -54 18 22 35 55 10 -19 -14 2 -3 24 4 2 -92 1 6 -21 8 57 11 0 -37
4416 -37 -12 -15 11 -8 -57 35 2 -50 -10 39 1 9 -26 -16 29 21 -65 -39 20 35 -7 48 19 9 -7 26 -42 -17 36 32 44 13
4448 13 -13 -10 2 -5 -44 14 44 -18 4 -34 -53 3 25 -1 -2 11 -22 29 -39 34 -4 11 -12 -13 -30 -15 -1 -8 -15 17 12 -8 37 -9
$$ packed form
4213g8P5k9K8M0m4l4j6Q9o2M0L5p2r%K5l1N4O0k7jj3k3K1mk3j1K4k3M6m8%l6j4
4246f1O4m9M1Rl0M0n6O2j8noM1J0k7l4o0P5k9P0l5kj9P6p7J4M3l1L1n6M8o0P6
4278D5n7J3QJ3m5J8OJ8j6J5k9k6L3j9M5K9o6LK0Pm3K4l3K9kk5M6j6O7k2m0K5j6
4311IOLok4m0R2No3L6Ro8N6k1RK7l4Kk0J8K0Ok5J0n2J09q7j7M4Pl8k2L1J6plk7
4347c9L0nJ3kk1RK7j3L2q9N1qJ8m9P7o5N1jqn4J9M0n3M3MK4l8oll6M4J0L3k0n0
4382c5jO5J4j7rl2L1l1l6P4j0m2k5P2MJ3K0m5k9NJ6nK7k0kr4R3Nk7K9M9m6j1l7
4416c7K5lK6j9m9R2l3n2M0M9l8Ql5J0M5qq6K6N9J5m2N5k9j0j6L3o8K5N3mJ2l1
4448A3k6LJ2pl9N8L0o2K2l8j9N6K2k6jJ3l3N1o8P3l8J5k3jj7J5J4ppL2nk0M5m6
$$ plain form
4482 -9 -16 80 16 12 6 2 5 27 -8 -75 -11 29 -3 12 -30 23 -15 -7 7 -51 -9 -14 -5 -36 -9 -63 2 -86 -14 18 2 -45 30 59 48
4517 48 -27 38 38 -12 19 -35 23 3 9 18 50 3 -33 -9 -1 8 28 14 55 -35 50 46 8 32 -12 1 42 60 -3 9 -24 -56 31
4550 31 8 6 -22 -23 -14 11 40 32 6 -58 -1 -23 -11 36 -16 -2 -3 -8 8 33 14 -45 30 5 37 38 25 -2 -10 14 3 11 31 0 12
4585 12 -3 -9 -62 -6 -20 -68 -16 0 5 1 -12 -41 -32 -23 40 -31 10 10 17 -30 55 -29 -31 75 -36 -49 -15 3 8 29 13 -38 11 49
4619 49 -30 -20 -10 -49 12 -22 -1 -27 33 19 -13 16 12 -16 19 -7 29 28 22 -63 2 8 1 41 -3 29 6 -7 5 46 -4 -13 -29
4652 -29 6 -45 -29 -9 -3 17 -39 31 30 -16 24 -1 -9 -7 -48 74 30 37 -3 -66 -36 -16 -4 -12 -20 -11 19 17 -43 1 12 -9 -24 -5
4686 -5 -30 0 15 -27 15 17 37 -54 54 19 4 2 18 -3 -14 10 22 16 -7 2 57 15 -10 4 -9 -18 -4 -21 10 5 -23 -7 -56
4719 -56 -33 14 -29 15 22 29 24 -23 12 -32 28 31 -13 -20 -20 -20 -8 19 -35 12 -1 13 9 -13 51 -35 30 36 -59 3 12 14 29 13 16 4
$$ packed form
4482ipR6o4momLK2l5o7O4M0l2J5m2N3l8QJ4n8M2nRl1K7n4O5q8P2L2j6m7P5K9j1
4517D8p5O5%n0L1n4N8k0ORL2m7l6K4QRK0j4M1r0Q5ml8K4m4J3M1J8o3J2l3l2Q7
4550C1k3kk8jRK5K9qk6o4N7k2J2M7n2J4jnJ6K5j9n9P5k5L2Jj3k7qK4j1QK0l1J2
4585A2j5on3N6j4m8N2J6Nmj3k9RRO3p1M1%Pm7Q5q4kJ06j11j3L4J8NK1j6n1M9L8
4619D9p9J0J0l9O1l4K1k6O0j4l2K9mk8L5k6L6joq5O5OpM0m4L2k3j3J2M1n0rj6
4652b9L5n1J6K0OK0n6P0jm6M0k5qKm1J22m4Pm0o3L0K0J2qqRL0ko0M4J1k1j5J9
4686ek5L0J5m2M2KK0r1J08l5j5kJ6k1j1K4J2ok3RN5m2k5J4j3rJ4j7L1nk8J6m9
4719e6K3M7m3M4PPnm7L5m4O0Lm4p%%J2K7n4M7j3J4mk2O4q6O5Or5O2RKJ5j6Lj2
$$ plain form
4755 4 10 -38 -60 -10 -48 14 -47 -9 5 -22 -28 -38 6 -15 8 -2 -17 -23 -22 22 11 17 -7 -15 -2 -19 -10 -24 -12 0 4 -55 15 -7 29
4790 29 2 21 -40 -52 -11 29 24 -39 -27 -18 -2 11 -73 30 8 -18 5 -8 -9 -66 -55 -36 11 49 -12 -41 -20 -26 21 -18 34 -10
4822 -10 -27 33 -6 3 -7 5 15 14 18 13 32 10 -23 3 -51 18 -6 -6 8 -36 -31 -25 7 -36 -16 -9 -18 17 -53 5 38 1 -10 56 17
4857 17 8 50 23 8 -16 31 -16 10 -40 17 25 21 -23 -63 -15 12 48 17 33 -27 -36 62 38 39 -34 12 62 19 3 2 -27 11 5 23
4891 23 -1 20 -10 -36 -30 -6 -2 23 7 40 -23 -9 7 -3 7 -31 33 -28 -20 -30 -44 17 1 12 -3 33 -28 47 -9 0 -1 -41 -10
4924 -10 -20 3 24 -64 16 -23 48 13 10 -26 49 -16 -3 34 -39 7 -27 21 13 -27 20 -17 35 15 -7 -9 -19 6 41 -14 -17 38
4956 38 25 18 -18 -8 15 -23 -4 -45 -38 -3 0 -21 -24 65 -4 -3 13 -21 14 -9 -41 2 29 -12 6 -38 -19 45 26 40 31 -34 12
4989 12 72 3 14 -15 -26 41 -30 14 -17 -49 -1 -13 8 25 24 -6 -43 -20 21 -6 15 -11 -42 -44 -15 51 0 -31 -26 -14 20 -16
$$ packed form
4755DOm8k2N0l8O2o1L8J4k7oj0M4k1K3j0j5oJM4j1Ok4qJ3j7Rj4J2J2Mn9P0k2L6
4790B9k7J9o1j2M1M0no3J2RJ6J3q4J03k2k6K3j3jn7J1J9M7L8o1k9K1oM7l9N2m4
4822a0j7O0l9Rj0J2J0jMnJ9k2l3K6n4O9k4%J4m4NOL2m3K0PrL5p0N8L3l7j1O6l9
4857A7rM2k7j5k4M7m7K6n0N7Qmm4m0M8K7L6l1J6o0rR8k4Jp3M6N0m3j6jk9L8oJ8
4891B3k4K1l0k6OK4MK5j6L3o3J4J6j0J0l8O4o1Qj0j4O1j6J1j5L6o1P5n6Rjm0L1
4924a0j0K3K1q8Q0l9P1l5ll6P5o5J3L7p3M6l4M8qm0M7l7N2k0k2kj0K5L5n5lN5
4956C8j3pl6J0K3l8J9m1PL5Lk1lQ9o9JJ6l4L5k3l2M3K7m1J8m4J9O4j9J4ro5M6
4989A2O0o9J1k9j1O7p1M4l1l2M8j2K1J7jl0l7K3M1k7K1k6l1kK9O6n1l1NJ2L4l6
$$ plain form
5021 -16 25 14 1 39 43 -22 -3 58 -2 -25 32 31 -42 -21 -30 -24 13 48 -55 -7 75 -25 15 50 -46 20 -9 2 -46 2 -36
5052 -36 3 -4 -8 2 -32 -12 -16 17 38 -4 -2 59 -30 -6 -30 -33 26 35 9 -4 6 15 24 -29 -9 10 8 -17 -1 10 47 25 15 -8 5
5087 5 -22 28 -33 43 63 18 21 16 -1 -4 -16 -34 -14 29 -6 3 33 -13 -20 -25 -30 28 25 -10 3 18 -29 -14 14 -18 -14 -6 -21 -11 58 35
5123 35 55 20 -17 -31 73 -18 3 0 -10 -9 -40 -38 0 -8 -5 -59 -13 13 26 14 -13 -19 -46 -6 16 -27 4 -1 31 28 0 0 16 3
5157 3 12 39 -31 26 12 23 3 -52 -44 20 -24 69 -15 33 -44 -20 -12 8 -8 -48 -46 7 -16 8 17 8 -36 4 6 -43 33 -7 -21 -48
5191 -48 10 5 37 2 -3 45 -30 69 -8 52 65 46 41 0 29 -25 1 27 0 -20 -33 -20 28 -24 -18 -10 -7 19 -30 -50 -33 -26 -25 -5
5225 -5 -39 -17 -6 -32 -13 49 -5 0 18 -32 53 44 -45 -7 12 -14 10 -20 19 19 -22 -11 -1 2 9 -2 -30 0 -12 -16 -15 -39 -42 20 2
5260 2 74 26 -5 19 -13 18 40 11 23 -40 -11 20 11 1 21 -12 -3 57 -5 25 -10 42 1 24 -35 24 14 -25 44 30 21 -4
$$ packed form
5021a6M1j1j3L8Mo5J9O1o0k3N7jp3K1rOL7L5j03M8Q2j00M0L5r6O6k9J1m8M8l8
5052c6L9pmJ0l4K0mL3K1m2KO1q9K4k4lN9Rk6j3J0RRn3K0J9kk5J6J1L7k2j0k3J3
5087Ek7N0o1P6K0m5Lnj7lj2j8K0M3l5RL0m6pnnN8ll5J3J5m7J5K8l2MQj5J0O9k3
5123C5K0l5l7j4J04r1K1lj0Jl1KL8qLn4M6K6J3j2k7ok7M0K2m3L1nL2lk8%J6j3
5157CRK7p0N7j4J1k0n5QO4m4R3q4M8p7K4QK0j6m0KN3k3K4Rrm4M0Km9P6m0j4k7
5191d8N8nL2l5nM8p5R9p7O0J3j9nm1K9n4K6K6k7k0j3J3M8n2OQLK6m9k0J7PJK0
5225el4K2J1k6J9O2n4NJ8n0Q5rq9L8J9k6K4l0L9%m1J1J0LPj1k8L0j2mJk4lO2j8
5260BP2m8l1K4l2L1K2k9J2o3K9L1rj0K0l3RO0o2L0l5N2m1K3n9N9j0l9O9j4rk5
$$ plain form
5292 -4 -5 66 -47 8 -30 6 35 -12 51 50 -15 -58 58 -24 22 44 -3 -10 5 -30 -5 7 3 45 24 30 -1 33 -5 -25 0 24
5324 24 -15 36 36 12 -24 51 63 12 3 37 10 -3 -14 -18 -44 -4 -19 13 -34 -52 10 -14 -19 36 5 49 1 -20 11 -7 -19 5
5356 5 -7 -7 0 -33 -39 -26 -22 1 -19 -4 -30 -14 -7 -2 38 -16 -13 -21 -13 3 -19 3 10 -40 -9 30 43 -12 -55 -20 7 37 15 -1 23 -1
5392 -1 31 0 -40 36 17 28 21 25 -6 0 17 2 40 2 3 12 4 23 0 69 -5 -20 12 13 10 -8 8 2 -11 2 23 -20 -26 -6 44 -33
5428 -33 -13 20 -5 32 32 23 -17 -36 29 40 -27 1 41 36 -4 4 18 59 30 -13 12 -4 -31 6 55 51 25 0 40 28 37 25 -30
5461 -30 43 28 -9 4 1 -47 17 -16 -27 15 -18 -49 -6 21 41 -3 11 15 9 4 48 1 6 20 10 7 -4 -23 -27 6 2 -17 77 23
5495 23 -26 18 64 3 -44 3 33 -14 -50 -12 -26 -23 -23 3 19 -18 -37 51 -65 19 -2 -50 20 -36 16 26 26 51 -25 13 16 -12
5527 -12 3 -26 -7 -14 12 -66 8 13 20 -52 10 -33 -32 -13 53 22 -1 14 27 26 -29 -26 -22 -15 32 -1 -2 7 56 -39 -2 16 -33 26 -21
$$ packed form
5292djP1j13N5l8L6K9m7O3jo5m3J16q2M6K2m7pJ5l5K5J2mM2k1Ol1L4l8k0K5K4
5324B4l9N1%k4l6P5J2n1rL4k7j3j1mk6M0j5L2m7j8O2k4nN5l1M4m8k1L1j8j2K4
5356Ej2%Pl3oJ3MK3k0J5k6J6PNM0n4LqQJ6k2K2Pn0L1L9J3n5m3L5K7L0k2j6K4k4
5392aL2l1m0P6j9J1pMl1OJ7j5L8l8JRqJ9k3O9p4j5L2Jlj8J6oj3J3K1m3oK0N0p7
5428c3K0L3k5L7%rm0j9O5J1o7K8M0nm0QJ4M1k9m3K5j6k7L7M9mk6k5M0j2Rj2n5
5461c0P3j5l7J3lm8O4l3j1M2l3l1M3K7K0m4J4MonM4m7NJ4j0lj1j9mL3mj9R4n4
5495B3m9M4M6o1m7M7L0m7l6L8j4L%K6J6l7j9Q8j16Q4k1m8P0n6N2J0%K5p6L8Lk8
5527a2J5k9J9pK6p8P4NPp2O2m3JJ9O6l1k3J5J3jn5LMPM7l3jRM9r5L7J8m9N9m7
$$ plain form
5562 -21 -14 41 36 -20 20 9 27 -23 -8 -22 17 34 1 35 37 -25 -5 -27 49 9 10 28 -75 12 6 -14 -34 7 33 -32 11 4 -18
5595 -18 30 -32 3 -70 6 -8 38 4 -5 -37 -41 -52 -57 20 23 25 -4 51 -11 -38 10 -19 -29 23 21 12 -32 -15 14 -48 -24 30 -2 16
5629 16 0 24 10 -59 -17 -51 -9 -9 -27 3 -36 5 5 -29 -10 -6 -6 20 15 -4 -20 30 52 29 16 24 25 9 41 -14 -19 10 51 37
5663 37 36 35 14 -18 57 -8 17 -8 -42 7 -40 -5 -3 3 9 -12 -13 11 1 36 -16 9 -8 -25 9 -14 35 -19 -10 26 33 19 -31 0
5697 0 42 61 35 43 -5 3 3 -18 -32 -28 41 29 -14 -34 -19 -12 9 51 25 19 -34 -83 0 4 -45 -10 -46 23 19 -31 12 21 29 2 16 37
5733 37 42 23 -13 6 20 30 -50 13 -21 -16 -14 6 18 -11 -35 34 -18 24 47 7 -79 -45 -30 10 -9 -9 48 -10 -116 57 27
5764 27 -8 44 13 -29 -30 -27 -36 -9 71 27 -5 17 -72 -4 -4 -5 -63 -25 50 -6 -58 -28 45 24 -31 10 -26 14 -12 17 -54 15 23
5797 23 -3 -3 26 26 -13 29 -5 4 -44 -36 -6 53 12 -53 29 -3 -35 -16 23 5 -51 -33 -4 -1 -9 -30 37 -20 15 32 1 12 -20
$$ packed form
5562b1PN5nn6M0j1J8n0J5j4L9J7l3L4Ko2K0k2P6m0JJ8j03Q7ok0k0M1K6o5M3pk2
5595a8M8o2L5p3P6j4M6l4rl2mj1nP7LKk9N5o2k7M8k9j0N2krm4J7K9o2K4N4l2J8
5629A6j6K4j4o9M2l4M2%j8L0l9M1%l4J9M%K6nj9j6N0K2k3j3QJj6L2n5nK9M1j4
5663C7jjk1l2P5o5K5k5l4M9m7L5KOOk1jK4j0L5n2K5j7j7L4k3M9n4RL6Pj4n0L1
5697@M2J9k6Qm8Q%k1j4MO9j2m3k0J5PK1M2k6on3m9Q3Mm9L5l6O9mn0M3RQk7J4K1
5733C7Nj9l6J9J4J0q0O3l4NKK0J2k9k4O9n2M2K3m0q6L4J5M0j9%N7n8j06J73l0
5764B7l5N2l1m2jLrK7Q0m4l2K2q9O8%jn8L8P5n6n2L0P3k1n5M1l6M0k6K9p1O9Q
5797B3k6%K9%l9M2l4Rm8QL0N9m1o5Q2l2l2J9L9j8n6J8K9Lqk1O7n7L5J7l1J1l2
$$ plain form
5830 -20 37 27 -20 51 34 -49 25 7 37 8 3 28 57 -18 51 -36 -9 9 -46 -10 -22 -14 41 -3 7 -15 27 12 -63 9 30
5861 30 19 80 -6 -28 -54 32 -2 14 3 -9 -38 20 30 31 1 -34 11 -7 35 -13 -25 5 8 -39 -24 -3 -4 47 -30 45 -33 -9
5893 -9 -44 3 -71 -17 -12 8 55 2 -6 24 -2 -7 -36 16 -41 -29 7 -37 -62 45 -23 -11 21 -23 24 -2 41 -53 30 5 35 -29
5925 -29 -17 -4 8 -4 -53 -16 16 -43 22 -10 5 19 -48 -11 -8 -19 -19 21 -5 -10 25 -11 7 3 26 -24 -11 -44 13 11 1 8 -15
5958 -15 57 49 10 -17 30 -12 37 -9 2 23 26 -39 -32 3 27 -22 -4 -10 -6 24 -47 -43 39 -27 -25 41 -29 13 13 -13 -65 -6 10 33
$$ packed form
5830b0N7j0m7P1j7q3P4j8L0k9nK5K9p5O9q7K7J8n5L6j2QN5m4J0k2M2j5p5P2K1
5861C0j1O1q6k2k6Q6l4J6j1j2k9N8J0Jl0l5M5j8M2m8j2L0Lm7J5K1jN1p7P5p8K4
5893il5M7p4N4NK0M7n3qL0k6nk9N2n7J2L6m4k5J07o8J2L2m4M7k6M3r4Q3k5L0o4
5925b9J2J3J2j2m9L7L2n9O5l2J5J4o7L7Lj1%M0k6nL5l6J8mK3n0J3l3N7kj0Pk3
5958a5P2ql9k7M7m2M9m6J1K1Lo5PL5K4m9J8oML0p1MQ2o6KO6p0M2%k6n2N9J6K3
$$ [...]
8191h
##END NTUPLES=NMR FID
##END=
