##TITLE=1H_4AEDB0606
 CDCl3
 8 sc, 
 7.6.2024
##JCAMPDX= 6.0         $$ Bruker NMR JCAMP-DX V2.0
##DATA TYPE= NMR FID
##DATA CLASS= NTUPLES
##ORIGIN= UXNMR, Bruker Analytische Messtechnik GmbH
##OWNER= root
$$ XWIN-NMR		Version 3.5
$$ Fri Jun  7 15:48:18 2024 Russian Standard Time (UT+4h)  she@DPX200
##.OBSERVE FREQUENCY= 200.1309
##.OBSERVE NUCLEUS= ^1H
##.DELAY= (6, 6)
##.ACQUISITION MODE= SIMULTANEOUS
##.ACQUISITION SCHEME= undefined
##.AVERAGES= 8
##.DIGITISER RES= 18
##SPECTROMETER/DATA SYSTEM= spect
##.PULSE SEQUENCE= zg30
##.SOLVENT NAME= CDCl3
##.SHIFT REFERENCE= (INTERNAL, CDCl3, 0, 15.7039)
##AUDIT TRAIL= $$ (NUMBER, WHEN, WHO, WHERE, WHAT)
$$ ##TITLE= Audit trail, XWIN-NMR		Version 3.5
$$ ##JCAMPDX= 5.01
$$ ##ORIGIN= Bruker BioSpin GmbH
$$ ##OWNER= she
$$ F:/spectra/data/she/nmr/H-F/1/audita.txt
$$ ##AUDIT TRAIL=  $$ (NUMBER, WHEN, WHO, WHERE, WHAT)
(   1,<2024-06-07 15:46:59.00 +0400>,<she>,<DPX200>,
      <created by zg, POWCHK disabled, PULCHK disabled
       configuration hash MD5:
       00 E9 B6 7A A2 85 ED C7 34 08 36 98 17 FE 4E 26
       data hash MD5: 16K
       D4 E4 4D 28 DF 93 2B EF DC 06 AA 78 A8 97 01 F3>)
$$ ##END=
$$ 
$$ hash MD5
$$ 51 FB E6 DB 29 22 82 1F 5A C6 AC 6F CA DF 28 3C
##$RELAX= 
##$RELAX= 
##$RELAX= 
##$RELAX= 
##$RELAX= 
##$RELAX= 
$$ Bruker specific parameters
$$ --------------------------
##$DU= <F:/spectra>
##$EXPNO= 1
##$NAME= <H-F>
##$PROCNO= 1
##$TYPE= <nmr>
##$USER= <she>
##$AMP= (0..31)
100 100 100 100 100 100 100 100 100 100 100 100 100 100 100 100 100 100 
100 100 100 100 100 100 100 100 100 100 100 100 100 100 
##$AQSEQ= 0
##$AQ_mod= 1
##$AUNM= <au_zg>
##$AUTOPOS= <>
##$BF1= 200.13
##$BF2= 200.13
##$BF3= 200.13
##$BF4= 200.13
##$BF5= 200.13
##$BF6= 200.13
##$BF7= 200.13
##$BF8= 200.13
##$BYTORDA= 1
##$CFDGTYP= 0
##$CFRGTYP= 5
##$CHEMSTR= <none>
##$CNST= (0..31)
1 1 145 1 1 1 1 1 1 1 1 1 1 1 1 1 1 1 1 1 1 1 1 1 1 1 1 1 1 1 1 1 
##$CPDPRG= <>
##$CPDPRG1= <>
##$CPDPRG2= <>
##$CPDPRG3= <>
##$CPDPRG4= <mlev>
##$CPDPRG5= <mlev>
##$CPDPRG6= <mlev>
##$CPDPRG7= <mlev>
##$CPDPRG8= <mlev>
##$CPDPRGB= <>
##$CPDPRGT= <>
##$D= (0..31)
0 1.2 0 0 0 0 0 0 0 0.06 0 0.03 0 0 0 0 0.0002 0 0 0 0 0 0 0 0 0 0 0 0 
0 0 0 
##$DATE= 1717760818
##$DBL= (0..7)
120 120 120 120 120 120 120 120 
##$DBP= (0..7)
150 150 150 150 150 150 150 150 
##$DBP07= 0
##$DBPNAM0= <>
##$DBPNAM1= <>
##$DBPNAM2= <>
##$DBPNAM3= <>
##$DBPNAM4= <>
##$DBPNAM5= <>
##$DBPNAM6= <>
##$DBPNAM7= <>
##$DBPOAL= (0..7)
0.5 0.5 0.5 0.5 0.5 0.5 0.5 0.5 
##$DBPOFFS= (0..7)
0 0 0 0 0 0 0 0 
##$DE= 6
##$DECBNUC= <off>
##$DECIM= 32
##$DECNUC= <off>
##$DECSTAT= 4
##$DIGMOD= 1
##$DIGTYP= 9
##$DL= (0..7)
0 120 120 120 120 120 120 120 
##$DP= (0..7)
150 150 150 150 150 150 150 150 
##$DP07= 0
##$DPNAME0= <>
##$DPNAME1= <>
##$DPNAME2= <>
##$DPNAME3= <>
##$DPNAME4= <>
##$DPNAME5= <>
##$DPNAME6= <>
##$DPNAME7= <>
##$DPOAL= (0..7)
0.5 0.5 0.5 0.5 0.5 0.5 0.5 0.5 
##$DPOFFS= (0..7)
0 0 0 0 0 0 0 0 
##$DQDMODE= 0
##$DR= 18
##$DS= 0
##$DSLIST= <SSSSSSSSSSSSSSS>
$$ [...]
##$SUBNAM2= <"">
##$SUBNAM3= <"">
##$SUBNAM4= <"">
##$SUBNAM5= <"">
##$SUBNAM6= <"">
##$SUBNAM7= <"">
##$SUBNAM8= <"">
##$SUBNAM9= <"">
##$SW= 18.0517689322627
##$SWIBOX= (0..15)
0 0 2 0 0 0 0 0 0 0 0 0 0 0 0 0 
##$SW_h= 3612.71676300578
##$TD= 16384
##$TD0= 1
##$TE= 0
##$TE2= 300
##$TE3= 300
##$TEG= 300
##$TL= (0..7)
0 120 120 120 120 120 120 120 
##$TP= (0..7)
150 150 150 150 150 150 150 150 
##$TP07= 0
##$TPNAME0= <>
##$TPNAME1= <>
##$TPNAME2= <>
##$TPNAME3= <>
##$TPNAME4= <>
##$TPNAME5= <>
##$TPNAME6= <>
##$TPNAME7= <>
##$TPOAL= (0..7)
0.5 0.5 0.5 0.5 0.5 0.5 0.5 0.5 
##$TPOFFS= (0..7)
0 0 0 0 0 0 0 0 
##$TUNHIN= 0
##$TUNHOUT= 0
##$TUNXOUT= 0
##$USERA1= <user>
##$USERA2= <user>
##$USERA3= <user>
##$USERA4= <user>
##$USERA5= <user>
##$V9= 5
##$VALIST= <valist>
##$VCLIST= <CCCCCCCCCCCCCCC>
##$VD= 0
##$VDLIST= <DDDDDDDDDDDDDDD>
##$VPLIST= <PPPPPPPPPPPPPPP>
##$VTLIST= <TTTTTTTTTTTTTTT>
##$WBST= 1024
##$WBSW= 4
##$XGAIN= (0..3)
0 0 0 0 
##$XL= 0
##$YL= 0
##$YMAX_a= 376931
##$YMIN_a= -475292
##$ZGOPTNS= <>
##$ZL1= 120
##$ZL2= 120
##$ZL3= 120
##$ZL4= 120
##$ABSF1= 10
##$ABSF2= 0
##$ABSG= 5
##$ABSL= 3
##$ALPHA= 0
##$AQORDER= 0
##$ASSFAC= 0
##$ASSFACI= 0
##$ASSFACX= 0
##$ASSWID= 0
##$AUNMP= <proc_1d>
##$AZFE= 0.1
##$AZFW= 0.1
##$BCFW= 1
##$BC_mod= 2
##$BYTORDP= 1
##$COROFFS= 0
##$CY= 11.3945322036743
##$DATMOD= 1
##$DC= 2
##$DFILT= <>
##$DTYPP= 0
##$F1P= 15.6554695791079
##$F2P= 12.8336369535428
##$FCOR= 0.5
##$FTSIZE= 0
##$FT_mod= 4
##$GAMMA= 1
##$GB= 0.15
##$INTBC= 1
##$INTSCL= 1
##$ISEN= 128
##$LB= 0.24
##$LEV0= 0
##$LPBIN= 0
##$MAXI= 10000
##$MC2= 0
##$MEAN= 0
##$ME_mod= 0
##$MI= 1.114404
##$NCOEF= 0
##$NC_proc= 0
##$NLEV= 6
##$NOISF1= 3.799351
##$NOISF2= 2.8
##$NSP= 1
##$NTH_PI= 0
##$NZP= 0
##$OFFSET= 15.70392
##$PC= 1
##$PHC0= -25323.15
##$PHC1= 21.58748
##$PH_mod= 1
##$PKNL= yes
##$PPARMOD= 0
##$PSCAL= 0
##$PSIGN= 0
##$REVERSE= no
##$SF= 200.130013532006
##$SI= 16384
##$SIGF1= 3
##$SIGF2= 2
##$SINO= 400
##$SIOLD= 16384
##$SREGLST= <1H.CDCl3>
##$SSB= 0
##$STSI= 0
##$STSR= 0
##$SW_p= 3612.71676300578
##$SYMM= 0
##$S_DEV= 0
##$TDeff= 0
##$TDoff= 0
##$TI= <>
##$TILT= no
##$TM1= 0
##$TM2= 0
##$TOPLEV= 0
##$USERP1= <user>
##$USERP2= <user>
##$USERP3= <user>
##$USERP4= <user>
##$USERP5= <user>
##$WDW= 1
##$XDIM= 8192
##$YMAX_p= 0
##$YMIN_p= 0
$$ End of Bruker specific parameters
$$ ---------------------------------
##NTUPLES= NMR FID
##VAR_NAME=  TIME,          FID/REAL,        FID/IMAG
##SYMBOL=    X,             R,               I
##VAR_TYPE=  INDEPENDENT,   DEPENDENT,       DEPENDENT
##VAR_FORM=  AFFN,          ASDF,            ASDF
##VAR_DIM=   8192,          8192,            8192
##UNITS=     SECONDS,       ARBITRARY UNITS, ARBITRARY UNITS
##FACTOR=    0.0002768,     1,               1
##FIRST=     0,             0,               0
##LAST=      2.2672688,     0,               0
##MIN=       0,             -475292,         0
##MAX=       2.2672688,     376931,          0
$$ Real data points
##PAGE= N=1
##DATA TABLE= (X++(R..R)), XYDATA
$$ [...]
1638g3K548m043K331P20m067K788J742l258K085J54l271K895O62k345K324j231
1654c9k152L617j554j078L432l178j318M105k387n86L426l267r32L765k618j35
1670h99L190l545k88L398k901N83K641l886N72K597k726J201J564k881P35J744
1686A099j838J182O77k457J579J72j443K135n74j774J731k81r46J590o62r88J296
1703D98q53J12J543j671LJ424j964Q72J663k429N49J337k236J325J190k200J172
1720C35L69j926J676Q27k433J876J09k280K121M79k421J727J82k062K073J38j693
1737i03J236Lj451J515K32j399J158j67j097J276M0q80M25k2k72L37j00L34k68
1756cp52R77M4j175J354q7j603J299M97j118P52J30j317J013L13r82J240l33j168
$$ plain form
1638 -73 2475 -1568 763 1483 -2584 204 1946 -1312 773 927 -2344 551 1213 -1132 1192 -39
1654 -39 -2191 1426 -128 -1206 2226 -952 -2270 1835 -552 -1138 2288 -979 -1911 1854 -764 -899
1670 -899 2291 -1254 -1542 1856 -1045 -462 2179 -1707 -1135 1462 -1264 -63 1501 -1380 -645 1099
1686 1099 -739 443 1120 -1337 242 414 -1029 1106 532 -1242 489 208 -738 852 190 -798 498
1703 498 -355 -243 1300 -371 -368 1056 -908 -36 1627 -802 -253 1084 -1152 173 1363 -837 335
1720 335 704 -1222 454 1281 -1152 724 833 -1447 674 1153 -1268 459 641 -1421 652 790 -903
1737 -903 333 336 -1115 400 632 -767 391 224 -873 403 443 -437 -12 -34 -306 31 -69 265 -3
1756 -3 -755 222 266 -909 445 358 -1245 54 551 -567 185 315 -1002 11 324 -658 582 249 -919
1775i19J144j60p59R73l0p46N12k76L14L41n40J7M51q44Q03O40j549M82J030j525
1795f41N44J071j468J43R52r97M10R24j152Q6O33q61N81L81q35J33K24m06N31
1814B53J51k44n5m72O93k42l80M93J81j237Q75P62j344N69P81j799P51J219j606
1833f51N16Q31j580O25J032j419M77P46j626O70J337j411K20P67j108j2P93l15
1851a08R1k68R0J50l16L51N02j045K34O62p95K42Q78j308L49Q39j078N47P70j553
1871g66P72O70j595J275N37j602O18P78j219N66P51j280L79M94q22R63k26q02
1889e09J200o94p57J633o85q18J040l74q20J745r80p32J518j008l87J563j186
1906b51k48J263j335J50J201q54k66Q80p27j65O89m02J65L7p27J058l57r43J447
$$ plain form
1775 -919 225 65 -694 279 249 -497 15 -261 53 394 -146 -129 322 -522 281 921 -628 -146 884 -641
1795 -641 -97 974 -494 -351 601 -396 14 938 -214 -128 505 -356 225 606 -229 -96 128 -278 253
1814 253 404 160 105 -367 326 84 -296 197 378 -859 16 778 -566 3 784 -1015 -264 955 -651
1833 -651 -135 696 -884 -259 773 -646 -169 577 -1049 -379 958 -453 -233 534 -574 -586 207 -108
1851 -108 -17 -285 -195 -45 -361 -10 492 -553 -319 343 -452 -210 668 -640 -291 548 -530 17 787 -766
1871 -766 6 676 -919 356 893 -709 -91 687 -532 34 785 -495 -116 378 -444 519 293 -509
1889 -509 691 -3 -760 873 188 -630 410 36 -784 961 -19 -751 767 -241 -628 935 -251
1906 -251 -499 764 -571 -421 780 -74 -340 540 -187 -352 337 -65 100 137 -590 468 111 -832 615
1925F15m50j183J989r14j093J874j057q76K085j105q41K049j312r85K324j200
1941h0j276K644j442j354K648j001j269K040j242o81J509n20o29J121p07K3O23
1958D07o59L80L93j054Q52j2q82J332o82j010J810q39q87K123j310j255K545j103
1976A49j543K812j063j963K580m97j785K443r37j203J763q53n21J542p80p98J270
1993F16p18k40J016p91j59M11o15Q29J4r72J357o25j368K429p96j741K559j128
2011G8j500K700q40j868K540p59k068K953p86k301L273j148k245L253p81k037
2027a536K336m61j673J870J67j521J071k5r01P93m2r5J43n75N68j21k43Q71n81
2046D5q90J620r76o30K127j633q96K377j320j042L031j914j610L398j540j764
$$ plain form
1925 615 165 -1018 971 57 -1036 838 -219 -1095 990 -115 -956 1093 -219 -1204 1120 -80
1941 -80 -1356 1288 -154 -1508 1140 139 -1130 910 -332 -1013 496 -24 -653 468 -239 -216 407
1958 407 -252 128 521 -533 319 307 -575 757 75 -935 875 36 -851 1272 -38 -1293 1252 149
1976 149 -1394 1418 355 -1608 972 475 -1310 1133 196 -1007 756 -97 -618 924 144 -654 616
1993 616 -102 -342 674 -117 -276 135 -480 349 363 -609 748 123 -1245 1184 388 -1353 1206 78
2011 78 -1422 1278 438 -1430 1110 351 -1717 1236 450 -1851 1422 274 -1971 1282 501 -1536
2027 -1536 800 339 -1334 536 703 -818 253 228 -673 120 78 -17 126 -449 119 -2 -245 626 45
2046 45 -845 775 -201 -831 1296 -337 -1233 1144 -176 -1218 1813 -101 -1711 1687 147 -1617
2062a617L547j787j994L285j274j372K725j334j908K948j086j456K743j088j486
2077a154K106o12j028J481n59p01O73K6j48P7j31M17n15j46P80p29l85J345r25
2096a28n61J641j262l05J681j357l65J947j821m20K103j648p05K445j591o39J981
2113I96j215p46K112j427n43J675j403K04J224j616L51J072j325M07R00j338N30
2130a42P65j382P94N57j322P04O08j200J098k18j099J098J71r54R48l92n59O73
2148A48P5m55N73l96l01Q53n80J25M40q77K80N51q46M36O71j330O87K47q20J132
2168F13Jj363Q79N56j311J271J52j716J092L75j205J224j8j262Q48K38q16R93
2186E51n6r54M07j1r1P62n62p09Q39m57J26P84o51l28M83p25M47P26r04J21N67
$$ plain form
2062 -1617 1930 143 -1851 1434 160 -1212 1513 179 -1729 1219 133 -1323 1420 332 -1154
2077 -1154 952 340 -688 793 234 -467 206 232 84 161 30 447 -68 -214 566 -163 -548 797 -128
2096 -128 -689 952 -310 -615 1066 -291 -656 1291 -530 -950 1153 -495 -1200 1245 -346 -985 996
2113 996 -219 -965 1147 -280 -823 852 -551 -347 877 -739 -388 684 -641 -234 666 -672 -142
2130 -142 623 -759 35 592 -730 -26 582 -618 480 262 -837 261 432 -522 426 34 -525 148
2148 148 223 -232 341 -55 -356 497 -83 42 482 -395 -115 436 -410 26 697 -633 54 301 -519 613
2168 613 614 -749 130 686 -625 646 798 -918 174 549 -656 568 550 -712 136 374 -442 551
2186 551 495 -459 -52 -63 -154 608 46 -663 176 -281 -155 629 -22 -350 133 -592 -145 581 -323 -202 365
2207C65j111O02R00j193N9N51n37K15R62q26k81J49j64N17l1l27L49n14N4M93
2227B32j94J38j73m85J70P90k81j60L95j352P22J049j120K91M34j143L80J346
2245A039r54l57Q00j007J45J065n16l81O27j075L63R57l97l19J01m99J32N67R3
2264C84n19J41M3j33o3L95J58r54K86O53n93N72L17j341K26P46k31kL02p85p1
2285d69R09o73L44K85q31K11M96l00J88J49o81k36M83O5K20j66k83K75q5K27K34
2306C62m09m53O87l38k7O51o47l07M77j01J42M15n17k52M90l53J22L97l27l06
2326b94N90k92J07N0k60l4j8J02K38l08n0L45l75O5O47k84m09K68j56k59P18p1
2348C20o51O26n09m0O49l97n7K71k50j7L76k62j44P6L6l81K55J29J8l3k62L01
$$ plain form
2207 365 -746 -144 756 -437 -378 173 -364 -149 813 -13 -294 -145 -309 208 177 -150 199 -315 -261 232
2227 232 38 176 3 -482 -312 478 197 37 432 -920 -198 851 -269 22 456 -687 -307 1039
2245 1039 85 -272 528 -479 -334 731 215 -166 461 -614 -251 706 309 -10 91 -408 -276 291 384
2264 384 -135 6 49 -84 -147 248 406 -548 -262 391 -202 370 687 -654 -428 318 87 85 387 -398 -469
2285 -469 440 -233 111 396 -435 -224 272 -28 160 309 -372 -608 -125 -60 160 -6 -289 -14 -99 128 362
2306 362 -47 -500 187 -151 -178 473 -174 -481 -4 -105 37 452 -65 -317 173 -180 -58 339 12 -294
2326 -294 296 4 111 161 -99 -133 -151 -49 189 -119 -169 176 -199 -134 513 229 -180 88 -68 -327 391 320
2348 320 -331 295 -214 -254 395 -2 -59 212 -38 -55 321 59 -85 -9 27 -354 -99 30 48 15 -247 54
2370E4k3j48K63M0n45M48l8j06J50pk64K86j81L2L05k77j85M38l52p6M49m02j42
2393b81L80j49OJ32l24J50J95l17K24L16o05J84O52j142L96O43p56O3O75r40L40
2414a58M53l59j65M38l12J7J95j9k48K55l2O7JMj33l87O90p6n53M96K41j058Q63
2437B20J72q64N02N83j131L97Q80j204M79N20r72K60Q50r63J42P30r86J20P57
2456D92p03j25J034o40m47O09l6m87L42J05k49K6M59l62n58M75L39q33N04M92
2476D37j042M21M79p37K46O73j098K92R57j222L14J096j348J47J005q64l34J115
2494E37m93m52Q24l07m67L16J43k23r8L67j16l20L53L57o66M13P1o19K88M06p22
2515d08L19P09j154K97R43j006K19J061j153l57J250j059q4J069q24l85Q83l22
$$ plain form
2370 54 31 -117 146 186 -359 89 51 -55 95 88 -176 110 -71 -39 266 -11 -196 242 -110 -186 263 -139 -281
2393 -281 99 -50 -44 88 -236 -86 109 -208 16 332 -273 -89 563 -579 -183 460 -296 -233 442 -498 -158
2414 -158 295 -64 -229 209 -103 -86 109 90 -158 97 65 132 133 137 4 -383 307 231 -322 174 415 -643 220
2437 220 392 -472 30 613 -518 -121 759 -445 34 554 -418 -158 692 -271 -129 601 -385 -265 492
2456 492 -211 -336 698 58 -389 220 184 -303 39 144 -105 -79 380 18 -540 -65 274 -559 -55 437
2476 437 -605 -184 295 -442 -196 477 -621 -329 628 -594 -280 816 -532 -385 620 -244 -578 537
2494 537 44 -408 416 109 -358 -42 101 -122 -220 147 31 -289 64 421 -245 168 239 -380 -92 314 -408
2515 -408 -89 620 -534 -237 706 -300 -81 980 -173 -530 720 -339 -423 646 -178 -563 320 -2
2533bj33N16j05o16O02l06j69M96k28j75J28j43J35n3K64L9n53L07L42n34K60
2554G2L31o87k3Q16p23o6P26o38k5P82p94K6L56n18J97K08l83K90M76o25J45K69
2576B12k98J27P9m81K59J57m60O08j54p08J004j7j050R44J28r69N27M24p53L02
2596a19N21p41L20N33o98J24L74k57k52K29O1j15P4J77l32J25M22m22l02Q12n21
2617A3m20J006m07p59R39j18q43J149l3j396J175M7q30O62K01j119Q97L28r52
2636d60M83L79p92J20O55p07K34M38m08l73N83M1j95P0K84m83k46O98l34l56M54
2657H5J33l67L03L28r23M62J13m57L98K52p37M93Q1n95M69K37o43L94O4l58M31
2678A63j89j77J95p2j31J87R7k1Nk28L02R0j72j88L91n76O27J15p79N72J43o35
$$ plain form
2533 -2 -135 381 276 -340 262 -44 -213 283 55 -120 8 -135 0 -53 211 250 -303 4 346 -188 72
2554 72 403 -284 -307 509 -214 -280 446 -192 -217 565 -229 -203 153 -365 -168 40 -343 -53 423 -202 -57 212
2576 212 -86 41 120 -361 -102 55 -405 203 49 -659 345 328 -722 222 350 -619 -92 332 -421 -119
2596 -119 402 -339 -19 514 -184 -60 314 57 -195 34 95 -20 54 231 -101 24 446 24 -278 534 13
2617 13 -407 599 192 -567 372 254 -589 560 527 -869 306 353 -477 185 386 -733 164 492 -460
2636 -460 23 402 -390 -270 385 -322 -88 350 -58 -431 152 193 -2 68 352 -131 -377 321 -13 -369 85
2657 85 218 -149 154 482 -441 21 134 -323 75 327 -410 83 164 -431 38 275 -368 26 90 -268 163
2678 163 -26 -203 -8 -80 -211 -24 73 52 57 -171 131 221 49 -139 252 -324 303 418 -361 211 354 -281
2700b81M12L68p96J59M35p44M06N81p54K1L76l12J7N11k91k07Q8o4P8k7L20k75
2722B1k12K78K77l52j78J86j48J83K26k83k4K10m39J42M31l23K5Q2n47M73J70
2743A98j10j29j7j0N9J77o0O6k86k42O28j53k39L22k22m24N77j20j91J65q3j27
2765b21K58r1J52Om90K16K37j17q3L82k94k35O58l16qQ0j25j76J38L67j72k52
2787h6M4J54o4JJ82k49k93K95j21J44K51l27o6K88k03N3K09j62j28K62J34n03
2809a85K96J7k21o6M40j9l01J85p0l12P1M96m06j66M46j69j20L4J82n78M74J76
2831B04m22M48K6n05L50p7l35L53J92m99M7K61j7j82K90r5k78K46J72l13R3L1
2853a0q2J2K44j52m9J25J29l21L24j82l22O64l45l70K98M08o64N02po67N53K13
$$ plain form
2700 -281 131 499 -297 -138 297 -447 -41 540 -214 -193 183 -129 -112 399 108 -99 -11 -75 3 -24 296 21
2722 21 -191 87 364 12 -166 20 -128 55 281 -2 -26 184 -255 -113 318 -5 20 102 -445 28 198
2743 198 88 -41 -58 -68 -9 168 108 174 -112 -354 274 121 -118 204 -18 -442 135 15 -176 -11 -94 -221
2765 -221 37 -54 98 104 -386 -170 67 -50 -133 249 -45 -280 378 62 54 134 9 -167 -29 338 166 -86
2787 -86 -42 112 48 49 231 -18 -311 -16 -137 7 258 -69 -135 153 -50 3 212 50 -78 184 318 -185
2809 -185 111 128 -93 -159 281 262 -39 146 76 -236 -165 331 -75 -241 205 36 -84 -50 132 -446 28 204
2831 204 -218 230 256 -249 101 24 -311 42 234 -265 -218 43 26 -156 134 39 -239 7 179 -134 -41 -10
2853 -10 -92 -80 164 12 -37 88 217 -104 220 38 -284 380 35 -335 -37 371 -293 209 202 -465 88 301
2875C01q41L50M84l98j25M81k55k17K90J68l75Q4K17l78K01J04j93r1L31j97p3
2896a32K72j43j79M56j39n65P98j70o25M13M20l82j17N67p86J31L79l20q9L30
2916A19l55N4L11j45k6R7k1k96K58K6k48L40j44k83L68L19n28k18M22J22j78R7
2938I1Ll37K35K33k22m0L63l79p2J73k37J87Q0k13J27J75j81O5Q1k14J6K37o7
2961A04j21K5l9J28j02m6J45k28J45p5n5J55L46l74k1j02O3K01j34Rj35J40j17
2984h8J23J8k09L6J88j91J61K07j82k50K37j16K12k55J38j66M6m8L45l48j04L34
3006H8J00l20L93k33k47L39k40L6L51k72r0k0M0P3R6L4l71J25R4j44J06J33Pl4
3030D4k47L21j51m0J60k03k9K78l8j71J77%k49K08j5j65K05J31l95K21K94m57
$$ plain form
2875 301 -540 -190 294 -104 -229 252 -3 -220 70 238 -137 -53 164 -214 -13 91 -102 -193 138 -59 -132
2896 -132 140 -3 -182 274 135 -430 368 198 -427 -14 406 24 -93 474 -312 -181 198 -122 -211 119
2916 119 -236 -182 129 -16 -42 55 34 -262 -4 22 -226 114 -30 -313 55 374 -154 -372 50 172 -6 91
2938 91 94 -243 -8 225 3 -37 326 -53 -125 48 -189 -2 78 -135 -8 167 -14 51 132 -82 -66 171 104
2961 104 -17 8 -31 97 -5 -51 94 -134 11 -64 -119 36 382 8 -13 -115 -52 149 15 24 -111 29 -88
2984 -88 35 53 -156 -120 68 -123 38 245 63 -187 50 -66 146 -109 29 -137 -91 -139 206 -142 -246 88
3006 88 188 -132 261 28 -219 120 -120 -84 267 -5 -95 -115 -75 -2 94 128 -243 -118 -24 -168 -62 71 78 44
3030 44 -203 118 -33 -73 87 -116 -145 133 95 -76 101 101 -148 60 45 -120 85 216 -179 42 336 -121
3052a21J71J8k50K17K88m83J60J92k78k71O27o7l41K75K5l39O7O59o74J79O7j67
3074d6m5L60k86j61L24j54r0K74j78j82L09M1n30N77j07l42K70J61k73J43M8l78
3096b65K39J26k21O0J26l63K71J47j25o1K05j51o9J45j37QJ36k27l3O8J88k67
3118b00J55J35r7o7J42o5j93K37j6j72K99j33k06K68k26K83j32m4m3J61K0k07
3140a01J35j50J05J55j42o4J17m5N7N2k98K78J7o9j07O4j5L0J49j66p5K54k63
3163h2R2L3N3M1j73L2J57k28n6J59Q8n6j55l8O7J58k39J52J72k32r5K99k44K74
3187A79j12j8k13L35l37J10J02O4l26K29o0K00k61j22J83J3l0K00n3k77L56k14
3209e2l3L0M1j12L53m36L6J49J01k26L00j81j9J4J33k23J86R6k01M4L0k72K16
$$ plain form
3052 -121 50 68 -182 35 323 -160 0 192 -86 -357 270 203 -138 137 162 -177 -110 549 -125 54 121 -46
3074 -46 -91 269 -17 -178 146 -8 -98 176 -2 -184 125 166 -364 213 106 -236 34 195 -78 65 113 -265
3096 -265 -26 100 -121 -61 65 -298 -27 120 -5 -66 139 -12 -81 64 -73 -65 71 -156 -189 -121 67 -200
3118 -200 -45 90 -7 -74 68 3 -190 47 31 -141 158 25 -181 87 -139 144 12 -32 -75 86 106 -101
3140 -101 34 -116 -11 144 2 -62 55 10 67 119 -179 99 116 47 -60 4 -11 19 168 2 -73 181 -82
3163 -82 10 43 96 137 -36 -4 153 -75 -131 28 116 60 -95 -133 -66 92 -147 5 177 -55 -150 149 -95 179
3187 179 67 49 -164 171 -166 -56 46 110 -216 13 -47 153 -108 -230 -47 -34 -64 136 83 -194 162 -52
3209 -52 -85 -55 -14 -126 227 -209 -173 -24 77 -149 151 -30 -49 -35 98 -125 61 157 -44 0 30 -242 -26
3232b6J05j56J71j36M7l5j11J37K29j10j61J13M5Kj89J13J71j95M0J38q9j44K81
3255B40j7k59J70p8r4J7J47k93M6L23k56j0o3K12j63K15j47m1j01J71p3J05J57
3278B08l04j4J50l4p3K94k25p1J12l0n6KJ64l20P4K98k51k3K87j13n2j54R9k9
3302f1r9J73j22L0J50p8j17J15P8j8RP1p3pk2j73J64j12M1K7Q1rJ6P3j66K46j08
3329A09j93J4J68l5J01j02j8N7q8m6r4K80p6k37J42J3j31K12J32j66l7J26j53
3352b2j89K37j09k7p7P1J48n2Q5k8J03l32K23Q1m9j23l8R5n2J66J8k78J33j45
3376a61J85j7P0k63K54o5q4K28j28j87K67qj20jkj37M0M95m90JJ65k9j29R2kn1
3402g7J04K9k6O9P3j44J27r2l5N1j08K7P9K2l0l6J93j82k30M03k08Q6j35L1j52
$$ plain form
3232 -26 79 -77 94 -42 5 -30 -141 -4 225 115 -46 67 112 114 -75 38 209 14 54 192 103 -41 240
3255 240 223 -36 134 56 -38 -21 126 -167 -121 202 -54 -64 -127 85 -78 137 -10 -51 -152 19 -54 51 208
3278 208 -96 -110 40 6 -67 227 2 -69 43 13 -43 -41 123 -197 -123 175 -76 -99 188 75 23 -131 -32 -61
3302 -61 -160 13 -109 -79 71 -7 -124 -9 69 51 60 131 58 51 29 -144 20 -92 -51 -24 57 48 64 137 -29 217 109
3329 109 -84 -70 98 63 164 62 44 101 13 -33 -127 153 77 -160 -18 -5 -136 76 208 42 5 131 -22
3352 -22 -211 26 -83 -110 -187 -116 32 -20 65 37 140 -192 31 112 63 -60 -98 -3 -55 111 129 -149 -16 -161
3376 -161 24 7 77 -186 68 3 -81 147 19 -168 99 91 -29 -30 -32 -169 -129 366 -124 -123 42 13 -116 -24 -26 -77
3402 -77 27 56 30 99 172 28 155 63 28 79 -29 -2 77 99 69 33 226 44 -186 217 9 95 -40 -9 -161
3427a61J47J1m0m8K3M4m4R2J82k44P7j64J48J49q7j6j06Q2o3P2o7K5k07K69l9
3452C5m5J21k40N8Q9l9N6J27p9j99O3j72L23o4J01l17K49J18j17o6jQO6j25j04
3477a54L17j54j1j13j0n9K15Q0l73K28P7nP7k25Q0J27j28J76j03o4k8q5p3L78
3501A70j93J18j0l8m9M8m3p9Nm7J25K0lj10K3j08K58kp3j76J24O9p4J22pl55L37
3528E2j22J21Q6J42k90O9q0Ll2J43k42O7J55k30O0Q4J73m00M01l4j76M7J77k70
3552i6R3J19k05n3J75m9m3R6Ok15J40J32l56M03p8p7J20J7k32mK59l93J88K92
3576B39l19Q2K02k06k24L21l5k27O6K19j98K29j21j6l1J09n2j01L46l88J58O0
3598A13k26K03l1N9p2J24j45k11K47lj44J13N3r6n9Q0JLJ64m06L00m4l7k05K37
$$ plain form
3427 -161 -14 -3 -43 -91 -68 -24 -68 24 206 -38 39 -125 23 172 85 69 -37 45 -18 54 -13 12 -195 74 35
3452 35 -10 111 -129 -71 18 -21 35 162 83 -116 -53 -225 98 34 135 -182 67 185 68 2 1 9 75 -50 -154
3477 -154 163 9 -2 -115 -125 -184 31 111 -262 -34 43 38 115 -110 -30 97 -31 145 42 -22 -50 -135 -208 170
3501 170 -23 95 85 47 -2 46 3 -76 -71 -118 7 27 24 -86 -63 -171 87 85 12 -164 -40 29 -45 77 70 -285 52
3528 52 -70 51 137 279 -11 58 -22 -19 -51 92 -150 -83 72 -158 -98 -14 159 -241 160 126 -50 -3 174 -96
3552 -96 -3 116 -89 -142 33 -16 -59 37 43 -172 -32 100 -256 147 69 -8 112 129 -103 -107 152 -241 -53 239
3576 239 -80 2 204 -2 -226 95 60 -167 -101 118 -80 149 28 12 -19 90 38 -63 283 -105 53 113
3598 113 -113 90 59 118 46 170 25 -186 61 58 -86 27 80 -16 -75 5 6 9 173 -233 67 23 -14 -219 18
3623A8P5j33J3k2l2K0P7m2R5n1J6N4r1L9j44PRJ36k7m6N6k99K83r0k5J81J4O3
3651A54k35J02K3k42K99j47J46L0j01j29J52kj75R9O5n0J23k11J34%m0O3m4J38
3675A52l98K63q4K41n1r8j64R2q6J3l4J69R2L9k17j16L59m03R1J66j78K08j18
3698f2qJ87n4jk11K18k51K11lj32m3K45%j12O9J15q2r5J14k57K44j56q0J35M6
3723C7p3K6o7mR9Rrk05J93Q7p5k06K05r4J95m9m3p5J90k52L5J62j65K37l23K09
3749D4k00K02J01j07q4m5J08k31L35j47j92J38p4L10q9l5j69J40J77l1j87n4q3
3772a73K42m5J26j83J9J61k13P5J60j45qK48j36j96N0N0r9K39j74K5O9j61j9J59
3796G1k7j47J48Q0k8j68J30j5k2J4j06P6l0P3o9n2J51j17J06n4q6p0J51k04R3
$$ plain form
3623 18 93 -40 -27 -49 -81 -61 16 -26 69 18 34 88 -3 36 -108 -101 -92 44 17 -29 27 -272 11 -79 -104 77 91 154
3651 154 -81 21 44 -198 101 -46 100 130 29 -100 52 50 -125 -26 39 -11 112 -99 35 35 -5 58 14 152
3675 152 -246 17 -67 174 123 25 -139 -47 -133 -120 -154 15 107 146 -71 -187 172 -231 -140 26 -152 56 -62
3698 -62 -70 117 63 62 -149 69 -182 29 26 -106 -149 96 96 -16 53 168 86 -9 105 -152 92 -64 -144 -9 37
3723 37 -36 -10 -77 -81 18 27 18 -187 6 93 18 -188 17 -77 118 69 26 -49 141 -111 -76 86 -79 158 -165 44
3749 44 -156 46 147 40 -44 -89 19 -212 123 -24 -216 -78 -152 158 69 34 -135 5 182 151 -36 -90 -173
3772 -173 69 24 150 -33 -14 147 -66 9 169 24 16 264 128 -68 -18 32 -67 172 -2 23 92 -69 -88 71
3796 71 44 -103 45 125 97 -71 59 44 22 36 -70 6 -24 49 -20 -72 79 -38 68 14 -72 -142 9 -195 -102
3821a02R0q4KL2K1j08K43J62m01J54K05j43j79K22M9j43J20k65p1Q4K44j50L0
3844A2J1l3m3J36j3j9Pj64K85k31O5L7j9P1k44R1J29n4J7k28P4K59j56J33k28
3869a05J45r8o4K54P6k94L37l27R2O7L4j12Q2p4Mq1J17O1o9j04L4K8J17k18J31
3894C3J21j9k16r4J28j24M05j32n4j10K58q9k37K1J09M8o4j23l8P0K55j55q8K24
3918A29j44M2j9J36j63L3j17J66mO3j66j07J75J02k29K10j49j56L23o9o4N3pj87
3942a49J43J33j35N6J65k26o0J27Ll01L58%k06J10J25J19j56O1j41L5k8j07k3
3965i7R3O6j35l7L45k47P2o0J7j25K52mq4qm7O5L8j58j5K75k98KJ72K4k87Q5Q1
3992a5j74K81P5k31j01P1P3J22o2r1Q7j01O3J06kk68J03J5N3Q8j65Q6k1J2Q7j66
$$ plain form
3821 -102 -12 -96 -94 -62 -41 -149 94 256 -145 9 214 71 -108 114 163 20 140 -125 -196 -112 132 -18 12
3844 12 23 -10 -53 83 70 51 58 -106 179 -52 13 50 31 102 -142 -51 78 24 41 -187 -113 146 -10 123 -105
3869 -105 40 -58 -122 132 208 -86 251 -76 16 83 117 5 87 13 17 -64 53 114 45 -59 -25 3 120 -98 33
3894 33 154 135 -81 -175 -47 -171 234 102 48 -62 196 107 -130 -109 0 48 -16 -139 -177 -107 148 -7 -95 129
3918 129 -15 27 8 144 -19 14 -103 63 59 122 -44 -151 24 126 -103 107 -42 -198 125 56 -8 45 38 -149
3942 -149 -6 127 -8 48 213 -13 -73 54 57 -244 114 114 -92 18 143 262 106 167 26 61 33 -74 -97
3965 -97 -4 62 -73 -110 235 -12 60 0 17 -108 144 140 56 48 1 66 104 -54 -69 206 -92 -90 82 106 -181 -96 -15
3992 -15 -189 92 167 -64 -165 -94 -21 101 39 -52 35 -66 -3 103 101 -167 -64 -49 4 92 -73 13 -8 4 91 -75
4018g5R4RJ27k67L46j61j31l2J53l8o6m6jJ52j08p7K91j35p8j50J85J56j05J22
4042A65k29J44N0m12K59J94j85K8Q8k4L0j4k6M2k81K77p8k4K49l97J45m1R0l3
4066A7j2j11k0J07O9m4p6K9J01k23P1J10M4m9NJ89k89J72J07k85Q1k5R4j9M8m5
4092D6q6o6J53P6m5j52L6J16j31J37m8j6k8J12L3q5r0L1k73K62q1RJ02k5R2o4
4118A5J96j30j14N6P6n4O8j13Km7L5O4q8J78kq1n0Qj4P9k9L5n1n4J08l5M9o5k30
4147a88J93k5k0M3J04q2M5L5kq8J07m4k65J74j17P7J37j38pL3J02j13j29J00K3
4172d5J64o4j88J82N8ml7j69J63l6j05j6N5l5K75k17QJ49j71j14K02P8n8k67N6
4197a36L59k99O2k4n6J48j76l5J73J23j71j1L0R0O7j20j38M06k26m6j5N1j2k0
$$ plain form
4018 -75 19 28 155 -112 234 73 -58 -90 63 25 -41 -87 -88 64 -44 -121 170 35 -43 -193 -8 148 43 165
4042 165 -64 80 130 -282 -23 171 -14 14 102 78 108 94 68 110 -171 106 28 4 253 -144 1 -40 50 17
4066 17 5 -106 -126 -19 50 6 -70 -41 60 -163 -92 18 62 13 18 207 -82 90 197 -88 -7 -32 62 43 91 46
4092 46 -40 -106 47 123 78 -74 -38 78 -53 84 36 20 -8 104 137 52 -38 -7 -280 -18 -99 -90 12 -13 79 15
4118 15 211 81 -33 23 99 45 113 0 2 -45 -10 54 -34 144 142 61 11 19 5 84 55 90 39 -15 93 58 107 42 -188
4147 -188 5 -20 -40 3 107 25 70 105 103 15 122 78 -187 -13 -130 -53 84 -54 -61 -28 74 -39 -168 -68 -45
4172 -45 119 55 -133 49 107 103 66 -103 60 24 -81 -97 -42 -77 198 -19 -11 138 -33 -147 55 133 75 -192 -136
4197 -136 223 -76 -14 -38 -94 54 -122 -157 16 139 -32 -43 -13 77 144 24 -114 292 66 20 5 56 44 24
4221B4m6m6N6J28k65J02R5J39l25K67k6k32J60P2j95Q8l3j2J43j0l3j44J34K2
4245F3j23J03m8O3k37J31j1J02l0m1j7P3p2n8M2J17k41P0K47j37j6Rj6n8r8O1
4271a22J27j27K15j51M8NlM9O1r0k26L49j35o2l2QN8%kJ71j68m6j9J70j3j23P5
4298A7n5M5n0M4lL0Q2j99J29M7N0j78J53Mj38L1j41JP3L1M6j52J35j4n2K01l44
4325b07L82k38N3o8qK60j27j94O1Q4J01j05R3L1q5O3j36K0MJ38K0j50j7j26K16
4350F5l5j69J45R4m4O0l3j04J9r7r4L65k16j53M3K05j23P4K1j81K29j9o1n3J07
4375D5j29J27K10k86K35j80P8n4qPj85Q0J72k59R4J39N8k05l2K37j68K09k78L6
4399e7R4J05j29q3J50J85k43J64j39k57K92m6P9j4j35o7N6K0N0j09R4n0J31j40
$$ plain form
4221 24 -22 -68 -12 116 -149 -47 48 187 -138 129 103 -129 31 103 -92 -4 -37 -49 94 84 51 -93 41 63
4245 63 -60 43 -5 58 -179 -48 -59 43 13 -28 -45 28 -44 -102 -60 57 -184 -114 133 -4 -20 -11 -27 -85 -183 -122
4271 -122 5 -122 93 -58 -10 -5 -8 41 102 12 -214 135 0 -62 -94 -86 -28 -28 -30 141 -27 -73 -92 78 65 -58 17
4298 17 -38 7 -43 1 -2 28 110 -89 40 87 137 -41 112 116 -22 9 -132 -131 -58 -27 19 -133 2 -12 -64 137 -207
4325 -207 175 -63 -10 -78 -86 174 47 -147 -86 -2 99 -6 87 118 33 96 -40 -20 -16 122 142 -8 -25 -151 65
4350 65 30 -139 6 100 56 116 83 -21 -2 -99 -193 172 -44 -197 -154 51 -72 2 23 -158 71 52 -9 -62 45
4375 45 -84 43 253 -33 202 22 100 46 38 45 -140 -60 112 -147 -53 86 144 -61 -93 144 -24 185 -93 -57
4399 -57 37 142 13 -70 80 265 22 186 47 -210 82 36 115 101 -34 -101 -45 -25 25 -84 10 -40 91 -49
4423d9O9l0RR4p3K4j73L4J81o6j68P2J24j12K3J0M5m0J5R8o5R5K33l65P0%j47
4450i2J25k15J08J03J18K3k20J28k8q6K2J15n4p6J7M2k5P2n6n0j20J89J6m8j4
4475fo9J6J28P1m8r4J64k67J33J1q3J58k12K2K49r8n7N0j75N4N0J97n6P7j32L4
4501A17k75K88j04O3k27J14J83j97J01j44P9L0O5n2k6o7J47q6l5J33k5n5K0o2
4525a5n2J13j95K60j00j28J60j37J90j51M9J3J18q0j57%J07q5J27j63K10j56J20
4548D8j23m5K66l7m6r3K0Q9o5N3j84K56j94R7n5K8N1k1j56J05p4M9N4J19k51J46
4574C7J1N2j28N2j2pM4J5n9l09M23j45J01q7P0m0K6j14MJ74k64J88mp6J47j59
4600f0R0j02K02l6N8k19J50j6M1j74J23p4l5K10l14J26K52l11R5K9j01J26r1k0
$$ plain form
4423 -49 20 -10 -1 93 20 44 -129 -95 86 20 -148 -76 48 -64 -41 -31 14 -26 -11 87 22 117 350 -15 55 55 -92
4450 -92 33 -182 -74 29 147 170 -50 78 50 -36 -14 101 47 -29 -12 30 5 77 21 -29 -149 40 56 8 -6
4475 -6 -75 -59 69 140 92 -2 162 -105 28 39 -44 114 -98 -76 173 75 18 68 -107 -53 -3 194 138 215 83 117
4501 117 -158 130 26 89 -138 -24 159 -38 63 -81 -2 28 93 41 15 -52 95 9 -26 107 82 27 47 -15
4525 -15 -67 46 -149 111 11 -117 43 -94 96 -55 -6 7 125 45 -112 -112 -5 -90 37 -126 84 -72 48
4548 48 -75 -120 146 109 63 -30 -10 79 14 67 -117 139 -55 42 -13 15 66 45 -111 -6 -80 -31 23 142 -109 37
4574 37 48 100 -28 24 12 5 49 64 5 -304 119 -26 75 -12 58 18 44 -70 -66 108 -156 32 28 -48 99 -60
4600 -60 30 -72 130 94 152 -67 83 67 108 -66 57 -17 -52 158 -156 -30 222 -89 6 35 -66 60 -31 -51
4624e1l0L7k14J69K57j64K1k8j0k99K75J69k83K04k7K2L5j97J18J08m9k8Qj39
4648i6J65j9k2qJ3j3l5OJ31j74R6r2J0j28J57o7N6J0r0K80k38L9j5J10j68J08
4674A6J36k67o9K97p1p4j11J82O3k53M2J36J53j65J88j38k6qM6mNL2M1j23oRj54
4701a23J94l4P8k7l2L4m7%j91J27N8j21J14k8Mj01k6Q2J56r9j21J03o9J05j85
4726a49K0K29k15J56p9K8j48K82o2l4k19J25M7M5p6p4R2J11k02R2p3N6K1o4q6
4751a77P8J46j27O0K35k02j57K02q8j60J77m5J5O9LN3N5j77j36J78N0j41J1Q2
4775Dp6J27J2r7K11q7k03kJ92p2j32O8J6m1j09J42K0J28j77J8o7K59j15r8Q1K07
4801B09j43q8pJ92k34n4K72j78J71k13R0k4M9j85J59R1m6R3l56K65j80J05O3k78
$$ plain form
4624 -51 -81 -44 -258 -89 168 4 25 -3 -13 -312 -37 132 -151 53 26 48 83 -114 4 112 63 35 43 -96
4648 -96 69 50 28 20 33 20 -15 -9 122 -52 44 -48 -38 -166 -9 -76 -20 -10 -100 180 -58 -19 -34 76 -92 16
4674 16 152 -115 -184 113 42 -32 -143 39 102 -151 -109 27 180 15 203 65 39 31 77 73 78 110 151 28 22 31 -123
4701 -123 71 37 115 88 56 90 43 43 -148 -21 37 -84 30 2 6 -95 -121 -39 117 18 -103 0 -69 36 -149
4726 -149 -129 100 -115 41 -38 -10 -158 124 62 28 -191 -66 -19 26 -50 -124 -32 79 -123 -31 -104 -48 -27 -91 -177
4751 -177 -99 47 -80 -20 215 13 -144 58 -30 -190 -13 -58 -43 26 29 82 137 -40 -176 2 52 -89 -78 4
4775 4 -72 55 67 -30 181 94 -109 -111 81 9 -123 -55 -39 -80 -189 -47 -27 101 -76 -58 -125 134 19 -79 2 209
4801 209 66 -22 -29 163 -71 -125 147 -31 140 -73 17 -7 42 -143 16 107 61 154 -202 63 -117 -12 51 -227
4825b27J98oJ89m6K8m2k31L89j64k2k54O8P1j4J46j26J52o9r5R4kj5J02j80J69
4850A13j86Q1J42k46k9J99l1k17K82n9m2K5O5k05O8k9P5o4J32r1N8p7J23j8j90
4875a21Q3Q1m8J90n4j25m6R7k09J76j62J37Nn7j23P9J25M5j23J63k78O7L4J41
4899G7j81pJ68j43R7j50K01o3l4M3q0K0J45k3J40l33L6K9K0p1K35j48q2K49j72
4924b7P4j26J8J22j00p9J21R8k12J86J4J34k35q1K2K8L0R0j88J20R7l3r0J17J06
4949B06k64q1Q0J7O1j41J87o0qO1p4l4L7P2M0j40j0k0J64n4p6N6j82N0K50j25
4975A2l2n3J94k17J43n4j66L16j29j3Mnk9o3Q5M3j04J06q4K2J71k90M6J55P7j88
5001e3Q0Qo0M2N6p1K4J54k43L3o6J87j92K96l18J01k9l3J33j7n0L0J02j03J35
$$ plain form
4825 -227 -29 -35 154 108 136 94 -137 252 88 66 -188 -120 -49 -63 83 -43 109 40 -55 39 37 22 124 -56 113
4850 113 -73 8 150 -96 -125 74 43 -174 108 49 7 32 97 -108 -40 -69 6 -58 74 -17 41 -36 87 69 -121
4875 -121 -38 43 -5 185 131 6 -40 57 -152 24 -138 -1 4 -53 -176 -97 28 73 -50 113 -165 -98 -64 77
4899 77 -104 -111 57 -86 11 -139 62 -1 -35 8 -72 -52 93 70 210 -123 -87 -58 -38 -109 126 -22 -104 145 -27
4924 -27 47 -79 -61 61 -39 -118 3 101 -111 75 89 223 -12 -93 -71 -43 -13 77 -111 9 106 73 -17 100 206
4949 206 -58 -139 -59 -42 19 -122 65 5 -3 58 -16 -50 -13 59 99 -41 -51 -71 93 39 -37 19 -163 -113 137 12
4975 12 -20 -73 121 -96 47 -7 -173 143 14 1 5 0 -29 -92 -7 36 -68 38 -46 -24 147 -143 -97 58 135 -53
5001 -53 27 35 -25 17 73 2 26 180 -63 -30 -96 91 -101 195 -123 -22 -51 -84 49 32 -18 12 114 11 146
5026A46k83J06j10K67j36J23k5k43K2r7K09o9J24N6L3L5r7j7j17J61j68R2N4j08
5050d2L7k1J3m9NK13k57J99j67NJ37K4j53J0J93k37J86P8j25K7j28J38j65J40
5074F1p8r7J49j53J6Q5J9p2L5Nj48K85k06l2R7N8N4p1R4r6p1n2J34pJ07j06o7
5101e7P4k3J87Kj99l3L1J6nq5J47o2m7K80j22p1J21j98J86r4j9L3r6m5J12r6J22
5128E9j87K21j47k4J61l9O2o8J03r8O1j06M0P6k40P3J70r2J91k68LK46k08J3P3
5153G5j6j98K95j38p8J73j93J72q6j1q3J40P3l9j36J44n5M4j20n3N0j10L07j51
5177Fk76R9J52j7J46j08k02J54J42j06J2k3j7l1J18l3N8M6k22N9J87k04k2J57
5201G5j77J74J73o6p3k4n7k10L67j25o3j43J38L1M0j39J54j69L8J52Qj54J0o9
$$ plain form
5026 146 -137 -31 -141 126 -10 113 88 -155 -133 -230 -21 -90 34 90 123 158 61 44 -73 88 -80 12 66 -42
5050 -42 -5 -26 -13 -62 -57 156 -101 98 -69 -64 73 97 -56 -46 147 -90 96 174 49 76 -52 86 -79 61
5074 61 -17 -114 35 -118 -102 -17 2 -70 -35 -30 -178 107 -99 -131 -34 24 78 7 101 5 -66 -118 16 9 116 10 -57
5101 -57 17 -6 181 183 -16 -49 -18 -2 -7 -92 55 -7 -54 226 104 33 154 -44 142 48 29 62 -34 -79 33 -63 59
5128 59 -128 93 -54 -78 83 44 106 38 141 43 104 -2 38 114 -126 -53 117 25 216 -52 -49 197 -11 2 75
5153 75 59 -139 156 18 -60 113 -80 92 6 -5 -88 52 125 86 -50 94 39 83 -37 -90 -40 -150 157 6
5177 6 -270 -171 -19 -36 110 2 -200 -46 96 -10 2 -21 -38 -69 49 16 74 120 -102 -43 144 -60 -82 75
5201 75 -102 72 245 179 106 82 25 -185 182 57 -6 -149 -11 20 60 -79 75 -94 -56 96 104 -50 -40 -109
5225a09K93m4k33K02p8J4p5J97j55o5Rk3R6r8ON5K2p3r8L10k88K77Pj60mp8J2
5252h1m7J34p5K17k17j03J87j27j10M1J62k6R7m3k4J07m2l7n8p9J99j24O8q0K
5277e9J53m4j57K78l68K76k63K28J21j86O4n2q7J25N6l1m2k33M48k53NK9O6j5
5301E9l6p2l2K08j45j44q0K03l9J09Q3n9n5j22L30j60j21J03P2l4j77K50j42J15
5325A14r9k5J21r3m7J46j61j4J87k39R6r1K16k5j19o2J56j25K5R7O5p6mm4q1N3
5351b9k13K97j67M2O7J38k6k40J03k4L3N3Nj11mJ34j00j05j74M81q7Q0l1n0m6
5376B6M6l6r0K11k10j72J53R0P1j54J14o0j64J16k9K18O2j98n7lrK04j32K0N5
5401G2J41j28j6j83K5K07p9l6J38j92j03J17L3p9K98k25k6Q1J6q0J18M5k73l7
$$ plain form
5225 -109 184 140 -93 109 31 45 -30 167 12 -53 -44 -67 29 -69 -63 -8 14 -59 -157 153 -135 142 149 -11 -15 -93 -81
5252 -81 -128 6 -69 148 -69 -172 15 -112 -222 -181 -19 -45 52 9 -15 92 50 13 -45 -124 75 -49 19 -61 -59
5277 -59 94 50 -107 171 -197 79 -184 44 165 -21 43 -9 -96 29 85 54 12 -221 227 -26 -21 8 74 59
5301 59 23 -49 -81 127 -18 -162 -242 -39 -78 31 114 55 0 -122 208 48 -73 30 102 68 -109 141 -1 114
5325 114 15 -10 111 18 -29 117 -44 -58 129 -110 -14 -105 111 86 -33 -95 61 -64 -39 58 123 47 43 -1 -82 -29
5351 -29 -242 55 -112 -70 -3 135 109 -131 -28 -52 -19 34 39 -72 -76 58 -42 -147 -321 160 73 153 122 72 26
5376 26 72 36 -54 157 -53 -225 -72 18 89 -65 49 -11 -175 -59 -88 130 192 -6 -63 -66 -75 129 -3 17 72
5401 72 213 85 69 -114 -89 118 39 3 141 -51 -154 -37 -4 -83 215 -10 -36 45 61 -19 99 144 -129 -166
5425a66K16j63J39O0j08P9j70P2K1J29J7j69J96k10K2Q3j32J83j98P9p6J61o5
5448@k0R3L9j74J92j03o4L2Q6k32J09%J17m1o1J43m3r5qL9M4r4m1K1Q8Qq6J70
5476A19p0k3j49J22n7r1K43j22Q7R7j66O0r3O2K7j24J99j71J91j60j58L37j43
5499A7O7j06pk5O1l8K8j15J6Q2p4K09j51j36J56%J32k42J44Pj02J51m9K8q1J09
5525H1n8k26P0J34k7J62k38Q2j38J45J01P6j26J9k1j06J64p1K0k8k09K87N5j38
5549A0L4p8l6J91k86J48J9P0m2N9p4j38M6J50j16J04n3j57N5P6k2RRK3n7R7j97
5576a56J05O5k5kl3J64j08k4j36J75p2N2j68K37j39M6J27k26K85j13j3j27n9J93
5600D8n5k4J48k49N7P7O1L8j69J7K6N4j26j49Q4K38r3NJ3j29K03j99l8K55L5j19
$$ plain form
5425 -166 50 -113 26 86 -22 57 -113 -41 -20 109 126 -43 153 -57 -35 48 -84 99 -99 -20 -96 65 0
5448 0 -20 73 112 -62 130 27 -37 -5 81 -151 -42 -42 75 34 -27 116 73 -22 -30 9 53 -41 -82 -61 27 35 -51 119
5476 119 49 26 -123 -1 -58 -149 94 -28 59 156 -10 50 -43 19 46 -78 121 -50 141 -19 -177 160 17
5499 17 84 -22 -29 -54 7 -31 -3 -118 -102 -20 -94 115 -36 -172 -16 -16 116 -126 18 25 -77 74 25 53 -28 81
5525 81 23 -203 -133 1 -26 136 -102 -20 -158 -13 88 164 38 57 36 -70 94 23 43 15 -194 93 148 10
5549 10 44 -34 -70 121 -165 -17 2 72 30 89 15 -123 -77 73 -43 61 8 -149 -94 -18 -40 -31 -22 1 -56 41 -156
5576 -156 -51 14 -11 -13 -46 118 10 -14 -150 25 -47 5 -163 74 -65 -19 108 -118 167 54 41 -86 -145 48
5600 48 -7 -31 117 -132 -75 2 63 101 -68 -51 -25 29 -97 -246 -162 76 -17 -12 1 -128 75 -124 -162 93 128 9
5626Ir2j34K06j8J6J00j57o6Q5J56RL5K2l82M5J18Jk0J03k3p7J46K3jK6k21P3
5653a8j7Q6n8O7k12k9K78j51M0j73J36J88Pq7o6L7m7K51j61P6j81P8M5j74J7k0
5679h8N4O5N5n6j99K41j98K66l5k42L15k93J13j17J24M9j0k19J92p6J54k17j77
5702b99L12n5J58rk02K84j57r3rJ81qj1l0M6o0k32J91J27K9k30J15N3j64l0L15
5727B22k11q1J30k65J50K70k94O3J64k96N0J63n1j92O0M9m5J98k85L50r7o4j34
5750a46J41l7j9LJ94r2n3k31J68J50k4K6N7J46j83r2j2j0J03j4j75K11j82J38
5774F7J1j39j0J10j22O1j5L4l0M0K8j53J96k38K63k01J19l1k9J56j0k1q9r8R9
5799bJ51j85K31j45k04J46m6N0j03J00J67j36o0j12J12l4O2K3j1r6R5Q3k47J31
$$ plain form
5626 9 -83 -217 -11 -29 -13 87 -70 -136 -51 105 114 149 171 -211 -166 -48 -47 -67 36 13 -64 82 105 104 130 -91 -18
5653 -18 -35 51 -7 60 -152 -181 97 -54 -14 -187 -51 137 144 57 -9 28 -19 232 71 147 -34 44 89 -85 -68 -88
5679 -88 -34 31 86 30 -169 72 -126 140 105 -137 178 -115 -2 -119 5 54 44 -175 17 -59 95 -122 -299
5702 -299 13 -42 116 107 -95 189 32 -61 -70 111 103 92 62 108 48 -184 7 134 163 -67 48 101 -63 -93 222
5727 222 11 -70 60 -205 -55 215 -79 -16 148 -148 -98 65 14 -178 -118 -69 -114 84 -201 149 52 -12 -146
5750 -146 -5 -42 -61 -58 136 44 -9 -240 -72 78 54 80 137 283 100 8 -4 -14 89 75 -100 111 -71 67
5774 67 78 -61 -71 39 -83 -22 -37 -3 -33 7 35 -118 78 -160 103 -98 21 -10 -39 117 107 86 -3 -101 -2
5799 -2 149 -36 195 50 -154 -8 -54 -4 -107 -7 160 24 -36 -148 -36 -70 -8 15 4 -92 3 86 -161 -30
5823c0J13j56Q8Q2n4o4K9O3k2p8J98k80k1L7K19o4j56O8l8J45j85K11j51j19M83
5848C18j84k68K7J91o0L6n7j1o9J12k2J3o4j10O1K47m23J35L20k90J12nPMJ21
5873A41j03j23O0K2k8K1pN5ml9p7J6J48q1RJ23k40J43O3J9j59K5J30q7J13l11
5899a71K45j32J09J37k54J09M8j02J45q3j53J33J00q1j16P9j95K6J23N3q3J45
5921H2Q8j19l8J4r3J57r5P8j13K8O0m0M0J73l56J77k4l8r6K59k16n9K25l55M33
5946A72p3L3j29K2K1Pj36P8J2M9J94k68Q5M1no1rJ09k20J63j13j6J20j3o0k0r
5973b6m9Lj7k1J95j16r9J4N3J70J5j75j4J78j76L2M5J6j31j02M41k52j39K55k7
5998G3J06j44N6n4Pj24q2K55m5k8l8k9Q2m2k31J38K12k57K86j18kl0J71l87K36
$$ plain form
5823 -30 83 -73 15 97 43 -21 8 71 49 -29 169 -111 -132 -95 124 60 -96 -28 -66 79 -106 105 -46 -165 318
5848 318 134 -134 -107 84 24 60 3 -8 -77 35 13 26 -38 -148 -87 160 -263 -128 192 -98 14 9 16 20 141
5873 141 38 -85 -25 -3 -31 -10 -17 38 34 -5 -82 -66 82 1 10 133 -107 36 99 118 -41 -16 114 27 140 -171
5899 -171 74 -58 51 188 -66 43 91 -11 134 51 -102 31 131 50 -66 13 -182 -156 -33 20 -63 82
5921 82 170 51 13 27 -66 91 -4 74 -39 -11 49 9 49 222 -134 43 19 -19 -115 144 -72 -131 94 -261 172
5946 172 99 132 3 25 46 53 -83 -5 7 56 250 -18 67 108 103 42 33 142 -78 85 -28 -44 76 63 3 -17 -26
5973 -26 -75 -72 -89 -110 85 -31 -130 -116 -63 107 122 -53 -67 111 -65 -33 12 28 -103 -205 236 -16 -155 100 73
5998 73 179 35 91 37 44 -80 -162 93 48 20 -18 -47 35 -7 -238 -100 112 -145 141 23 21 -9 162 -225 11
6023A1N5j98J84J6q9j34J00J81k00K9l8q1J67m8K8r4L0l8J64K8q3K2j26MK6J22
6049C8j38O9J13k18J73Q2j80j24L47j07j25K77j97q0J10K4K3j46N5n2pJ09m7j20
6073a21N0L4R8n9j06K0P8K7J01J6o8n3j56J53n4Q6k8N1j55J38N3L9j14l4q6m7
6099a37R6J33q7J35n2n8m8o4qn6J97k17J66O9j13J47o3J04m2o4nJ7j72P9R2j53
6125a04J35J4o5K30j58m5N5j39J64j08R8j84R6M9J86l65L24k20k8K8P6r2r5O4
6149h4K03K9l22K50j16N4l0o0J59k13J49j65J21qL1jM0k4L0k12K39q3j78L48j35
6174B2K0j22J58j75N4J01k7k32K69p6K7K9Op5J15j36J19Q8j62J14MO0j84QMj07
6200i8K82p4l7k9o9R4m1o7J63p2K2k3K7J06p0j64J31r7N2K0m5J66j45o6J32l5
$$ plain form
6023 11 66 -132 52 68 -21 -155 -55 126 -74 -45 -83 -164 3 -45 -17 -111 -81 -119 45 73 -10 12 -114 -110 -84 38
6049 38 -100 -31 82 -136 37 119 -61 -185 162 55 -70 207 10 -70 40 64 87 -59 -4 -56 -63 46 -1 -121
6073 -121 -71 -37 61 2 -104 -84 -6 21 122 138 70 17 -139 14 -40 46 18 69 -86 52 105 144 30 -4 -90 -137
6099 -137 -41 92 5 140 88 30 -18 -82 -90 -146 51 -166 0 69 -44 103 40 144 102 38 33 50 -122 -43 49 -104
6125 -104 31 45 -20 210 52 7 62 -77 87 -21 77 -107 -11 38 224 -141 183 -37 -65 -37 39 -53 -148 -84
6149 -84 119 148 -174 76 -40 14 -16 -76 83 -130 19 -146 -25 -33 -2 -3 37 13 43 -169 70 -13 -191 157 22
6174 22 42 -80 78 -97 -43 58 31 -201 68 -8 19 48 54 -21 94 -42 77 165 3 117 121 181 -3 5 9 -98
6200 -98 184 110 73 44 -25 69 28 -39 124 52 74 51 78 184 114 -50 81 -16 36 56 11 177 32 -34 98 63
6226F3p2R6k11P9j16J72j31J14j6J18j33j23N8R3Q7qj64J79k84K13l1J3j27K59
6250A28l2o8PJ27j97n5Q2l8JJ59j76O1p8N6J85o5j84J51p8L5r9J12j55J04l9J05
6276D9lL8k9j76N8K7K1j4O2n8NL9j50J13K8k3j26J73N0m9%J0m3k15J69j1J32P8
6304A55k83K66j23LJ5l2o0J95j06K7m8j60J95k8j07Q1k0O3j11K31q7j62J41n1
6328fM5k1J34o5j47L9K5o1o7J09K9m5o7m2O1K35j01j15Q1L2r4K15l2j62Q9N2j17
6355Dj63J7J91k11J86R5op5m9RO3L3j44J0J65k01P1J7M2n2n9K48k46L9r4K00j11
6382b1J1k2N4M6m6P9q7Q2j34K0K8K2j96J70J32k18K45k4j49O6R0K43l05M9j49
6407a4J7N8k70K09R1k09Q2o2l5J14L5rr4Q4M3K82l23L1p4j06M3J41n9j44K80j08
$$ plain form
6226 63 -9 87 -124 -45 -161 11 -120 -6 -22 96 -37 -160 -102 -9 78 70 -94 85 -199 14 -17 -4 -131 128
6250 128 96 28 35 162 -35 -90 -8 -46 -45 114 -62 -1 -79 -23 162 97 -87 64 -14 21 -78 34 -121 -17 -56 49
6276 49 46 84 55 -121 -63 -36 -15 -29 33 -25 -20 19 -131 -18 10 -13 -139 34 84 35 35 45 2 -213 -44 -55 77 155
6304 155 -128 138 15 18 33 1 -59 136 30 57 9 -151 44 16 -91 -10 -30 33 -78 153 66 -96 45 -6
6328 -6 39 18 152 87 -60 -21 4 -57 -124 -15 14 -31 -98 -140 -79 156 55 -60 21 53 -41 174 142 -20 69 121 4
6355 4 -159 -142 49 -162 24 119 113 38 -11 -2 61 94 -50 -40 125 -76 -5 12 54 2 -57 191 -55 -16 -110 90 -21
6382 -21 -10 -32 22 68 22 101 14 96 -38 -18 10 32 -164 6 138 -80 165 141 -8 58 148 391 86 135 -14
6407 -14 3 61 -209 0 91 -118 -36 -98 -133 -19 16 7 -87 -3 40 322 -1 30 -44 -150 -107 34 -25 -169 111 3
6433CJ0R2k14P6M3J9L0j35J24J76k49j89Q9J26J53j86J6J9J56j84o5j2J01N9J3
6458G1j79J35j37N9j88L52k07K6m4J09k6p6K52k8j23m7J66J2k18P6J45k36J00
6481fl7J74k19O4j4j8o5j3K41j21P3k5p2K06n7j86o7P6J5J20j06J6k14J53Or9
6507a75J62M7j07j1M7J46k5J4k61J48o8O0O6O1m5j32R4j40J24J33r7j1p3N7k78
6532b64L72n8j77N3P1K7r0j7Nq4K77p1j41J98NL4j07j2j08K11k62K22k98K82p8
6557a0j10O0K46m9k08K25j85oRQ1N3j57kp8K94p8P7p5k48N1K24j71nL3j10J42
6583Cn5J68j24J69j55N0m2k5Q8O9k18J33l9l5O2mm7N8j74K43j68j6N1M6p3K7L9
6610C1o9lJ35j20n1J71r4j01J15N5q9K3r3K23j31N2K3j8k0j7o9P0J17k66J98j48
$$ plain form
6433 3 13 105 -109 -33 10 29 59 -76 48 224 -25 -214 -125 1 154 -32 -16 3 159 -25 -90 -102 -1 58 71
6458 71 -108 27 -110 -51 -239 113 -94 -68 -112 -3 -29 -105 147 119 -4 -51 115 127 -91 -15 130 -106 -6
6481 -6 -43 131 -88 -24 -38 -56 -121 -134 107 -14 59 34 -38 168 111 -75 -142 -66 -51 69 -37 -21 -235 -82 -76 -175
6507 -175 -13 34 -73 -84 -37 109 84 98 -163 -15 -83 -23 43 104 59 -73 21 -119 5 138 41 30 -43 14 -264
6532 -264 108 50 -127 -74 -3 24 -66 -83 -78 -162 115 44 -97 101 106 140 33 21 -87 124 -138 84 -214 68 -10
6557 -10 -120 -60 186 137 -71 154 -31 -37 -28 53 106 -51 -53 -131 163 85 162 87 -161 -110 114 -57 -62 -29 -139 3
6583 3 -52 116 -8 161 6 56 14 -11 77 146 -72 61 22 -13 49 45 -2 56 -118 125 -43 -59 -8 38 -35 -8 31
6610 31 -38 -41 94 -26 -77 94 0 -101 14 69 -20 3 -90 133 2 54 77 59 39 22 -47 23 140 -126 72 -76
6636g6R6M1K5n2m8l9J66k10N4N4N4k01J58j3j5R0k8l9j27QQ9q6L03k34l0J0lJ05
6664E2k39O7J17P1K4k00N6J34j18Lk36J88R0j88J18M6RO6j54N4j7J99k28K6J31
6689G1j53R2m8J13l4O7m4j55KK58j18j17Q6j6j11K76k32K9R2k6r9O3q2M4j2L4
6715b0J5l7K24k21j7oo7Q3J37r3J47k21O2R7j39K50j73m6J5L7nj91K51r0J82k34
6741f0R1J30k86J08P7J4P0k15N6or3J53r0R3P7m1j98k4K17M8k10K23j28j24L17
6766A99k95k0M3J48j00J02j13LJ39j31K23k49k5Q0K3K2j36M2P4k30J35J39j11
6789c8M1J6M4j72J56K4N2j86m2M0J0J18j01kQ7J75j90J27k19Q2J4p0K63m09J26
6814e4J18n3j0L2P4j38N7j8J36k7j00m2n6p7K45k24J60q7K08rj79K2J10Q2j04
$$ plain form
6636 -76 20 61 86 34 -14 -53 113 -97 -43 11 65 -136 22 9 -6 84 56 17 -110 -102 -13 -99 204 -30 -60 -50 -53 52
6664 52 -187 -120 -3 68 92 -108 -52 82 -36 -33 -269 -81 9 -179 -61 -15 -6 60 -94 -40 -57 142 -86 -60 71
6689 71 -82 10 -38 75 41 108 64 -91 -89 169 51 -66 20 4 -107 169 -63 -34 58 32 -67 -4 -86 -42 -54 -20
6715 -20 -5 -42 182 -39 -56 -62 -129 -46 91 -2 145 -76 -14 83 -56 194 21 -25 -10 27 22 -169 82 -8 174 -60
6741 -60 31 161 -125 -17 60 74 144 -71 -15 -21 -114 39 -51 42 119 78 -120 -144 73 121 -89 134 6 -118 199
6766 199 -96 -116 -73 75 -25 77 -36 -33 106 -25 198 -51 -76 4 27 49 -87 -45 29 -201 -66 73 -38
6789 -38 3 19 63 -109 47 71 123 -63 -105 -65 -55 63 -38 -40 47 222 32 159 -60 22 36 -34 229 -180 -54
6814 -54 64 11 1 33 107 -31 26 8 144 117 17 -25 -81 -158 87 -137 23 -64 144 135 -44 -22 88 170 66
6839F6J30n4rJ3j58j5m2J04J48m8j62J19n6m5R6j87K20j6nj03Lr1J29Q3j2jp4
6866C3o2n2K60r3k53J82l7Lm2Jo5J45j4J57j84l9O1q2K21n2o2jrk8k4j16K07r6
6894d1L5o7N2M4q1K29j46q7L2jO5J54j38j46J53l3J70l55J74P7k11k3Q3q2J54
6919A1j58K00O9l2p8p5r7N8O3M0j07P0J65j21M6p5j18L53k15O0j03J74k06Q0J19
6944A23k52oK49n3m0N4N5l26K23j4J36j03j2Q3l28L17j06o4j25K03k7pN3M8k5
6969E6q6L2l6J40k84K18R5r6M3M4j06J70q7j74P2q2m0K06p0l1KJ02j46N7Q6Oj88
6996i7J31Q0j97K27k77K17n8J0J2O2j32J04m6p7L1j33m6K68o8O7Rj31J03jj42
7021h4j84K00J99k36L1j09L6j7J79K7k19N04m25J85p7J2r9K5P9L8QR1j02ol2J23
$$ plain form
6839 66 196 142 133 146 -12 -27 -69 35 183 135 -27 92 36 -9 87 -100 120 104 99 -4 -1 -92 37 120 108 107 33
6866 33 -29 -81 179 86 -167 15 -22 -19 -61 -60 -125 20 6 163 -21 -60 1 -81 140 88 26 25 16 -12 -36 -152 55 -41
6894 -41 -6 -73 -21 23 -58 171 25 -62 -30 -31 34 188 50 -96 57 24 194 -161 13 90 -121 -144 -61 -143 11
6919 11 -147 53 122 90 12 -63 -160 -102 -39 1 -106 -36 129 8 54 -21 -139 214 -1 59 -44 130 -76 4 123
6944 123 -129 -135 114 61 21 75 130 -196 27 13 149 46 34 117 -211 106 0 -64 -189 14 -13 -20 33 81 56
6969 56 -30 2 -34 106 -178 40 135 39 82 126 20 190 103 -71 1 -81 -121 85 15 -16 -14 88 -58 -1 85 91 -97
6996 -97 34 114 -83 144 -133 84 26 36 48 110 -22 82 36 -41 -10 -143 -189 79 11 78 87 -44 59 58 -84
7021 -84 -268 -68 131 -105 -74 -183 -147 -164 15 42 -177 327 -98 87 10 22 -77 -52 27 65 73 164 62 56 24 147
7047A47j75P4j17N4j04J74l25P4J97j9M0j44J74m6N3j48nj0K31j58Kj5K0R2L9
7072A05j35J49p6m8j3j3oJ18n4M0j17J18j8M7j77p5L26k29J53r1Jq2J9r6J49K4
7098A9r5o6J45m6j07K38q0m6N0j24J38j82J66j19J45Pr2L9j5J10j06J61k64J28
7122DM6l7j88J0K63j88L03k63j49L48r2L8l4K9j94J03OK8K5j35K2oJ42j87Q6l1
7148e1M0J84l41K08j79Q7J39Q3k6N5j09j41l3K53p9j36j07K29j45J41l6j60J26
7171Bq7J42N2L6j89J14J9r0n2k2O5m3J12q2N3n5j71P7K19J39k56Q2L2k46K84j44
7197ik1J52p7P8oK3l2k8r6R2k07J99k07K74k51k9K16m2J2j57K20q1j10Q4M7o3
7223a9O2j04j28K22o5J02N7j52p2m1J15P6j01N2%j20J62J53k04J1N0Qo2l6m7R9
$$ plain form
7047 147 -28 46 -71 -17 -121 53 -272 -198 -1 -20 20 -124 50 4 57 -91 -96 -106 125 -33 -31 -46 -26 66 105
7072 105 -30 119 43 -5 -18 -31 -37 81 27 67 -50 68 50 97 -80 -155 171 -58 95 4 5 -77 -58 -154 -5 19
7098 19 -76 -142 3 -43 -150 88 8 -38 12 -112 26 -156 10 -109 36 43 -49 -10 -25 85 -21 140 -124 4
7122 4 50 13 -175 -165 98 -90 213 -50 -199 149 57 95 61 90 -104 -1 5 33 58 -77 -55 -61 81 -106 -20 -51
7148 -51 -11 173 -168 40 -139 -52 87 170 144 199 90 -51 -84 169 90 -46 -153 76 -69 72 36 -124 2
7171 2 -85 57 109 145 -44 70 89 -1 -53 -75 -10 -53 59 -23 30 -25 -196 -119 100 239 -17 65 97 -149 135 -9
7197 -9 -30 122 45 123 117 140 108 80 -16 76 -131 68 -139 135 -116 -145 71 29 41 -116 104 23 -87 -3 44 -19
7223 -19 43 -61 -189 33 -32 70 127 -25 -97 -138 -23 53 -48 4 4 -116 46 199 -5 6 56 64 2 -34 -81 18
7249A8r4k6k5K42q7q0J03QL2r0k08L73j09l0q8o3Q9o8J95n3J23k76J89k6j51M4
7275e8k8K37j95O4q5P2J7O3J0m4O5j79K46q3r3nl3J5M1K2j06n4N9m4K42j13j16
7302h3K71l21J18J1Q2j43J4M9K56k29k1J07j65N5kL1j81N7j9L65k73J29r8J63
7326A73j21j64K47j1l2l4j72P5O1k09K22j33K13J24k54l7N9j10J74j97P9j8J8
7349d7l9O3j1rl8O8k6pJ85q6k14L28j64j30J99m8o5J6J55k14jQ2J20m5j24R5q2
7376c9Q2j15J48r1J04K9k51m6M71k27j01j47L08j5j74K07k04r1J29N7n6q1J26
7399B3p0J35j17L9J15j75L3j06M6J92l36N6J93m6J76j83M5k4K2o4J13j88R3R0
7423F2k1k3M1N5jk07J51j5j22j11J63J50p9L8r4J91j30J69k69P5O1r2O3j7j33
$$ plain form
7249 18 -76 -102 -127 115 28 -52 51 59 91 1 -207 166 57 27 -61 -124 -35 -103 92 39 162 -114 75 49 -102 -58
7275 -58 -86 151 -44 20 -65 7 24 87 97 53 118 -61 185 102 9 4 -29 -14 27 49 -57 -111 -52 -96 146 33 -83
7302 -83 188 -133 -15 -4 78 -65 -51 -2 254 25 4 111 -54 1 -1 30 -151 -94 -113 252 -21 108 10 173
7326 173 52 -112 135 124 92 58 -114 -39 22 -187 35 -98 115 239 -15 -52 7 -103 71 -126 -47 -65 -47
7349 -47 -86 -23 -34 -43 -81 -13 -39 -46 139 53 -161 167 3 -127 72 24 -41 -25 130 -84 -85 -3 117 72 -52 43 -39
7376 -39 43 -72 76 -15 89 118 -133 -179 292 65 -36 -183 125 110 -64 143 -61 -152 -23 34 -22 -103 23
7399 23 -47 88 -29 10 125 -50 -17 -123 -77 115 -221 -165 28 -18 158 -25 20 -4 18 -46 67 -121 -28 62
7423 62 41 18 59 114 113 -94 57 42 -80 -191 -28 122 43 81 -13 178 48 217 -52 23 84 -8 55 38 -95
7448i5L4j65J34L7M0J51q7j50QL21k59Q2Mj06M2nn9kK17j62m9N7n5J76j99J70
7474H0L8j23N5J1j84J35l8P0K0j09M0n2J12j99K33J52k85J03O1M8j94l9J81k80
7498a64K30m6j91L12j48O7m0l2K66q3q4j35PJ13p9K38k37m0j0n0K07Om6l2L2o
7524E5j71R7%P5n2J20j56j29J6J32O7p7K3%N2j68Q7R7j57M5M4o0P7n6J7J43q0
7551D1R3n7j82j66K94Q9j53O9k45K49p3P7j22j8K84k04j0K0M4Rj5p8J93k12N0
7576b3J32j58Q8q5J24j80N1lO4nN2P2k8j0k73j4L49k68O0O1q7J96k37J64p2M4
7602A4j2N7N2m7j27N3pQ6M1l68M06k89J60k7j81K55O8n8J23k82O4J57j34j49Q
7627a37J01q5m6K56k11J69qj6K09j45l4k3j64K0N3JK9n2o5J08P7J08Q9k17l3K9
$$ plain form
7448 -95 -61 -226 -92 -55 -15 136 49 -101 -93 228 -31 51 55 -51 -9 -14 -73 -75 142 -20 -69 -12 -67 109 -90 80
7474 80 118 -5 50 61 -123 12 -26 44 64 -45 -5 -57 55 -144 89 241 -44 59 120 168 -26 -65 116 -164
7498 -164 66 20 -171 141 -7 60 20 -12 254 171 87 -48 -41 72 -7 231 -6 -46 -56 -106 101 107 61 29 61 55
7524 55 -116 -19 -19 56 4 124 -32 -161 -145 -13 54 -23 0 0 52 -116 -29 68 -89 -44 0 -60 17 -39 -22 121 41
7551 41 134 77 -105 -271 23 112 -41 28 -217 32 -41 36 -86 -104 180 -24 -34 -14 30 39 24 -54 139 -73 -23
7576 -23 109 -49 39 -46 78 -102 -51 -54 10 5 57 129 101 91 -182 -196 153 -115 -55 6 -81 115 -122 42 -30 14
7602 14 2 59 111 64 -63 -10 -17 69 110 -258 148 -141 19 -8 -189 66 134 76 199 -83 -19 138 4 -145 -137
7627 -137 -36 -121 -167 89 -122 47 39 23 232 87 53 30 -134 -114 -61 -60 -31 -83 -148 -40 37 145 234 17 -16 13
7653A3N8k3j02qJ20r8mQ8L9q2k3l7M9l0k6N2m2K30j0j34J52l94J07N7k1k1P1J1
7681hL0p4J41M9l88L09k1j67o1K95Pj44m4J96k54J7J55j60J62r9J12j4j51K61
7705A49j89J70o3P2n3p9r4J85m7j00L8j12O6J27r1j77L47j77L8M3k16J98r3R3
7729C5No7M9N2o2p1J8k6QR9n8m2N4p1O0m9N5J58k18K02j53N7P0n7o9R5pj65K16
7758A18k86K1J66j67R0J26Rp6K9N0J14j92J06j8m1j41L3J0N5J1J7j89J89r7M4
7783a9j24J61o3J63r3J5J6R1k46P6Q9q8l4K13m2r4Q2o6q6j59L25j48K0qQ2j05
7809d2J54r2J4Q6k49J84j02j13K65%p5J13j76K5J08j61k2J7P7j41Q8K25j53q9
7833e9M5K0k1m2o1Q1L5k1J57k07M2m0J34j7J7L1k97L43j68J29q5J2n1R5p8J16
$$ plain form
7653 13 71 48 -54 -62 58 -40 -44 44 83 1 -22 -59 -10 -40 -66 -14 -56 174 164 30 182 -212 -105 -48 -69 -90 -19 -8
7681 -8 22 -52 89 138 -250 59 38 -129 -190 105 112 -32 -76 120 -134 -117 38 -122 40 -59 53 39 -112 149
7705 149 -40 130 67 139 86 7 -87 98 51 -49 -11 -123 -57 70 -21 -198 149 -28 10 53 -163 35 -58 35
7729 35 40 -27 22 74 12 -59 -41 -67 -59 40 -18 -60 -6 -77 -17 -66 -11 147 -71 131 -22 35 105 48 -21 74 67 -98 118
7758 118 -168 -147 19 -148 -58 68 77 1 30 80 194 2 108 90 49 -92 -59 -49 6 17 34 -155 34 -63 -19
7783 -19 -143 18 -45 118 25 40 56 147 -99 -23 66 -22 -56 157 115 21 103 37 -49 -208 117 -31 -11 -19 63 -42
7809 -42 112 20 34 120 -129 55 -47 -160 105 105 30 143 -33 -8 100 -61 -83 -66 11 -130 -42 183 30 -59
7833 -59 -14 6 -15 -57 -118 -37 -2 -23 134 -73 -31 -71 63 46 63 94 -203 140 -28 101 16 28 -23 72 -6 110
7859A10j08j6K2p7J21j6m9j26M4J29L1j87J75j15N9O7Op9j46K47j2o3j9k4j7O7
7885B4Q9m1j37J05p0J69k01K96k85nJ42l21J58J58o4j2l0L3j9n1Kn1J62k03R3
7910e9k4R4j51K14o3n1j8k5M7j0n4P0k8P0J4l07K94o6JM5J01p7P9j23j1l4Q0p8
7938g0RLj20L54k14l4N2r2J14j86M13j85j05M1J89k78J72j22K22o9k47K72j02
7961A7K9o3j16K15j07j0K3K03j48L7j36m7K21p9m2m5J43j81P0j8j29K64j62j05
7985a66J69Q3j80J48j59J33K8j78J86M8n1M3j30R5M7q7K3M4o5j02OJ08j04R7j8
8010A8rJ50J7j63N3Q7k75K48j79J70j37J02j90J93r3J49j23q3J30q4p3O1l2q4
8034a47K01j19J67j52JJ70j73l9J52j9q8R7n0K4o2Q7Q2k73J78k00K45N5j66J21
$$ plain form
7859 110 2 -14 8 -69 52 36 -13 -139 -95 34 65 -122 53 -62 -3 64 70 -9 -155 92 80 17 -2 -26 -43 24
7885 24 113 72 -65 40 -30 139 -62 234 -51 -56 86 -235 -77 81 17 5 -25 8 -11 -62 -60 -111 51 -152 -59
7910 -59 -83 11 -140 74 11 -40 -58 -83 -36 -46 -100 -30 -58 12 26 -281 13 -53 -52 -7 94 17 96 -27 -38 -72 8 -70
7938 -70 -61 -58 -178 176 -38 -72 -20 -112 2 -184 229 44 -61 -20 169 -109 63 -59 163 94 -153 119 17
7961 17 46 -17 -133 82 -25 -35 -12 191 43 80 -56 -103 118 39 -3 -48 95 -86 -16 -34 -163 101 -61 -166
7985 -166 3 86 -94 54 -105 28 56 -122 64 112 61 104 -26 69 116 29 52 96 31 -71 -65 43 -61 36 18
8010 18 9 159 176 13 66 153 -122 126 -53 117 -20 82 -108 85 -8 141 18 -65 65 -19 -92 -31 -63 -147
8034 -147 54 -65 102 -50 -49 121 -52 -91 61 42 -46 51 1 25 -37 50 132 -141 37 -163 82 137 -29 92
8058I2o7J02p8j34J43Q0j24J14q2o1j10P6KqJ86j04j37p3K81q2j04O1j2J86mp9
8084F4k5k65J69j05K06j50J60L9j68J85o2J51j51Lj21N3kJ34n3K2j37q3R5P6N9
8109I4r3ljK6m8j51N3J36mJ4j5P1k6P5j03O8o0oR1k23J44J4pl7J03j41J03j97
8137a23K60pj51j28J71J14k4k44J77k9L3m2J0N6j07M6l9P1j42Q6qj69J99n3O5
8162B2k12K54j58J54J53j93p3k5N0Q0k5n9l0oP2k0M7j43l8J40L5Q6K7k83L25m01
8188b21L81l51J89
$$ plain form
8058 92 25 127 49 -85 58 138 14 128 46 -15 -125 -49 -47 -55 131 27 -110 -183 98 16 -88 -27 -39 147 143 64
8084 64 39 -226 -57 -162 44 -106 54 93 -75 110 48 199 48 51 -70 -17 -19 115 62 84 -53 -136 -41 35 94
8109 94 1 -2 -3 23 -25 -176 -123 13 9 23 8 79 53 128 25 93 33 27 118 -105 39 53 46 9 112 -29 74 -123
8137 -123 137 130 -21 -149 22 136 112 -132 45 16 49 7 17 73 -34 12 -27 44 -98 -12 -20 -189 10 -43 22
8162 22 -190 64 -94 60 213 20 -53 -78 -28 52 27 -32 -62 -68 4 -16 31 -112 -150 -10 25 111 138 -145 180 -221
8188 -221 160 -191 -2
8191b
$$ Imaginary data points
##PAGE= N=2
##DATA TABLE= (X++(I..I)), XYDATA
0@%%%%%%%%Qj6J6j6K4l2M0m8N6p2Q8j11J35j60J92k24K64l12L60m16M81n54O36
31C39p25Q25r36J059j194J343j508J687j884K102k338K597k879L184l520L888
47B040m291M731n211N739o323O969p684Q482r378J0390j1546J2879j4434J6280
61H643j8510K1270k4787K9437l5917M5635o1983R6326k90276L51252J98845n94542
73b74607N03655q2303n82085M33556L17097m62928J74522R6178l77639J72759
83h1795L31175k09058p6135L0584j18135J7686K05369O0768j45259j10390N9850
94c5340k4413M6747J77508j25546j84064J35701l147j2233J99856j34409k01103
105a60443J54993l3307m185K46927j70098j86126J99545r5949l3539K88200j81925
$$ plain form
0 0 0 0 0 0 0 0 0 0 8 -8 8 -8 16 -16 24 -24 32 -40 48 -63 72 -88 104 -120 144 -168 192 -224 257 -297 339
31 339 -386 439 -497 562 -632 711 -797 890 -994 1108 -1230 1367 -1512 1672 -1848 2040
47 2040 -2251 2480 -2731 3008 -3315 3654 -4030 4452 -4926 5464 -6082 6797 -7637 8643
61 8643 -9867 11403 -13384 16053 -19864 25771 -36212 60114 -230162 121090 319935 -274607
73 -274607 229048 146745 -435340 -1784 315313 -147615 26907 123085 -254554 -81795
83 -81795 249380 40322 -35813 -5229 -123364 -105678 99691 160459 15200 -95190 -35340
94 -35340 -59753 -13006 164502 38956 -145108 -9407 -12554 -24787 175069 40660 -160443
105 -160443 -5450 -38757 -42942 203985 33887 -152239 47306 -48643 -82182 206018 24093
116B4093k00178K39804p0097p8373K66551j31190k20418J79167m873n4673J71195
127A21008o8497j33412N6270k398M6440M9492q9188J2535r008o1350J57075J3369
139I2336j77166R2073R431j45025J90291O7958k21425Q4190O3312j63510J20089
150A2554J01700j73929J5508Q5402p6284L3822O9769p1411m7520K3824L4374J0533
162A8342j6288L0124k9723p8706R0732M1950j05890O2521K8269j25465Q9009P8206
174H3081j29098L9422M9464j17145O6750P9890j05949L2331L8896r7166O0515
185I91N0993q7501L9603J8609p0761O4544K4084o9058L8684k154n2566O3700R576
198B8744n1781M0256j1508m0087N4106l762l4498L1841j7706j2956L9825j7581
$$ plain form
116 24093 -176085 63719 -6378 -84751 181800 50610 -169808 9359 4486 -50187 121008
127 121008 52511 -80901 -24631 -27029 19411 68903 -20285 -7750 -16758 -78108 78967 92336
139 92336 -84830 7243 16674 -128351 61940 129898 -91527 -7337 55975 -107535 12554
150 12554 114254 -59675 -44167 41235 -35049 -1227 68542 -2869 -50389 -26565 7809 18342
162 18342 2054 32178 2455 -76251 14481 56431 -49459 13062 41331 -84134 4875 83081
174 83081 -46017 -6595 42869 -74276 -7526 72364 -33585 -1254 37642 -59524 991
185 991 51984 -35517 4086 22695 -48066 16478 40562 -28496 10188 8034 -44532 19168 28744
198 28744 -23037 17219 5711 -34376 19730 15968 -18530 13311 -4395 -17351 22474 4893
210D893j0774J8797l0460O470L5150k7783k21K2096l4467N734L2941k6161k495
223f280J5508j9494P508J3723r798K225r308k547J6542j1387K479J6286k9022
236a3565J452L2395k8977j391L4679l9861m751M8512l5853j0760M5529l8029j5180
249b5800N2402k5718k3720M3303j9877k7823M3143n022l1346K8875l44k6933K2105
262C245R092k2007O127J0975j2934M4J5095q433j0820J2735r96j0426J2801L886
276H384j6391O545J0353j5979L325J5434j7149j678J8993j2547n986J6165q386
289A083j0332J3277Q26r467P832K871r949L685L694n413J022L250j185r31K039
304B302K02m393J729J761m275K660M353m266j090M496l001n099N896J226p010
$$ plain form
210 4893 -5881 12916 -17544 -11074 24076 -3707 -3928 18168 -16299 -10565 22376 -3785 -6280
223 -6280 9228 -10266 -2758 10965 1167 3392 -5916 -8463 8079 -3308 -829 15457 -13565
236 -13565 -12113 20282 -8695 -10086 24593 -15268 -20019 28493 -7360 -18120 27409 -10620 -25800
249 -25800 26602 884 -22836 20467 590 -27233 15910 10888 -20458 8417 8073 -18860 3245
262 3245 12337 -9670 -3543 7432 -5502 -5458 9637 1204 -9616 3119 2123 -8303 4498 8384
276 8384 -8007 -1462 8891 -7088 -3763 11671 -5478 -7156 11837 -710 -6696 9469 1083
289 1083 -9249 4028 4854 -4613 3219 6090 -3859 -174 3520 -1893 -871 2379 1194 263 2302
304 2302 2504 -1889 -160 1601 -2674 -14 4339 73 -1017 3479 478 -4621 1275 2501 -4509
319d509N646M359p812O25N593n936l746Q414m96p433Q418J595j0532N508L546
334C240r444L616P742q397N63R814j0371l284J2732r893n005J6638p393q553J5156
349G161m685j2818J2877J086j3231J1280N309j3055P155M413j1316M012M687n946
363c071K314L499k052r22J119j33k765K1L592j477p80N498l363o046Q352k736
379A050p888J2817l120j0642J4673k069j1433J1995l169j0813J2257q1p085J0642
393G134o014p545J2550q091k918J5503j4800k160J8265j6350P51J7066k2731J076
407h264K0731k0254N150K0589k8949K165K4798k7694O003K6191l3230J986K8797
420A8019k6346K232K3195k6681k482K1651j2654J485J1513j4605j000N622k938
$$ plain form
319 -4509 1137 5496 -2316 -1691 3902 -2034 -5780 2634 2138 -5295 3123 4718 -5814 -306 3240
334 3240 -6204 -2588 5154 -3243 -2680 7134 -3237 -6521 6211 -3682 -8687 7951 558 -7995 7161
349 7161 2476 -10342 2535 3621 -9610 1670 6979 -6076 1079 5492 -5824 -1812 2875 -3071
363 -3071 -757 2742 690 -232 887 754 -2011 -1990 1602 125 -655 4843 1480 -4566 3786 1050
379 1050 -6838 5979 2859 -7783 6890 4821 -6612 5383 2214 -8599 3658 3577 -3508 7134
393 7134 1120 -6425 6125 -1966 -4884 10619 -4181 -6341 11924 -4426 -3675 13391 -9340 -8264
407 -8264 12467 -7787 -2637 17952 -10997 -8832 15966 -11728 -5725 20466 -12764 -10778 18019
420 18019 -8327 -6095 17100 -9581 -12063 9588 -3066 -1581 9932 -4673 -5673 -51 -2989
433b989Q382n178n135R022j2294O250J8334k5641K087K0175l0259J2384L1850
446B6988l9665J446L2597l9322O621M1414m1405l399L6482l6001N686L5009l7002
459a0551J078K3675l0083J6299K0347l3586J3580R139k9566K7390Q437l3784K5148
472G523m09k8475L7386m826l1237L3872j3365k2507M4854j7574k4975L9420k3650
485c963j7420M7577k6030k0849M3171k9008j2858M8616l2024j7613M1081k8248
497g568q623M0469k5323j4262K5871j4091k471J5215r106j100n674Q28K2632k1918
511e121o014L3821m0193n602O3998m8161k3950P0440n2379k7192R0220m7655m7330
524d5118Q2638l9502m3351Q9014l0880n6243O8706k2809l8248O7627j9494m0644
$$ plain form
433 -2989 5393 215 -4920 4102 -8192 -1942 16392 -9249 -7162 13013 -17246 -4862 26988
446 26988 -12677 -11231 21366 -17956 -11335 30079 -11326 -14725 21757 -14244 -8558 26451 -10551
459 -10551 -9473 14202 -15881 418 20765 -12821 759 9898 -19668 7722 16159 -17625 7523
472 7523 7114 -21361 16025 11199 -20038 13834 469 -22038 22816 5242 -19733 19687 -3963
485 -3963 -21383 26194 164 -20685 22486 -6522 -19380 29236 -2788 -20401 20680 -7568
497 -7568 -16191 24278 -1045 -15307 10564 -3527 -5998 9217 111 -989 -6663 -5835 16797 -5121
511 -5121 -11135 22686 -17507 -23109 40889 -7272 -31222 39218 -13161 -40353 49867 2212 -45118
524 -45118 37520 -1982 -45333 43681 12801 -43442 25264 2455 -35793 31834 12340 -28304
536b8304M1031j6138j3299L9768k0109j4601J8039k1392J3404K4497k9753M496
548b361P996k7468K6877J6449k9640J0854m680j7429L2682k421j5701J7609k9303
561a6536k305M6673k8048q256L4919n0946j737O6266m2028j3774M7938n5808o458
574c0100P0361l8784j6496M0205m6541k182N4948k8739p060J8835l9777J5213
586a0117L3360k7902J5199j655m5898M0404J9674l8929L4614p606n6797N0736
598E083K3139m5824L1585j93n4466L7759K9739l2041J1868k058l0213K0198J7276
611A1852j654p26k3091r7J5136n878K1974K12m4314J6251J9948k2622L1249N858
625B4098n5979K1642K3940k9522L4340O308n7180K3808K0488k6553L5046k21n0411
$$ plain form
536 -28304 12727 -3411 -16710 23058 2949 -11652 6387 -15005 -1601 22896 -6857 -2361
548 -2361 5635 -21833 5044 21493 -8147 2707 -1973 -19402 13280 10859 -4842 12767 -16536
561 -16536 -18841 27832 -216 -8472 26447 -24499 -26236 40030 -1998 -15772 32166 -23642 -30100
574 -30100 40261 1477 -15019 25186 -21355 -23537 31411 2672 -4388 14447 -25330 -10117
586 -10117 23243 -4659 10540 8885 -37013 3391 23065 -15864 18750 11144 -45653 5083
598 5083 28222 -17602 13983 13790 -40676 -2917 26822 -5219 6649 4591 -25622 -5424 11852
611 11852 10198 9472 -13619 -13716 1420 -4458 17516 17728 -26586 -10335 9613 -13009 18240 24098
625 24098 -31881 -10239 13701 -15821 18519 24827 -32353 -8545 11943 -14610 20436 20215 -30196
638c0196K5430J2317k0728L7099p864m5907K8614O627j8615L8329j0861m1895
650b7650K5819N896j1999K8354r927k9560J3234M916K896J4988j4504j1870M068
663e339m139J8213R763k4484J483K390j2846K6345P490k9074Q154R08j4992K8297
677A2169N292k8184R496k37j3729K7095L294k4708Q835l031q641K4463j876j7040
691f802P075p993n92K0798p711q809N637j2425N306J9018j2199m106O003j5886
705a2686R358J7304j6213J165N321j8672J2783J6171j8270J824P100j7506Q933
718c388J7122j4789k648P053j0771M190J2235o764m187K88k239L906L472q9k232
733A159n930K067N337j483J896m47q226L345O451m885L792P58j0855N975O234
$$ plain form
638 -30196 -4766 7551 -13177 23922 16058 -29849 -1235 5392 -13223 25106 14245 -27650
650 -27650 -1831 4065 -7934 20420 10493 -19067 -5833 -917 1979 16967 2463 -9407 -5339
663 -5339 -9478 8735 18498 -5986 -4503 -2113 -14959 11386 18876 -10198 -2044 -1136 -16128 12169
677 12169 17461 -10723 -1227 -1464 -15193 11902 15196 -9512 -677 -3708 -12349 12114 10238 -6802
691 -6802 273 -7720 -8312 12486 4775 -4034 1603 -10822 -5516 13502 1303 -2803 3200 -12686
705 -12686 -3328 13976 -2237 -1072 4249 -14423 -1640 14531 -3739 -1915 5185 -12321 -3388
718 -3388 13734 -1055 -3703 3350 -7421 -3231 9004 2240 -1947 -1659 -3898 8 3480 3391 1159
733 1159 -4771 -2704 2633 1150 3046 2599 -5627 -2282 4169 -716 3076 3834 -7021 -1046 5188
748E188p440N168J106j1517O881N797p803M986J583j0879O326O582r507M871L974
763E316j2150M499R099q919M18O112p449j350Q644k189n309M267M0m886L954L984
779D081n367j650M539j819k892N820q38o332M606J786n114L907J782n654J773
794a372L355l347K79L383l764r66L947j491j112J971r47j045O03J448o98j580
810a336J599L04j849J641J014k388L86J676j325l45K086j800l37J781j365N45
826B87P35j788J419L45j832J294Q61j995L02J800j458n43J617q44k24M10k1J78
844E43r28N95Q64j664J141P04k474K032N44l086K519O90l874K961J910n546L451
861C82L016p122L512M010p091K436M517o737K065L946n190J103L586m568J528
$$ plain form
748 5188 -2252 2916 4022 -7495 -614 5183 -2620 2366 3949 -6930 -604 5978 -3529 1342 5316
763 5316 -6834 -2335 6764 -2155 -1737 4375 -3074 -4424 4220 2031 -3278 989 1029 -3857 97 4081
779 4081 -1286 -2936 1603 -216 -3108 2712 1874 -4458 148 1934 -3180 727 2509 -3145 -1372
794 -1372 1983 -1364 -1085 2298 -1466 -2432 1515 24 -1088 883 -64 -1109 -506 942 244 -1336
810 -1336 263 567 -1282 359 1373 -1015 -629 1047 -278 -623 1463 -337 -674 1107 -258 287
826 287 1022 -766 653 998 -834 460 1321 -674 -372 1428 -30 -573 1044 200 -24 386 365 543
844 543 -385 210 1074 -590 551 1255 -1219 813 1357 -1729 790 1480 -2394 567 2477 -3069 382
861 382 3398 -3724 -212 3798 -3293 -857 3660 -3077 -1012 2934 -2256 -1153 2433 -2135 -607
876f07K845m338J642K336m380K602J192l304K200M28j923J725r53m7J264k337
892a655J466J944m078K281K430n453L050L314p006M095L347q325N785K857r427
907e375P280K240j0550Q488K928j1647Q602L746j2776Q630M588j2972Q486L978
921E646j1985P943L391j0163P181J597q359O819O19o350O513j352n162O330k029
936F39k427N013m893K81M939o616L892L948j0148N646M627j0909P762M242j3197
951g201P483N047j2087R016L582j3921R591L093j2394J1975O51j3562J1726oj0464
966g471J2658j736j1326J0914j975o892J2158n537p001J0881p028k156J2824j0569
980b256l052J1573j1313J924J2708j4023J190R432j3460O508J0833j6756N302
$$ plain form
876 -607 2238 -2100 -458 1878 -2502 100 1292 -2012 188 616 -1307 418 -535 -582 682 -1655
892 -1655 -189 1755 -2323 -42 2388 -3065 -15 3299 -3707 388 3735 -4590 1195 4052 -5375
907 -5375 1905 4145 -6405 2083 5011 -6636 1966 5712 -7064 1566 6154 -6818 1668 5646
921 5646 -6339 1604 4995 -5168 2013 3610 -4749 2070 2689 -3661 2852 1500 -3662 2668 639
936 639 -1788 3225 -1668 -1387 3552 -3064 828 4776 -5372 274 4901 -6008 1754 5996 -7201
951 -7201 282 5329 -6758 2258 5840 -8081 1510 4603 -7791 4184 4835 -8727 2999 2993 -7471
966 -7471 5187 3451 -7875 3039 1064 -5828 6330 793 -6208 4673 -2355 -4511 8313 -2256
980 -2256 -5308 6265 -5048 -3124 9584 -4439 -3249 6183 -7277 -769 10064 -6692 -1390
993a390Q346j6899J0542J0346j8578O748P521j6083J0646Q211j5435N869L507
1006C351j0442R813L120r563N815k639m977J1180l920m112P473r811M24J2499
1020H211j0661J447Q246j6017O031J2981j5686N342Q752j9361Q361J3455j7573
1033f472P306P800k0539J1203J0923j8068J1011L751k0160J5234O613j7457J3692
1046D837J196j9470J6128N355j6455J3117k68j6144J4419K703j1013J0182l887
1059G00r043J1744j866m088P756q150k426R473n469J431N281j0951K995O861q584
1074d336P315K000j3177Q714L628j0197J1615j904j3253J2812q63r146J5233o778
1088A663j2472J7760n840r720K0614j1174j4101K3053q193j2370K3151j0482j5927
$$ plain form
993 -1390 6956 -9943 599 10945 -7633 -885 6636 -9447 1199 9410 -6025 -156 3351
1006 3351 -7091 2722 5842 -3721 2094 -545 -5522 5658 1738 -2374 5099 -4712 -4288 8211
1020 8211 -2450 -1003 7243 -8774 -2743 10238 -5448 -106 8646 -10715 -2354 11101 -6472
1033 -6472 834 8634 -11905 -702 10221 -7847 3164 6915 -13245 1989 8602 -8855 4837
1046 4837 6033 -13437 2691 8046 -8409 4708 4440 -11704 2715 5418 -5595 4587 700
1059 700 -8343 3401 1535 -2553 5203 -2947 -5373 4100 -1369 62 5343 -5608 -2613 4248 -4336
1074 -4336 2979 4979 -8198 516 4144 -6053 5562 3658 -9595 3217 2354 -6792 8441 1663
1088 1663 -10809 6951 1111 -8609 12005 831 -13270 9783 1590 -10780 12371 1889 -14038
1101a4038K2331m694j3006J8562o157j4239J6340j371r459J1294m068q229Q785
1114B051j66k473L031l509j37M92K0N371m828m141P640n142k131J2060q637p131
1130g630J3745p539m761J6134j0652q532J6685q608n829J7273j1030r323J7031
1143F964p299o838J6587r079j0067J4929m038o509J1857n917p403Q693j276j440
1157h36M073m251j337J767j005M641j083n927M972j505l446R371l212q149Q424
1172B497k549n399J1806l809q967Q881k015n017J0121k578q380O522l25l778P332
1187D342j746o253L853q88R0M334l494j479R99j925L504J763l536N37q43k012
1203b754N605l88m489M137l161l680R326j926p066P291k773o171J0236k60q554
$$ plain form
1101 -14038 8293 3599 -9407 9155 2998 -11241 5099 3728 -5731 5563 1495 -6734 2051
1114 2051 1885 -588 2443 -1066 -1203 -711 -691 4680 -148 -4289 3351 -1791 -3922 8138 -499 -7630
1130 -7630 6115 -1424 -6185 9949 -703 -9235 7450 -1158 -6987 10286 -744 -10067 6964
1143 6964 -335 -7173 9414 335 -9732 5197 1159 -5350 6507 590 -6813 1880 604 -836
1157 -836 3237 -1014 -2351 -584 -1589 3052 1969 -3958 1014 -491 -3937 5434 2222 -5927 2497
1172 2497 -52 -5451 6355 2546 -6421 2460 445 -4572 5549 2971 -5409 1113 788 -2990 4342
1187 4342 2596 -3657 196 -692 -602 3732 238 -1241 -242 -2167 1337 3100 -436 101 -742 -2754
1203 -2754 2851 2463 -2026 2111 -1050 -4730 4596 2670 -4396 2895 122 -6049 4187 3927 -4627
1218d627O118N9o697P264K282p588K978J444m611M243K051m028K0P81p48J389
1234C30N79n8j998j174K873L14j715K213j120l900M266J667l840K232M47m188
1250c072K838K468k804P12k31j377J646O43o54N96j501q15K556r63m20K063k623
1267i38o27L248j590n13K004k460m03K715j173n45J515k023j08K079r18k05J112
1284A170j729J56J444j111L51L11j217P04O75r37P34j97r59M29Q27n76q3K10l91
1303a89J56J63M75l43j331J331N31k088J815N41k712J282J622k141M76J444j992
1320i60J40J917j490k59J284j515M23P60p22L85k05m29J028n92pQ23j333L14J440
1339A002j625j29K330k390p54L412k150j252K983j406j720K761n51j450J141K99
$$ plain form
1218 -4627 1491 1550 -5147 2117 4399 -3189 -211 1233 -3378 865 2916 -1112 -1092 -311 -1059 330
1234 330 909 851 -1147 -2321 552 866 -849 1364 244 -3656 610 2277 -1563 669 1116 -3072
1250 -3072 -234 2234 -570 142 -89 -1466 180 823 169 765 -736 -1551 1005 42 -378 1685 -938
1267 -938 -1565 1683 93 -420 1584 -876 -1279 1436 263 -282 1233 -790 -898 1181 263 58 1170
1284 1170 -559 -403 1041 -70 281 592 -625 79 754 -183 551 354 -605 -176 651 75 -8 202 -189
1303 -189 -33 130 605 262 -1069 262 793 -1295 520 1061 -1651 -369 1253 -888 -412 1032 -960
1320 -960 -820 1097 -393 -652 632 -883 -460 300 -422 -37 -242 -671 357 -235 -242 581 -752 -438 1002
1339 1002 -623 -752 1578 -812 -1566 1846 -304 -1556 1427 21 -1699 1062 511 -939 202 501
1355E01r45P1Q11j22o90NJ132j104k20K135k089p22L221k505p19L726k929j394
1373a837M466k752k049M986k541l074N379j721l653M941j217l575M181q26k422
1388a714K934p55j785K013k96j101J369m37n83N63n0K45n58m91J760j736n56L137
1406A959k657j347M713l231k268N806l284k850O129l000l287N932k222l728O186
1421B851k568l479N776k426k977N246k624k122M233k023j538L260j826p93J983
1436I73j698P48J034k625K168M88l478L881R6m583M695l62m569N074k36m714M828
1453A720n92m197N126p94m490N298j128l936N347j553l255M664k023j887L684
1468A984k204m46K464k987Q10K607m113K166K186n186L208K368n875L814K080
$$ plain form
1355 501 -444 -373 438 316 -374 -369 763 -341 -561 1574 -515 -1237 1984 -521 -1240 2486 -443 -1837
1373 -1837 2629 -123 -2172 2814 273 -2801 2578 857 -2796 2145 928 -2647 1534 708 -1714
1388 -1714 1220 465 -1320 693 397 -704 665 228 -355 208 158 403 -155 -646 1114 -622 -1178 1959
1406 1959 -698 -2045 2668 -563 -2831 2975 -309 -3159 2970 -30 -3317 2615 393 -3335 2851
1421 2851 283 -3196 2580 154 -2823 2423 -201 -2323 1910 -113 -1651 1609 -217 -1010 973
1436 973 -725 23 1057 -1568 600 1088 -2390 1491 1587 -2996 1699 1337 -3232 1842 1606 -3108 1720
1453 1720 1128 -3069 2057 1263 -3227 2071 943 -2993 2354 801 -2454 2210 187 -1700 1984
1468 1984 -220 -666 1798 -1189 -379 2228 -1885 281 2467 -2719 489 2857 -3018 796 2876
1483B876o444M541J401n609M876O31o124N496M69n775N435n6n856N798l6n065
1499c442N634j226m239N442j938k654N101l407j799N258l942o69N428n019o65
1514b137N261n020K29N304n818P30M382n675K327L745n885J999K783n022K887
1529I0K359m228J765J084l209L006J0k268L123k741n57M793m342l62M922o009
1545b564M68O916o755M5O588p862O38Q318q229J57Q032r362N87R427q766l22Q318
1562E634q311o64Q591n919j925O362n254j130N603k779j198K314k348K77J213
1577D66l4P08k105J1J806k415K157K131n436J949L435n723K966M628q172J647
1593a981N989p218K114O683r121Q45P226p563J850O141q001O43N949o088J613
$$ plain form
1483 2876 -3568 973 2374 -3235 1641 2272 -3852 1644 2113 -3662 1773 1717 -4139 1659 1623 -3442
1499 -3442 2192 966 -3273 2169 231 -2423 2678 -729 -2528 2730 -1212 -1881 3547 -1472 -2137
1514 -2137 3124 -1896 -1667 3637 -2181 -1451 2931 -2744 -417 3328 -2557 -558 2225 -2797 90
1529 90 2449 -1779 -14 1070 -2139 867 877 -1391 1732 -1009 -1566 3227 -1115 -1477 3445 -2564
1545 -2564 -2096 4820 -1935 -1890 4698 -3164 -2526 5792 -2437 -2280 5752 -3610 -3023 6404 -2362 -2684 5634
1562 5634 -2677 -3341 5250 -669 -2594 3768 -1486 -2616 2987 208 -990 1324 -1024 -747 466
1577 466 432 1140 -965 -954 852 -1563 594 2725 -2711 -762 2673 -3050 -84 4544 -3628 -1981
1593 -1981 4008 -3210 -1096 5587 -3534 -2689 4537 -3026 -1176 4965 -3036 -2393 3556 -2532 -919
1608i19N040o639N14M630m488J458L374m742N12K281k358K150J62k365J814j215
1624g91k50L306k229j457K917k753j51M304l144j211L399l722O35M133l788j63
1640i65K855l836J315L516l664K06K045l338J830K271l132J048P32k813K933M63
1656A466k923K964j240k657M259q10k882L633j734k601M242r29k281L241k037
1671b89k005M447k109j279L259k985q88L571j962q26K704k618l75K805j726l37
1687f13J628k124L01J793j778R34P19k449J609P40j595J301l1j590J266q9p09
1704f87J590p65j123J583q87l05J995j770o95K144j673K67J871k237KJ608j712
1721g94Q18J339k385P34J619k377J023J786k816O35J724k275R94J593k426P39
$$ plain form
1608 -919 4121 -2518 -2004 2626 -1862 -404 2970 -1772 -1260 1021 -1337 813 975 -1390 424 -791
1624 -791 -1041 2265 36 -1421 1496 -1257 -1408 2896 -248 -1459 1940 -1782 -1147 2986 -802 -965
1640 -965 1890 -1946 -631 2885 -779 -573 1472 -1866 -36 2235 -897 151 883 -1930 1003 1466
1656 1466 -1457 1507 267 -2390 1869 1059 -1823 1810 76 -2525 1717 788 -1493 1748 -289
1671 -289 -2294 2153 44 -1235 2024 -961 -1849 1722 -240 -1066 1638 -980 -1355 1450 -276 -613
1687 -613 1015 -1109 -808 985 -793 141 860 -1589 20 760 -835 466 435 -1155 111 22 -687
1704 -687 903 138 -985 598 -289 -594 1401 -369 -1064 1080 -593 -326 1545 -692 -690 918 -794
1721 -794 24 1363 -1022 -288 1331 -1046 -23 1763 -1053 -418 1306 -969 25 1618 -808 -69
1737f9O84j493J049P37j413O36M78j320Q71N36j068J69N47o75L95J18K2J24r88
1756f60O65O51j262R39J76j308O21R30j163K53R13j660O70R97j250L78M13j101
1774g98O94N30j081P43J90r21M82L85n11M59k42k65M58l71j09Q06r26j89J323
1793F57j108L3J334j200n27J461q13l06J108p35o02J081n42j42R76p49k91N71
1811B06m38K37L12k50j10m1K71J33m50K07L57q89L38J277j387j46J286j368j14
1830e69J724j424r1J378j392J2J247r79k07J061j101K0J326j000m49J034r14j08
1848d32J003m29k96J00l19O15m60J28N72o69l24J140o75k75R67r94m57J476p25
1867e4m68J248j294o3J522j284l1J134j180r8J356j150k16J152q88k77R85o67
$$ plain form
1737 -69 615 -878 171 908 -505 131 609 -711 160 696 -372 -203 344 -331 64 182 204 328 -660
1756 -660 5 656 -606 333 509 -799 -178 752 -411 -158 755 -905 -235 762 -488 -110 303 -798
1774 -798 -104 426 -655 88 278 -643 -161 224 -287 172 -70 -335 123 -248 -357 449 -477 -666 657
1793 657 -451 -418 916 -284 -811 650 -163 -469 639 -96 -698 383 -159 -301 675 -74 -365 206
1811 206 -232 5 317 67 -43 -84 187 320 -130 77 434 -455 -117 1160 -227 -373 913 -455 -569
1830 -569 1155 -269 -360 1018 -374 -362 885 -94 -301 760 -341 -321 1005 5 -444 590 -324 -432
1848 -432 571 142 -154 -54 -373 242 -218 -90 482 -187 -511 629 -46 -321 646 -348 -805 671 -54
1867 -54 -522 726 -568 -631 891 -393 -424 710 -470 -568 788 -362 -578 574 -314 -591 394 -273
1885b73J43N73j247J023Q8r48J061M4j544J319K78j379J352r1j181R64K17j041
1903f42J392n33j017J504n93o42J373o74r34J214k97m19Q81n16k45N68q31P71
1921C60L45j287Q31L24j562J404L95j819J733j23j717J818j02j852J769q6j894
1938a463K355j1k302K124M2k241K220P2k065J628K40j402J173L7j083R52k78m48
1956d50R88p00m0M75p39K75Q58j279O32L87j710J787K8j703J764j36k140K253
1974E50P9k184K239L70k726J934O96k360J963K21k075J711K58j748J907m35j386
1991i86J455k37p57J106m78m13P29m58P2O33j349J046L14j802J837L05k253J730
2009D94N17k661K278O02k765J972O31k687K124R40l312K369P60l162K758N61k841
$$ plain form
1885 -273 -130 443 -804 219 307 -641 420 464 -1080 239 517 -862 490 399 -782 182 399 -642
1903 -642 750 217 -800 704 111 -531 842 168 -766 448 151 -268 613 97 -148 420 -411 360
1921 360 705 -582 249 573 -989 415 810 -1009 724 601 -1116 702 600 -1252 517 431 -1463
1938 -1463 892 881 -1421 703 745 -1496 724 796 -1269 359 599 -803 370 407 -676 276 -2 -450
1956 -450 538 -162 -202 273 -466 -191 667 -612 20 407 -1303 484 512 -1191 573 437 -1703 550
1974 550 629 -1555 684 1054 -1672 262 958 -1402 561 782 -1293 418 676 -1072 835 400 -986
1991 -986 469 232 -525 581 103 -310 419 -39 33 666 -683 363 677 -1125 712 1017 -1236 494
2009 494 1011 -1650 628 1230 -1535 437 1068 -1619 505 1445 -1867 502 1262 -1900 858 1419 -1422
2026a422J699O70k308J506J012j862M80R32j360R00J59p68M33l47L24J83p38P63
2044B56l8j225J268%j199J888r59j565K410k54k271K626l07k470K704J18k937
2061a955K809K17l273K986M40k872K421J61k746K309N08k625K237N12k550J835
2077D14L79j724J358J00j270R23K72o50K16r2K64k30k92P20p6q41J059l20r29
2096g19J575n40j238J775n68j308K061o96j693K381n60j574K257o14j933K160
2112G66k26j436J728m15j359J393k18j069J606p33o96J594j073n17J413r79j89
2129d10J317j189j38R80j171K87J007j272L25P43j325P90O14j271O81L29r82O35
2147e0N63r64L66J72n66Q53k31m48Q62q74k71J207o44l53R07r17J26Q64r37K75
$$ plain form
2026 -1422 277 947 -1361 145 1157 -705 -225 707 -653 247 406 -362 71 -276 48 231 -507 256
2044 256 218 -1007 261 261 -938 950 -9 -1574 836 582 -1689 937 630 -1840 864 982 -1955
2061 -1955 854 1071 -2202 784 1224 -1648 773 934 -1812 497 1005 -1620 617 1129 -1421 414
2077 414 793 -931 427 527 -743 180 452 -198 18 -74 190 -40 -332 388 312 -529 530 210 -719
2096 -719 856 316 -922 853 285 -1023 1038 342 -1351 1030 470 -1104 1153 539 -1394 766
2112 766 540 -896 832 417 -942 451 233 -836 770 37 -659 935 -138 -655 758 -221 -410
2129 -410 907 -282 -420 560 -611 -324 683 -589 -264 479 -846 -56 558 -713 -32 297 -685 -50
2147 -50 513 -451 -85 87 -479 374 143 -305 557 -317 -588 619 -25 -378 529 -388 -262 602 -335 -60
2167f0P30j328M38Q76j288N83Q01j748P62J062j355M29P97j283L97Q32j001N47
2185A91L65j066L47O56o24M60n0r79P96K30m12N82m50o09R51n75Q3Q45q58l34
2205d51P10m01k61J367j117o26J300n22j29Q49r73k35K91l7M03J37n33J12r3K
2225b07O66j48o85K57j95j3Q99n27k79K94n65J9J389r48o90J146j099J60J419
2244H93p34q16Q43l04n68J381n27q27P92n90K05P72n00m10M97k77o8O16M1n26
2264a07o0J57J83j45K09j82n77M03P57o11k43O81p98KR16m90l20O05p62p6J052
2285E94l89m48N17m93k52Q25l05o1K28n09p5O06n0N2l15J9L1N1J01J88l99m63
2307e47O83Q9l57N58k61p11M72J81j33L54k79l46M31j68j52M86l96m16N88L1k36
$$ plain form
2167 -60 670 -658 -220 656 -632 -49 752 -996 -234 828 -527 -98 699 -584 -187 645 -356 191
2185 191 556 -510 -163 493 -131 329 279 -700 96 326 -86 496 46 -563 388 -187 -104 741 -117 -451
2205 -451 259 -142 -403 964 -153 -779 521 -1 -130 719 -254 -489 -198 -235 168 305 -228 -116 -209 -207
2225 -207 459 311 -374 -117 -312 -325 574 47 -232 62 -503 -484 905 -43 -733 413 -686 -526 893
2244 893 159 -657 186 -118 -686 695 168 -659 133 -457 -252 520 20 -390 107 -170 -238 378 419 -107
2264 -107 -167 -10 173 28 237 55 -522 -119 638 27 -216 465 -333 -331 585 95 -225 380 -382 -458 594
2285 594 205 -243 274 -219 -471 354 49 -12 216 -293 -368 238 188 240 -75 -56 -25 26 127 315 -84 -547
2307 -547 136 225 -132 426 165 -546 -74 107 -26 328 49 -297 134 -34 -186 300 -96 -512 76 107 -129
2328a29L32m47R7J65j81M56j63o41Q15l22k12O58l18n70L43K71p00P88N3n48L27
2349G4Q5n51N99pn25P20l27l52L72K03m30K81O4j96J51J4k37j46K42nR2k10R0
2372AK07l84L13L48n62K51p0rN1L0l23M04j06l72L59j03j71M56l29l16N62l13
2394g6k9K92j51k06L07k59K4L74m82j0O16p14k3Q59p29j64P56l43m85P47l56j55
2416b07M49k12r7J35j00k37L60j53Q2m4o7j34J23J5K40m74J75M71q34L92Q20j120
2438d17K23R20j077N6J002q26m31J123p74m52J502q95k54P25n42j29N92k36m83
2457c73O91k36m51P49m6o01K61K26l72N2L34n6m86K94N29p86J07O82r11O1R57
2478F25q34j29R63p89k02R42q06k60J226r57m79J360l49r11R13l26n85P46J53
$$ plain form
2328 -129 203 -244 -147 18 -163 293 130 -511 304 -18 -230 428 110 -460 -117 154 -546 242 295 -253 74
2349 74 159 -392 207 200 -325 395 68 -284 88 291 -139 142 206 10 161 175 -62 -208 34 29 121 -89 1
2372 1 208 -176 137 485 -77 174 104 95 146 176 -147 257 151 -221 138 35 -136 320 -9 -325 237 -76
2394 -76 -105 187 36 -170 137 -122 -98 276 -206 -216 400 -314 -337 522 -207 -371 385 42 -443 304 -52 -207
2416 -207 242 30 -67 68 -32 -269 91 -62 20 -24 -91 -225 -102 -87 153 -321 -146 325 -509 -117 703 -417
2438 -417 -194 726 -351 -295 707 -119 -550 573 -201 -653 849 -46 -300 425 -117 -246 346 110 -373
2457 -373 318 82 -369 380 334 -267 -6 220 -152 -100 234 178 -308 -14 515 -271 -164 518 -393 -332 625
2478 625 -209 -338 625 -164 -366 576 -230 -490 736 -221 -700 660 311 -600 313 -13 -598 148 301
2497C01n03J56K62k94j73K53J50k47n4K53m06J83N10q02K50O36o99j38R36q69
2517b95l69J254o99l22J127p53r64J784p75o59J335n75p61J040j4r11Q31l0p01
2536d57N99K28m82J77K24n07K95K86l69o9J01J52l13J08M17n22j5N75n51r9P39
2557E17k96n10P30k92o80J036m19m17N79m17k4O25m55l8K98l86J82L70m87n1L05
2578A70m87L31L84p20K63L87p78N21L24p78L89L03o71J92O15p22M5O13o71J1M83
2599B04l46n3M12l66p4J76J83l03p3K43j48N5L71j86o14P42j30n97R65n8j183
2620g80J057L27j251R39L24j219P68M84j143N98N12j077K46P75p07K27M06q38
2638c52J66P77m44k94M88l94k04N89p1k92m0K41k7l08O08l80l64M10M6n01N36
$$ plain form
2497 301 -202 -46 216 -78 -251 2 152 -95 -149 104 -302 -119 391 -411 -161 475 -224 -362 574 -295
2517 -295 -664 590 -109 -431 696 -57 -1021 763 -12 -671 664 89 -672 368 354 -557 274 244 -457
2536 -457 142 370 -112 65 289 -218 77 363 -6 -75 26 178 -135 -27 390 -132 -147 428 -123 -222 517
2557 517 221 -289 441 149 -531 505 86 -331 248 -169 -193 432 -23 -61 237 -149 33 403 -84 -135 170
2578 170 -317 14 398 -322 -59 328 -450 71 395 -383 6 309 -362 -170 445 -277 -232 381 -290 -279 204
2599 204 -142 -195 217 -149 -223 -47 136 -167 -240 3 -145 -90 281 95 -519 223 93 -504 461 403 -780
2620 -780 277 604 -647 292 616 -603 165 649 -494 104 616 -461 -215 560 -147 80 486 -352
2638 -352 -186 591 147 -147 341 -53 -257 332 261 -31 -71 170 143 -165 443 63 -301 109 155 -346 190
2659A90K31p02J02M30n66L87J97o29J15M98n81M21K45o69L4M36k44k8N15n84k04
2680d06N22k35J23p9M9k3k12J45L61m14J08J72j50n9K94k33p0L50m53j01O49n33
2702a95J0M84m31j44P53o32j67L70k4k43K53M2k23K90k3R1l45J73L6k91K20K50
2724B54j94m5J83m23J11M75j44m58L10j41o3M61k25k36K77r8k33M78k67l1j18
2745a27J33M0P2J03k12j49p7L54O3l57O9M7l26N07%k91m7L92l63K04lj1k29rR7
2770a20K91j10k79J96j08O0P6J5j73J52j44J40J82k4m8l57K67LJ34k09K59j39
2792F4j14Q9J01j01L3k55k05M44K50k50J03J0n08L72L60n22Q9K65k17j00L34j22
2814A20m30L19K11r4L9K27m71j55K09L15m11L20l3l02oM00m78L66j6l21L8L33
$$ plain form
2659 190 421 -281 -179 251 -315 72 269 -360 -245 253 -328 93 338 -331 -297 139 -105 -133 382 -202 -406
2680 -406 116 -119 4 -75 -26 -49 -261 -116 245 -169 -61 111 -39 -98 196 -37 -107 243 -210 -311 338 -195
2702 -195 -185 299 -132 -276 477 -155 -322 48 24 -219 34 76 -147 143 120 211 -134 39 75 -216 4 254
2724 254 60 15 198 -225 -114 361 217 -241 69 -72 -135 326 101 -135 142 44 -189 289 22 -9 -127
2745 -127 6 46 118 221 9 -140 -217 137 200 -157 -88 -41 -367 140 140 -151 -198 194 -169 35 32 21 -208 -217 -120
2770 -120 171 61 -218 -22 -130 -70 6 21 -152 0 -144 -4 178 154 106 -251 16 19 153 -56 203 64
2792 64 -50 39 140 39 72 -183 -388 56 306 56 159 169 -339 33 393 -129 -40 225 8 -92 242 120
2814 120 -310 9 220 126 165 392 -79 -234 -25 290 -121 199 166 -136 -142 258 -220 146 130 -191 -153 180
2836A80k19J42J85m83J59K97ln23L75q8m31N20j14O7k01M8K2l3L62j51k17j8J70
2859D6l72M23J7k65M3K11l81K37K10l88K50K27m98QN24n02k47P20l53j06L57k51
2881i0j49L11K29l89j3K66m24K64K40k15k34K41n1j2M3J56l56L10K5m93L05L37
2903C01n48K38M24n24m3L99j90l99P87k77k03K51k54q0M49j94k68J74M2k44L21
2924A62J42l19k04K80r9RN1j48r5J99J5j12K11j25r2J35J35j96OP1k63L06J3j97
2948a15O1K25l25k7K75k4k27K35j65k8K5J80q9Qj38L4J1O9J29j66M0P1j28K7J88
2973A46k92P0J10K6n3J43k74M0K72o7k09K20n8j08k6L58j23M0k68r7L39nj93j06
2997a15J42J09j41J75k9p4k28J61M3j55J51R8m39K79J03j03K50p8k19R1q4M1J34
$$ plain form
2836 180 -39 103 288 -195 -36 261 258 -265 110 22 -409 111 -3 64 -137 -89 -67 -100 262 111 -106 -124 46
2859 46 -326 97 114 -151 -108 103 -278 -41 169 -219 31 258 -240 -232 292 -210 -457 263 -90 -196 161 -90
2881 -90 -239 72 301 -88 -101 165 -259 5 245 30 -204 37 -14 -26 17 173 -183 127 152 -341 -36 301
2903 301 -247 -9 415 -109 -152 247 57 -342 445 168 -35 216 -38 -118 331 137 -131 43 85 -159 162
2924 162 304 -15 -219 61 -38 -29 22 -126 -221 -22 -7 -119 92 -33 -125 10 145 -51 -45 26 -237 69 82 -115
2948 -115 -54 171 -154 -181 94 70 -157 78 -87 -115 -90 90 1 9 -129 -95 -84 -15 114 -52 -12 59 -69 -42 146
2973 146 -146 -76 34 60 7 150 -124 -84 188 121 -88 132 74 -34 -60 298 175 215 -53 -150 189 184 -9 -115
2997 -115 27 136 -5 170 141 67 -161 0 43 -112 39 137 -302 -23 80 -23 227 149 -70 21 -63 -22 112
3020A12o4p8j24J11J10o3k14L36l38Q4K04m3l83M28o3l73N57n7l72K49P6j86j07
3043a98L92j96RM8k32N1K84l12L3Q8l3q5M68l41j38L38k59k03M23r9l76K83J97
3066A42j82j78L91k08k48M52m8j64J36j88o5K77Ql05K50R4l65L94J09o10K25K35
3088A52l71K64L54n32J27J73l77qM73j92j74K78l23K86r4k4p8J03m3n6Q0O4j43
3111f1K3K73l16L6J43j16j86L31J2k96K94p1k06O7M2j28J43J80k58J05mj44R9
3134c8K38k88P6Q4l31J50L8R7r6J87p2P1k44L4J76j89K41O0k26Q0M7m9k78M11
3158A79j66J5N2k34J43O6K6p6R0j42Q3J13j89l1k7K22q6L8j89J17MJ4N1K9j5J30
3184B17k70J43j8j7j47j18J55J24L8m7j15M3p3N4M5n0n0K34l6k38K21n6j21L0
$$ plain form
3020 112 48 -30 -154 -43 67 4 -210 126 -212 -128 76 33 -350 78 15 -358 199 142 -230 19 95 -91 -198
3043 -198 194 -2 7 55 -177 -126 158 -154 -121 -33 -66 -151 317 -24 -162 176 -83 -286 137 38 -338 -55 142
3066 142 -40 -218 173 -35 -283 169 121 -43 93 -95 -160 117 125 -180 70 164 -201 193 302 -308 -83 152
3088 152 -219 45 399 -133 -6 167 -210 -218 255 63 -111 167 -156 130 36 12 -66 37 -6 -62 18 82 -61
3111 -61 -38 235 -81 -45 98 -18 -204 127 139 -157 137 66 -140 -73 -31 -159 -16 164 -94 11 7 -137 -38
3134 -38 200 -88 -12 72 -259 -109 -71 26 -70 117 45 116 -128 -94 82 -107 134 194 -32 48 95 46 -232 179
3158 179 13 28 80 -154 -11 55 81 5 95 -47 36 149 -40 -71 -98 124 38 76 -113 4 8 22 73 102 87 217
3184 217 -53 90 72 55 -92 -210 -55 69 107 60 -55 -12 -85 -31 14 -36 -86 148 112 -126 95 39 -82 -52
3208e2Q7P8k14k0J27n5j1K6k1P5j05N7j86K86l8k80J98P3j79P1L3N0q4R7m4J57
3234A26k68P0J52j61k8K40q4J47j59k5k1o9K34o3k53O2K40n9j72R6J43l58K11
3257AJ52j49J39r3Jo3O9o6j23J41m1J0P5Rp4k04L58j68N3k8J34l46L34j49j94
3282b22K40O3k24K56J18l42K20m5J83k48k8J85l52N0mJ52q8J48j46q8J10K0J32
3305I0j24r9J57N0j39K10k2j65PO6k4l7k4J8p2O3J51k04J03J22O1k27m3J44k53
3330a91L49l13K30K0mq5J8j47OJ83P9k99J51mq8J19P8j99OJ62j41J50q0l4J47
3355A13j94J60O1k36K49k36J04O6N6j24O5RJ51j47p5j77N1M6J53m2j8O0j39Mo0
3380a00J08m0Q4r6r0lL56k60lQ5n7J4J32k23o3K12O9J29j11l0j11o0K0k1K88l09
$$ plain form
3208 -52 35 113 -101 -121 6 -49 -60 -34 -55 20 -85 -28 -214 72 34 -246 -48 25 -154 -83 -50 0 -84 13 -31 126
3234 126 -142 -72 80 -81 -109 131 47 194 35 10 -11 -80 154 91 -162 -100 140 81 -91 5 148 -210 1
3257 1 153 4 143 50 51 -12 57 -9 -132 9 -32 -22 53 62 -12 -216 142 -26 27 -1 133 -213 121 -28 -222
3282 -222 18 81 -143 113 231 -111 109 64 247 -1 -29 156 -196 -146 -150 2 -86 62 -84 -172 -62 -42 90
3305 90 -34 -133 24 74 -65 145 123 -42 -35 31 7 -30 -54 -36 -108 -45 106 -98 5 127 188 -39 -82 62 -191
3330 -191 158 -155 75 95 91 6 24 -123 -117 66 145 -154 -3 -7 -95 24 102 -97 -91 71 -70 80 0 -34 113
3355 113 -81 79 140 -96 153 -83 21 87 143 19 84 93 244 97 22 -155 -104 -58 95 53 35 95 -44 -40 -100
3380 -100 8 -32 52 -44 -134 -137 219 -41 -44 41 -16 -2 130 -93 -156 56 125 254 143 113 2 -58 -38 -59 229 -80
3406h0n5J40L1l7J73o9r3k45L52L0l20K17j08r9J64K91j28l42L04j94j36L73j96
3429b7j56K30j62J10J18J29k14j74O7J23j9J14k12J09j11m7J17p0R0j3P0j03K51
3452B20Mr5k17N5N0rJ1J5rqK09l2k94P3N8l8RN4J43p1l14K31j84N0J79lo1p9R9
3481D6J1k2q7j18Q9K88j47l9k10J22J59j34P7k58J22mJ24R3j14L3K2m4k9kK59
3506B37k31k3jJ33o9J7l7p6R2kL0O6p9l34K32j02N3J62r9M6N2p5j15N7K06l39
3532a99J00R9K04l02Q5P5k93K95l2l10M11J34k90J26K8k42J53K7j07P1J67k33
3554c3kM9j31j6J82Q7l88K64R2k66K02R5k79R1J84k87J38J76k14k9J31q0k18L96
3578A44j68j15J98l2j12K5J10j01J2R8j03l9K4J56j15j18J33j1J44l1l16L88j83
$$ plain form
3406 -80 -135 5 36 -1 172 103 10 -235 117 147 -173 44 -64 -163 1 292 164 -178 126 -68 -204 169 -27
3429 -27 -183 47 -115 -5 113 242 28 -146 -79 44 25 139 -73 36 -75 -122 -5 -75 15 2 72 -31 220
3452 220 224 129 -88 -33 17 8 19 34 25 17 226 194 -100 -27 31 -7 2 56 199 128 -186 45 -139 -89 90 87 26 -53 46
3481 46 57 35 -52 -170 -81 207 60 21 -189 -67 92 -42 35 -223 -101 -105 19 112 -2 31 53 9 -20 -22 237
3506 237 6 -17 -18 115 46 63 26 -50 42 40 70 136 57 -277 -45 -147 -94 68 -31 15 67 -8 -123 -66 140 -199
3532 -199 -99 0 204 -98 -13 62 -231 64 32 -278 133 267 -23 103 131 -111 42 69 -38 33 200 -33
3554 -33 -35 14 -117 -133 49 136 -252 12 104 -162 40 135 -144 -53 131 -156 -18 158 -56 -85 46 -34 -252 144
3578 144 -24 -139 59 27 -85 -60 50 -51 -39 59 -44 -83 -59 97 -18 -136 -3 -14 130 99 -217 171 -12
3601a2k70L14Kp2J75n8j26R9o7J30j21J32j20r9M15k74M1K9P0k54J1jJ69J31k06
3626C8j06Q6N1q9j02L32j94N5K39k87o1O4J1Q4j21J17j95R3J24j22k0l9J05j03
3650d0M8o5N7Q0P8q8r4k3J07j22M3K03k37q2J42l5J1J7k12K59l14O1K70L0l34
3675b40J50K05L2j11%p0k6O3j6N1j90J79j33j35L18n5l4J38j28p7J5K35j48K68
3699B91j61M5m4J11k21j3o2N4j89J59J82l11L49j43p8j90K56k4j83Q9J40j32Q
3722f7J30p1J92j07k1O1l6j35O1J04j78qJ30j66k6J39O1k36N3J44j22J38%r1o1
3747a12J32j37P1L16l03K7m2k6L5L7l1L5kR2j3j79L35k21o0J02j81R9Q6j90n4
3772a84Q5K01l23L00j58j29L46r3j30K72j13q5l8J0K24m20L52j98L1R2j07Q5j02
$$ plain form
3601 -12 -282 32 34 -38 137 79 -47 52 -15 115 -6 126 6 -93 322 48 89 118 188 -66 -55 -56 113 244 38
3626 38 -68 18 69 -20 -122 210 16 71 310 23 -38 26 37 121 0 117 -78 15 139 17 -3 -42 63 -40
3650 -40 8 -57 0 80 158 70 -24 -47 60 -62 -19 184 -53 -135 7 -28 -17 0 -212 47 -267 -206 64 94 -240
3675 -240 -90 115 147 36 36 -34 -60 3 -13 38 -152 27 -106 -241 77 22 -12 126 -2 -79 -64 171 23 291
3699 291 130 175 131 242 21 8 -54 0 -189 -30 152 -159 190 47 -31 -221 35 11 -172 -83 57 -75 -67
3722 -67 63 -8 184 77 56 117 81 -54 7 111 -67 -75 55 -111 -137 2 63 -173 -120 24 -98 40 40 -51 -112
3747 -112 20 -117 -46 270 -33 -6 -48 -74 -39 -2 -33 2 0 92 79 -100 235 14 -46 56 -125 -26 60 -130 -184
3772 -184 -99 102 -221 79 -79 -208 138 45 -85 187 74 -11 -49 -39 185 -235 117 -81 -50 42 -65 20 -82
3795h2rL6j21J90j26P3qk7j09K05K0j7K00k90r9R1K32k05O8R7j10O9j59K6J17
3820F2l6m2j54L04q9k01J30Q7k34K27p2m0rM3K4M7j3n0j08J22P5m6k24K58j21
3845f0m4J47j57N4L45l63k7l4Q3M1J8L3j81J9J39k0L8K0k37Q5K23j04m2N9j36
3870a01K7J51M4j58j9P7j8M8j1r9J32q5m0J97j35J32k42R7p6J22j4K9Mj99K10
3895G3p5q0N6k6l9j1J35m5j17K23q8o3J39j53K9J66k13r3Q7J13j51K40M8m9o1
3920D5J44j10m5p4O4r9K45k16j20J22j00O3m4RJ16K7J51j33l7L6n4K9j41Q2o9
3945a09J03l5r3j2P8P9J03K2k01l5K99m27J04K57k60O4L06j47j64N5p0J4J39J09
3969A79l21K81rj14L2M8j31J2L6j43J97J00k49p1J39J6o0K5K06k02R0J58k73J13
$$ plain form
3795 -82 -91 -55 -176 14 -112 -39 -47 -74 -183 22 42 25 225 -65 -164 -73 159 -46 22 119 9 78 -81 -55 62
3820 62 26 -16 -170 134 45 -156 -26 61 -173 54 -18 -58 -67 -24 0 47 34 -16 -124 -2 73 27 -197 61 -60
3845 -60 -104 43 -114 -60 285 -78 -105 -139 -56 -15 3 36 -145 -126 13 -7 31 51 -186 -101 122 18 -24 35 -101
3870 -101 -74 77 121 -37 -56 21 3 51 40 -59 73 -12 -52 145 10 142 -100 -3 -79 43 29 58 62 -137 73
3895 73 -2 -82 -26 -52 -91 -102 33 -12 -129 94 6 -57 82 -71 -42 124 -89 -182 -95 18 -133 107 155 106 45
3920 45 189 79 34 -40 24 -75 170 -46 -166 -44 -144 -81 -125 -116 0 27 178 45 8 44 -10 19 -122 -40 -109
3945 -109 -6 -41 -134 -146 -68 11 114 136 -65 -100 199 -228 -124 133 -127 -63 243 96 -68 -13 -83 -69 70 179
3969 179 -142 139 130 16 48 96 -35 -23 13 -130 67 167 -82 -153 -14 2 -58 -33 173 -29 61 219 -54 59
3993E9l4l8q0nm1N8L1L6j07J38P4k14J24j08n1K26j32M8q5K10j96J99P4k51j72
4018b37L78j33q4L20k82J8M9J3M6k86J72j5J7j17K28j14R8K2m4J82l68J48L0j63
4042a22R7ol2N1k08K91j79J18n2J67j04r0j93K20l4J47M0j67j29K14p3j9J10o3
4066a6j07J56p9jP4K9j61O4J46r9N1o6m3Q1o8j1K48m77J86m8J69j23jJ59n3j59
4092a49Q7N6p1J5J13l4k7M3k1k29M22j53J5k49K75n3j89N3R6P0jk20O1M0M5Pj34
4119a32J78l4o3J45k56J44m8lJ31j4n1N9m0l39L01O4N4L3j22Kj49P0J81lj56J02
4145E4j58M1Q2q8pJ39j65J86j2j54N9J25K6j94J02J90l75K82l28J17J43j8Q3j60
4169c0j4L7j19J72o1m9%J3K2M0J3j21K62j52L1J0K9P2j88m7P9R4K0j54NR6j74
$$ plain form
3993 59 25 -13 -93 -98 -139 -81 -50 -14 -121 17 91 -123 1 -107 -158 68 -64 -16 -101 109 -87 112 186 -65 -237
4018 -237 141 8 -76 244 -38 -20 29 42 88 -198 -26 -41 -24 -141 87 -27 71 93 49 231 -137 11 41 -122
4042 -122 -25 -31 -63 -12 -220 71 -108 10 -42 125 21 -69 -262 -42 -76 71 111 -56 -185 29 -44 -63 47 -16
4066 -16 -123 33 -46 -47 27 56 -105 -41 105 6 57 -9 -52 29 -39 -50 198 -279 -93 -141 28 -95 -96 63 10 -149
4092 -149 -62 -6 -77 -62 51 17 -10 33 12 -217 205 52 67 -182 93 40 -149 -96 0 70 69 -151 -90 -50 -5 2 -132
4119 -132 46 12 -51 94 -162 -18 -66 -69 62 48 -3 56 16 -323 -22 42 96 129 7 9 -140 -70 111 108 -48 54
4145 54 -104 -63 19 -69 -76 63 -102 84 72 -82 -23 102 128 -66 36 226 -149 133 -195 -78 65 47 130 -30
4169 -30 -44 -7 -126 46 -15 -64 -64 -51 -29 11 24 -97 165 13 44 54 83 155 -33 -80 -1 93 113 -41 -36 60 -114
4196a14R4N6K2j02k1J55k10j8P4Q5O8k8k5q0K29j73j75M13l60J4M7J02m0r1k9
4221a07K13n0j53N7j4k8R7M8j30J1J9m5oK25j90n9J57r6M4J45j01r9O7J2r3M0
4247c6j34J78l4j34K39K2l0m8P2k22N1J51K1j24j39Q7P3O9l9M8r2r3K29k09j39
4272b33L59m03M69j90m1p3P4q2J42M7p4j79R8j6J63J6o3O3j5r9R7J0r2m8j1M0
4298d1m2J36J7p4j56J17J2j28K41j91k07K97R3j70L6lM6k13K29L4j35L0K38j27
4322C9q4N4J79j35q7O3r2J63r3o9L1m5K33j7l25L33k59J82o8j09K43j69P8l0q3
4347f7j68M90k38p5M8N7j94J73m5k0J19k41J27M1j51J27J62j23q1J24j40L4J32
4370I1o5j42J73M7J09l24P9M3O7j18O3Nj04K52k80jR2j8l8Q0l0j17L13k92o5J63
$$ plain form
4196 -114 -20 36 58 -44 -65 90 -120 -138 -64 21 89 61 36 -44 185 12 -163 250 -110 -96 -49 53 13 -78 -107
4221 -107 106 56 -97 -40 -54 -82 15 63 -67 -56 -37 -82 -88 137 -53 -112 45 -51 -7 138 37 -62 5 17 -76 -36
4247 -36 -170 8 -26 -160 79 101 71 23 95 -127 -76 75 96 -28 -167 -80 -7 62 23 71 -21 -114 115 -94 -233
4272 -233 126 -277 192 2 -39 -112 -38 -120 22 69 -5 -184 -86 -102 61 77 14 77 62 -37 60 70 -22 -70 -81 -41
4298 -41 -83 53 70 -4 -160 -43 -31 -159 82 -109 -316 -19 74 -96 -60 -63 -17 -230 -1 33 -102 -72 166 39
4322 39 -45 9 188 53 -34 29 -63 100 7 -62 -31 -76 157 140 -185 148 -111 71 3 -106 137 -32 46 16 -67
4347 -67 -235 255 17 -58 -10 47 -147 26 -19 -39 80 -161 -34 7 -144 -17 145 22 -59 65 -75 -41 91
4370 91 26 -116 57 104 213 -111 -32 11 78 -40 23 28 -76 176 -104 -105 -13 -31 -69 11 -19 -136 177 -115 -180 -17
4396a7J47j95J47Qr0K0m0Q6o7J3PJ48k16L1j50K20J7o7Lj29J03j27K09l4J01r0
4422C8q6q7K49n1q6O2R1k01L38j54j19J70p0m3j37L1O7J1J21j64K26o7p9j76P4
4447d2J54l17K01R4k50L88j69j25O1J77k29J6R6m6q2p5K04j68J83j68J17L5q3
4470b8J9m8J19Q6j66J54j87J51O6n6j39p5J71l33K74p4j6m1J58L1k49K37J5j22
4494e3j87K45J25j99J7L0J37r4j1n9N4P8j43K04j47J85k98L18j83J5M0r1j94J37
4518g4R4j93K07NJ99k03j11J03j34K04j72j21K14K26l19m6K45j57O0O4j74J3J27
4541E7P5l41K71o2p2j8J86j20p5R4j9K32m14J05J86j02Kl4J66n5j14J12l1Jl3
4566cJ24k13L3J49j23j32J02J93n7j51j40L24k84J10P0Q7l50K80kL2M8k30K38
$$ plain form
4396 -17 130 -65 82 90 0 20 -20 66 -1 12 19 167 -49 -18 -168 52 69 2 5 -124 -21 -148 61 27 128 38
4422 38 -48 -135 114 63 -23 39 130 -71 267 113 -6 164 94 51 -86 -55 12 23 144 -20 206 139 60 -116 -42
4447 -42 112 -205 -4 90 -160 228 59 -66 -5 172 -57 -41 55 9 -73 -148 56 -112 71 -97 20 55 -28
4470 -28 -9 -57 62 148 -18 136 -51 100 166 110 -29 -104 67 -266 8 -66 -82 -123 35 66 -183 54 69 -53
4494 -53 -240 5 130 -69 -52 -22 115 21 10 -49 5 83 -60 144 -3 182 -116 202 19 34 74 -17 -211 -74
4518 -74 20 -173 34 39 238 35 -76 27 -107 97 -75 -196 18 244 -75 -121 124 -33 27 91 -83 -70 57
4541 57 132 -209 62 0 -72 -90 96 -24 -99 -5 -24 208 -206 -101 85 -17 -15 -49 117 62 -52 60 29 30 -3
4566 -3 121 -92 -59 90 -33 -165 -63 130 73 -78 -218 106 -178 -68 2 89 -261 19 17 49 97 -133 105
4589A05j06n0K9jk8O7K0J6Q0j32M9p6J6J25L7k33J73m2j47K39q4j13J69k71N9
4614i9J46O7k15J80r1p7J24R7j53Qj5K13j27l2K9j17J85j0j53Q0K57k93j68K48
4638H4j23j09J55p5n7MJ00J46j05J08j35M3l1m6j7N2K9N1J2j36q6K31p0n4J61
4663A32R1k16M1k14Q3J69n1o8N6P0k38K99k12ol2P2q9J16kj9K65k21j68J76L8
4688G2k05J26Q6k37P0K29k45J30j02J8J46J5m4O4l43K80l3m2N9j39J45p7r6LJ31
4713A1o8j0O0M0L0j02r3J62q5k0J3J13j12K62k43j34rJ90p8p8K11j30l8K56k54
4738a06j71K33O8j1O9j70Jn0J10O3j67K49N4k90K29j05jl8R0j9K2J06j81j09J66
4763D2J04k01K23j04j22K75j11j09M4j05R7k57J99K16j32k67J15K0N1R5k4N1j6
$$ plain form
4589 105 -1 -51 -22 -23 -51 16 36 52 132 0 49 -27 -11 114 151 -82 91 49 -98 141 57 -56 113 -158 -99
4614 -99 47 114 -101 79 -12 -89 35 132 -21 -13 -28 185 58 26 55 -62 123 113 -40 40 297 4 -164 84
4638 84 -39 -148 7 -68 -125 -121 -21 125 20 128 -7 36 5 -41 -58 -6 23 74 86 -50 -136 95 25 -29 132
4663 132 223 7 48 -166 -83 86 35 -33 23 93 -145 154 -58 -64 -96 -24 -113 3 1 -18 247 26 -142 34 72
4688 72 -133 -7 79 -158 -88 141 -104 26 -76 -58 88 103 59 123 -220 60 27 -15 44 -95 50 -27 -123 -120 11
4713 11 -57 -67 -7 33 63 -39 -132 30 -55 -75 -62 51 -61 201 -42 -176 -185 5 -73 -151 60 -70 -108 148 -106
4738 -106 -277 -44 24 13 82 -88 -87 -137 -27 36 -131 118 172 -118 111 6 5 -33 57 38 60 166 -15 -124 42
4763 42 146 -55 168 64 -58 217 106 -3 41 -64 33 -224 -25 191 59 -208 -93 -73 -22 73 49 100 84
4786H4p3q9J06j86J86oj24J48J34k59P8j44J78j39j6OJ72r1O0j13J46l8j26J30
4810B4o7J70j37j1J8J21j02j10QJ84j47J28k66P0PL36k25j8N7j07n4K0K51k06
4834e6PR3k55J74J2K3k58L68O9k54K17l03K35j57J64O4r1k6m5j32J57P3mPM6j93
4860f5J44qk9j06J17j22l7K03k29J27J86l68L44q7M8j10l5J01j04J28J6j70rN6
4884iO3p9P2L2k48j6L96q9p7K0m0o7l9K15j72j33K50j27J8J56k16J18k7ol2M3
4910FM4j83J54M7o7q5K90l17J52k04lK24q0o5J46k43K03J4j48J26l5J88j94O0
4934C0p2J91k22P8Q2j36L3J8j17J00q4o9L94k03j93K3K34n8N3N4q0N6j63J63p8
4959C4M0J00k47K54l4r5j6J1J9j4K39k47l3k8jN8M6q0jMj00%J12r7J51k6j10o7
$$ plain form
4786 84 11 -78 28 -158 28 22 -102 46 180 -79 -1 -145 33 -106 -122 -116 56 -35 25 -88 58 20 -106 24
4810 24 -43 127 -10 -21 -3 118 16 -94 -86 98 -49 79 -187 -117 -110 226 1 -17 40 -67 -121 -101 150 -56
4834 -56 -49 44 -211 -37 -25 -2 -260 108 177 -77 140 -163 72 -85 79 143 52 26 -19 -151 6 79 75 82 128 -65
4860 -65 79 71 42 -64 53 -69 -106 97 -132 -5 181 -187 157 70 118 8 -27 74 -30 98 114 -56 -65 -9
4884 -9 54 -25 47 79 -169 -185 211 122 45 65 25 -42 -81 134 -38 -171 79 -48 -30 126 -90 28 1 -5 -37 6
4910 6 50 -133 21 68 1 -84 206 -111 41 -163 -166 58 -22 -87 59 -184 19 33 -115 11 -24 164 -30 30
4934 30 -42 149 -73 5 87 -49 -16 2 -115 -15 -99 -168 226 23 -170 -147 87 29 82 136 56 112 -51 112 34
4959 34 74 174 -73 181 147 52 36 47 66 52 291 44 11 -17 -18 40 86 6 5 9 -91 -91 21 -76 75 49 -61 -128
4987a28K14o6j8m6L0N9j69J64n9N2J38j39o5K52k10k7l0R0J74j01K8j86%M7P1
5012G5nR2j88J11j33O8p0J3q3J24j4J17k77RK04p7j4J79r6j73K44j86jJ8M2J88
5038A67k80J79p0k9J7O9j08r7K01n4pq6R7j31J47j79l5J24O2Q3j06J14j54R0r7
5063h3K1pP2Kl0J23p4J20j43J49k87K12k19J81j51J92j60K8k5J16M3q0P0k86L06
5088I0o4J99o4j79K1L4K3r8Jj3l5k1K17o6j18k2P1J26l2J39j89j7m4M1P6K8k4
5115H0n3l0L3k0Q6r3q3J57j33k9j2J55oj56K23n4j37P9J71O5j13l5j05J11r5P
5141A3n6R6j15K82p0k50KQ0rM3Q9R4p9j53K81k25n1K9R3J5k74K10j02M4K16j66
5167C7o3rJ00r8J53n2p8J38j89M3P0o7K02J4m16L28n1p7R5q1j07J33q9O2j12K1
$$ plain form
4987 -128 86 20 2 -44 -14 45 -124 40 -19 33 171 32 -33 219 9 -18 -48 42 216 115 143 -43 -43 4 75
5012 75 70 162 -26 85 -48 20 -50 -37 -120 4 -10 107 -170 -161 43 -34 -48 131 35 -138 106 -80 -81 -63 -21 167
5038 167 -113 66 -4 -33 -16 53 -55 -152 49 -5 -12 -98 -1 -132 15 -164 -199 -75 -13 70 -36 78 -76 14 -83
5063 -83 -62 -69 3 5 -25 98 24 144 1 150 -137 75 -144 37 -114 78 -82 -54 -79 37 80 0 70 -216 90
5088 90 26 225 161 -18 3 37 60 -38 -37 -50 -85 -106 111 45 -73 -95 -24 102 70 209 20 3 -41 0 76 104 80
5115 80 27 -3 30 10 96 3 -80 77 -56 -85 -97 58 52 -104 119 65 -72 7 178 243 130 95 -10 101 6 13
5141 13 -43 53 -62 220 150 -100 -98 -18 -27 16 105 199 120 -33 248 23 -28 1 94 109 -165 45 -57 -13 203 37
5167 37 -26 -35 65 -33 120 68 -10 128 -61 -18 52 -15 187 201 -215 113 62 -15 80 -1 -108 25 -64 -2 -114 -93
5193i3J56j35m9J40m1R2o7j31K15k19K7k1J74j55o2P7lJJ76n1j0K6j46Q0M1Q3
5219A05p0j5J9l1M2q3J97k03J66j83rJ2R9K00k25J37j31k3P5j01j7RN6q3p9m7
5245a83J86M3j06N8K0m0o7nJ18N1q6P3J2j75K7J10Rj17Q5o5P1%m5J35m6k16n5
5272b08J69K0j8NJ58K3j69p5J50j15n3NJ79j18K14n4k49O1J7J13J15k56J11j78
5296a53Q0O3r2K23o6n0m2O6N3j95J49k7kl4r5J08j12L7O1R7L1j27J94j96Q3q8
5322c4j37J75k07J22K6J0j44O1L68j17k02J47o0l4l3K2n4PQK8J10j50L3J26K1
5347I2J62k37l5p4m9Q2M2j05J98j18K3j50K16K6j61J47j35o9M2O3r4J43r2oJ81
5372I2o7K6j9Qj53J57j25l7k6J04K36k38j1L1N2m5J33k9j73R0l8K4R6jk32Q7j
$$ plain form
5193 -93 63 -72 -121 19 -22 70 3 -128 87 -132 -105 -126 48 -107 -169 -92 -95 -94 82 31 21 47 -99 -19 22 105
5219 105 35 20 39 8 50 -33 164 -39 127 -56 -65 -53 46 246 21 158 27 4 79 -22 -39 -30 26 -57 -136 -183
5245 -183 3 46 -60 -2 18 -22 -89 -94 24 75 -11 62 74 -101 -74 36 45 -72 13 -52 19 19 -26 109 63 -153 -208
5272 -208 -39 -19 -37 -32 126 149 -20 -95 55 -60 -113 -108 71 -47 167 113 -136 -75 -58 55 170 -86 25 -153
5296 -153 -73 -10 -102 121 55 5 -37 29 82 -113 36 9 7 -27 -122 -14 -126 -89 -28 69 100 -27 167 -29 54 -34
5322 -34 -171 4 -203 -81 -55 -45 -189 -128 240 123 -79 68 8 -26 -59 -37 -91 -84 -76 -48 62 -88 -55 71 92
5347 92 254 17 -18 -92 -141 -59 -17 -122 76 -42 -19 -169 47 73 -88 59 -76 -145 -103 -40 -134 9 -83 -89 92
5372 92 25 51 32 40 -113 44 -81 -118 -144 -40 196 -42 -53 -22 30 -15 118 89 -84 6 -32 -8 88 87 -145 -58 -59
5399e9K0O8k5K50j43k56L04Lj92RQ1M6L7o3j82N0j38K79m6nK0Q2p0l3J12r0j85
5426a26P0N7M5j01J75k1l5q2j0M1J7M3n2k19L71p4o8J06k38J53o9j01J97J10j69
5451B0n3J82k45J42j44L0Q4M3j57J75Oj24O6k4m5j06L9J27j20J36m4J32q5J22
5475A57j04j2r2m7j98M63j69j65J73o7J55Qq2Q1j63m2L72k89p6K07j7j20K5K8
5499B6m0p1j7l1l2K05o6K31j37o7%n8%J4Qo7K50j32j60J46n4Q7k77L48o2L1j83
5526a08J77q6J29j20k62L25P4q7O1J4j85J67k28J48J09k14J26M6m2l3Q5n5j20
5549g9P7k8J92o7j68J60J6Q0k5j80KJ35j22R7k38J37N3o7NJ68k02K8J82j62qj6
5575c0J9p7K45j99J06L0L7j23K8J0r8KL0q6R7J06j89k6O5p5K35j05PJ07Qp0J23
$$ plain form
5399 -59 -39 29 4 254 111 -145 159 162 -30 -21 60 106 143 80 -102 -52 -190 89 43 38 58 140 70 37 149 59 -126
5426 -126 -56 1 46 -55 120 99 64 -18 -28 13 30 73 21 -198 173 99 31 137 -101 52 -17 -118 79 189 20
5451 20 -33 149 -96 46 -98 -68 16 59 -98 77 83 -41 25 1 -44 -150 -111 16 -104 32 -12 120 35 157
5475 157 53 41 -51 -98 -296 167 -2 -167 6 -61 94 102 20 101 -62 -104 268 -21 -97 110 93 -27 -2 26
5499 26 -14 -85 -102 -133 -165 40 -26 205 68 1 1 -57 -57 -43 -35 -102 148 16 -144 2 -52 35 -242 106 44 75 -108
5526 -108 69 -17 112 -8 -270 55 129 42 103 117 -68 99 -129 19 128 -86 40 86 44 11 96 41 -79
5549 -79 -2 -30 162 95 -73 87 103 183 158 -22 -20 115 -7 90 -148 -11 42 -25 -20 148 -54 -26 156 -6 -14 -30
5575 -30 -11 -88 157 -42 64 94 131 8 36 46 -52 -50 -20 -106 -9 97 -92 -118 -53 -128 107 2 9 116 124 54 177
5602A77j16q5PmQ9L1k7l0Nr8J55o9j94K40n8j19J93k25J04J30O7l55J49J29l2
5627F4r1N9K4o9J01j82Q0p6j0K28k4l5k9%K5N0l29J09M1p8K60k31K91k15M5j43
5653a35O2J06J01k53K44o8j60K82j45J9jp1p9n0J98q0L2o8K0J70j62m2J22O7j92
$$ plain form
5602 177 61 -24 -17 -21 68 99 72 42 47 -51 104 35 -159 81 23 -96 97 -128 -24 106 173 -182 -33 96 64
5627 64 -27 32 56 -13 88 -94 -14 -90 -100 128 104 69 40 40 65 115 -214 -105 -64 -142 118 -113 178 -37 8 -135
5653 -135 -73 33 134 -119 125 57 -103 179 34 53 52 -19 -98 -148 50 -30 2 -66 -46 124 -38 -80 42 109 -83
$$ [...]
8191i9
##END NTUPLES=NMR FID
##END=
