##TITLE=1H_4ABDE0906
 CDCl3, 8 sc, 
 10.06.2021
##JCAMPDX= 6.0         $$ Bruker NMR JCAMP-DX V2.0
##DATA TYPE= NMR FID
##DATA CLASS= NTUPLES
##ORIGIN= UXNMR, Bruker Analytische Messtechnik GmbH
##OWNER= root
$$ XWIN-NMR		Version 3.5
$$ Thu Jun 10 09:50:58 2021 Russian Standard Time (UT+4h)  she@DPX200
##.OBSERVE FREQUENCY= 200.131506
##.OBSERVE NUCLEUS= ^1H
##.DELAY= (6, 6)
##.ACQUISITION MODE= SIMULTANEOUS
##.ACQUISITION SCHEME= undefined
##.AVERAGES= 8
##.DIGITISER RES= 18
##SPECTROMETER/DATA SYSTEM= spect
##.PULSE SEQUENCE= zg30
##.SOLVENT NAME= CDCl3
##.SHIFT REFERENCE= (INTERNAL, CDCl3, 0, 15.7039)
##AUDIT TRAIL= $$ (NUMBER, WHEN, WHO, WHERE, WHAT)
$$ ##TITLE= Audit trail, XWIN-NMR		Version 3.5
$$ ##JCAMPDX= 5.01
$$ ##ORIGIN= Bruker BioSpin GmbH
$$ ##OWNER= she
$$ F:/spectra/data/she/nmr/H-F/1/audita.txt
$$ ##AUDIT TRAIL=  $$ (NUMBER, WHEN, WHO, WHERE, WHAT)
(   1,<2021-06-10 09:49:09.73 +0400>,<she>,<DPX200>,
      <created by zg, POWCHK disabled, PULCHK disabled
       configuration hash MD5:
       00 E9 B6 7A A2 85 ED C7 34 08 36 98 17 FE 4E 26
       data hash MD5: 16K
       63 84 0D E0 7C 82 D7 76 BC 11 62 3D 1C 56 4A D2>)
$$ ##END=
$$ 
$$ hash MD5
$$ B9 60 F1 D4 2D C2 E6 F3 86 C3 10 C7 6A FC 85 17
##$RELAX= 
##$RELAX= 
##$RELAX= 
##$RELAX= 
##$RELAX= 
##$RELAX= 
$$ Bruker specific parameters
$$ --------------------------
##$DU= <F:/spectra>
##$EXPNO= 1
##$NAME= <H-F>
##$PROCNO= 1
##$TYPE= <nmr>
##$USER= <she>
##$AMP= (0..31)
100 100 100 100 100 100 100 100 100 100 100 100 100 100 100 100 100 100 
100 100 100 100 100 100 100 100 100 100 100 100 100 100 
##$AQSEQ= 0
##$AQ_mod= 1
##$AUNM= <au_zg>
##$AUTOPOS= <>
##$BF1= 200.13
##$BF2= 200.13
##$BF3= 200.13
##$BF4= 200.13
##$BF5= 200.13
##$BF6= 200.13
##$BF7= 200.13
##$BF8= 200.13
##$BYTORDA= 1
##$CFDGTYP= 0
##$CFRGTYP= 5
##$CHEMSTR= <none>
##$CNST= (0..31)
1 1 145 1 1 1 1 1 1 1 1 1 1 1 1 1 1 1 1 1 1 1 1 1 1 1 1 1 1 1 1 1 
##$CPDPRG= <>
##$CPDPRG1= <>
##$CPDPRG2= <>
##$CPDPRG3= <>
##$CPDPRG4= <mlev>
##$CPDPRG5= <mlev>
##$CPDPRG6= <mlev>
##$CPDPRG7= <mlev>
##$CPDPRG8= <mlev>
##$CPDPRGB= <>
##$CPDPRGT= <>
##$D= (0..31)
0 1.2 0 0 0 0 0 0 0 0.06 0 0.03 0 0 0 0 0.0002 0 0 0 0 0 0 0 0 0 0 0 0 
0 0 0 
##$DATE= 1623304149
##$DBL= (0..7)
120 120 120 120 120 120 120 120 
##$DBP= (0..7)
150 150 150 150 150 150 150 150 
##$DBP07= 0
##$DBPNAM0= <>
##$DBPNAM1= <>
##$DBPNAM2= <>
##$DBPNAM3= <>
##$DBPNAM4= <>
##$DBPNAM5= <>
##$DBPNAM6= <>
##$DBPNAM7= <>
##$DBPOAL= (0..7)
0.5 0.5 0.5 0.5 0.5 0.5 0.5 0.5 
##$DBPOFFS= (0..7)
0 0 0 0 0 0 0 0 
##$DE= 6
##$DECBNUC= <off>
##$DECIM= 32
##$DECNUC= <off>
##$DECSTAT= 4
##$DIGMOD= 1
##$DIGTYP= 9
##$DL= (0..7)
0 120 120 120 120 120 120 120 
##$DP= (0..7)
150 150 150 150 150 150 150 150 
##$DP07= 0
##$DPNAME0= <>
##$DPNAME1= <>
##$DPNAME2= <>
##$DPNAME3= <>
##$DPNAME4= <>
##$DPNAME5= <>
##$DPNAME6= <>
##$DPNAME7= <>
##$DPOAL= (0..7)
0.5 0.5 0.5 0.5 0.5 0.5 0.5 0.5 
##$DPOFFS= (0..7)
0 0 0 0 0 0 0 0 
##$DQDMODE= 0
##$DR= 18
##$DS= 0
##$DSLIST= <SSSSSSSSSSSSSSS>
$$ [...]
##$SUBNAM2= <"">
##$SUBNAM3= <"">
##$SUBNAM4= <"">
##$SUBNAM5= <"">
##$SUBNAM6= <"">
##$SUBNAM7= <"">
##$SUBNAM8= <"">
##$SUBNAM9= <"">
##$SW= 20.0188882624521
##$SWIBOX= (0..15)
0 0 2 0 0 0 0 0 0 0 0 0 0 0 0 0 
##$SW_h= 4006.41025641026
##$TD= 16384
##$TD0= 1
##$TE= 0
##$TE2= 300
##$TE3= 300
##$TEG= 300
##$TL= (0..7)
0 120 120 120 120 120 120 120 
##$TP= (0..7)
150 150 150 150 150 150 150 150 
##$TP07= 0
##$TPNAME0= <>
##$TPNAME1= <>
##$TPNAME2= <>
##$TPNAME3= <>
##$TPNAME4= <>
##$TPNAME5= <>
##$TPNAME6= <>
##$TPNAME7= <>
##$TPOAL= (0..7)
0.5 0.5 0.5 0.5 0.5 0.5 0.5 0.5 
##$TPOFFS= (0..7)
0 0 0 0 0 0 0 0 
##$TUNHIN= 0
##$TUNHOUT= 0
##$TUNXOUT= 0
##$USERA1= <user>
##$USERA2= <user>
##$USERA3= <user>
##$USERA4= <user>
##$USERA5= <user>
##$V9= 5
##$VALIST= <valist>
##$VCLIST= <CCCCCCCCCCCCCCC>
##$VD= 0
##$VDLIST= <DDDDDDDDDDDDDDD>
##$VPLIST= <PPPPPPPPPPPPPPP>
##$VTLIST= <TTTTTTTTTTTTTTT>
##$WBST= 1024
##$WBSW= 4
##$XGAIN= (0..3)
0 0 0 0 
##$XL= 0
##$YL= 0
##$YMAX_a= 239534
##$YMIN_a= -246607
##$ZGOPTNS= <>
##$ZL1= 120
##$ZL2= 120
##$ZL3= 120
##$ZL4= 120
##$ABSF1= 10
##$ABSF2= 0
##$ABSG= 5
##$ABSL= 3
##$ALPHA= 0
##$AQORDER= 0
##$ASSFAC= 0
##$ASSFACI= 0
##$ASSFACX= 0
##$ASSWID= 0
##$AUNMP= <proc_1d>
##$AZFE= 0.1
##$AZFW= 0.1
##$BCFW= 1
##$BC_mod= 2
##$BYTORDP= 1
##$COROFFS= 0
##$CY= 11.3945322036743
##$DATMOD= 1
##$DC= 2
##$DFILT= <>
##$DTYPP= 0
##$F1P= 15.9154993809931
##$F2P= -4.1035820241983
##$FCOR= 0.5
##$FTSIZE= 0
##$FT_mod= 4
##$GAMMA= 1
##$GB= 0.15
##$INTBC= 1
##$INTSCL= 1
##$ISEN= 128
##$LB= 0.24
##$LEV0= 0
##$LPBIN= 0
##$MAXI= 10000
##$MC2= 0
##$MEAN= 0
##$ME_mod= 0
##$MI= 1.114404
##$NCOEF= 0
##$NC_proc= 0
##$NLEV= 6
##$NOISF1= 3.799351
##$NOISF2= 2.8
##$NSP= 1
##$NTH_PI= 0
##$NZP= 0
##$OFFSET= 15.70392
##$PC= 1
##$PHC0= -11636.8
##$PHC1= 6.001015
##$PH_mod= 1
##$PKNL= yes
##$PPARMOD= 0
##$PSCAL= 0
##$PSIGN= 0
##$REVERSE= no
##$SF= 200.130013532006
##$SI= 16384
##$SIGF1= 3
##$SIGF2= 2
##$SINO= 400
##$SIOLD= 16384
##$SREGLST= <1H.CDCl3>
##$SSB= 0
##$STSI= 0
##$STSR= 0
##$SW_p= 3612.71676300578
##$SYMM= 0
##$S_DEV= 0
##$TDeff= 0
##$TDoff= 0
##$TI= <>
##$TILT= no
##$TM1= 0
##$TM2= 0
##$TOPLEV= 0
##$USERP1= <user>
##$USERP2= <user>
##$USERP3= <user>
##$USERP4= <user>
##$USERP5= <user>
##$WDW= 1
##$XDIM= 8192
##$YMAX_p= 0
##$YMIN_p= 0
$$ End of Bruker specific parameters
$$ ---------------------------------
##NTUPLES= NMR FID
##VAR_NAME=  TIME,          FID/REAL,        FID/IMAG
##SYMBOL=    X,             R,               I
##VAR_TYPE=  INDEPENDENT,   DEPENDENT,       DEPENDENT
##VAR_FORM=  AFFN,          ASDF,            ASDF
##VAR_DIM=   8192,          8192,            8192
##UNITS=     SECONDS,       ARBITRARY UNITS, ARBITRARY UNITS
##FACTOR=    0.0002496,     1,               1
##FIRST=     0,             0,               0
##LAST=      2.0444736,     0,               0
##MIN=       0,             -246607,         0
##MAX=       2.0444736,     239534,          0
$$ Real data points
##PAGE= N=1
##DATA TABLE= (X++(R..R)), XYDATA
0@%%%%%%%%%%%%%%Pj5J6j6J6k0K8l2M0m8N2o0P2q4R2j04J20j36J56j80K01k24
36a19K51k80L12l48L88m32M80n29N84o44P09p81Q60r47J043j150J270j402J550
55H15j719J911k134K398k712L092l564M168m972O094p764J0494j5658K8490j11533
70i2594j47097L73560p7019j91979K78338m3345l46471K35536K02729k90606N0448
81d8500K13034k83283l5196L60078j37575k48310K32794k222k18463K39358J22869
92A94584l23965K7595K12770j79293r28K60212j78493k05396K40404L6241j83807
103a00076J51735N5648k48092P7906K05569j57993n1437J58385j26791r5769K29150
114I8235P641j95685P6709N7481j34057Q7555J36084j52689o5674J25287m7022
$$ y = [0, 0, 0, 0, 0, 0, 0, 0, 0, 0, 0, 0, 0, 0, 0, 7, -8, 8, -8, 8, -12, 16, -16, 24, -24, 28, -32, 40, -44, 48, -56, 64, -72, 84, -96, 105, -119, 132, -148, 164, -184, 204, -228, 252, -277, 307, -337, 372, -409, 451, -496, 547, -603, 667, -735, 815, -904, 1007, -1127, 1271, -1441, 1651, -1913, 2255, -2717, 3377, -4387, 6107, -9551, 18939, -92594, -239691, 133869, 56850, -135129, 143209, 99864, -246607, -11071, 191658, -98948, -48500, 164534, -118749, -153945, 206133, 68558, -179752, 53042, 50820, -167643, 71715, 194584, -129381, -101786, 110984, -68309, -69237, 190975, 12482, -192914, 47490, 83731, -100076, 51659, 107307, -140785, -62879, 142690, -15303, -66740, 91645, -35146, -130915, 98235, 105876, -89809, -13100, 44381, -89676, -2121, 133963, -18726, -84400, 40887, -6135]
125f135m9187J34955k6354j45997P2637Q2151p9865J4594N6111r2536k2275J11775
137D9874p310o5638L5032j0203o1143N9973O7975n9901m0007L2047j0732j0573
149b0606N0584L892n9157p26L8871r514n736K6543k5524m3782M2150M5447m0398
162B044j8832K8181k9341j6760O7690L957o7156J8448K7393m7774K5757O2522
174E6129o5265m2347P5943q775n5279O3713J0436r0079L9891O9831p2709p619
186b6130P3782o5755m2892J08844r782r3680O6130K9376r8528M7076Q3665r6343
198b4237k0976R8220n7672n3461J09951j7900j06466Q2828M8450j08252L6021
209a3494Q2181j02913j7951J15877n4155o7424J02292j4716j02594Q6999N1352
$$ y = [-6135, -55322, 79633, 53279, -92718, -20081, 62070, -17795, -3201, 52910, -39626, -61901, 49874, 42564, -23074, 11958, 1755, -59388, 585, 68560, 8659, -31348, 699, -10033, -20606, 29978, 33870, -25287, -26013, 12858, 3344, -2392, 24151, -1373, -45155, -3005, 42442, 2044, -16788, 11393, -17948, -34708, 32982, 36939, -30217, -11769, 15624, -32150, -6393, 56129, -9136, -51483, 24460, 15685, -39594, 24119, 34555, -55524, -15633, 54198, -18511, -26130, 47652, -18103, -60995, 47849, 38067, -55613, 10517, 39893, -58635, -11559, 72106, -24237, -45213, 53007, -4665, -58126, 51825, 33925, -72541, 10287, 58737, -49515, -13494, 68687, -34226, -52177, 63700, 9545, -57879, 44413, 29697, -72897, 14102, 65454]
220F5454j14477K8166Q6882r4381j9660J12067n4643p3242J00921k170r7455P6026
232A3488M6817j12005K5461R1607q4914k6587J03120m8762p2161R6121O271r4713
244e6257O2126M7761r9462J9978Q7084p6500l2919R5203l5122o8897Q2927J1485
256C7407q8874M8377N2125q3320P981P7949o2005l6520Q4517k0286o6988O5108
268A5471K0309p7619L2272N3904o6889o210O9496m2221m0416O9277n575o3496
280d1697M7186L0297o6002J4392N4704m9968j9528O2100k2654m5653N3452R289
292B5918n9692L0458L9731n5343k484N5674l4796l2042N5925n162n1210M0105
304G082K3711n6949J4263M7689m5943j6818N7757k1178m3912M9410R839n5734
$$ y = [65454, -49023, -20857, 66025, -28356, -48016, 64051, 9408, -63834, 37087, 34917, -62538, 13488, 60305, -51700, -26239, 65368, -19546, -46133, 56987, 8225, -63936, 32185, 38456, -56257, 5869, 53630, -45832, -25854, 61230, -15270, -48189, 47014, 11892, -57005, 25922, 37407, -51467, -3090, 49035, -34285, -26304, 51645, -10360, -46880, 37637, 17351, -49637, 15471, 35780, -41839, -9567, 44337, -22552, -28762, 40734, -1487, -41903, 27374, 21799, -41697, 5489, 35786, -30216, -15824, 38880, -11088, -30616, 31484, 8830, -36823, 16629, 25918, -33774, -3316, 36415, -18928, -21412, 34262, -534, -32576, 23349, 18187, -33023, 7082, 30793, -26156, -11893, 35796, -10147, -26965, 30792, 9614, -34298, 15112, 24951, -30783]
316c0783K8639L6803n3537n50N3675l6939k9616N7416q283n1464M3024K2116n8628
329b8127J6616M6571m8025j2621N7359k7054l9623N3290K590n5578L5536L2479
341C3413n6730N876N1555m2026k3188N7626j5858m5531M7792J2285n7181K5840
353f127L9251n2344k941N5109l3971l1930N4582o668m9782M1524K1965n5768J6589
366a0511M4012m7513j2280N5995k5021l7931N1425K819n3445L2855L0141n2930
378b2384P425M8660m0374k1495N4443j6105m3599M6184J3028n3984K3964L6760
390C2523m9429l309N1290l1250k8593N1558o650m7911L8269K1405n2447J5193
402i351M2622m3590j3072N1160k2868l5352M7428L424m9294L0476K8174n0404
$$ y = [-30783, -2144, 34659, -18878, -19428, 34247, -2692, -32308, 25108, 16825, -34639, 8385, 30501, -28127, -11511, 35060, -12965, -25586, 31773, 4719, -34904, 18386, 20976, -34602, 934, 33413, -23317, -17441, 34114, -7912, -31100, 26526, 10668, -34863, 12929, 25214, -31967, -6127, 33124, -19220, -22161, 32948, -1023, -32953, 21629, 14961, -34821, 6703, 28668, -27100, -10511, 33501, -14012, -26292, 29703, 4682, -33249, 18176, 20995, -32450, 405, 30546, -22384, -14959, 33701, -6673, -28168, 26275, 10170, -33429, 12755, 25783, -28201, -4237, 32523, -16906, -20215, 31075, -175, -28768, 22790, 16140, -31771, 6498, 27903, -24544, -9351, 33271, -10319, -23391, 27769, 4901, -30451, 16977, 20401, -28893, 1583, 29757, -20647]
414b0647N554M5934l6854j9965N1162j4836m1272M1653J1204m9339K3963L4211
426C0768m7396k422M7731l1116k6027M9498p750m4037L7516J7858m9341J6275
438h443L7105m2643p432M8810k5101l1194M4942j686m3748L2916K2570m6864Q959
451a1809L8028l5996j1929M5630j8644l2796L9459M807m1014K4585K3512m1256
463a7423L787L8298k7536j6803L7694j1939l0694L3437J0454l7182J4321K3562
475A9976l2096q19L4659j9838k0786L0358k082k7005K2882J2569l2208O110K6226
488A7946k0968q251K6625j1975k2144K4885Q611k5375R045J5485k3598j113K7433
501A6606j1976j8557J9883J347k1289J6011J5295k6136l133K4119j1769j1782
$$ y = [-20647, -15093, 30841, -6013, -25978, 25184, 10348, -30924, 10729, 21933, -27406, -3443, 30768, -16628, -19050, 28681, -2435, -28462, 21036, 13286, -30751, 6765, 24623, -24718, -8443, 28662, -13981, -21413, 27397, 2296, -28898, 16044, 14358, -29390, 3526, 26096, -20768, -11809, 26219, -9777, -21706, 23924, 5280, -27516, 11943, 16750, -24264, 321, 23833, -17423, -13636, 24662, -2874, -19677, 18017, 6078, -24616, 8821, 19275, -17907, -3586, 19976, -12120, -12939, 21720, 1882, -18904, 11454, 9372, -17633, 5249, 17818, -14390, -8280, 17946, -3022, -11273, 15352, 3377, -18767, 6118, 14729, -10646, -1601, 13884, -9714, -10827, 16606, 4630, -13927, 5956, 7303, -13986, 2025, 17320, -8816, -11949, 12170, 401, -11381]
513a1381K3631m931k6664J8282J7158k4130K417K0904k3028j0485L3330n005k7057
526a6959K0527O974k9523J6595K5780l2012q617L2277j5752j7587L5439m910l8619
539b6387K4900K1215l4003R591K8731l7001j0727M5446j3685k9586L4692j809
551A1377m0993L2107K7068m5465K933L5921l4275r101N0049k1017l9502M0692
563I794O456m1242L2004K3203n3943O027M6207l3203j3508M6010k5291l6973M9261
576A4802Q481m6688K6383K0818m9253J3424M6829l8761j8897M3672j9777k8402
588b7369M7949J093m9552K5325K4142l9783J3137L5692m1019j4870M4834j3588
600E991k5396L5826m800m0242K8833K3464l6078N846K5421l1889m823L9845j5243
$$ y = [-11381, 12250, 7319, -19345, -1063, 16095, -8035, -5618, 15286, -7742, -18227, 15103, 10098, -16959, 3568, 10542, -18981, -2386, 23394, -8618, -17235, 15042, -710, -18297, 17142, 12232, -26387, -1487, 19728, -14275, -4684, 24047, -12954, -23681, 21765, 8080, -21506, 13186, 11377, -29616, 2491, 29559, -15906, -12973, 22948, -11327, -20428, 29621, 8604, -30898, 9794, 16250, -24992, 7012, 30215, -23728, -17701, 28506, -4697, -18205, 27805, 2514, -34459, 14802, 23283, -23405, 2978, 23796, -25457, -12033, 34796, -3965, -22862, 20810, 1033, -27369, 20580, 21673, -27879, -2554, 21588, -18195, -5058, 30634, -10385, -25255, 19579, 5991, -19405, 16421, 11621, -28621, 212, 23676, -12402, -6556, 18865, -13024, -17847, 21998, 6755]
613F755k5761K6278j484k5353K5541J3706l3267L319K2402j8683j495K5036j6425
626E69j8900K2528L464j6363J3051M475k1636N810J8331j0770n421J0430q347
639b779p042J5043K920j1955J296L610n021L504P467n172p196K829M045k10M02
654A741J160m072m535N863O516n814l351M911m454k824J1777m90j3212N197P088
669E501j0257M177J1995j4415p226J7564l649j1834J5281j21k0544J2591J4458
682A3521j9757J022J7969j8129p530K6690p841k0996K0889L094k4806J7193J6271
695A7590k8966J497K5697k0397r307L0228j2214k4797K7952N348k9834J8075J6849
708A7721l2773M475L0499k4047j2126L2324j2986k4731L1461M617l3809J8504
$$ y = [6755, -19006, 7272, 5788, -19565, 5976, 19682, -13585, -10266, 12136, -6547, -8042, 16994, 569, -18331, 4197, 7661, -8702, 4349, 8824, -12812, -7002, 11329, 559, -4862, 5568, -2779, -9821, 5222, 8142, -3813, -2517, 1093, -3928, -424, 7043, 1871, -5325, -2496, 1549, 1339, 1741, 2901, -1171, -5706, 157, 6673, 859, -2492, 2419, -2035, -4859, 6918, 6428, -6784, -1587, 5501, -4756, -579, 11416, -2999, -10225, 7339, 3690, -8144, 7137, 7016, -13528, -937, 13521, -6236, -5214, 12755, -5374, -12904, 13786, 5945, -15051, 5838, 8932, -15874, 1319, 17590, -11376, -9879, 15818, -4579, -13886, 16342, 4128, -20669, 7283, 12631, -17203, 872, 17721, -15052, -10577, 19922, -4125, -16251, 16073, 3087, -21644, 9817, 14434, -19375, -871]
720h71J8875l2714N329L0969k6553j3190L4305j1634k4874L0878L545l4473J9519
733h89K0394l2741M162K9903k6225j2272L4795j1177k5750K9148M117l2653J9313
746A25J9746l2328K956K9034k3624j1755L2501j0890k4872K7483N055l0239J6854
759D6J8129k9684K191K7572k0866j2043K8754q719k2519K4111N684k7259J3199
772a404J7114k5002N26K4271j7036j2147K4500n155k0246J8940O895k3228Q844
785c128J6447j9751k390K0609j1811j2287J9775j237j8279J3350Q487j8757M349
798d623J5660j4719n504J7770o379j3067J5137K696j6542Q408J0563j5142m37
811f179J5104r528q520J5120j564j3870J0706O617j4844L449J2556j1608m782
$$ y = [-871, 18004, -14710, -9381, 21588, -4965, -18155, 16150, 4516, -20358, 10520, 14065, -20408, -889, 19505, -13236, -9074, 20829, -5396, -17668, 17127, 5950, -19800, 9348, 13465, -19188, 125, 19871, -12457, -9501, 19533, -4091, -15846, 16655, 5765, -19107, 8376, 13431, -16808, 46, 18175, -11509, -9318, 18254, -2612, -14655, 14099, 5380, -17139, 6972, 12656, -14603, -1404, 15710, -9292, -8766, 15505, -1531, -13678, 10822, 5667, -14579, 4361, 11256, -11972, -3128, 13319, -6432, -8822, 11787, -24, -12311, 7464, 6227, -12052, 1298, 9785, -8972, -4623, 11037, -3682, -9186, 8584, 2205, -10862, 4275, 6971, -9571, -1163, 9400, -5742, -6179, 8925, -603, -9123, 5997, 4433, -9437, 1269, 7886, -6958, -3509, 9047, -2561, -7343]
824g343J4758n042j1198J2562K970j4617O814J0154j3450j075J4254q518q564
837h295J4421r64j3701J0106O843j4885L285J2785j1962m700J5103n551j1384
850h899J3281K426j5027P812R774j4591J93J4387j0167p481J5275k985j3296J1993
864B695N067j5582N611J1736j3753k489J5349q225r691J4916o42j4430J0436P268
878H266j5507L366J3131j2399m612J5544o122j1278J3776J677j4908Q576Q986
891H496j4600R69J3841j0492o519J4784l525j2303J2047L987j4571O082J0358
904H554j3058j366J3865q028q308J3691j047j2724R784O060j3764L483J1319j1117
918b656l612J3415n459r574J2132J322j2925P487P661j2508Q86J1821q904n552
$$ y = [-7343, 7415, 2373, -8825, 3737, 6707, -7910, -1096, 9058, -4392, -5467, 8787, 269, -8295, 6126, 5162, -8539, 1567, 8410, -6475, -3190, 9595, -2367, -7067, 8036, 2485, -8899, 4382, 6808, -8219, -407, 9367, -5224, -5031, 9356, -811, -8292, 6983, 3998, -9298, 2695, 7762, -7820, -2209, 9527, -4226, -6715, 8634, 409, -9282, 5634, 4992, -9438, 998, 8266, -7241, -3875, 9256, -3143, -7755, 7789, 1667, -9611, 4165, 5842, -9066, -490, 8496, -6104, -5135, 8706, -1786, -8305, 6479, 2954, -9349, 2698, 6685, -7886, -1804, 8554, -4504, -5870, 7995, -33, -8341, 5350, 4303, -8421, 1363, 7423, -6341, -2858, 8461, -2656, -6268, 7147, 1688, -7886, 4246, 5568, -7357, 130, 7791, -4717, -3831, 7990, -914, -6466]
932f466J2661l161j0493J0229L537j2496M996Q971j1107j338J1821o718p248J1515
946D703o02j1023Q083N402j1759K567R835r232l564J1415m284q379R841J700j0885
961f182N526P035j0308q9J0177o725n609J0394j518r278P646M035j0249K704Q354
976E913q240k780J0018l872p456Q877J502r774N048O327r234j73R443n934n615
991e950R660q52r075P141M508j0224K220Q794q038l302J0460l726q168R290K149
1006D887j0765N256P370j0452l83J1092o921o518J1407j353j0750Q924N100j2576
1020e682L391J0267j0639k853J3076o135r416J2515R09j3138Q469P454j4246K076
1034c952J3107j0955n401J4771n402j1687J3920K454j5525Q137R537j5273J285
$$ y = [-6466, 6195, 3034, -7459, 2770, 6307, -6189, -1193, 7778, -3329, -4667, 7154, 436, -6812, 4703, 4101, -6922, 1161, 6563, -5196, -2629, 7206, -2026, -5590, 5825, 1541, -6838, 3003, 4703, -6182, -656, 6379, -3929, -4018, 6159, -566, -6175, 4219, 2701, -6577, 1069, 5104, -5145, -2441, 5913, -2327, -5107, 4911, 1039, -6417, 2460, 3962, -5812, -764, 5563, -3671, -3844, 5599, -335, -5950, 3710, 2858, -6217, 924, 5432, -4792, -2572, 6222, -1816, -5118, 5342, 1616, -6552, 2738, 4887, -5878, -622, 6748, -3704, -4087, 7005, 84, -6434, 4973, 3620, -7130, 1794, 6894, -5682, -2291, 7976, -2663, -5516, 7560, 1425, -7991, 4524, 5433, -7705, 764, 8218, -6028, -3952, 9155, -1800, -7201, 7570, 2168, -9519, 4401, 6855, -8670, -533, 9004, -6269, -4984]
1047d984J5117j1882p232J6530m740j3022J4623L057j7387Q491J1248j6135Q20
1060e496J5931j2740p775J8137m488j4331J4872L103j7893R530J1836j7140L24
1073f130J6194j2661p099J8648n380j4814J4924L395j7004R861J0649j7656P95
1086f278J6254j1774o369J6893o242j3511J5158L218j5797Q662Q622j5936K423
1099d677J4873j1420o049J4425n760j0273J4092J628j4589P397P464j2583L248
1112b224J1183j1023m628J2414m169p329J0610p08j1468P373O070r391K069O833
1126E612q733j572R974l495n914O324q61o275O354L323p303N57M138l997M41N214
1142C787l428l820L386P54j651K234L9l672L73K693K06l95n61j158k33R73J783
$$ y = [-4984, 10133, -1749, -8981, 7549, 2809, -10213, 4410, 7467, -9920, -1429, 9819, -6316, -5496, 10435, -2305, -10080, 8057, 3569, -10762, 4110, 7213, -10680, -1150, 10686, -6454, -6130, 10064, -2597, -9696, 8952, 3572, -11242, 3682, 7077, -9927, -66, 10583, -7073, -6278, 9976, -1798, -8167, 8726, 2484, -11027, 4131, 7349, -8448, 214, 8836, -7100, -4677, 10196, -1224, -7273, 7152, 1392, -8881, 5211, 6839, -7750, -353, 7111, -5472, -2224, 8959, -2064, -6692, 5722, 1553, -5776, 4834, 4126, -7342, 31, 6101, -3290, -1221, 5612, -3121, -4693, 5281, 1786, -4128, 2196, 1335, -4940, 1414, 4737, -2566, -2009, 2129, -1868, -1427, 3787, 359, -3461, -75, 679, -972, 1262, 1301, -2371, -1998, 695, 901, 506, -55, -1213, -1446, -473, 1310]
1159A310J75k603j098K217J02k73K244k046l765L389K833l409J154J910n337N38
1175b659O904l111m051M848j990m725P347K413q698K031N389o674J420Q297p206
1190d65n551R508j542o547Q536O54j1526N660Q044r389N40Q766r500l697J3262
1205F753l368r481R130O32j1434Q776P731j3243O39J0446r335k509J3329o144
1219A922j0645J1765J608j1428Q735N403j4555K910J2248r805l224J2070p357
1232c53q791J4126N55j2796Q304M597j3025N042J1306j1655l427J2183o845o375
1246g154J3178k011j2491R171M901j1368N138Q233j2071j380J2302o468n779J0832
1260E033l036r884R735M153j1174M065O912j0095N92J0445o793n374R257k226
$$ y = [1310, 1485, -1118, -2216, 1, 103, -170, 2074, 28, -3737, -348, 2485, -924, 230, 2140, -3197, -2659, 4245, 1134, -2917, 1931, -59, -4784, 2563, 4976, -3722, -1691, 3698, -2976, -1556, 6741, -465, -6016, 3492, 1950, -4597, 3939, 4593, -6933, -1273, 6771, -2618, -2078, 6688, -2812, -6509, 6753, 3385, -6096, 3034, 3666, -7768, 1008, 8739, -4504, -3865, 6581, -2754, -5263, 8066, 1922, -8723, 3042, 4650, -6778, 1957, 7360, -7195, -4285, 7963, -1842, -5066, 7004, -353, -9144, 4982, 5537, -7259, 1045, 5642, -7383, -2341, 8965, -2690, -6117, 6066, -779, -7154, 6024, 4013, -8478, 693, 5594, -5774, -636, 7597, -4474, -5854, 6448, -20, -5799, 5033, 1997, -7887, 1848, 6001, -5173, -1108, 5804, -4291, -3699, 6746, -47, -5421, 3836, 1610]
1274A610p137Q307J990r651L709N825p219O27P495o305l752P913j545n333N609
1289B143O89o926L759M464n638M8M584l998j772N489j374m029L351P39l652K310
1305A87K281l503l53K836j526j030K538p91k205J644P78j381K26Q92j039l62J052
1322B44K27q41k09O80k78n69R75L21j524K62J497j219o20J922p94j882K203O51
1340A046k696J328J902k889j0L213k210j808L590p09l293L316J133m198J801L043
1356B559m027j56M355k900k507M957r67m214M031J357n196K277L687m876k20N193
1372C353l441k755N489j048m790M389J645n608K282M009n161l09N557l700k963
1387c051N605r38m963M606J640n739K217M194n201m27N357l349l101N422o73m969
$$ y = [1610, -5527, 2780, 4770, -4881, -1172, 4653, -2566, -1939, 5556, -749, -4501, 3412, 1867, -3466, 2143, 2832, -4094, -335, 4129, -1509, -1461, 3123, -875, -2647, 2842, 1468, -2561, 790, 1529, -2123, 187, 2468, -1035, -1388, 1448, -78, -1108, 1430, 639, -1566, 78, 856, -525, -299, 593, -446, -808, 244, 471, -370, -579, 101, -177, -746, 229, 550, -974, -712, 785, -434, -1054, 868, 74, -1808, 395, 1046, -1650, -322, 1580, -1309, -1319, 1894, -316, -2124, 1466, 757, -2536, 780, 1913, -2285, -484, 2559, -1468, -1624, 2731, -169, -2676, 2281, 1314, -2900, 1131, 2488, -2708, -431, 3256, -1620, -1840, 3353, -88, -2843, 2646, 1598, -3192, 1197, 2842, -2766, -484, 3525, -1636, -1945, 3612, -88, -3051, 2554, 1616, -3347, 1259, 2899, -2840, -623, 3571, -1630, -2057, 3300, -49, -3150, 2272, 1599, -3370]
1403c370M084J970n478J880M122m717q95N271k804l212N000l22m771L456K328
1418B542m993J190M101m031j384N002k025l446M268M58m541K672K701m474M34
1433a526M110l244j867M570j227l676L729J133m453J934L097l978k93M134k384
1448E9k524M166l39l901L125J787m257J153L414l446j072M206j819k908L827L62
1464A833m080K429K382m020M00L689k910j714M101j062l416L483Q83l980J730
1479b52K744l729p1L685k299k158L800o14l460K868J450l858J216K999l263p10
1495a652L640j841k522L590o8l279K284J780l602O13L206k979j025L425j251k585
1511b266K933O51l258J593K151l109Q0K840j953j524L192p10k635K439J060l015
$$ y = [-3370, 714, 2684, -2794, -914, 3208, -1509, -2404, 2867, 63, -3149, 1851, 1529, -3242, 214, 2542, -2451, -1261, 2840, -1191, -2575, 2427, 402, -3044, 1224, 1682, -2859, -187, 2514, -1960, -1526, 2584, -660, -2527, 2043, 816, -2860, 869, 2002, -2451, -517, 2580, -1398, -1691, 2443, 59, -2465, 1701, 1362, -2539, 586, 2373, -1884, -731, 2683, -763, -1835, 2371, 552, -2356, 1471, 1833, -2247, 182, 2564, -1456, -1056, 2633, -277, -1991, 2110, 1048, -2368, 1115, 1998, -1982, -252, 2492, -1237, -1308, 2377, 78, -2080, 1720, 1106, -2354, 514, 1964, -1894, -678, 2321, -942, -1652, 1988, 147, -2375, 1215, 1147, -2132, 152, 1932, -1670, -1057, 2149, -830, -1855, 1570, 319, -2266, 667, 1318, -1940, -347, 1804, -1305, -1225, 1615, -338, -1862, 1330, 620, -2015, 424, 1484, -1531]
1527a531Q83K294k385p39L003j223j950K557K66k780J546J793k679P9K555j700
1543a1j442K799m48k496K060J055k719P75K388k534n89K850j292j993K815J57
1559A375k976J799J606k697P3K838k264j388L276p98k634K506P43l198J650K305
1575B216l221l37L141k011j682L408n56l329K751J299l447J254K572l333n08L740
1591A957j876k182L318m66l130K795J402l711J146K544l130q1L577k196k235L243
1607I75k70k707K634J165l609R67K566k476l67K830k005j924L509k91k616K141
1623E22N90k822J404K329k450o34K294j521q03K667n76k402J622P07j799J293
1639D21J076k217k31J893p73m39J192p92j263J326Q81j100K48J09q64K57J165
$$ y = [-1531, -648, 1646, -739, -1478, 1525, 302, -1648, 909, 1175, -1605, -59, 1734, -945, -866, 1689, -11, -1453, 1346, 898, -1598, 462, 1517, -1202, -427, 1961, -573, -1162, 1688, 396, -1597, 1218, 1375, -1601, 198, 1804, -893, -820, 2018, -246, -1634, 1642, 844, -1790, 716, 1459, -1739, -89, 2216, -1005, -1342, 1799, -212, -1894, 1514, 958, -2371, 380, 1679, -1768, -514, 2058, -1275, -1783, 1957, 81, -2101, 1217, 751, -2379, 416, 1818, -1893, -747, 1797, -1333, -1414, 2163, -33, -2268, 975, 705, -2002, 632, 1797, -1812, -845, 1721, -755, -1122, 1708, -297, -2221, 1288, 997, -1619, 522, 1112, -1710, -306, 2023, -427, -1061, 1233, -288, -1091, 1576, 1000, -1402, 220, 927, -872, 421, 1497, -720, -951, 942, 169, -270, 922, 130, -1133, 193, 1074, -26, 222, 331, -533, -276, 889]
1656H89l74r15K13L7J89L82J37n75o70M46M94K08l20Q5o83k59R08O53j149j40
1676d44N03o93K86J550r70j677J418L16r77J143N60k494M28K334j501m40K087
1693A429j842j768K989L87k739J742P03k732J314L016k955j153K777j486j395
1708a713L736p39l798K317J744l242J792K563m136m27L944j842j789L677j236
1723H51l820L920J604m193J472K431m257O43M683l189k404M119j383l106M287
1738A658P83n049K171K916l956P20L993l771k274N017j179l406L896Om464K890
1754d9K972m300K56L395l431j086M973j922l416L627J90l896L051K184m789R80
1770a261L404l205k99L688k379k868M045J54l459K781Q55l786J337L191k822p69
$$ y = [889, 515, -400, -187, -150, 39, 421, 558, -17, -687, -241, 253, 461, 141, 226, -457, -716, 192, 845, -304, -444, 59, -634, -348, 1202, 232, -1445, -27, 289, -688, 455, 1015, -1479, -1051, 1283, -218, -658, 1429, -413, -2181, 808, 1195, -1544, 198, 901, -1831, -517, 2499, -456, -1609, 1168, -318, -1713, 2023, 1284, -2514, -197, 1547, -1695, 97, 2660, -1476, -1903, 2041, 199, -1590, 2087, 851, -2969, 951, 2555, -1638, -166, 2265, -1992, -1349, 3334, 145, -2259, 1860, 477, -2629, 1658, 2441, -2608, -437, 2479, -1477, -757, 3236, -535, -2809, 2208, 1029, -2377, 1519, 1525, -2939, -49, 2923, -1377, -1121, 2274, -1157, -2243, 2730, 808, -2608, 1019, 1209, -2687, 364, 2548, -2241, -1261, 2143, -1062, -1361, 2327, -52, -2920, 1125, 1279, -2180, 601, 1456, -2330, -993, 2198, -624, -1393]
1786a393L080j942j793L379j33l062K092R20k625J304K017k678m55K450j050j112
1802a001K245p94j929J703P38j684N57J300k012K03J790r38p41J132l77q99J012
1819C05N20j103J44N99o73J35N38j98n60M21L13m00j04K88p3m77L37M73o44j97
1839c56O92l14n46Q70m1q75L85P71j046J12J029r96m62J420k25j412J226L74j641
1858a035O69J409j826l2J780j146j109K138m48j935J847P35k237R30J456k299
1874a103K05K292j404j425K460p21j903K177N63k665J319J631k404R1K515j888
1890b60j347K874o55k197K307M94k855J577J862k803K53K524k040j047K826q51
1906F62k315K489L92k672J476J693k721J29K533j806j200K632p05k301K489N27
$$ y = [-1393, 1687, -255, -2048, 1331, 1198, -1864, 228, 1148, -1477, -173, 1844, -834, -1289, 1161, 111, -1001, 1244, 450, -1479, 224, 962, -722, -165, 1135, -877, -674, 1116, 178, -563, 569, 192, -707, 305, 825, -278, -134, 465, -208, -73, 465, 267, -293, 128, 441, 41, -63, 225, 152, -325, 12, 485, -159, -356, 336, 22, -524, 346, 305, -570, -185, 586, -460, -348, 681, -315, -777, 643, 418, -994, 232, 606, -1035, -366, 1043, -783, -815, 965, -181, -1290, 848, 400, -1535, 312, 1047, -1190, -260, 1196, -1103, -898, 1394, -10, -1435, 1025, 304, -1599, 578, 1141, -1524, -205, 1426, -978, -887, 1628, -260, -1607, 1267, 612, -1585, 722, 1216, -1639, -62, 1800, -1003, -750, 1774, -266, -1313, 1513, 662, -1653, 836, 1228, -1444, 32, 1725, -996, -867, 1666, -140, -1340, 1292, 587, -1714, 775, 1302]
1922A302k637J275J623k555K33K339j744j030K243n96j943K105M26k361J093J459
1938A232k058J25J998j447j119K096l66j660J471N88k025Q25J423j745r0J598
1954H46j025q04J615j04j562J027P72j554L22J376j352m06J577n90j083J300J52
1971E07j310O14R31j196j35J381q21p05J280j58j124R47N53j242J75J194j044
1988a53n08J384l68j063J116K78j285N72R13j236n9J272p80p87J353l4j374R45
2006A86N69j276K83J155j176m36J592n96j125J281J71j501P89J005j545J56J352
2023H84j062o95J610m52j351J346L51j518O93J089j477j21J528r31r77J695k42
2040C70j393J236N58j785N71J259j358k84J642p80j109J581j26j433J101P60j639
$$ y = [1302, -1335, -60, 1563, -992, -759, 1580, -164, -1194, 1049, 453, -1490, 615, 1041, -1320, -227, 1232, -826, -701, 1297, -150, -1269, 827, 461, -1199, 272, 860, -1165, -340, 1083, -662, -752, 846, -179, -983, 632, 528, -1034, -7, 765, -789, -467, 909, -443, -849, 728, 138, -945, 355, 507, -803, -189, 742, -454, -589, 792, -29, -734, 546, 388, -736, 211, 764, -478, -303, 891, -153, -661, 723, 355, -708, 408, 686, -599, -27, 886, -350, -409, 863, 83, -704, 649, 615, -759, 186, 755, -521, -238, 917, -259, -695, 897, 301, -824, 457, 628, -873, -84, 921, -624, -468, 884, -178, -873, 737, 285, -1066, 280, 631, -887, -194, 895, -582, -703, 825, -106, -1083, 612, 370, -1023, 213, 771, -1014, -443, 816, -542, -826, 816, 36, -1073, 508, 382, -1051, 50, 810, -829]
2057h29L77J393j213n65J698p15j161J446J97j478Q49Q39j377R1J376j038o64
2074g74J438l13j228J324L11j484O44J002j366r4J513q63q89J502k13j358J033
2091A85P00j451M94J018j205m56J627p43q89J249J04j454Q60Q10j444K71J199
2108H75j098l87J297m62j042J196K13j378O49Q87j156j8J156q97p10J222p6j099
2126h28R79N19j416N14R61j145k39J277o03p70J136p4j040P10P61j233M9J088
2144F46r36m23J203j78j016Q17L52j132M08J012j068j28R06n21n42Q38K68j131
2162f25O30O89j150J62J052j091o11J508j67r56O99M26j289P75Q32j082l24J303
2180G81p76p47J414q2j352P85P78j380J83J332j168n40J541l51j114J304%j513
$$ y = [-829, -452, 941, -272, -837, 861, 146, -1015, 431, 628, -850, -1, 838, -539, -448, 928, -110, -774, 664, 351, -877, 447, 758, -726, -82, 920, -446, -540, 973, 110, -779, 723, 510, -848, 185, 885, -566, -72, 946, -259, -715, 912, 169, -720, 529, 633, -821, 39, 849, -595, -324, 875, -223, -610, 687, 225, -817, 379, 592, -786, -137, 750, -406, -424, 732, -165, -875, 347, 271, -828, 151, 670, -746, -232, 729, -416, -655, 622, 19, -751, 385, 311, -729, -19, 742, -491, -442, 646, -290, -713, 490, 312, -704, 113, 465, -667, -259, 753, -315, -443, 463, -58, -600, 238, 506, -625, 5, 694, -456, -294, 758, -333, -944, 564, 397, -559, 140, 566, -723, 52, 884, -198, -522, 781, 5, -742, 672, 590, -762, 23, 801, -579, -396, 936, -232, -772, 769, 418, -696, 608, 608, -905]
2198i05R34R43j493M0J440j283o39J897n74j379J356L61j765Q94J188j766K7J392
2216F68p17j019J750l58j689J583O82j916Q13J385j897m2J785j242q41J741k91
2233C95j719J810O18k188O69J610k033J46K077j334j194K041l98j802J775N96
2249A069j948N32J737k009k2J828j363j048K138m17j540J560L16j818Q75J346
2265A236j839j22J893j242p06J877n61j511J357L94j668J012J021j748R4J591
2281A078j215o06J517n79j321J463K03j304Q68P20j457J82J308r50o33J538o85
2298A27q84J066J35j016M90N36r45J52Q33p15l02Q13k92n03Q17n3p83M51L90n47
2318b30O9M27m64j0L88k36j22K40j11r7J76l0L2l5j2k6Q4n8M6K01l50l1M27k04
$$ y = [-905, 29, 972, -521, -481, 959, -324, -963, 934, 360, -1019, 337, 698, -1067, -173, 1015, -751, -724, 668, -49, -1068, 682, 324, -1365, 218, 900, -1016, -203, 1182, -715, -757, 1028, -214, -1055, 686, 395, -1324, 486, 1104, -1084, -415, 1195, -838, -692, 1385, 51, -1143, 898, 500, -1302, 473, 1069, -879, -347, 1390, -619, -641, 1187, -176, -1224, 914, 497, -1043, 517, 833, -985, -110, 1236, -603, -725, 1168, -74, -780, 1097, 536, -975, 382, 776, -892, 120, 1141, -607, -513, 1078, -137, -743, 774, 195, -1126, 337, 540, -764, 104, 824, -633, -451, 857, -93, -726, 812, 127, -757, 309, 444, -572, -82, 454, -491, -339, 494, -221, -523, 290, -2, -505, 312, 259, -524, -73, 317, -230, -161, 266, -198, -208, 180, -56, -178, 62, -49, -146, 30, 0, 32, -3, -15, -41, 43, -15, 31, 232, -118, -149, 278, 74]
2342G4k64M63k06l55L56L89p79M34K52o57J25P85n41m95R47k62q76R20K78j152
2362e64N27O82j136K02J226r50o74J250l42r75J138K10j355Q23P85j444L46J161
2380I10j233n25J774p35j067J401m9j488J070Q57j760M83J210j446k66J831r41
2397B6j174J622n2j489J276P23j924N32J435j473j80J741j055j134J783j57j483
2414i83J356M02j775O60J472j625j99J583r91p86J588j52j432J113N08j455O72
2431d4J021j381j95J381p46p86J562m70j223J181L72j232M83Q74j211n3J250o77
2449A06o29J083k71j047Q39N94j035J54Q39q80j11Q77l83p59Q15J50p85N37M15
2468E09q71Q1O76n71k11O93k96m77O01K29p02K16L81n41r5O80k03m63M28k9l74
$$ y = [74, -190, 273, 67, -288, 68, 457, -322, 112, 364, -293, -168, 617, 76, -419, 528, 266, -610, 310, 588, -564, -37, 645, -491, -289, 937, -13, -687, 563, 221, -754, 384, 594, -761, 62, 847, -597, -251, 910, -323, -848, 926, 191, -876, 525, 476, -1012, 58, 915, -845, -362, 848, -598, -864, 967, 26, -1148, 474, 422, -1067, 209, 932, -992, -460, 975, -498, -678, 1063, 8, -1126, 657, 500, -983, 373, 775, -1000, -340, 1132, -493, -692, 891, -100, -886, 702, 550, -882, 231, 739, -716, -44, 977, -404, -599, 782, 36, -750, 812, 342, -881, 300, 672, -560, -77, 797, -414, -467, 783, 106, -523, 560, 289, -758, 81, 675, -360, -206, 633, -247, -358, 519, 136, -623, 192, 342, -443, 94, 509, -362, -281, 395, -176, -387, 306, 10, -467, 134, 363, -339, -123, 258, -283, -378, 302, 99, -364, 64, 35, -339]
2489c39K96M16n64j85N19k49l44N50l2n72L48M48n69J3O11n27j43N89K2p16N52
2510A24J93p26J02O88m19m08Q11k79n63P72J52p73K67N02p15n7R15o33m18Q47
2530C82K5q28N61L08q46M23N39q61p3Q79m87n50R72j74q93P58L17q83J91P72o89
2551a57k30P93l28p18R82j04p57N83M73r74J85P49p17l43R30j05q12P93J52r93
2571e98N08O53r73Q1Q30o91m01R62k00q55R49J37r10N01N21r45j1R12n85l82R44
2592D47j61j061P81N19q53J29P36p57l67J170l09p77Q46j28o93M87O55j088K43
2611a81Q22o44n13R76l66n42P89M7r90N45P49r97J10Q11o39l38P25l10n89O09
2631G4M25r22L87M76o01Q6N10m03m18O43r4p76P08J54n94M34J67k46n87Q26j35
$$ y = [-339, -43, 373, -191, -376, 143, -106, -450, 100, 68, -504, -156, 292, -277, -264, 347, -180, -323, 266, 288, -428, 124, 317, -409, -307, 381, -38, -446, 365, 86, -477, 295, 447, -326, -59, 443, -272, -329, 586, -47, -465, 382, 407, -421, 140, 448, -398, 25, 564, -297, -370, 509, 22, -528, 444, 270, -623, 135, 452, -431, -240, 532, -157, -387, 406, 78, -640, 342, 238, -519, 64, 537, -437, -252, 497, -220, -563, 367, 262, -550, 243, 395, -598, -90, 563, -410, -329, 501, -190, -591, 371, 171, -684, 265, 402, -508, -7, 514, -431, -442, 470, -115, -497, 447, 286, -775, 6, 525, -328, -199, 537, -220, -587, 583, 274, -503, 343, 215, -478, 9, 664, -424, -181, 641, -3, -516, 460, 94, -448, 341, 388, -602, -57, 692, -305, -195, 616, -23, -361, 364, 54, -535, 74, 499, -423, -36, 440, -161, -75, 435, 32, -386, 257, 163, -613, 95, 249, -345, 89, 256, 10, -577, 249, 114]
2652A14n60O57O0n66J95L70n96J64M99l49l36M55O8o55N13O8l73L53M2j13q2K69
2674A97j50l11L17K03o61N47K33o58Q1K93Nm08N00J13o90K68M93o86PP46l83n27
2696d71N65R7o20M64L32o58J8P75n30k45O99j93m80O13J8o83L77M48o94j95Q86
2717E23o23l68J027l34r28R54O6p74M00P32r07l45J314n97p84J250j86j202R19
2736A37M10j230M62R47j159j12J204o14p63J275j53j246Q60N30j147L69R00j180
2754e10k68J530o93o51J129k54j229R58O99j425N97Q11j170k1J310q02p19J148
2772D40j51j177J313L18j339L86Q78j008J1R59p44n43J115j55r52R77K10j098
2790e60M49P88j000J4R10o99n23J087k71o33N92K51q59N11N73q79j4P03m41k82
$$ y = [114, -446, 211, 271, -295, -100, 270, -326, -162, 337, -12, -348, 107, 175, -480, 33, 101, -272, 81, 123, 10, -72, 197, 47, -264, 53, 256, -405, 142, 375, -283, -202, 91, 96, -312, 188, 301, -389, -121, 372, -314, -307, 439, 56, -471, 94, 191, -429, 35, 367, -291, -273, 502, -28, -273, 426, 233, -247, 366, 384, -299, 78, 526, -168, -363, 523, -100, -468, 559, 225, -703, 251, 317, -457, -57, 675, -232, -577, 737, 140, -644, 606, 420, -782, 137, 547, -683, -221, 726, -433, -545, 659, 45, -718, 557, 404, -842, 18, 548, -599, -230, 670, -510, -778, 752, 59, -592, 537, 283, -946, 12, 711, -714, -117, 694, -476, -497, 813, 11, -708, 440, 289, -888, 425, 743, -596, -210, 668, -340, -329, 630, -114, -657, 458, 303, -649, 328, 538, -560, -111, 677, -323, -309, 601, -98, -621, 466, 195, -438, 154, 405, -454, 57, 630, -249, -263, 440, -1, -283]
2810b83N83j89n57N40K71n68K33L05n95M7L97j47j38J29L3l00K28N7j00k7O3o8
2832h6M0P1j9p9j36K65L4j83j2J37k41N8M31l87k85O48j94n16N60J86n72O3N09
2855B92m49r3O69m39m81Q60n3p56N89K25q56L08Q34q71j73R22o58m68J158k19
2875C41j109R31L75j083M75R07j203p8J289q34o72J272l17j132J098N06j477O50
2893f1R07j339m3J478j013p26J446l43j219J346L20j623P77R80j578K96J364j112
2911a43o74J556m97j177J417O9j437Q67Q95j498J05J354j194m32J500n47j107
2928i43J324J18j387R91O73j464K48J250j095l67J378o70r02J274O7j272Q45N75
2946F43j272M18J027j052l30J135n27p16J121l9j056P27M83r80L56O89j016J5
$$ y = [-283, 300, 111, -446, 94, 365, -203, 30, 335, -260, -213, 184, 37, -101, 28, 61, -239, -11, 46, -54, -81, -18, -86, -46, 25, 6, -73, -209, 56, 90, -93, -105, 32, -209, -151, 280, -107, -392, 256, 62, -454, 106, 292, -280, -217, 292, -157, -250, 419, -20, -501, 359, 306, -450, 139, 364, -492, -184, 650, -221, -394, 528, -130, -598, 560, 341, -768, 163, 538, -545, -70, 837, -366, -444, 845, 11, -661, 611, 294, -838, 260, 766, -711, -61, 846, -493, -536, 942, -71, -797, 649, 306, -913, 433, 753, -870, -93, 887, -691, -395, 969, -143, -817, 739, 242, -935, 482, 551, -886, -19, 876, -622, -517, 837, -357, -789, 711, 164, -943, 381, 499, -888, 103, 776, -688, -440, 810, -285, -652, 726, 56, -846, 428, 495, -777, 68, 643, -629, -211, 816, -236, -566, 569, 42, -674, 447, 408, -648, 79, 562, -418, -62, 627, -389, -374]
2964c74Q59m19m32P06m2p69O22L07p82K47M29n23p1O30l33l93N29l7l68M29M1
2985B56m95J57L21k48k9K03j84j70K26J04k02M8J06k20O8J62qk16K1J61j07L2
3007a4J14j10j53O1K74k01j25K50k37r5L60K8l36J74J66l67K20K59l93k26M58
3028A07m5l09N19k32l76L91K35m62N0L79m09k13P13k46m45M97lm96M60K57n92
3049b20K6N80m29k43P18m05m85O33R2o61M53K82p65K99O63o18j12O04l77n40P54
3070B49R3p78N10K28p04K64O06n11k59O78k79m94O10P3p44L88M13n68OO37o62
3091b44j32P30j24o23N89J74p19L09L74m84j26O07l61l82P07j46o10N48J34n78
3111c57L41M27n67j96O04j31m24L67Q9o04N18K66n89J68M16m50k84O65o7m65M70
$$ y = [-374, 485, 66, -366, 340, 298, -471, 151, 458, -324, -77, 352, -171, -242, 388, 55, -338, 191, 154, -214, 215, 256, -239, -82, 239, -9, -38, 165, -19, -189, 37, 141, -61, -13, 93, -127, -59, 103, 95, -121, -100, 61, -46, -14, 100, -10, -163, -102, 172, -29, -154, 96, -141, -236, 124, 152, -184, -10, 156, -211, 9, 268, -125, -351, 107, 62, -247, 272, 40, -336, 55, 290, -172, -122, 257, -152, -365, 348, 102, -343, 154, 151, -345, 115, 372, -220, -194, 386, -43, -286, 432, 27, -458, 175, 267, -394, 59, 341, -424, -125, 538, -80, -192, 412, 35, -505, 249, 342, -436, 74, 302, -402, -138, 468, -43, -302, 376, 97, -397, 213, 286, -458, -70, 343, -225, -219, 418, -244, -376, 354, 230, -393, 196, 370, -349, -40, 334, -150, -276, 331, -30, -412, 295, 149, -461, 87, 221, -357, -16, 411, -156, -352, 252, 121, -303, 64, 153, -451, 67, 333, -256, -88, 328, -122, -406, 259, 192, -273, 197]
3132A97J53p67M51M14q29qQ16l11m64O24P1p17N46J97n64l4N73m69j75Q07m79
3153C2l78O37j09l47K13M76o58k9N66l60m32P30j37o14N06K25o08K16M36p06O
3174c35P74l77n11O95j59l00K66R5l87M0O85p13q2O06k51o14O86J27o47L40L69
3195C07o24O0M37l69k62O18o0m66L71K99n74L54K26m41L4M43n04k70N95p3l66
3216b65L45K44n55J65L09l45J24K66k23k91L28J12m50K84L70o20K02L86n07l8
3236a59L27j03l90M61J04n80L00K04m66L29J26P5n30M95j27m73O06n4l81J30L31
3257B25l88l4M50k37k58L92R2m95L52n7p8J58K58l31j95N82k90o01M76j2l99K92
3279i8M52n52k35Q00n82j49N27j22n03L73K25j37j62L48m69J90K95k67l63N37
$$ y = [197, 350, -417, 34, 448, -381, -389, 427, 116, -348, 276, 347, -370, 176, 373, -191, -225, 348, -121, -296, 511, 32, -346, 291, 182, -165, 48, 524, -134, -163, 403, 43, -389, 341, 204, -410, 96, 321, -287, -71, 365, -341, -335, 439, 62, -449, 246, 87, -213, 53, 148, -239, -199, 486, -227, -309, 297, 46, -568, 118, 245, -402, -62, 307, -317, -257, 180, -189, -451, 167, 107, -359, 12, 311, -263, 91, 317, -124, -90, 353, -151, -421, 174, 101, -265, 80, 324, -231, -66, 243, -102, 22, 288, 65, -226, 102, 214, -236, 48, 418, -202, 0, 386, -121, -159, 168, 65, -325, 136, 240, -340, -40, 164, -302, 27, 153, 228, -302, 193, 66, -407, 199, 145, -236, -106, 225, -163, -197, 253, 16, -242, 150, 242, -253, 99, 42, -36, 122, 380, 49, -146, 436, 146, -455, 21, 9, -390, -98, 354, -198, -433, 367, -215, -364, 163, 41, -462, -89, 136, -1, -163, 185, -284, -94, 201, -66, -429, 108]
3299A08R4n38K09J99l01M09o3j95K0K67l20k05M32J0l43J83K39m19qL11Q2l44
3321a73M62j55l94L66j3k12K32K2k90M4K43mk39K01P2j67Q1K22j07l16L88l66
3343a03q4L58j60N2r6K04k82J16R5j2k47J43j9l0K29L6l19j53O87l05j27J77k56
3366i6k14K95M7M6l54K81L3j36L16p4n00M26k31j87M24J71n64K77L47m63j03N32
3388B73k23j30J11J39p16P18j5l48J23M85m86k50N35q1m59N08J78o96N55o5j28
3409B8j39N36n50k68O65l09j83L88L8n55J78M56l84K23K83m16k40O15k69m94O54
3430B57k38j30K14J91n19J70K88m37r0P05k84k88K96J6k42Q3L00m25o9L47j95
3451e0l7L64k81k68L45J80m88L25J08n05O3M84l53M3K43j17l58O02j40l89J34
$$ y = [108, 202, -336, -127, 72, -229, 180, 117, -78, -58, 209, -111, -316, 116, 126, -217, -34, 205, -214, -222, 89, 171, -173, 289, 134, -260, 106, 93, -119, 113, 135, -155, -111, 132, 128, -111, 90, 162, -5, 76, 298, 191, -125, 263, -103, -187, 171, 11, 63, -33, 171, -111, 5, 100, 88, -159, -16, -35, -65, 164, 200, -119, -272, 415, 110, -17, 160, -96, -310, -15, 32, 78, -276, 5, 38, -98, 218, 144, -356, 70, -161, -348, 76, 247, -317, -40, 307, -156, -259, 273, 50, -80, 31, 170, -546, 172, 157, -191, -68, 417, -69, -319, 216, 135, -324, 184, 362, -334, 221, 156, 28, -111, 425, -125, -393, 272, -37, -220, 168, 206, -349, -171, 285, -99, 124, 407, -9, -249, 366, 97, -397, 257, 19, -111, 103, 294, -225, -55, 233, -204, -294, 411, 127, -161, 135, 151, -91, -8, 292, -133, -202, 145, -50, -87, 277, -4, -272, 73, 253, -235, 90, 198, -307, -244, 240, -113, -70, 173, 56, -302, 300, 160, -229, -95]
3472i5j22J49j37L92j84k43P2J25LK84p4j99j7P2J88l7M3m08J48L08j96k18P2
3495g4O2m3J68K42L9m45l3j04K36M0J03j57k43K68L36m54N1J47j31r4O7K65k99
3518e3J9n8k3K50M7m04L6L92k71o8K52M9m56K64N5j97L11j50l61K75L40k61l16
3541c28L71j41r7L32L7k50J71om02K21K66l96M9K96K9l18M19l7n51J89M90m07
3563f3j6M42l91l82N69j15l17N08J53r67L78N86n61L03K70o51O2O34l64l73L75
3584H0J78p21N92L46n96j28N08j25m88N55M7o57N97J1l20J00K94m34q0N34l52
3605e9n8J35m5j59K21M2k31L7L98l81K3M18l64l09L84Q6k68K2Q3j67J58J91k64
3628a07J8L11l15q9L52j0l13P8J66l34R0M73m33J4L33j69k17K36j11j46L7L36
$$ y = [-95, -217, -68, -205, 187, 3, -240, -168, -43, -40, 244, 170, -29, -46, 26, 214, 177, 220, -188, -40, 268, 72, -146, -74, -12, -55, 113, 355, 394, -51, -84, -188, 48, 88, 191, 34, -209, 59, 395, -59, -8, 139, 8, -86, -19, 246, -53, -34, -92, -115, 135, 182, -222, -186, 206, -65, -133, 119, 168, -288, -24, 31, -166, 145, -5, -366, -91, 249, -12, -328, 43, -98, -195, 137, 174, -76, 95, 89, -313, -92, 174, -222, -173, 123, 152, -166, 253, 216, -335, -146, 344, -63, -79, 363, -28, -410, 159, 44, -273, 235, 388, -579, -201, 385, -176, 127, 397, -254, -192, 442, 78, -295, 80, 258, -463, 129, 475, -121, -249, 259, 134, -354, 201, 248, -409, 188, 199, -121, -21, 273, -161, -241, 293, -59, -117, 18, -27, -186, 35, 77, -154, -117, 281, -100, -77, 341, -23, -332, 52, 138, -130, -108, -25, -192, -34, 157, -107, -89, 222, -93, -182, 170, 160, -153, -75, 91, -243, -153, 320, -113, -99, 234, 65, -152, 84, -27, -173, -136, 200]
3650B00l3k21J87j32p0K01Jk24K11Q1k98P0K08k67J3J60L6j84jN9j41R7K9J19
3674A01o6J88k85j84L26Q4l18J09J32j69L12j56k1j69J74m2j50L30j90q4J40J84
3696B46j13k82K44p4k06K13K8j63K10M5k03J39Q5M9l54L46j84l73O3L79j39R3
3718D9J13l3k15J73j92q1L14r3j22n8M38n65O9M36k51j48K88j2k74L65r3k89L27
3741A46L2k82l9L59l17j18K88p1nJ11M5l42J57K36l84M0L64j44j97J08l8j14J92
3764B7O8r8J45j9j41j6K36l78P0O5j9k02L13N20o13M8J59k39j09M66m73j88N48
3787A70j76j94K24L2k16Q7L42k08j27J18n0k39L36j10j47R9K06k40j38J73Q1j85
3809a62R6K54n39K57O6MK5Q2k04jJ52k9kR7Q4l55j69N60l33n5M00m0m9l3j69k26
$$ y = [200, 167, -54, 133, 1, -69, 132, 133, -91, 120, 201, -97, -27, 181, -86, -73, 87, 123, -61, -62, -3, -144, -47, -18, 101, 35, 223, -62, -246, 80, 164, -154, -45, 87, -82, 230, 74, 53, -116, 58, 16, -134, 196, 6, -78, 62, 246, 133, -149, 95, 21, -185, 28, 56, -107, 103, 148, -55, 84, 169, 218, -136, 210, 26, -347, -284, 95, -44, 49, 162, 129, -86, 87, -105, -186, 128, 35, -87, -145, 293, -272, -203, 233, -18, -166, 122, 110, -164, 201, 108, -181, 146, 178, -104, -143, 216, -101, -219, 69, -2, -7, 104, 149, -193, -36, 200, -184, -144, 220, 76, -121, -13, -51, -165, 27, 95, -3, 142, 123, -18, -34, 202, -176, -106, -41, -60, -262, 51, 571, -42, 6, 165, -74, -183, 283, -190, -378, 170, -6, -200, 24, 56, -160, -73, 269, 61, -66, 52, 2, -237, 99, -11, -158, -59, 147, -93, -231, -58, 23, -162, -66, 188, -351, -94, -28, -24, 1, 83, -121, -122, 30, 1, -1, 96, 180, -175, -344, 216, -117, -172, 228, 188, 139, 106, -63, -289]
3835b89J73J91L6k77K25Lj87K44k56L6J4J73j23J55K53n01J3K31P1k81O1J35o3
3858C7K0K43m59n4K22J30j93J41Mk41J89M1l89N8L83k68Q0K13p1j98L03k11k49
3881b69M45q4k56P1J96l43M0K84p7m56P33n7l41L21j90j64j64N47l10j00K03j28
3903i9j39M30j8m91M42K38n65n0M73j44j08L79l87k00N24j14k97m1M50q97M42
3924a72L70k21p2L28j71k72M10k9l01J91J38l65J49L41l44K4K33j65k05K81m5
3945A03l26L29L00l83N7N6k60j83M39k2k41J82J28m91K62K02l12J26J63k71j11
3966b53L76k6j63K39n2l40N7L81l73m2L14j49O7J13j08j42J18M0m6j53J54o0q7
3989a35L67k99J13oJ1l00L27j25j5j67L12r1L0o1J01k17J22J06k63J24M3O0l5
$$ y = [-289, -116, 75, 111, -166, 59, 62, -125, 119, -137, -101, -87, 86, -37, 118, 371, -130, -117, 114, 185, -96, -35, 100, 37, 57, 300, -159, -213, 9, 139, -54, 87, 91, -150, 39, 80, -309, -251, 132, -136, -56, 157, 86, -112, 191, -20, -269, 176, 92, -164, -93, 103, -240, -200, 84, 7, -449, 284, 227, -114, 207, 17, -147, -311, 236, -74, -174, 29, -99, -238, 192, 174, -317, 125, 363, -202, -252, 221, 77, -31, 348, -39, -239, 285, 171, -126, -167, 283, -614, -172, 198, -23, -95, 233, 62, -210, 200, 171, -130, 61, 199, -166, -17, 324, -20, 4, 237, 72, -133, 148, 103, -223, 106, 406, 23, 80, 136, -124, -307, 132, 110, -131, 51, 179, -312, -50, 152, -160, -34, 129, -142, -253, 123, 97, -66, 173, 121, -219, -162, 219, -154, -196, 118, -31, 36, 149, 41, -101, 17, 57, 11, -142, 12, -48, -135, 232, -67, 46, 40, 51, -249, 78, -47, -62, -229, 83, -8, 22, -39, 62, -155, -33, 73, -190, -66, -23, 37, 2]
4012BQl2j10K68J30m45m2L85k26o8L3%j3j80M11p2l5O2j65J60r6Q4l34L88QL5
4038A56r6J38j97j15K22q9k22J92j41l70O01k0l7n2N3R7l5J7j85Q1Q8r5k56J73
4062i2L6j65N2J73J95k69L36l10j05K23M8k67j26K34j41J34M86m53k86L84j72
4083h5j41K23L59m99J78M5J0k29K09m1k89L13%k24O5J16p3r6L89k85q6K31l08
4106b18j0L98j03l74L82r0J70k76M69l84P7K4%R7o3j38j15J92n8j73K10Jm7j05
4130a34L15j35n2J18k33j23L31m5n2MK03j82j04K96k51k04K36p0K17j33J1N8k03
4153a32R1K06J27l51n5nK10o5j34RPJ73j64J24r4P9lK51l90N4J85k16Q9lK04j47
4179E0K5M9j18j36L73l57K25J53j33j35M3O0Mm2j40k4K60P4k21j06J47J16l8j4
$$ y = [2, 10, -22, -132, 136, 266, -179, -221, 164, -62, -130, -97, -97, -110, -290, 121, 49, 14, 76, -89, 71, -25, 59, -275, 113, 121, 156, 60, 198, 1, -114, 108, 19, -203, -11, -152, -522, 79, 59, 22, -30, 23, 120, 85, 102, -83, -2, 86, -9, -265, -92, -56, -221, -169, 4, 199, -70, 266, -44, -149, 74, 122, -145, -271, -37, -178, -44, 442, -11, -297, 87, -85, -226, -3, 356, -143, 35, 80, 90, -139, 70, 29, -260, 53, 53, -171, -106, 10, -63, -159, 230, -55, -141, 90, -218, -228, 170, 67, -307, 75, -15, 155, -121, 348, -36, 41, 65, 65, 162, 99, -39, -154, 38, -20, -193, 17, 18, -29, -134, 181, 46, -6, 112, -121, -244, 87, 42, -10, -6, 197, 15, -89, 207, -44, -248, -12, -82, 135, 2, 13, 71, -132, -41, 165, 292, -59, -114, -119, 91, 26, -108, -99, -92, 81, -83, 41, -53, 26, 23, 274, -116, -62, 123, -93, -4, -7, 197, 50, 75, 124, 6, -130, 243, -114, 111, 264, 131, -4, 39, 99, 103, 61, -79, -103, 157, 231, 10, -96, 51, 167, 129, 115]
4203A15j59M2n4J12k58K63mj38J56K3j52J83m0j14J37J7j20q5J5M4k1j3J22J26
4227A97k69M5K5L4L4j05L3J47p9J68j98J39k23m1J76Rj78j97L78n0j50J91n9p2
4251d5N7j19j12J56N5K8m5J89q7k02K69J06j11j97L50l02k5J44j56jJ36j6r3O
4275a5L2j52K20pj61P1l8J63p8j98J38n1K34o6j47K80o5j10j72J82q1m3J77n2
4299F1n5K8n2q1P2K09o5j39J36j83j29L28j87O1k60J92%J14J01l50N3K21p7l6
4323c8J19q3j07K03j71M8j14J5K2J0p4Q9N4K17j06k38J10J20pm1L0k10j9M27m8
4348B08m33K69N1j47O2l0m6nK21k24J0J69J88k19M9R7m7R8m1j92Oj7lj23K07k61
4374a53L46j41o4L7k82M07k30R7m9J95r4j77J18k8o4R6j25Q5Q3p0nJ20k05K08
$$ y = [115, -44, -2, -56, 56, -202, 61, 57, -81, 75, 98, -54, 129, 89, -25, 112, 129, 9, -76, -61, -17, -38, -51, 71, 197, -72, -27, -2, 32, 66, -39, -6, 141, 62, 230, 32, 171, -52, -93, 83, 92, -86, -283, 95, 45, -105, 86, 27, -45, 12, -107, -219, -63, -8, 20, -25, 164, 77, -125, 144, 250, 139, -58, 292, -10, -35, 109, -47, -48, 88, 72, -21, -15, 17, -135, 85, 78, -83, -12, -50, 113, 35, -163, -25, -76, 158, 92, -55, 225, 160, 50, -122, 60, -21, -64, 113, 61, 6, 34, -18, -99, -27, 182, 117, -22, 114, -69, -198, 130, -57, 4, -256, -64, -64, 50, 151, -199, -146, 75, -2, -38, 81, -2, -109, 94, -77, -29, -143, -128, -106, -96, -170, -81, -27, 190, 84, -154, -44, 76, 69, 28, 58, -152, -171, 256, 208, -225, 44, 95, -52, 10, -20, -66, -71, 150, -74, -64, 105, 293, 74, 123, 220, 173, 271, 230, 38, 44, 27, 24, -99, 108, -153, 193, 52, -12, 25, -257, 150, -80, 17, -32, 163, 69, -108, 10, -18, -82, 14, -111, -26, 57, -13, -18, 102, -103, 105]
4398A05n5ml4q9K8J6L2j9K32l42J15QJ23l02J9P0nK73kk22J17j53n3J53j06j7
4424a12Nr7K87l14J87J92l34J67mJ8%J31j69O0k4J13k00L77l15p9K15j73q2J62
4448A1J2k4j18J17Jj0jj71J40K00o9j98P5K5N9j62J08J25j25J46o3l01L54k28
4472i7P7J03o9J9P8j82J22k29J95j39J62O9j68J86j25k5M0k23K99m8p2M1k29K78
4496F3k09O3j7l9J22J92k50kJ35J5j26J13N9q8J53k11R1JL9k27J81n3r3k1J90
4521H1j5j68J83j24J80j22j6J14l7l9m1q0j01J82j05J45J49j88p3J25j6o7K79
4544B46l01J49j83J55N4j85K17k33j9M6K5J74p6Jk59J48K05m94L66M3n4q9K14
4567A50j08O0K8j94j47J97j34J4J85M3l4j39L94m52m7M85l19M7J37k65J07rk0
$$ y = [105, 50, 46, 12, -77, -49, -33, -1, -20, 212, -130, -15, -7, 116, -186, -167, -97, -102, 171, 169, -53, 64, -89, -142, 11, -95, -112, -107, -204, 83, -231, -44, 148, -186, -19, -23, -5, -5, 126, -43, 17, -7, 106, -94, 283, -32, -111, 104, -69, -151, 11, 23, -1, -119, -2, -1, -11, -12, -183, -43, 157, 88, -110, -35, -10, 49, -113, -5, 120, -5, 141, 78, -223, 131, -97, -20, 83, 14, 33, 111, -71, 51, -178, 17, -122, 40, 109, -59, 127, 2, -23, 17, -206, 93, 45, -27, 14, -215, 63, -146, -83, -100, -139, -17, 175, -75, -77, 58, 73, -53, 60, 119, 31, 184, -27, 64, 65, 104, -123, 58, 5, -88, -109, 81, 66, -102, 81, -43, 137, 15, -1, 113, 76, 37, -4, -84, -185, -3, -108, 37, 186, -2, -75, 50, 34, -33, 246, -55, 94, -89, 66, 120, -65, 152, -81, -100, -54, -29, 145, 69, 70, -189, -41, 164, -330, 36, 79, 25, -64, 150, 42, 102, 130, -64, -211, -14, -148, -134, 51, 94, 60, -79, 315, -137, -184, 301, -18, 29, 166, -99, 8, -1, -21]
4590b1K49m07K56Jj15k7L12k04j91J95k34L70j70l96M91qk6k05N3R6lJ44j66K3
4614A7jJ66p90O23J89m2m0K27n01L0L38j36k43R1J21m31J75j41L1N03j37M3j27
4637c5J35L3j26O4O1j70P0m5M5j41K38J12l46N0J06J0O0k7K7k22l0J23j05J17
4661Dp6p7J03J43n5j33P6L1j15J28Lj24M6oP0J1N6n4j34J11K0J4M7l6N4j78R9
4688B8j27M7J40j5r4M1o1K7Q4k13j2J41J46j49K8K5j7l4L5mr1Q9J2r1N5O2l0p3
4716e1J21j7j15K5N6q5K2J15n7M7l9m6K9RN7j22J25J13j60K2K0p3l1Q8m0n2O3
4743B4k6o2N6N1K2m4K6l9mj1j1j2k5O2K1m1O1q7J7O8j6q9K2J8k4M2K8m8j2P4m4
4774cJ4oK2n3J8L1k5k5O5l2j7P2p7KMN2r0O4Kj06O5M2kj00J00p8j2N1J08j17r
$$ y = [-21, 228, -179, 77, 78, -37, -64, 248, 44, -147, 48, -186, 184, 14, -382, 109, 101, 75, -130, -77, 19, 16, 160, -6, 17, 16, 182, -608, 15, 204, 162, 122, 349, -152, -122, 216, 80, -163, -72, 49, -382, -207, -348, -317, 186, 49, 92, -35, 100, 133, 7, 71, 132, -38, 32, -13, 32, -109, 129, 241, -105, -55, 51, 61, 121, 94, 121, -101, -131, -8, -113, 4, -72, -149, -46, 97, 42, -91, -15, 16, -99, 29, 32, -92, -46, -52, 18, 29, 85, 31, -103, 8, 28, 42, 89, 53, 107, -71, 28, -99, -52, 88, 73, -21, 20, -41, -14, 70, -143, -155, -14, 132, -17, 11, 36, 19, -15, 20, 16, -75, 14, 26, -65, -10, 52, 22, -51, 70, 53, -62, -37, 19, -66, -44, 71, 14, 61, 22, -24, 5, 14, 71, -51, 74, 187, 27, 49, 69, -4, -35, 53, 13, -39, 24, -2, -64, -8, 43, 65, 21, 47, 8, 4, -7, -18, -30, -55, 7, 28, -13, 48, -39, -22, 46, 30, -59, -37, -19, -43, -1, 27, -21, -33, 41, -3, 11, 5, 27, -26, -8, 23, -2, -27, 38, 6, -11, 61, -16, -14, -10, 42, -48, 16, 18, -88, -23, 19, 17, -83, 17, -61, -73, -22, 86, -31, -40]
4805d0P2j7n2K9N5p2P0j2q6O8lj0o5P2j6JO1n7m6P8Pl7L7j7l6J2O6p4J2L0L6j26
4837f0L3O6o4m0R2k3K0k4K3l1l6P4p7K0P9p8o2R8l0j7K7N6j05L0L3l2N8m8pQQ6
4868F9o8l1M5j0k7L6K1l8l2J05j36k1J14l0p7N7Q5q4J0J6n1K3N3j1q6R8k9m4L8
4897eO8r4J2R3o3l8J07j04j04J71Po1O3k9j8l4O0n0PO0m8OK7K6j18J14l3o7Q3
4926C8j2k2n0Q4j9j11J00N4j10J14l0n5J6J7m7J9N5m2o9N1kk2K0O7j05P6L0j04
4954e9k0R3kp2J33p0%m3L1l5N7j86J26L5n0M5m6P4k1l3lQ3m8j1O0J3p6L9j3l8
4984c7K5nJ7JN0Nj19P9Oj05J04j2J2mM2j7n6N9l5l1K3M5m7L1J5j06L0Q9j04pP7
5015B5l6K0L8j5o8M2O3o7JM9n0n5M2L3n5M1m8m8K8O3N0n4K2o5l9J34p1l3K2On
$$ y = [-40, 32, 15, -37, -8, 47, -25, 45, 33, -53, 15, 12, 2, -63, 9, -7, -6, 55, -2, -48, 30, 37, 0, 37, 20, -16, -4, 62, -12, 0, 30, 66, -60, -27, 39, -25, -65, 27, 4, 24, 0, 23, -8, -44, 30, -47, -27, 52, -26, -88, 10, -20, -37, -10, 46, -59, -29, 4, -28, 30, -18, -25, -17, 69, 1, -30, 15, 5, -22, 14, 35, -3, -35, 70, -66, -87, 27, -3, -80, -23, 62, -22, -12, 4, -47, -24, 29, 18, -68, 30, 1, -43, -5, 63, -31, -19, 74, 11, -27, 80, -24, -128, 43, 50, -11, 52, 23, 5, -29, 31, -19, -12, 48, 0, 6, 33, 59, -59, 55, 22, -45, 38, 26, 4, -46, 38, 19, -92, 8, 62, -48, 66, 36, -19, -3, 14, -33, -14, 41, -1, -70, -19, -21, -43, -23, 44, -61, 15, 45, -59, -79, 14, 12, -60, 73, 3, 3, -40, -9, -44, 13, -173, -47, -12, -62, -17, -63, 11, -10, -43, -46, 37, -11, -22, 38, 51, -25, 14, 1, -37, -12, -17, 0, 1, 51, 56, -63, 16, 22, -83, 21, 9, 21, 17, 59, 42, -14, 45, 10, -21, 2, 47, 0, 31, 46, -60, -30, 59, -45, -52, 25, -11, 9, 47, 32, -36, 6, 69, 2, 3, 52, 2, -53, -11, 22, -33, 8, -40, -88, -60, 3, 53, -1, 21, -44, -83, 51, -20, -53, -31, -25, -30]
5046c0P8Nl9r8J03m3k4M5L6j26J03nm4N8M2o1m4Q4o9q8Q5L6n5OJ25j24j3K7M3
5075A3j10Q9J8o7P0Nlk6L2j7j4JPOL2m9j4k4Q8m7L0m0l2P9l1M6q0K2L6k1L1%q0
5108e0K1M4K0qM0p4K1Mk6rJ8k4R3j03O8k3K4m4l6K8L7j7m8rj6R7p2M0k0Mk9P3
5140B4o5Q8j15L8k5M7M0l9n4M1J0J1L7l8lNN7j00M4J1k8o3J22p3N9jj03L7J8L9
5170B1m1J0j1l2L0M7Ol7jo5L9J53r9n5K5N0o0k3Q0rk7J6K6n0Rl2K2P3p5Mj9M7
5202B2o1k9P0j1l7P5m2j8P4n9K4j6j6l0K9P7n8m5J6J4K7l0k2j2M2N0Pn9J2o1M3
5233b4L7K1n6Rj4L1K9Pp0Nj1pJ07l5j5n6K9j9J02m5j2l9M2k6M9k9j0N7p9J8R6
5264I2m3qo8O0Pl9K7nn5J1O3j1Rk2j5l4R8r5M7l3O6l7qLQj2Jk1L3L8l0m3j2J48
$$ y = [-30, 48, 53, 14, -84, 19, -24, -48, -3, 33, -93, 10, 5, -39, 19, 61, 0, -44, 40, -29, -117, -32, 4, -51, -45, 80, -44, -57, -30, 13, -97, -8, 10, -57, 13, 18, 15, -11, 21, 4, -10, -9, -2, 4, 36, -13, -27, -51, 37, -10, 20, -20, -52, 27, -4, 42, -38, -16, 20, -1, 30, 30, -50, -29, 15, 35, 27, 67, -7, 14, 18, -8, -17, 1, -23, 70, -33, 35, 12, 36, -8, -44, -16, 21, 4, -44, -53, -69, 28, -44, -4, -24, -20, -49, 24, -41, 47, -68, -30, -55, -8, 32, -7, -61, -20, -10, 1, 38, 0, -3, 2, 59, -41, 3, 14, -14, -77, 45, -28, 31, 30, -73, -36, -18, 21, -20, -10, -21, -53, -23, 24, 30, -7, -8, -73, -34, 119, 20, -35, -10, 40, -20, -43, 37, 28, 1, 17, 43, -7, 2, -30, -8, 65, -10, -6, -25, 22, -39, -68, 2, -9, -46, 29, -13, -31, 43, -16, 8, -8, -24, -54, -25, 52, -6, -51, -35, -21, 6, -24, -46, -58, -16, 34, 41, -18, -6, -67, -24, 13, 34, -22, -13, -27, 4, 33, 40, -30, -25, -36, -43, 64, 29, 14, -42, -13, -32, 70, 25, 13, -26, 16, -10, 39, 10, 0, 57, -22, -4, 92, 49, 41, -27, 33, 40, 1, 28, 23, -32, -21, 42, 31, 40, 18, 3, -31, 67, -28, 19, -14, 52, 15, 7, 10, 18, 6, 7, -14, 19, 57, 27, -16, -28, 120]
5298A20j50P2p7P3Mj68J05K0J04j00k37J61k2j7K96k41p0N9J94N3m71J76J83k94
5322b27r7K82J06o3r9N5k55M19j90j53L34J6J76l51j04M10l72R9%l97N35p1j10
5345e7q5J62m0J57K01n69K37M38n92J99l9P1j01P5k54L7j5L38m53K38L11j71l25
5368b37J61K25j42j28L66k20J28l50J53J54j3k59L44J18m15K40q2J84l88M51l23
5389c3j07q6L51k07J20l53K29J81j53kpK69j44r6k51M55j99J39j6j02K35m36J53
5412f0Q3j37p5M05k73N1m3l7j65K26J03q7R9m6J78l19L40J25j43m78L70k1K68
5435C64n45L81j84q3l7K11J78n70K68J03l81L09J64j9J74k48j85K98j55n2N7r5
5457d7n4K13k94L91l23K1j43K44r6K37l80J94J23J33j02l20K37m9j3j71K70J61
$$ y = [120, -30, 42, -35, 38, 42, -126, -21, -1, 103, 3, -234, -73, -95, -112, 184, -57, -127, -68, 126, 179, -292, -116, 67, -227, -324, -42, 64, 1, -98, -43, -298, 121, -69, -222, 112, 128, 304, -47, -151, 259, -113, -14, -14, -411, 124, 53, -57, -142, 20, -20, 137, 338, -231, 6, 444, -148, 51, 12, 83, -18, 57, -197, -160, -175, 163, -290, -52, 259, 88, -237, -76, 149, 7, -121, 245, 25, 153, -197, -44, 110, 97, -162, 182, 300, -115, 125, 43, 227, -161, 290, -33, -140, -226, 125, -82, 38, -315, -86, 95, -58, -60, -67, 202, 58, -38, -289, 166, -33, 106, 90, -12, 223, -213, -60, 23, -114, -189, 216, -57, -6, -49, -86, -251, -25, 78, -9, 90, 44, 222, -97, 243, 368, 225, -253, 117, 96, 364, -181, 200, 16, -67, -104, 107, 285, -285, -17, 86, -295, 14, 178, 159, 333, 85, -100, 198, 43, -9, 48, -47, -101, 112, -182, 209, -114, -93, -236, 8, -88, 149, -231, -37, 86, 219, 117, -203, 34, -15, -28, -199, 71, 232]
5479B32n6k2j42k38K09O0r4J27j44j36K90M6R8k52J2M12o13j14L33j38J28J38
5501A36n4m4j27Mj18K86k40M1Q5Q8j25m1k9j52L86Q9j11mj72J32r8R4p4K31r1
5526I2j97J87j35j15J97L9k01K81j19n8N2l5K7R0Ro0J34j87k1J50j56M4j5k0R4
5551G7j25M1o9j25L31l09n7M04m42L33j7J10j8o4K1o3Om1j95j0K55qL0q3m8K19
5577A53rj88R3r2O6j5N1n1NQ6P6l56J3M5J31q0K2N7R1k19K16j21j51J70n2K8l6
5604f7K34k97K93l52J91QM2J7j55L1K48k03K33k72j94K85j58K62j82O5L0O2j86
5627f5K58k73j5J64O9K6K7j89j02J49o4r7n6J84OL8j51L6K26k0l63K53j3r0l4
5652i6K54k49J24r4L21k00j62O7q7Q6J23k6j01k65K68j10q1K23j26j59K83k5k18
$$ y = [232, 176, 154, 12, -226, -17, 43, -51, 76, -68, -204, 86, 132, 230, -22, -10, 402, -211, -325, 8, -130, -2, 136, 82, 38, -89, -85, -203, 83, -157, -116, -31, 57, -68, -109, -138, -290, 96, 185, 74, 70, -102, 30, -68, 26, -48, 183, 92, -105, 82, -53, -168, 29, 68, -133, 148, 29, -29, 23, -12, 15, 105, 114, 54, 188, 1, -20, 130, -26, 18, 3, -17, 77, -48, -7, -76, -201, 130, -179, -236, 168, -274, 59, 42, 152, 134, 70, 91, 28, 34, -7, -202, -212, 43, 35, 65, -18, -66, 153, 144, -44, 49, -43, 23, 8, 59, 8, 13, 99, 175, -181, -168, -123, 8, -72, -50, 7, 98, -121, 95, -26, -177, -7, -59, -31, -67, 167, -130, 163, -189, 2, 10, 52, 69, -86, -55, 193, -10, 223, -49, -243, 42, -116, 146, -36, 29, 59, 121, -65, 193, -80, -95, 69, 138, 164, 191, 2, -100, 49, -15, -112, -168, 16, 22, 60, -91, -55, 171, 151, -212, 41, 28, -62, -96, 158, -91, 33, -61, 260, 60, -102, -35, -122, -36, 87, 61, -40, -305, -37, -147, -228, -5, -131, -290, -7, -32, -250]
5675b50K92N3r7k9J92l85J15J37j65k4K26j83J48j9Mp6P5M3j27k4K70j59n9J65
5699A23k86l6K43O7L3o0M5j3k3%j21K18j32J7p5j03K88j77R5j80K7J76r4j6Q9
5724A05K11l79L5O8J1O7l30J46J11L4j98Q3J46j61J61j93J00j08J91j49ln6J29
5747B1Q8k73K50Q3k34m8M2J09k9O0j27N6l0Q6P2j81J6Q1n6k25K44j18J13j67J99
5772C2l9P1k3n7l2J83j27o8k0nL6J29Q6k52O8J0P4k02J03K8n2O0K09k88J04j0
5798A8N4j02J25j24O7J3j11J8Q7J5n8P6K2k13K01N0j32j2rN9j4K9r0rP6L1j43
5825g6N8P4l6o9J03q5kK5L0p4N7k0J7m8O7L0k6L7j11L7Q7k4K1r3N5j49R4R9j12
5854c4n2J15j02J35rj44N2J3R2j84K06p9j3j2J14r3%k0M8n8M8r6RO8l2M2q8J81
$$ y = [-250, 42, 95, -2, -31, 161, -224, -109, 28, -137, -161, 65, -118, 30, 11, 15, -61, 14, 57, -70, -94, 176, 17, -42, 123, -163, -199, 44, 111, 144, 84, 129, 116, 93, 93, -28, 190, 58, 75, 0, -103, 185, 8, 103, -77, -50, 126, 32, 16, 105, 316, -63, -28, 40, 51, 118, -212, -66, 45, 79, -119, -36, 110, -51, 110, -83, 17, -91, 100, -49, -52, -108, 21, 109, -164, 86, 169, -65, -113, -71, 38, 9, 69, -58, -2, -32, 54, 126, -55, -39, 42, -14, -239, 5, -113, 0, -167, 32, -7, 64, 41, -16, -48, 135, 8, -60, -80, -85, -49, 80, 166, -86, -18, -8, 66, -136, -33, -5, -57, 3, 212, -76, 28, 18, 72, -30, 95, -29, 38, 51, -60, -42, 45, 60, 2, 78, 100, -113, 88, 138, 6, -6, -15, 44, 30, 59, -31, -40, 36, 67, -76, -18, 56, 20, -49, 54, -31, -33, -8, 22, -52, 5, -15, 2, -46, 21, 51, 25, 62, -49, -12, 75, 51, 72, -21, 34, -115, -21, 78, -34, -86, 29, -73, 62, 53, -91, -39, -26, 66, -118, 88, 9, -4, -16, 98, 5, 5, -15, 33, -25, 23, -73, -64, 4, -28, 14, -74, 107]
5882A07j11L5o9Q4l5m3J00n7n1P7n3RK4N4p4Q6j19J19j6j15K09r0l6k2m4J05K9
5909A03j41R3j0l7J3k4j7N9J0m5m2rN3n8P4N0j31RK1j0pkK0j0P8l9p2P7n3k4J3
5940e8P9k9j4J27r2om6M8J4n2pP7jp5n4J16m1K0pq8Q9%N9m3j8j2kQ1j05n1J13
5971B2j02O1J8L5j25M9Q0o8K0K3n7N5l4K1J7m4j6m8K07o2j00j0J65q8q8N4L3J7
5999C5n1n4QjJ21J5j58J60j05L3L8rm1P0m4m3pPJ4o8J03q8K0M9j6l4K2p9J26o1
6029c8MM2n2K0N3m4J03p4j24J73r8Pq0Q7rl1M9r1R2m4j7OJ83j79P1k8Q4k4p2J5
6059a6qJ76j67N8o9Q2jp5J06r4m6p2J25m7K0P1j25R7L4o9k3K5P8j3j00J12p1k1
6087c3J5K9o9Q6r9J07m7J23j56K6rJ08p8j4n1m2J25l1j2J2N5j7K0j12J78q8L6
$$ y = [107, -4, 31, -38, 46, 11, -32, 68, 11, -40, 37, -16, -7, 17, 71, -3, 83, -36, 83, 67, -48, 161, 71, 35, 13, -31, 74, 103, -38, 55, 45, 8, 21, -3, -20, 39, 49, 4, -38, -47, 6, -52, 22, 72, -59, -50, -29, -39, -46, -48, -28, -38, 40, 1, -71, 6, -47, -71, -58, 21, -8, -22, 105, 13, 7, -39, 9, 23, -29, -36, 41, 40, -35, -89, 27, -14, 6, -1, -89, 0, 0, 59, 16, -2, -14, -16, 65, -40, -91, 22, -80, -19, -1, 34, -91, -42, 38, -30, -10, 13, -44, 11, -23, -2, 15, -29, -45, -93, 114, 52, -48, -58, 107, 19, -69, -15, 18, 35, -16, -70, -62, -63, 58, 73, -85, 75, -30, 3, 41, 32, -9, 61, 17, -26, -33, -26, -12, -80, 23, -65, -45, 4, -12, -46, -24, -103, 23, -38, -34, 8, -44, -24, 29, -15, 88, 14, -110, 63, -35, -28, -108, -21, -30, -61, -12, -103, -11, -55, -72, -66, 117, -62, 9, -19, 65, 41, -31, -16, -24, 152, -15, 43, -26, 56, 55, -20, 86, -8, -54, -126, -1, -48, -28, 43, -82, 15, 49, -20, -43, -18, 60, 47, -53, 59, -12, -33, -18, 11, -58, 28, -71, 36, -11, 112, -44, -18, -27, 81, 3, -11, -62, -104, 21, -10, -22, -10, 45, 28, 48, -64, 114, 26, 62]
6114F2j8r7PL8o7Km3K32j55O0j31K0O8k7O3K9q9n6J79r1pQ6j68J47K3r3J8O0K7
6143G9r5M3k0P2q1N6j5Mn2pmp5O4M0Q2j08j5P8r8n4R6m0N5K3j4n9%R2Q3j77M3
6174dJ6k6J53j91N2nJ7o4N0K2k1NKl3R1l9k8mk3M2P2op0j03J18o3J0k2J23j95
6204a24R3J25j47k4J13o2mLk0Q0N6n5N6j20L7p7M9j4Q2r3K11j93m3J58o9k2L2
6231B8N7r7QR1j15M1L2j19P6J5m2J6n0M7M5Qr9N0m2L2J13j06O7q3j5N6%j0q3J4
6261f5Q4l9J25k00M8R6q3O8mk1oJ16j18p7Q9N5j38M9M5k7J5J6n3J2L6n7J4N0j8
6290A2k7l2Lk3J11o0n7J3l2J36j16J95j39J4M3k4q9K5N9J2qKl1j00J61j46J46
6317D8p9k9m0J09k2n7R4M5r7J0L0j3j3PJl8J33j28L1PO9j13L6J37k16J06J4o6
$$ y = [62, 44, -53, -46, -8, -75, -73, -116, 116, -39, 21, -110, -90, -22, -49, 14, 43, -46, -102, 77, -14, -21, 65, -103, 44, 67, -26, -8, 52, 79, -16, 27, 7, 79, -2, 54, 39, 43, -9, -16, -20, -95, -31, 9, 91, -17, -32, 46, -52, -106, -10, -50, 5, 28, 14, -45, -45, 47, 130, -47, -4, 12, -14, 139, -52, 0, -5, 12, -52, -2, 20, -1, 4, 6, -27, 64, 25, -3, -7, -30, 12, 84, 78, 8, -95, 23, -40, -30, -52, 71, -124, -31, 94, -53, -77, 36, -26, -30, -27, -47, 33, 89, 34, 90, -30, 7, -70, -21, -35, 47, -46, 165, -28, -71, 87, 18, -4, 28, 85, -12, -4, 87, -28, 13, 45, -74, 2, 17, -25, -9, -59, -12, 33, 41, -58, -8, -50, -18, 95, -11, 56, -27, -42, 14, 14, 4, -79, -65, 19, -20, 105, -95, -47, 49, -34, 34, 30, 9, 3, 119, 1, -76, 13, 68, -70, -21, 24, -3, 12, 28, -25, -13, 23, -34, -20, 30, 12, -15, -47, -44, -67, 44, -16, -73, -60, -92, 44, -72, 123, -16, -2, 41, 17, -72, -47, 12, 24, 16, 18, -13, -113, 48, -98, 48, -31, -60, -100, 9, -13, -70, 24, 69, -28, -18, 12, -1, -14, -7, -6, -44, 89, -39, -8, -1, 68, -45, -9, 128, -88, 18, 32, -34]
6345c4KM7K1o7N6K8j46N9rm1L0Q1j4j8M7J8n3M4Oj49J03l2m3K5M9n1Q6lp8JJ4
6376b1JqKlJR9j8p3jO5r6K9O8l5j0J7J5o3oK0k9N3J6n3K0N7n8j5j4L1J5l0J9m7
6410e2J8k7P4K8k0o4k1J14l4l5RL4m0Nl1KQ6k7j1k7K1qM4k2l0M0k6K2J7o2O3l5
6442EJ5qj2l6L3k3K6k0J6j8L0lK9j9r6J24o4pM8rJ5o0M7o2O6J1J5m0n3M4m1K1
6474b6L1k0l0K3k4K9k4M4m6K7K3N8k5m7L0l5J5K2n8J6M7r3M9L4r2L2N7Pn0L0o1
6505e7M8l0J7M7oK3k5K1j8L6p9L0L7m5L8k0ol9Q2p6J5L0m2J2N0n0K1l1O8p2J7
6536dK2J0l6oM9p8N0L3k4n7Q2m2K3k2K5n3P6q3L2m3jJ3K1K7o1Q6k8j3o3J03l4
6567DmMo9O4Noj1r5O6P5pL3q2k9M1R5j52P5K8q9K5J6qL0n9L8L8m0K1l5oO1o6L0
$$ y = [-34, -32, 15, 36, -31, 25, 53, -93, -34, -43, -84, -54, 27, 13, -5, 42, 60, 7, 51, 57, -92, 11, -21, -64, -39, 10, -41, 45, 42, -36, -35, -21, -20, -28, -26, -29, -28, 71, 53, -20, -21, 44, -52, -23, 45, 10, 0, 17, 32, -31, -37, -17, -46, 7, 23, -30, -10, 47, -11, -26, -40, -9, 6, -24, -5, -52, -34, -61, 13, 41, 21, -43, -64, 50, 16, -19, -10, 24, -16, -11, -42, -40, 46, 19, 8, -19, 2, -6, 38, 16, -14, 26, 0, 22, 39, -23, 40, 5, 20, 12, 0, -36, -3, -26, 0, -20, -4, -22, 8, 5, 34, 15, -81, 43, -21, -28, 20, 11, 26, -34, 13, -49, 17, 28, 43, 3, -50, -6, -47, -26, 5, -15, -45, -22, -46, -17, -41, 3, -43, -16, 7, 65, 40, -7, 23, -12, 3, 25, -33, -17, 30, -63, -14, 20, -72, -40, 17, 24, -26, 4, -57, -9, -39, -22, 25, 19, 42, 17, 38, 20, 56, -23, 7, 44, -1, 37, 17, 11, -28, 54, -22, -7, 23, -19, -7, 43, -7, 14, -17, 51, -21, -4, 18, 28, -8, -14, 35, -43, 7, 40, 16, -41, 41, -1, 22, 0, 25, -28, 48, -35, -3, -46, -47, -34, -13, 14, -47, 39, 11, -2, -65, 38, 4, 0, 4, -65, -1, 4, -2, -13, -108, -42, 33, 26, 59, -23, -52, -11, 84, -68, 7, 35, -54, -29, -13, -21, 9, -50, -12, 26, -14, 7, -28, -34, 27, -39, -9]
6601iJ0n8QN8J2J5m1mJ7j2k5N3n5JrN0J1l0J3o1J13l2k7K7m0M1m0JJ3m9J44p9
6633A6J4l2L4n6l4N8j4k2K5J5n5j7J08m2k7k2qO5K4N6n5k9K5m7K7L1k4LO4p6l8
6664c3N4m7L5l0j2j5OK7o6O1L8m9J40j78M2j6M4j18J34PKo5L1j9K5M3m3J9J7M8
6694H2j11pJ72n5q5P0L2r0m9O2J8n6O9n1k9Q1j3j60J74o4J05j31P3n4o2Q3m0P7
6722D1m8L7p9R7l0N7k80K49l9O9n1k24J78Q7o0j07N9L9O2n7k2r3J26L1J8K0m3
6749C7r1J07j16PK9L5M9p1P2lr0k4o4K19N7j48K9l6M6j04J06p4jpO6J0ro2k7P7
6779A9j4j2kL1p1K6R1j12K6m0N0j0P7q8P7m6O7k1n5J29j05k4N1J14k13J8O0k0
6807CK0kn3M6j1kkk8R6ql3m2p1J45k4j39R4k7O8k3o9N7M1k6Jl1k5K4j1P6j0l9
$$ y = [-9, 1, -57, -49, 9, 21, 36, -5, -9, 8, -4, -29, 24, -31, -30, -39, 11, 22, -8, 5, -56, 57, 25, -2, 25, -15, 26, -14, -13, 0, -49, 95, 16, 30, -2, 32, -24, -58, 0, -14, -36, -11, 4, -51, -68, 40, -2, -29, -51, -59, 6, 30, 86, 31, 2, 27, -20, 7, 38, 14, 17, 81, 5, -33, 21, -26, 9, -21, -33, -48, -42, -15, -81, -20, 18, -31, 109, -69, -27, -43, 1, -117, 17, 24, 26, -39, -8, -27, -2, 41, -2, 17, 34, 82, -29, -36, 136, 81, -4, 66, 98, 8, -41, 21, 39, -17, 52, 1, -28, 53, 40, -120, 54, -10, 95, -36, 37, -17, -79, 4, -36, 41, -7, 30, -49, 48, 18, 75, -205, 44, 5, 74, 23, -201, -23, 64, 4, -103, -44, -5, 57, 0, -22, -115, 11, 42, 60, 80, 37, -54, 53, -63, -56, -27, 8, 57, -14, 58, 55, -35, -59, -123, 96, 153, 5, 34, -2, 44, -60, 46, -28, -29, -36, 30, 40, 31, -31, -58, 19, 5, -7, -9, 22, -49, -23, 68, -44, -18, -58, -8, -18, 59, -29, 48, 2, 69, 48, -7, 122, 17, -7, 44, 158, -55, -37, 23, 3, 23, 21, -32, 14, 3, 1, -1, -29, 67, 59, 26, -16, -87, 58, 34, -105, -11, -38, 30, 7, -62, -5, 36, 10, 11, -20, -45, -21, -32, 44, 34, -5]
6839eK2LM6j25R8J8n6K5l8J8q0P6o5M2K3k5m7J51o4o1L2k4O4J4L9j13m8J41l5
6868B6o2R0l6l8J8o8P5o1P4pl9Q4l5J1m4L2j4lm8M4j9NM8q1Q2j0k6O3p3n1J04
6899D1n9nrJ08q1OJ9l1J3%%k6M1m9rO0ro3N8L7o0k2K5Ok1O3r5N7J5O9n8o2L3n
6933a3O7k6j5k0J5l1QN9o0PJ7J2k1oMj0K8J5n6PM6l6N1mo9P9p0J2k1N1Jl9N2l1
6967CL3m5K3n0kL5L3k4N3m4n3L9P6n9m5O9r0K9Q8k7q5M5oj8N8l4m0L7K7k8L9K1
6999E8n8k6N2J0l3mMn8N9J3m1K8J8l7J2L1n3l4K4M7m5k4J15n9K0K4l8m1L5rk6
7030c6O3l0j3oL6l4N8m1j1K8j9K7m4K4k2n5J02n9K4O1j3o0J4L2r2L5J7Pl2M1k9
7061b7J5L7k3rJ4L0j8r2J06j7jJ3o5N9l3L9k3j2K1J6n5O3Pm6N3m1oJ4m6j8J2m
$$ y = [-5, 17, 20, 66, -59, 39, 57, 1, 26, -12, 6, -74, 2, -63, -21, 2, -23, -70, 81, 17, -44, -12, -36, 28, 42, 81, -32, -80, 61, 26, -36, 54, 18, -20, -2, -70, 5, -56, 18, 11, -28, 56, 21, 32, -12, 20, 6, 3, -45, -1, -20, -15, 33, -48, 34, 24, -2, 61, -12, -63, 41, -18, -23, -32, 76, -5, 1, 20, -11, 2, 2, 2, -24, 17, -32, -41, 19, 10, -53, 5, 42, -18, -40, -15, -9, -30, 33, -62, -5, 10, 79, 21, -41, -8, -13, 54, 28, 13, -7, 8, -23, -15, 44, -16, -9, 8, 20, -1, -7, -3, -13, 15, 30, -26, -19, 27, -9, 42, 38, -31, 48, -22, -10, -31, 20, 21, -18, 34, 3, 36, -9, 14, -36, -38, -3, 30, 6, 59, 15, -38, 1, 77, 18, -27, 42, -48, -19, 69, 42, -43, 2, -4, -22, 36, 2, -38, -1, 26, -2, 37, 58, 0, -26, 26, 36, 3, -1, 3, -55, 4, 17, -24, 4, 22, -15, -3, 28, -25, -59, -35, 12, -33, -57, 58, -1, 19, 43, 5, -36, -1, -10, -36, 27, -3, -16, -22, 14, -20, 38, -3, -14, 14, -5, 22, -22, 2, -20, -75, 27, -32, -8, 53, 40, -20, -6, 26, -66, -31, -14, -7, -39, 2, -27, -12, 25, 2, -7, 7, 37, 19, -73, 33, 16, 15, 28, -37, 22, -11, 28, 5, -7, 14, 30, -25, 38, 45, -1, 52, 11, 5, 19, -27, -45, -33, -37]
7093c7K5K0k2n1L5P9k7K3n1l0Rm5N8k3R0p8MjO3p9K5o5L5J4L5kL2k7M4o2qJ3l9
7126d3K0MM5lr5R8j2k9j2J6M2n8L5jl1J1M2qj16Q2Mq1Q5p7R1M1k5j9%rK4j0l9
7159b8J0k9J11o7Np6Q9m7J26r6Rj5MQ%J6pj1K2k3j3N2%k7o4Q1m3N2J6o2jj6J0
7192a4N3Jn9m5jJ11j9j8j9M5j24Q1m9rK7N9Rn6N7o7o5R8qK9k3K0j8l7N5j9j0J4
7224aL9l3p0O7oMJ5k7M9mo6J6M8n2L8l1m2Q4RJ7r3O4J9l9LJ9q5N5O5q8L2P8p2
7257A2J5o7%L0N5J5o2MM6j2Pm1p1M8J48q5l6j6p2O8jj6K1K8l5k8N6Kp3J10k9j7
7289Do4O3p7P4j4J4P2jr4k5N2m3j4M6K7o3Q1mJr0P6m4M0jj7JoL0OQJj06P2J5l9
7324a9J2K0J5l6JL0j5l1N7l3k8N5Km3R3j06l4M9k9O4k7N0p0k4J01l7j1M8n2j2
$$ y = [-37, -12, 8, -14, -65, -30, 49, 22, 45, -6, -36, -27, -72, -14, -37, 53, -25, -21, -22, 41, -38, -13, -78, -43, -29, 6, 4, 36, 9, 53, -9, -17, -4, -43, -23, -19, 26, 23, -72, 26, 14, -15, -27, -11, 31, -27, 8, 7, -24, -13, 29, 21, -95, -13, -9, -90, -5, -82, 9, 50, 25, 6, 6, -3, 21, 11, -28, -18, -47, 64, -3, 2, -74, 15, -32, 94, -2, 7, -8, -4, 4, 4, 20, 13, 2, 24, 1, -12, 40, 40, 13, -51, 30, -13, 39, 55, -7, -8, -24, -14, 39, 40, -19, -64, -65, 46, 27, 9, -10, 35, -89, -8, -57, -66, -39, 20, 29, -27, 30, -37, -102, -4, -12, 17, -6, 14, -4, -41, 14, -5, -15, -1, 38, 5, -65, 2, -4, 0, 15, -12, 37, 33, -33, -17, 31, -21, 17, -14, -56, 28, 37, 54, -39, 25, 44, 5, 8, 27, -58, -3, 62, -26, 6, 84, 12, 27, -40, -40, -10, 45, 60, -2, 2, 48, 36, 43, 2, -69, -21, 127, 42, 6, -10, -82, -14, -15, -31, -10, 18, -17, -45, 11, 13, -60, 50, 21, 4, -60, 3, -74, 0, -14, 0, 72, 71, -23, -48, 4, -39, -53, -7, 20, -43, 38, 34, 35, -55, 21, -23, 17, 16, -1, 0, -6, 24, 30, 38, 39, -67, 5, 20, -19, -7, 13, 28, -8, -7, 23, 8, -23, 34, 1, -27, 28, 30, -13, 80, -26, -60, -11, -40, 24, -3, 47, -23, -47, 54, 17, 6, 54, 2, -10]
7354a0M7l4l7Q0J3n3n5l0J1L4M8j4J3P0o6j38J62j08N6l0J32j42Q7l0n1M4j9j1
7382c1OO9lj16J04Jp6LM0M2Ln2pO2o5J8LJ6Om1L0K9o8O0j5KK1No5J5M6j1k3%L6
7417D4j20M5K5Pk1L8L0j0K4n4q0P8pL9JLm7m6Q8j29O0K1k0oP6p3L6j3NpKoj9K4
7451a2P6q5R2k7k7r7J20m2l4N4K5n2N1n1j7mO5j03N1M0q2M7J5K2k7nNl0N9k4J5
7482A8r8J03o8M3l4O1q1P7n3J2K9Nl5j1L0m5M3L4qm4K8lj1M4o4J8N5k8k5L8o8
7513c8L6l6J0k4K3M9K1n5J4k2kP3k8k1j4Q5p7m2P5o7M7nM7p0l0K8Oj1K5QjK4n3
7546b5%M3l5k7O0M6q6M7j1j6L0J3j10M8M8m0Qj0j4NL1J0l1kJ6K9k5J4pL6o0j0
7578b5j0j2O3Nl4m7L7K6m2O2J5j6m1J0LRJ5q8N5j1N0Qr1P9Ml0O0o3L8%o8k1R2
$$ y = [-10, 37, 3, -34, 46, 59, 6, -49, -79, -68, -34, 14, 0, 13, 83, 17, -121, 41, -67, -11, -41, 91, -51, 36, 6, -45, -1, -20, -31, -25, 44, 41, -75, 29, 30, -46, -43, -3, 39, 42, -10, -17, 45, -20, -2, 1, 17, 23, -18, 12, 41, -27, 33, 18, 20, 41, 46, -19, -4, 42, 31, 8, 8, 44, -76, -31, -6, 1, -20, 18, 48, 38, 62, 8, -72, 6, -1, 38, 39, 42, -5, -51, 37, -92, -32, -11, -31, -37, 39, -34, 2, -11, -6, -13, -11, -17, -36, -12, 64, -21, 71, 44, 17, -80, 40, -2, -36, 18, 43, -9, 42, -9, -26, -30, 35, -68, -17, 23, -59, -12, 3, 25, -2, -7, -2, -32, 27, 3, 18, -80, 23, -45, -2, -36, 25, -56, 21, -32, -20, 9, 14, -21, -32, -2, -47, -4, 30, 22, -22, 6, 3, -8, 36, -28, -10, 45, 17, -8, 30, -38, -2, -38, -28, -52, -29, 20, 41, -14, 0, -22, -24, 49, 21, 0, -14, 71, -6, -48, 27, -40, 7, 2, 49, -21, -51, -23, -17, -28, -3, 5, 4, 28, -25, -25, 18, -17, -44, 16, 62, -24, 23, 12, -4, 26, 39, -71, -23, 25, -15, -7, -17, -31, -26, 5, 15, -16, -18, -2, 27, 2, 16, 9, 45, -15, -25, -35, -47, 16, 21, -13, -60, -23, 3, -39, 23, 38, 22, -19, -9, -6, 3, 18, -70, -15, -26, 24, 32, -59, 20, 24, -6, 54, -9, 29, 29, -39, -60, 32]
7611C2%N0j01P2o0K4m9P0k5K7j2j6KK6j7Qn8k2P5j6Rn9L6J3Jo2K0M3N9j0J0j46
7643g6RK6J4M6k8PL0olj11J48p3j1N0j9k2MJ7q2j6P1k6N0r2J21m4k7R1j43R2Q
7674Eo0N4j8o7L5j3M2R4j06M5l6l3O7P9o2Ml6J13o8MkM2n5l4J09n3M1n1QL4n9
7705B3L9J5n5l6l8qP5M0m9l4J15j65J26l2l0J5p5O3%M9No6L8j33J51N2j5Q9j78
7734a9J50k07Q4o2J25q8k8k5J16j88Q9P7NJ04j37qK0l7M8r1J01K1K9r0P3j7mo1
7762b0l9J1l0R9Pr3lR6J0j7o0R1l2M2q7N8q1R3NM5j16Qp9K02m5n3O1j16Q3k7q6
7793g3K26j60K3K1m7J11q5l7o1J59o8N2k7n2j8N5Lr9J52j16%N2P0o4j3K4j3M9
7821F4p2J07j04p3P3K5P8l8l2l3O9k8l2r1NJ00m0j43J75L0j03M8O5j1Lj3o9J4
$$ y = [32, 32, 82, -19, 53, -7, 17, -32, 38, 13, 40, 28, 12, 14, 40, 23, 31, -27, -49, 26, 10, 19, -40, -4, 9, 10, -52, -32, 11, 70, 60, 70, -76, -67, -41, -27, 19, -9, -2, 28, 22, 19, -92, 56, -17, -28, 22, 3, -19, -15, 2, -80, -96, -25, -51, -1, -93, 28, -16, -43, 48, -95, -3, 5, -55, -1, -19, -86, -51, -64, -22, 72, -34, 11, -25, -58, 9, 88, 26, 30, -6, 107, 39, 43, 41, 83, 28, -6, 103, 50, 91, 40, 48, 82, 23, 62, 77, 22, -14, -52, -60, 15, 55, 6, -28, 87, -78, 48, 16, -14, 1, -74, -11, -11, 38, 43, -23, 15, -118, 33, 85, 70, 159, -19, 131, -76, 8, -54, 71, -17, -45, -70, 46, -142, -53, 24, 29, 133, -4, -12, 8, -29, 19, -72, 29, 50, 79, -11, 62, 45, 41, -20, -59, -48, -78, 21, 28, -65, -68, 28, 38, 21, -39, 52, 20, 62, -25, 33, -48, 45, 50, 95, -21, -13, -92, 110, 65, 12, 73, -43, 40, 13, -73, 153, -7, 16, 37, -10, 101, 16, -21, -82, 77, 9, 61, 34, -18, -36, 19, 22, -77, 75, -41, -41, 11, 81, 17, 4, 28, 15, 64, -8, 99, -5, -78, -5, 20, 98, 60, 28, -5, 64, 36, 4, -87, -82, 18, -22, -165, 10, 40, -63, -15, 50, 39, 42, 29, -40, -26]
7849b6mK0Q1K1p7N3o5nJ72k09J40j93K3J53r4Q4p3J7m8k9JO1l6J26j29Q5J4m6
7877A7K7m6mL5l1J4k1K1J1j0Lj0l5L9k9j0K0j8J2L2nj0k4N8l8j9n8J12o1l3L6
7908b5NK2Lk6J6m0LJ2rj3Q3l5L1k7j2PN2p0L6j8RmrK0l1M4m3R7m4l1j6j9M5k2
7942il7kNL5K6j9j1L1q3P5L9n8qO6n2k3j3J03l3Pn3J2NM9l5l6N0k3j8k9L7kJ3
7975IJ3k5J1m7N0n2K2Rj8K4m3PQ3r6N7K3Kp9O0N2r0K4j5kO0k9o2O0m5J9K3P4q1
8008bo3J48q5M1j3J8o9J9RrK1m6O0rm9M1K2moo3M8k2k4O9m8O2k7jl3M8k8n9R4
8041D0j2ol7j6P5J6q1P3MLMp4J7N1o4m4J16k7o6M7m7MM5l2LKMK3J5M5j4o5J8O
8075B6k4j6n7J0O8k1lJnp3J97j04Pj05J44o0o5R2n1m8R1j2k0L6oj5l4N3J9M5k1
$$ y = [-26, -30, -10, 71, 92, 15, 68, 3, -2, 170, -39, 101, -92, -69, 84, -10, 74, 1, 18, -30, -59, -58, 3, -33, 93, -36, 49, 63, 17, 44, -2, -6, 29, -2, 12, -9, 12, 23, 13, 16, 6, -29, 10, -19, -29, -9, -27, -15, 17, 12, 2, -22, 36, -2, -21, -79, 33, -28, -61, -25, -20, 2, 5, -21, -5, -45, -42, -30, -39, -52, 31, -4, 27, 0, -12, -5, 47, -23, 13, -5, 4, 0, -9, 11, -20, 24, -19, 78, 34, 3, -13, -32, 13, -9, -46, -48, -43, -8, 18, -1, -12, 19, -64, 11, 50, -8, -16, 50, -2, -25, -38, 65, 32, 39, -14, -2, 3, 52, 17, -19, 31, 8, -10, -39, -2, -4, 9, 22, -3, 8, -39, 11, -41, -19, -10, -28, -4, -47, -40, 43, -53, 4, 27, 29, -50, 10, 62, -28, -4, -19, -21, 39, 10, -52, 8, -37, -18, 5, 79, -2, -65, 83, -2, 39, 26, 44, -25, -6, 3, -6, 15, -31, 29, 20, -29, 12, 34, 30, 24, -39, 9, -13, -37, 32, -16, 46, 19, 18, -15, 33, 5, -54, 40, 28, 22, -15, -31, 44, 60, -21, 52, 56, 59, 63, -11, 6, 57, -7, -51, 65, 38, -28, 19, -28, -24, 21, -11, -8, -6, -2, 21, 36, 81, 67, 2, 20, 26, 2, -14, -71, -61, 7, -14, -17, -16, -21, -94, 103, -1, 6, -99, 45, -15, -80, 12, -39, -87, 4, -8, -28, 8, 2, -13, -47, 6, 25, 70, 49]
8106D9o0p9J4J3J86q4M5r3n8R7L7j06r2J18O4p2R7n5Ln5L6lJ3l4R2l6jj22N5J02
8136G1j21K2k7P1p8M6nJ9J1L6q7Q0q7j3J11m5J13r6N4n6o4J11j20Q0m3j9P1oJ3
8165D2k4P2n8ooM8n1N6j24J45p6l1m4O7RKJ7%p8J11j17o1P6l7R8j07
$$ y = [49, -11, -90, -76, -63, 123, 39, 84, -9, -67, 30, 67, -39, -131, -13, 51, -21, 76, 21, 24, -31, 5, 2, 15, -19, 73, 37, 36, -86, -31, 71, -50, -28, -55, 16, -62, -16, -21, -2, 9, 45, -42, 38, -49, -62, 49, 4, 117, 21, 75, 19, -45, 66, -54, 26, -17, -36, 35, 29, 42, 18, 90, 32, 26, 20, 68, 17, 73, -51, 94, 18, -13, -57, 10, 19, 21, 38, 38, -40, 71, -46, -107, -31, -68, 30, -77]
8191g7
$$ Imaginary data points
##PAGE= N=2
##DATA TABLE= (X++(I..I)), XYDATA
0@%%%%%%%%%%%jRj6J6j6K4l2M0m9N7p2Q8j04J20j39J63j92K24k56K89l29L77m28
34b27M84n46O13o88P71q62R62j069J188j317J456j610J778j963K164k384K627
51A377k894L188l514L880m292M754n281N891o602P444q462R721j1323J3443j6393
66i063K0806k8217M3706j29671J85236R6769l32381K10685N7053l23462J40760
77f7779L07313k89743p4535K61401j73353j35832L50344o1647l23201J94972J35541
88A23481k40892J35283J76979l04609n3640K91155j08866j09216K32609r8873
98D3411k51795K26927J29563k23874O2424J25301k16718J5157K43769j26852j38346
109a11033J68396m1533j32555J92822N2891k29893L6415J34180j10350K0885J43824
$$ y = [0, 0, 0, 0, 0, 0, 0, 0, 0, 0, 0, 0, -1, 8, -8, 8, -8, 16, -16, 24, -25, 32, -40, 48, -56, 64, -75, 88, -104, 120, -136, 153, -176, 201, -227, 257, -289, 324, -364, 407, -455, 507, -562, 626, -691, 765, -845, 933, -1030, 1134, -1250, 1377, -1517, 1671, -1843, 2037, -2255, 2499, -2782, 3109, -3493, 3951, -4511, 5210, -6113, 7330, -9063, 11743, -16474, 27232, -102439, 82797, 179566, -152815, 57870, 114923, -208539, -67779, 239534, -50209, -124744, 136657, -36696, -172528, 177816, 116169, -207032, -12060, 123481, -117411, 17872, 194851, -109758, -163398, 127757, 18891, -90325, 142284, 43411, -208384, 18543, 148106, -75768, -13344, 111957, -104761, -89604, 154165, 27313, -111033, 57363, 15830, -116725, 76097, 128988, -100905, -64490, 69690, -40660, -19775, 124049]
120A24049j32961j09354J48439J0745q9947R8234Q997j51384N4102J21352q1130
131A142l4770P0597n8865l9246J10904O624r5677K0982K7688m8986M0907O8334
143F9634o5694n8428M6945J5415j9203L3907N811n9195k683N1701l337k2909J7367
156I331j0989l5947L6163M7574m3171l5797L4739m141k2093N2048J1167p3087
168c4203N763N1028l3258n09N8625m8362n7185P4700J9312o9243L8037L4975q2019
181d2339J5600Q6199n9587m2561P7571l0274o1809R3611J8304j08781L9050O5786
193E0770q7021J0103R7816p6898n6985J03671j8995q0910Q9497J9275j15847N3518
205a2006Q2967j01793o957J01263p4388n3154J17369j9238r8371Q2982K7833j09291
$$ y = [124049, -8912, -118266, 30173, 40918, -49029, 49205, 58202, -93182, -39080, 82272, 1142, -33628, 36969, -21896, -61142, 49762, 56386, -39291, -18309, 9379, -39607, 1300, 69634, 3940, -54488, -7543, 7872, -11331, 22576, 28387, -30808, -33491, 18210, 14873, -8036, 9331, -1658, -37605, -1442, 46132, 2961, -32836, 1903, -2238, -24331, 27717, 38884, -34203, -28440, 22588, -10670, -11179, 47446, -916, -58101, 16599, 35911, -33332, 4705, 39680, -42339, -26739, 59460, -127, -42688, 34883, 4609, -57200, 36411, 54715, -54066, -15016, 50770, -36251, -26148, 71668, -5230, -62215, 41456, 22461, -58449, 31048, 50323, -65524, -12006, 70961, -30832, -37789, 63474, -10914, -64068, 53301, 34063, -64308, 18674, 46507, -62784]
217f2784N4717Q2584j07740j2805J07041o5576n6612J10593j8932r9213Q3101
228A4374L7843j05942M1832P6825j00522j1365J08772n8926o3014J00342j2415
239B7804r3469P7828M1769j01925K9890P5789q6404j4533R9656n1612o3779R1635
251C2649j633q7252O3367M2510r1684K0046P5104p0280k3127Q5877l7516o0743
263e2682P8212Q486q0439M5744M6083p6018O887O9942n2981l1670P2611j9457
275A4718n8194N9583J8251p0521K8349M9515o0175q043O3936l4372l9113N9558
287B3492j891n7196M0484K9164o0142J1424N2738m5743k2364N8789j7143m6441
299c4829M8087J4193n6923K3939L9763n1642n106N5582l1924l4294N4942k415
$$ y = [-62784, -8067, 74517, -33223, -46028, 61013, -4563, -61175, 49418, 30486, -68727, 14374, 52217, -53725, -11893, 64932, -35590, -46955, 61817, 2891, -60123, 40219, 27804, -65665, 12163, 53932, -47993, -18103, 57686, -28718, -43251, 56405, 4793, -58986, 32649, 31016, -56236, 7131, 49641, -42043, -21997, 53107, -17173, -40300, 45577, 8061, -52682, 25530, 34016, -46423, -679, 45404, -30614, -23727, 46215, -6766, -38436, 34175, 14718, -43476, 16107, 34358, -36163, -7814, 41701, -18474, -26517, 37419, 3047, -36066, 23492, 21601, -35595, 4889, 34053, -26089, -14665, 38073, -7670, -30034, 28755, 11612, -34829, 13258, 27451, -29472, -5533, 34230, -17412, -22518, 33064, 1140, -33154, 21788, 19373]
311A9373n4001L7356K8532n5801R933M9179m3750k0061N6928j9267m4305N0190
323A4306J1274n7781K7071L8991n4105k906N6097l4327l1466N6033p798n1716
335c6327M2796K2510n7847J7658M6829m8996j4264N7519k5479l9606N3274L864
347B1931n4841L3880L0652n5872P390N1340m1449k2333N7195j6582m6303M7110
359A2118J3490n5463K5823L8292n1780k913N2999l4068k9819N5148o668m9965
371c2806M0614K1592n5881J6092M4536m5563j2019N4052k5536l7402N0373K879
383B0931n2053L3158L0070n3334N803M8078l9140k1227N3655j4861m2550M3929
395A2459J1535n2975K3862L6906m8181l363N0545l1480k9708N0427n315m6014
$$ y = [19373, -34628, 2728, 31260, -24541, -14608, 34571, -9179, -29240, 27688, 8421, -35884, 14306, 25580, -32201, -5130, 33861, -20244, -23150, 32947, -1380, -32846, 23187, 15389, -36327, 6469, 28979, -28868, -11210, 35619, -13377, -27641, 29878, 4399, -35207, 18067, 21931, -32910, 970, 31622, -24250, -16860, 34480, -6969, -29302, 27893, 11311, -34992, 12118, 25608, -29855, -4032, 34260, -17520, -20433, 32566, -1502, -31321, 23827, 17159, -32806, 7808, 29400, -26481, -10389, 34147, -11416, -23435, 30617, 5081, -32321, 18052, 20931, -31122, 2036, 32106, -21228, -15425, 32653, -6487, -27714, 25941, 11080, -31470, 12459, 23994, -28981, -5119, 31787, -16394, -19757, 30788, -692, -30400, 20027, 14712, -31302]
407c1302L7515K0553n1513J4258M1151m3134j2006N1417k2571l5040M6805K522
419A8655m9268L0063K7991m8310O901M4380l8027j9594N0668j5176l9243M3037
431A2077R719m9774K4170L2847m6190q03M6081l1253k3619M8742r465m2670L7346
444G208J5704m7080J8682L5251m2574p265M5207k3873k6439M3631l758m1771L1147
457D070J9898m2893J0731L4321l5198j0208M2362j6928k9257L4695K485l6238
469b2160K4386K1828l7727K029L2111k4771j2583L5568j0406k9543K6712R843
481A5287l0470J3380K0810k9399l250L1004j4436j8213K4957k203k5715J9739
493A491J6262k6694Q1K1374j7369q475K7161n913k4513J6678J0499k1475P751
$$ y = [-31302, 6213, 26766, -24747, -10489, 30662, -12472, -24478, 26939, 4368, -30672, 16133, 18655, -30613, -550, 27441, -20869, -13968, 30412, -7615, -27209, 23459, 8283, -30960, 12077, 21796, -27978, -3808, 29039, -17151, -17954, 28127, -3126, -26745, 21997, 12532, -30138, 7208, 22912, -24168, -5486, 29765, -12809, -20074, 25133, 1260, -25179, 18452, 14694, -27077, 4070, 23968, -18925, -8194, 26127, -9071, -19279, 23083, 6155, -23102, 11593, 14078, -22160, 2226, 24054, -13673, -11644, 20467, -4304, -16887, 18681, 8275, -21268, 5444, 15287, -15183, -1803, 19007, -10392, -13642, 17362, 2926, -15287, 9670, 7467, -18248, 1491, 17753, -8941, -8860, 12514, -4855, -13330, 13831, 7918, -16595, 83, 10582, -10893, -3142]
506c142J9229k2383r838K6535m201j8925J8346L546k6540J2345K3499k2274q190
519a1993K3569j3287j6505L0134L092l2274J3190J8202k6238N121K9466k5828
531c351j8617L4145l229k6377K7022O736l9613J5864L2406l1210o470L3208k4792
544d278k0993M4215j122m0324K5307J4958m0220J8274L6650m1680j3311M3476
556B0952j9548k3914M5058o474m8230L2877K4951m3469J3488L4191m6261r267
568b5646N3954k0717l2124M2107o577m4428M0200K4613n1572R277L5877m0485
580a5521l540N1488k8176l5335M3943n19l8157L6433J5362n2458J2933L9470l4598
593h675n558M0146k9519k7081M6324O81l7421K6393J0589m0897J8538L4339l4910
$$ y = [-3142, 16087, -6296, -16134, 10401, 6200, -12725, 5621, 9167, -17373, -5028, 18471, -3803, -11993, 11576, -1711, -18216, 11918, 15010, -17264, -4074, 14128, -12110, -6989, 22477, -3351, -21968, 12177, 8948, -17429, 9593, 16329, -23284, -7420, 24986, -6224, -12694, 20514, -4278, -25271, 18944, 17822, -22502, 2805, 17763, -22457, -4183, 32467, -9213, -22524, 20952, 1404, -22510, 22548, 16074, -32156, 721, 25672, -17797, -4309, 29882, -16379, -25646, 28308, 7591, -24533, 17574, 10997, -33431, 6769, 31382, -20190, -10913, 24964, -15521, -19061, 32427, 4251, -31084, 12859, 12340, -25817, 10616, 25978, -26480, -13547, 25923, -8675, -14233, 25913, -3606, -30687, 15637, 16318, -21103, 5290, 15879, -25018, -6480, 27859, -7051]
606g051r563L2727k0298j5715L8773n952l5249K2121J2948k7250J4835K0685l1882
619a0871n420K9892j1709j2386K3326q437k3491K1204J1991k0638N272J0675j8721
632i313J205K1531r015j2535J1196j961q969J2938N041j4587p89Q000l176M38
646DO485n113p655M282N917j299j786J93k564k724N282N910o065n653N414k00
662D28l881Q264J408j3438K620J1042p916j680J1652r866j0583J7125K393j5909
676h341R871O203j9194O751J8884j7153p450K0001r980j3738K3969N2k5685J5192
690f18J2972k4320P512K1990k4627q156K9350j1454j8799K6992j493k9479K1416
703A286J6325l0890O784K4943k7142o605L4004j5179k2874K9974k75l0396K3827
$$ y = [-7051, -16614, 16113, -4185, -19900, 18873, 12921, -22328, -207, 12741, -14509, 326, 21011, -10871, -16291, 13601, 1892, -10494, 12832, 4395, -19096, 2108, 14099, -6539, -1267, 9408, -9313, -8108, 13423, 4408, -8127, 3069, 1108, -7861, 5077, 10118, -4469, -5258, 2742, -434, 4, 6489, 1376, -6279, -1997, 3920, 2621, 835, 1028, -1536, -4260, 1022, 6932, 867, -4786, 628, 428, -3453, 4811, 6219, -7219, -4599, 6443, -1473, -3153, 8499, -1367, -11950, 5175, 7568, -8341, 1530, 7733, -11461, -4710, 14174, -2979, -10429, 9572, -408, -14146, 9823, 9875, -15810, -618, 12354, -11966, -4454, 17536, -7091, -15247, 14103, 2649, -16150, 10842, 9349, -20130, 1286, 17611, -13279, -6495, 18448, -8694, -15299, 18705, 3526, -19348, 10626, 10351, -20045, 3782]
716C782J5720l4944P283K8308k7329p156L4040j7102k3709L2509J151l1646K2676
729C583J5224l5075Q654K9443k7989q669L3290j6166k2484L2708K89l2231K1755
742B332J5781l3116Q183K7977k7777q966L2883j4339k1617L0025L38l0703K0411
755A412J5965l0905O368K5753k4810q514L0502j2513k0935K6525J558k7376J7556
768E86J5087k7468L964K3715k0457q819K6313r432j9400K2133L643k3809J3004
781i40J4232k2387J137K1153j5298j0031K1583n057j7506J6898N798k0203P813
794b808J4318j7107k180J8253r956j1305J7347o12j6265J1515Q224j6714L084
807d206J4400j2349n828J5939m795j2488J3133L661j5339O525J0806j3538j632
$$ y = [3782, 19502, -15442, -8159, 20149, -7180, -14336, 19704, 2602, -21107, 11402, 12553, -19093, 3583, 18807, -16268, -7614, 21829, -6160, -14829, 18461, 2295, -20189, 12519, 12808, -19423, 2332, 18113, -15003, -6820, 21157, -6620, -15586, 17297, 2958, -18659, 11366, 11704, -18999, 1412, 17377, -13528, -7160, 18593, -6217, -14731, 15771, 3258, -17677, 8848, 10406, -16970, 586, 15673, -11795, -7831, 15884, -4573, -13392, 12921, 3489, -15911, 6222, 9865, -13944, -940, 13292, -9095, -7958, 13195, -2103, -12134, 9449, 4392, -13114, 3784, 9582, -10621, -2808, 11510, -5597, -7777, 10476, 520, -10785, 6562, 5950, -10315, 1200, 9424, -7290, -4206, 10194, -2155, -7983, 7956, 3161, -9327, 3806, 7467, -7872, -1347, 9459, -4079, -5711]
820e711J4523p928r272J3980l6j3866R384P609j4495J978J3216j0924n912J4668
834G214l983j2035J2088M031j4877N836J0836j3240j996J4801q281r334J4407
847E467m28j4067R932P359j5119K859J3206j1968n095J5393n544j1607J3553K360
861F301j5319Q004R759j4677K66J4557j0297p511J5435l084j3280J2362M769j5604
875h319N865J1594j3727k126J5289q400r417J4899p24j4373J0611P042j5297L663
889c420J2718j2283m182J5106o101j0806J3509J506j4351Q354Q674j4221J153
902d344J3275j0147o181J4336l530j1805J1634L776j4129N828J0059j2626j313
915e167J3331p744p963J3109j073j2255R376N677j3257L283J0930j0723l500J2942
$$ y = [-5711, 8812, 884, -8388, 5592, 5556, -8310, 1074, 8683, -5812, -3834, 9382, -1542, -7454, 7214, 3231, -8804, 3284, 7315, -7562, -1726, 9110, -4130, -6126, 8675, 394, -8940, 5467, 5039, -9028, 904, 8263, -6856, -3997, 9209, -2759, -7854, 7539, 1995, -9612, 3941, 6301, -9018, -1014, 8745, -5932, -5666, 8891, -1406, -8917, 6518, 3434, -9846, 2516, 7285, -8319, -2454, 9140, -4587, -6713, 8576, 176, -9241, 5658, 4934, -9439, 1172, 8214, -7083, -3420, 9298, -2985, -7167, 7939, 1838, -8968, 4541, 6047, -8304, 50, 8724, -5497, -4344, 8931, -1216, -7397, 6939, 3409, -8396, 3238, 7014, -7115, -1287, 8772, -3854, -5167, 8164, 420, -7543, 5566, 4493, -7762, 1614, 7291, -5966, -2683, 8247, -2476, -5976, 6966]
929F966n349r273J1543J217j2320P105P360j2090P42J1431q553n510J2205k881
943B593j0231R810L427j2011M677Q643j0519j525J1457o236p110J0952m57j0499
957g029P528N396j1093K099R543q439l769J0960l602q421R165K196j0463M901
971a028P058r481o22R819n776n851R713o32r287O823M809r803J821Q517p540l470
987d930R990l026p934Q266K442r862M209P242r213j102R940n422o334R800k20
1002C846r872O839N589j0631J455R719q292m166J1395l429r407R794K626j1715
1016f249N426Q381j1460r22J2122p421p094J2662j692j2092R906N508j3695M067
1030b553J0869j2059k921J4522o829r933J3695M6j4116J0209P601j5611K840J3325
$$ y = [6966, 1617, -7656, 3887, 5104, -7216, -111, 7249, -4841, -4099, 7332, -1221, -6731, 5474, 2593, -7638, 2172, 5599, -6412, -1735, 6908, -3611, -5136, 6321, 85, -7025, 3927, 3470, -7029, 499, 5895, -5198, -3099, 6444, -1995, -5764, 5196, 1594, -6827, 2338, 4534, -5929, -1028, 6030, -3451, -4073, 5746, -30, -5881, 3832, 3200, -6087, 736, 5545, -4258, -2437, 6080, -1460, -4930, 5060, 2034, -5900, 2366, 4808, -5054, -845, 6397, -2816, -3918, 6022, 600, -5734, 4066, 3846, -6026, 813, 6402, -4229, -2774, 6945, -1347, -5513, 5882, 2453, -6954, 2840, 5466, -6249, -823, 7558, -3902, -4824, 7298, -123, -7217, 5445, 3753, -8339, 1567, 7075, -6620, -2553, 8316, -3743, -6664, 7858, 1029, -8904, 4791, 4837, -9279, 930, 8531, -7080, -4240, 9085]
1044I085j2425m347J6243p060j1995J5122J456j5790J0290Q615j7028K773J5485
1057A0424j3176n583J7117p201j2708J6607J779j7401J0403R328j7523L528J5933
1070A1527j4313o289J7904o894j2436J6863R12j8123J1023R820j7014L412J4814
1083A1206j4735n298J8178o720j2082J5338J17j6426J1630Q945j6649K838J3013
1096I355j3136l276J6632p510j1195J3822J12j3161J0632O246j5417L336J1602
1109H042j0833k059J2677p836q490J2678J19j0506Q008L295j1816M475R379r052
1123a919k144Q649n879m359J0026j053q634N323K486o630M105M979p402j401O157
1138B304k452j826M886k325m766L722K525k687Q92O72l260N00L438k10j639l36
$$ y = [9085, -3340, -7687, 8556, 1496, -10499, 4623, 6079, -9711, 579, 9194, -7834, -5061, 10424, -2752, -8335, 8782, 1581, -11127, 5480, 7259, -10142, 261, 9589, -7934, -4406, 11527, -2786, -9075, 8829, 1935, -10501, 6362, 7274, -10849, 174, 9994, -7020, -3608, 11206, -3529, -8827, 9351, 2631, -9451, 5887, 6004, -10422, 1208, 10153, -6496, -3658, 9355, -3781, -7057, 9575, 2065, -9130, 4692, 4804, -8357, 2275, 8521, -6896, -3560, 8042, -2791, -4850, 7827, -9, -8499, 4179, 4298, -6208, 1800, 5095, -6721, -2246, 7133, -1919, -4063, 4586, -1293, -5652, 4374, 3321, -5313, 10, 2496, -4134, -29, 4950, -2452, -3853, 2304, -148, -1974, 2912, 587, -4179, -457, 2068, -619, 273, 945, -2315, -1815, 1623, 1413, -226, -562]
1154e62n71L28J202J134n37k230p37K648P26j218R90j003l197K892L636l473j072
1171a044K837l508o32O512j659n968L928J343n082M745L961q626l05P419m408
1186d87j967P876m717p446Q882K423q485N073L753j0707K747J0688q211m154R685
1201D953n378o548J1984O26j2558O538N577j1017M506J0115j1918l932J2668n147
1215D69o807J2083k073j3284R877O643j2376M033Q927j2622j384J4535o990q150
1229g119J1842k432j1138J1446N067j4180M145R022j1331M23J2978r102p775J2932
1243D778j986r641J0498K323j3678N901R502j1009k3J0727r189n389J3239k664
1257C389r843R414J329j1093O986P372j0996k00R455p373l259J0843l812q560
$$ y = [-562, -1133, -805, 397, 1531, 994, -1236, -1973, 675, 1401, 183, 1173, 170, -3027, -135, 3501, 28, -1044, 1793, -1715, -2347, 4165, 2506, -3462, 466, 1809, -3273, 1472, 5433, -3193, -3498, 3921, -487, -2454, 5422, 705, -6741, 2141, 4564, -3921, 1152, 4905, -5802, -3055, 7633, -578, -4732, 4953, -425, -6973, 5011, 5637, -6921, -383, 5194, -5823, -1317, 8798, -3120, -7052, 5616, 469, -6338, 5745, 3672, -9612, 265, 6908, -5468, -1435, 7492, -5130, -6514, 8021, 1031, -7119, 4723, 2291, -8847, 2599, 7666, -6514, -2369, 6653, -4678, -4255, 8723, -379, -8154, 4778, 2792, -6849, 3649, 5972, -7706, -1805, 7697, -3312, -3335, 7392, -1797, -7186, 6053, 3389, -6454, 2960, 4289, -6804, 182, 7554, -3442, -3642, 5813, -1560, -4819, 6024, 2212, -6348]
1271f348Q722J412q635N900M631r888J091Q425o086k628P812l825n863P570J076
1286C366p040L878L182o651J633N779m835k297N438k287l440N206J34n054K563
1301d25K418l825J124K924l287j092L389r00j904K216n7k341J327J539j577k19
1317f90J020p06n30J155K84j058j69P78j5n80O35M20j274l2J624p08j164J591
1335E81P9k037J564J418k617L04K455k060j113L283j045k845L127O42l706K164
1351A94K332m014L19L968l140j793M549j417l868M169R66m896K619K977m794L53
1367a476M767l856k156N468j689m383M802R61n526L025L393n467L16N219m066
1382f68k300N713j783m591M943J066n603K846L626n562K69N305l921k537N617
$$ y = [-6348, 2374, 3786, -4849, 1051, 5682, -4206, -3115, 5310, -776, -3404, 4408, 583, -5280, 2290, 3366, -3674, 204, 3386, -3265, -1632, 4147, -688, -2985, 2453, 166, -3274, 1932, 2066, -2988, -425, 1993, -1832, -708, 2216, -1071, -2163, 1226, 326, -1578, 638, 581, -1760, -433, 1106, -471, -690, 330, -376, -906, 249, 533, -525, -694, 84, 69, -511, 124, 544, -730, -762, 862, 154, -1010, 581, 660, -1377, 187, 1605, -1012, -708, 1747, -313, -1426, 1857, 812, -2033, 1094, 1736, -1970, 194, 2526, -1488, -1169, 2799, -341, -2134, 2415, 998, -2870, 1299, 2265, -2631, -12, 2965, -1829, -1476, 3291, -565, -2721, 2747, 1058, -3325, 1477, 2438, -3088, -63, 3330, -2137, -1821, 3398, -668, -2968, 2745, 962, -3629, 1314, 2380, -3223, -377, 3249, -2313, -2044, 3261, -660, -3197, 2420]
1397B420j523m549M770J245n638K622L685n037r5N112l483k668N312j042m450
1412c319M114J638n186J926L800m441o47M872k737k858M761l59m407L337K091
1427B585m737J243L870l849j192M651j942l229M076M42m318K581K582m270L44
1442a163L968l097j712M212j097l571L537J140m364J882L021l954l18M044k326
1457B02k481M003l97l755L003J705m177J095L350l456r85M123j815k914L758K32
1473A491l923K390K297m097N16L689k988j581L996j238l093L330P60l817J825
1488d43K532l546q7L564k321j955L692o92l133K880J226l648J200K663k972n85
1504a625L527j808k226L372p2l238K235J638l309P09K818k498j084L221j018k518
$$ y = [2420, 897, -3652, 1118, 2363, -3275, -653, 3032, -2005, -2100, 3012, -471, -3139, 2173, 1131, -3319, 795, 2433, -2753, -827, 2973, -1468, -2115, 2757, 20, -2838, 1923, 1564, -2843, 494, 2585, -2152, -909, 2961, -888, -2080, 2571, 629, -2600, 1476, 1918, -2400, 181, 2763, -1507, -1163, 2805, -292, -2004, 2208, 1111, -2460, 1077, 2217, -2147, -265, 2756, -1198, -1516, 2528, 202, -2279, 1724, 1327, -2428, 575, 2280, -1897, -802, 2548, -908, -1893, 2230, 415, -2499, 1259, 1491, -2432, -42, 2255, -1842, -1326, 2363, -625, -2206, 1790, 552, -2541, 789, 1549, -2268, -443, 2089, -1457, -1544, 2020, -301, -2256, 1436, 744, -2389, 491, 1717, -1931, -731, 1932, -1040, -1625, 1902, 94, -2132, 1240, 1168, -2070, 165, 1803, -1506, -797, 2021, -477, -1561, 1660, 642, -1876]
1520a876K771N57k936J478J904k754j65K835j714j564K793l00k569K045J249k906
1536a152O69K382k275p67K684r95k025K362N74k875J276J859k521j27K587j706
1552e0j554K744j93k635J978J212l000P79K625k570q70K937j182k231K937K94
1568A221l222J876J812l016L46K945k504j328L334r58k599K806N94l590J958K374
1584B049l254j3L062k535j430L853j063k916K857Q71l589J868K443l485j50L386
1600A954k197j427L441r77l057K926J023l309J685J918l169j08L390k003j556
1615a466L078j155k392K809R67l194J203J622k420L59K790k166j415K243m15j590
1631a142K412o3k725J119J671j684P5J514j870n41K221k06j372P86J6j444J226
$$ y = [-1876, 895, 1452, -1484, -6, 1898, -856, -1021, 1814, 100, -1464, 1329, 1029, -1540, 505, 1754, -1152, -483, 1899, -376, -1143, 1541, 546, -1479, 883, 1457, -1418, -142, 1717, -804, -931, 1656, -50, -1604, 1140, 947, -1688, 290, 1502, -1498, -719, 1906, -664, -1534, 1403, 221, -2010, 927, 1221, -2001, -125, 1687, -1329, -983, 1962, -542, -1870, 1464, 506, -2093, 713, 1307, -2283, -325, 2049, -1205, -1218, 1844, -691, -2121, 1732, 669, -2247, 610, 1481, -2108, -240, 2203, -1282, -1432, 1954, -243, -1670, 1771, 794, -2263, 663, 1686, -1623, 62, 1980, -1189, -1297, 2093, 90, -1466, 1612, 457, -1935, 874, 1841, -1353, -150, 1472, -948, -589, 2201, 35, -1380, 863, 448, -1142, 1270, 1207, -1518, -399, 1272, -412, -337, 1177, -693, -1234, 987, 781, -591, 195, 211, -1233, -7]
1648gJ088j293m03O74n19M5J139m21r50KN42Q5L30k2o61l39L72N97J12n71j71
1669c71k5j51P76N10j068o53R25j20l7J146o28j823J230J009j217O20Q36k243
1687a284N5K708q28j595J550n13j804K543J132l125O82J646k172O29K863k343
1703A44k303L127k23k258K685O46m010J569K834l140L80K998l061j958M629o48
1719A411l329L111K34m143L095K668m200l71L587l033j078M842k009l712L631
1734G04R24m024L104K027n167Q37M250l160j313M343k541l259M553M79m299K760
1750B18J710m388J544M103m104j438M276k113k436M703m26m542L074J784m160
1765b195J909K894m289m01M224j916k079L639j017l781L565J620l754J082K622
$$ y = [-7, 1081, -212, -615, 59, -460, -415, 724, 303, -647, -645, -103, -18, 312, 290, -371, -710, -338, 259, 371, -200, -371, -396, -547, 229, 739, -329, -982, -57, -177, -214, 932, 304, -1519, -289, 720, -497, 123, 959, -1284, -1229, 1479, 651, -944, 606, 93, -1711, 832, 1964, -1161, -479, 1167, -1005, -376, 2487, 144, -2159, 968, 745, -1513, 1172, 1818, -2192, -623, 2211, -929, -549, 2449, -612, -2570, 2059, 1411, -1918, 1193, 1427, -2716, 379, 3047, -1153, -1524, 2063, -970, -2048, 2794, 785, -2927, 704, 1628, -2396, 708, 2735, -2432, -1595, 2655, -505, -1818, 2525, -16, -3275, 1278, 1757, -2542, 218, 1928, -2460, -916, 3187, -917, -2355, 1921, -192, -2628, 2075, 1649, -2893, 181, 1965, -2195, -286, 2608, -1681, -2082, 2142, 226, -1853, 1786, 769, -3012, 553, 2173, -1581, -499, 2123]
1780B123l575J50L794k274k015L198q03k633K997O80l331J217K243k373M5K411
1796A854k114j336K717m09j802J780M07k456J247J478j866L9J612j351n98J756
1812I58l36j256Q07K80j003P61O84j276r0R23n01k45O87l75l80L11L93m27m0K34
1832A09o5l36J48L30m40k95O79K5n00L25L92j018J60J016o33n72J103m21q50J012
1852A69K89j265N67R62j452J33J699j468p87J958l37j642J635M89k198J328J212
1869A292j995J2K018j662p82K344o47k042K132N81k758J678J370k541L26K331
1885A657j964q15K715j106k107K585K80k665J652J413k774N07K523k305r81K877
1901A492j186j887K637J19k820J684J510k728O68K229k227r83K876j056j954K460
$$ y = [2123, -1452, -1302, 2492, 218, -1797, 1401, 598, -2035, 962, 1642, -1689, -472, 1771, -602, -557, 1854, -260, -1596, 1121, 712, -1090, 690, 1097, -1359, -112, 1366, -500, -461, 1151, -200, -798, 958, 622, -634, 173, 453, -550, 211, 895, -381, -471, 452, -49, -294, 393, 18, -362, -51, 342, -85, -125, 109, 44, -292, -144, 186, -254, -549, 130, 155, -345, -20, 372, -646, -486, 530, -103, -675, 428, 7, -843, 169, 458, -807, -240, 722, -730, -597, 1102, -366, -1153, 805, 468, -1174, 461, 950, -1248, 80, 1292, -703, -691, 1327, -335, -1117, 1227, 580, -1462, 670, 1251, -1507, 171, 1541, -1000, -674, 1657, -307, -1122, 1593, 487, -1620, 965, 1245, -1420, 232, 1645, -1129, -622, 1901, -404, -1385, 1492, 306, -1581, 1056, 1175, -1645, 39, 1549, -1179, -511, 1718, -509, -1492, 1384, 328, -1626, 834]
1917H34k9k440J729J373k633L72K283k121p15K609j037j779K149J91k308J444
1933g8J339k363L16K019j596p68K138q47j618J880L94j994J091J060j713l8J921
1950A143j237q98J810m63j360J402M33j719O85J240j429k55J613q80r67J518l7
1967E99j410R27P79j533L42J227r97m12J167m15j005J104L32j308N06R46j200
1984c51j47J362o13r86J347k1j248P93O95j293J22J218r37p00J385l08j183J120
2002B55L46j312N39R54j219k13J419q29q18J323k3j391R95P26j582L63J294j217
2020c90m48J423n20j139J388K17j558Q56R43j584K41J400j042p24J549l01j267
2037i56J256M25j674O92J152j435q3J638j097p79J516j90j387J192O80j694N71
$$ y = [834, 805, -1635, 94, 1467, -1166, -794, 1489, -632, -1347, 1262, 225, -1554, 595, 786, -1522, -78, 1261, -1102, -786, 1233, -363, -1131, 1007, 160, -1458, 422, 816, -1178, -87, 973, -740, -778, 1143, -94, -992, 818, 355, -1005, 397, 830, -889, -204, 1036, -393, -648, 965, 85, -882, 636, 599, -811, 116, 895, -638, -296, 931, -66, -478, 689, 274, -731, 373, 705, -603, -97, 849, -351, -498, 864, 251, -735, 612, 591, -657, 136, 831, -462, -340, 878, -59, -759, 626, 318, -865, 255, 601, -711, -172, 782, -437, -650, 769, -60, -878, 445, 422, -969, 26, 752, -830, -467, 827, -390, -838, 585, 65, -1074, 314, 531, -1027, -171, 772, -812, -571, 829, -213, -937, 612, 311, -956, 300, 725, -949, -257, 895, -540, -623, 1015, -82, -861, 655, 465, -922, 270, 950, -744, -173]
2054a73J224j458k32J625q61r52J399K5j493J122O99j535L35J288j295l97J589
2071I10o38j137J399J29j500R01Q91j442J70J303j119o06J525m65j190J306L38
2088G75j551P02Q75j357m7J480r50q22J379j1j333Q44O52j345L15J169j239l18
2106g82J396o25r45J319N9j401Q92P32j387K25J250j091l61J249l87j158J333
2123C18K59j421O58Q41j252J81J097n89q54J193J1j092R18L41j272M73J088j100
2141b02j59J090n14o69R81k2j167O51O54r27K08R32q67n62J091r7j112J071L36
2160G16j230L12R14r53j39J339r69o74J213j26r11N19O83j088Q5J131q54n59J028
2179D37j57j001J025L72j538P14R91j209k22J258p84r09J553Rj476J019N38j382
$$ y = [-173, 1051, -407, -639, 986, 125, -827, 572, 597, -896, 226, 925, -610, -275, 1013, -282, -679, 910, 272, -865, 534, 663, -837, 64, 955, -487, -317, 986, -133, -739, 786, 321, -869, 437, 775, -776, -74, 801, -556, -603, 877, -73, -895, 484, 473, -860, -16, 636, -709, -394, 775, -464, -782, 614, -11, -956, 363, 422, -979, -87, 645, -742, -517, 733, -358, -719, 530, 143, -1015, 318, 577, -844, -186, 655, -597, -416, 681, 92, -762, 431, 442, -650, 268, 609, -663, -190, 898, -202, -361, 729, 215, -454, 527, 505, -662, -11, 643, -284, -76, 856, -11, -573, 518, 421, -691, 380, 716, -514, -202, 712, -241, -380, 959, -10, -684, 529, 403, -508, 11, 694, -394, -309, 822, -32, -591, 437, 280, -721, 304, 676, -862, -148, 843, -366, -588, 670, -114, -1023, 530, 539, -937, 82, 620, -762]
2197g62M90J369j378o10J604o46r89J482J40j886Q40J306j743K84J607j402p62
2214a056J800n38j316J492K38j730J015J327j979J82J643j425p46K110p13j510
2230a206J674K12j691J163J262k111O3J944j525q30K258o69j831J893J75j754
2246i73J101J146k095J65J860j398q69K088p17j613J960L66k141J087J139j730
2262f24J65J770j494q79J864n33j225J484K24j860J135Q92j547J75J559j698m35
2279a027J808o69j152J587k8j555J136Q79j631K57J121j141l38J446o72r08J226
2296C39J6j238Q83O89j317K73R70r03j22J088p25m87Q40r2p19O73K27p54J42N36
2316C19l12j60L72j92j37M06j82j67K22n1j77J11O0n3J8l2p1K28j70L9O2j78r1
$$ y = [-762, -272, 1097, -281, -891, 713, 67, -922, 560, 700, -1186, -346, 960, -783, -499, 1108, -294, -1056, 744, 206, -1110, 382, 620, -1110, -95, 1232, -747, -565, 1078, -347, -1093, 1017, 304, -1206, 468, 680, -1011, 152, 1414, -697, -634, 1310, -215, -1045, 1213, 544, -1287, 606, 781, -973, 128, 1274, -821, -656, 1204, -194, -1063, 1025, 308, -1305, 655, 1021, -1120, -33, 1106, -624, -459, 1311, -183, -1062, 802, 269, -956, 528, 752, -1108, 27, 919, -628, -453, 1106, -592, -1027, 781, 112, -1040, 547, 519, -1036, 100, 979, -652, -395, 726, -415, -753, 693, 21, -887, 339, 355, -883, 0, 689, -628, -355, 615, -288, -410, 678, -47, -534, 306, 214, -505, 168, 395, -359, -217, 319, 7, -153, 219, 27, -110, 296, 114, -53, 169, 118, -59, 52, 112, 59, 77, 45, -26, 202, 32, 71, 133, -45, -136]
2339a36L59P3m96M22Mn11K34M76p09J68O46o87k18Q02k44q81Q95Op96O32N36j011
2361d36L1J019q17l68J179n07r27J237n4r86P30N71j620N79J270j154l60J412
2379G99r51q61J704k85j400J195M55j565O01J354j532k56J671j078p68J637l44
2396C76j573J449N62j691P72J211j763n5J755j068q73J775n58j436J455N60j754
2413h56Q26J093j659Q7J680j170q06J575m47j251J422L04j739Q64J011j352j08
2430e26J566j059r00J697m79j029J170O6j410P09J082j342k3J141q27o10J369
2447E95l86r32R56J76j081O08P97j094n2R59p33m38J111k59q16N85M48r40L17
2466a79O26p43j52Q34l47m99P07k1o61L48M94o42QN70m11k51O00q7o02L79L03
$$ y = [-136, 223, 296, -200, 222, 226, -285, -51, 425, -284, -116, 530, -157, -375, 427, 183, -698, 197, 203, -593, 39, 575, -436, -405, 614, -203, -571, 608, 101, -826, 411, 357, -629, 101, 672, -948, -369, 901, -253, -613, 799, -152, -1013, 691, 406, -994, 201, 656, -909, -308, 1046, -486, -742, 929, -149, -917, 720, 376, -1197, 252, 814, -877, -105, 1106, -657, -712, 1043, -25, -898, 877, 319, -1117, 338, 898, -856, -30, 1063, -596, -509, 1171, 1, -805, 770, 323, -928, 494, 798, -941, -77, 934, -418, -526, 1040, -19, -919, 778, 299, -730, 440, 506, -904, -195, 887, -455, -478, 663, -164, -774, 595, 209, -723, 233, 409, -672, -64, 733, -361, -413, 546, -187, -625, 486, 227, -589, -4, 444, -496, -179, 447, -296, -448, 386, 39, -460, 247, 226, -435, -87, 407, -235, -227, 343, -68, -319, 281, 194, -408, -29, 274]
2487B74n26J42M95m47k56N13l0l43K77R7n55J88N68l62l10N62k48l76N73J25n45
2508a84J17M71n89j42Q44m82m41Q17l2o45M33L45p91j19R17o12l16P97j78p64
2528e54P92R8q24L78N63q38N1R90o51n48Q94j61q12P89K80r57K92P18q24N3Q10
2549E39n90o24J037j76r45R32K37r95N58P07r06k24Q45n30l92R70j08r18O62M76
2569E55j119K92Q78q55l04J036l71p08Q06K95r54N02M54p08j34Q80m62n63J145
2588F65l74p82O57K85j023O09O84r65L2R13n69p69J024j00p38O63M19j047L43
2607g3O53q80Q7P58m06p32J037j27q96N53M74q64P7Q20q27l6P97m38n97P73K30
2628C83q79L68O53j060L52P01m93n20Q02j10n92M11L64q66N43K66m19l12O50l29
$$ y = [274, -252, -110, 385, -62, -318, 195, 165, -178, 99, 196, -359, -171, 397, 35, -275, 287, 39, -337, 236, 361, -184, -67, 404, -185, -327, 517, 35, -406, 411, 379, -266, 167, 512, -279, -398, 519, -93, -409, 388, 210, -554, 238, 336, -488, -110, 453, -385, -334, 656, 5, -543, 351, 190, -622, 167, 447, -510, -218, 500, -324, -271, 539, -51, -675, 362, 186, -759, 173, 410, -585, -27, 680, -226, -450, 395, -135, -527, 443, 335, -583, 79, 555, -564, -272, 606, -249, -553, 483, 112, -596, 210, 505, -449, 53, 507, -201, -335, 545, 83, -480, 665, 291, -491, 166, 451, -572, 37, 721, -244, -212, 701, 132, -637, 387, 287, -451, 212, 631, -416, -73, 580, -300, -213, 545, 139, -593, 444, 317, -579, -26, 448, -416, -339, 481, -346, -382, 415, -23, -620, 153, 383, -496, -128, 525, -535, -183, 518, 25, -495, 307, 197, -395, 16, 380, -486, 57, 323, -96, -408, 242, -87]
2648h7m69P56j86n25M46L35n80J95L67k71k48P21l61m12O07Qn04K00M70p10j48
2669c96O21k81k16N12j92l82L68J85k73r8M96l36l69N24n2l15J53K74l85K28K84
2690C50l18l25P01k84m18M55K30o47L16L56n39m7N36k60n58P69j4o88L88M61q42
2711c78K37P96j028k44J152n44o86Q52K99j051N46P34j165L06R07q58m59R33j44
2730B05j050J120J95j255O78O46j081J20J224r13o66J259j50j072R79L02j290
2747g49O08J081j076m02J140o45o91J457m08j012R81K32j142M62R62j226L2J100
2765G04q00n28J303k69j152R73M34j240O77O64j193j15J383r55m53J120l24j096
2783h67J177K44j149O50O42j176K47R26p69m64Q77k50p48J010J55j019M16N13
$$ y = [-87, -556, 200, 14, -511, -65, 270, -310, -115, 252, -19, -267, 454, 93, -319, 288, 296, -208, -8, 462, -248, -396, 225, -56, -272, 240, 48, -334, 34, 219, -54, -152, 344, 8, -361, 163, 111, -204, -51, 223, -162, 66, 350, 32, -293, 408, 124, -294, 161, 391, -256, 60, 416, -123, -170, 366, 106, -452, 317, 303, -385, 3, 464, -378, -141, 655, -373, -617, 535, -9, -695, 157, 456, -595, -49, 685, -480, -174, 733, -125, -584, 349, 205, -845, 275, 470, -785, -107, 539, -542, -422, 802, -111, -777, 482, 332, -740, 239, 541, -749, -141, 940, -136, -538, 602, -43, -734, 723, 315, -697, 284, 516, -626, -164, 798, -428, -396, 704, -96, -624, 679, 410, -742, 231, 665, -575, 102, 766, -427, -542, 841, -114, -567, 553, 229, -867, 310, 554, -595, 55, 697, -479, -232, 694, -75, -539, 338, 88, -660, 350, 505, -514, -98, 415]
2801D15p27J80O99o78l56Q61k43n70P66j66n96K64M61m48kL73l28k44M30P0m07
2822b46K16K5q1jK65k43j22J80l3J6J2J08j81j09L00Rk68Q3J26j61q3M29j22l85
2846b66M19j13k68K89L06n43j01O60l91k38O41k59o47O56K38o39J50O18q72QR94
2867F42p38m06R51k17q34J043J17j098M44Q22j060L3J131r73n57J386l86j049
2885g49J121J76j367Q03Q60j324j7J322j050n12J487n14j234J405J46j438R38
2902E3P60j510K35J343j191m30J578r20r68J610n4j420R69P43j571M19J275j282
$$ y = [415, -312, -132, 567, -111, -467, 394, 151, -419, 347, 181, -415, -151, 310, -138, -140, 233, -95, -339, 91, 161, -246, -30, -5, -86, -87, 178, -65, -187, -7, -40, -24, -12, 96, -85, -194, 106, 115, -153, -70, 56, -105, -188, 241, 119, -266, 153, 40, -228, 61, 367, -176, -277, 383, -8, -246, 395, 136, -511, 145, 383, -256, -106, 512, -360, -352, 642, -96, -502, 449, 232, -602, 441, 558, -540, -96, 726, -334, -301, 830, -143, -700, 686, 300, -749, 372, 548, -819, -16, 844, -480, -497, 825, -225, -737, 750, 236, -998, 407, 553, -885, 53, 813, -697, -462, 881, -310, -740, 838, -82, -1050, 560, 506, -914, 55, 798, -773, -354, 921, -361]
$$ [...]
8191e1
##END NTUPLES=NMR FID
##END=
