##TITLE=1H_475
 D2O
 8 sc, 
 29.11.2023
##JCAMPDX= 6.0         $$ Bruker NMR JCAMP-DX V2.0
##DATA TYPE= NMR FID
##DATA CLASS= NTUPLES
##ORIGIN= UXNMR, Bruker Analytische Messtechnik GmbH
##OWNER= root
$$ XWIN-NMR		Version 3.5
$$ Wed Nov 29 13:50:09 2023 Russian Standard Time (UT+4h)  she@DPX200
##.OBSERVE FREQUENCY= 200.1313
##.OBSERVE NUCLEUS= ^1H
##.DELAY= (6, 6)
##.ACQUISITION MODE= SIMULTANEOUS
##.ACQUISITION SCHEME= undefined
##.AVERAGES= 8
##.DIGITISER RES= 18
##SPECTROMETER/DATA SYSTEM= spect
##.PULSE SEQUENCE= zg30
##.SOLVENT NAME= D2O
##.SHIFT REFERENCE= (INTERNAL, D2O, 0, 15.7039)
##AUDIT TRAIL= $$ (NUMBER, WHEN, WHO, WHERE, WHAT)
$$ ##TITLE= Audit trail, XWIN-NMR		Version 3.5
$$ ##JCAMPDX= 5.01
$$ ##ORIGIN= Bruker BioSpin GmbH
$$ ##OWNER= she
$$ F:/spectra/data/she/nmr/H-F/1/audita.txt
$$ ##AUDIT TRAIL=  $$ (NUMBER, WHEN, WHO, WHERE, WHAT)
(   1,<2023-11-29 13:49:08.50 +0400>,<she>,<DPX200>,
      <created by zg, POWCHK disabled, PULCHK disabled
       configuration hash MD5:
       00 E9 B6 7A A2 85 ED C7 34 08 36 98 17 FE 4E 26
       data hash MD5: 16K
       2B 5A F4 DC F6 03 25 54 C4 F9 69 66 F0 8F 19 08>)
$$ ##END=
$$ 
$$ hash MD5
$$ 27 81 16 FA D4 F4 46 36 63 43 06 24 29 40 1F E7
##$RELAX= 
##$RELAX= 
##$RELAX= 
##$RELAX= 
##$RELAX= 
##$RELAX= 
$$ Bruker specific parameters
$$ --------------------------
##$DU= <F:/spectra>
##$EXPNO= 1
##$NAME= <H-F>
##$PROCNO= 1
##$TYPE= <nmr>
##$USER= <she>
##$AMP= (0..31)
100 100 100 100 100 100 100 100 100 100 100 100 100 100 100 100 100 100 
100 100 100 100 100 100 100 100 100 100 100 100 100 100 
##$AQSEQ= 0
##$AQ_mod= 1
##$AUNM= <au_zg>
##$AUTOPOS= <>
##$BF1= 200.13
##$BF2= 200.13
##$BF3= 200.13
##$BF4= 200.13
##$BF5= 200.13
##$BF6= 200.13
##$BF7= 200.13
##$BF8= 200.13
##$BYTORDA= 1
##$CFDGTYP= 0
##$CFRGTYP= 5
##$CHEMSTR= <none>
##$CNST= (0..31)
1 1 145 1 1 1 1 1 1 1 1 1 1 1 1 1 1 1 1 1 1 1 1 1 1 1 1 1 1 1 1 1 
##$CPDPRG= <>
##$CPDPRG1= <>
##$CPDPRG2= <>
##$CPDPRG3= <>
##$CPDPRG4= <mlev>
##$CPDPRG5= <mlev>
##$CPDPRG6= <mlev>
##$CPDPRG7= <mlev>
##$CPDPRG8= <mlev>
##$CPDPRGB= <>
##$CPDPRGT= <>
##$D= (0..31)
0 1.2 0 0 0 0 0 0 0 0.06 0 0.03 0 0 0 0 0.0002 0 0 0 0 0 0 0 0 0 0 0 0 
0 0 0 
##$DATE= 1701251347
##$DBL= (0..7)
120 120 120 120 120 120 120 120 
##$DBP= (0..7)
150 150 150 150 150 150 150 150 
##$DBP07= 0
##$DBPNAM0= <>
##$DBPNAM1= <>
##$DBPNAM2= <>
##$DBPNAM3= <>
##$DBPNAM4= <>
##$DBPNAM5= <>
##$DBPNAM6= <>
##$DBPNAM7= <>
##$DBPOAL= (0..7)
0.5 0.5 0.5 0.5 0.5 0.5 0.5 0.5 
##$DBPOFFS= (0..7)
0 0 0 0 0 0 0 0 
##$DE= 6
##$DECBNUC= <off>
##$DECIM= 32
##$DECNUC= <off>
##$DECSTAT= 4
##$DIGMOD= 1
##$DIGTYP= 9
##$DL= (0..7)
0 120 120 120 120 120 120 120 
##$DP= (0..7)
150 150 150 150 150 150 150 150 
##$DP07= 0
##$DPNAME0= <>
##$DPNAME1= <>
##$DPNAME2= <>
##$DPNAME3= <>
##$DPNAME4= <>
##$DPNAME5= <>
##$DPNAME6= <>
##$DPNAME7= <>
##$DPOAL= (0..7)
0.5 0.5 0.5 0.5 0.5 0.5 0.5 0.5 
##$DPOFFS= (0..7)
0 0 0 0 0 0 0 0 
##$DQDMODE= 0
##$DR= 18
##$DS= 0
##$DSLIST= <SSSSSSSSSSSSSSS>
##$DSPFIRM= 0
$$ [...]
##$SUBNAM2= <"">
##$SUBNAM3= <"">
##$SUBNAM4= <"">
##$SUBNAM5= <"">
##$SUBNAM6= <"">
##$SUBNAM7= <"">
##$SUBNAM8= <"">
##$SUBNAM9= <"">
##$SW= 18.0517328524113
##$SWIBOX= (0..15)
0 0 2 0 0 0 0 0 0 0 0 0 0 0 0 0 
##$SW_h= 3612.71676300578
##$TD= 16384
##$TD0= 1
##$TE= 0
##$TE2= 300
##$TE3= 300
##$TEG= 300
##$TL= (0..7)
0 120 120 120 120 120 120 120 
##$TP= (0..7)
150 150 150 150 150 150 150 150 
##$TP07= 0
##$TPNAME0= <>
##$TPNAME1= <>
##$TPNAME2= <>
##$TPNAME3= <>
##$TPNAME4= <>
##$TPNAME5= <>
##$TPNAME6= <>
##$TPNAME7= <>
##$TPOAL= (0..7)
0.5 0.5 0.5 0.5 0.5 0.5 0.5 0.5 
##$TPOFFS= (0..7)
0 0 0 0 0 0 0 0 
##$TUNHIN= 0
##$TUNHOUT= 0
##$TUNXOUT= 0
##$USERA1= <user>
##$USERA2= <user>
##$USERA3= <user>
##$USERA4= <user>
##$USERA5= <user>
##$V9= 5
##$VALIST= <valist>
##$VCLIST= <CCCCCCCCCCCCCCC>
##$VD= 0
##$VDLIST= <DDDDDDDDDDDDDDD>
##$VPLIST= <PPPPPPPPPPPPPPP>
##$VTLIST= <TTTTTTTTTTTTTTT>
##$WBST= 1024
##$WBSW= 4
##$XGAIN= (0..3)
0 0 0 0 
##$XL= 0
##$YL= 0
##$YMAX_a= 247702
##$YMIN_a= -219936
##$ZGOPTNS= <>
##$ZL1= 120
##$ZL2= 120
##$ZL3= 120
##$ZL4= 120
##$ABSF1= 10
##$ABSF2= 0
##$ABSG= 5
##$ABSL= 3
##$ALPHA= 0
##$AQORDER= 0
##$ASSFAC= 0
##$ASSFACI= 0
##$ASSFACX= 0
##$ASSWID= 0
##$AUNMP= <proc_1d>
##$AZFE= 0.1
##$AZFW= 0.1
##$BCFW= 1
##$BC_mod= 2
##$BYTORDP= 1
##$COROFFS= 0
##$CY= 11.3945322036743
##$DATMOD= 1
##$DC= 2
##$DFILT= <>
##$DTYPP= 0
##$F1P= 15.7292609196834
##$F2P= 12.9074282941183
##$FCOR= 0.5
##$FTSIZE= 0
##$FT_mod= 4
##$GAMMA= 1
##$GB= 0.15
##$INTBC= 1
##$INTSCL= 1
##$ISEN= 128
##$LB= 0.24
##$LEV0= 0
##$LPBIN= 0
##$MAXI= 10000
##$MC2= 0
##$MEAN= 0
##$ME_mod= 0
##$MI= 1.114404
##$NCOEF= 0
##$NC_proc= 0
##$NLEV= 6
##$NOISF1= 3.799351
##$NOISF2= 2.8
##$NSP= 1
##$NTH_PI= 0
##$NZP= 0
##$OFFSET= 15.70392
##$PC= 1
##$PHC0= -24587.62
##$PHC1= 0.052701
##$PH_mod= 1
##$PKNL= yes
##$PPARMOD= 0
##$PSCAL= 0
##$PSIGN= 0
##$REVERSE= no
##$SF= 200.130013532006
##$SI= 16384
##$SIGF1= 3
##$SIGF2= 2
##$SINO= 400
##$SIOLD= 16384
##$SREGLST= <1H.CDCl3>
##$SSB= 0
##$STSI= 0
##$STSR= 0
##$SW_p= 3612.71676300578
##$SYMM= 0
##$S_DEV= 0
##$TDeff= 0
##$TDoff= 0
##$TI= <>
##$TILT= no
##$TM1= 0
##$TM2= 0
##$TOPLEV= 0
##$USERP1= <user>
##$USERP2= <user>
##$USERP3= <user>
##$USERP4= <user>
##$USERP5= <user>
##$WDW= 1
##$XDIM= 8192
##$YMAX_p= 0
##$YMIN_p= 0
$$ End of Bruker specific parameters
$$ ---------------------------------
##NTUPLES= NMR FID
##VAR_NAME=  TIME,          FID/REAL,        FID/IMAG
##SYMBOL=    X,             R,               I
##VAR_TYPE=  INDEPENDENT,   DEPENDENT,       DEPENDENT
##VAR_FORM=  AFFN,          ASDF,            ASDF
##VAR_DIM=   8192,          8192,            8192
##UNITS=     SECONDS,       ARBITRARY UNITS, ARBITRARY UNITS
##FACTOR=    0.0002768,     1,               1
##FIRST=     0,             0,               0
##LAST=      2.2672688,     0,               0
##MIN=       0,             -219936,         0
##MAX=       2.2672688,     247702,          0
$$ Real data points
##PAGE= N=1
##DATA TABLE= (X++(R..R)), XYDATA
0@%%%%%%%%%%%%%%%%Mj2J6j6J6j6J7k5L2l2M0m8N4o2P1q1R0j04J18j32J48j65
38h7J85k05K27k53K81l11L43l82M22m64N12n62O21o86P55q33R19j019J131j259
58f65J412j589J802k068K403k842L446m333N773q487J5380o6769j63399K8303
72a91633P3076O1515R1447J40416P2881m0554j05942r2437p2158o5955m1164M2010
84a28498J05247Q5901L0823J3807q387o7852j10893p7132j0726L4732O1935R5554
96B4511J00308M7855k3313n9695p3344p8339m9612J1987N2490N9539N8611M2905
108A13903l363n0438o7687o3254m7948j7903K3321O0425P3534N4292K0506n874
120H9514l3612o3254n9775j6519K2104L7251M9298N6026L2727j4294m8769n3141
$$ y = [0, 0, 0, 0, 0, 0, 0, 0, 0, 0, 0, 0, 0, 0, 0, 0, 0, 4, -8, 8, -8, 8, -8, 9, -16, 16, -16, 24, -24, 30, -32, 39, -42, 48, -56, 62, -70, 78, -87, 98, -107, 120, -133, 148, -163, 180, -202, 220, -244, 268, -294, 327, -359, 396, -437, 482, -537, 594, -665, 747, -842, 960, -1108, 1295, -1547, 1899, -2434, 3339, -5148, 10232, -56537, -219936, -191633, -118557, -57042, 34405, 174821, 247702, 207148, 101206, 8769, -63389, -129344, -170508, -128498, -23251, 62650, 93473, 107280, 98893, 31041, -79852, -156984, -167710, -132978, -71043, 24511, 124819, 172674, 149361, 89666, 16322, -62017, -111629, -99642, -47152, 12387, 70998, 113903, 110540, 60102, -7585, -70839, -118787, -136690, -113369, -52944, 20590, 74882, 95388, 89514, 55902, -7352, -67127, -83646, -61542, -24291, 25007, 81033, 113760, 99466, 50697, -2444]
132b444m5494l8577j5253K6648N1492M3233K7539J4192j1068l9050m5729k9617
144f4128o728J6620L5578M7241M4006J7936j3865l1068l8998m2348k7048L654
156e9148K4870K9245K9703K2724J268k4645l5335k9628j9151o082J4093L6755
168a5331M1211K4694P208l599k0749l5492k9578p518Q466J6027K4106K7673J4120
181E1238j0082k5776k6497k2493j9605n185J9223L1115K3188J4898R733n329k4115
194A0313k5792j2511q18P041J6452K5443K1946M059j2515j7156j9892k4541j5313
207d3284M924J7075J6414J4999J4297L504j3291k0884j4644o725j654P764K1295
220b10K3507J1464K79m977j3184k1748j8179m234O701R515J2264J4863Q776n973
$$ y = [-2444, -47938, -86515, -101768, -75120, -23628, 19605, 47144, 61336, 50268, 11218, -34511, -64128, -70856, -54236, -18658, 28583, 72589, 90525, 76660, 45592, 6594, -35754, -62802, -59148, -34278, -5033, 24670, 47394, 48662, 24017, -11318, -40946, -60097, -66179, -52086, -15331, 25880, 50574, 57782, 54183, 33434, -2058, -31636, -39154, -30688, -14661, 9445, 37118, 51238, 41156, 15380, -11117, -33610, -53215, -58400, -39177, -8062, 15126, 30024, 39757, 34428, 10313, -15479, -27990, -28808, -21767, -5315, 20128, 42074, 46133, 33618, 16462, -3430, -27971, -43284, -38360, -21285, -4871, 10128, 24425, 27929, 14638, -6246, -20890, -27615, -29269, -21505, -210, 23297, 34761, 35040, 30063, 16879, -4869, -23048, -27282, -20581, -11066, 1198, 16061, 24837, 18864]
234A8864j5384j3707j0383r265p77J3963J8963J3010P410M842l994j4878j7000
247h336p802J86L234Q051J4739J2279j05q733r024j1477j4208q118N495J2815
261a1004J0285Q649R238L473q228j3885p946k203k042K669J2380J3983N241k610
275A8000l409p001j3190j2505k921O168O936O081R016P513k207r770p634m197
289i120m302j627P595J1878Q265L063P39k428q846j1148n931K61K206M034Q008
304B647P750M47n299n051n164o853m243L244P912O903M792N208K067n163q696
319E01n047j204j882K66P121Q501K447k655k749l426p426p124l17M843M070L460
335f21N642N174j871o239l669j216k731j865L906P771L997K55j04j239n746p593
$$ y = [18864, 3480, -10227, -20610, -29875, -30652, -16689, 2274, 15284, 22694, 27536, 23542, 8664, -8336, -16138, -15952, -12718, -4667, 10072, 22351, 22246, 13513, 4489, -6988, -21196, -29314, -23819, -11004, -719, 7930, 17168, 20641, 12413, -1472, -9418, -11621, -13663, -10994, 1386, 15369, 20610, 18000, 14591, 7590, -5600, -18105, -21026, -14858, -7922, -1841, 7175, 14688, 12481, 2711, -4923, -9120, -13422, -15049, -7454, 4424, 12689, 15752, 16491, 14063, 5217, -5931, -11862, -11601, -9395, -5361, 2647, 10397, 10844, 5545, 494, -4670, -11523, -15766, -12522, -4610, 2293, 7085, 12293, 14360, 9197, 501, -4546, -5750, -7632, -7366, -245, 8256, 10703, 8048, 5299, 1873, -5553, -12677, -12994, -8151, -4081, -621, 5021, 10195, 8324, 2085, -1584, -2800, -5531, -7396, -3490, 4281, 8278, 8533, 8429, 7190, 1444, -6149]
351f149l162J631J852J512N007N726J53m222k964j563k719l165K206N842M100
366D085J608J952J500l547o314l664j27k00j53L440N430J857k635k035j517l849
382d169m024P7M235L311J954L075L156j233m569l147n41j015j356K231M993K275
398E253p80p45o45l702m937j685J884K008J062K982L939O39k737k750m69j887
414b570k342J394M517K914M71M12J054k692m728k829J67L43J50K106L902J623
430C892j896j704l5k151l374P4L452K579J097J657K134l70l577k962m78l86j300
447c348P46M067J915j192o95P8j917l573j552J422K373O93J533K821J237k093
463B515j822j51j488k061M21K985K263k39j48J115j225l436k144J30M46k11J023
$$ y = [-6149, -9311, -7680, -5828, -4316, 691, 6417, 6570, 2348, -616, -2179, -4898, -8063, -5857, -15, 4085, 5693, 7645, 9145, 5598, -716, -4380, -4507, -4707, -4860, -1420, 4010, 5867, 3232, 1197, -320, -4169, -8193, -8116, -3881, -570, 1384, 4459, 7615, 6382, 1813, -1334, -1875, -2890, -4246, -2015, 2978, 5253, 4473, 3728, 3083, -619, -5556, -7241, -5357, -3349, -2287, 695, 4634, 5273, 2536, -214, -683, -2570, -4912, -3518, 999, 3913, 4384, 4796, 5850, 3158, -1570, -4399, -4232, -3889, -3739, -1633, 2269, 3892, 1996, 292, 257, -1894, -5268, -5194, -1742, 837, 1934, 3591, 5725, 5355, 1778, -1184, -1662, -2048, -3348, -2602, 1465, 3380, 2188, 1493, 1571, -346, -3919, -5471, -4049, -1676, -983, 550, 3371, 4608, 2515, 693, 542, -946, -3007, -2586, 399, 2662, 2423, 2275, 3390, 2165, -1271, -3415, -3285, -2839, -3050, -2027]
480b027L374J696j481r24K09q96k632n10K397J843R7J134J794j87k726k051k41
497a131j18j679M4K630K032j184n11J026o76k622j323J595J121l9R35K290J140
514C530j482j675L44l92j684q51K063J591p31m43J129l5k589j494Q51N79r43N76
532a656K297J572j049p85M97K13j482j190J527J223m21j91J305M30j942j478J58
549i72J29j068l83J908J382o97j022J111N93j819q98R65J250r3k24J425Q82j117
567A352j610K40N06j175j141J221J355n63o72P15M26j537j147Q10J228m80l11
584g83J032J596n63j156M80L30r89r19J071J146p96o99J013M48j532j194L47M70
602f98l41m10J126J322k66j463P64N68m93j159J033R47l40k97O97Q24j001j527
$$ y = [-2027, 1347, 3043, 1562, 638, 847, -49, -2681, -3191, -794, 1049, 1146, 2280, 4074, 3887, 1161, -890, -1131, -1249, -2928, -2884, -254, 1778, 594, 83, 1109, 433, -2189, -3512, -1917, -796, -835, 100, 2390, 3530, 2048, 373, 717, 325, -1359, -2210, -147, 1444, 713, 270, 1399, 1364, -1225, -2719, -1868, -1289, -2232, -1656, 641, 2213, 1164, 379, 876, 1089, -393, -1583, -56, 1167, 746, 555, 1860, 2290, 348, -1130, -972, -843, -1911, -2294, -386, 996, 299, -723, 388, 981, -838, -1736, -771, 479, 386, 162, 1587, 2469, 1352, -258, -18, 488, -687, -1828, -607, 748, 185, -487, 228, 654, -883, -2030, -1220, 8, -472, -783, 249, 1845, 1282, 126, 606, 936, -53, -972, 99, 1245, 449, -250, 763, 1211, -321, -1515, -1168, -698, -1039, -1449, -323, 999, 733, -730, 34, 602, 109, -1050, -17, 930, 590, 293, 990, 1814, 813, -714]
620g14J95M91p01p97R55J313q23o48Q87N20j020q93O91Q64n5k54P29P66n20o85
640C01j28N93r64j008P00J158m34o80M83L97q38r83N44O19l82j11M91J268m8j241
660b63P01P61p42j057N01R41m60o73P01P44q89j178K39Q16p30j155R13J259j77
679B52p91N38P40p32q16N06P40j35m80P06Q34n59q94j18R85p72j144O05Q48j95
699A18n69K42N51n42n19rJ104k28r02Q70R44l43r23M61P17p38q04L33O77k79p44
720e83M73O52l23j136J66P14j71o01L54J040k04p12N03Q31p91p86M60P89j79p70
740b74L45O90j85j260L30N55j78j154M57R49l40n99M73Q39l35r19J83R13jp41
760b52K31Q58j95p04N0M16l09q02M21N25K0q24K15P40m35n50o9O41J07n71K31
$$ y = [-714, -519, -28, -729, -1526, -571, 742, -81, -729, 158, 678, -342, -1235, -544, 320, 265, 11, 740, 1506, 986, 301, 173, 766, -198, -1206, -506, 652, 218, -462, 21, 418, -420, -1403, -859, -240, -622, -733, -242, 1026, 978, -263, 438, 1199, 457, -600, -99, 842, 382, -291, 410, 1154, 265, -913, -674, 142, -588, -1743, -830, 429, 252, -539, -1, 739, 7, -809, -303, 437, 302, -178, 528, 1362, 803, -91, -209, 776, 4, -1140, -535, 313, 118, -451, -209, 342, -200, -719, -728, 376, 148, -754, 116, 1060, 717, -206, 255, 972, 234, -570, -237, 440, 161, -583, -110, 542, 219, -917, -751, -37, -208, -809, -455, 585, 381, -331, 172, 1003, 212, -574, -114, 675, 496, -274, 71, 761, 576, -684, -354, 201, 23, -1131, -674, 275, -65, -664, -191, 648, 313, -606, -423, 490, 489, -252, -21, 837, 642, -62, -12, 404, 95, -707, -286, 239, 259, -565, -350, 390, -45, -595, -664, -23, 84, -487, -256]
781b56R40m3p04J44L52q3o96J18O53j98m79J07M19m1p20K4P00j20p83K64Q13p8
803C33o29R3Q49j93r19J53N02M1m00K37N06jj010J01P14l22o26R8N57L52r25J04
825c85P94N8n87l27R24l42m95Q0R31q5o61J46K55P2q95nN71K1m65k0O88o2o78
848d67J5M22J77p46J00P77K33n09k6M45O7m29m27O82q4o90J88O39j51m31j33N07
870A59k9o22k23P86J00o38K45N23J3n60j35Q72j68p45K14N57Q5m91j06M83k0q08
892e08J88K69J29m97p0P51P3m24p8M85j14n87Q5N27L93p65P9M61ml96j58L38r4
915H3l99p3M80J46n12q7O46m5m18l32O56Rk33K4J85J85l39p7L56J24n49j82O34
938B82k66l27r9L76J13l17L5M02k45k51N6M12J09l69j23L97J43j34l93N68L0l63
$$ y = [-256, 684, 641, -63, 81, 433, 350, -346, -228, 425, 227, -252, -145, 274, 233, -487, -463, 237, 117, -666, -402, 411, 333, -296, -203, 646, 453, -466, -313, 189, 230, -170, 67, 573, 572, -438, -337, 377, 55, -571, -473, 84, 436, -489, -385, 409, 467, -120, -447, 477, 135, -360, -280, 651, 566, -95, 51, 306, 378, -517, -522, 49, 70, -395, -415, 273, 211, -467, -452, -30, 147, -599, -499, 278, 511, 2, -24, 421, 488, 59, -368, 314, 230, -460, -272, 367, 216, -215, -348, 159, 130, -492, -715, 71, 171, -467, -222, 301, 314, -246, -381, 491, 323, -422, -208, 349, 434, -57, -163, 320, 300, -508, -320, -51, 78, -419, -489, 262, 335, -89, -167, 318, 204, -383, -298, 229, 622, -143, -64, 397, 393, -3, -161, 177, 83, -316, -389, 91, 237, -275, -362, 284, 239, -179, -511, 145, 154, -79, -55, 130, 315, -24, -101, 255, 379, -170, -352, 282, 16, -311, -410, -34, 79, -238, -203, 199, -46, -297, -241, 171, 280, -89, -212, 185, 328, 194, -199, 369, 399, 36]
960C6l93O89j45l67k24M10K97l90j91K82R4l59m2L20J95l67r1M75K89o94l3L41
982A32K21m72q6L60N8k22l60M86K03n60mJ59L44m15j93N36l0k57k05O74j12k75
1004a8j72M45K01n72R2R5K79m36k02M03J23l16l59K87L90k23l30K34J96j26k58
1025b67L93P1j96k22L50K43k57l18J05J99j07j99J63M58n58k15L11J45k02j93
1045b96M34k0l06nJ29M54k97l10J94L38l73j80L95J01k19l34K14K60j01j76J70
1066G2j9L5k74l6L17j44j67L45l2j32k55K79Q7l3l52K61L39k51k57L21J36k62
1088b2l37L84r2J00k06J77J78j64p4r8M77l03j35R2M77l98m61L66Q0J60m42J02
1110a39J55N5m1k11K38m5j90r4L10j94k40M41K87k76j98J13K82k86k19K21M07
$$ y = [36, -357, 332, 187, -180, -404, 6, 303, -87, -278, 4, 98, -261, -303, 17, 212, -155, -246, 229, 518, -176, -209, 132, 353, -119, -205, 155, 213, -9, -369, 117, 320, -240, -244, -85, 259, -156, -349, 187, 157, -100, -305, 369, 257, -18, -190, 255, 456, -116, -24, 71, 350, -86, -288, 115, 238, -78, -437, -150, 240, 17, -313, -79, 117, -9, -267, 126, 197, 1, -221, 129, 372, 115, -203, -98, 101, -6, -205, -42, 416, -142, -357, -46, 99, -103, -296, 138, 118, -188, -193, -64, 390, 93, -217, -23, 315, -58, -238, 157, 258, 39, -295, -81, 179, 78, -98, 72, 53, 88, -186, -222, 95, -49, -216, 129, 97, -35, -290, -11, 76, 43, -309, -48, 291, 40, -217, 104, 240, -22, -359, 25, -67, 33, -173, 4, 182, 18, -56, -154, 323, 20, -115, -23, 454, 56, -405, -39, 41, 201, -241, -139, 16, 71, 30, -181, 57, 12, -178, -272, 38, -156, -396, 45, 332, 56, -142, -29, 253, -33, -252, -31, 376]
1131C76j59l62K5K84k5k57M9K46k9m26J25M34k09j60R7n1J24j43J98J26l10j89
1153b36J56M27l78q2m7L11Q3n71J62J15m0j26K58J26j54k61J41J28k45L05p2K99
1175B99k20k37Q8J55O4j34j20J41j05j80K63K42l01p6k9R7K8k65K67J99Ok59j22
1198a99K37J54k20j07M28k92o6KL31j10l09n2P6J85k32J56J60l79n6J30J33R9
1220F9l82J65K31L0j53J4J51j05j48L30R5j75l19J31R5n3j65K08K83r5k44K6l3
1243d4J16k35J24J37j30r9j56M62j05j5j65J85l7o7n5K06m9j5j00J4K35l84K56
1266G9m3l3k38L5L01P4r2j41L37k12j85P1J25R1l20q2L31l3l67J06K57o8O8k30
1290a69J92nN6j48P4K43l16j20K30N0k9n3J30p0k96L22q6J09j37K3j25K34o6q4
$$ y = [376, 217, -145, -120, 164, 139, -118, -69, 177, 148, -278, -153, 281, 72, -88, 9, -42, 82, -61, 137, 263, -47, -236, -80, 347, -31, -113, -160, 151, 234, -337, -175, -60, -100, -226, 32, 158, 4, -257, -116, 12, -233, 72, 0, 299, 79, -158, -70, 85, 149, 15, -105, 36, -69, -249, 14, 256, -45, -121, -150, -53, -25, -290, -23, 176, 182, -77, -199, 38, 192, -28, -135, 293, 1, -65, -63, 268, 158, -151, -203, -127, 58, -174, -18, 142, -237, -293, -163, -30, 69, -313, -148, 83, 113, -40, -26, 125, 20, -128, 202, 297, 122, -197, -66, 29, -24, -189, 19, 302, 207, -37, -11, -44, 72, -163, -39, 98, -32, -131, -287, 175, 70, 55, -110, 75, 38, -29, -84, 122, 73, 58, -42, -28, 207, -177, 79, 36, 3, -235, -200, 101, 175, 83, -58, 279, 67, -118, -47, 78, 169, -151, -233, 98, 65, -302, -196, 61, -7, 61, -169, 23, 18, 74, -74, 0, 243, -73, -193, 37, 87, 58, 5, 135, 65, -231, 91, 5, 114, -23, 0, -125, 109, 43, -41]
1314d1j33N20j82j15k9Q7l45R2L6J12N3O4J6j50P2q7N2J83l24k27N00n8J2p6r8
1339f6K79k98J49q8m0J00j80N9J77K60k94j45P7K2qk28M41k41j29j9K65p6j08
1362i1J06J83j9j87R0r0O6M7P3l6l6k04L18j43k65R0K1J87m96J85L65Km42K15
1386f1Q1L9J92k96J78L7Jl65O8K66l55p3M60M7j79j96J72O7m72K66J56J82k82
1409f7j55J11P9r3N2l8J52p0j21Q6R6O1pj21n3J01j87K55J11j15j39P8j02N7l8
1434f7K94j86l01L14L0j86K86j96l5J16k57K16K17j39l27j4M50k61Q3Q5QJ34o03
1457c39K49K29j74q4j33J80P5P9l32J17J35q6j32K14%L30p10K67J24m4j21J81
1479B5k3j69J24R5J34k03k05J33j54J60j67L15R2k29J4R5J4j66j38J83o6k4K3
$$ y = [-41, -174, 346, 164, 49, 20, 107, -238, -146, -110, 2, 55, 119, 135, -15, 57, -30, 22, 205, -119, -346, 154, 96, 108, 32, -66, 213, -85, 64, -24, -64, 36, -144, -85, 92, 352, 58, -87, -10, 12, 4, -224, 217, -24, -153, -172, 93, 17, -91, 15, 198, 179, -8, 82, -8, 58, 105, 178, 142, 106, -98, 220, 77, -188, -98, -77, 110, -386, -201, 164, 166, -276, -61, 20, 59, 251, -45, 133, 170, 171, -194, -126, 140, -215, -288, 172, 219, 40, -156, 16, 83, -389, -123, 33, 215, -67, -222, -111, -32, -125, -73, -111, 41, -29, -150, -64, 32, 93, 86, -35, -88, 13, -174, 81, 192, 77, -62, 16, -86, -29, -67, 227, 41, -260, 54, 84, -102, 184, -12, -47, 69, -188, 28, 245, 106, -221, -235, 215, -46, 37, 122, 130, 264, -339, -90, 139, -35, -119, -252, -72, 3, 82, -250, -133, 2, -84, -216, -2, -2, 328, -382, -115, 9, -35, -156, 25, 2, -167, -43, 52, 186, -17, -222, -89, -243, -83, -250, 65, 157, -72, -58, 37, 51, -115, -253, -70, -136, -160, -137]
1502a37j3J83J16k75J30J6j14n9J23J63j15l06J53M2K21l85K10o1J05k1J59j42
1524gr4k1J97N3j30k02K17N7j33L4M4J46r9n0k34M39j21j56N3J04k5o1J30k15
1548g4J93j61k9K82l27m3J37Q7l0r9k84L86j19P6O8q9J86l22J84Q9p1k98K86j5
1572A3o9OMJ36j18m8O4l8J19j13K5J01j76J1J14J03j83O6q9K06k11M5J0J14q0
1597A2j54Q5j99N7J02Q2m3K0J32j39P3P2k8n9n8L5o8O9N9o7q0J19K5j11J20j32
1623g6m5J63r2r4J15J87k20J08r4K28j26j85J39l1j39K83k11J56k68N5K18j6J8
1646G3J68k90J18Jq6K39j79K8j6l79L11j3j95J58J63p6j55L82j93O9q5k70j3K81
1670D1O0l9Kj97K68l9k62K19k80L42q5j22M0J40n4L8m5k16J91o8M9o1P7Q6j32
$$ y = [-137, -150, 33, 149, -126, 4, 20, -94, -153, -30, 133, 18, -288, -135, -93, 128, -257, -47, -108, -3, -24, 135, -7, -101, -122, 75, 128, -2, -204, 13, 70, -63, -29, 15, 161, 62, 12, -222, 217, 96, -60, -7, 97, 72, 11, 141, -74, 119, -42, -71, 211, -116, -159, -22, 65, 35, -64, -348, 38, -81, -5, 63, -26, 160, -162, 22, 111, 40, -258, 28, 13, -56, -50, -46, 90, -28, -76, -12, -50, 69, -44, -19, 82, -94, -83, 31, 134, -49, 17, -72, 134, -77, -32, -22, 92, 12, -142, -57, -256, -199, -97, -15, -58, -38, 94, -45, 28, 100, 72, 13, -45, -10, -78, -9, 50, -17, -97, 22, 47, -64, 56, -76, -121, 42, -50, -144, -29, 158, -62, 46, -48, 180, 54, -131, 8, -23, -162, 121, -90, 66, -202, -147, 71, 55, 73, 241, -49, 69, 70, -16, 223, 44, 72, 56, -323, -12, -25, -220, -62, 101, 25, -130, 252, 59, 128, 43, -227, -240, 41, 101, 62, 64, -133, 135, 96, -166, 53, -227, 115, 30, -92, -52, 88, 34, 72, 27, -189, 2, -66, -17, -78, -1, 85, -47]
1695d7N9J10k09J54k05L04q5q9j40J64O9m6j62N4j42M3L11Qj85l6%k6L2j01J61
1720do2M1k2O9P0q8qQ8O3Kj70J10nk07L71j32l21J23J24j71J03N9j61J33J53m34
1746b76K11J21k10J98P3k62J73r4J5J75j89P5J14j90p4L3K24j34n0J66k37R6J08
1769F6k15K14r0L5j05J92j06Q2k7J8j02J27j96pJ71n7j04J23J57j26k70J90J00
1792G0j16J50j45k5r0J48j4jm9N9Q9j76J89j23L4P5p0K17n4q9m8L6j84K48l15
1817a84L81j66k01K96q3o4oJ22o2j78J04O8k30K27J27k68kJ33j64r2L00k38J72
1840hj7O7n8j75K55l6r7j0K28k85M6n4Q8jl6J98j58M9j15N0om7K46p4mq9R0k02
1868a55L21j89p8O0K19K72m11LJ60j46k6%l6J15k26K14L1k7j62O6j23r3Q1N9j4
$$ y = [-47, 12, 122, -87, 67, -138, 166, 81, -8, -148, 16, 85, 39, -123, -69, -211, -168, 143, 151, -34, -70, -70, -96, -64, -165, -4, -66, -25, -47, 22, 92, 4, -4, 84, 147, 149, -21, 89, 84, -123, 248, 116, -205, -82, 42, -129, -26, 33, -128, 5, 158, -276, -65, 56, -154, 44, 117, -145, 28, -66, -51, 124, -65, 10, 124, -66, -140, -107, 117, -17, -67, 99, -138, -42, 66, -149, 65, -25, 10, -95, 97, -9, 73, 46, 64, -38, 89, -107, -114, 57, 0, -104, 19, 176, 50, -220, -30, 70, -46, 104, -41, -66, -156, -8, -22, -23, -72, -13, 76, -100, 89, -34, 0, 75, 5, 222, 168, 79, 31, 67, -117, 131, -184, 197, 31, -170, 126, 43, -21, -27, 95, 33, -145, -41, 27, -203, 24, 151, -117, -119, 14, -150, -242, 58, -180, -8, -25, 42, -16, -191, 64, 28, -69, -79, 149, -136, -90, -144, -56, -57, -93, 105, -53, -4, -119, -69, -75, -122, 124, 50, 46, -43, 47, -155, 166, -23, -101, -41, 178, 450, 39, 42, 202, 56, 30, 30, -6, 109, -117, 97, 128, 101, -61, 5, -118, -211, -130, -71, -85]
1893h5O3Rp8J75j02K6P3k2k23Qj2J12J6N7M6l1K3j31J85j02PO6r6j9p0J84J50
1920B29k39j0J76l5j81j79J49J48O1k61J03j6l1J8K7j7j9o1j4K28n2K3j7J28j15
1945D3o4k1L0J0m6J0JJ29r4j65J29M2k7j20L6J41L3k9j34O4J35p7J02o8op0k33
1972b49J9J10R0q7J32J75k26Q7k1j07P4j25J12j44J70J11j55P9j25j7K5K39j02
1995F5q2J22q2j12o5J94j1K7k18K40o8k62K62k3p9J14j49J16P8r8J63j60J78k10
2019f0Q8j49K16k32J80J30k39m1L48k05Q1j29K4oJ08l20J32N5J68j17j13K20p0
2042F9Q9k11K96k45p3p0L19p2l6Q3j3rj28j00k6K9QpQ3J86Jr0j41J89M0k49N6
2069b2k0K35k25l6J48o8J50r6k22J01K9r0R4k0M4J15j68%M9j62L48j84n5J10O3
$$ y = [-85, -22, -13, -91, 84, -18, 8, 81, 59, -164, -156, -168, -56, -40, 17, 63, 32, 55, -76, 109, 7, 14, 80, -16, -35, -105, 79, 229, -10, -20, 156, 121, -60, -239, -90, 58, 119, -142, -39, -55, -86, -68, -41, -58, -77, -138, -152, 76, 24, 47, 30, 158, 43, -21, -42, -12, -2, -48, -38, -37, 92, -2, -167, -38, 4, -23, -143, -107, 34, 67, 38, -96, -32, 103, 26, 128, 60, 54, -16, -249, -230, -120, -30, -117, 15, 190, -36, 51, 30, -77, -3, -128, -16, -160, 10, 121, -34, 45, -80, -97, -72, 167, 65, -17, 105, 23, -89, -154, 40, 29, 56, -162, 78, 10, -252, 10, -13, -92, 22, -127, -11, 67, -31, 132, -28, 150, -60, 28, -121, 95, -137, 43, 173, -66, -107, 241, 36, 117, -12, 12, 6, 114, -206, -74, -19, 149, 32, -81, 139, 69, 158, -53, 243, -2, -75, -145, 174, 102, 66, 149, 136, 127, -1, -101, -127, -98, -90, -97, -14, 172, 173, 83, -58, 131, 171, -78, -22, -42, 193, -32, -68, 80, 12, 162, 66, -156, -55, -26, -116, -22, -42, 2, 117, -51, -51, -2, -164, 184, 0, -55, 55, 118]
2094A18j29Q7j35q2L51j84J4Rj23J39j76J68qk51K70j10n3Q4l9O2P0J27m00K40
2118D9p9k70L42j56L5K18J09l39L8M3K17k36J13m1k22J99k40L40p5j69J29mM3
2141D4Q8j66Mj06J93k25K55n2pM5j08k2P7m1j24J37R1N7r5k04J25j5O5j7r2l4
2167a27K2m1M9J56l2J29j24m5J15n4q6J07j52J56o1K1J47j18o0k01O5J35K62j18
2191A45l8k45J19j8R4j73K96q0j49k24J98P6L8q2l5O9j2R8k1L5rk31Q9K7L8n0
2217d5J1J70j60k4k6J26M9j83K52k99K5R2o6J07k9MJ62j67J02k02J98j11J23l8
2241G1k11J58m3J16r6j00j09jL36k36j45L82j6q0q8k0J35n1J55l09J01J6j7j4
2265f6q8J9O6K0J96l87K70K06l11J12j75J39k75L34j46K62j17k11J99j3J4j03
$$ y = [118, -11, 76, -59, -141, 210, 26, 40, 49, -74, 65, -111, 57, 49, -202, 68, -42, -95, -11, -50, 12, 82, 209, -191, 49, -30, -300, 42, -114, -79, 139, 248, -91, -53, -10, 207, -29, 84, 43, -179, 20, -220, 120, 45, -124, 5, 1, 44, 132, -34, -30, -136, 57, -168, 87, 35, 28, 73, -35, -57, 20, -21, -145, -8, 83, 140, 45, -159, -34, -49, 16, -1, -93, -127, -105, -146, -97, 59, 27, 156, 32, -13, 102, 48, -38, 69, -83, 73, 12, 33, 180, 62, 2, -199, -134, 1, 263, 145, 107, -138, -19, -37, 57, -116, 180, 100, -49, -273, -75, 1, 39, -43, -78, -9, -21, 77, 56, 91, 82, -149, -60, -33, 5, -45, -34, 136, -24, -48, -74, 52, 101, -82, 170, -129, -104, -12, -78, 29, 0, 4, 166, -1, 101, -101, 97, -14, 109, 71, -140, 18, -25, 91, -5, -105, -214, -215, 121, -115, -260, 122, 106, 26, -62, -82, 53, 2, 157, -152, -51, -35, -52, -66, -154, -135, -69, -49, 147, -240, 30, 236, -75, 37, -138, 1, -274, 60, -86, 176, 59, -152, 47, 34, 48, -55]
2287e5N5P3k7O1k54j6L20k8N7k28l7j36K12L3K8K2P3l26M3n9K22k05J22M4J0M1
2313D5L6m1m7r5j13L56k75P7L5J05o1j15J10r7J53m4o6k2J0K83k08Mrj81K46m8
2339C8Q6j1r5kP6M0k80K63k71P4K04j38n5N2J70o4J0n0j01P1L6j47J23N2k9J10
2365A62l05J93l6p1Lj7J90j86K72k64K43k06j06M3J34p3N5o8q1m6L23j99l7L51
2389B74m39K89j19J51k12j79J22Q5m6j62K70p5K15j15j22pJ87Q9r0j09L4nq0Q4
2413D0O2j59J27q6J39k75K7J51J68k75Q0m6nm4m9K74j52O4K5o3k10L98j59R1k25
2438a02R3Q0l4k32L37q8J22j53j29J22j2k9N0L8k38M19k53Q9j76K90k85N9J00
2461F8L3Mj3Q8m5m9k08Km3J80J65q5j64J25l7m4k06M35m8j51j46J18L1l01L24
$$ y = [-55, 0, 73, 46, 107, -147, -163, 157, 129, 186, -42, -79, -215, -3, 30, 58, 80, 153, -173, -130, -189, 33, -172, -50, -6, 4, 45, 81, 40, -7, -102, -215, 141, -134, -57, -22, 83, 22, -93, 17, -80, 73, 29, -37, -59, -49, 234, 26, 30, 21, -160, 86, 38, 124, 113, 18, 16, 92, 132, -148, 115, -156, -82, 122, -16, -71, -19, 151, 87, 97, 47, -54, 17, 53, -94, 29, 81, 52, 162, -143, 50, 14, -57, -54, -71, 119, -67, 205, -59, 184, -22, -128, -85, 49, -24, 31, -37, -118, -164, 159, -40, -77, 274, -165, 124, 5, 156, -56, -235, -113, -28, -74, -236, 34, -41, 174, 59, -63, -70, 117, 206, 116, 7, 41, 36, -44, 40, 102, -57, 70, -16, 123, -152, -125, 26, 194, -81, -1, -47, -52, -96, -145, 129, -23, 41, 66, 3, -207, 191, 32, 123, -102, -9, 71, 37, -195, 142, 54, 176, 23, -106, 16, 4, -25, 25, 63, -175, 244, -9, 80, -96, 194, -91, -32, 68, 101, 105, 92, 180, 135, 86, -122, -120, -163, 17, 182, 97, -67, 58, 21, -23, -229, 206, 158, 7, -139, -21, 10, -291, 33]
2486C3p2m5J09m6m3J38j38l6K22j80J2m5K1q8QJ23K7R1k11J48j7R6j77K5JL1j61
2513a74o6Q0L0K73l4j78J19K3r2n0K52k62m2m0R9J75k11j6K9J8R5R6k64K35m9
2538D6j85J12Q0P8j75J2m3Q7J36k14J42k41K07j17p5Q5O4M5L4j4j18p8J77J43
2562A88p1J98l00j39J35N5k14m0Q0mm5J29N2J26k34J80k8p2q0J12j40K28J11m74
2586b47J10J62R0n0Q9Qo6Pj53K1K2k63J29N7j38J35M2R4n9rj59J75J40P9m56J35
2612a05J75l54L30O5o4j84M9M6P6j18J3m6RL64j88Jj02J4J22r5L5j90J88k31K04
2637A4k6J64k24J56l6j78O7j15J36j17K73j06Q4k07K37k51J81q8J44j01J36l38
2659a95J98J40j88k1QQ5O9r2r1lM4J9n4J98r3M3j43K90m3m34L86r7L3j29Q3J45
$$ y = [33, -39, -84, 25, -21, -64, 74, -64, -100, 122, -58, -46, -91, -70, -158, -150, -27, 0, 91, -120, 28, 11, 107, -70, -45, -44, -13, -174, -240, -160, -130, 143, 109, -69, 50, 73, -19, -69, 183, -79, -121, -161, -62, 113, -98, -114, -85, -67, 28, 124, -140, 95, 46, -139, -27, 53, 131, -44, -32, -75, 12, 148, -66, 76, -165, 42, -75, -150, -65, -1, 44, 78, 64, -54, -132, 45, 188, 117, 315, 15, -124, 11, 66, -148, -188, -108, -112, -157, -28, 24, 150, -84, 96, 68, -4, -84, 28, -112, 116, 227, -247, -137, 25, 115, 65, 154, 162, 96, 103, -50, -29, -7, -270, -141, -84, -222, -87, -45, 49, -10, -19, -178, -3, 137, 216, -240, -105, 70, -284, 46, 111, 47, -137, -88, -42, 34, -84, -71, -117, -108, 256, 68, 69, -33, -19, 103, 8, 43, -147, 41, -190, 14, -12, 152, -72, 84, 48, -130, -63, -178, -42, -159, 114, 8, 92, -115, 122, -129, 52, -36, 108, 7, 143, -195, 3, 143, -45, -66, -58, 27, 96, 4, -87, -90, -46, -27, -81, 117, 24, 67, -76, 214, 171, -263, 123, 26, 59, -70, 13, 158]
2685A58N3j97J3j32l6R9M1J88j27l1k3J07j03p3O1N1j64J06J12j66K17j44J17
2708A27k99J24K1o6P2k9J56j01Q2J9n0j5J10k51O7K27k07j07R0P5o8j70K55pj11
2733e6L0K0J1o1r1J48k03K29Q2r2j55K36p1J62l0k02K66k70q3K6N2n7J30N3k29
2758a55J42J48j97K6J13p9k7J78j00Q0K4k16J10k99K30rr6j2Q5Q4r3R3K9l2k47
2783b20L39k0j00j20J47J5L9n1R7l03l8P1J77n2O1j94R9J11P2j77M4k46K42O7
2807F0m3o7J44j63o4L2QK91j55m4M6j42Q1OJ2j01q5K58p7J78lJ3K5j65n1k4N0
2834B0R7j49J44j96R8l1p9J59j95P3%Q9j34O0k6j2k1K87l02L02j74K6k02P7K61
2859A72k59R9n6J77p1j3k36N3J42p6o0J93q6J49k78P3K09N9k35J5o2K07p6m4o4
$$ y = [158, 211, 14, 27, -105, -141, -42, -1, 187, 60, 29, 6, 113, 10, -63, -2, 49, -115, -9, 103, -63, 154, 10, 127, -172, -48, -27, -93, -21, -50, 106, 5, 87, 106, 56, 41, 151, -100, -33, 194, -13, -120, -30, 45, -23, -193, 62, 55, -56, -26, -6, 5, -56, -147, 1, -202, 27, 109, 17, -138, 98, 27, 189, 159, -43, 223, -47, -130, -104, -52, -109, 21, 74, -155, -13, 135, -62, -36, 77, -2, -29, 149, 49, 129, 153, -63, 47, -252, -22, -31, -127, -139, -54, 30, -63, 30, 59, 27, -220, 119, 99, -1, -121, 26, 41, 80, 29, 126, -177, -215, -144, 33, -19, 42, -152, -53, 58, 130, -47, -3, -249, -7, 60, 17, -50, 94, -69, -133, -101, -93, 198, 43, -1, 45, -97, -16, -10, 2, -99, -184, 74, -3, 175, 172, 185, 210, 45, -6, -30, 20, 117, -32, 112, -84, 14, -17, -96, 63, -132, -59, -59, 30, -104, -44, -70, -82, -103, 184, -118, 184, 10, 36, -166, -89, 172, -87, 12, -44, 133, 62, 49, -187, -134, 8, -68, -128, 65, -21, 128, -150, -77, 132, 191, -44, -29, -91, 116, 40, -4, -68]
2884f8k3K93k83M9R3j09J67j25j9Lm6m4n4L28l06R2L1j54L73n3k0n1j93j57J91
2909h5m0J91j12M4o9J82J51k06j49p7J94n7N6J98k23R2l00J91q4r0K63j63J23
2932C0n5q7Q7j73K43j39K78j01j23n4N0M4l05M95k73J08j51L7j36M8L19l54P6
2955a36J23l6RJ77k30L0r8J67J06k31P6j90L50j06J50j66O6j79P1N3Q0M9k4M7
2979A58j05l10J77j06J70j7M0q8J17N4j02q3Q8J09k0j80j97K10J66J08j61LjK7
3003E7j78K06j73j09N1M8P1J82l26P4J65j16o7K43k25J01k06M3J0K85q3k75K31
3026IrRl6J60k0j55J46j31o0K09O6k84N5J5O4k3J90k89M6J02j7J94k64j70J44
3051d9Q5J60l4o6k31j15K67j63L51k36R8J77l53J60J5k57K93N1l8j30O4r2j29
$$ y = [-68, -91, 202, -81, -32, 61, -48, 119, -6, -25, -22, -68, -112, -166, 162, -144, -52, -21, -175, 198, 145, 125, 74, -119, -276, -85, -125, 66, -46, -2, -71, 111, 262, 56, -93, -170, 24, -33, 23, 221, -2, 90, -210, -19, -103, -193, 70, -93, 30, -25, -112, -25, -198, 45, -94, 184, 83, -40, -94, -44, 0, -305, 190, -83, 25, -126, -89, -225, -177, 142, -212, -136, -13, -49, -40, 137, -93, -63, -161, 6, 112, -119, -43, -233, 117, 11, 161, -5, 61, -118, -47, 6, 86, 135, 111, 158, 53, -257, -80, -186, -16, -33, 7, -81, 36, 90, -12, -95, -7, 102, 82, -98, -295, -85, 81, 189, 28, 31, 30, 57, -121, 85, -88, -197, -146, -98, -27, 155, -171, -97, 68, -48, -115, 128, -97, 4, -202, -159, -149, 136, 53, -222, 9, 0, 9, -27, 133, 113, -42, 104, -27, -87, 122, 188, -96, -41, -26, 38, 15, 205, -84, -38, 64, 47, 241, -23, -193, -49, 36, 196, 162, 96, -135, -250, 17, -146, 205, -31, 67, 244, -109, 51, 66, -191, 102, 153, 115, -15, 49, -43, -172]
3074a72K73n3J08k41q3mq4K25N8J99j94Ok3p3M0J22j51r5L3K28l9k1qK4k75K55
3100E5K3N0j62J79r7p5J02N2j32m2N6j24R7k6P4J81j7k48K30j09r1j13J75p4N5
3125A9qL3j16J95j13N6j01k3L7j58J94Mk5j8lk2P9l3j21J87n3n7KJ78k04J21j43
3152i3O8J35l20L55j86J22j04j39L16K7j70K3M4j10J34Q8m22K12Q2n1K6m4M4j14
3176g7K3k5K75k16j08J63L5Q8M1j69r5J68P5j95k68M45k71K18j24M3o1j57K22
3199C0m6QL9l00K14J94j93p1J51o8O1m1M1l3Rj25K28m4n0O0o2J24m1q7J6j59J33
3226a2j14J51r6K5P0Rr0K82k69k5J16j56N8K8j76L14k18J63k19J98j50n2J29J58
3250A24j35m0o2L9O2m0k19L59p8q8K50r3j01n9J00p5N9K8J89p1k96n0K14q0J66
$$ y = [-172, 101, 48, 156, -85, -168, -172, -256, -31, 27, 226, 32, 38, 15, -58, -18, 104, -47, -142, -109, 119, 80, 59, 51, 75, -200, 55, 78, 128, -34, 145, 48, -27, 75, 127, -5, -47, 9, -115, -18, -44, 30, 211, 194, -54, 176, 67, -24, -137, 38, -36, 19, 11, 44, -72, 123, 10, 66, -35, -58, -21, -179, 15, 19, -6, -24, -27, -49, 30, -3, -124, 63, 10, -47, -45, 133, -71, 50, -93, -25, 110, -210, 145, -41, 81, -23, -162, 154, 181, 11, 34, 78, -32, 102, 190, -232, -20, 62, 11, 37, -7, 37, -77, -54, -79, 196, -20, -128, 35, 70, 158, 199, 30, -65, 103, 178, -17, -285, 160, -111, 107, -17, 26, -35, -192, 30, -16, -8, 31, -269, -55, 139, -54, -125, 26, -42, 19, -22, 19, -14, -5, -130, 98, 54, 4, 64, 2, 126, 85, -2, 14, -145, -12, -126, 25, -71, -46, 24, 33, -57, 225, -44, -69, 47, -109, -51, -23, -199, 115, -103, 60, -159, 39, -111, -163, -34, 124, -11, -51, -113, -74, -12, -52, -271, 88, 10, -78, 172, 79, -22, -81, 19, -56, 3, 31, 220, 149, -147, -197, 17, -63, 103]
3275A03k04Q8J4p7J1K2o3j2K26m4j65J0L2o1J47l1KO3m3J8k7J06j79j27J98k0
3301a3j0R9j94K26m2M1j9j83K02j50J5J10j45J33k00J42J51k85Q0K7j3P4k26L11
3325A31j36j74K53j38O5o8P1l2l6N8J1K7j5o9J91j49J1M0p0L8p9o5O9J9J17P4
3351A44j78R4j39P3J7j2J38j06j6j3m1J41R1k27J64j89J17L0p4P7L3j95J90l27
3375b08K49j45K47j92r1J79J73l70K33k30M87l20k48K33J60k73K56j72n8J32J51
3396A93k54r7J25r1N9J31j70J31J29k42N1K0qJ34j69L%j8K8m3k48J13K31p5Rj3
3422g1R7j96L64j49r9lN8L2j58J17Q7n5o3R6J47k20J88pl15P1N9L0j98l1L56m6
3448I1q8J90j50OK7j38l9nQ7K39j51Pl44R9Q9j8M8L2L9l2k7R3j03J45j00K4J54
$$ y = [103, -101, -13, 1, -76, -65, -43, -106, -118, 108, 64, -101, -91, -59, -120, 27, -4, -2, 61, 18, 36, 9, 115, -64, -191, 7, -13, -23, 76, -118, 108, 66, 107, 88, -95, 107, -43, -28, 82, -63, 70, -130, 12, 163, -122, -42, -15, -28, 46, -180, 131, -5, -179, 74, -64, 1, -67, 4, -28, -64, -6, 5, 32, 17, -52, 139, -10, 1, 41, -29, 9, -70, -135, -66, -47, 70, 144, -34, 60, -79, -6, 11, -1, 137, 31, 15, 2, -39, 102, 193, -34, 130, -59, 58, 88, 14, 91, 124, -71, 119, -208, 41, -104, 143, -49, -140, 39, 212, -158, 75, -155, 332, 12, -236, -3, 157, -116, 140, -32, -90, 42, 193, -61, -158, -33, -124, -65, 66, -104, 27, 156, -86, -35, -15, -23, 111, -58, -55, -55, -73, -45, -88, -336, -223, 8, -67, -58, -71, 26, -170, 194, 45, -54, -57, 1, 33, -125, -8, 79, 24, -39, 57, 204, -16, 172, 165, -150, -79, -20, 10, -188, -219, 137, 91, 3, 193, 43, 49, 76, -62, -101, -106, -19, 220, 69, 76, -268, -169, -80, -98, -50, -18, 21, -11, -38, 55, -48, 97, -3, 21, 175]
3475A75o4j30m5L06o0j91J01K0k02n9N33n33K0N8k5r3L93k26N0M0K3O3k46J17
3499B5j23j08K34p9Q4j2N4m0N8q8k4K04j91lJ39j85j47L15o0jo3J92k28l07K55
3524i9K1r2K41j85J19r3j53J18K9L6p3K08o2j69J18J00q5m2K06r1J01o8k1n6J2
3549B0j2j69R1K00K2j23N8K1l1Oj62p5K22q0J00Rk24J72K47j54m9J6M4j85j12
3574a48N0R0J50l72L17K7o6qJ79j81j86O9J68j06M0n6N5K4p7J39j34M0j5k02N8
3599a45K44j38m7K3n9J36r9j25L09l4J06q0m2n8J73k69K26k42p8K23L4q9o8K35
3623A36K7j12j36L4j1m9O0R1J22M9k36N0K4n2j6J48n3k63J36p9Q2Q0p3N1j08L3
3649f5O7j15Q5jk7J67j9k15J35J33M6k17Q0l9p5N2Q9j94J6K10q4J27k14k5J99
$$ y = [175, 111, -19, -64, 242, 182, -9, 92, 112, -90, -149, 384, -149, -129, -71, -96, -189, 204, -22, 28, 68, 91, 154, -92, 25, -98, -206, 28, -51, 33, 21, 75, 35, 93, 5, -19, 185, -6, -9, 130, -55, -202, 113, 53, 52, -11, 181, -47, -354, -99, -78, -170, 71, -114, 5, -88, -241, -123, -94, -58, -131, 77, 15, -154, -36, 64, -21, -63, 143, 52, 153, 85, 64, 8, 20, 8, -161, -70, 130, 152, 29, 87, 108, 77, 83, -79, -154, 68, -12, 88, 97, -127, 45, 292, 138, 89, 105, 149, -36, -148, -98, -8, 142, -230, 87, 114, 48, 40, 219, 38, -148, -79, 89, -17, 23, -33, 22, 46, -31, 108, -26, 14, -1, -203, -145, 99, -39, -86, -63, -122, 14, -85, -210, 99, 65, 171, 91, 49, -9, 164, -105, 121, -121, -199, 24, 58, -31, -99, 136, 163, 51, -85, -51, -62, -111, -51, 40, 162, 211, -25, 25, 49, -3, -19, 129, 76, -187, -51, -130, -48, 32, -41, 10, -98, -65, 2, -113, -28, -29, -56, 111, 92, -123, 12, 145, 191, -26, 54, 15, -60, -8, 81, -113, -97, 113, 29, 156, -58, -83, 116]
3674A16j60r6J13J25k22J24k0k5o1J77k32K03j7j04K92m7r2j07n3j6K68k8m6p3
3698A9r4K62l50Q1Mj11N04k88j8j57J43rN7J19r6L4l14K35j75L3J84J4J16k37
3722d4J26L1k06K14m7n3l05L47k7n3M7n0Kk6m9K17j27J06k71P3P8N5j89R2m0N4
3748d5L4N8L2j26K01k84J29J29l60R0K4J52J07j35o9j3J28M3o3k80K40O2J07k48
3772h7J38k46J87o7K08l9L9j80j2J5J90k05K60r9j19k7R8r5J18j21J56k01P6O7
3796E4k6K23n31K10J3j55K65k8J38q4k9n1K30n4l39K60m6J08j51j0n3L2K31j86
3820B1L4J36k03j49K11l9j01L9M0MJ67Jj75k15J76q3P8J8J08P6j8j28j56RL13
3845A64m52L29Q1Q8j18Q8k20q9R8J15r1Q9J43j94j82K13Lj11J33k51O2L8K1J09
$$ y = [116, -44, -140, -27, 98, -124, 0, -20, -45, -106, 71, -161, 42, 25, -79, 213, 166, 74, -33, -86, -102, 166, 138, 92, 19, -75, 187, -163, -82, -78, -189, 315, 27, 9, -148, -5, -14, 43, 162, 66, 100, -214, 21, -154, -121, 63, 77, 193, -44, 82, 113, -93, 121, 74, 21, -284, 63, 36, -17, 30, -20, -18, -44, -93, 124, -3, 103, -168, -95, -17, 38, -151, -59, -99, -45, -11, 47, 79, -47, 154, -130, -1, 128, -232, -142, -118, 34, 141, 6, -63, -76, 52, 95, 32, -248, -8, 54, 161, -87, 51, -195, -8, -75, 133, 94, 133, -47, -59, -44, 146, -59, 201, 102, -17, -44, 54, -41, 77, -44, 112, -89, -13, 54, 28, 251, -280, -70, -57, -212, 53, 25, 163, 79, 50, -1, 229, 175, -164, 96, 50, 158, 7, -3, -56, -24, 207, 21, 55, 191, -12, -161, 50, 11, -90, -51, -11, -7, 160, 161, -14, -229, -53, -136, -58, -40, 68, 144, 126, -2, -158, -149, 164, -288, 41, 122, 210, 92, 180, -40, -129, -31, 84, -7, 82, 225, 31, -151, 62, 65, -46, 87, -164, -102, -64, -43, 66]
3869F6N2k44K02J17r1N1j59J53j78J11p6j90N2J34J15j6j47K1R4j0k63M30K7k02
3893D9K8j6nj82K92k03j05R7j29L45k36rJ30jj07O4j64J8L0J53M3m5l8K5K84l40
3919b2J0j22Q0N6J04j30q4K76l15K32j40M8J66n09L01J15qj13J6J58l4o5r7J53
3943G6j53R3J00l46K40k4j49l9J84N0p7J12j88k8J61J39j73Kk3q0O5P7J26k61
3967a16jPK71r1p4rN3k76J30J00qJ88j52m6J20J2k32K5N9J68kj46J2KJ02j10q9
3994a03J76j75jp3K74k22K30j70j54L31j90J26L8R6k02R7l6j53O4l7j65L14j22
4017e7J88j87J61k38J81K45l39j63J95o8j10K85r5N7M3k6m2M7p2k34J78P6Q0k83
4041a78J85R3j00O3k6L9jL8q3mj98J81M0R9j36o2k15L07k11R2L46l58Q1nL8J76
$$ y = [66, 118, -126, 76, 193, 102, 153, -6, 147, -31, 80, 4, -186, -134, 0, 115, 99, -48, -27, 67, 57, -206, 224, 251, 49, 77, 61, 56, -126, 166, -37, -142, -45, -174, 171, -65, -74, 56, 55, -52, 12, -152, -134, -104, 49, 92, 47, 9, 34, 318, -22, -12, -134, -54, 2, 106, -24, -108, 168, -147, 85, -55, -7, 159, -350, -49, 66, 58, -55, -39, 119, 85, 20, -77, 76, -77, 16, 116, -230, 10, -14, -163, -202, -18, 32, -45, 67, -121, -149, 12, 151, -22, -20, -43, -123, -58, 19, 145, -116, -117, -110, 161, 70, -4, -13, 40, -236, -106, -6, -14, 174, 22, -24, 96, 108, -124, -99, -40, 128, 126, -20, -8, -6, 96, -14, -103, 73, -102, -103, -176, 98, -124, 106, -64, -218, 113, -77, 49, 87, 183, -19, 78, 42, -111, -47, -84, -249, 65, -57, 131, -56, 105, -133, 48, 293, -46, -209, -14, -82, -192, 93, -2, 55, 98, 72, 30, 77, 5, -229, -51, 25, 105, -178, 7, 100, 0, 63, 37, 76, 75, 113, 30, 26, -172, 9, 49, 148, 12, -50, -265, 42, -169, -77, 269, -89, -8, -13, 25, 201]
4067B01r4k24J50j27J29M7q8m6j25o7L31j79J42r9P2R9j67r7R3q6J39K7n9Q6p6
4092a8j52J65Q7l30J86K19j05n2rj71K48l27M41k03k0J2J36j50Q1o3j31J23J84
4115A51k47J53j29J27J10p6m2j22K4J15R8j27J42Qj92l0J11q9L1o5J65n0J21p
4139A80l0j92l6J47j36Q4Q7j67oP3j24K01N8k25R3On5M2Q6k18K8R9j09J79Q7j22
4165C0l0p4J51J26k28K61l20N2K3j29J92k6j09M0j5l6p5J22K47k69O4l4M8L9j16
4190f6j19j57K49J44K1k97J57qP8o8J84M9n2j02j70J12q8J40o3J06m7j35K07m4
4214C1j04K29j53j65K40j63k5L67l33K1K13l03K10j95K36n2J9j64K05J3k50J53
4236C0O2k11J0O9L0qM2m0rN7j7p2M5o5k1J6l2K21j02j29M15l08k7k4K7L8Oq6k01
$$ y = [201, 107, -117, 33, -94, 35, 82, -6, -52, -177, -244, 87, -92, 50, -49, 23, 122, -45, -142, -49, -135, 4, 31, -28, 58, -18, -170, -5, 82, -248, -62, 157, 52, 0, -9, -180, 68, -259, 182, -21, -41, -29, 107, -43, 38, -25, -156, -33, 151, -96, 57, -72, 55, 165, 89, 47, -75, -51, 64, 162, 35, 177, 185, -7, -37, 74, -15, 16, -49, 116, 66, 187, 180, 150, -42, -78, 69, -67, 17, 104, -63, -69, 4, -120, 81, 139, -86, 7, 13, -42, 0, 86, -132, -104, -5, -114, 65, 152, 30, 0, -74, 77, 203, -25, 236, -84, -32, -9, -138, 54, 28, -81, -41, -56, -92, -167, -45, 202, -67, -3, -37, 11, 50, -66, -185, -342, -93, 51, 72, -225, -68, -76, 2, -66, 118, 167, 115, 13, -157, -45, -133, 7, -56, 50, 3, -132, 75, 31, -73, 156, 3, -162, 78, -85, -110, 257, -76, -55, 158, -145, 65, -130, 106, 54, 73, -91, 114, 127, -123, 30, 92, -119, -109, -40, -10, -18, 24, -16, -25, 32, 15, -57, -12, -77, -98, -82, -114, 107, 5, -124, 291, -17, -44, -68, -41, -3, 3, -83, -284]
4265b84L04K1P4l47K78j50M63k85p5j35n2R9J13J75l73L47j91l8K00j24R3L9j98
4288d6O8j63J37J60p4k9N5l36K42n5O2j46K22p5J32q2J6q6J00P5k52K5r4J81M
4313D1jj07N4J30q5J53o4Ro9j0j31P8l7JPj38l0L11j17Q9l16J94j23K04j07o4
4339a28N8K02r5j19K47j96J18k51J54Q1j82J74O7j91L32l34p4K38j4j46j94K83
4361C0rj49J95p6K1NN6J54j83J04j00L9j12r9K78j11O2j93L8N1L8r7J40j40J24
4386F6q1j83J99j99K41k95L44k0j6J32l31K08J7k1n3P7p7n4K71k05o0M1K20n20
4410b99L57j43O2Q5j6J99k30L9j94J68k81L08j00J98j48J8j13K3J25L3j61J79
4432A09J14l20K1K81j04l00K17j52Q8l7R8j73J20j0k2R9n4L8o8J59o9J7j53K16
$$ y = [-284, 20, 41, 115, -232, 46, -104, 359, 74, -1, -136, -188, -89, 24, 199, -174, 173, -18, -56, 144, 20, 113, 152, -46, 22, -141, -4, 156, 82, 53, 108, -228, 14, -41, 21, -125, 97, 22, 154, 72, 88, 2, 102, 177, -75, -50, -144, 37, 41, 40, -67, -13, 117, 32, 185, 121, 130, 61, 51, -80, -2, -39, -38, -31, -169, -199, 112, -5, 84, -232, -38, -161, 43, -64, -128, -70, 132, 37, -82, 165, -31, 87, -164, -10, 71, -111, 63, 130, -61, 271, -63, -137, 101, 87, -59, -253, 30, 21, -128, 67, -9, 12, 17, 73, 227, 44, 148, 48, 87, -25, -124, 154, 43, 105, -88, -50, 1, 39, -58, 82, -58, 66, -15, -198, 1, -198, 43, -252, 92, 72, 56, 188, -143, 65, 82, 61, 8, 85, 8, -46, 225, 20, -40, 1, 221, -299, 58, -85, -23, 62, 46, 245, 15, 54, -140, 28, -253, 55, -45, 153, 5, 23, -90, -67, 58, 91, -70, 109, 223, -97, -76, 205, 101, -199, 18, -134, -46, -83, 15, -158, -38, -48, -70, 29, -25, 13, -55, 104, 35, 52, -101, 115]
4456A15J17k62j3j01P6QJ47j79J45j52K09O3P9j60j84P9J29r7k28J73O5O4l4l5
4480B4l9K9J2j2R6j49J38k52K36Q9l12L1k4M2M5K4Q3j22L6l2p9J05J82k23K29
4505A57Q9l43j3L8n5J57m2J42j39N2m0o6J53j70J77l1j11j89j41O14k65l9N8j6
4529b3k44O75m37J0K0J2p3j14N02m44Q9M3o3Q6p1j67J86j63R0J4p1K50k10K7J35
4554E9j48J91n5n6K4l7J05Nn6j59J43J02k57N0M2m4J08Q0j11J99k4q3M1l44R8
4579a27P4j07J56l1j07J16K6L8j05Q5J20j69R6j91J94j18J63j98P0q0K53j34R6
4602A20j23j15L7qR9j10P4m7Q1J34j22o3J1J00j28n3j02L20j04k8j48ojL92j86
4627B4q0J53o9n2%P7m8N0Q8j14j36O2pk4J40p5o3k0J35M9k97K29p3J1P5j00J42
$$ y = [115, 232, -30, -43, -144, -68, -60, 87, -92, 53, -99, 110, 173, 252, 92, -92, -13, 116, 19, -209, -36, 29, 93, 59, 24, -15, 14, 26, 14, 110, -39, 99, -153, 83, 172, -140, -109, -133, -91, -46, -22, 61, -61, -25, -57, -136, -31, 151, -72, 157, 246, -97, -110, -72, -127, 30, -12, 130, -9, 43, 3, -63, 90, -80, 97, 66, -45, -234, -375, 239, -26, -65, -7, -23, -267, 408, -29, -19, 1, 13, -60, -174, 328, -116, -27, 16, -47, 39, -32, -199, -13, -176, -86, -72, -143, 107, -103, -76, 59, -89, 102, 47, -9, 15, -22, 83, 88, 32, -127, 16, 118, -139, -89, -47, -91, 17, 97, -14, 185, 161, 78, 119, -225, -127, -53, -160, -4, -35, -142, -26, 0, 38, -67, 18, 138, -31, 65, -126, 68, -50, 113, -85, -15, -95, 158, 24, 120, -3, -118, -81, -89, 10, -100, -26, -73, 8, 142, 20, -43, -32, 68, -60, -113, -215, 105, 1, -27, -175, -181, -182, 210, 24, -56, 97, 28, -24, -24, 53, 5, 55, 143, 29, -107, -45, -52, -76, 64, -11, -74, -94, 41, 90, -207, 22, -51, -40, 35, -65, 77]
4654G7k22K02R9k10l8j1J4O4J21j74lJ89j02Pj58K90j25j72K56K23m20K05j49
4677c7r2P4J39M0j13R0p9p8p0J15R9k38J37r0J66j45K19l8rj58O4k04J24K9oJ98
4703A37k69M3J35j90J88m06J12J99Jj90L2L49j40l6P8k39Q2J19J2K1N2q7j86J23
4727f0J53J03j87p2J42j17K7j19K31p1R5o2j81J18N6j40K9J81k15K16j5L3j86
4750d1K45j22j54kM1n5J14j55J59mO0k67L41j65L7o3o4J20O7j02m9K41j52P4k40
4775a36k3m7J16L48j88M9j75m0j97L02K8J35j43q1oQO5L3k19J56N1k19K94j61
4799e0m1k03M40j19k5J9j51N7q8j3J4L36k24O5n8J26j95J21p3J23l8p9j18J50
4823b4p5J45r0q8K24q2L3j23n3J04K11p2m4p8J52k38jJ34Rj46K08q4k22J32MM1
$$ y = [77, -145, 57, 156, -54, -92, -103, -89, -25, 96, -78, -81, 108, 6, 13, -145, 145, 20, -152, 104, 327, -93, 112, -37, -129, -55, 84, 124, 11, 101, 22, -56, -126, -11, 88, -150, -13, -103, 63, -82, 137, 99, 90, -68, -4, -208, -84, -55, -61, 137, -132, -89, 46, -144, 44, -362, -250, -51, -50, -240, -208, 141, 1, -35, 43, -196, -114, 5, 17, 38, 90, 3, -183, -60, 93, 196, 9, -63, 79, -38, -11, -130, 101, 30, 125, 63, -118, 0, 56, -84, -55, 126, -89, 127, 112, 145, -41, 204, 82, -72, -74, -33, -88, 26, -129, 30, 26, 86, -181, 160, -5, 32, -31, -95, 25, 92, -10, -59, 182, 30, 104, -136, -159, -206, -90, 258, 70, 119, -56, -96, -293, 9, 37, 172, 29, -52, -58, -50, 15, 48, -171, -15, 36, -183, 111, -50, -91, -294, 146, 27, 2, 21, -130, -73, -161, -174, -160, 176, -48, 17, -41, 85, -110, 11, -62, 61, 23, -56, -174, -24, -99, 46, -44, -132, 92, 10, 43, -80, -133, -29, 182, 110, 66, -12, 140, -98, -99, 35, 44, -102, 106, 22, -200, -68, -64, -23]
4849b3R4J53l08j5R3K00l05J35J53j05j03j13J82k47OJ73J31K4j61K03m0j53o7
4872i3J00K1Q9k29j43K38n0J92k9r6J71J7r0j77J29Q0j38j23J56p4O4rk33J23
4896a04L32k54J00j34K19J58l95J89K9M4k10R1j11J8K3r0N7J00J56j84P7k7k71
4919a87K98j92J91r1J06m0j8r2kl1R7n9j17j5J55p1JJ51k5o4m9P3o2j4J08N1j34
4946c2M1L9r4L9Mk54K60K1j92K71p9j00N6K74k75j03j1J05j1j62J09J85j48N9
4970BP1q8K25j85Q6j62J38l06L46j45qJ62l39K10P3k51K93j90J94j02j14J01o3
4993e2J69j70K41jk13K6M4j2J5J13o7k23J5N07m14O8j55k5P7l6M2L3Q2MJ7j13
5019b8J35p6N5O9j79L2K2N1M2N1j74Nk30K74o9J12j80N0j19J16j03K59m8j0j04
$$ y = [-23, 71, 224, -84, -99, -6, 194, -111, 24, 177, 72, -31, -144, 38, -209, -203, -30, 101, 125, -36, 167, 127, -26, -93, 7, 28, 117, -112, -255, -17, -67, 125, 96, 0, 171, 188, 98, -79, 50, 130, -8, -131, 25, -49, 15, 6, -227, -104, 228, -26, 74, -60, 159, 317, -78, 111, 140, 184, -26, 65, -46, -28, -5, -95, -38, 62, 218, 34, 111, 84, -187, 111, -81, 110, 19, 125, 85, 67, -25, -27, -58, 39, -20, -137, -152, 3, -68, -67, 84, 59, -5, -54, 19, -43, -57, 51, 102, -32, 9, 48, -46, -7, -3, -257, 3, 24, -168, 103, 24, -76, -20, 254, -21, -124, -135, -30, -41, -203, -94, 91, -57, 2, 73, -15, 210, 25, 111, -51, 87, -219, 127, -18, -26, 136, -203, 7, 80, -171, 122, -68, 126, 24, -90, 11, -52, 117, -53, 188, 187, -26, 0, 44, 32, 47, 160, 93, -130, -115, 392, -22, 46, -109, -134, -57, -93, -51, -18, 64, 68, 85, -28, 107, 31, 86, 155, -24, 8, 30, 81, 123, 174, 0, 5, -225, 49, -20, 92, -88, -38, -157, -41, -144, 115, 67, 57, -47]
5044d7J33r8L8L2k04K91Q9l32M6j0J13r0M4J32J29k65j1J82m4j02O5P5j59o5R7
5069C9o6M2J29m9j07j45J01J93j45J67k53mN0M0Q8j44J55Rl6m4O7k23L73l35j47
5094b45L15j71J15m1m9j88K27NJ07n7r4j7p5J54K6P9j63J52j51N4J61k25k06L02
5118A5N8J8k9j00Q6j8N7k42J97K4N2k38J36QL6j40M3K18l51N2J28K72l10J70k78
5143a36L3J23k5j4j18J47j71N6K33l42P0K5L30m8k06RJ7K21J2r3k15J71j5o5j15
5168a16J81j21j65N8J65M5j37j8J58J23j48j25LJ70J30l36Kk1J4K31k42K05R5
5191A51o8O1k60O1l1lK53k28l4K73k93P8J03L9k13J08o7j5pJ99J31l49J78m4m7
5216b4j10M4Q8p2K30j02j71L97m31K22j04Q7k0O9j40J42m8l8p2R0k12J41J96l31
$$ y = [-47, 86, -12, 26, 58, -146, 145, 234, -98, -52, -62, 51, -39, 5, 137, 266, 1, -10, 172, 128, 26, 91, 166, 7, -58, 39, -27, 15, 144, 95, -12, -157, -56, 137, -8, 159, -94, -98, -48, -8, 80, -64, 91, 100, 64, 20, 87, -136, 237, -98, -245, 70, -101, 14, -27, -76, -264, -37, -32, 75, 18, -76, -93, -168, -14, 12, 91, -72, 80, -71, -17, 144, -81, -287, 15, 73, 91, 62, -38, 48, 30, 87, -155, 42, 66, 118, -120, 16, 24, 60, -80, -37, 181, -170, -118, 10, 282, -28, 142, -136, -103, 20, -5, -19, -137, 10, -161, -105, 128, -214, -144, -119, 211, 163, -43, -34, -17, 204, 216, 123, -92, 79, 64, -1, -116, 65, -56, -221, -163, 2, 47, -90, -108, 50, 173, 25, -100, -97, 73, 203, -133, -131, -152, -138, 93, -149, 56, 151, 83, 144, -116, -55, -86, -89, 164, -64, -98, 175, -118, -40, 63, 102, -111, -3, -70, -85, -92, 107, 238, -111, 67, 23, -24, -134, -90, -2, -74, 156, 54, -117, 280, -151, 71, -33, 54, 34, 103, -37, 105, 57, 19, -53, 37, -175, -34, 162, -169]
5240a69K62p7PJ29k18L48l72R8K15k01k1l4k7J53j31m2J88l03J87M7p2j5j30L44
5264A66j62m0L03k40j13n0%J96P9K6j46j37j00jL55k67K55k00M0J14nJ13k37l1
5288h2J7N6j3q1J45P8j42M1j15J79K6j64M9oq4M9L9J9J09M3j71j12J92j71J06
5313GN3K1K7j29M5j08P1J04P5l24K11J17j22J41j07m0P8j61J30j0j50M0o9j1J59
5338D8L4k08N8p9K46M6m2r3Ok15K48j7l18K88l2j23J40J07r4K22Jj76J2j96R9
5363c8N7o3K35k37M7j44J8j61K32Q6k12L29L8j37J24k44kK9o2K25l7l15K31j6
5387a7J69k77J82K5p5L7j19N9j12m5N1J21R0j58K28j78J1j67K4R3K14j52j08k1
5411a25J29nN4k13Q2j05J86J60k36Q9p3J43j54N5K1q1J49M9j04j03P4j11K43j72
$$ y = [-169, 93, 16, 23, 152, -66, 282, -90, 8, 223, 22, 1, -33, -60, 93, -38, -80, 108, -195, -8, 39, -33, -48, -178, 166, 4, -36, 267, 27, -86, -136, -136, 60, 139, 165, 19, -118, -218, -219, 136, -131, 124, -76, -36, 78, 73, 186, -51, -82, -65, -9, -22, -103, 42, 120, -22, 19, -96, 83, 109, -55, -6, -12, -96, -47, -8, 11, 120, 163, -8, -120, 72, -99, 7, 60, 81, 108, -21, 24, -84, -13, 91, 166, -158, 53, 170, 48, 189, 82, 42, 120, -41, 89, 79, -71, -31, -100, -111, 48, 82, -126, -68, -147, 99, 145, 103, 10, 16, -199, 49, 32, -286, 2, -30, -153, -13, 94, 0, 222, 223, 47, 59, -137, -38, 19, -44, 191, -46, 1, -143, -125, -286, -54, 32, -180, 149, 187, 50, 174, -70, -72, -43, -105, 120, 83, -232, -1, -17, 152, -125, 57, 82, 7, 44, -75, -16, -128, -173, -122, -1, 89, -69, 159, -19, -8, -175, -151, -58, 156, 4, -104, -125, 4, -1, 53, -160, -78, -183, 3, 163, -73, 16, -57, 86, -68, -13, 8, -73, 76, 125, 21, -82, -8, -119, 124, -48]
5435d8n9n5K78j17L3j52r5L44p8j89J58N3j58J43j13k3Q5N0pr2J06j55K10m0L8
5460A17j57L8K3n9K13k28J17m7m3L5q8K94k70mJ67L2j36q%j07K20j05j92O7P7
5485d4L3l8J06j28K89k51j4Q6N5k3j98K20j38Rj47J95o4J88k08j79K86m2O8M5
5509A06Kq2N9m1jJ8j57K55j16k09J51l0J68j80j2J39j7O3l6l30J42J35K2J2k14
5534a53QJ74K18q7k01J42j17J58J4l2Kn14M21J25j20N5q8K0J08j94l3r2J27P3
5558A4M4j25O6p1L2M8k26J14j03J02J63q6j05N8O1N9j37r6M35k65l22M38n5j13
5582g0J31P5j2o5k73J38R6M1p6l1Rj32J41J56r8j2o1J32o1j38K23r7m4J84r0q7
5608b1N9j9j41pK24K21j46j52j47J29J10N3k07p3Q4j03J80L4k62K92j51Ok3J03
$$ y = [-48, -107, -162, 116, -1, 32, -120, -215, 129, 51, -138, 20, 73, -85, 58, -55, -78, 7, 57, 50, -42, 64, -91, 119, 79, 117, -40, -2, 21, -38, 175, -53, 64, 17, -26, 9, -79, 215, -55, -59, 108, 140, 4, -4, -4, -111, 109, 4, -188, -121, -44, -11, -49, 57, -71, 218, -33, -47, 39, 94, 71, -127, 93, -45, -36, -183, 12, -52, 136, -72, -251, 35, -7, 61, 106, 108, 26, 85, 44, 43, 61, -96, 159, 43, -166, -15, -45, 123, -57, -69, 70, 53, 116, 80, -250, -108, 27, 49, 61, -153, -145, 29, 247, 160, -41, 101, -16, 142, 156, 124, 126, -388, 33, 158, 38, 93, 5, 25, 133, -61, -94, -186, -59, 14, 58, -67, -1, -72, -40, 8, -218, -104, -207, -105, 58, -28, -133, -75, -14, 45, -92, -188, 247, -18, -340, 98, 43, -70, 61, 136, 124, 59, -214, -76, 20, 61, -15, -46, -37, -169, -28, 128, 30, 18, -43, 89, 28, -110, 113, 16, -28, 156, 66, -21, 38, 19, -122, -129, 95, 316, 170, 18, -129, 0, 110, 163, -44, -117, -33, -136, 44, 78, -184, 108, -43, -37, -60, 43]
5632D3j41K00k7k6mk13K14k01Q3JONJ1N5l7O7j12J56k18J60l6j87O3J08J92j8
5658A44J36l32J77m1J59j77r0r1%qJ46j34L12J40m12P7o8O8J10l4k09L3P5j77
5682a96O0j00M17k80K18q3k2K73l02J91j02L2k61p2J46J3O4n5J51oOj15o6J30
5706D1j79L2K78N6k83j8J09j38J13lr4k0J33J09N4k86J64J73l06R1J63k22J66
5729A33j73j2L72k58L2k3j99J45J25j1k31K01n9R5k12l1k2J20QJ92k11j1J46k19
5753a03j08J29J72m28K76J7Q8k70L7K36m3J37j88J85k58K20l0k29Q0j4r7M2k1
5776a70J72o5M4R1j63J69J91j65j87J84j32j63J21K5R0l0l1K09k66L6K48j73k3
5799A2J83k93J87O3k28M8n2j25M21j51j38o2J25J12j3J5q1j23O4L4k8N5n8J94
$$ y = [43, -98, 102, 75, 49, 45, -168, 46, -155, -72, -71, -65, -60, -49, 6, -31, 36, -76, 80, -138, 22, -14, -201, -138, -30, 162, 144, 280, -52, 125, 84, 243, 66, -24, -115, -115, -123, 23, -111, 201, 341, -71, 6, -62, 6, 116, 82, -127, -94, -19, -196, -136, -236, 181, -99, 119, 36, 14, 287, -15, 176, 74, 106, -155, -227, -81, -68, -4, -59, 92, 86, 92, -23, -89, 41, -138, -106, 172, 228, -55, -73, 36, -102, 11, 8, -86, -106, 27, 136, 190, -96, 68, 241, -65, 26, 189, -33, 133, -40, -52, 320, 62, 94, 71, -128, 17, 142, 131, -100, 101, 42, 137, -75, -106, -128, -8, 0, 192, -19, -30, 116, -103, -211, -82, 90, -338, -62, -45, 43, -227, -190, 46, 3, 140, -48, 137, -121, 99, 69, -160, -80, -94, -191, -149, -170, 2, -63, -19, 72, -91, 78, 269, 104, -83, 101, -31, -194, -73, -48, 42, 12, -19, 190, -76, -40, 208, 35, 12, 195, -98, 89, 152, -76, -28, -80, -205, 216, 65, -73, -135, -10, 102, 89, 104, 23, -100, -36, -2, -30, 25, -33, 161]
5823A61j54p4K7R2N2k20J63l13L84j93J55O4k18j73M67j70R8j51j68J21kq8K12
5846G2j18j8J15j9L4J0M0q5P3j24jJ68j26L8lj02j10L1J79J6o0k2N9j43j27K11
5872a2J81J34m76J03J29m3q6j4J48o0NJ80k20K05k82J66r7N0o5J44k04J53k37
5895a98Q8j19K22l3j4P2P9p9j35O8L0M6q0K76k76r5J25N8j68J29R4J29l89L25
5919A55k19J06j57J35N5o9k50J75J46j6j08J77K9j21n7L7J96k74j24K76j1j47
5941f6J4n7k4R2R1j79J64j85M4R0R1n1l00L40k14o0J69j64K58Q7j35J63k59p1
5965a62L05j7l09J08R7j91K12N0j76j09K78j2r2k24M69j06j33k04L14j20J04j36
5987e4K08j95M4K01l84K37k05P8L6J98j59r5J88k71pK17j86j38K96j16k1J99J33
$$ y = [161, 7, -67, -40, 52, 104, -116, 47, -266, 118, -75, 80, 144, -74, -247, 220, 50, 148, -3, -171, -50, -52, -140, 72, -46, -64, 51, 32, 66, 76, 116, 31, 104, -20, -21, 147, 21, 59, 56, -46, -156, -125, 54, 70, 10, -12, 47, -96, -223, -12, 169, 303, -173, -70, 59, 16, -70, -84, 64, 4, 9, 189, -31, 174, -108, 58, -39, 11, -54, 90, -114, 39, -198, -110, -229, -7, -40, -54, 18, 97, 18, -117, -49, -19, 27, -53, 223, -53, -148, -23, 35, -133, -4, 90, 219, -170, 155, -64, 42, -115, 20, 75, 6, -244, -69, 77, 61, -47, 130, 159, 38, -19, 18, 214, -60, -184, 92, 81, -66, -52, -109, -133, -41, 50, -129, 35, -150, -106, -16, 75, 24, -276, 64, -150, -210, -41, -205, 53, 140, 5, 168, -91, -162, 143, 126, -183, -75, 22, -169, 43, 93, -83, -192, 86, 74, -18, -242, 227, 121, -12, -216, 98, -22, 82, -54, 154, -41, 3, 204, -180, 57, -148, -70, -34, 164, 5, -90, 98, -173, -180, 37, -149, -287, 9, -107, -128, 71, 204]
6010B04l45J40p7N8j12j3K83j84R9j29M8K45l51L2J42j80Q8m0J34m5K32j56q5
6033a2j49Q0K5Nk2J35l6j30N3J8M5n5l6J42j83JJ96j37Q6rM7k93L59q8k28K89
6059A03k98J88N6k46J30J36l05K13p4O7k8j68J15J37j11P8J85m27K75J21k90K37
6081I4k18J62L0l02K15k58K95P0QJ72l18j01j20L72j48P7P2L1j33n3P3J2J22n2
6105A02k21J64j85J63J1k01K20j51L6q1L0J11K6P2p2p4q1j5J75R1j63K8n3J26
6129E8r8J48j7m8n4j01J40O1m5Jr2K35j82Q3M9pj51r8K62j88K7j04O7R2nj39N7
6156d9K02j14k10J33Mn7J60k43K03RJ11l06O4J12j27J01N3j70J38J96j94J62k35
6179e7p5R0l7l1J66j10P7j4k8j31L7J18k0J3J4jM8N3m0p3O4p5lK3kOP3j65j45
$$ y = [204, -141, -1, -78, -20, -132, -145, 138, -46, 53, -76, -28, 217, -134, -102, 40, -140, -52, -92, 42, -3, 229, 73, -12, -161, -81, -56, -51, -73, 62, 26, -104, -51, -33, 12, -43, -79, 63, -120, -119, 77, -60, 26, 17, 64, -229, 130, 42, -186, 103, -195, -7, 49, -197, -67, 69, -236, -23, -97, -30, -58, -226, -111, 26, -85, -7, 178, -249, 26, 147, -143, 94, -124, 38, 68, -234, -19, -277, 18, 88, 96, 268, -50, -151, -271, 101, -47, 30, 102, 133, 0, -53, 20, 32, 154, 102, -119, 45, -140, 23, 34, -167, 53, -98, -62, -143, -113, -2, 24, 96, 24, -50, -131, -146, 29, 120, -43, -15, -68, 58, -40, 108, 91, 43, -11, -112, 28, 89, 44, 45, -47, 188, 6, 89, 138, 131, -20, -118, 144, -44, -17, -121, -54, 38, 33, -106, -49, 153, 39, -171, -38, -34, -91, 69, -174, 29, 38, 149, -157, -93, 19, -108, -7, 46, -124, 14, 210, 16, 178, -57, -132, -42, -79, -110, 56, -54, 23, 9, -19, -150, -113, 5, -15, -2, 12, 11, 59, 112, 72, -1, 63, -12, -15, 8, 6, 12, 85, -80, -225]
6208b25K66k4n7p3J33k15J33m6P7Q6K9k56K18j99K24J69l58K6Q9q2n0J58n5n2
6232h4J86j27N1l6p6P0k03K19o8mJ50nj9k0kJ4j58J88r8M0L7j46o6J90j4n1K3
6259iK51m07L39l43J94J40k36K70j13p3p9o8N3J82j7j58J8m8J36k62kJ22O8J08
6283F6J11j11m4J7j75J27K5l2R9l9j5K9j58K54j43m7M4MN1P5m04J70K64k71J92
6308H9q3l2k7N1M2p0j20K23m3R8j10M8j0l25M00j32m5PJ34j76P2j12K81j66K3
6333A7J43r6j11J41p1M6j87O2L43n24J98L7o1n8K64r9K6p9J47k55J34P2r3j4K57
6358B39j90N1k2r3K1j85K51L7l02K29J01n00L68r0J02P5q4J40j24j07k3K37o5
6381F6n2K0%l2k30Q2J15j46K11j07R8k0Q2J32j69J27l05K03j14J0J76r5q0J04
$$ y = [-225, 41, 17, -40, -113, 20, -195, -62, -108, -31, 55, 84, -172, 46, -153, 71, 240, -118, -92, -3, -85, -135, 23, -32, -84, 102, -25, 26, -10, -86, -16, -219, 0, -68, -72, 78, 73, 54, 34, 32, 46, -112, 76, -22, 18, 55, -91, -157, 33, 19, -32, -9, 242, -165, 174, -169, 25, 165, -71, 199, 86, 13, -66, -134, -81, 101, 84, -74, -56, -104, 32, -230, -232, -110, -42, 66, 177, 66, 22, 39, -136, -9, 16, -16, 83, 44, 29, 58, -100, 154, 11, -36, 8, 12, 63, 138, -266, -96, 168, -103, 89, 6, -26, -53, -2, 40, -30, -150, 73, 30, 128, 18, 66, 56, -269, 131, -1, -46, -39, 95, -81, -9, -121, 160, -6, 17, 160, 64, -47, 94, 23, 69, -118, -56, 287, -237, -39, -2, -63, -121, 143, 44, 70, -9, 138, -117, 17, 89, -4, -18, 239, 49, 100, 78, -15, 6, -179, 72, 109, -193, 36, 137, -363, 5, -85, 17, 92, 8, 148, 24, -83, -106, 131, 66, 14, 34, 34, 2, -228, -146, -31, -177, 34, -73, 25, 5, 87, 219, 50, 177, -128, 75, -39, -29, 147, 52, -28, 76]
6405G6K2O4k55Q5J80j82RJ6m2ql9K32j2p9l9k7J13n4n5m0J19j18R9J8j86P4o5
6432i4J11kJ18j1j90K84l24K79k51M0J03j54J00OJ27j29J14k41R3J18R5n3J21
6455B60j67O2k64J62Ql98L33L2j8k8N1k0J1j98K90rq6J40j15o7J98j90op0p7M76
6481C10k95P6J6k11L5k11L32q8J05l0J98l15L4k1Q0r6J89K2m5o9o4K53k08q2J44
6506E9K6n8k71M37k31mj67p2L55M1j19Ok9L5j26qL3Q7K49j51j5q1K0M3n3j1J16
6533A11j49l1P0r2l2J19p0j44L66l57K18J00l5m8k66L39q9o8J40j22j09J32l8
6556e5K43k85o4J26L2k11J07K81j65j28Q4J84m00L10J7j41Q4j67K62Ok78K25J7
6579H4K38k50M3j30J12r7ql5j16J9J8J32R9k1q3p7L5o4J09O0j80K79j85P5q3K2
$$ y = [76, 98, 162, -93, -8, 172, -10, -1, 15, -27, -35, -74, 158, 146, 67, 28, 1, 114, 60, 5, -35, 84, -34, 65, 83, -103, -29, -94, 17, 15, 133, 122, -68, 216, -108, 171, -80, -40, 63, -91, 9, 15, 142, 13, 127, -114, -21, 97, 192, 139, 260, 93, 155, -109, 53, 61, -337, -4, 28, 10, -18, 33, 13, 24, -174, 116, 107, 21, 161, 46, -21, 177, -13, -19, -89, -166, 310, 15, 91, 107, -104, -69, -280, 52, -36, 69, 39, 237, -78, -44, -65, 15, -81, 108, 130, 85, 16, -48, 205, -3, -85, 59, 85, 27, -244, 193, -38, -42, -209, -281, 74, 115, -4, 2, -27, 8, -118, -126, -93, -6, 243, 92, 77, -4, 16, 59, 6, -5, 111, -38, -69, 1, -91, -123, -4, -74, -218, 148, -209, 9, 109, 74, 26, -240, 99, 10, -58, 82, -40, -149, -17, -55, 188, -97, -161, -35, -3, -214, -107, 174, 9, -119, -35, 149, -251, 59, 76, -65, 19, -148, 114, 120, -158, 67, 84, 322, 72, 115, -15, 97, 0, -8, -43, -159, -140, -122, 10, 109, 88, 5, -72, -37, -101, 8, 68, -112, 167, -18, 57, -26, -4]
6605dJ5p9P0j69M2Q8K2n7J40J30j05l2O7k02N6M7p8k21Q7R3J6N2R8j29O4P3n2
6632C2j94M5o1K93q8r8j33K05l4M8q7p8J78o1k8p9J78J08j0k02mM2J2Q8r4J12
6658I0q0L6j94J90j53J47j3O6k30J85j20K9P8j73K88j87l2K15o7j71K07k00N0
6681c9j17J70j00k4k4J39k16J46L2O9j94K28j45J14R1j19j69J43jM3j8o9K82j19
6705A03j74N5j7J84j82O4LJ48q3j42n7L23j79m0j1J5o2o6J39j41K28j62J06n5
6729cr3M3L6J26o4m0L1r7J39j01J9N7r9Q5j94O5J00J4j11P5j39L05n0j92K20l
6755A29k70J19%J08m3j14J54r2J53j09Q5o6Jr4K0l3J04L6r3N9J9j40J89K5l66
6780b19J95j2O7m0m6J88l89L33J22j30k14J56J8j86lJ93K8j58k35L15n7J88j15
$$ y = [-4, 11, -68, 2, -167, -125, -37, -15, -72, 68, 198, 93, 61, 128, -74, -18, 29, -49, -270, -183, -90, -74, -22, 76, -53, 11, 84, 32, -162, -117, -178, 115, 27, -71, -204, 1, -33, 15, -72, -150, 28, -33, -61, -140, 38, 146, 136, -66, -70, -28, -16, 72, -22, 90, 10, 46, -148, 42, -111, 36, 23, 89, -141, 44, -76, -47, 31, -142, 146, -41, -73, 142, 75, -96, 111, -89, -39, -156, 14, -86, -110, -134, 5, -211, -65, -33, 36, -158, 70, -75, 39, 130, 11, -158, -15, -16, 27, 9, -60, 222, 103, -71, -16, -33, 151, -31, 33, 36, 184, 101, -41, -98, 225, 46, 6, -5, 10, -52, -118, 21, -120, 108, -54, 52, -3, -96, -53, -17, 109, 45, 5, 36, -61, 78, -23, -4, 53, -46, 39, -155, -90, 10, 24, -87, -12, -151, 154, 104, -88, 132, 129, -141, -22, -22, 86, 43, -71, 83, -9, 144, 35, 120, 54, 55, -39, -19, -52, 52, 88, -5, 54, 73, -67, 122, 147, -219, -24, -36, 31, -9, -55, 133, -256, 77, 199, 69, -145, 11, 29, -157, -160, 33, 61, -97, -332, -17, -74, 114, -1]
6803ak4K8m2O4J81m02K38J54l07Q3J43m2j40j32J51m9N6j2J58N1j61J35q7M9m2
6828E0j28J18m7J06j25j6O6n2p3J40l5m8N8M7j41K48j52kQ8p6k12m2J81j23J30
6853d0j6O4K37m38K54l5k37J07K17N7o6j49j94J39o9K89r2n5j40J16J42k27K38
6876A02mj25j02N1j2m3J55j11J19J86j47j04J9q1J29j54J27r0lJ93O7k94N4M7
6900b1q2n7K70j51n6J74j41J88j65kQ2P9j49M9Ql3j06K43j74J06j9J68j74p2j6
6925e1p5J85R6j75n7M9M5o9k14J88N1j50K58%m3m2r6J61j2L3q4l0J55q1o1O6j47
6952a00l6N5J62J72l07j0j9q3K82J9Q8j40l6k22R3M7qQ9N4j36j3l5R2j11L3K17
6978A47j19J6k56L18q4M7k04J43j00J84o8j39Q1j3j1K8J40j12mJ8K7K4j36K30
$$ y = [-1, -25, 3, -39, 25, 206, -196, 42, 196, -111, -28, 115, 73, -67, -199, -48, -97, -41, -53, 105, 156, -5, 130, 43, 92, 50, -78, 40, -7, 99, -26, -42, 24, -28, -101, 39, 4, -44, 14, 61, -80, 168, 16, 14, 102, 26, -186, -228, -47, -170, -40, -56, 8, 245, -193, 61, 26, -211, -104, 113, 170, 104, -45, -239, -100, -169, 120, 28, -27, -167, -51, 91, -136, 102, 98, -27, -129, -78, -90, -133, 22, -89, 30, 216, 69, -35, -16, -97, 32, -122, 5, -85, -88, 105, 172, -122, -68, -21, -103, -160, 110, -41, -97, 77, -64, 124, -41, -43, 39, 118, -31, 18, 26, -7, -113, 130, -44, 62, 43, 211, 37, -35, -51, -126, 59, 155, -20, -77, -28, 17, -52, -266, -78, -27, -177, 81, 81, 38, -4, -100, 61, 49, 82, -2, -32, 123, 42, -19, 47, -100, -136, -81, 81, 253, -54, -64, -83, -166, 116, 135, 223, 83, 47, -175, -82, -35, -43, 46, 100, -36, -49, -84, 8, -103, -70, 147, 28, 44, -212, 106, 22, 69, -135, 8, -92, 92, 24, -115, -34, -47, -58, -30, 110, -2, -6, 12, 39, 63, -73, 157]
7002A57k1j07o5k4N7j00J92n2O9o4L8l0l6j10J06R1r5K5j45K47j91%J88j04J43
7027A69j72J48l04J93R7k09J1J73l9N1r1J88k23r5J57k1K2r4K07j61K2p4Q9j37
7051i3J27o9K6j4j31Q7J70j15Q3J02j59L9r6j7L5J22l99K21m6Nj10J27J6J6J47
7076G4j58J86p8j14j8K23j36q3K05r8O6%l4j79l5J75j55K46q9j06O3K17j48K4
7100D8j17Q2pJ72j42L7j27J14k20J14N8j00O3P3n5o2J18m4j06P8o7J30k16K6j5
7125a65J32%L6L3q7M15m16N7q0j05J47r9R1R8k06j62J83N1r8K76k51K8J5K6R9
7150A8J46j23ok6j54o0J88J4J94l8k09K27j44p4Km4Pj02K63r0q3K30j76J81k19
7175g8J39N9Q1k40oJ71k63J04j45R1P4m1j34K86j24J57j20m%l2q6J05J50k29J49
$$ y = [157, 136, 29, -36, -60, -3, -103, 89, 37, 106, 42, 80, 50, 14, -96, 10, 101, 6, 31, -114, 133, -58, -58, 130, 26, 169, -3, 145, -159, 34, 131, -78, -67, 106, 67, 118, 27, 215, -8, -103, 54, 33, 55, -39, 168, 7, 29, -45, 44, -93, 34, -35, -9, -23, -154, -67, 103, -12, 71, 173, 14, 53, -43, -60, -25, 97, -302, -81, -127, -122, -232, -105, -89, -73, 74, -84, 102, 24, -90, -108, 115, -21, -104, 101, 3, 69, 69, 35, -144, -179, -4, -159, 87, -2, -108, -45, 172, 24, 48, -69, 13, 6, 178, 36, 73, -54, 60, -160, -46, 12, -88, -25, 48, -7, -69, 49, 5, -101, -23, -90, 40, -176, -150, -165, -33, -33, 3, 36, -51, 364, -52, 5, -75, -180, -33, -132, -41, 57, -149, -311, -128, -77, -175, 101, -150, -122, -107, -81, 18, 164, 41, 35, 9, -145, -205, -17, -3, 191, 153, -56, 171, 27, -47, -45, -89, -82, -184, 79, -11, -94, 136, -40, 141, -78, 61, 120, 201, -39, -45, 126, -137, -33, -178, -87, -13, -54, -188, 98, -26, 131, 11, 7, 7, -25, -111, -6, 144, -85, 64]
7200F4j2j18o0J74j20O6j10n7J62j44O6O3o4J99n0j62J97j23J5pJ79k34j24J38
7224f2R9K5m0m2j03j9K86J4j38n1m2J77p2K2j11K00j91J57k2j56j1r2J07N7K4
7249A6J55j04J07j58K2J85K7j28N6k8m03J24N3P5q0j3O4m4O2O5j42r5J31PNK5
7275a6M1K4q3Pm6J75J10j06l0J16Kk28n3lK59j97M7NN8j02o6n7J64o0J27k13O4
7302f1Jo5NN5J61k5Lj20N3m3J57k16K09j70J11l3J62j47k0j95J68j09Q4N0j0j0
7328eJ14p3KJk3q7J30q1k9p8J43M4Q2M8j96j2O1J38k80L9k3M7j33K18J34r9k06
7355a24N3o3R3J07k13P7N9r6K57k26N3p2K2M4O4J56l21K2J97j21N0J17k91J48
7379hmQ9L8l35L59j69p2K15r6J04j87j77K59j31q3L58k17p1J15j43K13j63L06
$$ y = [64, 52, -66, -126, 48, -72, -6, -116, -173, -11, -155, -89, -26, -90, 109, 59, -103, 94, -29, -14, -21, 158, -76, -200, -62, 37, 62, 22, -20, -123, -142, 144, 158, 20, -31, -73, 104, 32, 54, -57, 143, -48, 109, 87, -69, -80, -172, -65, -8, 16, 171, 67, 174, 16, 38, 223, 250, 122, 178, 150, -253, -129, -76, -1, -81, -94, -30, -74, -12, 53, -89, -184, -53, -46, -41, -16, 25, 49, -34, -27, -73, 102, 212, 106, 76, 192, 194, -34, -87, -90, 169, -28, 19, 24, 82, -20, -86, -143, 21, -39, 88, -125, -61, -60, -125, -120, -65, 96, 71, 74, -46, 7, -36, 121, -95, 114, -56, 55, 22, 184, 37, 17, -178, -10, -119, -35, 15, 5, -5, 109, 36, 38, 39, 16, -71, 59, -22, -51, -129, 14, 58, 140, 188, -8, -20, 41, 179, -101, -62, -85, -38, -171, 47, 181, 82, -124, -71, -134, -41, 66, -147, -70, -11, -107, 150, -76, -23, -95, -73, -29, 35, 191, -130, -108, 89, -32, 18, 135, -156, -8, -12, 77, 115, -220, 139, -30, -102, 113, 17, 121, -66, -243, 16, -115, -198, 160, -57, -128, -13, -156, 57, -106, 200]
7402B00j76q6j09K77j36K74k48Q0Q2j85m9J70k10j7R8l9N0m9J25n9L9n3l6PJ38
7427H8j24J49J89m08N1K40j96J10o9po8Pj11k7K04j55O7Q2j6n9J19j56j17K67
7451F0j29K17j02J05k32p1j5K13k25K17k6J39K1k45L9j1J36Kj68l8K50j26m7j46
7475a82J01K11k32J88j83J47Kq7n7J15n4l5R4j27K65j40j44K22r3n3M4K47l41
7498i2J45L9p6J67k27N4J57r2r7J82l53L85k03K05k62N2J32j65J68j24KK4k1P5
7522G5n0jp0L0k04K23j28j00L18n6m1O2%o7r0L0J12q3J67p4r0L4NJ71r7j13J95
7549A58l05R8m1L00j78j58NO2r6J36O7j70J06L5j36J32Rn0J42M0k04q4J80L1n9
7574B0q5J21j34M8qn6R1J54j42k3P1j90L11k51O2r6o1J34lj2q1J98l62L28P2j12
$$ y = [200, 24, -62, -171, 106, -30, 244, -4, 76, 158, -27, -76, 94, -116, -133, -35, -74, -24, -73, 52, -7, 32, -21, -57, -50, 88, -36, 113, 302, -106, -55, 185, -11, 99, 30, 23, -45, -38, -149, -176, 28, -127, -60, 22, 6, -53, 66, -90, -207, 60, -69, 148, 46, 151, -81, -152, -167, 46, -179, 38, 12, 151, 172, -73, -34, -45, 91, 93, -75, -113, 137, 11, -36, -182, -81, 130, -102, 86, -97, 50, 52, -35, -92, 23, -31, -66, 28, -99, 166, 26, -118, 104, 11, -42, 2, 249, -92, 53, 92, 16, 183, -44, 10, 167, 75, -22, 160, -193, 192, -11, 194, -68, -16, 116, -49, 119, -5, -3, 21, 0, 75, 25, 24, -46, -16, -220, 3, -125, -225, 93, 37, -4, 58, 58, -9, -99, -69, 43, -40, 127, 53, -37, -3, 2, 173, 76, -37, 158, -147, -49, -90, 210, 32, -126, -121, -59, -155, -19, 48, -122, -16, 19, -117, 15, 24, -26, 116, 156, -48, -132, 48, 79, 20, -65, 56, -78, -30, -38, -94, -3, 151, 9, -14, 57, -133, 178, -73, -11, -107, -168, -34, -37, -49, -130, 68, -294, 34, 106, -6]
7600fJ15q2J26o5j19n9J01L0M3J16k25j80K34P8O6k09J53j66N4l1K3J28p6j01
7624e2K66k52O6J31K08l01r1J69j21j1Q7j58k3K67k38j13R7K70j17m5k75L05k62
7647a93J91P6l4m8n5L5q0K16j44j31P0P8N1j96J06o2P9J22j52j10J46Q4j1j45
7671a07O8J85q1k5n9J51n4k16J06o3J77o1M6j48o5K60j25p1K60K4j84n6NR7j74
7696a10L6j9L07j37k69L37k32K5Q4J01j92j28J40J40j11J11r4J16J5k59N3J44
7718E8m6n3J32k93K28q6J15o6k3Q5l3J3j09M4J33m1lj06k4J24r1j40J13qO1ON8
7745D8PL3r7k8l3K00k1j43r5L18j08j19J68k3j2j35J35j20j0K6j18rJ76j23J21
7770C8j07O1l7K10l9j65R4j24J64k35M09l8m02J80k28J88J11l2J60j49j75J41
$$ y = [-6, 109, 27, 153, 88, -31, -90, 11, 41, 84, 200, -25, -205, 29, 107, 173, -36, 117, -49, 5, -26, -3, 125, 49, -52, 214, -38, 28, 159, 367, 66, -25, 144, 23, 12, 99, -59, -82, 185, -53, -166, -69, 201, 84, 39, -236, 69, -193, -2, 74, 40, -8, -63, -28, -108, 108, -36, -167, -97, -19, 32, -164, -58, -120, -41, 81, -71, -181, -35, 49, 38, -107, -39, 146, 65, 40, -19, 132, 78, -138, -32, -95, 82, 21, 67, -81, -146, 114, -11, -82, 178, 202, 18, -38, -33, 64, -110, -74, -93, 214, 77, -192, 145, -87, -62, 22, 123, -69, -197, -57, 83, -28, 83, -11, 105, 120, -139, -86, 58, 12, -41, 91, -202, 26, -60, 55, -11, -34, 51, 18, 31, -78, -34, 99, 58, 55, -51, -75, 49, -42, -182, -69, -77, -16, -10, 48, 55, 88, -9, -37, -70, 130, 109, -34, -129, 189, 81, -38, 130, 107, 95, -40, 95, -25, -35, -9, -127, -136, 40, -83, 38, -69, -8, -45, 165, 126, -39, 55, -69, 95, -140, 269, 231, -171, 9, -219, -31, 80, 48, 208, 59, -116, 25]
7792B5j99J94o7P2J40k64m8J78j22J05k34M21j0p1l2q9k0K32l06K0l0J7j11L17
7816A18j12j55J53j57K7j40M19nk51L04r9l3j0k4q2L9KJ33M3k07J3K5J11r8oj20
7842a12rkM48l54q5l4J96J36k08o0R8jn9J82J5n1l20L60p2j75K21r9p9m8K77k64
7868i9j9L36l31jL28l49K79j82O6Lk3m8j0J8j22J19l7K32O3k94K82n0k89J19n1
7893f0L3K55k90J19J29k87J25n7ML3q6Q2r1K32j12mQ8p3L1o9K06l03J21J2M1k9
7919E0j29J29nO3j39K5n0nJ23j14K37p8l42L93m9k54P6K20k65R9J47j13j35mJ68
7944D8L7j51K86L2k72j27K04J90k78R9j93P6j48L80j51R5j79R7n2j1p3K20n2j87
7968a10J83n5J24r1QN1n8n1r4J87MN2j45O8%j3k9k9J25p5M0k09K61k30n8o4p9
$$ y = [25, -174, 20, -47, 25, 165, -99, -147, 31, -91, 14, -220, 201, 191, 120, 88, -1, -21, 211, -95, -75, -105, -88, -199, 118, 6, -149, 4, -153, -126, -266, 153, 148, -103, 201, 102, 69, 59, 35, -47, -8, -6, 127, 170, -37, -24, 1, 112, 14, 8, -112, -121, -123, 325, -29, -114, -148, 48, 184, -24, -84, 14, 13, -46, 136, 151, 100, -220, 140, 68, -107, 114, 15, -64, -112, 165, -99, -118, 218, -113, -114, 214, -135, 144, -38, 28, 31, 8, -40, -50, -32, -154, -35, -72, 160, 223, -71, 211, 161, -128, -9, -60, -27, 228, -62, 57, 186, -101, 24, -33, -29, 4, -82, 0, -91, 141, 29, 25, 113, 40, 71, 2, 208, -95, 26, 38, 79, 50, -79, 50, 45, 108, -31, -6, -56, -61, 62, -52, 185, 107, -235, 158, 109, -145, -69, 151, -114, -15, 132, 19, -116, -120, 48, 85, -66, 220, 252, -20, -147, 57, 247, -31, 68, -125, -49, -197, 183, 32, 127, -52, 45, -7, -18, -91, 129, 77, -110, 73, 18, 142, 51, 59, 110, 52, 1, -93, 94, 98, 150, 5, 73, 73, 60, 31, 2, 127, 52, 92, -117, 144, -86, -144, -208, -287]
7995b87M62k33J94j18p9N6j15J61Oj52J55k3l30J94J39j55K35j26O2L3j45J46
8017H0m4j86J03M0q0J35j98K00r2N1lj3O5j5j1P3o5Q4o8Rj57l9q4K09m7l2K9J76
8045A20j48m8r3K34m6l5o8l8O0j31J97N4p4J02r9N7l3L6K7N5p3j42N0l7OOK86
8072B25j92q0j7o8J85pk9mj88m0J37J44j1j66K08j49J70J13k04j81L3K85j56M7
8096E5k28J4J14r3J57j58J29k09J77K74nl40J8K7J16l08L12m8J4N3n2l4nq6R7
8121iJ18m0o9o3J52j34L3q2J21J17n5q6n2j19J48J77k12j2J0j21L72l71J16M8
8145a3J29m4O6j66K1j95K19J43j94k9O0j46J39q0l7O8J5K9j39O3l6J54j88M05
8169B44k96N8l3J74j0m2Mj63J80j58k36J05J23O6j5n4J7oL6m6J0K6
$$ y = [-287, 175, -58, 136, 18, -61, -5, -120, 41, 47, -105, 50, 27, -303, -109, 30, -125, 110, -16, 46, 79, -66, 80, 36, -150, -47, -7, -87, 48, -150, 50, -42, 9, 6, -7, 58, 43, 32, 105, 40, 124, 56, 65, -92, -131, -215, -6, -53, -85, -56, 120, -28, -76, -169, 65, 19, -16, -84, -122, -62, -193, 4, 58, -16, 86, -13, 44, 11, 47, 74, 129, 56, -86, -36, -73, -67, -61, 225, 33, -47, -64, -132, 53, 46, 17, 13, -175, -215, -78, 66, 55, -111, 97, -52, 118, 231, 27, -154, -121, 164, 8, 55, -173, -159, -45, -138, 19, -139, -10, -219, -42, 232, 227, -113, -95, -68, 48, -260, 52, 4, 18, 71, 19, -15, -20, -106, -9, 109, 69, 0, -63, 89, -45, -12, -94, 27, 144, 89, 3, -49, -168, -20, 157, -55, -67, -57, -178, 194, -177, -61, -13, 116, 72, 138, -28, -7, -202, 17, 160, -34, -63, -3, -149, -10, -90, -127, -59, -44, -15, -154, -91, -127, 27, -161, 244, -52, 6, -27, 147, 137, 95, 99, -64, 116, -42, -278, -173, -50, 16, 1, -53, -36, -42, -6, -52, -42, -16]
8191a6
$$ Imaginary data points
##PAGE= N=2
##DATA TABLE= (X++(I..I)), XYDATA
0@%%%%%%%%%%%qJ6j6J6j6K4l2L2m0N4o2P2q8J04j20J42j66J92k22K52k86L26l72
34a98M20m70N28n93O63p40Q26r22J021j130J252j383J527j684J857k047K256k487
52a304K740l019L334l690M093m551N080n702O443p345Q469r915J1856j4617J8896
67A0768k6483M4020j63945o8614K08740M9383P1884M2726q639j30688j15891n7525
79a44264K0263K9361N9199R3202J11948L1356m6688p4365o5443r0960q2096j6928
91a75415O5024Q4415P2077N2997K4940m0432r0226q4884m1893p901L6480Q3383
103b1435R3652N6010J7407j6132n5673q0299o1800k5087P445L4565N5848N7036
115F1537L3768r069m6793n8341n3818m5110j2798M1371P0957N9337L9181K1253
$$ y = [0, 0, 0, 0, 0, 0, 0, 0, 0, 0, 0, 0, -8, 8, -8, 8, -8, 16, -16, 16, -24, 30, -32, 40, -48, 56, -64, 78, -88, 104, -118, 134, -152, 174, -198, 222, -248, 280, -313, 350, -390, 436, -486, 535, -595, 657, -726, 801, -883, 974, -1073, 1183, -1304, 1436, -1583, 1751, -1939, 2154, -2397, 2683, -3019, 3424, -3921, 4548, -5367, 6489, -8128, 10768, -15715, 28305, -135640, -204254, 4486, 53869, 125753, 168479, 159840, 29152, -86739, -144264, -124001, -94640, -35441, 57761, 169709, 201065, 154377, 80012, 14569, -76391, -158487, -175415, -110391, -25976, 46101, 99098, 124038, 83606, -6620, -91504, -133397, -141298, -104818, -21435, 72217, 128227, 145634, 129502, 73829, -6470, -68270, -93357, -85912, -51347, 4501, 61537, 95305, 86236, 39443, -18898, -72716, -117826, -130624, -89253, -18296, 41041, 80222, 101475]
127A01475j2285n0788o0334l5734m736J3033L0304N0742M7121J1375k1664l4845
139C3664m5220n0479l1750L062L0028M2637M1625L0882J0049j9427m0299l7524
151c2752k0461m415J6930M0055M3961K5749N799j1134l0384m3663l6239j3517
163f0071O576J8505K7936L2682K0164p042k4611k5725k4016k0945r17K5297L5009
176B842K8021J9750J0069r633k9562l3544j8904m038M673J4600K7228K4652K931
189C9085j3318j6737k2254k7048j4768Q647K1818K2208K1342J8212O022j3998
201B9211k4362j8089r236m203O324K1950K3491J0247j326p067j6268k4878k1122
214c5328n433Q305J2940J5948J9560J2627m035j4891j3748j1667j0203m01J4858
$$ y = [101475, 89190, 38402, -21932, -57666, -62402, -49369, -19065, 31677, 78798, 90173, 68509, 33664, -11556, -62035, -93785, -90723, -60695, -18058, 23567, 54449, 64498, 45071, 4772, -32752, -53213, -57628, -40698, -643, 43318, 69067, 74866, 63732, 33348, -10315, -46554, -60071, -53495, -34990, -7054, 25628, 45792, 38750, 14139, -11586, -35602, -56547, -57464, -32167, 2842, 30863, 50613, 60682, 51049, 21487, -12057, -30961, -34999, -30326, -15726, 11502, 36154, 39085, 25767, 9030, -13224, -40272, -55040, -46393, -24575, -2367, 18975, 37187, 43209, 29211, 4849, -13240, -22476, -26679, -20355, 1595, 25086, 35333, 34007, 26940, 10672, -14206, -35328, -40761, -32456, -19516, -3568, 15992, 28619, 24584, 9693, -4055, -15722, -25925, -26326, -11468]
227a1468K0523J4141P382K560o711j8902k0707j0757j000K952R207J7142J3752
240A8114J349p376q728j0873j4060p334O557J4694J2942J0910J0382K459j0437
253A8599j6163j0333n842m416L111J3661J4021M534k488l852p868j4113j2779
266b3928p63Q121Q034Q622J2569R195k988j0546q069o008o569k575P818J3052
280E965P734J980L8l398j0479j3696o685J629K785N135R782J0781K408n044n572
295C363n189p180m847L063Q738P939M955M687J313o723j0908o561k624k226J049
310a1151P346Q672L508j110j804l548p540o994Q3N381M607M696P390N540k555
325A2521p522n359k919l900k335M265P882L721pl3j144o229q001k138K327J948
$$ y = [-11468, 9055, 23196, 30578, 33138, 26427, 7525, -13182, -23939, -24939, -21987, -12780, 4362, 18114, 19463, 12087, 3359, -7514, -21574, -28908, -22351, -7657, 5285, 16195, 26577, 29036, 18599, 2436, -7897, -13739, -18155, -15044, -1383, 12638, 17172, 14684, 10832, 2964, -11149, -23928, -24691, -16570, -8536, 86, 12655, 21850, 18862, 8316, 247, -5761, -12330, -14905, -7087, 5965, 13699, 15679, 15717, 12319, 1840, -11856, -18541, -16912, -14127, -8992, 790, 11571, 13979, 8935, 3363, -1826, -9006, -13853, -10790, -2052, 5887, 10842, 15529, 16842, 10119, -789, -7350, -9974, -12200, -11151, -3805, 4867, 8375, 7265, 5461, 1913, -5627, -12621, -12538, -7157, -2550, 2146, 9536, 15076, 12521, 4999, -360, -3279, -7179, -9514, -5249, 2633, 6354, 6347, 6314, 5170, -1059, -9060, -11198, -8871, -6923]
341f923K527O226O858J345l888l637k051m116l999J776O275M199J187J876R05
356H560m234p692l761o6m3K76M071O286K449j705j392r89l933m617J68M519K968
373H65K090L094L231j624n706l926j486j902j536K451N663K517o42n16j5l485
389i27m800j820K758K205J670L586M206O98l525k496j273k648k964J412M159K654
405B895J74M74O36k668m835k670P51N14L19L122M491K076j759j495m46k126l314
422c861m21L294K732Q37J171K061j023m420l337k64p18j276J484M268K437p21
438B243n02L55j809l585j642K079K244P16J969L062N79k930k000p73j607k591
454d192K60L185K245j64J20J025r32l500k314P30Q94j60J722L512K075j407j223
$$ y = [-6923, -4396, 1830, 8688, 10033, 6145, 2508, 457, -3659, -7658, -5882, 393, 4592, 5779, 7655, 8560, 4326, -3366, -7127, -7193, -7236, -6960, -2889, 3397, 5846, 4141, 2749, 1760, -2173, -6790, -6622, -2103, 865, 2955, 6049, 9280, 7656, 1950, -1976, -3462, -5364, -6900, -4449, 1214, 3731, 3089, 2573, 2558, -927, -5727, -7547, -4789, -2584, -914, 2672, 6878, 7576, 4051, 1555, 282, -2366, -5330, -3918, 241, 2895, 3069, 3543, 4179, 1511, -3324, -5994, -5243, -4729, -4410, -1288, 3203, 5279, 3520, 2025, 1579, -547, -3861, -4282, -988, 1744, 2581, 3752, 5813, 4790, 370, -2967, -3231, -3949, -5225, -3741, 527, 2964, 2243, 1741, 2096, 287, -3298, -4940, -2861, -617, 99, 2068, 5130, 5709, 2779, 779, 6, -1601, -4192, -3932, -747, 1498, 1334, 1454, 2479, 1547, -1953, -4267, -3537, -2643, -2803, -1081, 2431, 4506, 3099, 1876]
471A876J5j321k875n90J936J725P5O62J970m50l006k273m8l25j394P54L341J923
489A995n27j35P02r61k187j155J185J510k54O81K526M69k381j633j9m56k330l15
507c285J864K015o81K76J223J70k836j124Q19R63p78N93K571J474j009j145M64
524A574n32k265j102J614J328r96K5J565M43j896j602L19N15q92l10K208J613
541A609m74o06J333Jj996j119R94R46m94k72J328Q57j517j720N68M05j460j023
559b640J582J406m14m09J124P07j491j098P78J245o33o24J559J193j016j128K85
576D26L60j586j083Q66J298m59q06R86Q19j324q94M92Q32p06l47J671J052m78
594A119r51Q61N03j496j098P69R76m75n37Q73O98j110j718P30P26r37p83J337
$$ y = [1876, 1891, 570, -2305, -2895, -959, 766, 841, 1503, 3473, 3023, 17, -2256, -2304, -2629, -4023, -3269, 72, 1995, 1468, 1333, 2035, 1074, -1113, -2268, -1083, 427, 173, 854, 3380, 3849, 1468, -165, -184, -640, -2970, -3285, -1421, 594, -87, 189, 1412, 1582, -1254, -2378, -1559, -596, -1374, -781, 1790, 3264, 2255, 1110, 1574, 1042, -1223, -2325, -711, 617, -379, -354, 1211, 1654, -242, -1844, -1525, -1010, -1902, -2212, -4, 1609, 1135, 529, 1862, 1863, -133, -1252, -258, 688, 194, -78, 1250, 2107, 590, -1130, -562, -157, -1617, -2640, -1058, 348, -66, -475, 649, 1356, -135, -1233, -455, 790, 157, -467, 1092, 2285, 1269, 141, 426, 786, -800, -1883, -1017, 281, -178, -984, 2, 821, -503, -1397, -905, -73, -779, -1126, 545, 1597, 1119, 168, 1029, 1532, 36, -1062, -293, 683, 208, -329, 544, 1242, 132, -1586, -856, -130, -1067, -1850, -513]
612e13J175l73m41P21P91j020j187N91R11j35n38O14R91r76j228M41M62j168q40
631a722Q61R51k21m28M38O94p31p63M12R18j94q76J020J502o54j180L47M22j069
650b73o86O97K38k2m12M13P24o31j241L31Q88m38o45Q88J396n43n91N87N42q62
670C60r93N02N64j41r64Q48R73p40j119L9O91n87o14M86J117k43o32N11R63m55
690E66j230M22J008n02r34P13J170j60j086N3M61p03p87M35O90j79q20O72O84
709D73l76q52L56R06m69n00M70R78k73p89M25M54m41q59R3Q65j46j126L44J202
729G35m96j002J50P62l28n52L93R25o2q40L35P92j56j166J93R49k13q47M29Q90
749H91n27q42K26L34l39n76P1J030o6o25R1P48j29q11K40Q76l59n31K99J003m74
$$ y = [-513, 662, 289, -152, 569, 1360, 340, -847, -256, 655, 520, -18, 596, 1587, 611, -617, -176, 286, -882, -1722, -861, 90, -131, -559, -121, 573, -158, -921, -509, 409, 215, -661, 359, 1861, 1207, 27, 374, 796, -273, -959, -262, -24, -46, -458, -45, 679, 48, -1193, -862, 26, -412, -1057, -169, 1227, 684, 93, 680, 1222, 360, -633, -131, 433, 292, -672, 176, 1149, 409, -710, -671, 20, -567, -1181, -695, 422, 179, -453, 58, 1021, 566, -664, -242, 766, 264, -670, 43, 1213, 1053, -33, 20, 481, -222, -1009, -574, 116, -63, -883, -211, 473, 97, -755, -399, 507, 38, -462, 8, 986, 713, -76, 349, 803, 362, -497, -404, 461, 315, -811, -467, 735, 239, -763, -613, 149, -179, -731, -338, 587, 525, -315, 20, 812, 656, -510, -317, 632, 419, -428, 1, 891, 364, -478, -252, 82, -257, -833, -762, 268, 202, -423, -332, 416, 287, -524, -284, 592, 233, -298, 1, 1004, 530]
770E30p63J78O97n45q41J67R04Nq33J43N99j91p01M06N02k30m89L48P23J25r80
791b46K60O06k67q84K33O53r2q81L96O27j14p62j02Q34j62p41K00Q11M1k71k39
812a00N40O5q21J64L90J30p17J57O54l6n69k79O54k00o07Q5O33j26l28QQ18J09
834F24q94Q8K35R8m17R6N51n2l47l9P49m58n63nL04j6m02J30Q97j42p30J33L93
857B33q5n47K82M69j11k24J4N60n1p66J31L95r5m67k15N69L65q89K43K76N0o43
879e06n3O20Q6m64kP33j8n58L7O06k34j66l72O86j81j92l3K15J97q36m0O70O7
902B62p52j3O54J59m01Q7J92J87n65o7N51J78n25k24N59M5m70k57L45K56m89j16
924d04N41J41n15k98N93K13m42p3L01J14m11P8M60J74k35n38N52J5l88m48L48
$$ y = [530, -233, -55, 642, 97, -744, -577, 327, 332, -501, -358, 241, 50, -651, -245, 257, 27, -462, -114, 609, 734, -246, 14, 620, 353, -531, -298, 355, 263, -618, -222, 405, 291, -471, -573, 261, 99, -642, -442, 369, 410, 139, -100, 440, 505, -316, -152, 238, 368, -349, -192, 462, 426, -143, -422, 232, 32, -575, -490, 143, 17, -311, -303, 515, 624, -270, -182, 53, 151, -266, -170, 381, 329, -18, -57, 692, 234, -329, -334, -30, -46, -448, -318, 579, 437, -293, -160, 233, 148, -399, -117, 352, 241, 17, 31, 591, 540, -226, -95, 300, 205, -262, -477, 92, 457, -432, -189, 87, 137, -506, -559, 61, 147, -317, -319, 414, 396, -162, -125, 481, 247, 81, -291, 395, 214, 22, -11, 204, 401, -435, -475, 195, 262, -490, -503, 151, 310, -91, -4, 188, 375, -190, -257, 294, 472, -53, -277, 282, 327, -143, -400, -55, 201, -288, -404, 137, 278, -237, -535, 58, 271, -171, -244, 57, 171, -240, -162, 298, 472, 237, -301, 251, 266, -122, -570, -222]
945b22L38k01j57K53K33l98O3P9L27o21NJ75M11l03j2K55R3l89l73P21j4l87k08
968c32L60J93k74l53K46M42n74j58M18K89l07j26L61J76l86l22L42K18j12l54
988b53M83M6m06k14O63m1m27k70M13K80m00j46K61K09k36j89L77L30n58L6K79
1009B37R9l68j97L75P8k04j96L20K9l66j72L78L07n32K9L11J63m86m7L00J75l47
1031a14n5L24K11l54j91K93K54l68l73L95K39n09j14L37P5l77k13N79N0j62j35
1052b08K95j3j47k29K64L87k70k04R9M1l3M9K50k1j92j68QM11n32J83j90L12j62
1075g0j80K82J2K26m95K84K46l70Mj6K94o71J49K19K00o4k50N4L77k81m25L86
1097h9Q3N2k66K33R8j52j85K71M56m74K0k33M48j90k78L69m2j59j0j43L81j55
$$ y = [-222, 116, -85, -242, 11, 244, -154, -91, -12, 315, -306, -301, -126, 285, -18, -30, 225, 318, -71, -444, 277, 263, -124, -332, 28, 221, -53, -406, -160, 282, -292, -450, -32, 257, -50, -176, 185, 361, -25, -347, -5, 213, 101, -253, 230, 276, -130, -344, 319, 278, -149, -419, -6, 274, -126, -272, -11, 198, -38, -227, 150, 480, -78, -42, 237, 336, -32, -229, 146, 224, 20, -176, 144, 173, -193, -365, 13, 320, -212, -183, 128, 291, -195, -242, 58, 233, -114, -169, 155, 366, 12, -179, 114, 368, 0, -373, 22, 261, -248, -362, -25, 50, -327, -540, 39, 89, -73, -208, 87, 74, -73, -302, -38, 349, 79, -125, -26, 15, -18, 31, 281, 260, 68, -100, -92, 319, -213, -30, -220, 92, -70, -250, 32, 44, 270, -225, 59, 305, -65, -61, -77, 217, -454, -305, -86, 114, 50, -200, -146, 231, -50, -475, -89, -6, 46, -220, 13, 111, -41, -226, 45, 501, 27, 47, -186, 262, 72, -206, 163, 121, -38, -48, -191, 190, 35]
1119C5n79N78j10J49k99J06L41k65n22O21J07r7k83L99K09l55J61l82K34l2k85
1140b69L23L10k42m28K49L6m4k19K18L40j25m11K05M82m30k60K39J76j15j60m2
1161a67K76J3l89K52L39l74k13K53K66j80l95J42L86m9l98J32M37m18J9J59O6
1182A57J45n44J55L02k9j42L0Q8k50j77K52j24J88j46o6L14m6K9j74J93qj54o9
1205g6M16k89j29O4P4J52l28j8J66k41J46o3K91k92L9J12R6J56n81J53L00k68
1227a20Q0J2Q3M9J4j98P3J34j45l2L73j73l09rK37n4k62L4M92j77j38j11L00K0
1251A73k04N0kJ02l06O9K29k08J66Q3j46j33j54R5L09j2j80k15O26m3n76O5K42
1274C0K15k99L2J83K7l30N2K13m7j43J8L21l76M5k1R1K51l55j83N77r5l98N8K20
$$ y = [35, -544, 34, -76, 73, -226, -120, 221, -44, -566, 55, 162, 65, -218, 181, 390, 35, 196, -186, 48, 16, -269, 54, 364, 122, -306, -57, -21, -65, -284, -66, 274, 149, -262, -57, 425, -5, -265, -26, 150, 35, -125, -167, 109, 122, -267, -15, 324, -50, -263, -10, 256, 76, -319, -177, 209, 160, -238, -106, 331, -87, -68, 91, 157, 302, -242, -87, 215, 186, 44, 74, 162, -88, -265, -13, -137, 51, -95, -161, 153, 107, 136, -38, 155, 147, -7, -76, 340, 51, -78, -14, 60, 212, -116, -134, 32, -209, -63, -126, 165, -127, -88, 24, 120, 276, -305, -152, 148, -120, -40, -28, 55, 104, 118, -80, -7, 127, -18, -50, 323, 150, -159, -168, 69, 15, -247, -213, 279, 102, -36, -147, 153, 173, -31, 19, 17, 119, -187, -118, 111, -97, 69, 152, 6, -127, -281, -186, 123, 111, -69, -284, 342, 299, -277, -212, 30, 245, -54, -22, 161, 188, -142, -90, 123, 76, -67, -49, 272, -104, -59, -80, 11, 262, -93, -276, 301, 206, -192, -134, 86]
1298H6P2k71j70M55K9o7l85K93j87J2P8K43k55K6j95J31K84k36m2J14R8k13J7
1321h3R2Q8k97K32R6k94J54j88K86M5k40J64m1j60L7k27L86P5j77q0J25P4l53
1344b86L28K27j60k00q8K06J01o2j65O7K60l71M7J39p7k5m8L72j82j25j38J86
1366FJ48k05L5m9K03k25q7J34K99l95J80J73q7j00K8m2K97k31r8k06K83j55j30
1389b24M05J4o2m1q2J61j1j39m8J72p2k89K00K32j42o6j6K43n3k58L02O8l76j07
1413a89P1K11k52KK01j7K6n9K1J28k38J31J89n9l22J95j86K45L2k03K27k15r6
1436a57R9n7K15pj17J61L6k18J63l8o4l2q9Q0J76k54K20L4N6o9m58L72N3j2l49
1461b56L57O6k50k4N8L17l44m0m2K96n5N7o4nk13K03J51j47j14J34k79M50k89
$$ y = [86, 158, -113, -283, 172, 201, 134, -251, 42, -145, -133, -55, 188, -67, -41, -236, -105, 179, -57, -99, 15, 113, -100, -83, 9, 97, -200, 32, 128, -166, -12, -200, 86, 131, -109, 55, 14, -146, -109, -336, 50, 125, -52, -132, -7, 67, -286, 42, 269, 109, -91, -179, 27, 128, 66, -99, -32, 228, -143, -96, 43, -34, -59, -107, 265, 83, -42, -180, 6, 154, -51, -16, -65, 138, -87, -174, -40, 259, -136, 44, 217, 130, 30, 58, 16, 313, 82, -16, -222, 61, -94, -224, 181, 195, 133, 92, 10, 171, 160, 21, -27, 145, 73, -216, -16, 216, 74, 8, -8, 235, 182, -76, 226, 294, -82, -189, -118, 93, -159, -157, 44, 27, 53, -6, 15, 143, -95, 36, 225, 166, -156, 39, -147, 98, 130, -73, 154, -61, -157, -58, -115, 100, 93, -24, 137, 173, -45, 118, 80, 16, -16, -105, -25, 151, -103, 117, 151, 207, 138, -320, 52, 105, 93, -256, 101, 167, -83, -107, -49, 268, -76, -116, -158, 138, 83, 140, 76, 71, -142, 61, 212, 65, -49, 85, -194, 256, -33]
1484c3k51L11j51J13k71K25N3o7K96k89O8j16M04l52J20l62K29J9N5k9j41j5K98
1507A14N6j66J16r4Q3k21J33Q9m6j5p3J20O6k15L9N1J34k43J69j14QK3M67n62
1531h1M4O7j33J53l8j02K97j27n4o6n7L23j90j12J59Nm3kL4j26L5J31jl8l9j86
1557a47L6K44j31j13K05l15K05m3K6K09l71J30K9J60j01j56l3L27j65k09K22K17
1579B26k33k5J74j06k27K06o4O6j3m8J15n0n4k4k7J99o6m8P6J5j77J26j5J44k15
1604d5l7L1K21j40j53jJ32N4j7OO1p3j18J3R2n4J78j00q7r1L30n2j01m6J80k19
1630c6O7J46k21K45k05o1Q0j04j01K69j32K4%K28l64N4J01Qj47J36OJ06j38K9
1654a0l0j4K43k38o3R2J58j8l4J01k07N7K3n3R1m5j36K18k50M7J20j3N9l1k60
$$ y = [-33, -284, 27, -124, -11, -282, -57, -4, -71, 225, -64, 4, -112, 292, -60, 60, -302, -73, -54, 1, -28, -169, -184, 114, 170, 4, 120, 26, 109, -112, 21, 110, 64, 49, -24, 96, 162, -53, -14, 37, 171, -72, 97, -17, -9, 14, 481, -81, -37, 30, -103, 50, 12, -90, 207, 80, 26, -40, -97, 226, 36, -76, 83, 88, 45, 43, 77, -49, -14, 117, 116, 78, 39, -147, -111, 133, 2, -111, 94, -221, -16, -59, -33, 176, -195, -65, -36, 124, 23, -133, -166, 161, -4, -213, 9, 226, -7, -32, 142, 36, -191, 15, -49, 17, 4, -44, 71, 21, -33, -57, -84, 115, 49, 1, 77, 92, -85, 41, 26, 170, -45, -82, -51, 170, 30, -123, -124, 8, 62, 45, 51, 112, 39, -79, -66, 26, -28, 150, 50, -37, -128, 202, 150, 49, 3, 183, -36, 31, 177, -44, 201, -4, -65, 15, -89, -190, 79, -53, -29, -29, 199, -165, -111, -10, -2, -149, -13, -7, 99, -39, -10, -40, -54, 189, -49, -112, -20, 138, 120, 86, 187, -20, 37, 60, 7, 98, 53, -83, 135, -115, -68, 52, 39, 98, 67, -193]
1679a93K72k9k01L12K49n51J28J29k67j36L15Oqm3j74J15Q5J74l33K27k10J46
1701A3J23J58l09l31L77J26l62J77K4k8J35k84K56L5Nj13k48K05R9j40k1N7n6
1724a02J44j22K85j20k23J66j14J28K8l0K7p9j1j5l6J41J33k66K4J9N2l8J34j35
1748a0j34R5j17M51k11j35R2r1K2L2J17j47o8K8k8l7L28l27J23K03j76j16L3P1
1772bP6m2Q5j64O3n5o6J90k1k60K19K0j19n5L04k70R0r1N8J88m1j33k1J56k62
1797a53J77j15K11j59Q3j38O7J9O6K3j04j55J24n2J55l07K60K1N0J46m42K12k4
1820c5n3J29j41J98j45%J77n4N7k56j8J32POj55K29j79N1K57k36P4j46J11j6n9
1845f5k0K36j77J23q7L1K8k28J65p7J23l78L30j25K68ll38M26k01L9K5j93J75
$$ y = [-193, 79, 50, -151, 161, 410, -141, -13, 116, -151, -287, 28, 34, 26, -17, -191, -76, 9, 183, -150, 77, -133, 13, 136, 294, -15, -346, 31, 157, -205, -28, -4, -32, 103, -181, 75, 110, 115, 2, -246, -41, 58, -82, -103, -46, -102, 42, -80, 205, 85, -138, 28, -86, 42, 70, 40, 67, -12, -23, -38, -74, 67, 200, -66, -42, -23, 29, -9, 125, -10, -144, -49, -166, 285, 74, -61, 31, -60, -38, -6, 111, -36, -104, -76, -104, -141, 187, -140, -17, 186, 10, -106, -73, -2, 74, 32, 117, -47, 16, -39, -105, 85, 64, -196, 23, 43, -76, -131, 173, -97, -7, -98, -40, 148, 107, -26, -47, 109, -153, 24, -91, 120, -39, 44, -94, -27, -8, 58, 81, -23, -178, -54, -106, 49, -258, 2, 23, 73, 219, -223, -11, -35, -88, 41, -100, 98, -47, -47, 130, 76, 133, -123, -141, -9, -2, 4, -151, 78, -101, -50, 207, -29, 45, -101, 10, -6, -65, -85, 151, -26, 97, 10, 41, 69, -159, 6, -71, 52, -326, 4, -121, 147, 144, -194, 232, 31, 70, 95, -98, 77]
1868G7r2j97L43j27p4K27j62R8J06k67L1j12J95j06J64p1j72K72k0O6q3j94R3
1891eJ80j41l15K35J89j4k99K59r6kK35k07r2Q1k02J3K06j91R5Qj04L18L2k49
1915f6r3Q0P2Rp8J39o3j05J33j50J07k2J37Pl9n1l3M9k41N3r8K58J00j78Q4J18
1941A29n3l16K01J12J05m69M71j64l8q0J54R0j25%j49K17J0J28k50K09k44J09
1963D7m8M3L0j76J7K87k62K0K5j03J72k77K70j03L09m87L54m1k0O1k69O4K13j20
1987Fm1Q2J93m52K61k39K90m2l9Q8k39K24j55K16k64K06j94O6j01K07J03k95q1
2010b00J31rK05k25N9k8j67L62k04r5O3P9p3J2J26k11L84P1l27J41j71P0qq9K60
2035A56K9k20j58M41j73j3l5j03K05n1j32L19l65L51n07L04Q5Q7l90K77Q3r5j
$$ y = [77, -15, -212, 131, 4, -70, 157, -5, 93, 199, -68, -37, -149, 46, -60, 104, 33, -139, 133, 113, 179, 96, -98, -5, 175, 34, -281, -46, 143, 129, -170, 89, -7, -9, 226, 19, -73, 8, -194, -181, 25, -166, -71, -63, -167, 151, 183, -66, -159, -79, -7, 2, -76, 63, 0, -105, 28, -122, -15, -37, 100, 107, 68, 17, -16, 33, -208, -155, -253, 5, 105, -73, 11, 129, 76, -240, -39, 73, 178, -291, 180, 16, -22, -102, 52, 142, 17, 17, -132, 85, 95, 223, -27, 182, -62, 47, -1, 42, 72, -104, -87, 200, -62, -42, -17, -120, 52, -225, 45, -58, 251, -236, 118, 77, 57, 118, -151, -87, 126, 6, -35, 47, 240, -212, 49, -190, 100, 58, 19, 107, -132, 92, -63, 153, -111, 95, -99, -33, -134, 73, 176, -119, -200, -69, -78, 127, -98, -39, -67, -234, 128, -76, -171, -108, -29, -102, -90, 36, -175, 209, 280, -47, 94, -77, -7, -15, -104, 156, 185, -35, -193, 248, 75, 62, 27, -76, 129, 78, -54, 265, -100, 251, -256, 48, 133, 220, -170, 107, 190, 95, 94]
2058I4k10K74k03J4J3j15J45K12l17J48q4J51j2l82K76l3O6J02j03Q8k17O4J31
2081A02k35Q6J85j72J53j35j25J54j06L00l19J56kr6l9L95n44J85k5K4J23m5R7
2104A17j78J05j16K22k12N6K36k55K09j24j29lJ69k3M7l16m6L18r8J92k04l1K59
2127A95J5k48P2J37r0k9m7n6L3k8qN7j4j62J66m6K82k90J56j00k5N9Lo8P1l1o9
2154f5L5k35L12n7K24J26l73L3R8k08o2J74J00m7n7N4j36J97J2p3p4R6l9J92j94
2179C3r7J26k8O6j16J19k02K9J70k52K03QM1k56J17K56l49L01k25J11J19k24K7
2202b3k01K23j71J41R3j08K20j25j07J19M3j30%l4J42P1k37J32Q9M6k79J58pj56
2226a01M9p2J39j51J21N5J8J36m4j39q9K24j56j24J07Q4o7r5J40m9n9N6J90k92
$$ y = [94, -116, 158, -45, -31, -18, -133, 12, 224, -93, 55, -29, 122, 110, -272, 4, -29, 37, 139, 36, 124, -93, -29, 102, -133, -47, 138, -34, 119, -16, -141, 13, -93, 207, -112, 44, 42, -54, -93, 302, -242, -57, -82, -58, 65, 20, 117, -61, 44, -72, 150, -62, -6, 230, -25, 184, 60, -69, -72, 97, 74, 121, -195, -241, 77, -21, 171, -33, -64, 195, 210, -38, 34, 171, 81, 52, 5, -51, -18, -46, -54, 3, -11, -173, -7, -53, 229, -61, 95, -5, -30, 29, 32, -36, 35, 4, -65, -30, -265, 47, -10, 214, 340, -33, 0, 98, -110, -172, 2, 102, 55, -2, 52, -84, 113, 125, 52, -22, 74, 35, 227, 33, -64, 62, 34, 100, -16, 103, -99, -70, 100, -152, 51, 59, 100, -156, -39, 217, -132, 169, -56, 55, 174, -50, -23, -224, -1, -172, -31, 62, -46, 174, 49, -58, 61, 104, -26, -26, -60, 82, 153, -84, 48, 137, 183, -96, 62, 55, -101, -52, -124, 15, -136, -15, 40, 58, 194, 150, 11, -78, 146, -10, -134, -27, 57, -10, -105, 35, -14, -73, -17, 173, -119]
2250a19J09j60J50K35k19p4J40M6j7k05N3rJ12k39J16K96j90k20L56k80p6L49
2272A54k30L95l25K5m6M9N7P7p2k10K15n9J8rj84n3K06Pj51J14J80p8j48j1n9
2297a38J07J69n2r3J40k19J83K7k56N1K36k49J9L78m88K65j2L2l29K72N9o0j15
2320g3N3N4L4k2L0jj32P1P6k30k5K13PJ84l98J21N8r6J7M8K9L6j39o8K47Rj68
2347f5R5m7K2r8n1K20P3j77N1k21J95jpo9j8m2j14L02J21J1j56n7j82J61K43k30
2373d1m5LpJ18O7Q6k17R5q7K0m4k2L11j12j95R5J65l07JJ53j7Nj77K07j52J6Q2
2400AN5p3p6M9K8r5P2J18j55oP9o7J03K9k08L7K9J29r1j60K47k82M24l11J17L9
2426C2k71R5J13PP7o8R8K9M1k33R3L0j25J02N0l4J45j49k29J26K4j18J08J30j83
$$ y = [-119, -10, -170, -20, 215, -4, -78, 62, 108, 91, -114, -61, -70, 42, -197, -81, 215, 25, -195, 161, -119, -195, 154, -76, 319, -6, 19, -27, 22, 79, 156, 84, -126, 89, 30, 48, 39, -145, -198, 8, 15, -136, -22, 158, 80, -68, -79, -138, -31, 138, 86, -7, 133, -86, 97, 124, -132, -81, 155, -94, -75, 303, -185, 80, 68, 100, -229, 43, 102, 42, -73, -20, 34, 68, 46, 76, 75, -57, 14, 90, -140, -165, 48, 55, 239, -159, -38, 20, -76, -59, -11, 18, 54, -85, -153, 94, 103, -65, 30, -17, 5, -93, -144, 76, 149, -28, 23, -198, -3, -4, -11, -80, -98, -140, -254, 48, 169, 180, 24, -33, -215, -54, 189, -41, -86, -83, -90, 28, 95, 181, -36, 59, -28, -8, -52, -74, 237, 125, -70, 25, 190, -117, -116, 37, 20, 25, -152, 55, -97, -81, 1, 56, -17, -93, -44, -16, -111, -39, 79, -76, -82, -3, -70, 33, 62, -146, -109, -80, 49, -42, -202, 45, -237, 187, -124, -7, 32, -239, -144, -31, -24, 53, -15, 83, 112, 153, -80, 13, 43, -82, 20, 70, 36, 181, 32, -197, -71, -47, -165, -57, 73, -110]
2451a10K41j84J43O2l17J57k2N0o7J43j32P3j38J83j94K66l53R2K61N9k91j40
2473b18J85NrJ72k61Q1J38K7rm2J05k18J74r1j18L2j20J60O7j5R1r2j24J93m5
2498F8Lj56O6R3K22k69k20K88j83J02q6J1J88J1J2k53J42l6j67l3L41k05J69j80
2522g2pN4K96l06o7L6l0MJ97j12l82O01J03k38L2qJ3k61J55j46K07j7k01o4J82
2547c1j16K26p1J4J8RJ36k23N5j0j15oJ12pJo0rl3K53p0j45m9J12J83k11J35K1
2574A19k10R9r0J36R3m0p8J7j58k0J22K62k97J12j51K5O0J10k75K35q1K0Np5J25
2599F5NJ56l60J16L1o3N8r2J38J35k23Jl5o7L63k63K7K1n7j65K66P4j38m2RL1
2625ik16K35M1k59J83l6J26J05j23Q6m6J11m68L51m7k19J28J11J6k76M12j94J22
$$ y = [-110, 131, -53, 90, 152, -165, -8, -30, 20, -47, 96, -36, 37, -101, 82, -112, 154, -199, -107, 154, 213, -78, -218, -33, -28, -37, 135, -126, -45, 93, 120, 111, 69, 174, -44, 130, 39, -79, -47, -167, -7, 60, 45, 136, 44, -80, 113, 68, 71, -85, -19, 74, 296, 27, -193, 95, -88, 14, -72, -61, 127, 138, 150, -103, 39, 3, -164, -197, 144, -61, 108, -72, -79, -25, 271, -35, -102, -66, -96, -92, 105, -7, -389, 212, 315, 77, 109, 101, 114, -147, 8, -138, 69, 52, -149, -213, -31, -147, 79, 8, 22, 40, 49, 185, -38, 17, 7, -108, -114, -2, -9, -8, -68, -77, -110, 143, 73, -72, -121, -9, 174, -37, 98, 119, -91, 8, -82, 54, 147, 107, 29, 46, -112, -132, -10, 252, -45, 67, -84, -59, 1, 111, -164, 71, -10, 10, 15, -60, 65, 70, 226, -134, -18, 13, -50, 8, -84, 54, 189, -34, -33, -68, -135, 228, -35, -8, 13, -44, -209, 57, 131, -7, -49, -40, -9, -225, 10, 51, -208, -25, -61, 65, 170, 47, 133, 87, 198, -270, 81, 34, -185, -57, 54, 70, -206, 206, 12, 134]
2648A34n9j09N6k5L2p0J87k72J9K62j81O6J16l0l5j07J26o3m2K00j07l44J96j69
2672b19L06q7p4m4J9K35j67N2J12j48jL5j71J88Rk00J93J5j2P9j76k9J19j6j7
2697Ap5P4M4j33J93k37R1n1L9J78l03O8K46j60J87k09P1r1P6j2K3Kq7J08r7K7
2723b7J93L2l87K25j70J65j54Q1Q0K9j12OJ86j88j5J02J27k11m2J79p0r6K03k93
2747a57K57j5J28k41P7n0k41L29P5k86R8O8l1p3O9J27j94k7J46K3r5QP3j96L78
2772B50j12k29M5j45M0J42o5l4j16L28k62K59j99J20mK4j79K35k20J17p0L8j63
2795b00J11K58k07L67l16P7j76j66K93Q9j01P2j53K27k22K09k78K39l0j6j32J00
2817D5j48L8J2J34l5k50J37J01n7Jj30J93o5Q2k09K29L4j82N7k81J78N1R1j04
$$ y = [134, 75, -34, 22, -3, 29, -41, 146, -126, -107, 155, -26, 40, 156, 126, 91, -16, 110, 47, 5, 205, 98, -246, -50, -219, 87, 0, -74, -118, -99, 136, -31, 21, 133, -15, -16, 19, -152, 36, 45, -155, 38, 53, 41, 120, -56, -85, 34, 18, 1, -74, 0, 44, -89, 104, -133, -42, -93, -54, 124, -179, -111, 135, -25, 162, -47, 24, -67, 9, -3, 20, 22, -65, 43, -54, -27, 166, 198, -189, 36, -134, 31, -123, -42, 38, 67, -45, -39, 147, -41, -56, 46, 173, -38, -80, 99, 29, -67, 136, -157, 100, 85, 213, -28, 49, -1, -242, 87, 162, -124, -26, 42, 11, -62, 7, 134, -60, -87, 59, 82, -13, -5, 68, -128, 250, 138, -91, -46, -191, -151, -9, -74, -108, -224, 104, -158, 101, -98, 22, 18, 42, -137, 98, -122, -5, -75, -37, -200, -89, 169, -38, 329, 13, 90, -86, -252, 41, 130, 29, 101, -52, 175, -47, 162, -116, 123, 93, 77, -55, 45, -103, -65, -53, 81, 46, -204, -67, 34, -23, -22, -152, 41, -24, 58, -151, 78, 112, -70, -13, -294, -116, -65, 26, -78]
2841g8J26P0n8Pk37J96j3j08R9l1J80J62k58j92J58q9L2K29j50Q7k63P4n2L6j8
2866i1J48J6N8k18J10k00K72j08P6q4o4J88k87L09k85J94j38L3J44k15l8K13n4
2889b1n1K99k27m0j40j09M32R5j91j63N4q5J82k04J05J85j03J9R9rk42J60M2L9
2913A26j36Qm7K5J17j03m9P8j39J00r7P6R0M2k02J85m1j44M7j00NP9J18QJ5J11
2939A72j86N1p6M7j3J7J38j09lQ1j00J05j47lJ06j43j5R0M4r8l2J22ml7J75j20
2965F2k03J47Q0k06J61J3R0j19q0K08k12k3L2p6K55j68Ro2J70p3R3m5nk60K59
2990D7k0L6k5j19O7J85j81j22N5j4k1L4M2l5m3J85q1K6Q2j89L4J30O1m4j34J51
3016A07j40M8l1J9Q0r1j15J03j39Q2J21j90K88m64K57k8J96j74K5P9j19n6K04
$$ y = [-78, 48, 118, 60, 67, -170, 26, 13, -95, 4, -27, 153, 315, 57, -135, 23, -66, -34, 195, 45, 132, -131, -57, -109, -73, -91, 57, 73, 131, -87, 23, -177, 95, -13, 63, -21, -85, 103, -184, 125, -160, 34, -104, -71, 73, -142, -180, 33, -21, -72, 227, 0, -40, -180, -289, 143, 238, 47, -116, -62, -147, 35, -169, -64, 121, 18, 37, 136, 127, -115, 45, 87, 126, -10, -2, -49, -24, 93, -10, -59, 19, -120, -20, -117, -41, 49, 91, -111, 74, 33, -111, -64, -164, -159, -80, 38, 46, 61, 172, -14, 37, -39, 8, -5, 12, 150, 41, 38, 119, 19, 124, -23, -26, 80, -63, -78, 12, 56, -42, -74, 48, 44, 7, 182, 62, -141, 6, 86, -120, 41, 54, 144, 25, -55, 153, -59, -82, -50, -126, 129, -39, -30, -92, 78, 5, 98, 53, 48, -212, 47, 27, 63, 38, -81, -14, 171, -10, -132, -77, -91, -112, -78, -36, -71, -114, 71, -10, 16, 98, -91, -57, 73, 134, 90, -44, 107, -33, 15, -16, 3, 83, -8, -123, -20, -159, -77, 44, -146, 142, -322, -65, -93, 103, -71, -46, 33, -86, -142, 62]
3039F2J6j77R6J16R5m29J24O5l3lJ58L2n9K7o4j52J21K47l29J33n1m4k8MR2o9
3065e0K7j01J03P7n9j42M9o5J24N4J5m1K25j22l14J37m6J57j76J35joj7J18j36
3090e5q5J13K4n1R6p2j71N5O7QK05j15J3J11l6j2k65J74j5j7J00j81m0P6J78o2
3116D3j33K26j99l9J30j6o2m0l9J5K55k23K42k56K48q6j23K76j96m5J24j19J54
3139A37l05M9lK94N2q7l32l4L40m3J55j95P1j14P4j14j01M7l1L35r8j36M8j20
3163a11o3n0L16k17l1j9K82Lj55J7J12l25L04k3k39K61R7j84L5k9J87j52M4q2
3187b2l2M00j65m5%j00l4m3M1J81p3j77j7k8J93k56J5L16j38p9J40q6r4J30L6
3212F3L3k59Q6N4O6P8j07j20L14m25J75qL6J7j30J93j85K30k26K68k15J51J69
$$ y = [62, 78, -99, -3, 113, 208, -221, -97, -32, -65, -68, 90, 122, 63, 90, 26, -126, -5, 242, -87, 46, -5, -49, -77, -73, 19, -50, -23, -124, -21, 56, -3, -145, -96, -161, -37, 17, 32, -9, 216, 94, -220, -83, -129, 28, -148, -13, -14, -20, -37, 81, -55, -140, -27, -3, -54, 42, -30, -201, -146, -79, -71, 134, 19, 32, 143, 107, 95, -170, 4, -11, -28, 72, -109, -149, -73, 105, 43, -90, 136, -63, -102, 28, 12, -50, -90, -129, -114, 141, -82, 160, -96, 152, 66, -57, 219, 23, -22, 102, -17, 137, -168, -119, -122, 172, 224, 137, -195, -229, 111, 68, 223, 28, 99, -15, 59, -55, -156, -109, -140, 195, 97, -39, 9, -111, -174, -224, 92, -125, -156, -175, 107, 110, -45, -28, 84, -241, 63, 40, -199, 62, 159, -25, 10, -19, 168, 16, 60, -22, -54, 346, 181, 136, 136, 36, 2, -41, 0, 181, 108, -69, -86, -114, 79, -177, -162, 154, 16, -63, 77, -9, -103, 27, 63, 96, -163, -77, -23, 43, 121, 14, -106, 208, -217, -42, -50, -14, 3, -127, 66, -119, 111, -115, 153, -62, 89, 258]
3235B58k21k10K83j9Kk31K52j04k56K28j0n7n4J32M0NM8J04l37J49j52J98j53
3258a05K88jj49O1j71Q4k11K24J5j97M04l68K08j86K49j78K46j1m11J75n8m1j6
3281a49K6J7Q2M1q4q0J26J25j23k0q7R4p2J41l03J55P7J9K30j73M4L7Jk7j18j6
3307c7j74K30j47J75k19J44K16j07jn7J17l52J11N3P8n3j33J68K7j9j27K61o3
3330I1j75j7R0m9k7J72k23K58j39o7J24k40J23l7K02p4J34l1k8j10J20K6j75J49
3354I7j74J69k82J53O3L3LN5r2k38K65Mj9J59k08J58K6l12K01k76J98j2pJ37m4
3379E7j45P6l2Km9P5k85L22m5k18J02O4l5j18N05k95L68n46J40L7K61l58p7L23
3403A29L2j25n2j55J03J02k4n1R3M3j90Q5j88L85k42J1K06k58J95r1n4K0M7N2
$$ y = [258, 37, -173, 110, 91, 93, -138, 114, 10, -246, -18, -28, -85, -139, -7, 33, 38, 86, 190, -147, 2, -150, 48, -105, 183, 182, 33, 94, -77, 7, -204, 20, 35, -162, 242, -126, 82, -104, 145, -33, 213, 202, -209, -34, -92, -133, -149, -123, -106, -24, 17, -67, -147, -21, 104, -19, -39, -126, -32, -104, 37, -266, -111, -34, -15, 215, 42, 86, 123, 124, 97, -21, -37, -211, 19, -128, 47, -172, -28, 188, 81, 80, 23, 140, -212, -101, -48, 30, -23, -156, 12, 39, 20, -107, 154, 91, -84, -101, -11, -60, -87, 85, -138, 120, -19, -86, 38, -202, -79, -116, 86, 12, 146, 115, 87, -23, 97, 123, -52, 97, -77, 92, -190, -37, 26, 59, 62, 117, 25, -213, 52, 56, 37, 196, -12, 146, 172, -140, 61, -215, -17, -29, -36, 101, 57, -88, -12, -44, -42, -91, -16, -301, 21, -24, -242, -140, -76, -111, -229, 276, -19, 349, -197, -57, -20, 241, -117, -194, 129, 161, 36, -16, -171, -68, 34, 10, -41, 52, 95, -95, -10, -198, 187, -55, -44, 162, -96, 99, 8, -46, -26, 21, 73]
3427G3q7J63j0j21q5J04O1L0k39J52J28k62J17j98J77K33m00R8J15L7j12j78K49
3450D5K90l35k3M57m75L1L5j15R8j25J34o7j5J7l6R5l1q4J20J35j23l28L66j4
3474E2Q8k19M4R7k5J52j38j51P1J23k26J9K76m19M88j63j56N0R4r5K13p8j06m8
3498e7KM8K83k26J38l53J09k39J18K36K7j78p7J20K01j46j49J79k55L57o4O6k93
3521a53Q1J06k1j4j13J76m9j00q0K12kl03L21q7j78J69J9J53k41K32j70o3QJ34
3545C7j15N9Q0j04k3l3J67n1p0M7Q9k55L55j70o5Rj13J08j10m3L14j86q9J81l5
3570a6P0O8j40p0R4Q7K2l23J12pL8J30K5j02K9Q1j02j83J78J26j67K6J7M7j20
3595h0q1R1N6J89j24j23Q2n7J10l49K93K32k98j4J01n1L3j2n6L00k17r4O8j43
$$ y = [73, -14, 149, 139, 18, -67, 37, 98, 128, -111, 41, 169, -93, 24, -174, 3, 236, -164, -66, 49, 86, -26, -204, 45, 335, 0, -23, 434, -41, -10, 25, -90, 8, -117, 17, -50, -65, -48, -84, 11, -20, -104, 16, 151, 28, -300, 66, 52, 140, -79, -35, 62, 37, 189, 51, -100, -29, 94, -132, -113, 163, -256, 232, 69, -87, -37, 57, -38, 175, 97, -9, -57, -55, -7, 276, 50, 188, -165, -56, -295, -177, 59, 86, -92, -169, -49, 152, 6, -143, 36, -219, 138, 74, 140, -153, -72, 34, 13, -1, -114, 62, 13, -87, -167, 45, 43, -260, 61, -26, -204, -35, -16, 137, -104, 128, -42, -105, -97, 37, -78, -19, 61, -43, -66, -99, 68, 17, -53, -6, 83, -172, 183, 13, -52, -43, -156, -48, -158, -201, 113, -73, -162, 19, -16, 54, 122, -18, -88, 6, 93, 115, -208, -96, -103, -65, 65, 90, -12, 17, 98, -4, -187, -9, 117, -50, -24, -7, 40, -80, -161, -70, -14, 175, 51, -72, 10, -47, 63, -286, 7, 239, -59, -73, 28, -23, 10, -2, -58, 242, 25, -69, -1, -144]
3619a44PNK68lk16J27o7k50K48nJ00J03k8j13L1j28o7o5K27j26Q7o1j54L37J7
3644A30j09k8R8k00N0K90k69J0R2j79J04j5j46N6l8J65k17K04j54K53n7m9N8k61
3668b12L31j60Pj4Q0k5j58L96j31p3j21r5K72l8k11J69o6r1J05M9K9N2j14R1j47
3693g5J48J54k25J25k0N1j19P3l6k62K04J89k22j15J10j56K56o8m4J03k69K6R6
3716g6O2N6J14l02K92k01N5P0j52J23m0n0O4OJ84l41J55J46l05L4J71Mp2J18n3
3741F2q4j99K03J29n6j0j49J34J8r0J68k0k55K21j58Q0N8p8jN5j27J23J07j08
3765B3L8o7r4J06j57J89m1K6j47J50k2O8j21J22J67k78J15J8k15l1J85n5k2R7
3789E4j21L5p5J31j74J60r6R7n4r8K13j67K54J6j0l69K03k11R6J48Ql0j73J28
$$ y = [-144, -137, -132, 136, 133, -83, 44, -23, -273, -25, -30, 70, 173, 145, 32, 63, -65, -132, -197, 30, -96, -9, -70, -224, 113, 130, 21, -7, 91, -109, -59, 231, -38, -28, 64, -115, -11, -26, -172, -116, -154, 11, -206, -2, -156, 97, 40, -9, 49, -212, 119, -41, -34, -48, 32, 7, -151, 245, 114, 41, -80, -175, 97, 59, -152, 17, -49, -140, -35, 14, 43, 95, -19, 72, -75, 73, 227, 2, 127, 107, 158, 39, 112, 76, -186, 18, 207, -15, -130, -20, -176, 80, 12, -32, 71, -198, -172, -76, -14, 42, 156, -146, 146, -55, 0, 70, -82, 41, 1, -49, 15, 21, 205, -136, 19, 165, -140, -106, 65, 69, -3, 115, 62, -22, -221, -18, 111, 55, 45, -104, 30, 48, -42, 126, 106, -149, 72, -86, -6, 52, -26, -27, 28, -99, 24, 131, 23, 61, -6, -100, 6, -151, 38, -3, 23, -124, 26, 4, 72, -49, 73, 240, -38, 77, 95, -120, -151, 34, -21, -43, 54, -67, -32, -107, 24, -150, 10, -86, 11, -43, -141, 72, -95, 159, 175, 165, -204, -1, -212, -116, 32, 40, 10, -163, -35]
3813c5N3m3j40L37j71P7l8K9M9j34L0j16K8Q7J17m9m5r0m6J01R8j80m4K03Jj19
3839d0J19k48oK16P2J1j33OJ65k71R8k4rJ05o5l3j2J12R1r3p2O9j91J99k04O5
3865g3K43l73K16j23q8J36j04K08p7M3j01P1m7l8K11k82J11NM1K9J13J11j42j8
3889G2Qj43M0O7k1%L9J4k16M4J52lJ40k34m6J41j13N4j01L33m39K22K4oR6q1k09
3916a66k25M50j21N5RpJ15j3oj73J06J19j94K6j42N0m9P6Q9J20l0M3k10K00J8
3941A40j59k63L55m3j9j13p7J24j18J56K01l12J16R9k33K83j39N8n4k24L36r9
3963A5K19j45j90O9J31m2k4k08K24m8j76K49P3j78J8N8L4q4l07N13n2j63j42J81
3987B5n3J29k23L12r6k3P4j72P1o7o5nR6pq6J13k38J01L03k71J41j16j03J12K33
$$ y = [-35, 18, -25, -165, 172, 1, 78, 40, 69, 118, -16, 14, -102, -74, 13, 130, 81, 36, -54, -100, 1, 99, -81, -125, 78, 79, -40, 79, -169, -175, 41, 113, 124, -9, -3, 162, -109, -11, -35, -44, 61, -4, -37, -49, 63, 154, 61, -11, 58, -133, 66, -138, -73, 170, -203, 13, -110, -198, -62, -166, 42, -35, 8, -93, -22, -69, -107, 104, -178, -67, -62, -21, 8, 121, 232, 90, 72, 80, -63, -23, 44, 23, 23, 62, 76, -140, -96, 56, 53, 193, -41, -87, 54, -59, -5, -106, 227, -212, 10, 34, 28, 124, 43, -166, -391, 59, -62, -7, 2, -5, 110, 97, 91, -82, 24, 143, -51, -25, -167, -117, -166, -90, -1, 119, 89, 132, -78, 122, 140, -19, -282, 73, 30, 11, -102, -179, -55, -173, -17, 184, -128, -12, 87, -146, 137, -2, 56, 2, -222, 114, 15, 234, 89, -101, -32, 99, 57, 33, -175, 49, 1, -175, 74, 147, -31, -13, 45, 79, -5, -312, 201, 149, -14, -156, 25, -28, 101, -122, 190, 94, 71, 145, -27, 44, -23, -88, -93, 3, -4, -90, 23, -215, -114, 189, -82, 59, -57, -160, -48, 185]
4012A85m15O9J93r4j27J95J7M3j69O7l5K9L6JM4j67M05j90l3j8q0J82j4J30l21
4037f7j3O3K28l32O4j16K91j5k33J12o2n7L88l22O2j01L8M8pL7M4k73L20k58P3
4062h8rJ37LJ8k61L46k05J81k46M52m36r0J97P6l98L22N2k8J5k6k2j41J14j11
4086a48J32k04K95Po9j8q4J90n5o1J93j67O1j57nJ67o7j11K50j90n1N9J01J04
4110A72j13M6J21l58j38L12j06J61J37l50j59M05J8j36J44j36J22j56mK84j44
4131A22l56J60K28p6q1m2K87k55p0k87L31q4J39j03J1J68M6J1j11o4L9r9J15L
4155C2j06jK02j94J23j20J37J2j79Q7j9J21j16j83J89K5j41M5RK25j14j4J67j33
4179E4j18m3J21j05Q2j3J62j2J31k20q0n2N6N4j60k6N04l39n8K34k18q7J50N4
$$ y = [185, -230, -161, 32, -62, -189, 6, 23, 66, -103, -36, -71, -42, -6, -5, 39, -128, 277, 87, 54, 36, -44, 138, 124, 254, -67, -80, -17, 211, -121, -57, -173, 118, 103, -130, -18, -80, -137, 251, -71, -9, -110, -72, -24, -31, 6, 50, -223, 97, -161, -88, -97, 40, 43, 61, -200, 146, -59, 122, -124, 328, -108, -198, -1, 75, -323, -1, 51, 23, 38, 12, -10, -151, -37, -148, -16, -220, 75, 82, 13, -5, -89, 101, 46, -15, 178, 11, 72, -85, -90, 77, 10, -101, 149, -41, -92, -33, 68, 172, 59, 105, 226, -132, -270, 42, -64, 97, 234, -116, -275, 130, 148, 12, 156, 20, 142, -14, -18, 266, 122, -234, -74, 154, 78, -3, -45, 242, -13, -83, -370, -39, -123, 16, -87, -76, 92, 138, 149, 38, -26, 13, -86, 29, 32, -74, -75, 127, -67, 56, -64, 73, 85, -94, -7, -26, 95, -21, -204, -15, 10, -131, -86, -77, 148, 34, 20, 187, 54, -64, -107, 14, -91, -9, -22, 140, 128, 259, 39, -41, -93, -37, 17, -143, -169, 335, -4, -62, 172, -46, -133, 17, 71]
4203G1J73m34K92k29j44L24n2j56j5R1k13K02OP4q8J01M7j07P4P4j28K3J52l71
4227b33R8j0R1m0j87K39n4J22O7Q8m37L90k77L21j57M7M8m8j18R2n2r6O3KJ44
4252A03j3p3L8J86k35m6lJ13J56k86J14J76k27J5l8n9q8P8J15m4j56M6O2J01P9
4277A14m2j74J64LO4k58K1N1%J28m1K5j73P7M4K5M2k03J41J62p0j11N1L7j46K59
4303A90j22l2j05J49r9j60L98k68O0J83l96J24O1J75j48J13k64L12k23J15O0K9
4325A52j10p1m3J37j9j16j39Q4K92k95K12J06k04qJ37k02J41Ln0L7j4j42J68m5
4349A1jL5l4N6k2K8J7j57j66K19L9P3j00J33n9R4k36K4l9K25Lj52q9J10k9J42
4375A25j33j43K20p7R4Ko1K9j66K65j09Rj17J38j79P4j0J13o4j63J51K3m6kq8
$$ y = [71, 244, -190, 102, -127, -271, 53, 1, -155, -170, -79, -292, -90, -84, -10, -98, 3, 50, -57, 17, 91, -37, -14, 138, -233, -135, -145, -54, -94, -281, -42, -96, 26, 93, 181, -256, 134, -143, 178, 21, 68, 116, 68, -50, 42, -10, -106, -43, -41, 103, 90, 17, 55, 241, 6, -40, -43, 70, 226, -60, 54, 230, 3, 18, -20, -79, -167, -89, 26, -18, -174, -128, -66, 35, 114, 72, -102, 62, 65, 129, -129, -108, -57, -57, 71, 30, 55, -118, -41, 3, 28, 70, -133, 8, 170, 100, -11, 40, 77, -69, 190, 68, 36, -69, 80, -19, -179, 219, -49, 11, 194, -202, -78, -17, 158, 10, 123, -141, 171, -52, 63, 123, 152, 42, -29, -72, 65, 46, -70, -209, -125, 167, -128, 84, 190, -14, -22, 115, -87, 54, 57, 7, 44, 30, -112, 56, 11, 10, 45, 11, 67, 45, 73, 90, -67, -233, -14, 25, 98, -2, 131, 72, 166, -70, -46, -85, 140, 143, -9, -98, 12, -17, 125, -8, -151, 69, -8, 86, 88, 27, 56, -110, 155, 46, 55, -62, 76, -103, -29, -39, 74, 10, -153, -2, 21, -25, -27, -115]
4400a15K6J06p8K65j90J07J5l02K69r6j46P8K7kj09K38k95pJ63K18lj58L9r1p
4425d8J68k62K04m1O4nj24j69K83l3J19q3n8k3J57k65K65m7j12n0R4L9L2k27O7
4450e5J19l8J21l8k88J32m5k9J67N9j57J38j8j10j04L1J10M7j09K20k57M6l9R1
4474fR9j70O6N9J15k20M0K04j69o4j19J26M3R2r0L5J34Q6l60J66k24L77q3l26
4498a89K67j01J85k33J43o4n3N2O3j45K43Kk09R9j76n5J72J49jj15l8k19K57j0
4522B4R2k64N0j22K31L45j58k87J09j86K12J44l53K21L4Q5m4j4j53k2K1M1k24
$$ y = [-115, -89, 17, -61, 204, 14, 121, 136, -166, 103, 7, -139, -61, -34, -36, -145, 93, -202, -209, -46, 172, 169, 11, 50, -41, -48, 120, -142, 62, 21, 85, 80, -44, -213, 70, 37, 156, 73, 15, -8, 149, -116, 149, 102, -10, -60, 34, 73, 105, -122, -55, 64, 26, 147, 109, -179, -47, -92, -121, 46, 105, -52, 86, 68, -42, -146, -115, -5, 42, -67, 153, -104, -58, -97, -6, 93, -77, -11, 48, 163, -57, -17, 187, 18, -46, -165, -39, 4, 96, 6, 41, 175, 261, -99, 67, -157, 220, 137, -189, 78, -23, 162, -71, 72, 8, -45, 7, 70, -75, 168, 170, -39, 60, -116, -171, 1, 150, 149, 34, -4, -223, 34, 24, 116, -148, -98, -220, 11, 356, 198, -89, 20, -166, 46, 190, -163, 58, 92, 177, 133, 119, -34, -56, -35, 6, -218]
$$ [...]
8191b8
##END NTUPLES=NMR FID
##END=
