##TITLE=1H_45BnP0107
 CDCl3
 8 sc, 
 4.07.2022
##JCAMPDX= 6.0         $$ Bruker NMR JCAMP-DX V2.0
##DATA TYPE= NMR FID
##DATA CLASS= NTUPLES
##ORIGIN= UXNMR, Bruker Analytische Messtechnik GmbH
##OWNER= root
$$ XWIN-NMR		Version 3.5
$$ Mon Jul  4 14:01:28 2022 Russian Standard Time (UT+4h)  she@DPX200
##.OBSERVE FREQUENCY= 200.1313499994
##.OBSERVE NUCLEUS= ^1H
##.DELAY= (6, 6)
##.ACQUISITION MODE= SIMULTANEOUS
##.ACQUISITION SCHEME= undefined
##.AVERAGES= 8
##.DIGITISER RES= 18
##SPECTROMETER/DATA SYSTEM= spect
##.PULSE SEQUENCE= zg30
##.SOLVENT NAME= CDCl3
##.SHIFT REFERENCE= (INTERNAL, CDCl3, 0, 15.7039)
##AUDIT TRAIL= $$ (NUMBER, WHEN, WHO, WHERE, WHAT)
$$ ##TITLE= Audit trail, XWIN-NMR		Version 3.5
$$ ##JCAMPDX= 5.01
$$ ##ORIGIN= Bruker BioSpin GmbH
$$ ##OWNER= she
$$ F:/spectra/data/she/nmr/H-F/1/audita.txt
$$ ##AUDIT TRAIL=  $$ (NUMBER, WHEN, WHO, WHERE, WHAT)
(   1,<2022-07-04 14:00:12.71 +0400>,<she>,<DPX200>,
      <created by zg, POWCHK disabled, PULCHK disabled
       configuration hash MD5:
       00 E9 B6 7A A2 85 ED C7 34 08 36 98 17 FE 4E 26
       data hash MD5: 16K
       8C 57 AD 6A D1 A1 DE 3C FF 97 3F C5 F6 C0 BC C8>)
$$ ##END=
$$ 
$$ hash MD5
$$ 7A 5F 2F 74 40 13 02 F8 AE D4 99 17 16 33 1E 53
##$RELAX= 
##$RELAX= 
##$RELAX= 
##$RELAX= 
##$RELAX= 
##$RELAX= 
$$ Bruker specific parameters
$$ --------------------------
##$DU= <F:/spectra>
##$EXPNO= 1
##$NAME= <H-F>
##$PROCNO= 1
##$TYPE= <nmr>
##$USER= <she>
##$AMP= (0..31)
100 100 100 100 100 100 100 100 100 100 100 100 100 100 100 100 100 100 
100 100 100 100 100 100 100 100 100 100 100 100 100 100 
##$AQSEQ= 0
##$AQ_mod= 1
##$AUNM= <au_zg>
##$AUTOPOS= <>
##$BF1= 200.13
##$BF2= 200.13
##$BF3= 200.13
##$BF4= 200.13
##$BF5= 200.13
##$BF6= 200.13
##$BF7= 200.13
##$BF8= 200.13
##$BYTORDA= 1
##$CFDGTYP= 0
##$CFRGTYP= 5
##$CHEMSTR= <none>
##$CNST= (0..31)
1 1 145 1 1 1 1 1 1 1 1 1 1 1 1 1 1 1 1 1 1 1 1 1 1 1 1 1 1 1 1 1 
##$CPDPRG= <>
##$CPDPRG1= <>
##$CPDPRG2= <>
##$CPDPRG3= <>
##$CPDPRG4= <mlev>
##$CPDPRG5= <mlev>
##$CPDPRG6= <mlev>
##$CPDPRG7= <mlev>
##$CPDPRG8= <mlev>
##$CPDPRGB= <>
##$CPDPRGT= <>
##$D= (0..31)
0 1.2 0 0 0 0 0 0 0 0.06 0 0.03 0 0 0 0 0.0002 0 0 0 0 0 0 0 0 0 0 0 0 
0 0 0 
##$DATE= 1656928812
##$DBL= (0..7)
120 120 120 120 120 120 120 120 
##$DBP= (0..7)
150 150 150 150 150 150 150 150 
##$DBP07= 0
##$DBPNAM0= <>
##$DBPNAM1= <>
##$DBPNAM2= <>
##$DBPNAM3= <>
##$DBPNAM4= <>
##$DBPNAM5= <>
##$DBPNAM6= <>
##$DBPNAM7= <>
##$DBPOAL= (0..7)
0.5 0.5 0.5 0.5 0.5 0.5 0.5 0.5 
##$DBPOFFS= (0..7)
0 0 0 0 0 0 0 0 
##$DE= 6
##$DECBNUC= <off>
##$DECIM= 32
##$DECNUC= <off>
##$DECSTAT= 4
##$DIGMOD= 1
##$DIGTYP= 9
##$DL= (0..7)
0 120 120 120 120 120 120 120 
##$DP= (0..7)
150 150 150 150 150 150 150 150 
##$DP07= 0
##$DPNAME0= <>
##$DPNAME1= <>
##$DPNAME2= <>
##$DPNAME3= <>
##$DPNAME4= <>
##$DPNAME5= <>
##$DPNAME6= <>
##$DPNAME7= <>
##$DPOAL= (0..7)
0.5 0.5 0.5 0.5 0.5 0.5 0.5 0.5 
##$DPOFFS= (0..7)
0 0 0 0 0 0 0 0 
##$DQDMODE= 0
##$DR= 18
##$DS= 0
##$DSLIST= <SSSSSSSSSSSSSSS>
$$ [...]
##$SUBNAM2= <"">
##$SUBNAM3= <"">
##$SUBNAM4= <"">
##$SUBNAM5= <"">
##$SUBNAM6= <"">
##$SUBNAM7= <"">
##$SUBNAM8= <"">
##$SUBNAM9= <"">
##$SW= 18.0517283424941
##$SWIBOX= (0..15)
0 0 2 0 0 0 0 0 0 0 0 0 0 0 0 0 
##$SW_h= 3612.71676300578
##$TD= 16384
##$TD0= 1
##$TE= 0
##$TE2= 300
##$TE3= 300
##$TEG= 300
##$TL= (0..7)
0 120 120 120 120 120 120 120 
##$TP= (0..7)
150 150 150 150 150 150 150 150 
##$TP07= 0
##$TPNAME0= <>
##$TPNAME1= <>
##$TPNAME2= <>
##$TPNAME3= <>
##$TPNAME4= <>
##$TPNAME5= <>
##$TPNAME6= <>
##$TPNAME7= <>
##$TPOAL= (0..7)
0.5 0.5 0.5 0.5 0.5 0.5 0.5 0.5 
##$TPOFFS= (0..7)
0 0 0 0 0 0 0 0 
##$TUNHIN= 0
##$TUNHOUT= 0
##$TUNXOUT= 0
##$USERA1= <user>
##$USERA2= <user>
##$USERA3= <user>
##$USERA4= <user>
##$USERA5= <user>
##$V9= 5
##$VALIST= <valist>
##$VCLIST= <CCCCCCCCCCCCCCC>
##$VD= 0
##$VDLIST= <DDDDDDDDDDDDDDD>
##$VPLIST= <PPPPPPPPPPPPPPP>
##$VTLIST= <TTTTTTTTTTTTTTT>
##$WBST= 1024
##$WBSW= 4
##$XGAIN= (0..3)
0 0 0 0 
##$XL= 0
##$YL= 0
##$YMAX_a= 478967
##$YMIN_a= -495442
##$ZGOPTNS= <>
##$ZL1= 120
##$ZL2= 120
##$ZL3= 120
##$ZL4= 120
##$ABSF1= 10
##$ABSF2= 0
##$ABSG= 5
##$ABSL= 3
##$ALPHA= 0
##$AQORDER= 0
##$ASSFAC= 0
##$ASSFACI= 0
##$ASSFACX= 0
##$ASSWID= 0
##$AUNMP= <proc_1d>
##$AZFE= 0.1
##$AZFW= 0.1
##$BCFW= 1
##$BC_mod= 2
##$BYTORDP= 1
##$COROFFS= 0
##$CY= 11.3945322036743
##$DATMOD= 1
##$DC= 2
##$DFILT= <>
##$DTYPP= 0
##$F1P= 2.36226072786647
##$F2P= -0.459571619588291
##$FCOR= 0.5
##$FTSIZE= 0
##$FT_mod= 4
##$GAMMA= 1
##$GB= 0.15
##$INTBC= 1
##$INTSCL= 1
##$ISEN= 128
##$LB= 0.24
##$LEV0= 0
##$LPBIN= 0
##$MAXI= 10000
##$MC2= 0
##$MEAN= 0
##$ME_mod= 0
##$MI= 1.114404
##$NCOEF= 0
##$NC_proc= 0
##$NLEV= 6
##$NOISF1= 3.799351
##$NOISF2= 2.8
##$NSP= 1
##$NTH_PI= 0
##$NZP= 0
##$OFFSET= 15.70392
##$PC= 1
##$PHC0= -18048.99
##$PHC1= -1.999309
##$PH_mod= 1
##$PKNL= yes
##$PPARMOD= 0
##$PSCAL= 0
##$PSIGN= 0
##$REVERSE= no
##$SF= 200.130013532006
##$SI= 16384
##$SIGF1= 3
##$SIGF2= 2
##$SINO= 400
##$SIOLD= 16384
##$SREGLST= <1H.CDCl3>
##$SSB= 0
##$STSI= 0
##$STSR= 0
##$SW_p= 3612.71676300578
##$SYMM= 0
##$S_DEV= 0
##$TDeff= 0
##$TDoff= 0
##$TI= <>
##$TILT= no
##$TM1= 0
##$TM2= 0
##$TOPLEV= 0
##$USERP1= <user>
##$USERP2= <user>
##$USERP3= <user>
##$USERP4= <user>
##$USERP5= <user>
##$WDW= 1
##$XDIM= 8192
##$YMAX_p= 0
##$YMIN_p= 0
$$ End of Bruker specific parameters
$$ ---------------------------------
##NTUPLES= NMR FID
##VAR_NAME=  TIME,          FID/REAL,        FID/IMAG
##SYMBOL=    X,             R,               I
##VAR_TYPE=  INDEPENDENT,   DEPENDENT,       DEPENDENT
##VAR_FORM=  AFFN,          ASDF,            ASDF
##VAR_DIM=   8192,          8192,            8192
##UNITS=     SECONDS,       ARBITRARY UNITS, ARBITRARY UNITS
##FACTOR=    0.0002768,     1,               1
##FIRST=     0,             0,               0
##LAST=      2.2672688,     0,               0
##MIN=       0,             -495442,         0
##MAX=       2.2672688,     478967,          0
$$ Real data points
##PAGE= N=1
##DATA TABLE= (X++(R..R)), XYDATA
0@%%%%%%%%%%qJ6j6J6k4L2m0M8n6P0q3R9j17J36j60J89k19K53k90L35l86M39m98
$$ 0 0 0 0 0 0 0 0 0 0 0 -8 8 -8 8 -16 16 -24 24 -32 38 -45 54 -63 73 -87 102 -117 136 -154 181 -205 234 -264
33b64N65o41P22q12R12j022J139j269J412j568J739j923K125k349K593k856L146
$$ -264 301 -340 382 -430 482 -540 599 -670 742 -826 913 -1010 1115 -1234 1359 -1497 1649
50A649l465L819m210M642n125N668o283O988p799Q748r884J1260j2966J5158j8094
$$ 1649 -1816 2003 -2207 2435 -2690 2978 -3305 3683 -4116 4632 -5252 6008 -6958 8200 -9894
65i894K2251k8649L9883o5475K35766P9989j33313K62353P6056q4473j25131k4904
$$ -9894 12357 -16292 23591 -41884 193882 273871 140558 402911 478967 394494 269363 244459
77B44459l4258L6119M079j28308k34646m6394J53806N9519k38651k22101N3744
$$ 244459 210201 246320 250399 122091 -112555 -158949 -5143 54376 -184275 -406376 -352632
88c52632J48604l8964j02297l445N1068N3198J14565O7763p5011l5858J91711
$$ -352632 -204028 -242992 -345289 -348734 -297666 -244468 -129903 -62140 -137151 -173009 18702
99A8702K05380l4148j38278K9963J51672P1282l8860m1283j8475k1235k198J3807
$$ 18702 224082 189934 51656 81619 233291 304573 265713 224430 205955 184720 182522 196329
111A96329o5953j39414l8590R2102n855j68437r1432Q6111P2896l5552m0926o656
$$ 196329 130376 -9038 -47628 44474 38619 -129818 -221250 -135139 -62243 -97795 -138721 -145377
123a45377j1973J8422P5360M1118n1637l7655Q0220J03152j9990p4778L1641R4468
$$ -145377 -157350 -138928 -63568 -22450 -74087 -111742 -31522 71630 51640 -23138 8503 102971
135A02971O421n4015n948J0348k4280N071M2557k7570q8995m141Q2532Q841q7569
$$ 102971 109392 55377 49429 59777 35497 40568 83125 55555 -33440 -37581 44951 53792 -33777
148c3777l4809N5221K4404m0308j4565K7841J624r461M1504M0597m0066m3004
$$ -33777 -68586 -13365 11039 -29269 -43834 -15993 -14369 -23830 17674 58271 18205 -24799
160b4799N3945N7823n1430o3829L4290L9674m6684m2428K5533Q160m1143l360
$$ -24799 29146 86969 35539 -28290 6000 45674 -1010 -43438 -17905 -9745 -50888 -54248
172e4248L8659j5278n6328J1752O3479l189n3004J8307O8531J162l7717L1214
$$ -54248 -15589 -30867 -87195 -75443 -11964 -15153 -68157 -49850 18681 19843 -17874 13340
184A3340N5657j8480l1715L8709L4115l9145k4718M3496J4314n5589k0653M3000
$$ 13340 68997 50517 18802 57511 91626 52481 27763 71259 85573 29984 9331 52331
196E2331k802o4935j4937M1975j1417o5567j1718L7116j0581m0961J3824L5475
$$ 52331 49529 -15406 -30343 11632 215 -65352 -77070 -39954 -50535 -91496 -77672 -42197
208d2197j9652k2662M5073M0123l4209k0894O0937M6447l4166k1719M9440L3913
$$ -42197 -61849 -84511 -39438 685 -33524 -54418 6519 52966 18800 -2919 46521 80434
220H0434k6428q849K9963n402l6846J1488L3797l3996o2628J2454M7777k5127
$$ 80434 54006 45157 75120 69718 32872 44360 78157 44161 -18467 -6013 41764 16637
232A6637o2986J136L7052j2621l2864R855R890l0192l615N1000J0882n3932p129
$$ 16637 -46349 -45213 -8161 -20782 -53646 -43791 -33901 -64093 -67708 -16708 -5826 -59758 -66887
245f6887O9509L0458m5300j7186M4834K5087j6012K122J7273j6935j8000L5252
$$ -66887 2622 33080 -12220 -29406 15428 40515 24503 26625 43898 26963 8963 44215
257D4215L0566m5213n1547L3969N1731l2986o1882O405L2565j3080j9684J0691
$$ 44215 74781 29568 -21979 11990 63721 30735 -31147 -24742 7823 -5257 -24941 -14250
269a4250q069k9514J8580M8874j6469o1101Q901P0116J3950n2621j5371M2293
$$ -14250 -22319 -51833 -33253 15621 -848 -61949 -53048 17068 31018 -21603 -36974 5319
281E319J9748j6843K799J1948k0338p942M4909J8623n9062l5312N4320M0050m7652
$$ 5319 25067 8224 11023 22971 2633 -5309 39600 58223 -839 -36151 18169 58219 10567
294A0567m4036K6274K6392j9741j3003J1178j1537k3229K2139L6556k5537m9719
$$ 10567 -33469 -7195 19197 -544 -13547 -2369 -13906 -37135 -14996 21560 -3977 -53696
306e3696K1837O0180q533n2614P253M5643j551k2974J5304J1787k7105k977M1874
$$ -53696 -31859 28321 19788 -32826 -25573 20070 18519 -4455 10849 22636 -4469 -7446 34428
319C4428L740n0211j0430M9423J4345m6863k1944L2460J3208k8177o547K1680
$$ 34428 38168 -12043 -22473 26950 41295 -5568 -27512 4948 18156 -10021 -16568 5112
331E112j0426k6521K1128L1292k9530l7712L3477M2601k7675l6148K5608K9966
$$ 5112 -5314 -31835 -10707 20585 -8945 -46657 -13180 29421 1746 -34402 -8794 21172
343B1172j9787j5099K4203Q489k5935R19L5847j291m2523k130M4215K654m4491
$$ 21172 1385 -13714 10489 18978 -6957 -6038 29809 28518 -14005 -16135 28080 30734 -13757
356a3757l617L6980l848l2794R274K3816k2289k2502K9306K1575l3945k2941L4172
$$ -13757 -17374 19606 15758 -17036 -7762 16054 -6235 -28737 569 22144 -11801 -34742 -570
369e70K3714l0060k0805K8100J8474k3686j0053K6041K847k8717N151L4263j0155
$$ -570 23144 -6916 -27721 379 18853 -4833 -14886 11155 14002 -14715 -9564 24699 14544
382A4544l8158J2950L9297j5110l8037J3362L1143j5245k4379J7344J7457k1584
$$ 14544 -23614 -10664 28633 13523 -24514 -11152 19991 4746 -19633 -2289 15168 -6416
394f416j3260K5999J1169k9743q894L5747J0861l5198q166L6605O493l3976j196
$$ -6416 -19676 6323 17492 -12251 -21145 14602 25463 -9735 -17901 18704 25197 -8779 -9975
407i975L1417m534k8187J0483K3608j9414k5539J9811K1471k5733k4373K3614
$$ -9975 21442 16908 -11279 -796 22812 3398 -22141 -2330 19141 -6592 -30965 -7351
419g351K1020k6064k1167K4163J6866k4071r895K8317P724k6037K821L3116k786
$$ -7351 13669 -12395 -33562 -9399 7467 -16604 -26499 1818 9542 -16495 -13674 19442 16656
432A6656k8576J1103L4557q057k8914J2234K7904j2985k5384J3332J8365k0897
$$ 16656 -11920 -817 33740 25683 -3231 9003 36907 23922 -1462 11870 30235 9338
444I338k0292J8762J0410l0758j6967K6208P789l3876j0698K9665M044k9274K08
$$ 9338 -10954 7808 18218 -12540 -29507 -3299 4490 -29386 -40084 -10419 -6375 -35649 -35441
457c5441K9253j460k2607J3275L0733q070k1253J9795K9746j4106k1006K2564
$$ -35441 -6188 -7648 -30255 -16980 13753 5683 -15570 4225 33971 19865 -1141 21423
469B1423K4102k0007j7909K1471J0628k8244j2655K3035M06l3891p332K5263m114
$$ 21423 45525 25518 7609 29080 39708 11464 -1191 21844 22250 -11641 -18973 6290 2176
482B176l4262k349K5334n633k6611P888K5258r820j8816K0700K4956j6152j4673
$$ 2176 -32086 -34435 -9101 -14734 -41345 -33457 -8199 -18019 -36835 -16135 8821 -7331 -22004
495b2004K8285K3164j9695j2138K7108J4134k3293p960K3926L198k6936l579K1490
$$ -22004 6281 29445 9750 -2388 24720 38854 15561 7601 31527 34725 7789 4210 25700
508B5700q241l1870L333K4834j3765l1563R472K4424j5273k3918J6513J9481j6202
$$ 25700 17459 -14411 -11078 13756 -9 -31572 -22100 2324 -12949 -36867 -20354 -873 -17075
521a7075j1452K4398J5346k0420o381K8998J1062k4906m480L0087N546k8066k446
$$ -17075 -28527 -4129 11217 -9203 -15584 13414 24476 -430 -4910 25177 30723 2657 211
534B11K5139n130k7609M720J9992j5098k4570J3668J8748k0041k1802J8031J8541
$$ 211 25350 20220 -7389 -2669 17323 2225 -22345 -8677 10071 -9970 -31772 -13741 4800
547D800j8020j4112K2622J5301j9141o857K6530Q725k2733J06K9740P03k8226
$$ 4800 -13220 -27332 -4710 10591 -8550 -15407 11123 19848 -2885 -2779 26961 27664 -562
560e62K599K6696p191k7079O400J8914j6089k2834J2579J5118k1866j9987J8715
$$ -562 2037 28733 21542 -5537 863 19777 3688 -19146 -6567 8551 -13315 -33302 -14587
573a4587J6098k1606j5094K4012J4763k1530o507K7913Q385k0622N043K9154k524
$$ -14587 1511 -20095 -35189 -11177 3586 -17944 -24451 3462 11847 -8775 -3732 25422 22898
586B2898k3222J0226K6746r830k5242R831K1955j3977k3973R262J3676k0253j9470
$$ 22898 -324 9902 36648 26818 1576 11407 33362 19385 -4588 4674 18350 -1903 -21373
599b1373J5739R670k5007j2982K3018O913k6529m620K8483N084k3468L171K8680
$$ -21373 -5634 4036 -20971 -33953 -10935 -4022 -30551 -35171 -6688 -1604 -25072 -21901 6779
612F779Q74j9077J0310K4775o750j7615J4899K1488j4861j9573J6310J6392k1998
$$ 6779 7653 -11424 -1114 23661 16911 -704 14195 35683 20822 1249 17559 33951 11953
625A1953j8937J8451J0237k6086j3221J9947K315k6995m132K3660j314k4506L564
$$ 11953 -6984 11467 21704 -4382 -17603 2344 4659 -22336 -26468 -2808 -4122 -28628 -25064
638b5064K4753m576k1052J1110K4976q119j8152J6190K2078j3144j5672J8999
$$ -25064 -311 -4887 -25939 -14829 10147 2028 -16124 66 22144 9000 -6672 12327
650A2327J5976j9284j2366K0344Q804k3279q450K0470P10k5783k545K1900l527
$$ 12327 28303 9019 -3347 16997 25801 2522 -5928 14542 15252 -10531 -13076 8824 5297
663E297k4989K641K1818o695k1715Q879K0864r869j6352J5948J7744j5582j3419
$$ 5297 -19692 -17051 4767 -1928 -23643 -14764 6100 -3769 -20121 -4173 13571 -2011 -15430
676a5430K1223J4367j9889r726K2867Q380k2491n896K1213J306k2641k70K0232
$$ -15430 5793 20160 271 -9455 13412 21792 -699 -6595 14618 15924 -6717 -6987 13245
689A3245n409k2832N208K0310j0041k1373J1109J9144j2949j7209J5980J6408
$$ 13245 7836 -14996 -9788 10522 481 -20892 -9783 9361 -3588 -20797 -4817 11591
701A1591j6103j1848J9475J1225j8243o074K2287N539k1240k918K1315o6k1196
$$ 11591 -4512 -16360 3115 14340 -3903 -9977 12310 17849 -3391 -6309 15006 14940 -6256
714f256K258J9954o205k1413O126J8398j0703j9315J0835J6270j4158j5235J5698
$$ -6256 -3998 15956 9751 -11662 -5536 12862 2159 -17156 -6321 9949 -4209 -19444 -3746
727c746J2892j7531j0007J9897R348j8994n183K2041M217k0022l51K1359j252
$$ -3746 9146 -8385 -18392 1505 10853 -8141 -13324 8717 12934 -7088 -7439 13920 12668
740A2668j9669M513J9702o885j9382Q195J7355j1995j7626J2540J4825j5089j4317
$$ 12668 -7001 -2488 17214 10329 -9053 -858 16497 4502 -13124 -584 14241 -848 -15165
753a5165J4819J0336j7911q718J9062O218j9902l453K0872K081j9892N23K0462
$$ -15165 -346 9990 -7921 -16639 2423 8641 -11261 -14714 6158 8239 -11653 -11130 9332
766I332j477j7851N125J7970p028j6352J0073J6308j2281j5419J4026J4217j5790
$$ 9332 7855 -9996 -4871 13099 6071 -10281 -208 16100 3819 -11600 2426 16643 853
779H53j2998J6012R643j7655p775J7960M244j9099j721J8824j377j9613L204J9291
$$ 853 -12145 3867 13510 -4145 -11920 6040 10284 -8815 -10536 8288 6911 -12702 -9498 9793
793I793m387j8540O661J8206q656j6950J0701J5846j2327j3273J5241J1603j6688
$$ 9793 5406 -13134 -6473 11733 3077 -13873 -3172 12674 347 -12926 2315 13918 -2770
806b770r556J8115P082j8472m328J8887K188j9121l32J8931j878j8898L226J7936
$$ -2770 -12326 5789 12871 -5601 -9929 8958 11146 -7975 -8307 10624 8746 -10152 -6926 11010
820A1010n266j7006P327J5681j0539j5092J2786J3780j4975j1938J6556J0006
$$ 11010 5744 -11262 -3935 11746 1207 -13885 -1099 12681 -2294 -14232 2324 12330
832A2330j7239p772J7632N448j7433k509J7857P70j7848J481J7751l445j7893
$$ 12330 -4909 -12681 4951 10399 -7034 -9543 8314 9084 -8764 -7283 10468 7023 -10870
845a0870O037J8176q055j7738R769J5960j1967j4447J4095J1910j5631r574J6569
$$ -10870 -4833 13343 5288 -12450 -2681 13279 1312 -13135 960 12870 -2761 -12335 4234
858D234P152j7494n111J7542L416j7626j341J8083k53j8363J935J8157m172j7828
$$ 4234 11386 -6108 -11219 6323 9739 -7887 -9228 8855 8602 -9761 -7826 10331 6159 -11669
872a1669O830J7286q943j6022J1104J3560j3334j1498J4888R925j5877q117J6545
$$ -11669 -4839 12447 3504 -12518 -1414 12146 -1188 -12686 2202 12127 -3750 -11867 4678
885D678O777j6759n065J7143L670j7238j544J7885r07j8118L383J7812o415j7024
$$ 4678 11455 -5304 -10369 6774 10444 -6794 -8338 9547 8640 -9478 -6095 11717 5302 -11722
899a1722Q654J5620j1262j5095J2360J2803j3650j1312J4234R527j4727p271J5454
$$ -11722 -3068 12552 1290 -13805 -1445 11358 -2292 -13604 630 10157 -4570 -11841 3613
912C613N768j6376l333J8231K257j7525P14J8514k958j8042N537J7448p138j6408
$$ 3613 9381 -6995 -10328 7903 10160 -7365 -6651 11863 8905 -9137 -3600 13848 6710 -9698
926i698Q962J3802j1105j3220J1048J0611j3407j0046J3715P939j5693o876J6221
$$ -9698 -736 13066 1961 -11259 -211 10400 -3007 -13053 662 8601 -7092 -13968 2253
939B253M893j6890k469J8070J408j6779K255J7664l396j5349O689J5620p582j3395
$$ 2253 7146 -9744 -12213 5857 7265 -9514 -7259 10405 7009 -8340 -1651 13969 6387 -7008
953g008R922J2549j1950j2122J2274R931j4385r852J3707O465j6191o012J5341
$$ -7008 2914 15463 3513 -8609 3665 13596 -789 -10641 3066 9531 -6660 -12672 2669
966B669K013j6535o88J6813j354j6317L994J6791m745j4370Q182J5534p657j2511
$$ 2669 4682 -11853 -12541 4272 2918 -13399 -9405 7386 2641 -11729 -3547 11987 4330 -8181
980h181J0709J2346j1102r872J2688Q819j4057p443J4157M255j6317m983J4803
$$ -8181 2528 14874 3772 -6100 6588 15407 1350 -6093 8064 12319 -3998 -8981 5822
993E822O59j6540k23J5097l139j5976M327J4916o112j3624Q691J3989q361j0610
$$ 5822 6481 -10059 -10282 4815 1676 -14300 -9973 4943 -1169 -14793 -6102 7887 -474 -11084
1007a1084J1173J1023j0719p642J4046P449j3761n332J5248L528j6174k864J5406
$$ -11084 89 11112 393 -7249 6797 14246 485 -4847 10401 13929 -2245 -5109 10297
1020A0297m53j6430Q88J3732m796j5128N067J2220q037j2411R808J1713j0625
$$ 10297 9844 -6586 -5698 8034 3238 -11890 -6823 5397 -2640 -15051 -5243 6470 -4155
1033d155j0402J2033J0493j1094p079J3662P099j2635k897J4673K117j4912M37
$$ -4155 -14557 -2524 7969 -3125 -10204 3458 10557 -2078 -4975 9698 11815 -3097 -2660
1046b660J5392k044j5587K895J3761n942j4813N585J1558q654j1769Q604R382
$$ -2660 12732 10688 -4899 -2004 11757 5815 -8998 -3413 8145 -509 -12278 -3674 5708
1059E708j1160q857J2189P512j2673n369J4753N427j3478k170J5275J697j3686
$$ 5708 -5452 -14309 -2120 5392 -7281 -12650 2103 7530 -5948 -8118 7157 8854 -4832
1072d832K060J4989k859j3944M996J3235p122j3047P230J0542r955j0680R657
$$ -4832 -2772 12217 9358 -4586 410 13645 6523 -6524 706 11248 1293 -9387 270
1085B70P705j2549q197J2072N820j3534m331J3929L187j4103m81J5235J08j3483
$$ 270 7975 -4574 -12771 -699 5121 -8413 -12744 1185 4372 -9731 -10212 5023 5131 -8352
1099h352L705J4772l917j2157O528J2444p671j0883Q991J0142j0448r835J0067
$$ -8352 -4647 10125 6208 -5949 579 13023 5352 -5531 3460 13602 3154 -6681 3386
1112C386P465j2603p802J1726M522j3984l426J3608M42j4701J167J4849k661j3501
$$ 3386 10851 -1752 -9554 2172 6694 -7290 -10716 2892 3334 -11367 -10200 4649 1988 -11513
1126a1513N107J4048m877j1632P473J2085p380r840R678R789j0690q139J1913
$$ -11513 -6406 7642 2765 -8867 -1394 10691 3311 -6529 3149 12938 2248 -5891 6022
1139F022O282j3860n754J3482L167j5183k421J3439q69j4401J747J3214l613j2693
$$ 6022 12304 -1556 -7310 6172 9339 -5844 -8265 5174 4305 -10096 -8349 4865 1252 -11441
1153a1441N134J2466n638j1057P656J1630q159r231J0814R544j1452p223J2977
$$ -11441 -6307 6159 521 -10536 -2880 8750 591 -8640 2174 11718 266 -6957 6020
1166F020N812j3475m248J3197J929j4028q63J2635j862j3632K272J2473m545j3001
$$ 6020 11832 -1643 -5891 7306 9235 -4793 -5656 6979 5117 -8515 -6243 6230 1685 -11316
1180a1316N926J2183p109j1761R022J1235r088q641J1370Q070j1434n567J2937
$$ -11316 -5390 6793 -316 -12077 -3055 8180 -908 -9549 1821 9891 -1543 -7110 5827
1193E827M312j3394j938J3703N38j3795k2J2457j991j3121K733J1657m775j2135
$$ 5827 10139 -3255 -5193 8510 9048 -4747 -4769 7688 5697 -7424 -4691 6966 2191 -9944
1207i944N898J1021p873j0394R214R493j0098p251J1797O462j1390m283J2445
$$ -9944 -4046 6975 -898 -11292 -2078 7415 -2683 -9934 1863 8325 -3065 -7348 5097
1220E097L675j2061j536J2415N09j2682R55J1935k648j2560L411J1517n673j1481
$$ 5097 8772 -3289 -4825 7590 8099 -4583 -3628 8307 5659 -6901 -3490 8027 2354 -9127
1234i127O780R628r063r074J0149P987j0458o562J1336N327j0705l452J1740K579
$$ -9127 -2347 7281 -1782 -10856 -707 7280 -3178 -9740 1596 6923 -3782 -7234 4506 7085
1248G085j1435l25J2346n97j2464K148J2162l878j2020M826J1122o827j0523P179
$$ 7085 -4350 -4675 7671 7074 -5390 -3242 8920 5042 -6978 -2152 8970 2143 -8380 -1201
1262a201Q511q871p454R442O063j0201m869J1052L886j1490k544J2214J823j1439
$$ -1201 7310 -1561 -9015 427 6490 -3711 -8580 2472 6358 -5132 -7676 4538 6361 -5078
1276e078J42J1873j243j1649L320J0947m786j0329N867R326p360q929Q006P553
$$ -5078 -4936 6937 5694 -5955 -2635 8312 3526 -6803 -936 8390 1030 -7899 107 7660
1290G660r138o934R895N637j0784m209J0821K937j1031j238J1653Lj1367J968
$$ 7660 -1478 -8412 1483 7120 -3664 -7873 2948 5885 -5146 -6384 5269 5272 -6095 -4127
1304d127J1454l367j0850M368J0534n337r680O659Q562p991p969Q563O701r428
$$ -4127 7327 3960 -6890 -2522 8012 2675 -7005 -346 8216 225 -7744 819 7520 -1908
1318a908n818J0193M115j0719k686J0794J330j1099L95J1337j202j0900K557J0545
$$ -1908 -7726 2467 6582 -4137 -6823 3971 5301 -5798 -5403 5934 4732 -6168 -3611 6934
1332F934l652r955M865R396o101q604P081P612q327o755Q963N414r987m074J0461
$$ 6934 3282 -6673 -1808 7588 1487 -7117 -36 7576 -751 -7506 1457 6871 -3116 -7190 3271
1347C271L022j0894j951J0947O66j0422J180J0583k098j0261L300R977m639r574
$$ 3271 6293 -4601 -6552 4395 5061 -5361 -4181 6402 4304 -5957 -2657 7320 2681 -6893
1361f893O225Q593p355p903Q028O620r324n814R620M334r806l370J0087J980j0167
$$ -6893 -668 7925 570 -7333 695 7315 -2009 -7823 1797 6131 -3675 -7045 3042 5022 -5145
1376e145n78J0826p17j0356J896J1128k988j0301M338R824n397r095O786P887
$$ -5145 -5723 5103 4386 -5970 -4074 7054 4066 -6235 -1897 7927 2530 -6565 221 8108
1390H108p601p023Q039N321r242m711R569L430j0204k737J0229J520j0784m8J0863
$$ 8108 507 -6516 1523 6844 -2398 -7109 2460 5890 -4314 -7051 3178 4698 -6086 -6134 4729
1405D729r26j0319K870J0311m162r284N884R144o655p952P310P232q143o064Q605
$$ 4729 3803 -6516 -3646 6665 2503 -6781 -897 8247 1592 -6360 950 8182 39 -6025 2580
1420B580M733r494m155R668K844j0580k087J0396J31j0571R51J0471k258r802
$$ 2580 7313 -2181 -6336 3332 6176 -4404 -6491 3905 4036 -6535 -5584 4887 2629 -7173
1434g173L831R793m868q667O075Q382o461p150P688O764q083n968Q854M373r444
$$ -7173 -3342 6451 1583 -7084 -1009 7373 912 -6238 1450 8214 131 -5837 3017 7390 -2054
1449b054l536R622J999j0485r83J0045p16j0683J931R981k910r616M228R091n238
$$ -2054 -5590 4032 6031 -4454 -5437 4608 3892 -6791 -4860 5121 2211 -7405 -3177 5914 676
1464F76q071O308P961o798o660Q309N979q514m773R065L793r747k254R775J061
$$ 676 -7395 -1087 6874 76 -6584 1725 7704 -810 -5583 3482 7275 -2472 -4726 5049 6110
1479F110j0237n85R734j351r922K113R273l900q766M571Q262n588p452O932O776
$$ 6110 -4127 -4712 5022 3671 -6251 -4138 5135 1235 -7531 -2960 5302 -286 -7738 -806 5970
1494E970o960n682Q305N181q409l715R099L157q954j564R301J45r663P16R145
$$ 5970 -990 -6672 1633 6814 -1595 -5310 3789 6946 -2008 -3572 5729 5874 -3789 -3073 6072
1509F072k229r520K853Q580m391q565M698P353n976o914O938O170p470m979Q453
$$ 6072 3843 -5677 -2824 5756 1365 -7200 -2502 4851 -1125 -8039 -1101 5069 -2401 -7380 1073
1524A073M327q441k483R387J997q771k50R146k56r306J691Q964k675q691L278
$$ 1073 5400 -3041 -5524 3863 5860 -2911 -3161 5985 5729 -3577 -1886 7078 4403 -4288 -1010
1539a010P784n167p650N020O396o642o125P021M786p852m130Q324L099q506j861
$$ -1010 6774 1607 -6043 -1023 5373 -1269 -7394 -373 4413 -3439 -7569 755 3854 -4652 -6513
1554f513R240J391q361K20Q999n43q402K443Q674l203q034M484P467n594p074
$$ -6513 2727 4118 -4243 -4023 4976 4433 -3969 -1526 7148 3945 -4089 395 7862 2268 -4806
1569d806N659O019p362n518P141L887q195l569P906K067q374j064Q664K85q676
$$ -4806 853 6872 -490 -6008 1133 5020 -3175 -6744 1162 3229 -5145 -6209 2455 2740 -5936
1584e936J160R074j650q324L433Q587l597p087M909O837n676n957O252N220p185
$$ -5936 -4776 4298 2648 -5676 -2243 6344 2747 -4340 569 7406 1730 -4227 2025 7245 60
1599F0m492P198L143q425l035Q184J255q848q40Q600n60q678J620Q405k398p561
$$ 60 -4432 2766 5909 -2516 -5551 2633 3888 -4960 -5800 2800 2240 -6438 -4818 3587 1189 -6372
1615f372L976P645m279o324N656O253n856n136O983M693p284l821P586K527q456
$$ -6372 -2396 5249 970 -5354 302 6555 699 -4437 2546 7239 -45 -3866 3720 6247 -2209
1630b209j966P970M43q691K65Q136j935q394K689P521l649p267M724P005n074
$$ -2209 -4175 3795 4238 -4453 -4188 3948 2013 -6381 -3692 3829 180 -7087 -2363 4642 -432
1645d32n712N940N650o097m291P348L914p354k816Q241J680q409q66Q166n06q457
$$ -432 -6144 -204 5446 -651 -4942 2406 6320 -1034 -3850 4391 6071 -2338 -3204 4962 4456 -4001
1661d001J208P721k628p805K686P113m075o558M574O212n435n548O194N176o676
$$ -4001 -2793 4928 2300 -5505 -2819 4294 219 -6339 -1765 4447 -988 -6536 -342 4834 -1842
1676a842l882P736L282p513j849Q149R44p984J3Q119r86p898J642P395k914p456
$$ -1842 -5724 2012 5294 -2219 -4068 4081 5025 -2959 -2946 5173 4187 -3711 -2069 5326 2412 -5044
1692e044L421O737m393o581N044N812o194m996O617M334p193l172P705K394p801
$$ -5044 -1623 5114 721 -5860 -816 4996 -1198 -6194 423 4757 -2436 -5608 2097 4491 -3310
1707c310j109P857O03p685O11P624j399p357K409P301l416p078L958O542m883
$$ -3310 -4419 3438 4041 -3644 -3033 4591 3192 -4165 -1756 5545 2129 -4949 -991 5551 668
1722F68n952N555N156o513m342O620L652p193k594P440J604p529q29P641l9p607
$$ 668 -5284 271 5427 -1086 -5428 1192 4844 -2349 -4943 2497 4101 -3428 -4257 3384 3345 -4262
1738d262J172P637j807p433K850O954l923o452M836N916n293n511O119M444o473
$$ -4262 -3090 4547 2740 -4693 -1843 5111 1188 -5264 -428 5488 195 -5316 803 5247 -1226
1753a226l605O876K745p215j943P399J059p568k65P520q10p430J603P103k376
$$ -1226 -4831 2045 4790 -2425 -4368 3031 4090 -3478 -3743 3777 2967 -4463 -2860 4243 1867
1768A867p084L520O395l987o017M947N332n369m735O133M138o659k897O830K370
$$ 1867 -5217 -1697 4698 711 -5306 -359 4973 -396 -5131 1002 5140 -1519 -4416 2414 4784
1783D784o899j457P174M95p507M64P412j491p416K236O899l194o704L496O097
$$ 4784 -2115 -3572 3602 4097 -3410 -2946 4466 2975 -4441 -2205 4694 1500 -5204 -1708 4389
1798D389m426n457N138M696n876l656O354L199o594k275P070J865p043n84P252
$$ 4389 -37 -5494 -356 4340 -1536 -5192 1162 4361 -2233 -4508 2562 4427 -2616 -3200 4052
1813D052j39p078J075O891j995o487K722O066l843o192M357N343m969n003N108
$$ 4052 3913 -3165 -2090 4801 2806 -3681 -959 5107 1264 -4928 -571 4772 -197 -5200 -92
1828i2M259n972l539O458K593o724j600O993J161o796p1O919n42o433J448O815
$$ -92 4167 -1805 -5344 1114 3707 -3017 -4617 2376 3537 -3259 -3330 3589 3047 -3386 -1938 4877
1844D877k245o344K935O071l901n767M454M883n201m315N452L355o334k613O272
$$ 4877 2632 -3712 -777 5294 1393 -4374 80 4963 -238 -4553 899 4254 -2080 -4693 1579
1859A579J997o698j115O900K56o679M20O926j277o399K190O444k817n754L560
$$ 1579 3576 -3122 -4237 2663 2919 -3760 -3340 3586 2309 -4090 -1900 4544 1727 -4027 -467
1874d67N471m339m911M941M092n520l478N694K749o150k268O184J457o606o59
$$ -467 5004 665 -4246 695 4787 -733 -4211 1483 4232 -1918 -4186 1998 3455 -3151 -3810
1889c810O439R6o535R72O577j698o137K699O044l481n424M240M975m581m377N088
$$ -3810 2629 2725 -3810 -2838 3739 2041 -4096 -1397 4647 1166 -4258 -18 4957 376 -4001 1087
1905A087L638n469l093N649K048o295j593O257Q62o613L3O412r09o235J731O264
$$ 1087 4725 -744 -3837 1812 3860 -2435 -4028 2229 3091 -3522 -3489 2923 2014 -4221 -2490 3774
1921C774k444n708L377N533l803m695M504M200m829l561N277L038n839k348N843
$$ 3774 1330 -4378 -1001 4532 729 -3966 538 4738 -91 -3652 1625 4663 -1176 -3524 2319
1936B319J708o434q51O000q3o309O24O305j692o184K256N661k745n174L820M888
$$ 2319 4027 -2407 -3258 2742 2659 -3650 -3026 3279 1587 -4597 -2341 3320 575 -4599 -779 4109
1952D109m346m157M791M010n163k787N460K484n709j764O031Q46o326j13O374
$$ 4109 -237 -4394 397 4407 -756 -3543 1917 4401 -1308 -3072 2959 3805 -2521 -2634 3740
1967C740r39o268J292N966k372n784K917N120l560m981M211M467m627l567N002
$$ 3740 2801 -3467 -2175 3791 1419 -4365 -1448 3672 112 -4869 -658 3809 -818 -4385 617
1982F17L156n289k185N822J830n928j083O026N35o081K83O035j089o100J839N678
$$ 617 3773 -1516 -3701 2121 3951 -1977 -3060 2966 3501 -2580 -2297 3738 2649 -3451 -1612 4066
1998D066k837n510L014N034l773m389M091L802m621l253N094K976n412j998N832
$$ 4066 1229 -4281 -1267 3767 -6 -4395 -304 3498 -1123 -4376 718 3694 -1718 -3716 2116
2013B116J497n856n39O315p1o310R12O176j769n781K140N156k993n128L494M540
$$ 2116 3613 -2243 -2782 3533 3462 -2848 -1936 4240 2471 -3310 -1170 3986 993 -4135 -641 3899
2029C899m542m096M388L747n208k937N542K399n487j594O131J138o041j0O140
$$ 3899 -643 -4739 -351 3396 -1812 -4749 793 3192 -2295 -3889 2242 3380 -2661 -2671 3469
2044C469m96n673J510N551k043n303K667M860l193m956L531M183m343l986M500
$$ 3469 2973 -2700 -1190 4361 2318 -2985 -318 4542 1349 -3607 -76 4107 -236 -4222 278
2059B78L023n138k664N302J823n620j052N765M57n648O54N856q85n468J992N704
$$ 278 3301 -1837 -4501 801 2624 -2996 -4048 1717 2174 -3474 -2820 3036 2151 -3317 -1325 4379
2075D379k410m789K874M695l332m463M156L612m760l360M862K197n456k006N292
$$ 4379 1969 -2820 54 4749 1417 -3046 1110 4722 -38 -3398 1464 3661 -1795 -3801 1491
2090A491J025n708p04N679j80n475P26N680j258n107K213N121k631m473L617M461
$$ 1491 2516 -3192 -3896 1783 1603 -3872 -3146 2534 1276 -3831 -1618 3503 872 -3601 16 4477
2106D477l688l923M239L668m874k854M913J932n336j451N210N58n627l97N286
$$ 4477 789 -3134 1105 4773 -101 -2955 1958 3890 -1446 -2897 2313 2871 -2756 -3153 2133
2121B133m94n256R25N368j815n015K433M979l094m148L842L987l722l434M519
$$ 2133 1639 -3617 -2692 2676 861 -4154 -1721 3258 164 -3984 -142 3845 123 -3311 1208
2136A208K895m710k063N036J468n276j019N292K50n547K17N075j311n057J712
$$ 1208 4103 -607 -2670 2366 3834 -1442 -2461 2831 3081 -2466 -2249 2826 1515 -3542 -1830
2151a830M697k171m658K724M174l233l782L970L491m176k586M399K458m659j615
$$ -1830 2867 696 -3962 -1238 2936 -297 -4079 -109 3382 -794 -3380 1019 3477 -1182 -2797
2166b797M839J197m855o32N191l05n096N80N025j405m749J933M529k926m255L043
$$ -2797 2042 3239 -1616 -2248 2943 2638 -2458 -1878 3147 1742 -3007 -1074 3455 529 -3726 -683
2182f83M031l746l422L967K923m260k196M711J688m941r73N077M02m885Q0N104
$$ -683 3348 -398 -3820 147 3070 -1190 -3386 1325 3013 -1928 -2901 2176 2578 -2307 -2227 2877
2198B877q14m965J470M844k053m481K534M007k998l852L383L524m073k699M353
$$ 2877 2063 -2902 -1432 3412 1359 -3122 -588 3419 421 -3431 -48 3476 -597 -3296 1057
2213A057K133m599j649M690J354m938o53M967j03m860N36M701j168m700J742M653
$$ 1057 3190 -1409 -3058 1632 2986 -1952 -2605 2362 2259 -2601 -2065 2636 1468 -3232 -1490 3163
2229C163k258m301K775L949l333l511L954K972m155k466M618J903m764j311M920
$$ 3163 905 -3396 -621 3328 -5 -3516 438 3410 -745 -3211 1407 3310 -1454 -2765 2155
2244B155P04n099K5M906n42m841R48M785j864m462K300M211k834l925L155L441
$$ 2155 2859 -2240 -2215 2691 2149 -2692 -1744 3041 1177 -3285 -985 3226 392 -3533 -378 3063
2260C063l634l031M126K329m009k025M661J453m841o53M785L90m764L04M731q88
$$ 3063 -571 -3602 524 2853 -1156 -3181 1480 2933 -1908 -2561 2224 2614 -2150 -1846 2885 1997
2276A997m676J266M584j975m135K208M064l046l796L387L042l696k625M186K073
$$ 1997 -2679 -1413 3171 1196 -2939 -731 3333 287 -3509 -122 2920 -776 -3401 785 2858
2291B858m431j618M566J175m564m77M835q4m722O99M690j185m454J680M462k443
$$ 2858 -1573 -3191 1375 2550 -2014 -2491 2344 2260 -2462 -1763 2927 1742 -2712 -1032 3430 987
2307I87l795K672L494l202l444L781K655m059k209M051J849m395j275M406O26
$$ 987 -2808 -136 3358 156 -3288 493 3148 -911 -3120 931 2780 -1615 -2890 1516 2142
2322B142m538j80M784l79m484J009M327j418m195K164M058k490l722L002L283
$$ 2142 -2396 -2576 2208 1829 -2655 -1646 2681 1263 -2932 -768 3290 800 -2922 80 3363
2337C363l313k912L738K184l920j982M092J522m418r85M413L16m418J0M641p71
$$ 3363 50 -2862 876 3060 -860 -2842 1250 2772 -1646 -2631 1782 2098 -2320 -2310 2331 1560
2353A560m406J244M145j476m085K224L860k685l354L393K768l472k588L845K082
$$ 1560 -2846 -1602 2543 1067 -3018 -794 3066 381 -2973 420 3188 -284 -2872 973 3055
2368C055l936j602M112J083m363p07M568k18m351N32M228j005m205J530M185k423
$$ 3055 -881 -2483 1629 2712 -1651 -2358 2210 1992 -2359 -1827 2401 1396 -2809 -1279 2906 483
2384D83l612K660L307k738l208L404K580l560j980L551J940l910j435M288P94
$$ 483 -3129 -469 2838 100 -3108 296 2876 -684 -2664 887 2827 -1083 -2518 1770 2564
2399B564m485j53M499o14m026Q40L980j552l803J990L586k502l187K724K922l121
$$ 2564 -1921 -2074 2425 1811 -2215 -1375 2605 1053 -2750 -760 2826 324 -2863 -139 2783 -338
2415c38k579L409K093l657j718L976J308m017q30M302L5m097M72M041o74m140
$$ -338 -2917 492 2585 -1072 -2790 1186 2494 -1523 -2353 1949 1984 -2113 -1641 2400 1726 -2414
2431b414J196M020j760l823K322L188k470k987K951K620l223k490L664J879l710
$$ -2414 -1218 2802 1042 -2781 -459 2729 259 -2728 223 2843 -380 -2870 794 2673 -1037
2446a037j514L790J082m162l23M045j49l960L87L987q01l846J420L731j965l438
$$ -1037 -2551 1239 2321 -1841 -2164 1881 1732 -2228 -1841 2146 1345 -2501 -1081 2650 685 -2753
2462b753K437K973k729k732L093K309l290j801L549J490l879r15M153M01m145
$$ -2753 -316 2657 -72 -2804 289 2598 -692 -2493 1056 2546 -1333 -2248 1905 2306 -1839
2477a839J70L746m36l854R91L643j525l566J941L321k513k891K519K811l064k309
$$ -1839 -1669 2077 1641 -2213 -1222 2421 896 -2670 -729 2592 79 -2812 -293 2518 -546 -2855
2493b855L325K154l725j226L655J047l759p04M036L3l666K49L886p79l981J288
$$ -2855 470 2624 -1101 -2327 1328 2375 -1384 -2088 1948 1981 -1685 -1436 2450 1671 -2310 -1022
2509a022L677j751l547K132K995k379k858K650K571l312k104L554J593l523j146
$$ -1022 2655 904 -2643 -511 2484 105 -2753 -103 2468 -844 -2948 606 2199 -1324 -2470
2524b470L689P30l660k53L930k05l780P59L784j093l667J564L523j983l309K325
$$ -2470 1219 1949 -1711 -1964 1966 1761 -2019 -1260 2524 1431 -2236 -672 2851 868 -2441 -116
2540a16K890k828k521K962K119l273j866L364J292l714q45L864L48l751K00L838
$$ -116 2774 -54 -2575 387 2506 -767 -2633 731 2023 -1691 -2536 1328 1676 -2075 -1875 1963
2556A963n10l680J110L661j382l332J727L239k123k946K564K569k853k217K961
$$ 1963 1453 -2227 -1117 2544 1162 -2170 -443 2796 673 -2273 291 2860 7 -2210 751
2571G51J713l251j773L542J153l790n95L728O7l822M27L797r12l369J206L452
$$ 751 2464 -787 -2560 982 2135 -1655 -2250 1478 1545 -2277 -1850 1947 1035 -2334 -1128 2324
2587B324j663k911K027K851k293k547K623K572l100k056L232J423l538r03L248
$$ 2324 661 -2250 -223 2628 335 -2212 411 2983 -117 -2173 1059 2482 -1056 -1959 1289
2602A289O94l534l18L610l69l600O59L408j027l234J318L265j816k922K225K765
$$ 1289 1983 -1551 -1869 1741 1372 -2228 -1569 1839 812 -2422 -1104 2161 345 -2577 -352 2413
2618B413k497k305K929J938k962j500L153J388l561r43L534L85l450j50L502n06
$$ 2413 -84 -2389 540 2478 -484 -1984 1169 2557 -1004 -1947 1587 1972 -1478 -1628 1874 1368
2634A368l422R20L336j333l321J650L009k135k534K248K414k782j819L021J573
$$ 1368 -2054 -1134 2202 869 -2452 -802 2207 72 -2462 -214 2200 -582 -2401 620 2193
2649B193l076j273L398Q89l411m67L598m8l413L49L279p08l417J147L044j486
$$ 2193 -883 -2156 1242 2131 -1280 -1747 1851 1803 -1610 -1261 2018 1310 -2107 -960 2084 598
2665E98k920K031K488k205k577K605K127k747j755K884J508l218r94L320O54l272
$$ 598 -2322 -291 2197 -8 -2585 20 2147 -600 -2355 529 2037 -1181 -2175 1145 1799 -1473
2681a473k81L499j68l437P11L311j021l189J409L042j845k835J926K786k436k126
$$ -1473 -1754 1745 1577 -1860 -1149 2162 1141 -2048 -639 2403 558 -2277 -351 2435 -1 -2127
2697b127K302J960k861j398K923J201l315p10L374L54l526J37L342m67l193Q60
$$ -2127 175 2135 -726 -2124 799 2000 -1315 -2025 1349 1703 -1823 -1686 1656 1189 -2004 -1144
2713a144L136j298k971J688K808j792k550K264K251k546j945K656J892k938j563
$$ -1144 1992 694 -2277 -589 2219 427 -2123 141 2392 -154 -2099 557 2449 -489 -2052
2728b052L204R16l211n93L356j6l479L85L262o71l152Q97K927j337k689J737K445
$$ -2052 1152 2068 -1143 -1736 1620 1604 -1875 -1490 1772 1101 -2051 -1154 1773 436 -2253 -516 1929
2745A929k007k329K548J988k553j501K712J326k883j027L125N89l177j47L343
$$ 1929 -78 -2407 141 2129 -424 -1925 787 2113 -770 -1797 1328 1917 -1260 -1407 1936
2760A936n33k886M35L001j058k935J269K588j685k471J831K455k258k004K486
$$ 1936 1403 -1483 -1048 1953 895 -2040 -771 1817 132 -2339 -508 1947 -311 -2315 171
2775A71J615k685j261K987R95k971n45L115K37l016K79K976n31k864P92K797j185
$$ 171 1786 -899 -2160 827 1822 -1149 -1694 1421 1658 -1358 -1079 1897 1366 -1498 -706 2091 906
2792I06k758J412K579j970k445K260J992k400j834K614J431k934j056K927O87
$$ 906 -1852 -440 2139 169 -2276 -16 1976 -424 -2258 356 1787 -1147 -2203 724 1411
2807A411k894l5L006j36l035N35K893p28k832J303K625j453k626J857K417k122
$$ 1411 -1483 -1518 1488 1352 -1683 -1148 1745 1017 -1815 -512 2113 660 -1966 -109 2308 186
2823A86j995K226J680k623j384K707R71k768q03K885M11k997j78K972k32k845
$$ 186 -1809 417 2097 -526 -1910 797 1768 -1000 -1803 1082 1493 -1504 -1682 1290 1058 -1787
2839a787N95K863r43k806J434K634j718k241K081J915j961j851K402J583k641
$$ -1787 -1192 1671 728 -2078 -644 1990 272 -1969 112 2027 66 -1785 617 2200 -441
2854d41j227K754P32k869p14L063K87l104J94K888o45k774Q10K765j235k640J745
$$ -441 -1668 1086 1818 -1051 -1765 1298 1585 -1519 -1325 1563 918 -1856 -1046 1719 484 -2156 -411
2871d11K097j739j948K054J879k237j604K376J429k516j093K759P04k923j06K835
$$ -411 1686 -53 -2001 53 1932 -305 -1909 467 1896 -620 -1713 1046 1750 -1173 -1279 1556
2887A556j53k837M33K696q04k628J212K341j460k255J599K177k039j802K056J684
$$ 1556 1403 -1434 -1001 1695 891 -1737 -525 1816 356 -1899 -300 1877 -162 -1964 92 1776
2903A776k283j487K785J015k838o26K677M42k693j19K965m79k710O62K765j073
$$ 1776 -507 -1994 791 1806 -1032 -1658 1019 1461 -1232 -1351 1614 1135 -1575 -913 1852 779
2919G79k551J563K169j530k207J739K091k226j764K377J309k478j213K824O14
$$ 779 -1772 -209 1960 430 -1777 -38 2053 -173 -1937 440 1749 -729 -1942 882 1496
2934A496k604m47K668J6k696K83K780m58k704R07K464j025k394J358K231j619
$$ 1496 -1108 -1555 1113 1129 -1567 -1284 1496 1038 -1666 -759 1705 680 -1714 -356 1875 256
2950B56k046J977J814k212j489K430J007k327j096K503O27k638l62K678J56k655
$$ 256 -1790 187 2001 -211 -1700 730 1737 -590 -1686 817 1444 -1194 -1556 1122 1278 -1377
2966a377L23K529o99k482Q62K454j188k299J565K021j629j862K034J549k182j147
$$ -1377 -1054 1475 776 -1706 -844 1610 422 -1877 -312 1709 80 -1782 252 1801 -381 -1528
2982a528K277R52k505p30K853K21k641j07K739m89k544O75K440r40k362J046K260
$$ -1528 749 1701 -804 -1534 1319 1540 -1101 -1208 1531 1042 -1502 -827 1613 673 -1689 -643 1617
2999A617j588j944J855J691j807j749K307J310k335r56K289Q70k569l68K630L02
$$ 1617 29 -1915 -60 1631 -176 -1925 382 1692 -643 -1599 690 1560 -1009 -1377 1253 1555
3015A555k736K26K521m22k525P49K329r83k189J301J811j661j819J791J571j905
$$ 1555 -1181 -955 1566 1144 -1381 -632 1697 714 -1475 -174 1637 -24 -1843 -52 1519 -386
3031c86j295J988J140k261r65K547O30k477k90K491p4k343N88K215p32k220J130
$$ -386 -1681 307 1447 -814 -1779 768 1398 -1079 -1369 1122 1048 -1295 -707 1508 776 -1444 -314
3048c14K077j134k232J591J754j616j597J837J195k034j117K099P59k292n29K441
$$ -314 1763 629 -1603 -12 1742 126 -1471 366 1561 -473 -1590 509 1268 -1024 -1553 888
3064H88J58k400J91K324k35k447O57K408r11k079J067J973j397j686J646J478
$$ 888 1046 -1354 -1163 1161 926 -1521 -864 1544 633 -1446 -379 1594 197 -1489 157 1635
3080A635j718j444K026J238k192j096K425M61k345l31K422K8k470K08K482o56
$$ 1635 -83 -1527 499 1737 -455 -1551 874 1335 -1010 -1341 1081 1109 -1361 -1153 1329 673
3096F73k251Q47K027q91k016J282K026j644j768J808J477j957j195K138J154k311
$$ 673 -1578 -731 1296 405 -1611 -329 1697 53 -1715 93 1570 -387 -1582 556 1710 -601
3112f01p55K444K76k368kK389k80k303K87K456q69k272R91K188j149k084J459
$$ -601 -1356 1088 1364 -1004 -1006 1383 1103 -1200 -913 1543 674 -1598 -607 1581 432 -1652 -193
3129a93J678j703j525J910J345k076j071K255Q31k249m40K223K53k289J59K417
$$ -193 1485 -218 -1743 167 1512 -564 -1635 620 1451 -798 -1238 985 1238 -1051 -892 1525
3145A525n62k217O09K214j062j890J032K089j655j770J671J471j736j426K100
$$ 1525 963 -1254 -645 1569 507 -1383 -351 1738 83 -1687 -16 1455 -281 -1707 393
3160C93R90k038r75K465M22k311j61K197Q7k265K84K287n68j984O26K157r50k074
$$ 393 1383 -655 -1630 835 1257 -1054 -1215 982 1069 -1196 -912 1375 807 -1177 -551 1606 656 -1418
3178a418J336J836j629j475J594J357j814j283K056Q41k207p52K314M58k264l49
$$ -1418 -82 1754 125 -1350 244 1601 -213 -1496 560 1401 -806 -1558 756 1214 -1050 -1399
3194a399K377j15k296N94K014n98k235J129K035j118j974J577J639j569j474J951
$$ -1399 978 863 -1433 -839 1175 577 -1658 -529 1506 388 -1586 -9 1630 61 -1413 538
3210E38J201k178q00K037P23k113m46K038J08k264R8K093k64k267O20K057o99
$$ 538 1739 -439 -1239 798 1521 -592 -1038 1000 1108 -1156 -1058 1035 771 -1496 -876 1181 482
3227D82k109J164J816j304j760J748J429j615j307J890R97j940q47K189M18j972
$$ 482 -1627 -463 1353 49 -1711 37 1466 -149 -1456 434 1431 -509 -1356 833 1251 -721
3243g21r1J951m9j917j4K151o01j970R32J666j107j716J071J713j382j487J545
$$ -721 -812 1139 1090 -827 -841 1310 709 -1261 -329 1337 230 -1486 -415 1298 -84 -1571 -26
3260b6J267j587j251J917R04j880n65K044L42k171L1K035r7k017M67K076o75k061
$$ -26 1241 -346 -1597 320 1224 -656 -1221 823 1165 -1006 -975 1060 963 -1054 -587 1489 814 -1247
3278a247R93J571q62j704J100J368j362j231J506J106j786q66J786O86j869m79
$$ -1247 -254 1317 455 -1249 -149 1219 -143 -1374 132 1238 -548 -1414 372 1058 -811 -1290
3294a290J986L83k103Q3K020k61k094O70J919p95j601Q54J666j008j675J396J370
$$ -1290 696 1079 -1024 -941 1079 818 -1276 -606 1313 518 -1083 -229 1437 429 -1246 150 1520
3311A520j589j221J656Q01j779o16J901K11j826k12J801J47k075L70K009o39j710
$$ 1520 -69 -1290 366 1167 -612 -1228 673 884 -942 -1154 647 794 -1281 -911 1098 459 -1251
3328a251P52J765r20j738J305J450j313j338J398J283j553r48J865O23j866n84
$$ -1251 -499 1266 346 -1392 -87 1363 50 -1288 110 1393 -160 -1108 757 1380 -486 -1070
3344a070K023N0j914r7J940p1k192N83J772o25j712P00J683r27j520J331J358
$$ -1070 953 1003 -911 -1008 932 861 -1331 -748 1024 399 -1313 -613 1070 143 -1377 -46 1312
3361A312j486j071J544J060j693q75J931M40j721k53J791J13k096J94J818k57
$$ 1312 -174 -1245 299 1359 -334 -1209 722 1162 -559 -812 979 1092 -1004 -810 1008 751
3377G51j942P01J669q53j676J077J473j260j312J388J178j331j115J665Q22j736
$$ 751 -1191 -490 1179 326 -1350 -273 1200 -60 -1372 16 1194 -137 -1252 413 1235 -501
3393e01q49K258K28j941j28J816R6j757J72K015o45j926P71J768r17j747J146
$$ -501 -1350 908 1136 -805 -933 883 979 -778 -606 1409 764 -1162 -391 1377 460 -1287 -141
3410a41J513j361j515J705J019j717q66J740Q01j888m87J873M20k012j8J964k57
$$ -141 1372 11 -1504 201 1220 -497 -1363 377 1178 -710 -1197 676 1096 -916 -934 1030 773
3427G73j787L26J911p02j680Q17J546r15j430J187J224j406j112J502J003j713
$$ 773 -1014 -688 1223 521 -1159 -342 1204 289 -1141 46 1270 -136 -1248 254 1257 -456
3443d56p06J663N88j775m99J872L41k062K38J670k29j731L69J832q98j381P56
$$ -456 -1162 501 1089 -686 -1185 687 1028 -1034 -796 874 645 -1086 -717 1115 217 -1164 -408
3460d08J588r65j409J173J358j487q78J266R10j512o90J659M51j670l28J989j75
$$ -408 1180 215 -1194 -21 1337 -150 -1028 238 1148 -364 -1054 605 1056 -614 -942 1047 872
3477H72j785K84J757o46j651O26J688r46j597J203J299j086j223J253J030j376
$$ 872 -913 -629 1128 482 -1169 -543 1145 199 -1398 -195 1104 18 -1205 48 1078 -298
3493b98r39J523R13j725m39J787J86j816Q4J753j95j732M20J637p50j516P45J474
$$ -298 -1237 286 1199 -526 -965 822 1008 -808 -724 1029 834 -898 -478 1159 409 -1107 -362 1112
3511A112q39j598J146J282j412r59J484J051j707q76J683O68j785l12J800J48
$$ 1112 273 -1325 -179 1103 -309 -1268 216 1267 -440 -1316 367 1035 -750 -1062 738 886
3527H86j625q3J838j98j675L05J649o63j362P35J383j108j142J161J039j400r42
$$ 886 -739 -822 1016 818 -857 -552 1097 434 -928 -193 1190 82 -1060 101 1140 -260 -1202
3544a202J444P88j635o05J687N26j765j61J608J55j804L18J619m85j551L50J738
$$ -1202 242 1030 -605 -1210 477 1003 -762 -923 685 840 -964 -646 973 488 -1063 -713 1025
3561A025o06j432J006J201r74j295J281Q98j234r02J375Q65j808k09J363L64j628
$$ 1025 419 -1013 -7 1194 220 -1075 206 1104 -130 -1032 343 1208 -600 -809 554 918 -710
3578g10k41J687jj937N03J548n08j336P07J410p85j519J017J336j225r31J204
$$ -710 -951 736 735 -1202 -699 849 341 -995 -288 1122 337 -1182 -165 1171 -54 -985 219
3595B19R31j367p92J549N20j590k30J454K59j753M1J684l56j403L76J399q17j344
$$ 219 1150 -217 -1009 540 1060 -530 -760 694 953 -800 -759 925 569 -834 -458 941 124 -1220
3613a220R02J268r43j053J104R84j242q47J296Q03j420n62J485M68j568k21J791
$$ -1220 -318 950 7 -1046 58 1042 -200 -1047 249 1052 -368 -930 555 1023 -545 -766 1025
3630A025r4j814K87J545k99j473M28J477p66j336P81J241j000j239J313J008j473
$$ 1025 931 -883 -596 949 650 -823 -395 1082 316 -1020 -239 1002 2 -1237 76 1084 -389
3647c89p20J656L87j523l81J634K6j510R0J473k16j324L52J547n57j462Q05J168
$$ -389 -1109 547 934 -589 -970 664 690 -820 -730 743 527 -797 -445 1102 545 -917 -112 1056
3665A056o95j441J175Q74q66j015J101Q66j328p40J326M46j423k31J504l1j376
$$ 1056 361 -1080 95 969 103 -912 189 1055 -273 -1013 313 759 -664 -895 609 578 -798
3682g98K1J411k84j208L61J579o24j464P76J231p06j227J205R24j387n71J067
$$ -798 -777 634 350 -858 -497 1082 458 -1006 -230 1001 295 -932 273 1197 -190 -761 306
3699C06Q93j666l33J378J40j255m50J690J14j604J84J353l27j427M44J225l72
$$ 306 1199 -467 -800 578 718 -537 -987 703 817 -787 -603 750 423 -1004 -560 665 293
3716B93j330J015R65q07j125J085P88j124o00J274L94j175l29J349J06j295j53
$$ 293 -1037 -22 943 136 -989 96 884 -240 -840 434 828 -347 -676 673 779 -516 -669
3733f69J363Jj530K06J411m83j323O21J168o12j258J005J015j054q06R71Q10j118
$$ -669 694 695 -835 -629 782 299 -1024 -403 765 153 -1105 -100 915 -139 -945 26 836 -282
3751b82p63J368N48j318k46J375j8j267J47J354j70j541M55J245n10j347P69J180
$$ -282 -1045 323 871 -447 -693 682 664 -603 -456 898 728 -813 -358 887 377 -970 -201 979
3769I79r74q89Q41Q79j081p64J102Q27j208o62J415J09j369J37J259O4j457K40
$$ 979 5 -884 -43 836 -245 -1009 93 920 -288 -950 465 574 -795 -658 601 665 -792 -552
3787e52J341j81j351M87J209o54j234R60R34r20r02R68Q42j016p68J053M28j163
$$ -552 789 608 -743 -256 953 299 -935 25 959 39 -863 105 947 -69 -837 216 644 -519
3805e19l89J271J76j301j06J387j10j245K82J347m24j256P44J015o02j108R28
$$ -519 -908 363 539 -762 -868 519 409 -836 -554 793 369 -887 -143 872 270 -838 90
3822I0R45r41r03J005Q75j278m98J162N75j499k60J245J82j274L1J294l28j294
$$ 90 1035 94 -809 196 1071 -207 -705 457 1032 -467 -727 518 700 -574 -543 751 423 -871
3840h71K75J313m80j176O16J116p82q25Q77J033j125o99R99O70j285l00J114L29
$$ -871 -596 717 237 -939 -323 793 11 -814 63 1096 -29 -728 271 941 -344 -644 470 799
3858G99j243l05J434lj455J32J366j79j349M98J292q15j112N78J089p94q64R69
$$ 799 -444 -749 685 682 -773 -641 725 546 -803 -305 987 172 -940 -362 727 -67 -931 38
3876C8P77j036o78J032P31j131m71J252J79j251K6J102m5j197J94J198m48j036
$$ 38 815 -221 -899 133 864 -267 -738 514 693 -558 -532 570 525 -672 -478 720 272 -764
3894g64M56J098n39j201Q98R36r64r11J133O63j152m72J066N18j246k86J206J07
$$ -764 -308 790 251 -950 -52 884 -80 -991 142 805 -347 -819 247 765 -481 -767 439 546
3912E46j117J95R60k50j120N05J074n09j062O08R83o62j026R33Q21r72p69J015
$$ 546 -571 -376 584 334 -786 -281 793 284 -778 -170 813 151 -875 58 879 -93 -862 153
3930A53N28j152j21R92J90r91l84J280q0j083P8J294k30j331N53R29l77j014N57
$$ 153 681 -471 -592 400 590 -401 -785 495 415 -668 -590 704 474 -857 -304 625 248 -766 -209
3949b09J120q94q27R56P31q76p89J186L05q75o26J316J99j203RJ009J1j323L18
$$ -209 911 17 -810 146 877 1 -788 398 703 -172 -798 518 717 -486 -477 532 543 -780 -462
3968d62J063l73r39M96Q91n47j122R15R33r36p02R03N22q04n72J208M30j421j7
$$ -462 601 228 -711 -215 676 129 -993 -78 855 -81 -783 120 642 -162 -734 474 904 -517 -534
3987e34J156J18j327K92R95j92j232L62J023n51r66N20J063o76j018R29P05p58
$$ -534 622 740 -587 -295 700 508 -724 -362 661 110 -856 -336 727 51 -967 -38 667 -91
4005i1p42R83N27j164k84J120K54r81k33J308j00j133N8J090j44j153L99R70l70
$$ -91 -833 150 677 -487 -771 349 603 -378 -611 697 597 -536 -478 612 468 -685 -286 684 314
4024C14j201P86P82p11o87P34P45q72p75R20O40j018m59J051K85j041j99J145
$$ 314 -887 -101 681 -30 -717 17 762 -110 -885 35 675 -343 -802 249 534 -507 -706 439
4042D39J10j007P4J016l79r16M41J080o89r14O57R26p88q83R50P37r75n60R00
$$ 439 549 -458 -384 632 253 -663 -222 858 169 -745 -88 838 50 -833 117 854 -121 -681 219
4061B19M75j148k62R57L56j258q1J194j58r75J54J182m61j014P04Q85p00p81Q02
$$ 219 694 -454 -716 241 597 -661 -742 452 294 -681 -527 655 194 -820 -116 769 69 -712 90
4080I0O75p01p65J006M30j007m44R02M06j051j29R57L01j287J08J027j98r93M03
$$ 90 765 64 -701 305 735 -272 -716 186 592 -459 -588 369 670 -617 -509 518 320 -673 -270
4099b70Q69m96r53O41Q48o82p88R08O35q34n72R18M33q88l14R21K86j086p0J008
$$ -270 599 103 -850 -209 639 -43 -831 77 712 -122 -694 224 657 -231 -545 376 662 -424 -494 514
4119E14kr82J44J008l32j133M17J078o26p59M98O29m24r10Q22O10p18n96J060
$$ 514 512 -470 -326 682 350 -783 -366 712 86 -673 -175 454 30 -880 -58 552 -166 -762 298
4138B98L21j034k00J115P6j008n3J139k54q48K54R87n47p93N40O54o25o39N38
$$ 298 619 -415 -615 500 576 -432 -485 654 400 -448 -194 793 246 -547 -7 647 22 -617 -79
4157g9Q18q33p27J023L86j031k36R59K27q06l05R05J62r52n8J038k35p89J92R75
$$ -79 739 -94 -821 202 588 -443 -679 280 507 -299 -604 301 463 -489 -547 491 256 -533 -341 634
4177F34m35q53P64N83o04p09P40M92o87o10R31K78q36l05J106K9r21mP45Lr10
$$ 634 199 -654 110 693 89 -620 120 612 -75 -685 246 524 -312 -617 489 518 -403 -407 338 341 -569
4198e69K86P69k57q86M11Q50o17m80N10P43p77o53Q96M96r25l67Q57M45j046k96
$$ -569 -283 486 229 -657 -246 604 -13 -493 17 760 -17 -670 226 722 -203 -570 287 732 -314 -610
4218f10J065l2q60O2Q19r1j092L61R27l37q39M01Q25o29o66Q23N28o85o73R14
$$ -610 455 423 -437 -375 444 353 -739 -378 549 212 -627 -226 599 -30 -696 127 655 -30 -703 211
4238B11M06p84l49P56L63j018j04J083L9j072J73Q20m4j140K39R14k19j009N96
$$ 211 617 -167 -516 240 603 -415 -519 564 603 -469 -296 524 480 -660 -421 493 274 -735 -139
4257a39P81p15p46O74N69n95n97R86K58p99k16Q60K62q75j79R69J4q61J96Q14
$$ -139 642 -73 -819 -145 424 -171 -768 218 476 -323 -539 321 583 -292 -471 498 512 -349 -153 661
4277F61l46p65K52O78l08q45O11Q08p23p29Q34M41p02n56Q02M70r50k89Q80M17
$$ 661 315 -450 -198 480 172 -673 -62 746 23 -706 128 569 -133 -689 113 583 -367 -656 224 641
4297F41j164L2Q87o3o82K17Q06l73q76M50Q45n92q70P53P05p03o72Q44M51r48
$$ 641 -523 -491 396 333 -349 -132 674 301 -575 -125 720 128 -742 11 716 13 -659 185 636 -312
4317c12l11R07L23j046qP27J30q19k2P97o0q57J53Q25n0r82N35O28n80n52O41
$$ -312 -623 284 607 -439 -447 280 410 -409 -431 366 306 -551 -398 427 377 -605 -70 558 -22 -574 67
4338F7O11o22o78R33M47r42m67Q38L77r28N4N51oo49PQ63k34r39M24P15l48p33
$$ 67 678 56 -622 311 758 -184 -651 187 564 -364 -310 241 235 -414 -407 456 222 -717 -293 422 74 -659
4360f59N58P30n90p38Q81L29o96j79N34L55p79j49P57K31p47k12Q37oq37J42P64
$$ -659 -101 629 39 -699 182 511 -185 -364 170 525 -254 -403 354 585 -162 -374 463 457 -380 -238 526
4381E26m23o95K29Q97m40o87M70P18o54m64O62L99q06k29O81L16p82l59J023J63
$$ 526 103 -592 -363 534 94 -593 -123 595 -59 -523 139 538 -268 -497 184 500 -282 -641 382 545
4401E45j028Q3R86j77q93L77N88k19p32K83O80m38o85O81M95n79n18N94L35n27
$$ 545 -483 -400 586 409 -484 -107 481 262 -470 -187 493 55 -630 51 546 -33 -551 43 378 -149
4421a49m30P54K38o79q6P66M7r48M1Q12k21n17K41P42k90q95M83O27n49l79M64
$$ -149 -579 175 413 -266 -352 414 461 -487 -446 366 145 -372 -131 611 321 -574 -91 536 -13 -392 72
4442G2M55o37l36N69L07o84k30P16J7p59J55P37m0q39K73O97k06p34J43Q10n35
$$ 72 527 -110 -446 123 430 -254 -484 232 249 -510 -355 382 342 -497 -224 473 267 -467 -324 486 -49
4463d9m05K99N91l78m76N92M15q37l46R34K11o98k65Q51K3p14j77P95l1q14O6
$$ -49 -454 -155 436 58 -418 174 589 -248 -594 340 551 -147 -412 439 462 -252 -429 366 335 -479 -413
4484d13Q36l32p82N42O77m90o19M69O33n98m51O39M34p43k74P61K00o82k43Q04
$$ -413 423 91 -691 -149 528 38 -581 -112 521 -77 -528 111 545 -198 -472 289 489 -193 -436 368
4504C68J1o15J09N62k14o27J16O12j50p49L59N78l09o64N33O06p08l83O82L24
$$ 368 379 -236 -127 435 221 -406 -290 322 172 -577 -218 360 51 -613 -80 526 -182 -565 117 441
4524D41n27m69Q33K27p54lO49k00o54J08P99j68o69K62N58k49o74M14O10m34o73
$$ 441 -86 -555 278 505 -249 -252 397 197 -457 -349 450 282 -387 -125 433 184 -490 -76 534 100 -573
4545e73P42K71o18l37P16J33n93k71P91J49p87l2P80j88o97M13N70k44n04K62
$$ -573 169 440 -178 -515 201 334 -259 -530 261 410 -377 -409 371 183 -514 -101 469 225 -279 -17
4565a7M96m20m69M86M51n62n12O12N53q36k73P53K25p48k36O75J79p76O3R44k90
$$ -17 479 59 -410 76 527 -35 -547 65 618 -218 -491 262 487 -261 -497 178 357 -419 -356 588 298
4586B98p37K91M93k79o56M67O01l47n83M69N32o48m33P35L88p85k99P69K81q32
$$ 298 -439 -148 345 66 -590 -123 478 131 -452 17 549 -99 -532 203 591 -194 -493 276 557 -275
4606b75o7Q23j90p43L8Q20k56o56L50O16l52o15M95M55m67o13O30N20o66k85N51
$$ -275 -342 481 291 -452 -414 406 150 -506 -156 460 108 -507 -12 443 -24 -637 -7 513 -153 -438 113
4627A13K72m01l15O58R3p99J40O22j45o25M2Q22k08o69K20N69l21n37L86N12n28
$$ 113 385 -16 -331 327 420 -379 -239 383 238 -387 -345 477 269 -400 -180 389 68 -469 -83 429 -99
4648i9k99M50M23o40k76N04K80n73j51N81J25n59q3N61m8n37K34O41l58p12N57
$$ -99 -398 52 475 -165 -441 63 343 -230 -381 200 325 -234 -317 244 196 -341 -107 534 176 -536 21
4669B1L94m03m63M71M90m79n88P01J83n36j79M75K27o66k0N63J49o96K6P29j21
$$ 21 415 12 -451 20 510 31 -557 144 327 -209 -388 87 314 -352 -372 191 340 -356 -330 399 278
4690B78q67M19O62o09j90K81N32m56m87O24R8l51l40O30K80q29LO11N6m79k02
$$ 278 -589 -170 492 -117 -307 -26 506 50 -437 187 285 -66 -406 224 504 -325 -322 289 345 -134 -336
4711c36N78m6n58J7P39j83n87K60N73k70n93M05N58o43k42N42J55m38l55P29J67
$$ -336 242 196 -362 -345 394 211 -376 -116 457 187 -406 -1 557 -86 -328 214 369 -69 -424 305 472
4732D72n94j20L94J51n68J4N11M1n69M0O13l45n87N78K83j87n83L81M45m30k18
$$ 472 -122 -242 152 303 -265 -251 260 301 -268 -228 385 40 -547 31 314 127 -456 -75 370 -60 -278
4753b78L48M86o19l16N90K85o68j03O76j11o39K03M73N9p59L87K80k53n95M43
$$ -278 70 556 -63 -379 211 496 -172 -275 401 290 -349 -146 327 386 -373 14 294 41 -554 -111
4773a11N11n13l12M27L05n35j45N17J94n83N4K09L14o13k2O79o1p50K39N53k01
$$ -111 400 -113 -425 2 307 -228 -373 144 338 -245 -191 18 332 -281 -303 376 315 -435 -196 357 156
4794A56m23J66N10m76j84K74N57n39l78L95K39m00l12N52L4l28j97N38o7m88J36
$$ 156 -267 -101 409 -67 -251 23 580 41 -337 58 297 -103 -415 137 171 -157 -354 184 117 -371 -235
4815b35N29m4n26J62L43r2m85J85O38l84n00O57K50m61l68M05K89o15j25M40M27
$$ -235 294 250 -276 -114 229 137 -348 -163 475 91 -409 248 498 37 -331 74 363 -252 -377 63 490
4836D90q12M5M67q7l84qN39p1n73M0P40k56n44M04L63l39l38L31M64n39k92M48
$$ 490 -322 -277 190 103 -281 -289 250 179 -394 -354 386 130 -414 -10 353 14 -324 7 471 -68 -360 88
4858H8K68n16j91N45J27n53N0N01j93m04R1N17k07n67K70M66l04l81L89L43l99
$$ 88 356 -160 -351 194 321 -232 -182 319 126 -278 -187 330 123 -444 -174 292 -12 -393 -4 339 -60
4879f0m06M57K78l05l08N84J20n66j45P25m1o50J77M13j90m02K34M88m01l72L60
$$ -60 -466 -9 269 -36 -344 240 360 -206 -351 374 333 -317 -140 273 83 -319 -85 403 2 -370 -10
4900a0L62k59m69L67K89m18l97L89M14m38k19L87L03m18l26P22j6n81l7N67J17
$$ -10 352 93 -376 -9 280 -138 -535 -146 268 -170 -389 -2 301 -117 -443 279 263 -318 -355 212 329
4921C29p06L70M31k31n35L10L79k70m72L81M42n33k10K52K78n13o3M43J53m37
$$ 329 -377 -7 424 193 -342 -32 347 77 -395 -14 428 -105 -315 -63 215 -298 -361 82 235 -202
4941b02j89O28j04k90q4N56j20m01J15N81n65l82L94M81n56j51K85N11o90j73
$$ -202 -391 237 133 -157 -241 315 195 -206 -91 490 -75 -457 -63 418 -138 -289 -4 507 -183 -356
4961c56N65J54m51l35N99K20o17J5N27r0n96J36M46r3m21R0M88r8n42K56M76l08
$$ -356 209 363 -88 -423 176 396 -221 -206 321 231 -365 -229 217 124 -297 -207 281 183 -359 -103 373 65
4983F5m04M13K45m33j46M19L00o84j33P39j39m90nM71j02m08J59L31m8m06MM88
$$ 65 -339 74 319 -114 -260 159 459 -225 -358 381 242 -248 -253 218 116 -292 -133 198 150 -256 -252 236
5005B36k41l97K05N27l34l02L62L31m58k74O28N3m94j4L64Jm74J36M51j04n27
$$ 236 -5 -402 -197 330 -4 -306 56 387 -71 -345 283 336 -158 -172 192 193 -281 -145 306 202 -325
5026c25K40M62m05l56L16M32n20r7K28K09l81j82M57L86n64j59M23J26n01O2M12
$$ -325 -85 377 -28 -384 -68 364 -156 -253 -25 184 -197 -379 78 464 -100 -259 164 290 -211 -149 263
5047B63om46P0M96l57k63K48L74l28l17L30L77n03m11N12K21n42j61M54K56n53
$$ 263 257 -189 -119 377 20 -243 5 379 51 -266 64 441 -62 -473 39 260 -282 -443 11 267 -286
5068b86L3M16O0o54K57N25k25n30L71L90k15l94K48L41l53j74J62M57m92m36N58
$$ -286 -253 163 223 -431 -174 351 126 -404 -33 357 142 -252 -4 337 -16 -190 -28 429 -63 -499 59
5089E9J53l77p3M20J60n55j5M90J0n68o6N99o2n58M14M33l17m04K62L10k49k91
$$ 59 212 -165 -238 182 342 -213 -228 262 272 -296 -362 237 175 -383 31 464 147 -257 5 315 66 -225
5111b25K02L56m93l9M99N2m00k54N03J21n51P9K51Q2n25Q1O28k59m16J58L77l27
$$ -225 -23 333 -160 -199 300 352 -48 -302 201 322 -229 -150 101 183 -342 -261 367 108 -308 -150 227 -100
5133a00l49K54L81k62k62L93J27l42k07N06J53m58j0M02j3m30q4N46l0l50MM94
$$ -100 -449 -195 186 -76 -338 55 182 -160 -367 139 292 -166 -176 226 213 -217 -301 245 215 -135 -131 363
5155C63k63l77K70J36j67k35J56L70k36n42P15O6l74j96M46R7m72l1M58L4m59
$$ 363 100 -277 -7 129 -38 -273 -117 253 17 -525 190 256 -118 -314 132 229 -243 -274 184 218 -241
5176b41J28M92k46l54J05M69k56k22L4M18k12n33N38K94n40k08N80J7j57m55N48
$$ -241 -113 379 133 -221 -116 353 97 -125 -91 327 115 -418 120 414 -126 -334 246 263 106 -349 199
5197A99Q7m84j68N65L9m91j19N89K6o75L68K89j77l23L45K70l58l43L69L54m18
$$ 199 286 -198 -366 199 238 -253 -372 217 243 -432 -64 225 48 -275 70 340 -18 -361 8 362 -56
5218e6k04K89L74n55m6M48j51m19O8M79k40l96L11L18k04l94K48M70k66l03K39
$$ -56 -260 29 403 -152 -198 250 99 -320 -252 227 -13 -409 -98 220 16 -378 -130 340 74 -229 10
5239A0L18k22l76L51J21j73l76N79L7l85%L97r1l76rN04j28m57J87L63l21l29
$$ 10 328 106 -270 81 202 29 -347 232 269 -116 -116 281 190 -186 -195 309 181 -276 -89 274 -47 -376
5261c76K81L33j56m83L48K95l80j53L50J67k41j76L41K26o00L6L41J58n68J33
$$ -376 -95 238 82 -401 -53 242 -138 -291 59 226 -15 -191 150 376 -224 -188 153 311 -257 -124
5281a24L74n2m45N7N37k50l79L71K84l94l59L81K71n96J09L80J45n77J25K70K01
$$ -124 250 198 -247 -190 347 97 -282 89 373 -21 -380 1 272 -324 -215 165 310 -267 -142 128 329
5302C29m43l7L74p3l14K4L55q3l73J32M46k44k47J16L98k84j58J57J65l84j36
$$ 329 -114 -151 223 150 -164 -140 215 132 -241 -109 337 93 -154 -38 360 76 -82 75 240 -144 -280
5323b80M43N4m00j6L44J47n05L6K34j0m55K71N32m06k43J55L23k43j53L41J91
$$ -280 163 217 -183 -199 145 292 -213 -177 57 47 -408 -137 395 -11 -254 -99 224 -19 -172 169 360
5344C60m15k17L30J88k15k84L89R1n20K2N11j57l04%L93J7l11P1K39j81j76J80
$$ 360 -55 -272 58 246 31 -253 136 227 -293 -271 240 83 -221 -221 172 189 -122 -51 188 7 -169 11
5366A1L61l30l82N58k9k02j47L88K0l02k9L33q1k84r1M00j7m47K43K36l9m27J13
$$ 11 372 42 -340 218 189 -13 -160 228 248 -54 -83 250 169 -115 -206 194 177 -270 -27 209 170 -257 -144
5389a44M81l67l29N34J25l32k51N11O4l84j23L97l0l93K5M62n1l75m6M00n0l32
$$ -144 337 -30 -359 175 300 -32 -283 228 292 -92 -215 182 152 -241 -216 246 195 -180 -226 174 124 -208
5411b08L9M22q4m17J34J87L1l98K34K77l24k18K91K21k39l07M25P2l51j30M97
$$ -208 -169 253 169 -248 -114 73 104 -294 -60 217 -107 -325 -34 187 -52 -359 66 138 -213 -343 154
5432A54O5m29L0M01l6l51J59J95r9l44L26L83m80k69K29K54k15k20N01q7k42j85
$$ 154 219 -210 -180 221 185 -166 -7 188 89 -255 71 454 -26 -295 -66 188 -27 -247 254 167 -75 -260
5454b60M45j6l82N4L73q0m27J22L73r2k76P5L40r9l85J64L35k54k26J97L17m15
$$ -260 185 169 -213 -159 214 134 -293 -171 202 110 -166 -91 249 150 -235 -71 264 10 -216 -19 298 -117
5476a17k55M98J7k86n4L73J50n35QL07M5l76jM60j60l20K19L40l55n0J71J88k78
$$ -117 -372 126 143 -143 -197 176 326 -209 -201 106 151 -225 -226 234 74 -246 -27 313 -42 -92 79 267 -11
5499a1k57L57K07l51k49M91k2k31j71N30M1p14J50M60j12m35K17L65k07k89J92
$$ -11 -268 89 296 -55 -304 187 165 -66 -237 293 334 -380 -230 230 118 -317 -100 265 58 -231 -39
5520c9K91l41j58K54K10m11q4L73N6l40K4K99J83m01L4K40J3n30J76L73j92l75
$$ -39 252 -89 -247 7 217 -194 -278 95 151 -189 -165 134 317 -84 -50 190 203 -327 -151 222 30 -345
5542c45L24M03l26k78R4M35m21j40K97K98n14k84O47o1k29m2K20K12n96qM56j7
$$ -345 -21 382 56 -222 -128 307 -114 -254 43 341 -173 -457 190 129 -100 -142 78 290 -306 -314 142 125
5564A25l14J53K33%m32K27L74l78l10M71J45j25m54L84J68j30l90L07L40p04J46
$$ 125 -189 -36 197 197 -235 -8 366 -12 -322 149 294 169 -285 99 267 137 -253 54 394 -310 -164
5585a64L57M7m98J18M34k23l46K06L32j72l97L00J54j09l82L93J72l97j95M93
$$ -164 193 240 -258 -140 294 71 -275 -69 263 91 -306 -6 148 39 -343 50 222 -175 -370 123
5605A23K37m50k36L98J26m13o1M49K2m01K9L46r2k66J09M24l88j60J34L98l95
$$ 123 360 -90 -326 72 198 -215 -276 173 195 -206 -177 169 77 -189 -80 344 -44 -204 -70 328 -67
5626f7j90K92K71l05k83N17N3m84R0K02P2k87n6K76J1k10j6L53k95k90K25L95
$$ -67 -257 35 306 1 -282 235 288 -196 -106 96 168 -119 -175 101 112 -98 -114 239 -56 -346 -121 274
5648B74k47k95L45K12l57k81L29L03m42J9L47P7m02J5K79K1l11l2L89jl39n8M79
$$ 274 27 -268 77 289 -68 -349 -20 283 -159 -140 207 284 -118 -103 176 197 -114 -146 243 242 -97 -155 324
5671C24k42l19J48L07k51l50N07R4m18j27N08m2k66k63N06P8l79K7K15Q7l35l2
$$ 324 82 -237 -89 218 -33 -383 124 218 -200 -327 181 139 -127 -390 116 194 -185 -158 57 144 -191 -223
5693b23M43j31l71K96K07j29l74J61M45l25q5J5K85k93j69M66n0l53P5L00lm02
$$ -223 220 89 -282 14 221 92 -282 -121 324 -1 -86 -71 214 -79 -248 218 168 -185 -110 190 187 -215
5715b15K7M46Qm43K06J89j83l22L20K29j77k93K45L02n28K1K49K13k97k70L64
$$ -215 -188 258 266 -177 29 218 35 -287 33 262 85 -208 37 339 -189 -168 81 294 -3 -273 91
5736I1J29m25M1L75K23o78P1L81n4l21O3K53L2l02J37J80k27k40K39J87l50R7
$$ 91 220 -205 -164 211 434 -244 -173 208 154 -167 -104 149 181 -121 16 196 -31 -271 -32 155 -195 -98
5758i8J30L0q2l21M39L5j90l0L70j69l36R1K31M3k90J55J02j27k52k0M18j85k61
$$ -98 32 62 -20 -341 98 133 -57 -87 283 114 -222 -131 100 143 -147 8 110 -17 -269 -289 129 -56 -317
5781c17M06J73k82k33J83K37l57J01L96j30l98J5N32n8m76K07J85k27j04%M34
$$ -317 89 262 -20 -253 -70 167 -190 -89 307 177 -221 -206 326 268 -208 -1 184 -43 -147 -147 287
5802B87k89k87K64K96l11j18J32J95l69l4J75K13l56J58J17j5k92K04K70j15k87
$$ 287 -2 -289 -25 271 -40 -158 -26 169 -200 -234 -59 154 -202 -44 73 58 -234 -30 240 125 -162
5823a62J9L66o8k70R8L96m34j85K52J41k81k03M97rj03j00J68J18l64j67M74j03
$$ -162 -143 223 155 -115 -17 379 -55 -240 12 153 -128 -331 166 157 54 -46 122 240 -124 -291 183 80
5845H0k97J89J01N6l93K11J89k07j42R9M16l01j66J71J45j67k13L14O8k51j70
$$ 80 -217 -28 73 129 -264 -53 136 -71 -213 -114 302 1 -165 6 151 -16 -229 85 153 -98 -268
5866b68L97j1j69o6Q4J42k89L9L63o2l14j4M46l00k78K75K70k90k18L51K1n4k32
$$ -268 129 118 -51 -117 -33 109 -180 -141 222 160 -154 -168 278 -22 -300 -25 245 -45 -263 88 109 55 -177
5889a77L69k1k39j48M45j32k67O3J49P9k66oM63k63l19K03K38j49l12K78J36j78
$$ -177 192 171 -68 -216 229 97 -170 -107 42 121 -145 -151 312 49 -270 -67 171 22 -290 -12 124 -54
5911e4k25L87K49n00L1K12M2k81P4K44l8k79m9N39k80n12M22K39k59o9R4K41l59
$$ -54 -279 108 357 -143 -112 100 142 -139 -65 179 141 -138 -187 352 72 -440 -18 221 -38 -107 -13 228 -131
5934a31j29K33K18k00j85J28K83k67j03L16k25j89N9L25k37k8P8L30k74k16J20
$$ -131 -260 -27 191 -9 -194 -66 217 -50 -153 163 -62 -251 -192 133 -104 -132 -54 276 2 -214 -94
5955i4L23k37p3J00K60l90n3K40J22j90k91M15N1l36MJ11J68k60n3J98N8k72N4
$$ -94 229 -8 -81 19 279 -111 -164 76 198 8 -283 132 183 -153 -149 -38 130 -130 -183 15 73 -199 -145
5978a45M20j12l45J29K82l62mK48K91l76k86M59p2k81k12O02J47l46j28J45pj33
$$ -145 275 163 -182 -53 229 -133 -137 111 402 26 -260 199 127 -154 -366 236 383 37 -91 54 47 -86
6000h6oK01J44l77l2M50k19k55J95J42l6k94J27J24q3j70K71J69l12k28L89R7
$$ -86 -92 109 253 -124 -156 294 75 -180 15 157 121 -173 -46 78 -5 -175 96 265 -47 -275 114 211
6022B11k17j81K85k9m2l7L28k45l71K10L72j99j92rL02n08P1M27n6r5l19K48K28
$$ 211 -6 -187 98 69 27 -10 318 73 -298 -88 284 85 -107 -116 186 -322 -251 176 120 25 -294 -46 182
6045A82j21l01L82j9m28J90L58k63j21j2L50j08j24J30J7r9k65K26M8j16k14L10
$$ 182 61 -240 142 123 -305 -115 243 -20 -141 -153 197 89 -35 95 112 13 -252 -26 22 -94 -308 2
6067BJ02j65j20K41Q7k35J5J93O5l70O3K48l5k98J02K41n8j70P2K34j51k38K36
$$ 2 104 -61 -181 60 147 -88 -73 120 185 -185 -122 126 91 -207 -105 136 78 -92 -20 214 63 -175 61
6090F1Q7j41j71L22p7q2j72L84l0l14m4K24N1l17J29K07j2j19l8J47p0j64J16
$$ 61 148 7 -164 158 81 -1 -173 211 181 -133 -177 47 98 -219 -90 117 105 -14 -52 95 25 -139 -23
6113b3L23k23k52K82J46l62mL42P2l45n9J32L4k19J6L22q3l57K87Q3p2k54K0L20
$$ -23 300 77 -175 107 253 -109 -113 229 301 -44 -103 29 63 -156 -140 182 99 -258 29 112 40 -214 -194 126
6137A26j38j15J0K69k87k7J88J84k80o7L84r1k51j52M49m5k40k6J97l8l11J25
$$ 126 -12 -127 -117 152 -135 -162 26 210 -70 -137 247 156 -95 -247 202 157 -83 -109 88 50 -261 -136
6159a36K83n8l26Q8K18r7k11J17J84k51l6L83Lk67j97L60p4n8j01L56N3l84J91
$$ -136 147 89 -237 -149 69 -28 -239 -122 62 -189 -225 158 161 -106 -303 57 -17 -75 -176 180 233 -151 40
6182D0J4Pj75J62J61j89j28Q0J82k03k24L57pj03q6J76L6l68K38K09j04k09j09
$$ 40 54 61 -114 48 209 20 -108 -28 154 -49 -273 84 77 -26 -112 64 100 -268 -30 179 75 -134 -243
6205b43K01K17l29J37K13j62k49J92J93k04r4K84J62l57j83L22L9k46n9J98J91
$$ -243 -42 175 -154 -17 196 34 -215 -23 170 -34 -128 156 318 -39 -222 100 139 -107 -166 32 223
6226B23m43Q4K48k0k94M1K93o9j38M3J69p0j58K28n1j14k62L43Q7k78k2K07j33
$$ 223 -220 -136 112 92 -202 -161 132 63 -75 -32 137 67 -91 137 86 -28 -290 53 140 -138 -160 47 -86
6249h6O8j47L49K8l04j10L94j52k77K0L88j85j42J27L07k87j26J68J95j29l81
$$ -86 -18 -165 184 212 -92 -202 192 40 -237 -217 171 -14 -156 -29 278 -9 -135 33 228 99 -282
6270b82K25L37m73j5L39J5j04k05K83R4l45J63J26r7j33N4J85j47j82K9M15j60
$$ -282 -57 280 -193 -208 131 146 42 -163 120 214 -131 32 158 61 -72 -18 167 20 -162 -133 282 122
6292A22l20J56J57k26j51K01K59k02j82J55K51m05L4M48k18j52K1L59j53l18P1
$$ 122 -198 -42 115 -111 -262 -61 198 -4 -186 -31 220 -185 -151 297 79 -73 -52 307 154 -164 -93
6313i3K59o4m25K74K15j82r1J26K1j22j21L58K3k99MJ62n3j49M3K84j43k8j62
$$ -93 166 102 -323 -49 166 -16 -107 19 40 -82 -203 155 178 -121 -117 45 -8 -157 -114 170 27 -1 -163
6336a63K39Ok74J11L19l01j82J84K73j93k69M43J3q0o6Q1k9k84OL65k8k60k9K81
$$ -163 76 82 -192 -81 238 -63 -245 -61 212 19 -250 193 206 126 60 141 112 -172 -166 199 171 -89 -118 163
6360A63k03k15J23K91j38j47l1L85j41l63K80K21k65n5J68J35k15k43L32K40l86
$$ 163 -40 -255 -132 159 21 -126 -157 228 87 -276 4 225 -40 -95 73 208 -7 -250 82 322 -64
6381f4k2K57J6m18J71J10J9k50J03K62j68k17O4L21k71r6K52J79k95j05K75%n5
$$ -64 -86 171 187 -231 -60 50 69 -181 -78 184 16 -201 -137 184 -87 -183 69 248 -47 -152 123 123 68
6404F8n9J23M3l87J75J82r0k49r6N52r7m90L39K03k60j28R9K47j44j34J13Q2k31
$$ 68 9 132 175 -212 -37 145 55 -194 -290 262 165 -325 14 217 -43 -171 -72 175 31 -103 10 92 -139
6427a39r5K93O1j77j34L16P2l12o9M05o1l20O7L17j15k39K20J09k93r7K22P4j66
$$ -139 -234 59 120 -57 -191 125 197 -115 -184 221 160 -160 -93 224 109 -130 90 199 -94 -191 31 105 -61
6450f1j39K64K0j99M0J94K3k70O1J73M7m10M9K92q2j01rL53j09k81J22K55j82
$$ -61 -200 64 84 -115 -75 119 142 -128 -67 106 153 -257 -208 84 2 -99 -108 245 136 -145 -23 232 50
6473E0k61M17j0k03q3J87J54l32j34K84K79l88r3K28k7k39l1M19j79k50J23L14
$$ 50 -211 206 196 -7 -90 97 251 -81 -215 69 348 -40 -133 95 68 -171 -202 217 38 -212 -89 225
6495B25j39k25L1K30k15qL13j07m6j56K35P6l48L0K34m2k42J1K18k6j90K6L13
$$ 225 86 -139 -108 122 -93 -101 212 105 59 -97 138 214 -134 -104 130 88 -154 -143 75 49 -141 -115 198
6518A98j83k52J94L06k95j46K49M7m2k62J83J75k33k41K49K81k73k9L36j60l14
$$ 198 15 -237 -43 263 -32 -178 71 118 76 -186 -3 172 -61 -302 -53 228 -45 -74 262 102 -212
6539b12O2L13k61m9R3K50l16o0J00J62p8j89K79Q1k74j08K65%kk58K51Q0l45K07
$$ -212 -150 163 -98 -147 -54 196 -120 -180 -80 82 4 -185 94 175 -99 -207 58 58 56 -202 49 129 -216 -9
6563iJ20J13l61l2M06j49k44J99K14k78j1M7O0k01p1K35jr7j93K96K7k80N8K37
$$ -9 111 224 -137 -169 237 88 -156 43 257 -21 -32 15 75 -126 -197 38 37 -60 -253 43 70 -210 -152 85
6587H5p2j61J5J59j2j90M6M31k93n6j23L88j68j22N5M8o3r0J47J17k33r7L32r
$$ 85 13 -148 -133 26 14 -176 -130 301 8 -48 -171 217 49 -73 -18 30 -33 -123 24 141 -92 -189 143 134
6611A34j86P0P7l9k95J54Q9j11r0J92J32j64oR9M9j46j62J43K55k17r3J88p1k03
$$ 134 -52 18 95 56 -239 -85 4 -107 -197 -5 127 -37 -43 56 105 -41 -203 -60 195 -22 -115 73 2 -201
6635b01P0L24r2k17J06J47j46J1pR8q2j65K08J55j43l44L15J2j59l2K68M1k98
$$ -201 -131 193 101 -116 -10 137 -9 2 -5 93 11 -154 54 209 66 -278 37 49 -110 -142 126 167 -131
6658a31j35M08R4k78j10K87J01k99q3L48J8k56j00K45r6q7L0L21m09J8J64J20
$$ -131 -266 142 236 -42 -152 135 236 -63 -146 202 220 -36 -136 109 13 -74 -44 277 -132 -114 50 170
6680A70k35k40M55p5j88L0J24J87l17N4J03o3l6k0L11j63k16O2K60j76j50j2M07
$$ 170 -65 -305 150 75 -113 -83 41 228 -89 -35 68 5 -31 -51 260 97 -119 -57 203 27 -123 -135 272
6703B72j07k28P0J88l66R3K34n6j34j81L29j95j62N1L56j63k07J86K67j34k15
$$ 272 165 -63 7 195 -171 -78 156 100 -34 -215 114 -81 -243 -192 164 1 -206 -20 247 113 -102
6724a02J74%n8j35K06K5n0k13P3K60j76o5J39M0j53k78L25J95l43J8K55q3k08
$$ -102 72 72 14 -121 85 110 60 -153 -80 180 4 -61 78 118 -35 -313 12 207 -136 -118 137 54 -154
6747a54P5K86k66l1K13J48m15q1L25J25k41j83P0L37k70OJ77M1l18J44Q8Ol11
$$ -154 -79 207 -59 -90 123 271 -144 -225 100 225 -16 -199 -129 208 -62 -56 121 162 -156 -12 76 82 -229
6770b29j08N42M0m71K23K31j34k79K60J07j56r0N2K68l56K2J21j8j41N1P4K68
$$ -229 -337 205 245 -226 -3 228 94 -185 75 182 26 -64 -12 256 -100 -78 43 25 -116 -65 9 277
6792B77l22p2K62o6k05J6M11j52k78K46P5o0l29J49J74o3k26J05K05l00r8K50
$$ 277 -45 -117 145 79 -126 -110 301 149 -129 117 192 132 -197 -48 126 63 -163 -58 147 -153 -251 -1
6814aJ60l91J91K65j31l68K30J58j69n3K4L08j33l62K74K44j58k62K01J93j10
$$ -1 159 -232 -41 224 93 -275 -45 113 -56 -109 -85 223 90 -272 2 246 88 -174 27 220 110
6835A10k00J76M5l16L1J13J40l61J35J23j8j45K32P3Q7m03J57J15p4l32Q0K85
$$ 110 -90 86 131 -185 -154 -41 99 -262 -127 -4 -22 -167 65 138 225 -178 -21 94 20 -312 -232 53
6857E3j72kJ37R0j55P5J56k2j46k46L31K8k49M6K53o8k74J90Q4j18k09J92K77
$$ 53 -119 -121 16 106 -49 26 182 160 14 -232 99 127 -122 -76 177 109 -165 25 109 -9 -218 -26 251
6880B51l69L7J07j7j34p2K42J35k96K1K23j34J04k32K91j32k49J84K54k02j64
$$ 251 -118 -81 26 9 -125 -197 45 180 -116 -95 128 -6 98 -134 157 25 -224 -40 214 12 -152
6901a52K21J86k23j59P1K61l27J38L6L6j87j30L82O7l51oK84J8l69J25K36m0j93
$$ -152 69 255 32 -127 -56 205 -122 16 52 88 -99 -229 153 220 -131 -137 147 165 -204 -79 157 117 -76
6924g6j43M05q7k61J42K57j64k92J85J0l8j02J43Q2r0j76K32K16k29J51j11J08
$$ -76 -219 186 99 -162 -20 237 73 -219 -34 -24 -62 -164 -21 61 -29 -205 27 243 14 165 54 162
6946A62l50Q2K63k0l10O5K22p6r6J7J76k7k98R4J76O6k60P6J40j78n3K36M9l68
$$ 162 -188 -106 157 137 -173 -108 114 38 -58 -41 135 108 -190 -96 80 146 -114 -38 102 -76 -129 107 156 -212
6970b12M8L33j58j30KK97j52k65K19K70l33j20K16J19m9l68M26r4o2j58L10K5
$$ -212 -164 169 11 -119 -117 180 28 -237 -18 252 -81 -201 15 134 85 -283 143 49 -13 -171 139 164
6992A64p2k29K31Lj56j02K89Q9m34J46K60m4l40J30K19p8k91J01M00l79j08K90
$$ 164 92 -137 94 97 -59 -161 128 217 -217 -71 189 145 -195 -65 154 76 -215 -114 286 -93 -201 89
7014H9Q1l08J54J39k23Q5m0Q5l6k17J25K21L2l51K8K06k22J01J10O4j17j47J80
$$ 89 170 -138 16 155 -68 17 -23 62 26 -191 -66 155 187 -164 -136 70 -152 -51 59 123 6 -141 39
7037C9J23j95l4o7K62j94rL7J43j73k3P8O6k02K94j18N2k28K2J95r2L1J18Jr7
$$ 39 162 -33 -67 -134 128 -66 -75 -38 105 -68 -91 -13 53 -149 145 27 79 -149 -127 68 -24 7 125 126 29
7062B9j80J17K06l26j1J91Lj74J92p4J51l22J5L10q5n8o2K30j62k44J63K96l18
$$ 29 -151 -34 172 -154 -165 26 29 -145 47 -27 124 -198 -183 127 42 -16 -78 152 -10 -254 -91 205 -113
7085a13j7R0Q5j33j15L40Jm6j12J28J18m00R2O8l9j46J96J50L3l92J16K43j43
$$ -113 -130 -40 45 -88 -203 137 138 92 -20 108 226 -174 -82 -14 -53 -199 -3 147 180 -212 -96 147 4
7108Dj99R7K31j97n4J37K25j82l23L23n0m8O7J80j05k02qK68j17j89M9K98j25
$$ 4 -195 -98 133 -64 -118 19 244 62 -261 62 12 -36 31 211 106 -96 -104 164 47 -142 -93 205 80
7131H0j51j93M28q5k32Q4K04j34k02K80qj02n8M6J39j28j26L33l9k59P1K62o8
$$ 80 -71 -264 164 79 -153 -69 135 1 -201 79 71 -31 -89 -43 96 -32 -158 175 136 -123 -52 210 142
7154A42k63M5J61k1j83J33K6J8k38K04L9j31k52L49J86k39j13K35P9k07P4K36
$$ 142 -121 -76 85 64 -119 14 40 58 -180 24 63 -68 -320 29 215 -24 -137 98 177 -30 44 280
7176B80j67k46J89n0J96l59J53K27r3j04p2L12j95k42J96K12k47j64K05Q1k22
$$ 280 113 -133 56 6 202 -157 -4 223 130 26 -46 266 71 -171 25 237 -10 -174 31 112 -110
7197a10m4J44p8Q5O6m7J89l18K4K64r4l01K29Rj1j7l1J56p2j90J16K19k92l6J83
$$ -110 -154 -10 -88 -3 63 16 205 -113 -89 175 81 -220 9 18 7 -10 -41 115 43 -147 -31 188 -104 -140 43
7222D3K18m51J59K23j59l10J10K64r6j25L5K39j50q5K5J75j02j13J16J43j43q2
$$ 43 261 -190 -31 192 33 -277 -167 97 1 -124 -89 150 0 -85 -60 115 13 -100 16 159 16 -66
7244f6P1J00Mk45J85q9P5q0K60k08L3k40M28m2k93M1Q2Q9m08K25J27j55lJ39J29
$$ -66 5 105 109 -136 49 -40 35 -45 215 7 40 -200 228 186 -107 -66 16 105 -303 -78 49 -106 -109 30 159
7269A59k37M1P4O0k88nK35O8j25j41K80p1k30K13N4J26l25j28L21n2k16K21r3
$$ 159 -78 -37 37 97 -191 -196 39 107 -18 -159 121 50 -180 33 87 213 -112 -240 81 29 -187 34 -59
7292e9O1q5J60J13l39j5N0K68j67p3K22J9k91oK77k9l06J41J26L0j48M6O3j4l6
$$ -59 2 -83 77 190 -149 -164 -114 154 -13 -86 136 155 -136 -142 135 106 -200 -59 67 97 -51 -5 58 44 8
7317HJ1L9LL1K0n9o0q5mJ81j90j2J84L2j01k11K00J28k39p6L55j47k43J27K22
$$ 8 19 58 61 92 112 53 -7 -92 -96 85 -105 -117 67 99 -2 -213 -13 115 -124 -200 155 8 -235 -108 114
7342A14j03k40L34J77k45k6J20J64l14o8J78k0j32L7J45mj99KJ37j75q3K36P1
$$ 114 11 -229 105 282 37 11 131 295 -19 -87 91 71 -61 -24 121 117 -82 -80 57 -118 -201 35 106
7365A06k02K9J52Q9k41J07R5J55k92q7R1J31j76j25L47j5k31j53L70j26q1L6P9
$$ 106 -96 -67 85 174 -67 40 135 290 -2 -89 2 133 -43 -168 179 164 -67 -220 150 24 -57 -21 58
7388E8jj64K1Q5N8j35O6J55o6k83K38J62l47n2L72p8J2k29J85q8q6o8L45j16k64
$$ 58 57 -107 -86 -1 57 -78 -12 143 77 -206 32 194 -153 -205 167 89 101 -128 57 -31 -117 -185 160 44 -220
7413b20N9L93k64j26J82J75j00l06J87K11k62K9M5O2r0j77L08j26j39J58J45J5
$$ -220 -161 232 -32 -158 24 199 99 -207 -20 191 -71 -42 3 65 -25 -202 106 -20 -159 -1 144 159
7435A59k21N3J99q6l68J86K03q2j39Q0K18k16j31M4K70m52J92J56m5n6L7P4K9
$$ 159 -62 -9 190 104 -264 -78 125 43 -96 -16 202 -14 -145 -101 169 -283 -91 65 20 -36 1 75 104
7458A04j47k12M75l74J5N6M04l50j45K92n4j21NO9M0q9r3J91K16m31J26P8J83
$$ 104 -43 -255 220 -154 -139 -83 321 -29 -174 118 64 -57 -52 17 57 -32 -125 66 282 -149 -23 55 238
7481B38j75j9N9k8k21K7J38m2L5r5K27j63l1j48L15j01j59J70O5k46M1J81J54
$$ 238 63 44 103 75 -146 -119 19 -23 12 -83 144 -19 -50 -198 117 16 -143 27 92 -154 -113 68 222
7504B22k40o8L06j53j41q3K08p6Oo1K47k00j23J06K71k54J1oJ38k78k2K07J20
$$ 222 -18 -86 220 67 -74 -157 51 -25 -19 -80 167 -33 -156 -50 221 -33 -22 -28 110 -168 -190 17 137
7527A37j14k25J93mk5j74L09r5Q4k9J87q1k03L8O6r0j60J66J83j41j61K13Qj38
$$ 137 23 -202 -9 -13 -38 -212 97 2 86 57 244 163 -40 -2 64 -26 -186 -20 163 22 -139 74 82 -56
7551e6j52L03L5j14k01K89Qj30k9L24j25k75J0K31M7k47J32R1j90j30J07K72j81
$$ -56 -208 95 130 16 -185 104 112 -18 -47 277 152 -123 -113 118 165 -82 50 141 -49 -179 -72 200 19
7574A9k33L17M4j88n4P5J12k32j20L30q2j19q7K50N1k62K27j10K2r1M6R5R5k41
$$ 19 -214 103 147 -41 -95 -20 92 -140 -260 70 -12 -131 -218 32 83 -179 48 -62 -40 -131 -85 10 105 -136
7598a36J1K06j23J1J03J0k34J22J75K5k88K6K50l34J9O9J17J18k46RL52j61k70
$$ -136 -125 81 -42 -31 72 82 -152 -30 145 170 -118 -92 158 -176 -157 -88 29 147 -99 -90 262 101 -169
7621a69J27J98k20p5J74J08j07j53L2J98j61Q3J4P6k29L4J59p5j09O9J44l4nr4
$$ -169 -42 156 -64 -139 35 143 36 -117 -85 113 -48 35 49 125 -104 -70 89 14 -95 -26 118 84 79 -15
7645a5O4j34m4k4L24j87k35K42O9j28OR0N2j49l6J18L0n2MN9M1k21R3Q4Q1k18
$$ -15 49 -85 -129 -153 171 -16 -251 -9 60 -68 -62 28 80 -69 -105 13 43 -9 -5 54 95 -126 -33 51 132 -86
7671h6j5L27k68r0J09J53j78r3K47P0k23j33K15P7l10K17P5k3j62p8L51j02j77
$$ -86 -101 226 -42 -132 -23 130 -48 -141 106 176 -47 -180 35 112 -198 19 94 71 -91 -169 182 80 -97
7694i7NK71j94n1J14O5j69j42J95Q6j40n6K74Lk84NK51j03k03N0K85j49j57kJ59
$$ -97 -92 179 -15 -66 48 113 -56 -198 -3 83 -57 -113 161 164 -120 -115 136 33 -170 -120 165 16 -141 -143 16
7719A6J71l63J22J42j50j85K70P2j20p6K00r6l9K4K6J36k88N6J45q5o8MJ17O9
$$ 16 187 -176 -54 88 -62 -247 23 95 -25 -101 99 3 -36 -12 14 150 -138 -82 63 -22 -90 -86 31 100
7743A00j62L3N8p8o5J59P5j56j13P3K67j88k44L41k6j13q7K34n3j70k0L06j55
$$ 100 -62 -29 29 -49 -114 45 120 -36 -149 -76 191 3 -241 100 74 -39 -126 108 55 -115 -135 171 16
7766A6j62J73OJ9l15K54N4pj40J91o6j09l7Q8O6j73k0J89O0j96K16mj31j60l0
$$ 16 -146 27 33 52 -263 -9 45 38 -102 89 23 -86 -123 -35 31 -142 -162 27 87 -109 107 103 -28 -188 -218
7791b18K81j25P0r9L13j21k06K55j18M0k84K92L1j75L8P1J1j07M4R5j2j15l0J71
$$ -218 63 -62 8 -91 222 101 -105 150 32 72 -212 80 111 -64 -26 45 56 -51 -7 88 76 -39 -69 102
7815A02P6j66k94L58p2j78K05K5Q4j18k5R1N0k05J17Q1k12j3K15N3k7j20M8k1
$$ 102 178 12 -282 76 4 -174 31 56 140 22 -3 88 138 -67 50 131 -81 -94 121 174 147 27 75 54
7839E4n2K7O7L4k67O5L4J7r3K1J58J5l30L02J8j79qQ1L78l61n2J12M5j67J32L9
$$ 54 2 29 96 130 -137 -72 -38 -21 -114 -93 65 80 -250 52 70 -109 -117 -36 342 -19 -71 41 86 -81 51 90
7865I0p8p0JJ04l6k06R9J97m0j25Q6r0j30J03J1K11j58q9L0J34p2j28J82O1r5
$$ 90 12 -58 -57 47 11 -195 -96 101 61 -64 22 -68 -198 -95 -84 127 -31 -120 -90 44 -28 -156 26 87 -8
7890hr8J53L3j03K4R5l4l55J91K54m8k56M4J53j35P5M6l6j6n3J83j03n8K0R2j7
$$ -8 -106 47 80 -23 1 96 62 -293 -102 152 104 -152 -108 45 -90 -15 31 -5 -21 -74 109 6 -52 -32 60 43
7916D3j36N6J9J18l31J27K54j53m8l9J93p7k11K84O3k89Q5J34j6k6k38J42P9r0
$$ 43 -93 -37 -18 100 -231 -104 150 -3 -51 -90 103 26 -185 99 162 -127 -42 92 76 50 -188 -46 33 -57
7940e7J8J93k9j14j02J43j0q4n8J56j97N2j02M06k02j11j4L37j87k74M57j50j50
$$ -57 -39 154 125 11 -91 52 42 -42 -100 56 -141 -89 -191 215 13 -98 -112 225 38 -236 221 71 -79
7963g9J3O9k3j41n0J39K29k34j2L07k98j26J66J00j78q7J06Q8O2k02J76R0j97
$$ -79 -66 3 -20 -161 -211 -72 157 -77 -89 218 -80 -206 -40 60 -118 -205 -99 -11 51 -151 25 115 -82
7986h2KJ29J83j01j06J3lk78J95J69j9k31J98M5j46j17J52J70k23O0N9k6j35l3
$$ -82 -80 49 232 131 25 38 35 -243 -48 121 102 -129 69 114 -32 -149 3 173 -50 10 69 43 -92 -125
8010a25Q5P8n7Qp8J67j77j5J62K2n8k21L23Pl05L1L73l00J1L6K56j3l74J44Q6
$$ -125 -40 38 -19 -11 -89 78 -99 -114 48 70 12 -209 114 121 -184 -153 220 -80 -69 -33 223 210 -164 -20 66
8035F6j22j08J55J06j35M2P1Q8k92JJ83Q5k37o4J57N1j12j20K45o9J2k4R8Q0l16
$$ 66 -56 -164 -9 97 -38 4 75 163 -129 -128 55 140 -97 -161 -4 47 -65 -185 60 -9 3 -21 77 157 -159
8060a59J74O6j17j35J93R1r0k42K33O5k55R9K16j91J4n7K55j85j71K46j1Qj66
$$ -159 15 81 -36 -171 22 113 23 -219 14 79 -176 -77 139 -52 -38 -95 160 -25 -196 50 39 47 -119
8083a19J89N0q5Q0L3ok25lJ09L2j15%K38j32k22K18P2j27j64L0K27m9k18K06J31
$$ -119 70 120 35 115 148 142 -83 -86 23 55 -60 -60 178 46 -176 42 114 -13 -177 -147 80 31 -187 19 150
8108A50j55J3K4L8q7j43J00J73l5r7J63j10m5J6J33m5j79o0J54M5k36K97j04R
$$ 150 -5 8 32 70 -17 -160 -60 113 78 -19 144 34 -11 5 138 93 -86 -146 8 53 -183 114 10 19
8132A9q2J12J01Ll18J23J84j91j39J68J86l34R5J86j05k22Q0L07j56j01K5J15
$$ 19 -63 49 150 153 -165 -42 142 -49 -188 -20 166 -168 -73 113 8 -214 -134 173 17 -84 -59 56
8154E6Jk46K77j47R7QpK53k61j4q4K31o2k24K19N3k87K7K96j94o2m1M4O1j08N9
$$ 56 57 -189 88 -59 38 46 39 292 31 17 -67 164 102 -122 97 150 -137 -110 186 -8 -70 -111 -67 -6 -114 -55
8180e5lP6j62J09M8M4q1o5L21k29j67
$$ -55 -58 18 -144 -35 13 57 -24 -89 232 3 -164
8191a64
$$ Imaginary data points
##PAGE= N=2
##DATA TABLE= (X++(I..I)), XYDATA
0@%%%%%%%%%%Qj6J6k1K9l2M0n2O0p2Q8j04J23j47J76k08K40k75L16l64M19m77
$$ 0 0 0 0 0 0 0 0 0 0 0 8 -8 8 -13 16 -16 24 -28 32 -40 48 -56 67 -80 96 -112 128 -147 169 -195 224 -253
32b53N42o14O94p83Q82r91J106j234J375j528J695j877K077k297K536k798L083
$$ -253 289 -325 369 -414 468 -523 583 -651 724 -804 891 -986 1091 -1206 1330 -1468 1615
49A615l396L742m122M543n013N536o124O794p562Q451r493J0739j2259J4162j6624
$$ 1615 -1781 1961 -2161 2382 -2631 2905 -3219 3575 -3987 4464 -5029 5710 -6549 7613 -9011
64i011J9952k4729L2204m5663P7492k95874k49813M44467J52633o8704r1597J01512
$$ -9011 10941 -13788 18416 -27247 50245 -245629 -495442 -50975 101658 32954 -58643 42869
76D2869J08588J49104Q9291l1445j31067K9057J64124M6801k11666j51555J02498
$$ 42869 151457 300561 389852 358407 227340 256397 420521 467322 255656 104101 206599
87B06599J16421j58330k36433p5479K7926m021M66m6311j47488q6335J39635J51510
$$ 206599 323020 164690 -71743 -147222 -119296 -123317 -122851 -169162 -316650 -402985 -263350 -111840
99a11840p0821j37139O1808J67734M7819n8773j120P9029Q2305O2562M7864j6576
$$ -111840 -182661 -319800 -257992 -90258 -42439 -101212 -102332 -23303 59002 121564 169428 152852
111A52852n9779L6511J37953K1098j50562q0452Q6770M5352r1247q2374r390j1649
$$ 152852 93073 129584 267537 288635 138073 57621 144391 189743 98496 16122 6732 -4917
123d917j7732Q133k3661q7240m7482O7725P2618n1923r0285L5034J09218K0891
$$ -4917 -22649 -14516 -38177 -125417 -172899 -105174 -32556 -84479 -174764 -139730 -30512 -9621
135i621m1542J9756N0153J499L160L7321j2670o0838J6150Q4925k327r7225l0499
$$ -9621 -51163 -31407 18746 20245 23405 60726 48056 -12782 3368 88293 85966 -11259 -41758
148d1758O8665K8875n1627k9785K0237l277k4532J9640K8993l3630l3220N5973
$$ -41758 26907 55782 4155 -25630 -5393 -8670 -33202 -13562 15431 -18199 -51419 4554
160D554N8952m4834n2599N2404N9908l7403m3402L1612K0967l6169p153L6254
$$ 4554 63506 18672 -33927 18477 78385 40982 -2420 29192 50159 13990 6837 43091
172D3091j2113n5947K805M7537k0253p1060q66N1183j6998n9955J2147M8891j7919
$$ 43091 30978 -24969 -22164 25373 5120 -65940 -66806 -15623 -32621 -92576 -80429 -31538 -49457
185d9457l2396M1834M6874k5506j6048N4474L2721l6555m639O0996J8141m6914
$$ -49457 -81853 -40019 6855 -18651 -34699 19775 52496 15941 11302 72298 90439 43525
197D3525j479N5430n7n9464r383L8920j4263n5755n121K1748l0957m1688K1483
$$ 43525 42046 97476 97419 37955 28572 67492 53229 -2526 -7647 14101 -16856 -58544 -37061
210c7061K2058m7429l5485M5501L3561m6689l1465M7609L6169k7892r737M1155
$$ -37061 -15003 -62432 -97917 -52416 -18855 -65544 -97009 -49400 -13231 -41123 -50860 -9705
222i705J6917j7524K2788M6897j3703m0858K9509N9658j8027n7654R356M6043
$$ -9705 7212 -10312 12476 59373 45670 4812 34321 93979 75952 18298 27654 73697
234G3697j2339m3014J073J1010k9679j6664K9317n212o3364j6856N7224J5498
$$ 73697 61358 18344 19417 30427 748 -15916 13401 8189 -55175 -72031 -14807 691
246F91o0010k3907M8389K6764k4354n531K2021k108q825L4053L0503l4444l4390
$$ 691 -59319 -83226 -34837 -8073 -32427 -37958 -15937 -18045 -26870 7183 37686 3242 -31148
259c1148M7117N8122l0303n6169K0039M7924j0517l0147N951k03k5239Q308L3081
$$ -31148 15969 74091 43788 -12381 7658 55582 45065 14918 20869 20666 -4573 3735 36816
272C6816k4721o0748R206O3582n63o5837j8282M6950J9337k7883p452J6410p138
$$ 36816 12095 -48653 -39447 24135 23572 -42265 -60547 -13597 5740 -22143 -29595 -13185 -20323
285b0323l906L8536J7293m8700k2747O1883M1425n0058m2267L7296L6400k3088
$$ -20323 -24229 14307 31600 -17100 -39847 22036 63461 13403 -28864 8432 44832 21744
297B1744k1367J2208j836j8945J5156K6377k8521m7337K0834N3130j7924n9187
$$ 21744 377 12585 10749 -8196 6960 33337 4816 -42521 -21687 31443 13519 -45668
309d5668O419N0020k639l3514R057J8395j8925m071L7337N446m4172l959N3099
$$ -45668 -39249 10771 8132 -25382 -16325 2070 -16855 -20926 16411 21857 -22315 -26274 26825
322B6825J4961m7000j7263M0815J9087k9807j1536K2507l795k5670J3540K6150
$$ 26825 41786 -5214 -22477 18338 37425 7618 -3918 18589 14794 -10876 2664 28814
334B8814k8611l7094L0491L8791l2722m1736K5633L2648k2535k2260K2394J2477
$$ 28814 203 -36891 -6400 32391 -331 -42067 -16434 16214 -6321 -28581 -6187 6290
346F290k3404j521L2667J35l7294J800M5845M278m3278k803M1718Q25l4966N769
$$ 6290 -17114 -18635 14032 14167 -23127 -21327 24518 28796 -14482 -17285 24433 25258 -9708 -3939
360c939K7606j6217k3559K5204K0602l3651k3688L3081K1885l3338k3454K8236
$$ -3939 23667 7450 -16109 9095 29697 -3954 -27642 5439 27324 -6014 -29468 -1232
372a232J9594k5624j4758K4971P027k6220J982L2513o993l5888J2544L9676j3710
$$ -1232 18362 -7262 -22020 2951 9978 -16242 -14260 18253 11260 -24628 -12084 27592 13882
385A3882l8647J4407L5111j4290k7943J5495J9841k0370j6207K2762J1258k8536
$$ 13882 -24765 -10358 24753 10463 -17480 -1985 17856 -2514 -18721 4041 15299 -13237
397a3237j0455L2498R821l5645r511L6906Q399l4543k359L4440J65k7880Q734
$$ -13237 -23692 8806 18627 -17018 -26529 10377 18776 -15767 -18126 16314 16479 -11401 -2667
410b667K7040j3839k3242K0512K3680k2818k3736K3535K1352k6955k3830K2571
$$ -2667 24373 10534 -12708 7804 31484 8666 -15070 8465 29817 2862 -20968 1603
422A603J6543k6901j6102K3711O291k9145m006K8587l150l0884Q217L3529p417
$$ 1603 18146 -8755 -24857 -1146 5145 -24000 -28006 581 -2569 -33453 -25236 8293 876
435H76k9086J3523L2480q692k2455J7314K5537j3197j6610K2168J6855k4201j4112
$$ 876 -28210 -14687 17793 9101 -13354 3960 29497 16300 -310 21858 38713 14512 400
448D00K7686J0615l3173j3147K7366K405l4865p224K4014n816l0064L766K3641
$$ 400 28086 38701 5528 -7619 19747 22152 -12713 -19937 4077 -1739 -31803 -28037 -4396
461d396j2603k7449J4213K7003j4731k2121K2861K7825j5693j5348K6444K0147
$$ -4396 -16999 -44448 -30235 -3232 -17963 -40084 -17223 10602 -5091 -20439 6005 26152
473B6152j9412o671L0074R880k6078l043K9448L06l2518l094K5291o891l1635
$$ 26152 6740 69 30143 40023 13945 10902 40350 40656 8138 5044 30335 23444 -8191
486h191P22J9603j4938k7152J0267J7690k1516k1558K1763J9833k2104j5180K7223
$$ -8191 -7469 12134 -2804 -29956 -19689 -1999 -23515 -45073 -23310 -3477 -25581 -40761 -13538
499a3538J7684j9897n265K9289J0977k0059J062K8013L25k4501O980K8327r757
$$ -13538 4146 -15751 -21016 8273 19250 -809 253 28266 28591 4090 11070 39397 29640
512B9640l0685Q603K4553j6710k9016J0951J7024k0472j9271J7207J0594k4254
$$ 29640 -1045 7558 32111 15401 -13615 -2664 14360 -6112 -25383 -8176 2418 -21836
524b1836j1497K4723J0030k4610n264L1063Q818k5059j59L0293K240k3384P207
$$ -21836 -33333 -8610 1420 -23190 -28454 2609 11427 -13632 -13791 16502 18742 -4642 2565
537B565K5436r176k2346J3306J9957j9654k3589J5773J6929k1733j9911J7115
$$ 2565 28001 18825 -3521 9785 29742 10088 -13501 2272 19201 -2532 -22443 -5328
549e328J1787k2776j2656K2094Q036k3124k578K9036L290k5640M684L1597j011
$$ -5328 6459 -16317 -28973 -6879 1157 -21967 -24545 4491 7781 -17859 -13175 18422 17411
562A7411k3408R721K5425r396j9782J4594J7626j8926j9965J7116J4196k4092
$$ 17411 -5997 3724 29149 19753 -29 14565 32191 13265 -6700 10416 24612 520
574E20k0182J8393J0632k6734j4300K2384N799k5331j348K5645j841k3748R918
$$ 520 -19662 -1269 9363 -17371 -31671 -9287 -3488 -28819 -30167 -4522 -6363 -30111 -20193
587b0193K9433n586k1339J4890K8515p551j9434J4303K1087j3528j6145J7540
$$ -20193 9240 3654 -17685 -2795 25720 18169 -1265 13038 34125 20597 4452 21992
599B1992J2759k3032j4502K0284N176k9520j0828K3066M34l0149m428K3740k938
$$ 21992 34751 11719 -2783 17501 22677 -6843 -17671 5395 5829 -24320 -28748 -5008 -7946
612g946k4954M715K3086o759j8328J4499K3604j0777j6201K0253K2258j5256j4046
$$ -7946 -32900 -28185 -5099 -11858 -30186 -15687 7917 -2860 -19061 1192 23450 8194 -5852
625e852K3230J6726k1296j1395K2421O418k5423n745K2379k242k7989j375K0700
$$ -5852 17378 34104 12808 1413 23834 30252 4829 -916 21463 19221 -8768 -10143 10557
638A0557p551k6067N233K1023j1010k2341J2193K0842j3273j7327J8502J8626
$$ 10557 3006 -23061 -17828 3195 -7815 -30156 -17963 2879 -10394 -27721 -9219 9407
650I407j6188j1196K3066J3629j9174o450K3841N882k2309j583K3759j362k5048
$$ 9407 -6781 -17977 5089 18718 -456 -6906 16935 22817 508 -1075 22684 21322 -3726
663c726J425K1325p175k4122N239J9252j1226k0652J1570J5932j6539j5642J8875
$$ -3726 -2301 19024 11849 -12273 -7034 12218 992 -19660 -8090 7842 -8697 -24339 -5464
676e464J4301j9345j0445K3148J0631k1057n210K3839N006k0447M31K2145k544
$$ -5464 8837 -10508 -20953 2195 12826 -8231 -13441 10398 15404 -5043 -4612 17533 14989
689A4989k1545N166K0890q651k1981R131J8790j3568j9698J2934J5297j7061j5213
$$ 14989 -6556 -1390 19500 10849 -11132 -2001 16789 3221 -16477 -3543 11754 -5307 -20520
702b0520J7384J1511j8710q222K1125O604k0919l070K3048L068j9974K281K1975
$$ -20520 -3136 8375 -10335 -18557 2568 9172 -11747 -14817 8231 11299 -8675 -6394 15581
715A5581l433j9979O382K0109q332j9330J0164J7207j3608j7008J3630J2505j7601
$$ 15581 12148 -7831 -1449 18660 10328 -9002 1162 18369 4761 -12247 1383 13888 -3713
728c713j2688J7666Q810k0163p688K0100M978k1004j999K1646L79j9502L923K0970
$$ -3713 -16401 1265 10075 -10088 -17776 2324 7302 -13702 -15701 5945 6324 -13178 -9255 11715
742A1715m863j8442Q447J9017r107j6909J2407J6687j3979j4958J4353J1867j7127
$$ 11715 6852 -11590 -3143 15874 6767 -10142 2265 18952 4973 -9985 4368 16235 -892
755h92j0076J7794O588k0230n896J9628J894k0864j184K0078j028j9217L479J8020
$$ -892 -10968 6826 13414 -6816 -12712 6916 8810 -12054 -13238 6840 5812 -13405 -9926 8094
769H094n736j6437R114J6704j0683j5145J3851J5372j4437j3427J6174J1737j6885
$$ 8094 2358 -14079 -4965 11739 1056 -14089 -238 15134 697 -12730 3444 15181 -1704
782a704q577J7999N738j8606l239J8562l95j9366J828J9267l847j9353N127J8132
$$ -1704 -10281 7718 13456 -5150 -8389 10173 9778 -9588 -7760 11507 7660 -11693 -6566 11566
796A1566q064j7637R570J6509j1637j4478J3552J2581j5851j0262J7522Q515j8084
$$ 11566 3502 -14135 -4565 11944 307 -14171 -619 11962 -3889 -14151 3371 11886 -6198
809f198n456J8902L237j8745q23J9040j007j8515K780J8430m141j7446O141J6304
$$ -6198 -11654 7248 10485 -8260 -9083 9957 8950 -9565 -6785 11645 7504 -9942 -3801 12503
823A2503r181j5598J1761J4424j4016j3077J5654J0560j7177q982J7450O351j7360
$$ 12503 3322 -12276 -515 13909 -107 -13184 2470 13030 -4147 -13129 4321 10672 -6688
836f688l980J7570J506j7942L71J8027k095j7705M990J8041o940j7997R143J6936
$$ -6688 -10668 6902 8408 -9534 -9163 8864 6769 -10936 -5946 12095 5155 -12842 -3699 13237
850A3237j0805j5104J3298J3015j4921j0668J5813Q266j7164o207J7633M182j7757
$$ 13237 2432 -12672 626 13641 -1280 -11948 3865 12131 -5033 -11240 6393 10575 -7182
863g182k311J7816O46j8601J053J8461k728j8134N461J7647p871j6706R794J4807
$$ -7182 -9493 8323 8969 -9632 -8579 9882 7154 -10980 -5519 12128 4257 -12449 -2655 12152
877A2152j2147j2404J3967J0645j5392r281J6155P276j6473o092J7029M461j7118
$$ 12152 5 -12399 1568 12213 -3179 -12460 3695 10971 -5502 -11594 5435 9896 -7222
890g222k341J7669L30j7695K484J8087m595j7461P785J6452j0168j5352J1939
$$ -7222 -9563 8106 8436 -9259 -6775 11312 6717 -10744 -2959 13493 3325 -12027 -88
903h8J3828j3224j2414J3712J0025j4867q964J4747O351j6442m592J7270K818
$$ -88 13740 516 -11898 1814 11839 -3028 -11992 2755 9106 -7336 -11928 5342 8160
916H160j8113p25J8428j561j8018M891J8488n868j6283Q590J5627r667j3365J1514
$$ 8160 -9953 -10678 7750 6189 -11829 -6938 11550 5682 -10601 -2011 13616 3949 -9416 2098
930B098J2132j2502j0409J3348Q443j5295q113J5224N218j7398m479J6937J249
$$ 2098 14230 1728 -8681 4667 13110 -2185 -10298 4926 10144 -7254 -11733 5204 6453
943F453j7992J62J7160k984j6381N330J6171o243j3727R535J3727r734j1569J3018
$$ 6453 -11539 -11377 5783 2799 -13582 -8252 7919 1676 -12051 -2516 11211 1477 -10092 2926
957B926J2020j2781r501J4281Q435j5219o739J5410L480j7155k277J5761j667
$$ 2926 14946 2165 -7336 6945 15380 161 -6578 8832 12312 -4843 -7120 8641 6974
970F974j7772J669J5604n118j5980O048J4761p883j3651R630J3123r936j0073
$$ 6974 -10798 -9129 6475 1357 -14623 -8575 6186 -1697 -15348 -5718 7405 -2531 -12604
983a2604J3021J0645j2434o758J5045O607j4277m255J5901K853j5893o92J4950
$$ -12604 417 11062 -1372 -8130 6915 13522 -755 -5010 10891 13744 -2149 -2841 12109
996A2109k368j6734K665J4223o346j5547O144J3062r232j3027R294J1007j0906
$$ 12109 9741 -6993 -4328 9895 3549 -11998 -5854 7208 -2024 -15051 -5757 5250 -5656
1009e656q935J2931Q309j2580n548J5878N332j4376k196J6665K360j5399J061
$$ -5656 -14591 -1660 6649 -5931 -11479 4399 9731 -4645 -6841 9824 12184 -3215 -2154
1022b154J5237k866j4818M295J3105p467j3538Q021J0609j1406j2181J0441R812
$$ -2154 13083 10217 -4601 -306 12799 5332 -8206 -185 10424 -982 -13163 -2722 7090
1035G090j2407r173J2293P039j2829m603J4254L175j3750M45J6479j52j4424L336
$$ 7090 -5317 -14490 -2197 4842 -7987 -12590 1664 4839 -8911 -8466 8013 7861 -6563 -3227
1049c227J5388l538j3744N976J3126p254j2054P837R961j0960j0261J0587P285
$$ -3227 12161 8623 -5121 855 13981 6727 -5327 2510 12471 1511 -8750 1837 9122
1062I122j3560p460J2880M691j4800l950J4369K211j4419P47J5287j525j3549
$$ 9122 -4438 -11898 982 5673 -9127 -13077 1292 3503 -10916 -10169 5118 3593 -9956
1075i956N003J4514n029j2035P969J2705q084j0368R797R289j1218q744J1804
$$ -9956 -4953 9561 4532 -7503 466 13171 5087 -5281 4516 13805 2587 -6157 5647
1088E647O136j3915o098J2774K795j5128k682J3852k43j4672J598J4163l556j2920
$$ 5647 11783 -2132 -8230 4544 7339 -7789 -10471 3381 3138 -11534 -9936 4227 671 -12249
1102a2249N867J2892o278j0600R519J1482q706r218J0973R245j0880p374J2177
$$ -12249 -6382 6510 232 -10368 -849 10633 1927 -7291 3682 12927 2047 -5327 6850
1115F850N856j3071m665J3149R21j5039n64J3829k778j5005L175J3048n297j3239
$$ 6850 12706 -365 -5030 8119 9040 -5999 -6563 7266 4488 -10517 -7342 5706 409 -12830
1129a2830O308J1995p016j0757R357J0548r423p990J2220Q063j2147n428J4431
$$ -12830 -6522 5473 -1543 -12300 -2943 7605 -1818 -9808 2412 10475 -1672 -7100 7331
1142G331M999j4231k825J4194K95j4264N15J3196l427j3691L524J1889o111j2502
$$ 7331 12330 -1901 -4726 9468 9763 -4501 -3986 9210 5783 -7908 -4384 7505 1394 -11108
1156a1108O303J0947p910j0484R800R403j0643p686J2836P394j2668m293J4175
$$ -11108 -4805 6142 -1768 -12252 -2452 6951 -3692 -11378 1458 8852 -3816 -8109 6066
1169F066L641j3322q93J3526m30j3062J713J2666l581j3346M598J1768p221j2629
$$ 6066 9707 -3615 -4508 9018 8588 -4474 -2761 9905 6324 -7022 -2424 9344 2123 -10506
1183a0506P528J0962r199j0271R775Q532j1320o600J2658N140j2445k309J4066
$$ -10506 -2978 7984 -1215 -11486 -1711 6821 -4499 -11099 1559 6699 -5746 -8055 6011
1196F011J792j3188K17J3559n75j2774K470J2253l948j2214N018J0984p352j1297
$$ 6011 7803 -5385 -5168 8391 7816 -4958 -2488 9765 5817 -6397 -1379 9605 2253 -9044
1210i044Q060R407j0018q987J0629O518j1496n402J2100M190j1739k179J2698
$$ -9044 -984 8423 -1595 -10582 47 6565 -4931 -10333 1767 5957 -5782 -7961 4737
1223D737J459j2025N11J2693r94j2146L364J2143m500j1569N802J0381q370r748
$$ 4737 6196 -5829 -5318 7375 6381 -5765 -2401 9742 5242 -6327 -525 9856 1486 -8262
1237h262R113Q232j0733p737J0612N579j1263m451J1125L092j1490j349J2245
$$ -8262 851 9083 -1650 -9387 1225 6804 -4459 -8910 2215 5307 -6183 -7532 4713
1250D713K11j2036J784J2740k701j1696M734J1908n875j0615O799R220q080q113
$$ 4713 4924 -7112 -5328 7412 4711 -6985 -2251 9657 3782 -6833 -34 9186 1106 -7007
1264g007R033O455j0282n895J0323M005j1425l634J1837K371j1829j015J1861
$$ -7007 2026 8481 -1801 -7696 2627 6632 -4793 -8427 3410 5781 -6048 -7063 4798
1277D798n13j1692K649J1594l545j0380N365J0220o550r189P827Q342q693p440
$$ 4798 4285 -7407 -4758 6836 3291 -7089 -1724 8496 1946 -7243 584 8926 233 -7207
1291g207R389O087j0415n288J0724L381j1305k150J1350N81j1816J180J1373k449
$$ -7207 2182 8269 -2146 -7434 3290 6671 -4634 -6784 4566 5147 -6669 -5489 5884 3435
1305C435j1136M085J0929m899r737O300R133p477q152Q352P513r173o187R642
$$ 3435 -7701 -3616 7313 2414 -7323 -1023 8110 633 -7519 833 8346 -827 -7014 2628
1319B628M676j0417l589J0735J840j1246m45J1230q15j1094J829J0901l126j0188
$$ 2628 7304 -3113 -6702 4033 5873 -5373 -5818 5412 4597 -6497 -4668 6233 3107 -7081
1333g081M526R871n382r153O761Q358p841p303Q811O040r520m766J0083L372j1135
$$ -7081 -2555 7316 1934 -7219 -458 7900 59 -7244 1567 7607 -1913 -6679 3404 6776 -4359
1348d359k459J0997J119j0842J61J0671j564j0483K924J0392m055r600N673R175
$$ -4359 -6818 4179 5298 -5544 -5383 5288 3724 -6759 -3835 6557 2502 -7098 -1425 7750
1362G750o534q225P892P400q963o241R602N014r865m086R714K441j0427j384J0290
$$ 7750 1216 -7009 883 8283 -680 -6921 2681 7695 -2170 -6256 3458 5899 -4528 -5912 4378
1377D378k44j0476J242J0574k394j0458L494J0439m637r182O309Q647o833p389
$$ 4378 4134 -6342 -5100 5474 3080 -7378 -3884 6555 1918 -7264 -955 7692 859 -6530
1391f530Q135O194q708m938R408L911r935l165J0176J570j0865j050J0551n21
$$ -6530 1605 7799 -909 -5847 3561 7472 -2463 -5628 4548 6118 -4747 -5797 4754 4233
1405D233j0942J836J0276l485r982N059R374o011q483P539P785p718o247Q583
$$ 4233 -6709 -4873 5403 1918 -8064 -3005 6369 358 -8125 -586 7199 -519 -6766 1817
1419A817N702q888m276R604L765j0310k410J0031J149j0776o6J0413j856j0363
$$ 1817 7519 -1369 -5645 3959 7724 -2586 -4996 5035 6184 -4592 -4658 5755 3899 -6464
1433f464K732R590m592r299N327Q645o223p532P239P002p690n827Q636N486q802
$$ -6464 -3732 5858 1266 -8033 -2706 5939 -284 -7816 -577 6425 -1265 -7092 1544 7030 -1772
1448a772l716R678K732r897j430J0309q3j0505J112J0002k547j0086L245Q880
$$ -1772 -5488 4190 6922 -2975 -4405 5904 5821 -4684 -3572 6430 3883 -6203 -2958 5922
1462E922m699q795N525P798o511p189P388O649q323n128R147M504r084k633R990
$$ 5922 1223 -7572 -2047 5751 -760 -7949 -561 6088 -2235 -7363 1784 6288 -2796 -5429 4561
1477D561J785r980m77J0199n62r587J609R108k988r366L882Q203n461q081N882
$$ 4561 6346 -3634 -4111 6088 5526 -4061 -2452 6656 3668 -5698 -1816 6387 926 -7155 -1273
1492a273O964p239o440P656N384q215m325Q864L843q786k059R469J322r117M56
$$ -1273 5691 -1548 -7988 -332 5052 -3163 -7488 1376 5219 -3567 -5626 3843 5165 -3952 -3496
1507c496R742j314r080K578R208l695q723M219P690n712p555O321O025p560n905
$$ -3496 6246 4932 -4148 -1570 7638 3943 -4780 -561 7129 1417 -6138 183 6208 -1352 -7257
1522g257P460M549q720l376Q829K333r117q61R393J62q834J527R372j688q459
$$ -7257 203 4752 -3968 -7344 1485 3818 -5299 -6160 3233 3395 -5439 -3912 5460 3772 -4687
1537d687L352Q604l975p779N258P158o192o262O241N432p810n026P744L143q905
$$ -4687 -1335 7269 3294 -4485 773 7931 1739 -4523 1718 7150 -660 -5686 2058 5201 -3704
1552c704k641Q483J328q913p84Q694k81q557J792Q787k479p880M195Q272m805
$$ -3704 -6345 2138 3466 -5447 -6231 2463 2182 -6375 -4583 4204 1725 -6155 -1960 6312 1507
1567A507o798O198O824o367n584P155M553p791l946P769K569q426k147Q186R2
$$ 1507 -5291 907 7731 1364 -4220 2935 7488 -303 -4249 3520 6089 -2337 -4484 3702 3794
1582C794r066K49Q575j798q823K441Q638l435p743M718P361n051o044O421O133
$$ 3794 -5272 -5023 3552 1754 -7069 -4628 4010 575 -7168 -2450 4911 -140 -6184 237 6370
1597F370o512m438P534M070p600k981P963J976q388j322Q229k26q962O71Q200
$$ 6370 -142 -4580 2954 7024 -576 -3557 4406 6382 -2006 -3328 4901 4675 -4287 -3616 4584
1612D584k440q288L010P207m358o893M848O428n614n402O775N250o647l816P803
$$ 4584 2144 -6144 -3134 4073 -285 -7178 -2330 4098 -1516 -6918 -143 5107 -1540 -5356 2447
1627B447L579p877k004Q507J399q493j4Q369j446q465K071P586l553p713L810
$$ 2447 6026 -1851 -3855 4652 6051 -2442 -2456 5913 4467 -3998 -1927 5659 2106 -5607 -1797
1642a797O674n018o680N219N709n919n000O644M510p156l043Q021K552p793q44
$$ -1797 4877 -141 -6821 -1602 4107 -1812 -6812 -168 4342 -2814 -5857 2164 4716 -3077 -3921
1657c921Q412K72q091J018Q152j758p870K485P255l405p116M001O136n382o209
$$ -3921 4491 4763 -3328 -2310 5842 4084 -3786 -1301 5954 2549 -4567 -566 5570 188 -6021
1672f021N599N296o635m556P070L507p506k725P967J761p876k92Q212j73p618
$$ -6021 -422 4874 -1761 -6317 753 4260 -3246 -5971 1996 3757 -4119 -4411 3801 3628 -3990
$$ [...]
8191F7
##END NTUPLES=NMR FID
##END=
