##TITLE=1H_3xp
 CDCl3
 8 sc, 
 3.11.2023
##JCAMPDX= 6.0         $$ Bruker NMR JCAMP-DX V2.0
##DATA TYPE= NMR FID
##DATA CLASS= NTUPLES
##ORIGIN= UXNMR, Bruker Analytische Messtechnik GmbH
##OWNER= root
$$ XWIN-NMR		Version 3.5
$$ Fri Nov  3 15:40:51 2023 Russian Standard Time (UT+4h)  she@DPX200
##.OBSERVE FREQUENCY= 200.1313
##.OBSERVE NUCLEUS= ^1H
##.DELAY= (6, 6)
##.ACQUISITION MODE= SIMULTANEOUS
##.ACQUISITION SCHEME= undefined
##.AVERAGES= 8
##.DIGITISER RES= 18
##SPECTROMETER/DATA SYSTEM= spect
##.PULSE SEQUENCE= zg30
##.SOLVENT NAME= D2O
##.SHIFT REFERENCE= (INTERNAL, D2O, 0, 15.7039)
##AUDIT TRAIL= $$ (NUMBER, WHEN, WHO, WHERE, WHAT)
$$ ##TITLE= Audit trail, XWIN-NMR		Version 3.5
$$ ##JCAMPDX= 5.01
$$ ##ORIGIN= Bruker BioSpin GmbH
$$ ##OWNER= she
$$ F:/spectra/data/she/nmr/H-F/1/audita.txt
$$ ##AUDIT TRAIL=  $$ (NUMBER, WHEN, WHO, WHERE, WHAT)
(   1,<2023-11-03 15:40:12.76 +0400>,<she>,<DPX200>,
      <created by zg, POWCHK disabled, PULCHK disabled
       configuration hash MD5:
       00 E9 B6 7A A2 85 ED C7 34 08 36 98 17 FE 4E 26
       data hash MD5: 16K
       CE 34 AE 3F 1C 6F B6 0A 17 EE 73 01 C6 21 CA AB>)
$$ ##END=
$$ 
$$ hash MD5
$$ 1F 09 63 9D 09 15 84 6A 36 DE 9D 32 F5 75 FA 2E
##$RELAX= 
##$RELAX= 
##$RELAX= 
##$RELAX= 
##$RELAX= 
##$RELAX= 
$$ Bruker specific parameters
$$ --------------------------
##$DU= <F:/spectra>
##$EXPNO= 1
##$NAME= <H-F>
##$PROCNO= 1
##$TYPE= <nmr>
##$USER= <she>
##$AMP= (0..31)
100 100 100 100 100 100 100 100 100 100 100 100 100 100 100 100 100 100 
100 100 100 100 100 100 100 100 100 100 100 100 100 100 
##$AQSEQ= 0
##$AQ_mod= 1
##$AUNM= <au_zg>
##$AUTOPOS= <>
##$BF1= 200.13
##$BF2= 200.13
##$BF3= 200.13
##$BF4= 200.13
##$BF5= 200.13
##$BF6= 200.13
##$BF7= 200.13
##$BF8= 200.13
##$BYTORDA= 1
##$CFDGTYP= 0
##$CFRGTYP= 5
##$CHEMSTR= <none>
##$CNST= (0..31)
1 1 145 1 1 1 1 1 1 1 1 1 1 1 1 1 1 1 1 1 1 1 1 1 1 1 1 1 1 1 1 1 
##$CPDPRG= <>
##$CPDPRG1= <>
##$CPDPRG2= <>
##$CPDPRG3= <>
##$CPDPRG4= <mlev>
##$CPDPRG5= <mlev>
##$CPDPRG6= <mlev>
##$CPDPRG7= <mlev>
##$CPDPRG8= <mlev>
##$CPDPRGB= <>
##$CPDPRGT= <>
##$D= (0..31)
0 1.2 0 0 0 0 0 0 0 0.06 0 0.03 0 0 0 0 0.0002 0 0 0 0 0 0 0 0 0 0 0 0 
0 0 0 
##$DATE= 1699011612
##$DBL= (0..7)
120 120 120 120 120 120 120 120 
##$DBP= (0..7)
150 150 150 150 150 150 150 150 
##$DBP07= 0
##$DBPNAM0= <>
##$DBPNAM1= <>
##$DBPNAM2= <>
##$DBPNAM3= <>
##$DBPNAM4= <>
##$DBPNAM5= <>
##$DBPNAM6= <>
##$DBPNAM7= <>
##$DBPOAL= (0..7)
0.5 0.5 0.5 0.5 0.5 0.5 0.5 0.5 
##$DBPOFFS= (0..7)
0 0 0 0 0 0 0 0 
##$DE= 6
##$DECBNUC= <off>
##$DECIM= 32
##$DECNUC= <off>
##$DECSTAT= 4
##$DIGMOD= 1
##$DIGTYP= 9
##$DL= (0..7)
0 120 120 120 120 120 120 120 
##$DP= (0..7)
150 150 150 150 150 150 150 150 
##$DP07= 0
##$DPNAME0= <>
##$DPNAME1= <>
##$DPNAME2= <>
##$DPNAME3= <>
##$DPNAME4= <>
##$DPNAME5= <>
##$DPNAME6= <>
##$DPNAME7= <>
##$DPOAL= (0..7)
0.5 0.5 0.5 0.5 0.5 0.5 0.5 0.5 
##$DPOFFS= (0..7)
0 0 0 0 0 0 0 0 
##$DQDMODE= 0
##$DR= 18
##$DS= 0
##$DSLIST= <SSSSSSSSSSSSSSS>
##$DSPFIRM= 0
$$ [...]
##$SUBNAM2= <"">
##$SUBNAM3= <"">
##$SUBNAM4= <"">
##$SUBNAM5= <"">
##$SUBNAM6= <"">
##$SUBNAM7= <"">
##$SUBNAM8= <"">
##$SUBNAM9= <"">
##$SW= 18.0517328524113
##$SWIBOX= (0..15)
0 0 2 0 0 0 0 0 0 0 0 0 0 0 0 0 
##$SW_h= 3612.71676300578
##$TD= 16384
##$TD0= 1
##$TE= 0
##$TE2= 300
##$TE3= 300
##$TEG= 300
##$TL= (0..7)
0 120 120 120 120 120 120 120 
##$TP= (0..7)
150 150 150 150 150 150 150 150 
##$TP07= 0
##$TPNAME0= <>
##$TPNAME1= <>
##$TPNAME2= <>
##$TPNAME3= <>
##$TPNAME4= <>
##$TPNAME5= <>
##$TPNAME6= <>
##$TPNAME7= <>
##$TPOAL= (0..7)
0.5 0.5 0.5 0.5 0.5 0.5 0.5 0.5 
##$TPOFFS= (0..7)
0 0 0 0 0 0 0 0 
##$TUNHIN= 0
##$TUNHOUT= 0
##$TUNXOUT= 0
##$USERA1= <user>
##$USERA2= <user>
##$USERA3= <user>
##$USERA4= <user>
##$USERA5= <user>
##$V9= 5
##$VALIST= <valist>
##$VCLIST= <CCCCCCCCCCCCCCC>
##$VD= 0
##$VDLIST= <DDDDDDDDDDDDDDD>
##$VPLIST= <PPPPPPPPPPPPPPP>
##$VTLIST= <TTTTTTTTTTTTTTT>
##$WBST= 1024
##$WBSW= 4
##$XGAIN= (0..3)
0 0 0 0 
##$XL= 0
##$YL= 0
##$YMAX_a= 266332
##$YMIN_a= -226244
##$ZGOPTNS= <>
##$ZL1= 120
##$ZL2= 120
##$ZL3= 120
##$ZL4= 120
##$ABSF1= 10
##$ABSF2= 0
##$ABSG= 5
##$ABSL= 3
##$ALPHA= 0
##$AQORDER= 0
##$ASSFAC= 0
##$ASSFACI= 0
##$ASSFACX= 0
##$ASSWID= 0
##$AUNMP= <proc_1d>
##$AZFE= 0.1
##$AZFW= 0.1
##$BCFW= 1
##$BC_mod= 2
##$BYTORDP= 1
##$COROFFS= 0
##$CY= 11.3945322036743
##$DATMOD= 1
##$DC= 2
##$DFILT= <>
##$DTYPP= 0
##$F1P= 15.7292609196834
##$F2P= 12.9074282941183
##$FCOR= 0.5
##$FTSIZE= 0
##$FT_mod= 4
##$GAMMA= 1
##$GB= 0.15
##$INTBC= 1
##$INTSCL= 1
##$ISEN= 128
##$LB= 0.24
##$LEV0= 0
##$LPBIN= 0
##$MAXI= 10000
##$MC2= 0
##$MEAN= 0
##$ME_mod= 0
##$MI= 1.114404
##$NCOEF= 0
##$NC_proc= 0
##$NLEV= 6
##$NOISF1= 3.799351
##$NOISF2= 2.8
##$NSP= 1
##$NTH_PI= 0
##$NZP= 0
##$OFFSET= 15.70392
##$PC= 1
##$PHC0= -23874.99
##$PHC1= 13.85269
##$PH_mod= 1
##$PKNL= yes
##$PPARMOD= 0
##$PSCAL= 0
##$PSIGN= 0
##$REVERSE= no
##$SF= 200.130013532006
##$SI= 16384
##$SIGF1= 3
##$SIGF2= 2
##$SINO= 400
##$SIOLD= 16384
##$SREGLST= <1H.CDCl3>
##$SSB= 0
##$STSI= 0
##$STSR= 0
##$SW_p= 3612.71676300578
##$SYMM= 0
##$S_DEV= 0
##$TDeff= 0
##$TDoff= 0
##$TI= <>
##$TILT= no
##$TM1= 0
##$TM2= 0
##$TOPLEV= 0
##$USERP1= <user>
##$USERP2= <user>
##$USERP3= <user>
##$USERP4= <user>
##$USERP5= <user>
##$WDW= 1
##$XDIM= 8192
##$YMAX_p= 0
##$YMIN_p= 0
$$ End of Bruker specific parameters
$$ ---------------------------------
##NTUPLES= NMR FID
##VAR_NAME=  TIME,          FID/REAL,        FID/IMAG
##SYMBOL=    X,             R,               I
##VAR_TYPE=  INDEPENDENT,   DEPENDENT,       DEPENDENT
##VAR_FORM=  AFFN,          ASDF,            ASDF
##VAR_DIM=   8192,          8192,            8192
##UNITS=     SECONDS,       ARBITRARY UNITS, ARBITRARY UNITS
##FACTOR=    0.0002768,     1,               1
##FIRST=     0,             0,               0
##LAST=      2.2672688,     0,               0
##MIN=       0,             -226244,         0
##MAX=       2.2672688,     266332,          0
$$ Real data points
##PAGE= N=1
##DATA TABLE= (X++(R..R)), XYDATA
$$ [...]
1851g00j83J431k39j030O45J062r57n8Q97k60n17M22N6o80k85L92M4m02J94K84
1871A16n40l81Q83k15k02K47J88l4J54M1p5K43k79L05m28J88m92R5M39l76J59
1892C6M1k15l06O9M45l32j71M41L85n52M84J90n01QK67J93r36L94Q71j040m37
1913f66J273j84j232M60M83q93O7J193k92p56K71J314j133k64Q15K54j211M46
1931e5J236j231m80J318m38j534R89J021j757j63J541j10j434Q54J227j488j51
1948f55J601j83j359J028O47j297k03J017n15j140R13P18j218m13J702n08j234
1965a099J553M89j265K17J073k77j165J076N02j499j92J395o52r70O67N93j226
1982g80j27J492k86j482J277Q42j208n0J348n61j201J050L82r08j18J009l67j234
$$ y = [-700, -883, 548, 309, -721, -76, 986, 29, -29, 868, 608, 91, 513, 569, -111, -396, -4, 40, -362, -168, 116, -424, -805, 78, -137, -339, -92, 96, 62, 216, 257, 182, 425, 146, 451, 23, 211, -281, -186, 253, -123, 36, 77, -138, -444, -375, 70, -262, -433, 8, 393, -159, 325, 515, 14, 22, 289, 482, -454, -60, 811, -229, -666, 607, 423, -809, -349, 134, -759, -692, 501, 209, -547, -276, 1038, -95, -359, 456, 710, -501, -55, 1181, -50, -530, 788, 350, -1184, -195, 826, -931, -1094, 447, 337, -1097, -243, 984, -504, -655, 946, 763, -596, 432, 1079, -218, -421, 596, 81, -1059, -146, 572, -646, -1059, 643, 135, -1099, 454, 943, -322, -105, 968, 691, -474, 602, 1104, -395, -587, 808, 156, -814, -147, 446, -780, -907, 585, 299, -1183, 94, 936, -272, -322, 1026, 465, -736, 314, 696, -212, -330, 679, 312, -922]
2000i22J012K78j256M45P86m56n12J075Lp15n6R18l37r33J176J75r15j76R40n11
2020A9l80L99L95q55N0Q74n84m85M66N19q48Q4P90k61o72P17J96j006M34P35o29
2041d2k84M56J30l19j63O65p11k09P11j83j2J3K45l77j98J64J90l66L34J42l8
2062A48k09J89p6m22L04M65n37j59J30N4O2J06J89m48P6R0K44k62L25l7p7k47
2084i2k9J88j72j11L30lm18K87R8j34K86m69K07J76k96K61j39P8k21k39L77j54
2106a89MK81k04%j00K07j02J27o6K16K3j62n9J31k51O8L2J70j51kK57l46m4N34
2130C74o30K59o0L26p9j18K69j55n04K39L05l86K75k27J61l66K20J28k00N8K16
2151A05J31l15J73K01Jj13J47o9o53M22K86l03j74J79J71o88J49L36j66j99O88
$$ y = [-922, 90, 368, -888, -443, 343, -113, -625, 450, 453, -262, -318, 600, 263, -670, 506, 681, -234, -410, 530, 19, -361, 38, 433, -422, -372, 502, -82, -567, -101, 418, -430, -346, 444, 183, -489, 228, 424, -582, -148, 587, -42, -326, 130, 260, -59, -222, 443, -268, -477, 234, 51, 39, 52, 297, -80, -278, -114, 76, -290, 44, 186, 148, -61, 128, 52, -370, -66, 399, -138, -297, -167, -113, -51, 55, 244, -204, -128, -38, 206, -56, 269, 232, 155, -92, -121, 67, -105, -216, 114, 111, -307, -20, 78, -56, 230, -239, -32, 144, -152, 109, -30, 48, -173, -412, -35, -189, -185, 96, -108, -108, -208, -1, -103, 24, -42, 174, 197, 35, -24, 107, -144, -76, -44, 126, -25, -27, 230, -116, -160, 374, -256, 3, -57, 269, 190, 72, 341, 186, -318, -79, 226, -160, 115, -112, 49, -317, -97, 31, -169, -111, 105, 236, -79, 94, 295, 296, 183, 330, 261, -392, 30, 316, 13, -161, 18, 189, -499, -350, -14, -180, -379, 309]
2172C09L1l89J79L38l69j5J36K73o44P2L62m46k95M75J28n48M21K14m59l72N94
2193eJ97l02M21J97l62m62P46M1o04j50M28j97n31R61k27o40LQ72o67l07R39j04
2215B47p48M81O39o22k99P22P4q45L72M53p97j62K21N32o88J71M39n62m52J187
2235C63k10p09O52M50n89j97Q76l64n25M15M79o17n39Q57N2o58J8N77p62k31P88
2256A26r6n95L90O70p16J12M11R3n48M59O7m80j64O13k93m58K96K40o49K29L80
2277H7m7m51J17M30k84j86L31M18o16M95q5Qk82K87j3m23J28K39m47J02L56l39
2299a75j02K63O0j75j60K84pk41oN95k66O3mLJ68l30J92o4l72m6K76k93J11j49
2323c75L77j69j20M89j14k6J59q7N8l99L19M65m90p6J86Ol50K54k2m41j38N96
$$ y = [309, 340, -49, 130, 468, 99, 84, 220, 493, -151, -79, 283, -163, -458, 17, 145, -403, 18, 232, -227, -599, -5, 192, -110, 311, 508, 146, -316, 430, 471, -133, -283, 145, -52, -583, 378, 151, -489, -486, 386, -281, -588, 351, 247, -501, -20, 619, -3, -302, 420, 494, -351, 21, 474, -323, -485, -264, 268, -420, -249, 190, -372, -824, 363, 153, -556, 96, 546, -43, -240, 636, 272, -253, 162, 641, 24, -515, 342, 394, -264, -246, 331, -431, -662, 126, 30, -565, -175, 495, -221, -109, 302, 395, -153, 306, 373, -107, -271, 342, 49, -409, -113, 127, -522, -293, 87, 40, -411, -294, 136, -148, -334, -3, 415, -201, 294, 209, 217, -65, 222, 209, -214, -86, 153, -294, -192, 164, -175, -277, -14, 46, -129, -289, -5, -12, -253, -259, 336, 70, 133, 129, 132, 300, -30, 162, 98, -274, -320, -44, -337, -226, -375, 2, -167, -287, 202, 88, 62, 221, 134, 192, -207, 112, 577, 87, 11, 197, 203, -147, 107, 85, -356, -494, 102]
2345A02r4o97Q98L05j099N46N06j82m03L67L55o49R4K33l17k59L49p7m74r5Q46
2366B55j44o48L24N74m11j57M25n3n60P50J04m28j91O13m08m29N33J66o48J08
2386b25N81l11q36P41Q3m92J73P54j85l04L89J38p20J87O68l43r57R05L68j042
2406d28K5N22m26n11O79L22o38P3R14p78k87Q05K75o77L6P09l50p22P36j20n99
2427d40L19M42l44p31O01J01n59M1P60m45k92Q83L23r36K68N23k89n48P57j84
2447B50p21J74P03m37p71R06N8p63J22O58q4n80Q80J68r09L9P00l28m6M96k5n47
2469e7k29O72n95l38M52K61q28M48L74n19L2N06J07k99J57L57l07k68M03om44
2490a21K58J64l27l39M43k7o06J91M03j69k38O17k60l4J51J11r9J91J80l55Q9
$$ y = [102, 8, -689, 209, 514, -585, -39, 467, 285, -118, 249, 604, -45, 49, 282, -35, -294, 55, -22, -496, -591, 255, 111, -537, -213, 361, -50, -207, 218, 165, -395, 355, 459, 31, -160, 453, 45, -384, 149, 315, -333, -225, 356, 45, -791, -50, 33, -459, -286, 468, 283, -21, 368, 506, -214, -27, 641, 298, -659, 246, 614, -428, -403, 119, -307, -818, -139, 183, -455, -382, 532, -246, -533, 272, 547, -130, -94, 615, 265, -457, 279, 159, -440, -121, 321, -23, -754, -153, -52, -611, -570, 190, -255, -547, 336, 659, -277, -9, 514, 225, -323, 434, 250, -471, -297, 406, -31, -802, 104, 162, -601, -479, 179, 95, -485, 395, 563, -346, -307, 393, 65, 19, 515, 490, -57, -286, 386, -209, -547, -95, 166, -662, -214, 160, -359, -327, 179, 286, -13, 144, 501, 194, -74, 329, 323, -121, 137, 301, -26, -365, 78, 51, -555, -364, 39, -130, -368, 249, -11, -45, 106, 217, 118, 309, 489, 134, 223]
2511B23j34J83j41K1j44p7k50J12LL02p6j37J76k8j56K84J78p2K72k58k59J27
2533A49Lr5O7n7j43j98R5k2K66k18p0J64K3nK90n9N3l69M72R8m63L3J02j75R2
2558C3j40o3l6j20M94m44J65J65N7k73L6K6K89l03L30j17r5K79k46k17m5J29p1
2581a67M39m45L8k3j01P5L63k08m6J45j93N0K02K08l62J71k4j21n9K17k31J0N6
2604fJ67l06j45J75R6k2j88L42J5r3lJ03m18K01N09l64j56Q5J28j72j13N14n83
2627b34J41J85RR4l76M0J30R2j8J92k39n0M39k50k07J93O0m81K62K03k00P6l4
2650B7J27k25j79L75j05k18L28jr3j18K68j99j86L14R1j90J36j48j52r6J08J99
2672F3j11Q1j03L6Q2o2l8k1L60l3l59J82j78K33q9Q1n2j34M5j0j65K23l9J99j56
$$ y = [223, 89, 272, 131, 152, 8, -69, -319, -207, -204, 98, 22, -115, 61, 33, -123, 161, 339, 267, 539, 281, 22, 149, 152, 57, 124, 67, -76, -274, -179, -201, 65, -153, -223, -59, -36, -41, 249, 190, 243, -126, 346, 444, -19, 14, 116, -59, 33, -107, -170, -206, -326, 168, -276, -111, 54, 111, -162, -126, -100, 189, -114, 216, 99, 4, 283, 37, -180, -225, -96, -167, 272, -173, -135, -158, -259, -184, 179, -29, -75, 70, -123, -73, 129, 337, -25, 146, 122, 1, -58, 159, -72, -62, -6, 161, -145, -290, -115, -19, -41, -229, 113, 128, 35, 32, 135, -283, -82, 427, 63, -93, -8, 120, -52, -165, 349, -234, -93, 92, 101, 195, -181, -141, -11, 81, 63, 255, 16, -34, 405, 155, -52, 141, 201, -280, -18, 185, -15, 61, 27, 154, -71, -250, 125, 20, -198, 130, 129, 36, -82, 186, -13, -199, 115, 206, 16, 152, 4, -148, -244, -136, 63, -48, 33, -70, -34, 48, -14, -52, -73, 287, 254, -105, 77, -101, 132, 43, 124, 72, -62, -17, -27, -192, 31, -8, 191, 35]
2697C5m7J66j74m3K11l18J41R5J64k78k37L65o3K78k42j6K33k99J4q1Q5p8J28
2720C9p3M0j42OJ02J2j67j91K01M5o0K01q1K55n4O2p8MJ0j15rO1k28J43J20k88
2746a85O7O1o0o2M1K21k86M14j55O0k39J81P5J61l78O5Kj49J85o4j8p5p4K8j14
2771b98M98k39j62P0J62R9o5K35k27K50k06j24M5o0K02j76k42L8K44j99j65J99
2793a21J62KK24q8r1j8j76L50l84L87j76Q4k42K27j3l55M2l3K03j6R2n8q6J74
2817I0Pl6R8m2k38K65j91J06p3J07J94l96rj35J77Kj47j31N62l37l6K34J9k48
2841a58L33Q1k49l1K53j24l2OM3r1j62K40j99k34K11J03l90j38K88K85J17j74
2863b2K17j72Q5J12l8m72O88k17n81M39J41q7l48K84O7l8m39K87j96J16K06m3
$$ y = [35, -12, 154, -20, -63, 148, -170, -29, 66, 230, -48, -285, 80, 17, 295, 53, 37, 270, -29, -15, -96, -11, -89, 39, -34, 6, -136, -130, -28, -16, -183, -374, -173, -128, -188, 13, -68, 187, 133, 195, 117, 121, 131, 16, 7, 68, -160, -17, 103, -185, -118, -57, -117, -179, -138, 83, -203, 211, 56, 116, -123, 58, 133, 294, -84, -19, -17, -166, 19, -45, -63, -138, -212, -184, -298, 200, -39, -201, -131, 31, 130, 65, 300, 73, 323, 117, -7, 38, -22, 180, 4, -238, -200, 44, -155, -320, -121, 41, 43, 267, 179, 88, 70, -106, 244, -140, 247, 71, 155, -87, 140, 127, -228, -186, -219, -16, -32, 60, 2, -84, 90, 97, 61, 159, 117, -121, 144, -47, 59, -14, 93, 287, -109, -118, -253, -76, -74, -221, -352, 210, -127, -163, 71, 90, -158, 175, 256, 7, -24, 229, 105, 73, 79, 122, 31, -131, 109, -90, -324, -113, -10, -400, -538, -250, 35, 152, -22, 195, 23, 108, 220, 182, -290, 398, 181, -400, 39, 180, 93, -255, 29, 96, 58, -381, -94, -290, -174, 32, -11]
2885a1K17n9L58k83o73O90o8k55J34L00m39M4j07L0n8O1J40l25K63K7ppj24K23
2909G1J35k50K3r8p4K12J74j13j62j77K22k9j41J10j0n6L8Q1NnJ79j21P4r6O6
2934E8Nkk21K20j27M0j67J46j83kK15m01L66o4k1K09P8j51Q7J15J20l22j95L98
2958B01k20L4J48m65O6M22k47o3L6m7P4j69K39l8L90k62m7M9K41k93j64K12j09
2981a2LL09l48M2L9k9n9k6JL16l81K57j39J51o9p9K86j83J09K8j33l00J97M25
3005D05l18j87Q0J3j12l1J20k87K86j98K77j70M71R0l71k94M42j44l30K92L21
3026C55n14l3J50k5j12L91k54j77L44J73k85j35J18J5L1k16K61J4Lj83L94k46
3048F9j61J7j34j36K12K58m43J02K70p7j80L29p0k13%K43k4P9J56j43r0k27J81
$$ y = [-11, 206, 147, 505, 222, -451, 239, 171, -84, 50, 350, -89, -45, -152, -122, -180, -119, 21, -304, -41, -14, -21, -28, -152, 71, 206, -44, -21, -119, -193, 19, 193, 80, -82, -259, -37, -66, -207, -97, -107, -163, -125, -44, -39, -44, 135, 14, 88, -8, 58, 63, 61, -160, 60, -67, -27, -194, -48, -231, -233, -18, -419, -53, -117, -138, 71, 149, -2, 85, 200, 320, -2, -197, 201, -19, 15, 163, -302, -236, 186, -61, -124, -88, -135, -61, -230, 9, -29, 361, 99, 52, 101, 342, 49, -115, 97, -12, -9, 300, -48, -6, 33, 4, -55, -81, -80, 236, -145, 112, -27, 124, 55, -24, 262, 79, 188, 216, 83, -217, -20, 405, 87, -100, -20, -7, -119, -150, -30, -317, -31, -229, 48, -122, 349, 439, 68, -226, 216, 72, -258, 34, 355, -159, -192, -42, -67, -179, 212, -42, -219, 125, 298, 13, -122, -4, 11, 42, -174, 87, 101, 104, -79, 315, 69, -92, -75, -209, -345, -133, 125, -318, -216, 54, -23, -203, 126, 56, -157, -157, 86, 62, 141, 297, 154, 64, -163, 18]
3071A8j19p1J22R5k33%L49k36j78K29p9J68o4P9k79K42R8j20J63k37N8o8O1nJ37
3096A30j59O5J81l66k6K37j66J24j25M31l79j46K29L3j9L6J03k35j7J1M1n5qj74
3120b54K91j74N9j10L13k17J24M1j15K49k93J98j88N6K34K1l68J08rk28J32R7
3142c3R5J18N1m08Q2Q1j8R1m6j83M83j78l3k7R6J25j07m28K45K2M7r7J95k52k28
3167c07L00rO2jj2q6J6Mk38L11n0j6m4K15n4m2k32L11j35j3L38j37l65J33j14
3192a65L8q6K63j44r4J43N3j34P1J62K23k67k49L43J6l17J12q0J17J49m71M66
3214A49q0j79m8l4K40j9J03K51m49qJ86j32P4p3J17k22l7K93j75j4J53j99j0J32
3238A9%k15K75j88N1L87n19K13L1j8K26j25j5j2j40J53l0n1k93J93P6k58K52p2
$$ y = [18, -101, -172, -50, 45, -188, -188, 161, -75, -253, -24, -103, 65, 1, 80, -199, 43, 141, 21, 184, -53, 5, -63, -2, -7, 130, -29, 36, 217, -149, -175, 62, -104, 20, -105, 326, -53, -199, 30, 63, 44, 80, 183, -52, -69, -58, -17, -72, -80, -254, 37, -137, -78, -188, 125, -92, 32, 73, -42, 207, -86, 112, -76, -20, 214, 235, -133, -25, -34, -262, -130, -33, 62, 180, 231, -177, -95, -14, -32, 59, 13, -170, 313, 135, 102, 75, 171, 296, 189, -239, 6, 28, 75, -22, 173, -79, -307, -7, -16, 46, 45, 33, -53, -37, -33, -271, 40, -10, -26, -70, 145, 91, 49, -183, 128, -7, -20, 318, 181, -184, -51, -165, -127, -213, 50, -94, -188, -45, 8, -126, -55, 107, 330, 63, -186, 157, 173, -144, -32, -112, 5, 154, -317, 149, 69, -110, -158, -192, 48, 29, 132, 383, -66, -74, 112, -20, 54, -19, 98, -124, -161, 132, -43, -57, 96, -103, -113, 19, 19, -196, 79, -109, -58, 329, -190, 23, 54, 36, 262, 137, 122, 110, -30, 123, 93, 42, -251, -58, 18, -240, 12, -60]
3262f0N3N7K0j77L57j70oo5P0N3k01j4K87m1k10K35m08L51j89O3n9J81l7j57Q8
3287B1j26J05q2L1J00j2P3l3l05K43k76L95j86k36L98r6O1j25k2J50K77m73J52
3310C4J10k66J42J66j16n1M2j90O8J17r4jm6n9J43P2j64j7m5K06P0P1k42P4P9
3335A03o3K17m71J01J33Q1n9j71nJ59j54J77j7j42J32K6j57K52k47M4j62L10j44
3358e7QMJ47J76m31l6j29J76J72Q0m16J54O2K96l08K96r6l41L55k73K44j92N2
3381e7M7K40m12R9J65O2m05L11l3K01l56N7k3J94k28L15l6k89K01o5j6m9JJ54
3405G8J04j92L9j96R4K68n7p7Qkk40J26j13J54k43L48j14%M5j95N14m46K55k25
3429f7P8J7P9q6k30OK02J83k68J84k66J31m1J35j39M6K43j59k88K17N6j92J73
$$ y = [-60, -7, 50, 70, -107, 250, 80, 74, 9, 79, 132, -69, -83, 204, 163, -47, 188, -220, 131, -58, 5, -54, 127, 90, -67, 21, -105, 0, -82, -51, 49, 37, 110, 77, -228, 15, -261, 134, -52, -288, 110, 14, 75, -50, -72, 78, 355, -118, 34, 144, -122, 20, 186, 70, 19, 61, -129, -61, 56, -38, -39, -85, -144, -1, 71, -93, -110, -155, 51, 121, 192, -50, 24, 103, 40, 257, -214, -113, 20, 101, 42, -129, -134, 25, -129, 48, 31, -111, 21, 47, -110, 142, -105, -61, -223, 87, -57, -49, -45, 102, 278, -153, -189, -318, -142, 30, 110, -306, -152, -90, 206, -102, 194, 98, -243, 112, -161, 83, -109, -57, -10, 230, -182, -83, 82, 144, -261, 50, 17, 218, -138, -81, -104, 90, -138, 177, 141, -148, 53, -12, -28, -77, -76, 78, 182, -10, 29, -167, -73, 195, 138, 61, 69, 67, -173, -47, -160, -6, -249, 99, -15, -15, 30, -165, 349, -97, 158, -67, 11, 28, 107, 21, -209, -203, -1, 182, -86, 98, -168, -37, -78, 57, -82, -36, 207, 48, -240, -23, 33, -159, 14]
3452A4j55K87k8j59j5j73p3K64M3l35K57N8j34K89J24j17k32P8Q9O9j13j32J27
3475C3J04j70K46K0k16J21l91K77r4J89k43K59J60l91K82j71K43k50k1J54k22
3496h1Q2j9Q5k77N5M7K18l12J48O2j03J11K9J18k95K11R6o9J1rj66r3J19m3N9
3521a6j62K27P0l10M25l20K8N9J16j29j52K00q2J49j05K18l19N3L09j27q3j24
3543g5J47j74K32n3k36Q8J28J92k44j04K86j99O0m8J6l8k05k5L30M5P7l07J22
3566A5o8k8J42k9k6j15K60l2k9m2j4K72k73J83o7J6P9j63R5k06J31k19J36j14
3590i6j03L31l35Q3o8K37j12L08j75n5J51j9M4k46K72j31M3l43J38j40R1K13k07
3613a19J4L12m01J13N0j96K98k0Kk09K16m2j70M40l30J8L08k82J54j06k4k97J53
$$ y = [14, -141, 146, 118, -41, -56, -229, -302, -38, 5, -330, -73, -15, -149, 140, 264, 147, -85, -7, 82, 151, 38, -94, 33, 137, -33, 213, 233, 17, 138, -253, 24, -70, 119, -124, 135, 295, -96, 186, 15, 258, 8, -13, 141, -81, 1, -18, 67, -210, -155, -108, 110, -202, -54, 8, -95, 16, 45, 163, -132, 79, 175, 106, 117, 108, -58, -151, -32, -75, -16, -178, 49, 119, -191, 234, -86, -58, 1, 117, -12, -164, 36, -46, 103, -2, 216, -103, -50, 259, 132, 49, -75, 72, -102, 130, 77, -159, -71, 57, 249, 5, -99, 187, -12, 48, 0, 16, -22, -227, -252, 78, 123, 200, -107, 15, -53, -81, 61, 32, 6, -109, 151, 119, 90, 48, 34, 306, 33, 216, 149, 165, 244, 81, 176, -30, 101, -118, 18, -96, -199, 132, -203, -120, -188, 49, -63, 245, 70, 15, 166, 147, 191, -55, 217, 86, 129, -214, -76, -216, -125, 88, -119, -105, 207, -194, -81, -31, -227, 71, 51, 53, -156, 60, 18, -152, 288, -42, -24, 284, 2, 156, 50, 26, -271, -118]
3636a18J13k91K99p4k84L66L17l28J43j30j33M6J86l79K28P0j28J86p3k21J96
3657ik82L99q3N5k2q2J15k22L37l02L64m70K73K1j38j65M54k48j64K86J5l8o6
3680B8J04p4j1q6k48M81k13R1M2l83K30K34j40L74j67l41k7L92l49k40L26j26
3702a03L77m48K97n5K54r1k18k1k02m0K09K20r3K8j39j01M8N6J47k55O7J08l03
3725b58L32j76J55j87J50j52m3K35j69m3J94K01o1p7N7l38l5J81K33n8j90k25
3747b74J65K59l8k07Q6K2j15kJ80k67P4K05p2K67m4j55k49M17l81J34j90K75q
3770H2q7R8j13j14pK36k53L9p8L67k65J61k66L78j15K0l6j11L42n03K36J01K38
3793C50m02K26l78K7o2M06j78j35M0K03O2k03O6j5j76K46j49r6L07k1p4J9k51
$$ y = [-118, -5, -296, 3, -71, -355, 11, 328, 0, 143, 13, -120, -74, 112, -267, -39, 31, -97, 89, 16, -205, -9, -291, 108, 25, 80, 58, -24, 91, -131, 206, -96, 268, -202, 71, 92, -46, -211, 243, -5, -169, 117, 132, 94, 28, 132, 58, 47, -39, -287, 194, -19, 72, 114, -269, -39, 195, 55, 429, 262, -79, -106, 286, -63, -303, 23, -103, 274, -174, 123, 68, 322, 231, 13, -8, -210, -250, -41, 179, 86, 114, -25, -126, -78, -22, 125, -130, -63, 45, -258, 74, -102, 53, -134, 16, -136, -179, 56, -113, -156, 38, 239, 178, 101, 158, -180, -215, -34, 199, 141, -49, -274, -109, 150, 112, -95, -9, 13, -102, -104, 76, -191, -117, 88, 16, 283, 239, 84, -165, 252, -129, 5, -185, 90, 82, -5, 93, -20, -134, -141, 95, -158, -119, -197, 170, -95, 66, -200, 178, 63, 83, 47, -64, 278, -225, 11, 112, 350, -52, 174, -204, -177, -239, 167, -11, -146, -106, 97, 159, -44, 22, 7, -169, 77, -72, -168, 139, 118, 44, 63, -188]
3816a88MO7lj3J54J33o2k25J06k1o8K86l40Q9oJ11l09J86K29j68Rj32K02RrJ5
3842E6O1p3n6k39K05K80%m32R2L7J44r6q0J11j53j6k25N05Nk9J04j66k41K44J26
3867A64k76J38l0R6j00J50J32l64mJ97k37J07j73J58k92K89K03m09K91n7o8K92
3889B07K6l26K04n2j5J29k98J72MK3k4p5m8L09k63M3J83l6j85j69K2J91L0j52
3913a00K51L7m37L35n7pK91j66l05M1K31j58k05J56J56q4m9J66k53M66l09J34
3935A34k19M01m44K04k73L28R5n9o9j29J23j42J33N6R5m58L60q7Q4o7j93K29l46
3958b44J51L2J0P3p4q8L95k41N7k26J7K26j73K52l8M2m18J95o3R5m1K94k01n1
3982a9R4m8O5q0l1J84l03Q0J19j4k82M9J04P0k0l29L21q4L4P4k35K08J23pr9K46
$$ y = [-188, -184, -117, -120, -133, 21, 154, 92, -133, -27, -48, -116, 170, -170, -81, -87, 24, -285, -99, 130, -38, -29, -161, 41, 50, 41, 56, 117, 44, -12, -251, -46, 234, 234, -198, -106, -69, 75, -21, -101, 10, -143, -159, -384, 121, 126, 97, 201, 35, -206, 38, 164, -112, 26, -4, 92, -8, 142, 274, -90, -94, 103, -134, -27, -200, -42, -334, -45, 158, -251, 40, -17, -85, 207, 233, -93, 111, 59, 44, 173, -125, 47, 51, 74, 50, -25, -73, 236, -27, 16, 199, 163, -22, -191, -169, 22, 52, -100, 151, 188, -249, 86, 29, 22, 313, 147, -158, -117, 114, -44, -249, -93, 63, -21, -70, 96, -157, 309, 0, 134, -85, 316, -128, 76, -197, 131, 226, 167, 98, -31, 92, -50, 83, 139, 234, -224, 136, 49, 133, 66, -127, 102, -244, -93, -61, -51, 22, -52, -140, 255, 14, 71, -155, -138, 88, -85, 167, 129, 171, -247, -52, -115, -20, -61, 233, 32, -19, 75, 27, 92, 12, -19, 165, -138, -58, 61, 47, -235, -186, -82, -12, -32, -361, -40, -124, -90, -16, -251, -43, 80, 73, -26, 220]
4008B20n1q2q6l6J27j42j19o2J87n0J04l6rJ17j29P5K08%j13N2J57k30J18k11
4032IJ22j1m05L79l5j48mJ8P0J88k87J81j11R5j99l3J64R9L21l66l5j2R2J65m93
4057b36K70J30k47Mj32L74Qk50J35q0J44j46J10j39l5n3K68k70L9J41l2k51J19
4080a29J42o1k0k4J26N7k44J51j40K41k18j37M07k05j8J63KJ6j55L4r9Lj16K15
4104iP6l6K72k75Jk6N2o0J59j59K02l66K55j37j17L34r0K17m02J58k01M14m88
4127b26L25j18k78L38ln8K7Q3r0J2J67l65k6L9J28p4Q6L8p9J35m0Q2l18K30r4
4152g9L36m62L6q5R3P1L8K02mk62k74K42J85P1k99M53k41P7k29j36K95P1k33O7
4176f7j59K55j08m2R5K18l7k03oj08J26O8J28l31R2L7j25J37jRJ12r1k50J55K26
$$ y = [220, 169, 87, 1, -35, 92, -50, -169, -231, -44, -94, 10, -26, -35, 82, -47, 28, 236, 236, 123, 175, 332, 102, 220, 9, 131, 120, -285, 94, 59, -89, -93, -75, -5, 183, -104, 77, -34, 61, -138, -171, -7, 92, 413, 47, 12, 0, 92, 257, -236, 34, 164, -83, -79, -211, 163, 171, -79, 56, -24, 120, -26, 84, -55, -90, -143, 125, -145, -106, 35, 3, -248, -129, 13, -48, -68, -92, 34, 91, -153, -2, -142, 99, -119, -256, 151, -54, -72, 91, 93, 109, -46, -12, -111, -108, -224, -9, 67, 31, 303, 28, 29, 3, 55, -5, 154, -5, 197, -169, 86, -51, -168, 166, 76, 293, -109, 49, -152, 262, -226, 99, -19, -297, 41, 38, -20, 7, 90, 0, 12, 179, -186, -212, -173, -45, -119, -33, 5, -74, 61, 21, 103, -215, 15, -79, 257, -205, -169, -254, -161, -90, -52, 150, 146, -116, -390, -148, 37, 108, -191, 262, 21, 98, -131, -267, 28, 99, -134, -67, -226, 29, -79, -121, -26, 192, 155, -48, -54, -162, -36, 32, 160, -171, -79, -42, -167, -30, -31, -22, 90, -1, -251, -96, 130]
4201A30m0k90K45r3k58M77k00RJ5R9j04P1p2K04j24l77M21k71K13n3N6k06J9N9
4225g0K75j81K98j40j32L9l91M49k1N8l19l5M35l34M2j24K11l27M14o7l14L67
4247A33r2n7Qk7J26M7k39L33p7n33L75q7j31J30K27K03n11L93m80L10k45R2J6
4270h6K42k45j09J79J94n0O0J3m32L53j56J98k37j30J14j37N42m01O7P0m3j94
4292a88O0p2J1M0J92k61J91K03m16L59j55m3j77J15J42j41M48l01j96K9J21K50
4314B11j53r1j03k58M32J0J92q8k15k9QO2K4p7J45lj52J95l24K06N9j21j6o2K91
4339A43j77o3K08j77L7l7J35j14J00n9P1j48n5R4m3J70j20K12n54K28j20K87J14
4362A32j61n8j72L98j88J20j98K53j40o3m6J95J9m2J88k86l5j83L02nq9J85j21
$$ y = [130, 90, -200, 45, -48, -306, 171, -29, -20, -5, 94, -10, 61, -11, 193, 69, -308, 113, -158, 55, 2, 58, -148, -129, -70, 205, 24, 322, 182, 50, 89, -302, 147, 126, 184, -135, -170, 265, -69, -27, -151, 60, -267, 147, 80, -234, 133, 41, -16, -8, -35, 91, 138, -101, 232, 155, -378, -3, -90, -221, -91, 136, 339, -172, 221, -259, 51, -194, -102, -86, 156, -89, -198, -19, 175, 125, 185, 198, -234, 119, -37, 161, -76, -206, -92, -229, 313, -88, -21, 49, 6, -188, -128, -200, -189, -149, 43, -218, -27, 176, -240, 119, -36, -79, -256, -141, 1, -140, 308, 7, -189, -160, -39, 211, 58, -33, -136, -394, 38, 48, 240, 152, -63, -92, -84, -22, 2, -75, 70, 67, -85, 110, -214, -8, 51, -70, -86, -148, 143, -34, -97, 111, -66, -29, -66, 69, -45, 55, -4, 67, -81, -136, -42, -85, 85, -35, 177, -377, -149, -269, 18, 132, -29, -87, -259, 139, -49, 71, -127, 126, -14, -77, -123, 72, 91, 49, 237, -49, -84, -267, 35, 30, -59, 126, 5]
4385Eo9J19L9J42n66K47jJ42m45L68K4K21j46l0r6L1P8o3j13J88J30j22J2j7j19
4410d1p9K10j14N1j19J26j7J03j44mJ26mp8K38r6j52K2p8o0k7J01J0j0QJ54l39
4436b13L54l58oJ03p6L82j72J50l2J52l85K92k18Q4k3j02j16M39l16q7R4J11j28
4459g1R0K08j89j03L85k74R5j17n6J46j49j57J98K66n3n0m08J76p9K95o4o4m25
4482d00M24L0P1j52m3K13j29j4k51J51K6m5J56l0J07k19J28M4m2l42J90J71Pj29
4506g8J54N4l01L0L8K51k84K58j47j29N8K5k8O3J9R6m59M30Q6k74J43j15K70k23
4530f3L2K14k53Q2J93j79J51k58J57J08q5M5j8O4j92K3j23N7J98l71J86k6K83
4553B25l87J95N2k6R5j66q8J69k97J13L25k92L51m37N9j10J67J66r6j2l4L5j09
$$ y = [5, -64, 55, 94, 236, -330, -83, -84, 58, -387, -19, 5, 226, 80, 50, -46, -15, 63, 0, -113, 75, 205, 83, 95, 78, -41, -120, 90, -24, 27, -92, 34, 17, 120, -24, -28, 98, 94, 16, 254, 158, 6, 28, -50, -110, -137, -36, -26, -36, -28, 126, -213, 141, -217, -223, -120, -196, 186, 14, 164, 132, 284, -101, 191, -27, 57, 34, -68, -184, 255, -61, -148, -54, 57, -71, 19, 227, 38, -65, 320, 46, 141, 24, -32, 114, -35, -192, 6, 272, 219, 169, -239, -63, -142, 153, 89, 25, -400, 24, 54, 125, -27, -70, 143, 14, 0, -251, -100, -74, -119, 37, 7, 114, -105, 23, 67, 25, -317, -127, 44, 51, -78, 76, 130, -171, -141, -103, 148, -136, 122, -25, -154, -96, -71, -99, -36, -17, 79, -380, 50, 136, -138, 5, -110, 160, -63, -31, 183, -70, 12, 205, 26, 177, -81, 76, 184, 99, 144, 126, 190, -2, 21, -102, -45, 153, -218, -32, -58, 225, -162, 33, 85, 59, 154, -12, -100, 69, -228, -115, 210, -82, 269, -168, -109, -219, -52, 114, 18, 6, -28, 7, -102]
4576a02K03n7k04K35j83l4l6L21q1Q9r5j44n3J38pj07P0l6L6m5Jo8R6j12q2J34
4602a23Q8L6K34j32QL6k02L01k55q9Q8J50k89J93J29j6J97l88J64k26R2J95j00
4625I1j27k0K22k80L07j73j85pK84MK6k37k5o9J34L1j5J3K03n7l44K10j34K03
4649E5R4j69J09J31j04%j45N0l34K05J31q4j68K39o9j21m9J31L84j45k87K82q4
4672E2O4jr5L8L15j98k07o2K21j85j53J50P4Mj03J63j75K64j94N7n1J83m2j58
4696c9R7k61L34j00J0j43N10k06j27k8k42O5J54O1k73J60m1K29r3J49j44l51L12
4719C3K68j18l51P2rM8k9k6J22j03K79J21n39K16k64L06k16L00o8J23j38j0j07
4742i0jJ04N9j83K1j6K1K56k61K42l62K01O5j58K64l92K57J95j66km8o8J93J36
$$ y = [-102, 101, 44, -160, 75, -108, -142, -178, 143, 62, 151, 56, -88, -141, -3, -10, -117, -47, -83, -47, -92, -91, -159, -63, -175, -257, -123, -35, 1, 235, 103, 111, 147, -55, 246, -9, -98, -10, 140, -149, 44, 173, 157, 354, -34, 130, -96, -4, 191, 91, -36, -56, 166, -114, 193, 20, -165, -172, 112, 116, 142, -95, -120, -189, -55, -24, -39, -26, 177, 120, -224, -14, -148, 55, 149, -20, 89, 220, 116, 116, -29, 21, -313, -108, 23, -61, -229, 10, -59, -180, -229, -98, 286, 141, -146, 136, 52, 116, 115, 20, 58, 373, 175, -32, -94, 127, -58, -211, -61, 13, 17, -86, 77, -98, 166, -28, 29, -22, 161, 119, -39, 58, -203, 131, 31, 41, -102, 408, 202, 75, 47, -195, -130, 24, 85, -188, -28, -69, 160, 67, 216, 72, -279, 33, 301, 183, -168, -96, -105, -57, -86, -112, 10, -93, 186, 307, -232, -16, -280, 26, -190, 110, 42, 165, 27, 17, -90, -91, 13, 72, -111, -90, -106, -85, 171, -90, 152, -210, -9, 56, -102, 162, -230, 27, 222, 56, 54, 6, -62, 131, 267]
4766B67k54pJ6J6q4j02J03J10j05P4N1J01j66k14q9L26k18K37l18L99K9l09J94
4789E7M7l1j09l7k87K60J44J68j23ljq2o2k53L74rk44P1j34K35mm0k43J27L66
4814A87j55L4k57J44J3J59j20K23k76P4j26m7L61l92K79j13L41l58p1N3L35j94
4836I4j0N4k61J64K38p4l23M35k66Mj19J85l49K61o3M4m7L20j11j04J99n34L84
4859A21j93q1K97k44J17k24N29j66k12k12J60K16j20m8K8l13M27m5m63N31j50
4880d5m2M7j17N73n48K47k36J03J0kL2j7K47l75nl5K24o9J86j6j5k05L01j98k06
4905a61Po2L56j52j08r1K78j30n2O9L2k7K91j91j42r9J13j3m1M00n07J71j23J68
4929a4M5j02K29m17M23O6k58j0J55l23L45j20L57k09k21K2j12J4J57P7p7k16K25
$$ y = [267, 13, 6, 22, 38, -46, -148, -45, 65, -40, 34, 85, 186, 20, -194, -283, 43, -175, 62, -256, 143, 172, -137, 57, 104, 73, -36, -73, -360, -100, 44, 212, 89, 86, 85, 3, -59, -312, 62, 53, -191, -120, -254, -19, -23, -63, -306, -179, 187, 32, 66, -191, -47, -34, 125, 5, 228, -48, 26, -100, -147, 214, -178, 101, -12, 329, -29, -100, -47, 288, 94, 84, 138, -123, 41, 279, 205, -118, 317, 51, 55, -64, 121, -228, 33, -30, 14, -33, 287, 176, 72, 271, -263, 121, -72, -153, 144, -100, 17, -207, 322, 156, -56, -268, -108, 108, -12, -60, -32, -345, 82, 37, -426, 105, -45, -87, -40, -157, 416, -132, 115, -121, -18, -8, -10, 22, 5, 252, -123, -128, -163, 61, -8, 178, 162, 147, -58, 243, 45, -161, -154, -216, 140, -12, -120, -211, 67, -63, -115, -46, -14, -41, 250, 59, -83, -182, -69, -82, -123, 277, -230, -59, -182, -14, 31, -71, 158, -259, 164, 230, -28, -38, 117, -206, 139, 19, 376, 167, -54, -32, -144, -130, 27, 104, 27, -189, 36]
4952C6l4p5O0k02L08j90J56P3l49L27j37J12R0j68J94m39J74j33K09J49o1j63
4974f3L12k39n9j00N04n26K03j41J67j62q8L38k14K9m1K6j73J77j13J77n4k6K31
4997A65l48K09P4Q2k44n9L04j09l0j27J40j98J55l8R7j39o3K19j06mm1J23j65
5020a03K86k36L2K09j03l08M56L5l41K21j94K25kl11q9p2K07Q6J14j24j45P0Q0
5043gk9K01n6j20j34J80n0L7j06J32qj43J60m4J06p7j9q5k53N71j14j71O3k27
5067a93L23m4l6Q3j84K77k55J58j8J64j29NK2j28q6J82J89l90l5J38n9o1M3J32
5091I8j03l3J58m8L25n86L62J12k75o2R1J19r0j89J48N1R9j63o2Q7J66k76M8J18
5115I5l9K23o4nM2l69M0R6L7L3P0O8m23J49J62N7m1k43J16J48j64k03Q4O6j06
$$ y = [36, 2, -73, -13, -215, 93, -97, 59, 132, -217, 110, -27, 85, 175, 7, 201, -238, -64, -197, 12, 161, 100, -63, 249, 10, -49, -149, 355, -171, 32, -109, 58, -104, -192, 146, -68, -39, -80, -54, -227, -50, -163, 14, -40, -66, 165, -183, 26, 100, 182, -62, -121, 183, 74, 44, -83, 57, -141, 14, -24, 73, -66, -129, 90, -16, -20, -61, 62, -103, 183, -53, -21, 188, 85, -223, 233, 268, -73, 148, -46, 179, 177, -134, -223, -295, -88, -2, 112, -12, -157, -87, -7, -36, 165, 109, -11, -145, 35, -15, 22, -84, 48, 40, -103, 57, 13, 119, 42, 23, -62, -315, 256, 142, -29, 34, -193, 130, 86, 50, 133, -51, 226, -29, 129, 111, 275, 146, 151, 173, 45, -41, 141, 330, -60, -95, 43, -16, -77, -34, 98, -5, -38, 120, 72, 397, -189, 173, 285, 10, -52, 39, 158, 68, -121, 27, 78, 177, 14, -48, 39, 205, -71, -23, 95, 56, 279, 215, 210, 252, -117, -77, 19, 56, 89, 159, 227, -196, -47, 115, 172, 131, -112, 4, 152, -12, -215, -131, -65, -171]
5140a71L78l27K15k75K61k2n9J26l27L65l0j74P3M1j73R0j49O3j51J80L1J67k65
5163a33J98j90P1m3J11K15k91R9J74J52n70J99j41L69l62j8L17j47J91j56k40
5184a95M79l41J59j81O3P8k4o9k26J55P6J55l5k87L36r6k67L00q4J60n04L47j27
5207a28R8N2N4L1p0l5Rl2L0J7LK98n62M11j78r3L58l83m4L45k59K2k53K07L36
5232B34l77P2r6J70K35l81J5J93j02o9q8L53l82K77n4k4J17k97K01p0l1L48p1
5255A73k94J57j76K6J2K46n08K65o6J04J14j30J59lj50J48j11N7m0m2J66k97J05
5278h5J03j31K67k88L05k37P0K28n0m6k08j06n4N07j11k85r4K87j07M8j29N8R6
5301C8j43K39o1k85J05P2K8J7j71Q0P8l7M5o0m5o3L04j22J5j69K01p4jk36K36
$$ y = [-171, 207, -120, 95, -180, 81, 59, 0, 126, -201, 164, 134, -40, 33, 74, -99, -9, -158, -95, -246, -66, -35, 132, -133, 65, -125, -54, -97, 14, 229, -62, 37, 211, 363, -207, -8, -149, 220, -142, -160, 157, 10, 201, 45, -195, 284, -57, 102, -79, -16, 62, 38, -31, -257, -102, -26, 129, 94, -193, 143, 47, -220, 80, -4, 156, -348, -1, -128, -30, 22, 76, 107, 37, 2, 11, -21, 9, 26, 29, 327, -235, 176, -2, -95, 263, -120, -164, 181, -78, -56, -309, -102, 234, -143, -71, -167, 3, 238, -143, -128, 65, -37, -106, -194, 159, -223, 54, 0, -24, 93, -204, -3, -73, -104, 244, 173, -121, 36, -140, -114, -102, 144, -364, -99, -165, -61, 53, -77, 82, 79, -71, 77, -34, 23, -17, -59, 107, -190, -85, 18, -113, 154, -134, 171, -66, 4, 232, 182, 136, -72, -178, -232, 275, 164, -121, -215, 72, -35, 13, -116, -58, 38, -105, 134, 73, -212, -107, -35, -7, 10, -161, -81, -3, -40, 5, -55, -100, -163, 141, 19, 34, -135, 66, -8, -9, -245, -9]
5326ij06K15o9j02k0J48j96L5J73N1J62q7k60K36j41M9k6J6J07j78K08k53M9j23
5350a21K5NM1r4J86r7m1L8n5j7L01k34M01l06j95K19j2l3K03Q9m03K60l20Q0j07
5375a87Q9p1K19J8j57Qj64J03K37N1j28K45m93J73n2pOO8K38m80k5N9n1K54J53
5400A06j93K9J70K48m14J25k91pK86k5j72O4L5O4J0q3Q2J41K1j59j83N4Q5k7j29
5425a63J53P0L1K3j04N0k05K91j85Q3q4J79k60M17k10m5j34K0M16l61K7O5q6k26
5449b38J02J03OJ67k86J34J07m2j26J73j11R0j67J27r1q1J59j01J16j39J82k42
5471a58K62k24o3J04J30j99J33j26J63k4M07m30m7J36k35K45k94J16k4J33L88
5492C93k71n8p8O5j4j54j81L40P3k20L57l07O6J6lN4j9J77k32K21R1k94M7r0K52
$$ y = [-9, -115, 100, 31, -71, -91, 57, -139, -104, 69, 120, 282, 195, -65, 171, 30, 79, 53, 69, 176, -2, 206, -47, 2, -121, -96, -91, -50, -144, 42, -55, -96, -58, -113, -130, 171, -63, 338, 32, -163, 56, 44, 11, 214, 303, -100, 160, -160, -80, -187, -98, -169, 50, 68, -89, -81, -245, -142, 95, 146, 18, 263, -230, -57, -109, -116, -110, -42, 196, -284, -309, -250, -301, -47, 106, -87, -58, 112, 360, -54, 71, -220, -227, 59, 34, -138, -74, -39, 25, 35, -48, 34, 175, 196, 37, -146, -92, -7, -34, -163, -10, 60, 91, 114, 10, 60, -145, 146, -39, 44, -40, 139, -121, 296, 86, 41, -93, -73, 343, -18, 9, 74, -12, -238, -136, -33, -27, 140, -146, -12, 95, 53, -73, 100, -11, 79, -88, 39, -52, -133, 26, -75, 41, -98, 84, -158, 104, -120, -183, -79, 51, -148, -15, -141, 22, -2, 405, -25, -72, 64, -171, 74, -220, -104, -128, 5, 393, 122, 64, -14, 51, 37, -117, -298, 42, 115, -105, 252, -55, 11, 27, 24, 78, 59, 236, 4, 225, 316, 22, 69, -21, 231]
5517B31Lj44J0J41n13K01R4l72L25M06m40q3L73j68m1n3K48j52j54J77o3j44J35
5540A7N1q0j9ML3J02K00k20k16J96l8j29K5O0K9n0p3R8M26m15n0K96j20j3j33
5565a9L6l01K56J35j20j17J44k55J48o2J32J54K60l18j12L22k50J4l05M02k25
5586h1K19k09l3L28k33q0K8K19N4l72J71j59M12k70l78K11L7J83l26K66O7J60
5608B14j52j19N3%M9MJ42J19j42M3k12j17J91k09mJ83j68J25K20j96m4K00l86
5631b06N7J40P4q7J23R1k09P4o1j51L17k99n2L99j64o0K5N8j13R4p4R8l12N9J38
5656d1J34k44J57q7M7O9Q6J20o2j25J17k95kK44j68J21J2J3k73N0J86k14J22K25
5680A92p9m7k25K87j6l23J74j24L89k83L5M0N5j3k01J51Q2j51J09J22j68M18m52
$$ y = [231, 234, 90, 100, 241, -272, -71, 23, -349, -24, 382, -58, -141, 232, 64, 23, -30, 218, 66, -88, 89, 26, -118, 17, 68, -12, -31, -27, 6, 108, 308, 88, -128, 68, 30, -99, -74, -14, 15, -35, -108, -10, 416, 1, -49, 247, 127, 114, -19, 17, -284, -28, 107, -13, -130, 14, -241, -93, -155, -23, 131, 391, 73, -39, 283, 33, 47, -258, 144, -81, 138, -71, -104, 224, -9, -89, -61, 158, 212, -160, 11, -148, 264, -6, -384, -173, -136, 47, -279, -13, 54, 214, 62, -57, -4, -4, 45, 49, 191, 310, 168, 211, -1, -118, 73, -136, -140, 43, -125, 0, 220, 24, -20, 180, -206, -149, -9, 65, -22, 101, 192, -17, 57, -4, -155, 162, -137, -189, 210, 46, -14, 11, 69, -44, 50, -24, 74, -238, -179, -41, 93, -151, 6, -81, -34, 35, 121, 241, 179, 54, 171, -124, -126, 118, -50, 71, 83, 96, -177, -127, 59, -155, -33, 192, 113, 66, -159, 128, 112, -211, -37, -161, 228, -55, -20, 20, 75, 62, -139, 12, 94, -57, 52, 174, 6, 424, -28]
5703b8J09Mo2j57M01j75j83K60j28k92K95k75mM15m58O02o16M09j39k76M22m44
5725c20M12j55l27M60j88J11K4J44k8J10m18L21j77N8P5j16N5n6J31j18J6o0P4
5748B8m5m1O0J54j03J35l56K63R4k87J58q2mK88k44m4J23N5k40K14l45K96m7N
5772C5n4p2K47j87O6r8J64j19L5K4j39J19L6J20j48rj28J95j45J41L7K22m97o0
5796b15lL75l82J96J66j09J30j38k6Q5j63L00j57J89k33M1k1k43L48j71J1j1j12
5819a43K45l62J06J12K06k80J68j60R6K24j71K00k10J20k68N6m2J78j49R5K03
5840B24p9P7j58n20M91j19J11J5J05r3R6K62l50J26k79n7J11L00k03j05Q8O7j22
5863a2L6Oj50K47l92J08J7Mr6O5L37j95m3O7j46K12j25J30k33J0R7MKm5J84j7
$$ y = [-28, 81, 85, 23, -134, 267, 92, -91, 169, 41, -251, 44, -231, -235, 180, -278, 324, -292, 117, -22, -298, 124, -320, 92, -63, -390, 70, -118, -7, 17, 161, 133, 243, -175, 146, -31, 27, 102, -14, 41, -15, 116, -2, 14, -46, 28, -17, -58, 2, 156, 53, 188, -168, 95, 189, -98, 60, -22, -26, 262, 18, -26, 97, 152, -88, 126, -219, 77, 30, 35, -19, -91, 156, -31, 35, -63, 101, -18, 17, 41, -98, 21, 57, 177, 29, 20, -108, 87, -58, 83, 120, 342, -155, -215, -218, 157, -225, -29, 137, 28, 158, 20, -6, 79, -84, 216, 59, 248, 15, 56, 35, -208, 140, -31, -20, -31, -143, 102, -260, -154, -42, 164, -116, 52, -108, -12, 212, 41, 241, 31, 151, -117, -61, -103, 75, -74, 21, 224, 145, 222, 64, -456, 35, -84, 27, 42, 147, 54, 150, 412, 62, 188, -91, -148, -37, 263, 60, -45, 43, 110, -12, 24, 30, -120, 127, -265, -157, -140, -136, -232, -167, 170, -25, -68, -1, -147, 65, -60, 70, -163, -153, -56, -52, -50, -95, 89, 72]
5889G2K1p6R9l7j37j02K95J05j82K99k81j3J46j35j47J46P3m75M85p4j67J01j
5912A5n7O1j09L32j18j03j35nK22M8m2N7j27j28Q7L0k56K79j84K54o6j05N6M6
5936E2j52K88n26L9M08J7l9O3l69m7N52k80P2r5J8k20K91O6L5J4k26k60N18l06
5960h7n6P6K89n9o1r1j01j73J86k9qKO1Q9p5j34K4N2J33j92M2J65j89j7J88q4
5986d9K32q9mj17J83k37M3J57j30k27L46J32k80O7j69K78Nm13M13k49k3K00p6
6009gl9n9K43j91O1r6J39r1k03K23j54P7j22J08J53m1K5J00k2q8R1n8k31Q7j26
6034b21K60r0l0R5J86j91K78j56qj81J08n0KJ52j85J68k93K15m3J78j24J0j07
6057b7J6L4Q0p8l8j69J33J78k24j96J94K2p9J57J28l14J92j19O9j91K99J76k51
$$ y = [72, 93, 17, 116, 79, -58, -160, 135, 240, 58, 357, 76, 63, 209, 74, -73, 73, 146, -329, 156, 82, -85, 16, 15, -42, 19, -90, 242, 124, 21, -114, -119, 103, 151, 109, 166, 39, -89, -2, 28, -228, 51, -133, 121, 55, -50, 6, 52, -100, 188, -338, -299, 109, 126, 87, 150, -219, -266, 286, 6, 78, -17, 1, -219, 72, 138, 173, 187, -39, -299, 219, -87, -143, -67, 222, 163, 102, 11, -90, -263, -77, -106, -114, -112, -51, 38, -37, -171, -147, -95, 38, -154, -112, 53, -136, -153, 35, -49, 183, 94, 90, -27, 156, -81, -38, 119, -11, -238, 108, 240, -40, 27, -142, 136, 141, -272, 141, -108, -131, 69, -7, -46, -105, 138, -53, 8, -88, 51, -40, -243, -20, -174, -97, -219, -111, 42, 1, 26, 126, 104, 16, 107, 49, -182, -95, -221, 39, -51, -81, 14, 200, 9, 287, 131, 123, -58, 50, 0, 2, 154, -31, 137, -156, 59, 16, 194, 70, 80, -27, -11, 23, 103, 25, -13, -182, -49, 129, -95, -291, -97, -75, -154, 3, 131, -183, 9, -110, -41, -232, 67, 243, -8]
6080hJ73j01K85l79K6K19l99L20o3k78K25j46J76l23M10L9p8j47p5R1j4MJ26q9
6104fl9J6M1K9r0n4J7K15m2l31l4K98jj53N6mN6L69n30J11J9J39J81k61k34J47
6130h5J83k16K78m09N43k62N7j00J52j81L6j46K46J01j80Q6k07M11l04k10J18
6151h9J1K20l28J25J16l8J2n5N1k68J65J50j27K76j25k43M9J63K8n9J06l45K68
6174F3jK95m76N3Q0J67m30J58Mj3j67L43J10m47L68k65K78oj10m3j0j38L02k9
6198H6j3o5J24j77M8j08Oj34J62K17j41k5M6K92j75r3k5M7o5J81j1k19J64j25
6222cj27Q7m5O1J57j58k91K69J84nk91K15m9p8k1J82j37j0J97l62R1J3j27J89
6246e9R4m8j20L64k22j9L4K41r3l20J9K69j02N3J15j80l6j6J4J30k23k5L48k0
$$ y = [-8, 165, 64, 349, -30, -4, 215, -184, 136, 73, -205, 20, -126, 50, -273, 137, 176, 98, -49, -124, -33, -47, -43, 83, -6, -45, -29, 12, 41, -49, -103, -86, 129, 87, -244, -278, 20, 19, -134, -78, -82, -26, 343, -187, -76, -57, 82, 263, 2, -232, -85, 98, -118, 160, -249, 294, 32, 89, -11, 141, -40, -4, -150, 96, 197, 17, 103, -104, 307, 3, -207, -89, -78, 142, -186, -61, 55, 17, 29, -26, 25, -243, -78, 72, -55, 221, 96, -147, -98, 65, 93, 34, 140, -205, 63, 62, 357, -119, -66, 14, 181, -249, -91, -87, -100, -267, 76, 186, -261, 107, -158, 120, 114, 4, -39, -49, -187, 115, 86, 73, 8, 132, -45, 3, -105, -99, -233, -71, 146, 5, -20, 26, 318, 143, 50, 25, 72, 7, 188, 177, -42, 122, -3, -130, -43, -88, -27, 130, -28, -319, -50, 134, 129, -162, 53, 4, -74, -95, 87, -50, -60, 137, -225, -134, -121, -248, -59, 35, -13, -133, 231, 9, -10, 24, 265, 172, -148, -129, 140, 38, 91, 206, 26, -10, -26, -12, 118, -105, -130, 218, 198]
6270A98l08J11j98L11j1j63M9j9qL2J64k13l6j23o2J52K68m8P1k4m0j21p8K28
6294A32K18l81J31k5k74J79k5J80K55k65j51NO0N5j00m6M14k59r6J22l41K36j8
6317Fj86pL26j44P7q5n2k61M06j43OJ45M0K7r4M0k63J63r2L04l09R8Qn0o6j19
6343b25J78k2Q7K98n69L48k08K21k44P1R3Ljp1K2J42k80L20l74K06M9k10J57j5
6367b4j17L2K09m12K6N44k72l6O6KQ4k17J23O1P5m8j7j69J68K0J79k49J44j96
6391b4K06j7j05J11j96J09q1O3k11R0K37r3j23r8J00l6lj13J33j0P2J7q2j21o9
6416b44L27n1j22L9M2P8J35k82J41j56k26J13J51K81l39j24L26k23P5RK57k23
6438a6O2O5p7Nrk70L62j63k48K96P0J37l70K44l4q7k9P4o2K25n44L48O7J11l09
$$ y = [198, -110, 1, -197, 114, 103, -60, -11, -30, -38, -6, 158, -55, -91, -214, -276, -124, 144, 96, 167, 143, 103, -18, -96, 132, 350, -31, 100, 75, -199, -20, -45, 135, 390, 125, -26, -21, 39, 94, -6, -52, 362, 103, 7, 129, -212, 24, 6, -180, -187, 139, -5, 72, -13, -65, -326, 80, -63, -57, 88, 128, 155, 61, 101, -162, 1, -91, 213, -96, 2, 10, -40, -106, -225, -47, -69, 18, 316, -253, 95, -113, 108, -136, -65, 28, 31, 30, -41, -19, 123, -157, 163, -211, -5, 44, -166, -9, -24, -141, -109, 100, -312, -286, 258, -14, -50, 16, 18, 102, -115, 8, 69, 144, 96, 79, -90, 78, 98, 277, 28, 172, -24, 182, 165, 60, 171, -25, 84, 3, 66, -145, -55, 182, 89, -34, -132, -32, -68, -71, -184, -51, -61, 11, 28, -54, -175, -244, 83, 32, -90, -51, -9, 69, 204, -78, 63, -93, -319, -206, -55, 226, -113, -237, 89, -134, -59, -50, 207, -16, 46, 111, 34, 39, 30, -240, 122, -41, -289, 7, 77, 214, -156, 88, 54, -33, -62, 12, -50, 175, -369, -21, 46, 157, -152]
6463a52Q3l2K50j69N3K05j92J75m70M12k83J66k13n4N06m00m1K09n8N4P0k35J21
6486Ej15J94j64p8K29N3J94m91M8M07o15N08l62j7K26J69l16R3J8NK77m14J40
6509fo2j9K44j23j19L4J6j31J73m3L2rP5j30l3J87k13K04n3J86j13j83l1J11N1
6534D5j38K80j89o7j16J85J44N1l00k00K50J78O1j30j09j97J95K1J28p6j40J36
6556A2rJ8j00NJ35O1j45K25M6k34q5k05J85L66m42L18k17j66K02j62K59l06K15
6579b4Q8k8k66L58K6j05k05K23j40K15j07m5R2k15k7J07o9L89m10K93q6q7J12
6602H9p1K1j18J51k32mK03j09O8mm2q6p6L53k22j31J01J41r9k43L99k96L08k61
6626a60J07J47j79J56j4k27J42m3k6K17l70J89J62l40K27OK4j18q7K30r5qJ77
$$ y = [-152, -69, -101, 149, -20, 33, 238, 46, 221, -249, 163, -120, 46, -167, -221, 285, -115, -156, 53, -5, 49, 119, -116, 5, -110, 84, -80, -158, 71, 124, 318, -173, -125, 282, -333, 175, -187, -204, 22, 191, -125, -32, -14, -9, 268, -146, -6, -68, -87, 157, 34, -85, -51, -35, -166, 7, -36, -4, -13, 62, -68, -101, 86, -127, 77, 24, 210, 97, -86, -117, -6, 45, -93, 187, -2, -69, -185, 0, 144, 195, -105, -305, -55, 123, 184, 54, -55, -252, -57, -36, 92, 16, -124, 12, 3, 21, -79, -74, 61, 122, -23, 202, 248, 14, -71, -276, -91, 275, -167, 151, -66, -232, -30, -192, 67, -239, -24, 64, 36, -230, 128, 154, 49, -156, 67, -73, 142, 35, -10, 82, -133, -160, -53, -122, 267, -143, 150, 64, -23, 89, 18, 39, -79, 72, -160, -164, 39, -70, -2, -6, -48, -134, -210, 143, -79, -210, -109, 32, -67, -310, 89, -207, 101, -160, -53, 94, -85, 71, 57, -170, -28, -71, -97, 120, -250, -61, 101, -239, -12, -6, 18, -100, -187, 43, -52, -60, 117]
6649A17k08k46M21O7J4l15J46J33j70K26j05k0p3k55L51j6l21K06J06P0j53L25
6671C00m96K18j51jK52o2J56P8m33J37j29J93J6P2j86K3j93M44l20P8k13J04J66
6694E3j34K96m08L21O4k40o1K37k00p0q7K86j89J39J26j66P3l8J4J26l46L01j84
6717h7J77j99J25j20J55j43K5m0J22j56J2K67JJ31k84n4r3J06N8n8q7M5J35n9
6741b1k11O9J86j33J86R9j94J88P7k53j40L26k4l65K11K7q1K71k2k3m4k01n9J68
6765C7k29O8k33L12j91K17o2j5K99k80J61O4J20j04l36K62j25j83R9K10j11P7
6787E7j47p1K18j82RJ04Q7p3L7o9L5K74l78J17J22j36J81n64K91k4J40J74k37
6810c5n5O5Q6Q1j40L03k76J06o3p5m8J13N7l01PK39K6q4m1J35q9N2o0J00j4j25
$$ y = [117, -91, -337, 84, 151, 165, -150, -4, 129, -41, 185, 80, 60, -13, -268, 83, 67, -254, -48, 58, 128, -25, 300, -196, 22, -129, -130, 122, 60, 216, 294, -139, -2, -131, 62, 78, 150, -36, -13, -206, 238, -82, -4, -217, -113, 53, -81, 215, -193, 128, 192, -48, -109, 128, -72, -142, -229, 57, -132, 7, 133, -33, 40, 2, 16, 142, -204, 97, -87, 90, -109, 16, -104, 51, -92, -67, -107, 15, -141, -129, 138, 139, 270, -14, -68, -161, -55, 3, -55, -142, -97, 38, -21, -232, -163, 23, -110, 76, 175, -19, 169, 246, -7, -147, 179, 155, -210, 1, 28, -53, 218, 196, 173, 129, -72, -131, 37, -192, -124, -357, -45, -236, -19, -81, -96, 203, -77, 84, 148, 268, 164, -172, 90, -35, -218, -119, 91, -20, 57, -90, -161, 57, -125, -116, -12, 75, 2, 39, -30, 5, 279, -99, 18, 140, 4, 185, -379, -88, -112, 28, 202, -35, -90, -25, 61, 142, 2, 305, 29, 135, 72, -3, -51, 62, 119, -182, -175, 64, 90, 6, -35, 100, 11, 63, 3, 103, 89, -36]
6836c6k2J5Q4j97K6J63j15J75n6J32l05K38J76n00m1K24J26q1j27p5K91N9r0m6
6860A8j0J77k2k67O0K45n50N55k34r9J08P7N9k62K78l91M58j87J90r7j72J53j70
6883h3N4K75j35j24L49j09q0j22j09J00r4L18m25L64j72p0J55j29J13k22M5J89
6905H8k25m4J78r2J04r1q0J14J14j33O6j48K15J1k58L31j01Po7j41K74m0j69Q4
6929cj57K93n9l26K07j0J9k18L75K2k71J48K74m84J03l6K08k03nJ29L7j05N5K01
6953A94k28J85j60l6O5j54J90L85m69L7j5j27l2L36j10J44j91m8O5J99j40o0J16
6976A46P3m50K03j62K72j09j65L26o5N7j43j36J28j48J02j19L62j30L2o7J63l29
6998a59n2J48j99K65P4J23j87J74r2p3K4J74l33R5K04l77K19rJ04l09J21K40m
$$ y = [-36, -58, -43, 41, -156, -130, 33, -82, 93, 37, 169, -136, 102, 278, -222, -263, -39, 87, 6, -121, -196, 95, 154, 64, 18, 8, 185, 163, -104, -44, 201, -349, 206, -28, -127, -19, 58, 117, -145, 133, -258, 200, 13, 203, 106, -66, 87, -83, -29, 246, 111, -13, 336, 227, 147, 25, -84, 16, -78, 240, -185, 179, 7, -63, 92, -37, 76, -146, -101, 88, -137, -181, -3, -95, 9, -82, -162, -48, 66, -67, -1, -149, 66, 77, -181, 150, 49, 56, -11, -152, 122, 82, -87, -3, -160, 133, 74, -252, -45, -55, -36, -254, 121, 143, -128, 20, 294, -190, -87, -123, 85, -118, -123, 6, 43, -62, -7, 194, -34, 151, -9, -45, 20, -134, 56, 441, -28, 9, -6, -133, -165, 171, 61, 205, 14, -34, 31, 230, 90, 30, 146, 219, -231, -28, -190, 82, -27, -192, 134, 69, 126, -17, -153, -25, -173, -71, -190, 172, 42, 74, 7, 170, -159, -211, -63, -262, 3, 77, 200, 13, 187, 95, 22, 46, 220, -113, -18, 186, -191, 28, 19, 123, -186, -65, 175, 171]
7021A71k86J67n7J11l4o8l1qR8n6J31k15K58l91L71l33P4J86l35J77j03J86k30
7044b17L37r2K2o3O7Ql9K1o1m3k77M53j66J4M6n4L00l03J83k8r6J37j72j17Q7
7069e3k1J2O0j27K32l36M89l18Q4N5N4p5k49J27J6n6J72j58j24J94K00j00k43
7092a65O4O1K67l60K24j86K66q6k44K07L4l4J95j11k82J46O9Q5J52l55pj14J25
7115d9j41J81J0j67K36O0j38l7p2J11o8j4L5o0K13o9k15J40q3K10k00KK15M6j53
7140gj1K68l92L17Jl56J82K97r4k39L4k1jj75L8J53J22k6J6j63o1j14J76L6L53
7165C33l53j4K15j15l9r2K14j97K49j41l09N60j77j21j37J29r9k4K78j06m5P1
7187H0N3j32J47j93KK7J18j08k52K32J36M0r2j26J89o1k05j59K07P7j50L64j72
$$ y = [171, -115, 52, -5, 106, 72, 4, -27, -35, 63, 7, 138, -77, 181, -210, 161, -172, -98, 88, -247, -70, -173, 13, -217, 120, 28, 50, -13, 54, 62, 23, 44, -17, -60, -337, 116, -50, -36, 10, -44, 256, -47, 136, 108, 12, 149, -23, -140, -53, -74, -62, -2, -129, 103, -233, 256, -62, 22, 77, 131, 56, -193, -66, -50, -106, 66, -92, -216, -22, 178, 78, -165, -101, -40, 227, -133, 91, -95, 171, 85, -159, 48, 82, 48, 243, 132, -150, -4, 65, 150, 302, -53, -60, -174, -49, -190, -9, 1, -166, 70, 130, -8, -45, -117, -6, -74, -88, -53, -113, 100, 31, -184, -44, -127, 83, -117, -115, 100, 146, -7, -18, 250, -142, 175, 176, -180, 2, 299, 205, -34, 0, -21, -22, -197, -159, -6, 116, 90, 106, -57, -118, -232, -56, -20, 333, -20, -34, 181, 66, 27, -65, 149, -48, 201, 60, -249, 311, 134, 13, -124, 5, -94, -118, 160, 54, 9, 80, 133, 1, 148, -45, -43, -16, 102, -6, -258, -26, 110, 150, 58, -68, 121, 60, -145, -304, -97, -20, -170, 194, 22]
7210B2l27K22K80j27k18K42J47k41J5K11m2j80M3k13K44l3k34J30j13K39j70K0
7232h3n6K8K92k85K62l89L31l37K63NR5k02p3q7l2L25j63Q3J16k78m1L11k39K05
7256E1J11j93j96R6O7J44N4l82J97j64J31K35j37r7M4R4R0k17P5j2j96L01l73
7279b77J69K23k63Q4J10J35m9l4k17M7R4k95J63K6L38p6k7j17L8M3K3j74R9M1
7303A04k84M8J16j68K07j3L5k7Q9j6J36k24J21k21oO2M0j4j12O7k17M91l3j76
7327Elk18J13J92l63J75r1Q7Q3O6pN0Ol5l38M26k92Q6m1J18j58M2k54L80l12K3
7353b60L41j16prJ95m1q5j15J54k79K08lJ41j15K17M3k15j66J09J65n3j74J98
7376A33l08J0K87m90K42K25o5k53l4O3K16J57j89q2N3j3K11j55q4MK48Q1m81M97
$$ y = [22, -305, -83, 197, 70, -148, 94, 241, 0, 15, 226, 184, 4, 47, -166, 78, 45, -189, -59, -172, 67, -103, -83, -139, -111, 181, -104, 158, -231, 100, -237, 26, 31, 126, -76, -149, -236, -268, 57, -106, -23, 93, -185, -226, 85, -154, 51, 162, -31, -227, -131, -64, 80, 134, -248, -51, -215, -84, 151, 14, -83, -39, 55, 145, -72, 3, -9, -205, 96, -277, -108, 115, -148, -64, 46, 181, 132, 98, -119, -72, 22, -273, -110, -84, 254, 178, 151, 34, 72, 115, 138, -36, 63, 104, -180, -132, -16, -184, 23, 10, 45, 18, 107, 91, 227, 3, 124, -97, -103, -41, -1, -15, -127, -60, -277, 214, 181, 5, 2, -216, -103, 89, -274, -99, -190, -103, -20, 46, 39, 89, 95, 60, -278, 148, -144, -58, -99, 19, -139, -97, -351, 29, -283, -260, 81, -35, -42, -51, 144, 103, 18, -97, 57, -222, -14, -17, 124, 9, 226, 269, 54, -112, -3, 162, 109, -65, 133, -175, -165, 122, -368, -126, 99, 34, -219, -253, -190, 26, 183, -6, -88, -35, -48, 163, 8, -76, -72, 176, 257, -224, 273]
7400B73m25K7K5j11K20pN1j47L02j68j44J15o7J65j13J33Q4p8p5J63j21k56K32
7423G8P8j47J04k68K05J7l55K51n6kQ2o2PK44k84M5J01J20N9j84N0j58j28K80
7447G7j79l7J85M3P5j18j18j37L42l15J63J5j6K48P9j26q3k14K3J08J7J50k71
7470h9k5N9k83K97N8q3J06m3k96J41K67q6j30J12n2N9J41n7k62J85l7Lq9J58j89
7495a35J08K27k98p3P9K10j43o6L22m07K8L04n9j32J06J42j43j90L44m2k3j35
7517B4N6j03j8J04J4l81P0K72r3L05k56j48J89k13J25qL4J71j0l31M46m03J70
7540A6l1k4L16k11j34o8o8J24o0J60j06j14L04o9k66Q7R9r0P0j63O54n43K10k0
7564G3l48L14k20L62j57p9k02J66R4M08l32l1k68J14j04j32L37L0L4m09P1N35
$$ y = [273, -152, -125, -100, -211, 9, 2, 53, -94, 208, 40, -104, 11, -56, 109, -4, 129, 213, 135, 60, 223, 102, -154, 78, 156, 9, 113, -155, 50, 67, -288, -37, -93, -95, -13, -75, -68, 176, -108, -63, 38, 158, 217, 33, 83, -75, -203, 77, -102, -139, 46, 89, 164, 46, -72, -209, 133, -182, -19, -4, -20, 228, 307, 181, 98, -116, -93, 15, 32, 182, -89, -114, -55, -338, -41, 17, -66, 40, -3, -299, -158, 109, 23, -107, 5, -47, 12, 153, 96, -166, 19, -18, -15, -104, 54, -135, -27, 200, -98, -171, -92, 118, -25, -91, 231, -176, -148, 156, 97, -35, 71, 213, 70, -120, 224, 182, 159, 24, 80, -23, -41, 63, 77, -304, -234, 38, -55, 250, -6, -154, 35, -178, -53, -61, -27, 144, 134, -197, 249, -154, 16, -15, -39, 277, 66, -68, -136, -204, -80, -140, 20, -86, -200, 104, 35, -231, -144, -45, -135, -65, -228, 426, -117, 93, 73, -275, 39, -181, 181, 24, -55, -257, -91, 3, 411, 79, 48, -220, -106, -210, -342, -5, 25, 59, -350, -279, 256]
7586B56l10o9J79j0J94l65K9O6Jo0Q4k2J75j93J07k8L1r1j03K21o9K18r9J78k50
7611G0j48M4K30m63L18q7jq5l7j34L60o7j8J17p5K0j11O2L4j26J50o3L7n5m3O2
7637iJ01k34K8K18k7j11q2L31k93K98p4k13j75J04J03m2j23N0Q3m9J65J15j76
7660a2J52j26jL6M7j37J10N0k21J65r2mj00Q4J48j09q3J54Q4J1j37Kj79N28k70
7685A00m4jK6k27K57J44k05p2l8o1K82Kj33P1j5kr1j03R4J4j08R0O9n5k70L78
7711A02j34J46k36J96l71L51J94j45l20R8J55N7k32J32m4J29j37k87L38R9j77
7732h6J47j97J40j22R2j37J12l0k73J06N97n81jK67r3L1K71m53K82j7M3P5O6k50
7756a1j38K11l26L72j88P1K50l40l2L37o6l04K26p7M9j81K35j37pm4N7J61k0o8
$$ y = [256, -54, -123, 56, 46, 240, -125, -96, -30, -29, -89, -5, -27, 148, -45, 62, 34, 65, -26, -129, 92, 23, 241, 142, 320, 70, -78, -34, 196, -267, 51, -36, -37, -122, -159, -293, 67, 0, -18, 99, 24, 44, -67, -5, 29, -97, 53, -10, 27, -28, -71, -9, 92, -142, -114, 104, 77, -34, -116, 215, -78, 220, 146, -67, -242, -138, -35, -77, -200, -150, -67, -116, 49, 164, -12, 140, 14, 13, 49, 96, -41, 69, 119, -102, 63, -29, -33, -133, -49, 99, -10, -93, 61, 145, 156, 19, 21, -158, 370, 100, 56, 55, 81, -146, 111, 255, 50, -22, -60, -121, 161, 163, 30, 101, 86, 84, -7, -110, -16, -2, -110, -20, 49, -6, -276, 102, -32, 114, -122, 74, -297, 54, 248, 103, -217, -119, 36, 93, -139, -7, -51, 78, -59, -346, -8, 91, -86, 61, -136, 4, -118, -26, -163, -51, -81, -354, -248, 349, -232, -233, 34, -59, -28, 243, -210, 72, 55, 98, 173, 239, -11, -149, 62, -264, 108, -80, -9, 241, -99, -131, 206, 140, -164, 62, -15, 34, -147, 88, -49, -56, -100, -43, 118, 98, 30]
7780C0K04j43N1k20j50J43k84K56MQ4J34r9JJ47l06J17j74j47L13Q4l8J2mR8J15
7805B28Q3j95j70L6O8k68M02n3q6o0J83j50M6Q3k61K24l60K62p1K05o3M5j49j16
7829a37J24J39j79O1o8M1j9k1K96l23L7J03j86K20K14l26O0K23j58j27J36L9q
7852A41k9N9j03%j14K29j61m8j43J56j39K87j60qJ21k3k20K53J2j67J25j62j26
7875b20K99k56Q1J3J5K94j52J22k81M11m23K60j90N0M9Q0j2j44n6L9j75K31%j12
7899g7L40o15M08j0j48L01M5j42Q2n6m9j50m7J98m5R9k39Q1j9N0k68J67N3P2J50
7924A81j65j43J65j13M2J15p1J55n7O3l40K10j7j23K41l0j75K44k8l32J86J18
7946A26j32R7k92K32j10K41m03m0M79l31J61J1QJ77k80l3J12k41L13R2k65R6k10
$$ y = [30, 234, 91, 142, -78, -228, -85, -369, -113, -109, -25, 109, 10, 11, 158, -148, -31, -205, -352, -39, 45, 7, 19, 15, 113, 228, 311, 116, -54, -18, 50, -218, 184, 131, 45, -15, 168, 18, 64, 147, -114, 110, -250, 12, -59, 146, 83, 128, -21, -137, -13, 126, -53, 8, -60, -19, -38, -59, 237, -86, -49, 54, -132, 88, 302, -24, 36, 259, 101, -26, 110, 149, 141, 112, 171, 68, 68, -46, 183, 22, -26, -169, -13, -152, 135, -25, -33, 88, 65, -155, 98, 110, -57, 68, -94, -220, 79, -177, -96, -83, -68, 226, 74, 196, -85, 326, -97, 163, -27, 23, 72, 152, 140, -4, -60, -21, -196, 35, 35, -77, 263, -352, 56, 46, -102, 199, 244, 102, 184, 128, 79, -71, -118, 80, 35, 134, -105, -24, -43, 7, -261, -94, -41, 31, 181, 16, -127, 38, -75, -33, 82, 11, 166, 109, 172, -168, 42, 25, -98, 143, 113, -62, 182, 154, -178, 8, 126, -6, 91, -201, 31, -79, 162, -241, -281, 198, -133, 28, 39, 47, 224, -56, -89, 23, -218, 95, 187, -78, 18, -192]
7969a92K49Qj26n8L14N0l35J94n9q6K98j99r1Q5j51j0R0Q0K97l19q1k0O1j53J05
7994d9O0j27N5p2K08O3j76J06ol41K90j31J42j66Q5j18L17j9j87J67l11J31J71
8017I2k3k16K8J85M0qN6k39P8K1r9j01K44j82QL4Q6K07l74K42m85N78p4K8k19
8042i3m7L48j87J0Jk0J25m2j28J54R4k18n8q8K79j01j36k20K30j54L21j4j29k8
8066a01M5q3K08K44l04Q6p0p0J5K8L4P3j2j14o4q1O2M03j73p9p2o7J01j36K7L08
8092B08q2j49p6J17j11J64r2M0J47k81k1L58k46K8L1J25q6j93J60o4K23n7k88
8115a45M75j63l04J6m8J62J31L8j11K22l04J11q6K18k60j15J70j30K7j24M72l17
8137f5O3J34PL0l60RK15R3j61L32l82Q2j92L05k84J75J72k37j5M23m30L25n40
$$ y = [-192, 57, 65, -61, -119, 195, 245, -90, 104, 45, -41, 257, 58, -33, 52, -99, -109, -19, 61, 358, 39, -42, -62, -1, -154, -49, 11, -116, -61, -133, 75, 138, -38, 68, 62, -279, 11, -120, 22, -144, -59, -177, 140, 121, -66, 101, -210, -79, 92, 69, -147, -119, 66, 106, 98, 154, -85, -7, 14, -85, -186, 58, -124, -116, -82, 4, 211, -163, 79, -406, 172, 98, 126, -93, -140, 208, 21, 31, 32, 12, 137, 95, -33, 121, 215, -3, -61, -149, 130, 29, -107, -327, -97, -251, 70, 56, -73, -101, -56, -139, 69, 313, 9, 95, 25, -45, -30, -2, 32, 105, 93, -21, -85, -166, -104, 299, 126, 47, -25, -92, 9, -127, -100, 208, 126, -23, -99, 18, -93, 71, -21, 19, 166, -115, -136, 222, -24, 4, 35, 160, 74, -119, 41, -23, 200, 143, -145, 330, 167, -137, -121, -169, -7, 124, 162, 51, 273, -31, 80, -6, 212, -48, -163, 7, -123, -96, -220, 252, -65, -2, 132, 139, 169, -191, -182, 33, 126, -35, 297, -85, -3, -195, 110, -174, 1, 173, -64, -79, 344, -86, 239, -301]
8160c01K06o5K38j5J8J47l14J87j69K55j81l6N6L12k44k39J1K86m31L25k45K36
8182C7r3j00K31J09k88J0N3k78M28
$$ y = [-301, -95, -160, 78, 63, 81, 228, -86, 101, -68, 187, 6, -30, 26, 338, 94, -145, -134, 152, -279, 46, -199, 37, -56, -156, 75, 184, -104, -94, -41, -319, 109]
8191A09
$$ Imaginary data points
##PAGE= N=2
##DATA TABLE= (X++(I..I)), XYDATA
0@%%%%%%%%%%%qJ6j6J6k4L2m0M8n6O9q0R6j17J36j55J80k10K42k78L20l66M17
33B22m73N35o03O77p62Q53r52J062j181J311j451J607j777J962k165K385k628
50a378K896l190L515l876M279m732N245n832O510p304Q246r387J0807j2626J5053
65H226j8470K3679l2683N2553j77276P3593J69435k80389J42598K31148j95976
76c562j46076K77756l427k11235J43546J75014k25514p9205J84344o0272j91285
87a39916J18497R6209j69095n0217J52642l1624j13759J09108J21150j02827m0509
98e0341J34265J819j24198P2940J20914j14715r0901J17186k6106j75097O7006
109f7228J36197j27947n8526J73376k8270j66524J21736J29067j49505q345J80666
$$ y = [0, 0, 0, 0, 0, 0, 0, 0, 0, 0, 0, 0, -8, 8, -8, 8, -16, 16, -24, 24, -32, 37, -43, 53, -64, 72, -83, 97, -113, 129, -149, 171, -195, 222, -251, 284, -319, 358, -404, 449, -503, 559, -622, 689, -762, 845, -932, 1030, -1135, 1250, -1378, 1518, -1672, 1843, -2033, 2246, -2486, 2759, -3073, 3437, -3867, 4379, -5008, 5799, -6827, 8226, -10244, 13435, -19248, 33305, -143971, -70378, 99057, -181332, -38734, 192414, -3562, -149638, 128118, 124691, -86544, 57002, 232016, 6502, -72703, 111641, 51369, -139916, -21419, 74790, -94305, -144522, 8120, -23504, -137263, -28155, 92995, -9832, -50341, 83924, 85743, -38455, 34485, 155399, 40684, -50217, 66969, 40863, -134234, -67228, 68969, -58978, -117504, 55872, 27602, -138922, -17186, 111881, -37624, -45969, 134697]
120A34697q5215j51995J37857N9527j60937M6017J46785j21767j00955J23787
130B7801j3298j31633Q4159J04332r4704j9205J04417m0692q3117O9096M3043
141E0199o7528O223N9412l4598m4905L5897J7391l7851l671L1412r871l2145J7239
154a2796L3728j8046j6346L5546M17n1728J0499M2263l2603j6395N9341p180o1075
167c4375L1476L2935n8834M099P0615l3042m5363N7496P5p2348L3419N1134o0139
180b2852r295O8276l2293n1423O0989J8666o1516K8722N1300n5791k2031N8163
192C0915j8476m7956M4697K1779n3314M640L9625l2348k4785M0207M665l3240
204b3591J5918K6487j9460r297K7277N897k0838J347J7412j3310k3454J2975J4257
$$ y = [134697, 49482, -102513, 35344, 94871, -66066, -20049, 126736, 4969, -95986, 27801, 14503, -117130, -32971, 71361, -23343, -42548, 61869, 21177, -61940, 7156, 50199, -17329, -11106, 48306, 13708, -31197, 4700, 22091, -15760, -19431, 11981, 2110, -30035, -12796, 20932, 2886, -13460, 22086, 22503, -29225, -18726, 23537, -9066, -25461, 33880, 26700, -34375, -2899, 30036, -28798, -24699, 45916, 12874, -32489, 25007, 25082, -47266, -13847, 37287, -22852, -32147, 36129, 3836, -47587, 13402, 32068, -29448, -726, 50574, -5217, -27248, 30915, 12439, -35517, 9180, 30959, -22355, -17715, 21910, -10438, -35223, 4984, 9649, -23591, -7673, 18814, -646, -9943, 17334, 23231, 2393, 3740, 21152, 7842, -15612, -2637, 11620]
217A1620k5386j0426L0355o098l4332K4998L0978l5648m349N1320j5749m2758
229b5475M1218K2634n6421N905N3922l8772l9695N3680L011o2153K5509M6273
241B9636m9213j7769N9786r825m6819L8724L1458m5950j949M5834j9945l5072
253b1104L0801J3587l8556o27L0307j5572k4493K1101J4615k3421k734K7801k016
266I689k2665J4239K1529k1332j2894K8155k36l3032J2166K5044k8997j5449L5806
279A2023l604l5491K1878K6739l4100o871M0395j0991l1368K8721J7621l5681
291a0729J396L2570j9459k3273K7055N607l0340O987K3393j8044j2670K3147K397
304H037j8936P845J5661j1664p822J4447J706j3777K218J0960p290r635Q925M432
$$ y = [11620, -13766, -24192, 6163, 65, -34267, -9269, 21709, -13939, -18288, 33032, 17283, -25475, 15743, 38377, -18044, -12139, 41783, 3011, -36684, 16996, 20007, -42146, -16637, 29636, -19577, -37346, 22440, 12615, -34204, 4520, 35978, -9972, -11921, 33913, 13968, -21104, 9697, 23284, -15272, -15899, 14408, -1164, -25657, -4556, 10059, -13362, -16096, 11705, 9689, -12976, 1263, 22792, 1460, -11434, 16721, 16485, -16547, -4381, 20663, -8334, -23783, 12023, 8419, -27072, -5194, 21545, -12555, -19426, 20969, 9978, -21390, 7331, 24952, -10729, -9333, 23237, 3778, -19495, 7560, 13167, -17173, -10186, 13207, -4837, -17507, 5640, 8037, -10899, -3054, 12607, 943, -6879, 7568, 9274, -4503, -2285, 8675, 1385, -8250, 675, 5107]
318E107j1549j117J1794l738r943R799P032j1113k53J2873n293r511R434L926
332G448j2108P22R997o864o123Q979J300q638L389O296o030k402O537q11m624
347b932L226L099l337K64K566j180j929K07k75j491r42j00L49Q28Q91Q00J650
364A694J087q75N72R64j875j926K63n48k909L80K900j121j416L827R52l806J270
381e67M141m030k370N510n42n010M147M424n992m48O274m528o222N204L13q557
397h253L775O149n414l88R321j372n162P223K221q377J347M370p810l324O492
412G98k092n611N379L339n712P44N658k254k903M464J900m183N19M599j057l568
428B0K763K772n880l755N219j719q643M217O858p966k170J3642j206j0978J1403
$$ y = [5107, -6442, -7559, 4235, 497, -9446, 353, 7385, -3728, -3981, 8892, 3599, -5912, 3522, 7448, -4660, -3938, 6059, -805, -6928, 2051, 3351, -5287, -1898, 4398, -1632, -4034, 2503, 1692, -2932, 294, 3393, 56, 320, 2886, 1706, -223, -16, -291, -1782, -2724, -2824, -2475, -1647, -756, 44, 1694, 2781, 1906, 2478, 3442, 1567, -359, -96, -644, -3553, -3173, -273, -1394, -2810, 1017, 1969, -1837, -567, 3574, -456, -2826, 2684, 2142, -2868, 1279, 5703, -289, -737, 5537, 1009, -5213, -9, 304, -8253, -4478, 1671, -3743, -4131, 5190, 3818, -1344, 5879, 8100, -277, 1070, 5440, -2370, -5694, 798, -1294, -6905, -1526, 1813, -3899, -3155, 2503, 249, -2654, 1810, 3710, -473, 46, 4645, 3588, 20, 2783, 5555, -325, -4080, 1139, -580, -9223, -5006, 1852, -6114, -8284, 5358, 4152, -6826, 4577]
443D577R093j6104m34J7533j0879j5649J7648L786k3794O788J9848j9165j0713
456a7465K5975k429k4313J7100J7927k4951k284K8346r467k1893K0943J0246k6955
469i220J038K3734j3987j8667J9987O787k3622K503K2084j0213j5528J8314R971
482A3181k1073p05K3826p940j9788J7766J3791k6448n076K8105j0659k6642K3126
495A464J6513l3552j537L5701j5961k7876L2922J4427m0286O175L7811k5970k4390
508b4559M0304N960m2155J5500L2117l3750j6836M0661l513l6616K1105K3173
520B1391l4232r386L4807o115k7394K2732J9799k7149o799K7111n343k4317J5483
533E88J8752k2186j0476K4598j162k6552J0790K2098k2503j4659K8106O66k9599
$$ y = [4577, 13670, -2434, -2868, 14665, 3786, -11863, 5785, 9571, -14223, -7435, 12413, -6752, -17465, 8510, 6081, -18232, -1132, 16795, -8156, -10440, 17906, 8439, -13454, 7489, 17735, -9220, -8182, 15552, 1565, -17102, 2885, 9672, -13950, -11447, 10637, 424, -15104, 3210, 13181, -7892, -8597, 15229, 7289, -12499, 5267, 19058, -7390, -12466, 15639, 4980, -21662, 1464, 17977, -15575, -17112, 18589, 2628, -25248, 7674, 22101, -18185, -12010, 25801, -169, -24559, 15745, 21705, -20450, -4950, 27167, -6583, -23419, 17242, 13729, -22887, -1782, 21391, -12841, -22227, 12580, 6465, -20929, 1803, 21602, -5547, -12346, 14765, 9422, -14895, 588, 19340, -2846, -13322, 11276, 10114, -16438, -5648, 16450, -6053, -20712, 7394, 8060, -21539]
546b1539J5373K7017k4884j1851L3811l446l2120K0885K3044l2118p050L2339
558A9461j4185k9849K5145J3772l1643L541K8579j8635j8618K7310O169k2403
570a1356J1855K0039j7658r868J6852k463j5397R310J1261j1111o463O563l850
583b286j1178J483R065n81k836P718O215o924k921R665n07r968O926Q081j0828
598A124k908J0918o433j2287P298J547j3475M008J2259o320j603J3112l439r716
612e915Q672L027q686P239R089r841j679O770j0415p667J0337j793r629R350M102
627B961j4077K862J2316q338k078J6605j802j2606R051N078j4556J945J3710p097
641C974q571R715j037j3941J693Q185n633l410R349L503o468R49P241j888p177
$$ y = [-21539, -6166, 20851, -4033, -15884, 17927, 14481, -17639, 3246, 26290, -5828, -12878, 19461, 5276, -24573, 572, 14344, -17299, -13758, 14821, -3814, -22432, 4878, 11047, -11356, 499, 20538, 2880, -6988, 9864, 7401, -7996, 1314, 12575, 1464, -4999, 1564, -2286, -13464, -11981, -2916, -3497, -6333, 1385, 7600, 676, -2245, 7420, 6913, -3055, 3871, 11952, 1124, -1784, 9134, 2701, -9586, -2288, -741, -14216, -10208, 2051, -4269, -5872, 7240, 3801, -5915, 2757, 5784, -2902, 4337, 13426, 3585, 1906, 8676, -1739, -9406, 931, -862, -10491, -1141, 2961, -11116, -8254, 4062, -4276, -6354, 10251, 8449, -4157, 4894, 9972, -4584, -2639, 11071, 3974, -4597, 5118, 4081, -9860, -8167, 18, -5615, -9025, 324, 3827, -2641, -1692, 5549, 3661, -3516]
656c516L869P056o703l698J1281J199j4040K304R641j4558q877J8406K100j6102
670a1638J1788J5064k0493p566K1618n796j8171K0071J4022k2921o70K1332j4781
683A859j8450K0945O209k2618N645J8997j5387j2118J9329K511j7999P485J5251
696A1659j1924q756J4516L092j4325L000J3026p563j1357J0899O231j4368j872
709g742J5729n450j5482J1803J1056j7011k469K0831o614j8117J5614J1253k1197
722g796P50K3089j1787j7853J8391N761k3252M974K0987j3602j1802J9682J203
735H745k0865O933J5625j3669o717J7300M36j5188N792J0864r984o364J1836J154
749E898j2064K897R944o912q066R851M664j1338l50J2505m479j0932J0719O335
$$ y = [-3516, 353, 7409, 706, -2992, 8289, 9488, -4552, -2248, 7393, -7165, -16042, 2364, 4464, -11638, 150, 15214, -5279, -12845, 8773, 2977, -15194, 4877, 18899, -4022, -4692, 16640, 1859, -16591, 4354, 10563, -12055, -6410, 12587, -2800, -14918, 4411, 6922, -11077, -3592, 11659, -265, -9021, 5495, 8587, -5738, -2738, 10288, 2725, -8632, 2267, 8498, -5870, -7742, 7987, 2537, -12945, -1142, 9914, -7097, -9566, 11265, 4651, -13466, 2148, 13401, -7796, -7046, 16043, 4256, -13597, 4794, 10555, -12697, -7723, 13264, -338, -12140, 7542, 8745, -12120, -5187, 10438, -3231, -9948, 7352, 7788, -7400, -1608, 9256, -728, -7092, 4744, 5898, -6166, -3269, 6675, -237, -8303, 1548, 6212, -5126, -5476, 7029, 2550, -8382, 2337, 8672]
763H672j4080n66J4204o484j1465J2692N389j5177J983J4052r099r446J3432K531
777F638j3997N208J0813r946n405J1666p51j0341N320O680p767l014P999j303
791A800o173L353M313m037k061M759O58m079L06M387j763l767K541L352m895j862
807c168N147p95n794L323M216n206j408O670j330n150M903L128n994L97N251l153
823A037l480M216N18m685J123K635k278j779K486M5j405R28P49m84O14o7Q04R96
841A973j060n05J680o93k509J750O85l483j57L165k235k315L847P59l411J741
857g68L748k949j180L568j98l529J893K265l057o67K278q92k714J103J360j801
873a540q60J691N78j311P12J950l22j141J810J109k078q02K273r68k683J261J658
$$ y = [8672, -5408, -5974, 8230, 1746, -9719, 2973, 8362, -6815, -4832, 9220, 121, -9325, 4107, 6638, -7359, -2151, 8662, -1284, -6689, 4977, 4226, -6115, -795, 5885, -1882, -4896, 3103, 1800, -4373, -1020, 3293, -744, -2805, 1954, 2612, -1467, -1161, 3226, 1463, -2304, 237, 3589, -1306, -3168, 1979, 1184, -4610, -1287, 2929, -2277, -3685, 2985, 1655, -3495, 1408, 4536, -1458, -1061, 4190, 1037, -2443, 1773, 2291, -2394, -1271, 1364, -914, -2693, -207, -162, -1567, -639, 110, -374, 240, 173, 977, 1973, 913, 408, 2088, 1395, -1114, 636, 1321, -2162, -2319, 846, -1389, -3704, 143, 902, -2509, -768, 2980, 31, -1149, 2419, 2221, -1308, 585, 2850, -207, -874, 1404, 512, -2202, -1099, 261, -1540, -2400, -709, -131, -1442, -730, 1220, 898, -243, 1567, 2676, 598, -204, 2069, 1101, -1582, -321, 1337]
890A337k854o52L023j228k343K497J559k790N12K996j491j677K785N66k261K55
906B34K057k157j366J434K96k057N44J312j428n71J344J92n06Q55J030n94m88
923A31O74j7n28m9L00J93p63m58J58Kk40K76K11o0k68O8p8L39J03R59L35j250
945C8j33P85r24l28Q23N13j550K65M98q68p53J629R02j241L76J369j301p81J490
964H09J71j262M39J309j809j016J096L86j089P64J275j047j460J344Q70j320O78
981A38K019j053j849J110K41j900M10K587j412k081J586J77k194L86L004p56j212
998g99J998j98k222J166K025j039m70J641j342j937J06R98r62M08J024p04j136
1015a443K82m9M76J107P93K15P1r74p61J096P6n30O29M39k418q56R85n59o87K042
$$ y = [1337, -1517, -2169, 854, -374, -2717, -220, 1339, -1451, -939, 2057, 566, -1111, 1674, 2240, -21, 234, 2291, 134, -1232, 202, 498, -1559, -1015, 297, -1131, -1702, -358, -166, -672, 183, 1213, 619, 131, 805, 788, 260, 211, 511, 704, -59, -517, -359, -357, -597, -321, -110, -170, -438, -370, -448, -109, -6, 953, 1288, 38, -95, 690, -234, -562, 261, 774, -776, -511, -13, -881, -1634, -5, 897, -344, 32, 1401, 100, -681, 809, 980, -282, 157, 1466, -343, -1359, -263, 123, -966, -202, 1073, 26, -1434, -90, 780, -540, 138, 2157, 1104, -745, 365, 606, -1294, -884, 1703, 291, -1790, -204, -27, -2221, -1835, 1169, 413, -799, 1199, 1001, -1221, -55, 1970, 931, 461, 2102, 760, -1177, -1071, -73, -1035, -627, 397, -307, -1443, -1161, -1210, -734, 373, 1166, 1381, 1452, 478, -283, 813, 889, 359, 988, 1427, -991, -1847, -862, -1421, -2108, -66]
1035f6P01j862j83J467n21n30K550J100j597k16M35p33j475J153J518j414j478
1052a151Q37m29k803J086K985p06j645K916O42l939J395M330k130k331M723n35
1068C245n854J264M511m820j579N903j521n873K984L886n486n7O852j202n406
1083c153M018L268n662L4O338j948n302L461J982o157m64N596j310m583L285K873
1099B276n355j258O296K0m568L483M456n816k580O342p29o202M090M842o968k662
1115d333P225j945p307N332N187p721q13Q369k549o266O374M042p829m71P851
1130E146l648n661O057L010p392lO036l750n314N460K863n600J51N745k440m681
1146d021M509L428m855n83N509j796n721L731L695n375j374O232j281o543L747
$$ y = [-66, 635, -1227, -1410, 57, -464, -994, 1556, 2656, 1059, 843, 1278, 545, -930, 223, 1741, 327, -1151, -314, -743, -3546, -2460, 525, -181, -1826, 1090, 1732, -2207, -812, 3518, 1388, -943, 3780, 3245, -2609, -1345, 3166, -1654, -3233, 2670, 1149, -4724, -1740, 2146, -3340, -3397, 3455, 2253, -3153, 865, 4133, -1529, -1495, 4843, 2895, -2407, 1054, 3036, -3121, -3585, 2011, 701, -3882, -597, 2276, -3079, -4337, 1959, 1979, -2589, 894, 5350, -466, -3046, 3296, 2567, -3635, 455, 5297, -1671, -4333, 2892, 947, -6360, -1028, 4159, -3562, -4375, 3994, 1445, -4821, 1553, 5595, -2234, -2705, 5146, 1498, -4163, 1894, 4904, -2488, -2491, 3545, -205, -5519, -59, 2804, -2796, -2645, 3100, 660, -4021, 488, 3916, -939, -1522, 3987, 2191, -3530, 201, 3896, -1479, -2853, 3379, 2098, -4445, -698]
1161f98L694o090r31P258k144n178M885L574o365k29O060k888m545N190K334n593
1177a666M45M536l137m027M030J257m059J151M022j712k772K311Q50k888p7L010
1193A274L55k159J209K055k446j902K446L72l368J559K867k444k015K806K42l496
1209b645J202L173j877j522L329pl225J469J928k017o99K264J51k360R64Q90j428
1226d10r73R87P83q01k00J027J00j282m42J568J76j463J636J293k525o48K715
1243A541r97k737K222K074l124l60L604j765l054K953J437l894Q50L591j656k923
1259b238K810J337l588N11L063j077k237K090J457k874o99L191q87k898J858K415
1275B234k870j644L724k22m315J811L905l366k003M990J02n187K292M056m006
$$ y = [-698, 2996, -3094, -4025, 3233, 1089, -4089, 796, 4370, -1995, -2224, 3836, 948, -3597, 1593, 3927, -1666, -1221, 3315, 178, -3849, 181, 1438, -2621, -1470, 2552, 840, -1932, 379, 1229, -1659, -1736, 1274, 1629, -530, 679, 2734, 288, -1614, 832, 1204, -2164, -605, 2262, -182, -2197, 609, 851, -2645, -1443, 1730, -147, -1669, 1660, 1653, -1572, -103, 1825, -192, -891, 1373, 1524, -836, 128, 1018, -410, -1383, -396, 387, -414, -614, 413, 513, -769, -1211, 357, 533, -930, 706, 1999, -526, -1174, 1541, 544, -2193, 29, 2103, -1021, -1381, 2223, 458, -2596, 357, 1794, -2100, -1250, 2341, 685, -2238, 572, 1909, -1679, -1168, 1895, 818, -1419, 671, 2128, -746, -1445, 1746, 859, -2039, -181, 2234, -636, -2280, 1444, 1222, -3093, -1282, 2623, -743, -2746, 2244, 2346, -2841, -549, 3507, -499]
1290d99k287N810l36n958L124L861n485j664N697j125n259L444L928n235r57N824
1306B883j207m805L685L094m431r17M816q91m944K711K918m231j873M781n43m821
1322c775L039L360l943j952N580P0n367L040M355m918j569N289p98n532L156L519
1338C554n255j814N483j167m974L459L331m804j019N770j072m210L681K703m395
1353g29o54M914k171l819K773K215m205p40L711j031l207K499K105l172p87L866
1369A568m62l291K575K541l134q56L680j054l699K699K012l791r91L881j489l094
1385b905K432K139l348k10L570j125k286K380J570k771K51K392j207k411K275
1400G46M68k151q3J765j131j532J610N08j432L41J306m07q23J331N38q34j4P05
$$ y = [-499, -2786, 3024, 2688, -3270, -146, 3715, -1770, -3434, 2263, 1138, -4121, -677, 3251, -1984, -2941, 2883, 1676, -3129, 556, 3650, -781, -1698, 3118, 2227, -2717, -6, 2912, -1319, -3192, 1589, 1046, -3775, -736, 2624, -1319, -3271, 2309, 2379, -2988, 52, 4407, -511, -2080, 3209, 2411, -3121, 35, 3554, -1701, -3515, 1968, 801, -4173, -714, 2617, -2187, -3206, 2564, 1492, -2718, 963, 3666, -729, -1383, 3531, 1360, -2459, 314, 2529, -1676, -2416, 1295, 264, -2943, -444, 1661, -1511, -2298, 1568, 1106, -2185, 390, 2931, -203, -1059, 2621, 1567, -2132, 567, 2579, -1212, -2203, 1678, 189, -2905, -473, 1666, -1682, -1892, 1678, 553, -1733, 647, 2217, -554, -303, 2089, 882, -1529, 746, 1214, -937, -1020, 745, -386, -1918, -308, 200, -1232, -891, 415, 8, -815, 516, 1054, 220, 206, 911]
1418I11J93j242J86L69p58l09J032k51j342N19M91l79l67R57M75o10K32M73l93
1437A87L7N26q4n34j72N34m54l90L37l14k74J88J78K66k90j47N51p0j19K89M67
1458G12l92l82L39j31m53M05L31p45k49O46k52p19Q03M24k52N8L64o03l60Q07
1478C51K48l92l77N95m76n74M38K50j81j52N30k57m47J44L63m4m3P61k56o65M1
1499a43O1l6m39Q44p0l29j45j32j15M5N86J58J42k54J43j27k79J64K12N6m97N8
1521i7m02J63n5J76M77k55l98J46J18k77N23N06j90l09K76qm70N0O03o30k61M46
1543A32J35j117J42P86j16m27J099l42n61r3R40m92n74J376k07j329J60Q00q43
1562e31j05J066K56j238Q4P66j037m33J568L36j000O2J080j147n82J452K17r57
$$ y = [911, 1104, -138, 48, 417, -341, -650, 382, 131, -1211, -692, -201, -580, -947, 10, 485, -125, 107, 580, 187, 224, 750, 666, 132, -40, 494, 40, -350, -13, -327, -601, -413, -235, 31, -259, -406, 145, 75, -44, 245, 712, 320, -62, 277, 146, -307, 98, 429, -316, -565, 81, -171, -890, -87, 337, 85, 143, 507, -96, -456, 351, 599, 207, -170, 425, -51, -625, -187, 63, -118, -270, 260, 3, -444, -300, 63, 19, -24, 737, 481, -184, -143, -82, -118, -557, 287, 217, -112, -257, -389, -504, -459, 127, 285, 427, 173, 316, 189, -90, 74, 286, 342, -155, -97, -499, -336, -391, -215, 262, 7, -391, -245, -127, -404, 119, 625, 435, 126, 402, 394, -76, -26, 577, -53, -314, 132, 267, -850, -708, 78, -38, -465, 634, 292, -269, -362, 578, 86, -488, 888, 681, -648, -488, 312, -531, -636, 430, 686, -552, -468, 298, -739, -1172, 396, 732, -268, -206, 874, -273, -855, 597, 814, -143]
1580a43K75P87j108q17J198r2n26J87J050j282p14J410K1j316R80J008p29r50
1598g61J105J68j008P59R77q94j013J288m11j345J070P25q87o24J071m60j180
1615a420J286P49o73j46J018n62q38Q47N56n86k30Q82p04o04K38M17m37k23Q70
1634D40l20q99L08N00J7j61N35K68p85L30L17l88J2J44K80m69o8m5j68o11N85
1655a78K90l83lL21k71k64N04N5N64k41m5Q1q9n47L20K94m03j82N37j12j068N99
1677b21O94n64m45R77j72r23Q33P54j040M6R15r5j407Q09R07j324m06J779r30
1696A87j263P42Q40j212l09J728m14j210Q15J163j378o72J964j22k069J496J115
1713A401j803q85K093P9k391J447J541k133p82K427n81k065J621J636k404r34
$$ y = [-143, 132, 919, -189, -1006, 192, 100, -426, -239, 811, -471, -1185, 225, 246, -1070, -90, 918, 189, -761, 344, 512, -496, 263, 1240, 346, -667, 621, 210, -1135, -65, 660, -227, -851, 220, -240, -1420, -134, 615, -58, -204, 814, 252, -586, 261, 817, 231, 1, 883, 179, -425, -187, 230, -207, -430, 440, 120, -779, -471, 29, 46, -115, 420, 688, -97, 233, 550, 162, 174, 318, 598, 129, 61, 16, -152, -763, -178, 112, -271, -274, 47, -224, -488, 16, 71, 635, 394, 349, 430, 341, -206, 114, 408, 5, -177, 360, 248, -820, -221, 473, -91, -536, 441, 269, -654, 179, 933, -107, -61, 854, 759, -648, 161, 1068, -256, -662, 1117, 187, -1076, -334, 506, -706, -1015, 713, 299, -911, -96, 1067, -311, -983, 981, 859, -1210, 286, 1401, -402, -1287, 806, 885, -1506, -59, 1482, -651, -1433, 994, 413, -1652, -31, 1605, -799, -1733]
1729a733L123q12k092J622J604k502m16K758p26k511K050J598k988k65K747q51
1745F06k701K099J608k972j30K857q83k706K403J750k874k27K612n22k891K402
1761D31J209k347l85K962j410k595K159J710l360l5L200j031k582K379J458l167
1777a404K1L475j344k477K725J089l415K33L191j605k612K488J154l252J46L078
1793A491j769k098K671J111k531N45K850j816j670K332P98k845L61K474j517k077
1809a690K075N39k631L79K176j299j423K491O40k199K93K588j414j598K091L42
1825A360k335P62J989j797j496K061J53k185O45J552j439r02K265j21j404Q29
1841f3J496j129p60J345J37j491L29J279j177o34J036l74j098L27J062o08o29
$$ y = [-1733, 1390, 578, -1514, 108, 1712, -790, -1206, 1552, 826, -1685, 365, 1963, -1025, -1290, 1457, 606, -2095, 4, 1612, -1360, -1490, 1367, 484, -2222, 181, 1931, -943, -1170, 1442, 920, -1971, 431, 1640, -707, -1092, 1870, 460, -2135, 24, 1734, -1626, -1661, 1539, 508, -2074, 305, 1763, -1404, -1383, 2092, 748, -1729, 996, 2085, -1330, -1097, 2094, 489, -2123, 365, 1519, -1733, -1587, 1491, -278, -2376, 295, 1406, -1125, -580, 2270, 454, -1216, 1116, 1914, -931, -570, 1904, 387, -1690, 385, 924, -1707, -1328, 848, -451, -1874, 617, 1257, -942, -649, 1939, 525, -1073, 1018, 1360, -975, -213, 1776, -21, -1517, 544, 697, -1488, -843, 709, -730, -1632, 633, 512, -892, -63, 1433, 304, -456, 889, 1026, -465, -136, 1143, -34, -668, 368, -6, -1104, -777, 285, -323, -952]
1858i52J012L09n33N3J043r74j21O91L2q30L17M86m57o27N63p6o68L97J83j30
1878b82K5L27j36K13l5j33M1Q1K02%J60l52j31N11q4n90j90O48k73p00O62o5n04
1901f05K04Q14o14k65O14K26p34J64R52n87m73O57K69j050J12J024q71o52J134
1920C19j04p01J40O23n55o58J419j61q50L71J212r76o50J305r5j412P19J061j186
1939a79q10J383j31j545Q63J114j067m66J211p2j417R55J256j168r94J831M2j428
1957f22O91J185j610k88J475m94j768J226R43j342m65J428q7j411J125R07j074
1974a81l8J123l62j201O05R81j363n06J579k64j384P00Q19j001j90J332l19r87
1992f57P59R55j189n1O84N2j115O01J025j148n18J062N3j173M44N83p18j34R19
$$ y = [-952, 60, 369, -164, -111, 932, -42, -163, 528, 560, -270, 47, 533, 76, -551, 12, -64, -732, -335, -152, -282, -257, 70, -66, 147, 112, -21, 20, 101, 303, 303, 463, 111, -20, 491, 407, -183, -373, 275, 2, -698, -36, -101, -605, -401, 413, -201, -466, 148, 374, -360, -196, 756, 169, -304, 353, 622, -428, -316, 708, -163, -815, 319, 215, -486, -346, 277, -278, -936, 483, 322, -528, -157, 1055, 79, -571, 734, 639, -773, -54, 1007, -179, -989, 394, 263, -1282, -419, 695, -372, -838, 373, 301, -1116, -161, 1095, -73, -1067, 764, 806, -622, 69, 1254, -356, -644, 831, 337, -1431, -205, 738, -604, -1069, 359, 272, -1139, -14, 893, -181, -219, 904, 542, -659, -54, 927, -436, -942, 637, 373, -1011, -311, 508, -493, -683, 649, 330, -657, 102, 1057, -132, -183, 501, 553, -562, 39, 1064, -84, -602, 460, 513, -660, -216, 367, -351, -485, 434]
2011D34l43o83O14N18o34l04J041n63n43O95K77j152K03R06l16p17O42L92q71
2030d04L2N83r3o72O65P9j3l14O62m93n93Q12O3l56k69N30k10n24O62j45q2j71
2052b51L45k17j31J68K34m80M7M52k20j56L18K69l85k7P7j42k07N99N9m61j87
2073b96J98K63l07K64K6oq6j59O9p0j39O59o72K05J06j10q1j41M58j73N4pj92
2096a37P3j29J05P7N4K23j49J83p3l09J31P0k9n2j18J11j27j10J88N3J58l08L86
2119B71j3l75K42l5n5k54K78q9k19J60o8J9PL12j67l92K94K27l51L70%L5j53J28
2143A72jk23K37r8j1l00o2K71k11J71j43K87l60K14J99k47k9J91N1R9J07j9m19
2166a24l6M90p38P1K77J87n64K43K80L5n69N83R5k45q5L15J41k18J76J99p88L70
$$ y = [434, 91, -592, 22, 540, -94, -398, 643, 80, -463, 232, 509, -643, -440, 466, 150, -567, 75, 467, -404, -372, 211, 118, -554, 111, 190, 177, -137, 525, 32, -561, 251, 314, -42, -311, 219, 9, -515, 147, 2, -80, -251, 94, -123, -254, -86, 148, -332, -285, 167, -53, -209, 109, 378, -7, -34, 43, -99, -306, 293, 352, -109, -296, -98, 165, -142, 122, 148, 142, 56, -103, -34, -104, -243, 416, -256, -51, 55, -55, -136, -277, 181, 8, 62, 55, -137, -64, -193, -88, -11, 43, 266, 117, 300, 227, -82, 49, 119, 90, 38, -80, 31, -96, -206, -18, 35, 193, -115, 271, 258, -117, 125, 90, 35, -219, 59, -30, -249, -89, -157, -138, -131, 181, 14, -378, -84, 143, -208, 162, 162, 197, 44, 172, 171, -52, 185, 87, 76, -224, -286, -15, -226, -55, -198, 89, -271, -57, 142, -105, -134, 57, 108, 207, 314, 295, -124, -160, 330, -408, -337, -60, 127, -437, -194, 86, 121, -448, 135, 230, -15, -100, 215, 356, 138, 314, 513, -275, 95]
2188I5K93n02m52O45K39n10k29O26m00l81M17N29l87l17J001o13l50L98M39o88
2208a47J10P24p33o54P60J35m33oM36l96k20N50M82p95m1P87n32k3N00j22q36
2229d54M40O00n01q07O45N15j044L21O33o25l51R08j87m81N26K69j43m51P54j10
2249D57o70K3N74n19n6M42N2m65j17N20m70l75P53M6q41M28O69o14k43O74j41
2270A27j52r6M05m32j50L90K53o38M1L32l55J44J74j17k03K72nk09J21M35k3k51
2292F3J06K70n05j23N45K3p39N03l59K09m5J08j4k06j12J99n7J62o6K23%OJ6l07
2316a00K59j31K76N0m50J08O6j25o9LJ11l69N9K62O5j28K26k6l23K00K04O8j11
2339A25q6J21j19L1J24j26l86K40K36n77K08K18j21j51L24M9j24n05R50om54K6
$$ y = [95, 388, -114, -566, 79, 318, -192, -421, 205, -195, -576, -159, 370, -17, -334, 667, 54, -296, 102, 541, -147, -37, 687, -46, -700, 60, 195, -238, -244, 192, -204, -424, 126, 608, -187, -228, 559, 27, 4, 504, 382, -454, -14, 586, 85, -722, -77, 438, -606, -285, 348, -277, -628, 280, 93, -388, 138, 407, 264, -187, 567, 457, -213, -190, 384, -135, -191, 251, 303, -162, -279, 241, -229, -604, 149, 195, -646, -218, 451, -163, -406, 268, 127, -25, -121, 284, -148, -298, 92, 345, -293, -252, 80, -275, -131, 43, -74, -277, -5, -10, -219, -98, 337, 314, 63, 169, 439, -66, -189, 356, 379, -360, 143, -216, -7, -52, 56, 42, -164, -276, -77, -134, 28, -38, 185, 185, 191, 207, -100, 159, 28, 304, 354, -96, 12, 78, -47, -116, -113, -2, -371, -312, -50, 15, -113, 113, 87, -236, -36, 168, 236, 125, 39, 160, 41, 72, 196, 70, -316, -76, 160, -417, -209, 9, -112, -263, 61, 110, -14, -519, 431, 425, -29, -3]
2361cN68m83j61K94rn97L37M63q58R5L35K78o06L89N17p74m9N90L3p34L98M38
2383D61n77k2P78l67r47Q26P5n56l93J020k67p01L12N77p60J95N69k54l87P45
2403C27L74q70M6Q43l34p96L72N69r46k19R62m69p10O32O19o66n4P39l08o38O03
2424G6Q42p96k98J047o43l82K21L61j047K1J062n53p69Q44j03n14M48M04l93k02
2444c74L13N88o51L24M53l96n47N16K02p59L07M79m72p98Q35j43m14p5Q62m7l37
2465a34K78L77o94L0O23k91l25M85J25n56q6L86k06n80K91K09l85R7N19k15j9
2486g1L51J47n60JO24j41m70N39j80k98k5M11l73m70L99L6j83k45N41j47l20K94
2508a40L25j25K4R0k63j5M58j14m1k40R6j20j26K16J0l10j76K08n3n7J65J90%
$$ y = [-3, 565, 82, -79, 215, 206, -391, -54, 409, -449, -354, -19, 259, -347, 42, 559, -215, -264, 326, 359, -375, 23, 461, -116, -138, 640, 273, -674, 152, 227, -329, -722, 298, 31, -670, -358, 219, -541, -346, 223, -31, -418, 327, 701, -169, -123, 720, 386, -410, -38, 531, -415, -634, 328, -141, -851, -219, 400, -266, -320, 419, 111, -527, 76, 918, 122, -176, 871, 228, -154, 67, 428, -619, -598, 464, -89, -858, -14, -117, -631, -183, 221, -172, -374, -61, 527, -124, 200, 653, 257, -290, 226, 428, -331, -24, 455, -17, -815, 20, -123, -537, -612, 250, 203, -134, 144, 521, -173, -143, 480, 189, -136, 349, 474, -82, -168, 218, 12, -568, -277, -68, -453, -356, 163, -52, -71, 280, 427, -133, -132, 492, 351, -119, 420, 240, -58, -83, 328, -45, -515, -116, -80, -263, -508, 33, -114, -434, -140, 185, 60, 84, 174, -89, -104, 354, 240, 199, -41, 55, -65, -191, 25, 35, -275, -451, -243, -296, -353, -188, 2, 2]
2531Bj94M36J68p9k60P0M5l13K37j25J20l71J28K24m74J88k73J81J94q4J17j05
2553a68J95K59j06m62O51j84q5j45J59j62j80J17J70l26j10J96J93l88J68L78
2573A70j11l77J62M96k83L08j99j35N3L33J07q34L0L61nl95J34L58l15m1M09k43
2595a7n3J78M4l09J40pk19J96M64j10m86O1J61k63Q0L0L21m59L55j76J40j2J68
2618B27j83k96J14M31k56K2k0R5m27J71M4J09Jm0RMl44M32l72K09J48k77J38L
2642e8N20n77o4L49J31l70J61L1m58K37j1k4j27P9J97M5k44R5K17k59L2Q3l7O5
2666A3L28j19m97K42K29j84R5j82M5O5K27m16N7K90k72K01J31m32J73J93k66J70
2688I1j66K3J72j22j03q5n4M02p9K90j34n34K19r6M00J6l10Lo0R0l2m1K01j16
$$ y = [2, -192, 244, 412, 333, 73, 143, 188, -125, 112, -13, 107, -264, -136, 88, -386, -198, -471, -290, -96, -180, -63, -168, 27, 286, 180, -282, 369, 185, 100, -45, 114, -48, -228, -111, 59, -267, -377, -181, 12, -376, -208, 170, 59, -318, -156, 340, 57, 365, 166, 31, 84, 417, 524, -310, -280, 81, 76, -319, -185, 173, -142, -183, 226, -17, -70, 108, 152, -157, -17, -24, -243, -47, 417, 307, -179, -118, 43, -220, -140, -110, 211, -248, 107, -69, 71, 59, 227, 44, -252, -138, 293, 37, 59, 39, 134, -293, -122, -78, 31, 32, -8, 1, 5, -339, 93, -279, -70, 78, -199, -61, -58, 462, -115, -179, 170, 301, -69, 92, 123, -335, -98, -109, -133, -260, -181, 16, 61, -183, -88, 129, -130, -98, -15, -52, 13, 341, 222, -275, -33, 196, 12, 107, -75, -30, 35, 262, -154, -97, 193, -79, 122, 253, -179, -6, 187, -79, 91, -75, -52, 120, -2, -105, -190, -244, 158, 79, 369, 235, -299, -80, -176, 224, 240, -70, -67, -127, -37, -69, -110, 91, -25]
2712b5M6J08k2l87L75MLLK80j43k46j8J43J77m18P2J11r7p2O6p1j9j8K68k35L22
2738B07M3K5k45K03K78n35qQ9NK3j2N8r2Kk61l1J26P9N9o3j85L07K4QJ8J63k31
2765E4J25j99K50k92p2j34P4L6J27l8R1q9j32J10J44k36K21J02k5K67k17j51Q4
2788A00%lj55n1Mk05L01j44r3K48k06L91l73J82m8J65l40L10N9j56j07J4K3J19
2812C5J39k15l28qK40l2j9K93j90j5q8K41j09o2M04p2l51L25N8k83pJ62J17m66
2836b31J62Kj01k46K44rJ07l6K45Q9l68N60l53J54l38L32O6k93k4rJ17J5J15j12
2860H8L8J09k56L0r7J1K74j76KR0k27L44k3l07j90M73k11r7J65j55L01l81K16
2883B1Nk72pK01O8J4j02R2j85M28j20k07L49j6r3l5k78L07L5m73K38j52L01j38
$$ y = [-25, 21, 129, 107, -280, 95, 99, 102, 105, 385, 242, -4, -22, 121, 298, -120, -48, 63, -34, -106, -40, -111, -130, -148, 120, -115, 207, 250, 275, 30, 233, 511, -24, -32, 57, 62, 85, 73, 131, 39, 41, -220, -251, -125, -46, 13, -50, -235, 72, 96, 104, 122, 285, 54, 179, -20, 230, -62, -134, -268, -194, -158, -31, -69, 22, -67, -199, -89, 55, -181, 40, 142, 117, 384, 167, 16, 100, 100, 97, -58, -109, -105, -310, -9, -153, -246, 2, -204, 187, -186, -4, -52, 113, -227, 83, 142, -14, -121, -107, -84, 35, 174, -41, -369, -377, -137, -169, -188, 105, -85, -100, -188, 53, -56, -118, 286, 214, -137, 188, 246, -37, -44, 118, 235, -231, -69, -67, -168, -414, -170, -179, -72, -108, 137, 226, -142, 418, 65, 219, -119, 213, 279, -14, -38, -47, 70, 85, 200, 88, 126, 235, -21, 9, -88, -77, 197, 21, 23, 113, -114, 230, 207, -100, -290, 183, -28, -125, 40, -115, 186, -195, 21, 26, -246, -253, -52, 16, 30, -72, 20, -165, 263, 143, -64, 285, 269, 176, 141, -137, 170, 205, -268, -30, -182, 119, -19]
2907a9J24m4k55K23K34m13J46j57L64j48k15J56Q5J16J03k90k33R5L9q1n3j54
2929c77K09kK31r3J08j22J27M4m42L33J52j85J59P0k10l4N8j8n31L65n4J06L03
2952A97k43J48j89M9K04j18J97J01r5j55P6r8q2L97o63J34q7J52j01j1k9P6rL22
2976A73oj03L63l87J4L5k11J94k8R5p0l45K87j6k41K8M15l60j68J79M2j04P0L03
3000A59N1j05j6j89M59m83K60m5m2j61L37j83j49J14j34j11L36N6k66lL54j52
3022H7j98M28J01l34p2O3r3j02O4J89k18j08L40q4l30J11k9L78m31K97J11k37
3044f7K0J09j19MK17k23j65L63k83l0J03o7N0j07j14J49J74L8N3l43K40p1K21
3067A52j4j37m0j06L07j14m0r5R3K15j56j50J51o3j92K0K28j37j24r2L84m7j47
$$ y = [-19, 105, 61, -194, 29, 263, -150, -4, -161, 203, 55, -160, -4, 81, 197, 300, 10, -223, -128, -89, -170, -223, -377, -168, -170, 61, -32, 76, -46, 81, 125, -317, 16, 168, -17, 142, 212, 2, -32, 26, 8, -523, -158, -212, -106, 197, -46, 102, -87, -38, 166, 48, 245, 346, 251, 96, 172, 74, -8, 389, -274, -140, -227, -75, -176, -187, -216, -140, -149, 173, 167, 64, 427, 40, 54, 89, -122, 72, 44, 139, 69, -276, 11, -5, -246, -218, 197, -163, -331, -152, -110, -214, -144, 159, 210, 105, 89, -100, 359, -124, 136, 91, 49, -112, 225, 42, -107, 7, -127, -238, 98, 154, -112, -115, 239, 87, -111, 317, 418, 84, 12, 75, -18, -120, -56, 133, -85, -193, 147, 63, -267, -156, -185, 193, -238, 59, 170, -67, -47, 62, -57, -53, 164, -59, -224, 139, -144, -174, -71, -138, -88, -195, -309, -160, 14, 52, 105, -238, 2, -69, 152, 138, 1, -39, -145, 162, 48, 8, -87, 6, 221, 65, -85, 66, 3, -189, -169, 59, -78, -202, -294, 90, 43, -104]
3090a04Q8j39J5R5L71k85Kk08j02L40O6o6L6j95o8P6J46j14L50k64n1J24J6l6
3114I3O4j09n6R9L9j41o4j83K41l9j66J86L65o34M51Oj0j2j56Qk8l6K8R5K08j20
3140A29j88P1j32N5r9P3K07j47P0J42l60K76j43J05l7J30j09k1k86K36O8N0k35
3163a45L28q5j53l9J53j13j9p8J3K32k43K70J10n84L75r9o5K85j2J76l95J17J02
3186A31k72K71j67k76K92J1J0j54J31J52q5k89J9J65m0J24m7K4O9J3L9j11K86
3209B96j29kr9j17o8K02M5l09J12k4K24l59L27l41L04N8l08L60j8j36p7J97Np7
3233F6K2q8J11k77J71p1K59l33R0k46J22L69l13K96l75K20k28K37j00Q6L7j60
3255a05K13j84J62Q1j07M9k10K28k12j03o1K87n8J70j91K33j15j85Q7K89m1l94
$$ y = [-104, -16, -155, -140, -45, 326, 41, 43, -165, -267, 73, 139, 73, 109, -86, -154, -78, 68, -46, 304, 40, -11, 113, 129, 93, 157, 48, -8, 91, 130, -11, -75, -258, -17, -56, -222, -36, 329, -305, 146, 152, 142, 130, -26, -18, -46, -82, -54, 41, 249, 129, -59, 12, -120, -65, -164, -91, 116, -31, 39, 181, -179, 97, -46, 59, 22, 152, 43, 22, -264, -28, 40, 90, -145, 183, 98, -55, -94, 59, -54, -73, -151, -138, 94, -149, 121, 231, -353, 22, -77, -142, 143, 131, 307, -88, 29, 131, -141, 130, -37, -313, -21, -10, 0, -154, -23, 129, 44, -245, -226, -61, -101, 23, -24, 0, 69, 82, 121, 10, 296, 167, 165, 66, -51, -119, 83, 128, -181, -69, -93, 131, -228, 99, -242, 62, 120, -188, 172, 154, 18, -59, 138, 143, 66, 88, 0, 111, -166, 5, -66, 193, -140, -50, -296, -174, 195, -118, 178, -197, 23, -205, 32, -68, 18, 55, -105, 108, -76, 86, 167, 60, 109, -101, 127, -85, -188, -249, 38, -20, 150, -41, 192, 77, -108, -21, 268, 227, -167]
3277a67K02OmJ62k45j58J08N6MJkJ05k66L27mj56J94k43P1j83J43N5k5l1j12J55
3303gJ3j23K33j91J96j70m1K12o6j67J63R2j88K7K90l01J83j96j23M68l30K0J41
3326A35j80J37j10j1j45P8KK29l70L23P7n7j9j4K83m01M92n16J3p2J23J12n9k53
3350b03J52k8K2n3po3J82J0j8Qj8l91L89r1R8M3M3K49j10k55j68K7J57M4k4L3
3376B8j76J27J4L4J52k98j39K88J19k19J8Q5j67p5L11j43j3k05M78j40j70L76
3398B85Ll05l95L45J32J8k23J16K10o2m68N63l4k94K49k11m6K42J61k00L9k61
3420a36p3M19j18k54MR5Q7J68m67M53J5r7k2J01J4k1j51J9k5K0Oj54M0L2J0K3
3446a2m8K74l73l1L18p4J42k22o6Kn6L98k52J90l51J83k02j21K83j19K46n5k95
$$ y = [-167, 35, 41, 37, 199, -46, -204, -96, -40, -36, -35, -37, 68, -198, 129, 125, -31, 163, -80, -9, -192, -49, 6, -19, -50, -162, -7, 6, -117, 116, -75, 121, -49, -90, 122, 56, -111, 52, 144, -44, -17, 273, -28, 155, -41, -164, 304, -26, -6, 135, -45, 92, -18, -29, -174, -96, -94, 135, -235, 88, 165, 108, 89, 75, 358, -43, 449, -67, -54, -126, -3, 109, 50, -203, -51, -79, -57, -110, -117, -180, 2, 12, -6, 2, -16, -407, -18, -109, -11, 32, 75, 324, 214, -41, -209, -182, -25, 19, -5, 28, -148, -21, -7, 27, 179, -119, -258, 30, 149, -70, -52, 33, -134, -209, 102, -41, -54, -259, 219, 79, -91, 285, 288, -17, -412, -67, 65, 83, -140, -24, 186, 124, -344, 219, 185, -109, 140, -71, -117, 125, 286, 86, 125, -136, -209, 210, 92, -162, -158, -63, 24, 192, -275, 178, 193, 96, 74, 175, 189, 168, 17, 36, 11, 31, 37, -117, -77, -45, -35, -12, -60, 214, -159, -190, 128, 54, 196, -26, -92, -90, -146, 252, 0, 190, -161, 22, -180, -301, -18, -137, 109, 54, -241]
3469b41J86J32K6n7k8O3k8n7L01j97p5j67k10L52j33J80O7j06j38K09K2j26rJ28
3493I4k53K97j42k3J84j11o0K8j46R5J13j16K31k46J03K45l17J08K5n3j59K02
3515I9mj53K0K63k66J46Mp1l11L13%p0k29J27J79J4n5Q5j19k94J57J75K9O9J3
3540A21k45J16m6L13l37J39j22K6r0J25J7j76K8L5L48l86M8J51J37j3q6j0Q2r0
3564H5J80l85J21J49O0k75r8J79k39J79r1M8l3J91J75k64O4j1j70J9K47j61J8
3587a2J17J42j85k5k07p6J36j73M62k21L6j80K53J4mj93J92o1j48M12l01j06J97
3610F9J4j49j16K49k57K49k44J20L9o5m7L57k2j98K38p8P5k98P7L6R1p0k2q6K10
3635A72j84J43j75j68J58j44K3J26J94m95K84r1L21n9j64oM0K31m4K3j85M6j53
$$ y = [-241, -55, 77, 103, 46, 18, 81, 53, -4, 297, 100, 25, -142, -352, 0, -133, 47, 114, 8, -130, 79, 101, -25, -34, 94, -159, 138, -4, -27, 157, 46, -14, 14, -132, -37, 76, -40, 191, -55, 48, 293, -24, 84, 109, 56, -103, 99, 95, -58, -38, 225, -41, 105, 109, 38, -273, 40, 40, -30, -259, -132, 47, 61, 6, 91, -28, -322, -165, 10, 39, 108, 121, -124, -8, -54, 259, -78, 61, -61, -35, -125, 0, 17, -159, -131, -96, 252, -134, -86, 65, 202, 189, 103, 93, 175, 85, 265, -120, 1, 150, 210, -65, -163, 16, -223, -44, -135, -87, -120, 71, 246, -18, 46, 35, -135, -116, 131, -30, -12, 105, 247, 62, 37, -170, -246, -110, -283, 179, -42, -6, -186, 67, 81, 77, -116, 76, 15, -133, 279, -22, -128, 69, 83, -66, -182, 67, -190, 59, -185, -65, -26, -91, -138, 219, 197, -1, 237, 159, 234, -64, 13, 49, 140, 70, 48, -38, 172, -12, 131, -44, -212, -54, -198, -175, -49, 145, -350, -66, -157, 164, 105, -59, -65, -25, 206, 162, 185, 0, 46, -107]
3658a07J43j86J11l00K72J09j31q6L09j54J59L7l36P9K32l68J77K67q8N6q9q7
3680A9m4J05k92L26k97K54j1k2l09J70L1O3o5OR7N0q6J9J54l00O2l31M01P7L6
3705A13p9k42N37n83R9kkM44k50p2L5j70J58M1k23K50P9j04r9K39K22l96n4m6
3729a05j34L77m28L10j3j2m0J19k2J9L8m0j64O3N6k9P4l57M28M2k47J23K13j44
3753A27k54J09j2J8P1j11K29m0J69j05j61O5j78J25q9j77M40l51j32J26R7l3R5
3776B8r6r7K82p4j66r4M58pm74J27K17Q9m82K38qK42j91J39J59m70L69l15L64
3799B38j68n4K4j64j1J65j16J3kJ84j10p9K42l2j04J50l12Q5M34m41r9m7L16k91
3823a79J55l16M47j28o3M9J17k3l5M8J9r9l8o6p3M34p3k53p7K05O3l67K48J17
$$ y = [-107, 36, -150, -39, -339, -67, 42, -89, -175, 134, -20, 139, 176, -160, -81, 151, -217, -40, 227, 139, 195, 106, 19, -25, 80, -212, 114, -183, 71, 60, 38, -271, -101, -70, -7, -72, -66, 31, 81, -5, 14, 168, -132, -70, -401, 0, 77, 113, 34, -208, 329, -254, -155, -157, -159, 285, 35, -37, -2, -172, -14, 27, -196, 54, 133, 29, -70, 169, 391, -5, -59, -105, -239, 138, -290, 20, 7, -5, -45, 74, 52, 71, 109, 69, -95, -32, 24, -5, 69, -288, 140, 182, -65, 58, 271, 127, -127, -18, -30, -12, 59, -52, 177, 137, 306, 201, 40, 105, -73, 52, -37, -214, 226, -125, -257, -131, -34, -67, 28, -68, -165, 117, 43, -123, -217, 241, 234, -240, -113, 104, 193, -289, -51, -59, 183, -8, 131, 290, -180, 189, -126, 238, 70, 16, 40, -124, -135, 30, -86, -73, -75, 109, -1, -80, 162, 130, 26, 176, -136, -51, 383, -58, -157, -204, 112, -179, -24, -340, 107, -21, -84, -35, 82, 59, 24, 72, 91, -8, -46, -112, -185, 249, 176, -77, -154, 51, 114, -253, -5, 112]
3847A12l61N30l03p3P8m1L5O0J58j09l37L35k3o0j25L09k81n5O0O3J75l12K44
3870G9r8J58j82rN7m9L28j00K47n26K0J3K62j58l2j78J05m0K98j30j06J09O9o
3894A31k68L22k79K70j83m8p3K09k29J5K8K50j44j59J16L0J5k41LL73j44J38J29
3917B61M9k96K82o2k36l6q9K79l1l6m7j01o3J67J71j35Q9j87O6j62L09R2n7j36
3941I1j65K54j71L5P8k39J87j2pj01lJ85k96q6J77NJ1j92K12L19n11J69j3K07
3965A34j49K2J17k28J53k46J11N8l8j35J83J16l02mJ58Q7MJ2Q7q5N1O7j20p2j11
3990a30R7Q1o8o2l9p4O6K08k00J00j67P1J11J21K3j1q0m0M8n3K53l21K35l40J81
4015A0J57J37m54Q1k51L8K47K6J06k0j32P3r5M95n29O3R5O4k80J83j13MQ3J08
$$ y = [112, -249, 281, -22, -95, -17, -58, -23, 37, 195, 86, -251, 84, 61, 1, -124, 185, -96, -151, -91, -28, 147, -165, 79, -19, 139, -43, -52, 5, -44, 284, 184, 431, -95, -75, -62, 200, 42, 10, -168, -63, -103, 195, 65, -41, 68, 137, 131, -137, 185, -94, 176, -7, -55, -128, 81, -148, -133, -105, 145, 1, -158, -42, -12, 3, -238, -235, 138, -6, 132, 261, 310, 14, 296, 234, -2, -38, -127, 152, 121, 85, 38, -63, -126, 41, 212, 77, 166, -21, 45, -117, 192, 284, 227, 91, -74, 180, 9, 44, 122, -117, 70, 58, 51, -50, -53, 132, -164, -250, -73, -68, -57, -249, -37, 282, -229, -60, -73, 134, -15, 7, 124, -104, 49, -197, -86, -28, -66, -201, -18, 98, -204, -208, -50, 37, 41, 53, 140, 55, 106, 173, 53, -19, -130, -33, 48, -20, -82, -121, -195, -129, 79, -121, -21, -188, -117, -6, 115, 138, 127, 47, 7, 55, 2, 255, -66, 169, -171, 10, 167, 304, -150, -69, -320, -282, -35, -9, 97, 77, -55, 18, -77, 418, -111, -48, 47, 111, -169, 14, -99, -95, -12, 96]
4039I6J1k61P1K0K6O2m8l1l4J15k2p2J4oJ38k29J28J90k66J22j90L57j49M5n7
4064C0q5J31J20j38j4P5PlJ02l65J05o1L4p3J84l3j89K06j75J95r2NJ57k69j43
4089b89M29k24L82j92l77L44k42J40L10j45Q9l75J97j10k46J61P8O0O3j13j97
4110b57K46J16Q2l02J43J40N1k72L10l26J99j36L8n4Q5J55j54m0k23K83k38K03
4132D9j26N2J08O2l00R8J67j57p6Q2j56L11rm43L27K49k10k05K75Pk34K06j31
4155e4M0M39n34n8n6L85m40L56M6j02l89K89p0RL74l18K34OJ4k00P1q2K88k93
4179d5N4p7J91k39J80p5q9J25O3k02oL22l38Q0l6M07n26K06J63k68J54J42j52
4202C4j03J72l20K99N0l73M31k72K86k48j62k7M47Kl92P1l0K51l30j11L25J12
$$ y = [96, 107, -154, -83, -63, -37, 25, -23, -54, -88, 27, 5, -67, -53, -59, 79, -150, -22, 168, -98, 24, -166, 191, 42, 87, 30, -55, 76, 196, 58, 44, 119, 126, 123, 225, -140, -35, -96, -62, -135, 49, 16, -173, 33, -142, 53, -39, -34, 123, -146, -289, 140, -84, 298, 106, -271, 73, -169, -29, 281, 136, 225, -150, 47, -63, -309, -148, -70, -10, 53, -60, -257, -11, 105, 187, -115, 28, 168, 219, -53, 257, -69, 130, -6, 32, -22, 63, 218, 64, 24, -199, 84, -154, 49, -77, -25, 83, 145, -155, -57, 110, -47, -123, -41, -197, 114, 105, -338, -11, 238, 28, -177, 98, 105, -129, 77, -54, -14, 425, -109, -167, -223, 162, -278, 78, 124, 22, -367, -78, -148, -139, 235, -83, 151, 157, 171, -29, 42, -40, 248, -45, 9, -68, 123, -116, 64, -11, -100, 25, 88, -114, -120, 202, -136, -56, -92, 315, -211, -5, 158, -110, 44, 186, 34, -69, 103, -217, 82, 132, -241, 190, -82, 204, -44, -206, -233, 214, 216, -176, -105, -135, 116, -214, -325, 0, 112]
4224A12p6l57J67M3J58J50l53K96K4j24p5KJ16o8N8j62K39q5R1j18J50k20J38
4247A06j66q4L01j26K07l15j6M63n16J92R1L4j94J3J73k64r8J32N5k5kk28N03
4270B36m34L83k28J62l6j08K14m12K38K67k78n2K10j96J3o2J85j3n3Qo6J30j5
4293I3j65m2R9Q5P1k50PJ61m3J95k70J55N0L6j61j91K16M81n35J9j94M89m62J37
4317a9J19j05MM8j9o5K60j10M8q8j19J62j88Q0q8P7p5J9qM0j44L07j74K04N7r0
4343A33l39L30l5j85J66L1j27j09L51m68K24J5%q1J12k98K91j39J94L5q9k74o4
4366c26M29J55j33j63R9J70k22k52K34k85L31rm6J02rn6P2k82K10J99j74jK19
4389B62k17J53l5j50K23l51LO2O4r2J66k0J39j95k42K79LKPo3JO8R8j24k1p4J12
$$ y = [112, 36, -321, -154, -111, 47, 197, -156, 140, 164, 40, -35, -33, 83, 15, 73, -89, 150, 65, 156, 38, 188, -32, 106, -60, -144, 157, 31, 238, -77, -93, 370, -146, 46, 137, 171, -23, -10, 163, -101, -199, -67, -12, -37, -39, -267, 236, -198, 185, -43, 119, 83, -25, 189, -223, 15, 282, 4, -48, 162, -34, -21, -83, 102, 89, 36, 44, -22, 108, 93, -72, -114, -15, 70, 141, -109, -102, 59, 16, 211, -59, 96, 146, 182, 21, -170, 46, 527, -8, 11, -183, 306, -156, -19, 100, -5, -1, 47, 28, -37, 223, 113, 161, 73, -46, 116, -72, 8, -80, -3, -78, -59, -67, -27, -171, 136, -38, 166, 223, 133, -206, 124, 89, -96, 70, 101, -26, -135, 216, -252, -28, -13, -13, -94, 18, -280, 11, -128, 66, 101, 12, -262, -326, 103, 258, 125, -38, 61, 231, 9, -243, -9, -294, 37, 28, -18, 84, 75, 19, 91, -191, 19, 218, 44, 43, 262, 45, 198, 163, 13, 236, -115, -112, -50, 14, -78, 88, 68, 207, 12, -230, 49, 52, 54, 61, -2, -1, 67, 165, 41, 20, -54, 58]
4416E8k25K8L51k30L97r2k69l37M37pk03N3m1K60l88mL71q1l1k07K30oj47k8Q4
4441b7P7l8j65N6J62N0l3J98k47j29J56j24l6j42L16P8j40k1q9j1J61P4o9j43
4465h6K55o7j14n3K5N1K61j56j74M9Mj10K16J4P4k9Nl48L43j98J44o9j56L77l67
4490a09L2J82j63M1J59j1k79K90k65J22k46K69Q2J41m94J83O6k15K88O5j10j02
4512g4j18J60j17K14L4R9j12j76L9KJ83j61j48R8J3j16K72r9N5j67J63Kq9j10
4536a53J32j29J70Nkm19L89pK39r9P9J95m74j46L72k30k6L38l88K77j42Kj77P3
4560a21L2o7K45j10lqK0J63l92L94m0q6k33J47J64l76L02l9o3P5j3l31M95p9j21
4585d5J55o3J9n9j47J1J68rJ12k07J24r7j72L87k23J44k24M9K90m47J25L96l12
$$ y = [58, -167, -139, 212, -18, 379, 287, 18, -319, 118, 111, -92, -39, -80, 180, -208, -212, 159, 78, 47, -160, 70, 64, -83, -111, -27, 50, 12, -153, -97, 65, 115, 82, 280, 33, -96, 60, -64, -100, -242, 74, 152, 12, -9, -98, -109, 52, 126, 57, -86, 169, 102, -12, -65, -40, 11, 272, 116, -58, -9, -5, -115, 101, 115, 189, 160, 165, -183, 160, -38, 106, 37, -119, 258, -109, -77, 105, -58, -17, 142, 131, -148, 142, -123, -1, -247, 22, 104, 245, -249, -66, 0, -215, 73, 138, 28, -74, -192, -32, -149, 65, 99, 198, 86, -90, -51, -49, 134, -27, -175, -77, -64, -180, 92, -7, 48, -119, 44, 46, -43, -153, -21, -150, 20, 25, 23, -396, -7, -14, 225, 126, 205, 400, -74, -220, 152, -78, -104, 234, -154, 123, -19, -17, -194, -121, -89, -156, 89, -21, -24, -32, -12, 151, -241, 153, 113, 27, -206, -59, 105, -271, 31, -8, -71, 4, -9, -340, 155, 76, -45, 110, 47, 66, 7, -140, -129, 39, 30, 142, -65, 59, -38, -210, 177, -46, 98, -126, -77, 213, -234, -109, 287, -25]
4608b5L4J84k78K36j55l1J04k37J30J47p2K1j34j19K93k13j07K63J89k46k5L01
4630B60k84Q1O2q7J21j42P7k63K83L2j0o1j97MK94k76J45P4K22k54l69K56P1J16
4654A55j74J16k81l4M50j14j53Qj8R0k63L56Lk20K66j94Q7k08k74L16M0K1rN1
4678A7j44M62k11m06L77n7J25k34q0K32n2k38L42j97j1j4j09L55l6nj13l8J52
4701A17q8J07j15p7k36J96j57L45j5L8L8j38j07j10K40N0K40k89k33P1J47j87
4723a63J32O0J47m06K82kr8k03J2K09K41k80k86M77k59n8N65m23K97k19l05K27
4745e3m0P6J43l9OJ21l15J27r4N6L3o0J02l21K23L7j03Q0L51o50L86j52K28pO2
4770A97l03n0Q8r4NL08l03K48j29Q4no7J9%r0M2j53J66J7J36m4j89jK65q2P2j12
$$ y = [-25, 9, 193, -85, 151, -4, -35, 69, -168, -38, 109, 37, 58, -76, -195, 98, -115, -222, 41, 230, -16, -41, 260, -24, 57, 119, 32, 153, 11, 88, -175, 108, 140, 130, 69, -128, -124, 170, -106, 39, 113, 335, 81, -288, -32, 39, 155, -19, 97, -184, -218, 232, 118, -35, -27, -45, 45, -218, 138, 141, -79, 187, -7, 80, -128, -402, -86, -46, -25, -34, 17, -127, 335, 124, -282, 95, 38, 163, -71, -151, 81, 29, -209, 133, -64, -75, -89, -198, 157, 121, 116, 3, -35, 117, 29, 136, 21, -56, -292, -96, -253, 92, 77, 115, 153, 15, -92, -202, 38, 88, 328, 39, -194, -123, 24, -163, -31, 29, 176, -230, 52, 50, -48, -251, -239, -30, 211, -69, -355, 122, -137, -195, 370, -53, 244, 25, -280, -53, -93, -17, 126, 87, 93, 214, -101, 26, -68, -12, 21, -39, 63, -258, -35, 2, -101, -21, 330, -320, 66, -86, 142, 135, 197, -106, -156, -68, -162, -157, 151, -152, 96, -33, 51, 46, -21, -2, -2, -92, -50, -203, -37, -20, 116, 72, -117, -118, 147, 65, 137, 25]
4797B5j48R0j10K92j60O4k00K00rj2j88M39k30M2l52L10j22K31n9J98k55J48k16
4820b2J25j97J9j5k0K44k8j58k8K54k74N4J11O1l40J66j22M7P0J45l26J58J31
4843E5l51M48l79K92qk49Q8j15L20K7l5R3l94L21L8p9J43j18n2%j06Q2J10j1j14
4868Fj9j17L68j90K25N7m42J31j4j65L27j84j01J84j69J12J0K52l48O1K98m77
4890a95J96J06r2o8L6Q9j72J01K14m21L74j41M7L4k43JK89k03j47p3M14J78l55
4913c1j95M0L63q4m7L2J37l17K04j96n5J9j4k1J02r1M54o8j79j69J63j53K21j51
4937c6J14k7mr5J89j63J74l33J87j4J31l03J95M6J55k82R6j72O6j0J45R3l8j61
4961d7K78l85J45j45kL19k4k99L92l39m6J40k41J80J10j35J08k02j07L72k95P5
$$ y = [25, -123, -33, -143, 149, -11, 53, -147, 53, 44, 32, -156, 283, 53, 95, -257, 53, -69, 162, 103, 301, 46, 194, -22, 103, -94, -75, -90, -110, 134, 106, -52, -80, 174, -100, -46, 65, 126, -214, -48, -170, -123, -53, 92, -234, -76, 55, -296, 152, -227, 65, 57, -192, -104, -219, 101, 128, 93, 186, -208, 113, 151, 72, 215, 97, 45, 45, -61, 21, 131, 120, 6, -13, -130, 238, 48, 273, 330, -112, 19, 5, -160, 167, -17, -118, 66, -103, 9, 19, 271, -77, -16, 282, -195, 1, 107, 15, -53, -17, 72, -100, 1, 215, -206, 168, 27, 74, 108, -135, -134, 155, -48, -195, -268, 146, 324, -31, -226, -186, 177, 93, 46, 78, 215, -102, 102, -94, -149, -130, -144, -165, -63, -154, 300, 232, 53, -116, 47, -106, 115, -36, 78, 51, 47, -48, 141, -22, 152, -181, 6, -8, 123, -180, 15, 61, 216, -66, 30, -142, -76, -86, 59, 152, 114, -47, 231, -154, -9, -154, -156, 163, 139, -160, 232, -107, -153, -13, -254, -74, 36, -99, 9, -193, -300, 72, -223, -148]
4983a48J54K7r8J8j0J58j12J30m87J74N9P7k17M24j99J00L0k73L85p1l22j6K12
5006ej39J31K99k96J9j5L72r4l41J52k56K44N0k9l73K99M9j05j26Q6J74j44j3
5029f1j72K46L8m16M16k08L69k31Pj89J27K7J09P7j9L8J7k97n7K1J44k05L01J38
5053B20l26K8J24J93l97L04k75L51j15j7L3Oj07L9k47L63j95l8O8j95K09Rl3N7
5077E9k26J02K88k95J13q1J18n5k78K79j46K34l09k8J10j78K39j5K4p8j11K31
5099cj56L18j83M3o4K24k92J20m9N4J05k35J91M4j95L0O0oP4jnk54L33j53J31
5124A31j39k29L54j11O3j7j59L67m08K15j84J74J78j76Jk7j12n4O6K38j35r2j39
5147a95K16m0R3k83J51J10j33m6K53Ml3l44J04K5M9M3M0N6n3K02m22N0J82j39
$$ y = [-148, 6, 33, -65, -47, -57, 101, -11, 119, -368, -194, -135, -58, -275, 149, -50, 50, 80, -193, 192, 121, -201, -217, -5, -144, -13, 286, -10, 9, -6, 366, 272, -69, 83, -173, 71, 121, 92, -281, 18, 67, -38, -164, -78, 96, -48, -61, -233, 13, 51, -365, 51, -157, 212, -19, -12, -201, -74, -47, 62, 139, 120, 158, 175, -122, -179, -158, -14, -219, 82, 220, -106, -78, 46, 239, -158, 146, -129, 222, 107, 90, 123, 129, 22, 61, -186, 177, -18, -56, 12, -183, 26, 35, 2, 59, -167, -65, 223, -72, 41, -40, 78, 23, -255, 24, -122, 112, -197, -225, -115, -293, -54, -69, -45, -123, -234, -3, -159, 159, -24, 19, -45, 179, -113, 7, -42, 12, 117, -118, 73, 117, -78, -48, 12, 6, 80, 79, 74, -180, 153, 0, 131, -8, -237, 117, 6, 69, 52, -107, 260, -148, 67, -117, 57, 235, 59, 60, 33, -79, -133, -67, 171, 36, -56, -195, 21, -19, 74, -209, -58, 52, -81, -127, 126, 130, 97, -247, -143, -118, -69, -26, 14, 70, 17, 219, -203, -153, 29, -110]
5171a10N1K95k0q0j74j51mL40k32K00l3k57K18j8J23j3l6j63l15L91p0K18k76
5194a16L23m62K99l9k26K32j68L2nK02k81J28r9J72L1K02j74P9K11p1l99K39m9
5217F1K6j56J50np3K83k95q6R1r3o4M12l99K36j68O3O5m9qn4J86k36J15K9n3j76
5243a98L32k15q4J14K51j80j98J99N9j81p0K27J3Q4l54L67nlm9J15l70jJ25M9
5267B7j83P6lJ41n0K65k58NK71j57j72N6J55p5j02Q5m4j9q2Q0k2n0J86j65J55
5292A20o9r4N8n0L4O1k40m3N05j20q8P2J16l1k75k39K39Q5J77n5k5l10K07N9J41
5317B35l41j18K33Q0%l79J95M40m44K85j20k25K32m53j7J74K90r4J15q3N6k04
5339a43J71J00q5q8k44L13n7M0j05J4j09Q1j46J90M9J77o7L6l09o1M97o91M01
$$ y = [-110, -59, 236, 216, 136, -38, -189, -193, 147, -85, 115, 82, -175, 43, 25, 148, 135, 99, -64, -379, 12, -58, 160, -116, 207, -255, 44, 5, -221, 11, -157, -125, -130, 72, -209, -81, -180, -8, 23, 225, 51, 130, 341, 270, -129, 110, 61, 87, -69, 81, 76, 3, 286, -9, -95, -4, -97, -161, 251, -148, 88, -80, -17, 48, -1, -9, -63, 123, -113, 2, 31, -22, -198, 134, -81, -165, -51, 200, 20, -178, 21, 80, -101, -171, 56, 69, 153, -201, 166, 161, 158, 109, 224, -146, -147, -22, 27, -156, -80, -83, 58, 8, 273, 15, 20, 291, 134, -38, 18, 173, 98, -4, 81, 37, 18, -64, 16, -6, -56, 130, -35, 120, 51, -43, 15, -35, -1, 60, -180, -223, 282, 162, 74, 146, 262, 231, -44, -283, -44, 41, 218, 163, 138, -172, 35, 94, 235, -106, -224, 9, 89, 89, -290, -95, 345, -99, 186, 66, -159, 73, -380, -397, -223, 67, -27, 88, 5, 61, -143, 28, 128, 43, -45, -289, 24, -33, 7, -98, -84, -193, -112, -258, -68, -19, 158, 91, 127, -182, -243, 254, -437, -36]
5362c6j12J67O3O9l81K5PK55J45k94J03q0j50j4J80L32m69J08m1N52l80J06M6
5385B01N4k02l4J69m9J60m36O14k18l99m7K86k92K02n4k1p1o7m0K22k13L43k22
5408a14J11J05l36J26K65J95k47N6l04J25n9K32r1j10J33q0J84k44J17R2p5r2
5430a1J26j74k1L29k39j36L1J85j04k0j99Q4j51L09k74N8L41l5o5l5O7N5j07N2
5454F6J66j44j49k5mj7J54k27K49L4j03J88k43P5j30K52k62N0N4L1q3K15j13k36
5478b02K72k27L04j17J37l30jM28k32m4J14k16l6q9J61J53j88o7P2Q1J8N4J5j52
5502i2O4Qp3L39l51J35k11J62L31l80m8q1L96k08K35l38l4K93k18J08n8J27o7
5525C9j11J5l5J57j81L13J12m69K68J19l47J45J46j97K54o01M65r5M6J6l51M95
$$ y = [-36, -148, 19, 82, 151, -230, -205, -198, 57, 202, -92, 11, -69, -219, -233, -53, 279, -190, -82, -123, 429, 49, 155, 201, 255, 53, 19, 188, 139, 299, -137, 477, 259, -140, -187, 99, -193, 9, -45, -66, -137, -204, -244, -22, -235, 108, -114, -3, 102, -234, -108, 157, 352, 105, 161, -143, -18, -77, 155, 64, -46, 87, 7, 191, -53, 64, 156, 81, -11, 115, -59, -80, 249, 10, -126, -95, 90, -14, -34, -233, -149, -300, 9, -265, -207, 134, 99, 34, -1, 66, 121, 14, 66, 232, 88, -61, -86, -90, -107, 47, -180, 69, 103, 0, 188, -55, 20, -110, 142, -120, -70, -16, 15, -68, 147, 34, -202, 70, -157, 147, 30, 167, -163, -164, 264, 32, -12, 102, -114, -150, -239, -78, 75, -113, -180, -108, -27, -9, 45, 60, -92, -28, -20, -93, 246, -105, 30, -181, -19, 312, -68, -116, -197, 199, -9, 226, -112, -146, 147, -71, 37, -21, 106, 39, -72, -57, -92, 65, -116, 197, 309, -160, 108, 227, -120, 25, 171, -26, 228, -373, 92, -3, 43, 59, -292, 203]
5547B03l25M77l36m3j5L9q8K78l03k4Q3K60l75J31K93n30K85l8j49L17j77J24
5569H7j54K9K2K56m04J03L08j79k03K32p8l21L31P9o4j37J40j31j16L90k87J83
5591H6k78pK55K71j13k17r5K41K62m64K7n0J80k83l3o3J71K65j41M6k88J99O8
5614C9j07j41K55j24J66L8k25J27L7j43j50L21J9k25j2L42j72j18K25j89J88J26
5636B77o4k7m77O8L42k08K11j9k92O1K26k23P1J08r0o0k4o8L53j25j18%L22l42
5660i8J56J22l71M22l18J40j67P6n9j49L84p3q6K0n3R7K32k69j41J32P1j15P6
5683B9K05l57O8m6J73J38k65J16j95K88j65j79J70J90k31J48j31r6K60J17l82
5704a45L35j17j58j18L32k51J1K06p1j84k6J09Q8oR6p2J80l8j34J99m21L19j08
$$ y = [203, -122, 355, 19, -24, -39, 0, -88, 190, -113, -137, -54, 206, -169, -38, 255, -275, 10, -28, -177, 140, -37, 87, -67, -38, -16, 240, -164, -61, 247, 68, -135, 97, 19, -302, 29, 108, 44, -93, 47, -84, -200, 190, -97, 86, -192, -199, 56, 327, 214, -3, -98, 143, 405, -59, -32, -82, 98, -185, -218, -281, -110, 155, 14, 60, -228, -29, 39, -68, -209, 46, -78, 88, 126, -99, 28, 65, -78, -228, 93, 112, -113, -125, 217, 45, -73, 152, -37, 151, 277, 213, 186, -291, -223, 119, -89, 122, 103, -189, -128, 98, -125, -54, 54, -36, -96, -120, -188, 165, 40, -78, -78, 244, -98, 58, 180, -191, 231, -87, 53, -114, -38, -97, -246, 138, 65, -21, -1, -54, 43, 275, 6, -135, -3, 68, -47, 29, 234, -123, -55, -101, 72, 210, -55, 61, -134, 154, -11, -190, -20, 170, -61, 87, -44, -140, 120, 237, -145, 190, 73, -85, -203, 129, -122, -111, 95, 24, -160, -186, -77, 11, 5, 101, 29, 209, 171, 37, 236, -185, 134, 26]
5727B6j8j92J34J97j66Kk61M70l45J97j3j17Q6M9k32J71J38P4l53K44p6J24j28
5750A1j4l9K47Qj42p4q3O7k50L45q6N4M6n7mo6J29mj26m0J9m4J14p6K43j96O0
$$ y = [26, 8, -184, -50, 147, -19, -17, -278, 192, -153, 44, 31, -86, 0, 49, -183, -12, 126, 200, -153, 91, 15, 139, 11, -3, -42, 205, 213, 71, -3, -86, -19, -269, 76, -10, 44, 90, 33, 29, -37, 92, 88, -38, -78, -59, -103, 11, -65, 178, -18, 42]
$$ [...]
8191B8
##END NTUPLES=NMR FID
##END=
