##TITLE=1H_3mBBC-2
 CDCl3
 8 sc, 
 29.06.2022
##JCAMPDX= 6.0         $$ Bruker NMR JCAMP-DX V2.0
##DATA TYPE= NMR FID
##DATA CLASS= NTUPLES
##ORIGIN= UXNMR, Bruker Analytische Messtechnik GmbH
##OWNER= root
$$ XWIN-NMR		Version 3.5
$$ Wed Jun 29 13:50:53 2022 Russian Standard Time (UT+4h)  she@DPX200
##.OBSERVE FREQUENCY= 200.1313499994
##.OBSERVE NUCLEUS= ^1H
##.DELAY= (6, 6)
##.ACQUISITION MODE= SIMULTANEOUS
##.ACQUISITION SCHEME= undefined
##.AVERAGES= 8
##.DIGITISER RES= 18
##SPECTROMETER/DATA SYSTEM= spect
##.PULSE SEQUENCE= zg30
##.SOLVENT NAME= CDCl3
##.SHIFT REFERENCE= (INTERNAL, CDCl3, 0, 15.7039)
##AUDIT TRAIL= $$ (NUMBER, WHEN, WHO, WHERE, WHAT)
$$ ##TITLE= Audit trail, XWIN-NMR		Version 3.5
$$ ##JCAMPDX= 5.01
$$ ##ORIGIN= Bruker BioSpin GmbH
$$ ##OWNER= she
$$ F:/spectra/data/she/nmr/H-F/1/audita.txt
$$ ##AUDIT TRAIL=  $$ (NUMBER, WHEN, WHO, WHERE, WHAT)
(   1,<2022-06-29 13:49:58.64 +0400>,<she>,<DPX200>,
      <created by zg, POWCHK disabled, PULCHK disabled
       configuration hash MD5:
       00 E9 B6 7A A2 85 ED C7 34 08 36 98 17 FE 4E 26
       data hash MD5: 16K
       F3 70 B7 A9 2C 19 C7 EE A4 DE 17 37 79 4C 57 7B>)
$$ ##END=
$$ 
$$ hash MD5
$$ 48 B4 6A C6 8A 9F 93 26 EA D4 EC 46 3A 26 17 74
##$RELAX= 
##$RELAX= 
##$RELAX= 
##$RELAX= 
##$RELAX= 
##$RELAX= 
$$ Bruker specific parameters
$$ --------------------------
##$DU= <F:/spectra>
##$EXPNO= 1
##$NAME= <H-F>
##$PROCNO= 1
##$TYPE= <nmr>
##$USER= <she>
##$AMP= (0..31)
100 100 100 100 100 100 100 100 100 100 100 100 100 100 100 100 100 100 
100 100 100 100 100 100 100 100 100 100 100 100 100 100 
##$AQSEQ= 0
##$AQ_mod= 1
##$AUNM= <au_zg>
##$AUTOPOS= <>
##$BF1= 200.13
##$BF2= 200.13
##$BF3= 200.13
##$BF4= 200.13
##$BF5= 200.13
##$BF6= 200.13
##$BF7= 200.13
##$BF8= 200.13
##$BYTORDA= 1
##$CFDGTYP= 0
##$CFRGTYP= 5
##$CHEMSTR= <none>
##$CNST= (0..31)
1 1 145 1 1 1 1 1 1 1 1 1 1 1 1 1 1 1 1 1 1 1 1 1 1 1 1 1 1 1 1 1 
##$CPDPRG= <>
##$CPDPRG1= <>
##$CPDPRG2= <>
##$CPDPRG3= <>
##$CPDPRG4= <mlev>
##$CPDPRG5= <mlev>
##$CPDPRG6= <mlev>
##$CPDPRG7= <mlev>
##$CPDPRG8= <mlev>
##$CPDPRGB= <>
##$CPDPRGT= <>
##$D= (0..31)
0 1.2 0 0 0 0 0 0 0 0.06 0 0.03 0 0 0 0 0.0002 0 0 0 0 0 0 0 0 0 0 0 0 
0 0 0 
##$DATE= 1656496198
##$DBL= (0..7)
120 120 120 120 120 120 120 120 
##$DBP= (0..7)
150 150 150 150 150 150 150 150 
##$DBP07= 0
##$DBPNAM0= <>
##$DBPNAM1= <>
##$DBPNAM2= <>
##$DBPNAM3= <>
##$DBPNAM4= <>
##$DBPNAM5= <>
##$DBPNAM6= <>
##$DBPNAM7= <>
##$DBPOAL= (0..7)
0.5 0.5 0.5 0.5 0.5 0.5 0.5 0.5 
##$DBPOFFS= (0..7)
0 0 0 0 0 0 0 0 
##$DE= 6
##$DECBNUC= <off>
##$DECIM= 32
##$DECNUC= <off>
##$DECSTAT= 4
##$DIGMOD= 1
##$DIGTYP= 9
##$DL= (0..7)
0 120 120 120 120 120 120 120 
##$DP= (0..7)
150 150 150 150 150 150 150 150 
##$DP07= 0
##$DPNAME0= <>
##$DPNAME1= <>
##$DPNAME2= <>
##$DPNAME3= <>
##$DPNAME4= <>
##$DPNAME5= <>
##$DPNAME6= <>
##$DPNAME7= <>
##$DPOAL= (0..7)
0.5 0.5 0.5 0.5 0.5 0.5 0.5 0.5 
##$DPOFFS= (0..7)
0 0 0 0 0 0 0 0 
##$DQDMODE= 0
##$DR= 18
##$DS= 0
##$DSLIST= <SSSSSSSSSSSSSSS>
$$ [...]
##$SUBNAM2= <"">
##$SUBNAM3= <"">
##$SUBNAM4= <"">
##$SUBNAM5= <"">
##$SUBNAM6= <"">
##$SUBNAM7= <"">
##$SUBNAM8= <"">
##$SUBNAM9= <"">
##$SW= 18.0517283424941
##$SWIBOX= (0..15)
0 0 2 0 0 0 0 0 0 0 0 0 0 0 0 0 
##$SW_h= 3612.71676300578
##$TD= 16384
##$TD0= 1
##$TE= 0
##$TE2= 300
##$TE3= 300
##$TEG= 300
##$TL= (0..7)
0 120 120 120 120 120 120 120 
##$TP= (0..7)
150 150 150 150 150 150 150 150 
##$TP07= 0
##$TPNAME0= <>
##$TPNAME1= <>
##$TPNAME2= <>
##$TPNAME3= <>
##$TPNAME4= <>
##$TPNAME5= <>
##$TPNAME6= <>
##$TPNAME7= <>
##$TPOAL= (0..7)
0.5 0.5 0.5 0.5 0.5 0.5 0.5 0.5 
##$TPOFFS= (0..7)
0 0 0 0 0 0 0 0 
##$TUNHIN= 0
##$TUNHOUT= 0
##$TUNXOUT= 0
##$USERA1= <user>
##$USERA2= <user>
##$USERA3= <user>
##$USERA4= <user>
##$USERA5= <user>
##$V9= 5
##$VALIST= <valist>
##$VCLIST= <CCCCCCCCCCCCCCC>
##$VD= 0
##$VDLIST= <DDDDDDDDDDDDDDD>
##$VPLIST= <PPPPPPPPPPPPPPP>
##$VTLIST= <TTTTTTTTTTTTTTT>
##$WBST= 1024
##$WBSW= 4
##$XGAIN= (0..3)
0 0 0 0 
##$XL= 0
##$YL= 0
##$YMAX_a= 371306
##$YMIN_a= -359056
##$ZGOPTNS= <>
##$ZL1= 120
##$ZL2= 120
##$ZL3= 120
##$ZL4= 120
##$ABSF1= 10
##$ABSF2= 0
##$ABSG= 5
##$ABSL= 3
##$ALPHA= 0
##$AQORDER= 0
##$ASSFAC= 0
##$ASSFACI= 0
##$ASSFACX= 0
##$ASSWID= 0
##$AUNMP= <proc_1d>
##$AZFE= 0.1
##$AZFW= 0.1
##$BCFW= 1
##$BC_mod= 2
##$BYTORDP= 1
##$COROFFS= 0
##$CY= 11.3945322036743
##$DATMOD= 1
##$DC= 2
##$DFILT= <>
##$DTYPP= 0
##$F1P= 2.36226072786647
##$F2P= -0.459571619588291
##$FCOR= 0.5
##$FTSIZE= 0
##$FT_mod= 4
##$GAMMA= 1
##$GB= 0.15
##$INTBC= 1
##$INTSCL= 1
##$ISEN= 128
##$LB= 0.24
##$LEV0= 0
##$LPBIN= 0
##$MAXI= 10000
##$MC2= 0
##$MEAN= 0
##$ME_mod= 0
##$MI= 1.114404
##$NCOEF= 0
##$NC_proc= 0
##$NLEV= 6
##$NOISF1= 3.799351
##$NOISF2= 2.8
##$NSP= 1
##$NTH_PI= 0
##$NZP= 0
##$OFFSET= 15.70392
##$PC= 1
##$PHC0= -18053.45
##$PHC1= 23.80069
##$PH_mod= 1
##$PKNL= yes
##$PPARMOD= 0
##$PSCAL= 0
##$PSIGN= 0
##$REVERSE= no
##$SF= 200.130013532006
##$SI= 16384
##$SIGF1= 3
##$SIGF2= 2
##$SINO= 400
##$SIOLD= 16384
##$SREGLST= <1H.CDCl3>
##$SSB= 0
##$STSI= 0
##$STSR= 0
##$SW_p= 3612.71676300578
##$SYMM= 0
##$S_DEV= 0
##$TDeff= 0
##$TDoff= 0
##$TI= <>
##$TILT= no
##$TM1= 0
##$TM2= 0
##$TOPLEV= 0
##$USERP1= <user>
##$USERP2= <user>
##$USERP3= <user>
##$USERP4= <user>
##$USERP5= <user>
##$WDW= 1
##$XDIM= 8192
##$YMAX_p= 0
##$YMIN_p= 0
$$ End of Bruker specific parameters
$$ ---------------------------------
##NTUPLES= NMR FID
##VAR_NAME=  TIME,          FID/REAL,        FID/IMAG
##SYMBOL=    X,             R,               I
##VAR_TYPE=  INDEPENDENT,   DEPENDENT,       DEPENDENT
##VAR_FORM=  AFFN,          ASDF,            ASDF
##VAR_DIM=   8192,          8192,            8192
##UNITS=     SECONDS,       ARBITRARY UNITS, ARBITRARY UNITS
##FACTOR=    0.0002768,     1,               1
##FIRST=     0,             0,               0
##LAST=      2.2672688,     0,               0
##MIN=       0,             -359056,         0
##MAX=       2.2672688,     371306,          0
$$ Real data points
##PAGE= N=1
##DATA TABLE= (X++(R..R)), XYDATA
$$ plain form
0 0 0 0 0 0 0 0 0 0 0 0 0 8 -8 8 -16 16 -24 24 -32 40 -48 56 -64 80 -90 105 -126 144 -166 190 -218 250 -284
33 -284 321 -364 409 -462 518 -577 645 -719 800 -887 982 -1086 1202 -1329 1465 -1612 1777
50 1777 -1958 2158 -2377 2620 -2892 3202 -3549 3946 -4407 4946 -5589 6371 -7342 8587
64 8587 -10255 12605 -16187 22344 -35783 127802 -221179 -201998 371306 -97475 -325016
75 -325016 202210 156957 -287077 42961 252960 -118183 -130453 184241 27784 -173341
85 -173341 10227 125531 -74757 -110705 99225 81501 -145287 -17515 176195 -65899
95 -65899 -153898 169542 70419 -217618 59191 188919 -183280 -82988 229242 -60395 -182287
106 -182287 181332 77186 -200429 63913 155668 -152214 -66366 153541 -43960 -126956
$$ packed form
0@%%%%%%%%%%%Qj6J6k4L2m0M8n6P2q8J04j20J44j70J95k31K70l10L56m08M68n34
33b84O05o85P73q71R80j095J222j364J519j687J869k068K288k531K794l077L389
50A777l735M116m535M997n512O094o751P495q353R353j0535J1960j3713J5929
64H587j8842K2860k8792L8531n8127J63585l48981J9181N73304m68781k27541
75c25016N27226m5253m44034L30038K09999l71143j2270L14694j56457k01125
85a73341J83568J15304k00288l5948K09930j7724k26788J27772J93710k42094
95f5899q7999L23440r9123k88037K76809J29728l72199J00292L12230k89637j21892
106a82287L63619j04146k77615K64342R1755l07882Q5848K19907j97501q2996
$$ plain form
116 -126956 94109 70219 -98729 -8813 99163 -23228 -92211 44654 70193 -91285 -46418
127 -46418 129549 -7234 -135031 95702 103798 -163257 -14528 182435 -97622 -132466 181133
138 181133 25730 -195912 93533 137687 -172026 -32216 181690 -72075 -129033 136232
148 136232 47106 -146169 26605 112517 -78494 -70757 95749 25190 -99368 16277 98520
159 98520 -54011 -80250 95862 39428 -129080 22053 127224 -93123 -77632 148521 -2368
170 -2368 -149015 93050 94072 -152733 -5502 151617 -84409 -95886 137055 13520 -133776
181 -133776 62657 87309 -104628 -24913 104675 -30535 -79132 63351 43232 -76901 -9149
192 -9149 77470 -23697 -69811 54835 48356 -81890 -9869 93980 -40691 -77341 87601
$$ packed form
116a26956K21065k3890j68948Q9916J07976j22391o8983J36865K5539j61478M4867
127d6418J75967j36783j27797K30733Q096k67055J48729J96963k80057l4844L13599
138A81133j55403k21642K89445M4154l09713J39810K13906k53765n6958K65265
148A36232q9126j93275J72774Q5912j91011P737J66506p0559j24558J15645Q2243
159I8520j52531k6239J76112n6434j68508J51133J05171k20347J5491K26153j50889
170b368j46647K42065J022k46805J47231J57119k36026j1477K32941j23535j47296
181a33776J96433K4652j91937P9715J29588j35210m8597J42483k0119j20133O7752
192i149Q6619j01167m6114J24646o479j30246P2021J03849j34671l6650J64942
$$ plain form
203 87601 29843 -109803 35505 94331 -90349 -39690 116051 -26953 -97126 82440 46042
214 46042 -104695 14477 89483 -62109 -50883 82312 5036 -80027 29915 59255 -55590
225 -55590 -35639 67662 5792 -72965 26344 65713 -59808 -39643 87105 -2419 -90349
236 -90349 56372 66548 -95097 -11190 108267 -48975 -79578 96627 24078 -108686 38138
247 38138 82248 -84357 -32934 95450 -23675 -80005 60260 41036 -78791 -2746 72545
258 72545 -31860 -55118 55097 29844 -67136 2652 70087 -34460 -53568 67218 24690
269 24690 -81272 21634 76114 -63384 -40853 90072 -10298 -86285 59083 50564 -90502
280 -90502 -570 85901 -51304 -56858 77887 8655 -81033 32918 57932 -61265 -24291
$$ packed form
203H7601n7758j39646J45308N8826j84680N0659J55741j43004p0173J79566l6398
214D6042j50737J19172P5006j51592J1226J33195p7276q5063J09942K9340j14845
225e5590J9951J03301o1870p8757R9309L9369j25521K0165J26748q9524q7930
236i0349J46721J0176j61645Q3907J19457j57242l0603J76205p2549j32764J46824
247C8138M4110j66605N1423J28384j19125n6330J40265j9224j19827P6045P5291
258G2545j04405k3258J10215k5253r6980O9788O7435j04547j9108J20786m2528
269B4690j05962J02906N4480j39498K2531J30925j00370p5987J45368q519j41066
280i0502Q9932Q6471j37205n554J34745o9232q9688J13951K5014j19197L6974
$$ plain form
291 -24291 69177 -9269 -59279 38538 42328 -54132 -13666 64113 -13536 -57427 44509 39302
303 39302 -65448 -5953 71896 -33464 -57213 64814 20270 -80010 22430 65797 -61864
314 -61864 -33390 76812 -12274 -70293 48642 40192 -68590 -1930 67354 -31556 -47070 55297
326 55297 20117 -60532 12044 55612 -36165 -35622 55443 10119 -60993 21009 52905 -49078
338 -49078 -29689 65462 -6184 -66102 40478 43341 -67374 -8217 71600 -32869 -54688 62153
350 62153 19202 -72262 20845 59925 -52196 -29402 67476 -5951 -61219 39060 40674 -57019
362 -57019 -9365 61146 -21368 -48956 45865 25136 -58849 4653 56761 -34075 -39935 54510
374 54510 10827 -61326 20739 49594 -48027 -24137 60944 -9083 -56381 39322 35299 -57542
$$ packed form
291b4291R3468p8446n0010R7817L790r6460M0466P7779p7649m3891J01936n207
303C9302j04750N9495P7849j05360k3749J22027m4544j00280J02440M3367j27661
314f1864K8474J10202q9086n8019J18935q450j08782O6660O9284r8910j5514J02367
326E5297l5180q0649P2576M3568r1777N43R1065m5324p1112Q2002L1896j01983
338d9078J9389R5151p1646n9918J06580K863j10715N9157P9817j04469k1819J16841
350F2153m2951r1464R3107L9080j12121K2794R6878p3427n5268J00279J614r7693
362e7019M7654P0511q2514k7588R4821k0729q3985O3502N2108r0836n860R4445
374E4510m3683p2153Q2065K8855r7621K3890Q5081p0027m7298R5703m023r2841
$$ plain form
386 -57542 -3733 59054 -27395 -43738 49844 16742 -57883 13859 50396 -39448 -28942 54262
398 54262 895 -54108 27871 39793 -48286 -14501 56335 -14545 -48665 40087 27596 -54338
410 -54338 1333 53219 -30026 -37843 48908 10721 -55385 17264 45518 -41055 -24584 52617
422 52617 -3279 -50716 29163 35182 -47197 -10058 53299 -16716 -44129 41056 23912 -52489
434 -52489 4931 51595 -30743 -34476 49592 8246 -54237 20085 42708 -43295 -20318 52614
446 52614 -9133 -49305 33200 29959 -50254 -5474 51428 -21740 -40381 41963 18476 -50992
458 -50992 9234 48074 -32789 -29469 51050 5008 -52637 24579 41899 -45504 -16663 55181
470 55181 -13137 -47895 38580 25317 -53476 2600 49471 -30819 -33973 46004 6865 -49787
$$ packed form
386e7542N3809O2787q6449j6343R3582l3102p4625P1742L6537q9844J0506Q3204
398E4262n3367n5003Q1979J1922q8079L3785P0836p0880l4120Q8752j2491q1934
410e4338N5671N1886q3245p817Q6751l8187o6106P2649K8254q6573J6471P7201
422E2617n5896m7437P9879O019q2379L7139O3357p0015k7413Q5185j7144p6401
434e2489N7420M6664q2338l733Q4068m1346o2483P4322K2623q6003K2977P2932
446E2614o1747m0172Q2505l241q0213M4780N6902p3168j8641Q2344k3487o9468
458e0992O0226L8840q0863L320Q0519m6042n7645P7216J7320q7403K8841P1844
470E5181o8318l4758Q6475j3263p8793N6076M6871q0290l154P9977l9139n6652
$$ plain form
482 -49787 17355 37671 -36259 -18170 44284 -4013 -40283 24706 28833 -36986 -8390 43530
494 43530 -10813 -36477 31581 23085 -42739 -550 44472 -22632 -33370 39954 10789 -47712
506 -47712 13660 38594 -37346 -20664 46162 -6143 -44268 27989 27697 -41947 -5074 43769
518 43769 -16512 -32646 34171 16547 -39940 5536 39000 -23001 -25855 37879 8523 -41789
530 -41789 13202 35651 -32485 -19989 42474 -4249 -42310 25577 26264 -42247 -4633 43154
542 43154 -20371 -32644 36718 11900 -41669 10546 34480 -27323 -17366 36311 -672 -33109
554 -33109 19117 24568 -29733 -8664 34929 -7211 -31323 22574 20333 -33920 -3486 35853
566 35853 -16938 -29078 32447 10707 -40558 10661 34380 -31051 -17553 40269 -5721 -36406
$$ packed form
482d9787O7142K0316p3930J8089O2454m8297l6270O4989M127o5819K8596N1920
494D3530n4343k5664O8058q496o5824M2189M5022o7104j0738P3324k9165n8501
506d7712O1372K4934p5940J6682O6826n2305l8125P2257k92o9644L6873M8843
518D3769o0281j6134O6817j7624n6487M5476L3464o2001k854O3734k9356n0312
530d1789N4991K2449o8136J2496O2463m6723l8061O7887O87o8511L7614M7787
542D3154o3525j2273O9362k4818n3569N2215K3934o1803R957N3677l6983l2437
554c3109N2226N451n4301K1069M3593m2140k4112N3897k241n4253L0434L9339
566C5853n2791j2140O1525k1740n1265N1219K3719o5431J3498N7822m5990l0685
$$ plain form
578 -36406 26048 21122 -36868 427 35735 -19053 -23189 31051 6848 -32051 9997 26387
590 26387 -21972 -14991 28660 1668 -29228 11858 23612 -23728 -12289 30826 -3870 -30306
602 -30306 20689 20066 -32921 -3045 35245 -17112 -26437 31593 8148 -36161 12181 28315 -27781
615 -27781 -12290 33544 -6290 -28768 20790 16980 -28053 -2129 28350 -10399 -21984 20896
627 20896 12340 -26296 785 27290 -14247 -21282 26456 8630 -33186 8782 30212 -26683
639 -26683 -17306 36418 -3843 -35534 23762 20853 -36933 -76 35943 -21372 -23541 33468 4357
652 4357 -34005 14296 24927 -25036 -9454 29417 -4227 -24375 16746 17243 -23413 -5868 26880
665 26880 -6153 -25088 18046 16527 -28863 -3492 30879 -14571 -26214 27957 8778 -36134
$$ packed form
578c6406O2454m926n7990L7295L5308n4788m136N4240k4203l8899M2048J6390
590B6387m8359O981M3651k6992l0896M1086J1754m7340J1439M3115l4696k6436
602c0306N0995o23n2987K9876L8290n2357r325N8030k3445m4309M8342J6134n6096
615b7781J5491M5834l9834k2478M9558l810m5033K5924L0479l8749j1585M2880
627B0896q556l8636K7081K6505m1537p035M7738j7826m1816M1968K1430n6895
639b6683R377N3724m0261l1691N9296k909n7786L6857L6019n7315k169N7009k9111
652D357l8362M8301J0631m9963J5582L8871l3644k0148M1121M97m0656J7545L2748
665B6880l3033j8935M3134j519m5390K5371L4371m5450j1643N4171j9179m4912
$$ plain form
677 -36134 10631 30198 -29128 -13652 37498 -7622 -31816 26466 17632 -32820 2886 31283
689 31283 -17369 -18865 27210 4702 -27148 8551 21694 -17913 -13393 23429 2871 -25807
701 -25807 7195 21377 -19399 -14248 27597 -432 -29833 17133 21762 -30208 -5030 35027
713 35027 -13880 -26366 30725 10887 -35022 10805 29856 -24985 -13247 32460 -3747 -27920
725 -27920 18547 17067 -26510 -3904 26237 -9598 -22461 18108 12470 -25195 -2190 25378
737 25378 -11509 -21712 22599 10424 -29748 5274 28998 -21001 -17334 32408 844 -31977
749 -31977 18556 23070 -30217 -4203 33255 -13444 -24362 26658 8839 -30486 7056 24800
761 24800 -20197 -14339 25036 106 -25373 10765 18636 -20090 -9461 23888 -2491 -23207
$$ packed form
677c6134M6765J9567n9326J5476N1150m5120k4194N8282q834n0452L5706K8397
689C1283m8652j496M6075k2508l1850L5699J3143l9607M520L6822k0558k8678
701b5807L3002J4182m0776N151M1845k8029k9401M6966M629n1970K5178M0057
713C5027m8907j2486N7091j9838m5909M5827J9051n4841J1738M5707l6207k4173
725b7920M6467j480m3577K2606L0141l5835j2863M0569n638l7665K3005K7568
737B5378l6887j0203M4311j2175m0172L5022K3724m9999L667M9742l1564l2821
749c1977N0533M514n3287K6014L7458m6699j0918N1020j7819l9325L7542J7744
761B4800m4997N858L9375k4930k5479L6138P871l8726J0629L3349k6379k0716
$$ plain form
773 -23207 14555 17019 -23196 -4765 27531 -8679 -22454 22104 11706 -28058 4538 26496
785 26496 -18843 -15347 27427 148 -27316 14554 18320 -24184 -5466 25545 -8685 -20408
797 -20408 18096 10057 -23010 1262 21714 -11865 -15763 19478 6390 -22744 4757 20965
809 20965 -15280 -13199 23072 2032 -24322 11205 18949 -21525 -7333 26110 -6676 -22127
821 -22127 19046 11887 -25476 1811 24193 -14748 -15899 22664 3603 -23852 8805 18651 -18546
834 -18546 -9058 22728 -2837 -21480 12983 14403 -20719 -4064 22628 -7724 -18961 17960
846 17960 9681 -23262 2764 22386 -14135 -14302 22537 2655 -23442 10728 18059 -20001 -6752
859 -6752 23777 -5528 -20578 16018 11333 -22212 -160 21066 -11558 -15685 18599 4978 -22008
$$ packed form
773b3207L7762K464m0215J8431L2296l6210j3775M4558j0398l9764L2596K1958
785B6496m5339L496M2774k7279k7464M1870L766m2504J8718L1011l4230j1723
797b0408L8504q039l3067K4272K0452l3579l898L5241j3088k9134K7501J6208
809B0965l6245K081L6271k1040k6354L5527P744m0474J4192L3443l2786j5451
821b2127M1173p159l7363K7287K2382l8941j151L8563j9061k7455L2657R846l7197
834a8546R488L1786k5565j8643L4463J420l5122J6655K6692l0352j1237L6921
846A7960q279l2943K6026J9622l6521j67L6839j9882k6097L4170P331l8060J3249
859f752L0529k9305j5050L6596m685l3545K2052K1226l2624m127L4284j3621k6986
$$ plain form
872 -22008 5572 18236 -15395 -10567 20618 18 -20318 10978 15174 -17995 -4778 21693
884 21693 -5158 -17563 15399 10347 -20154 830 20073 -11068 -14096 18110 4170 -20843
896 -20843 5850 16538 -15536 -9589 19080 -1634 -19238 10895 12954 -18243 -3674 20198
908 20198 -6179 -16280 15505 9282 -19093 2218 19056 -10979 -12090 18528 3434 -19581
920 -19581 7297 15866 -15555 -8261 19163 -2863 -18679 11671 11522 -19054 -2833 19214 -8560
933 -8560 -15727 16032 6513 -19986 4272 17917 -13097 -9983 19391 865 -17923 10031 13626
946 13626 -15498 -3999 18171 -4887 -14571 12908 7943 -16825 328 15911 -9137 -12261 13868
959 13868 3869 -17091 3514 14315 -12171 -8959 16527 -96 -17059 9445 12628 -15891 -3124
$$ packed form
872b2008K7580J2664l3631M828L1185k0600k0336L1296M196l3169J3217K6471
884B1693k6851j2405L2962n052l0501K0984J9243l1141l028L2206j3940k5013
896b0843K6693J0688l2074N947K8669k0714j7604L0133K059l1197J4569K3872
908B0198k6377j0101L1785o223k8375K1311J6838l0035j111L0618j5094k3015
920a9581K6878Q569l1421P294K7424k2026j5816L0350j49l0576J6221K2047k7774
933h560p167L1759r519k6499K4258J3645l1014L114K9374j8526j8788K7954L595
946A3626k9124J1499K2170k3058r684K7479m965k4768J7153J5583k5048l124K6129
959A3868r999k0960K0605J0801k6486L212K5486j6623j6963K6504L183k8519J2767
$$ plain form
972 -3124 18597 -5944 -14204 14868 7015 -17373 3335 15419 -11650 -8491 16010 -365 -15519
985 -15519 7941 10468 -13258 -4262 14023 -3634 -12603 8630 7471 -12884 -1659 13587 -5313
998 -5313 -11394 11596 6217 -14826 1961 14938 -9664 -9383 15670 1300 -15995 8532 11758
1011 11758 -14899 -3145 16613 -6292 -12934 13182 5110 -15654 2930 13174 -10031 -7661
1023 -7661 12944 514 -12880 5464 9798 -10521 -4966 13013 -1154 -12789 7822 9941 -13023
1036 -13023 -3281 15326 -4781 -13061 12860 6383 -16805 3347 15653 -12473 -8769 17615 -1368
1049 -1368 -16393 10580 10073 -15657 -818 15491 -7750 -10518 12696 3460 -13895 3283 11295
1062 11295 -8679 -7338 11372 1502 -12432 3919 10723 -9552 -6615 13173 236 -13659 7722
$$ packed form
972c124K1721k4541q260K9072p853k4388K0708J2084k7069L159K4501j6375j5154
985a5519K3460K527k3726Q996J8285j7657q969K1233j159k0355J1225J5246j8900
998e313o081K2990n379k1043J6787J2977k4602K81K5053j4370j7295K4527L226
1011A1758k6657J1754J9758k2905o642K6116q072k0764J8584J0244k3205K370
1023g661K0605j2430j3394J8344M334k0319N555J7979j4167j1635K0611K119k2964
1036a3023R742J8607k0107q280K5921o477k3188K0152J2306k8126L704K6384j8983
1049a368j5025K6973n07k5730J4839J6309k3241k768K3214r236j7355J7178Q012
1062A1295j9974J341J8710r870j3934J6351O804k0275K937J9788j2937j3895K1381
$$ plain form
1075 7722 10464 -13513 -2522 16488 -5949 -12978 13998 5796 -16738 4118 14371 -11954 -7419
1088 -7419 15248 -1763 -14434 8620 8639 -13532 -2603 13167 -4673 -11120 8970 6174 -12215
1101 -12215 -858 12740 -5148 -10552 11356 5804 -14332 2534 14771 -9719 -9347 16316 1359
1114 1359 -16697 8540 12313 -15400 -3687 16829 -6629 -13597 13061 5129 -16680 2841 13531
1127 13531 -10512 -8400 13218 1149 -13494 5518 10765 -10115 -5229 13516 -704 -12721
1139 -12721 7751 10891 -12168 -3605 15587 -3751 -13509 11754 7443 -16282 1130 15413 -10374
1152 -10374 -10162 15197 841 -16245 7129 10977 -13627 -4130 14559 -3767 -12306 9720 7170
1165 7170 -11985 -591 12761 -4876 -9361 10490 5490 -12605 1667 12899 -7613 -9058 12660
$$ packed form
1075G722K742k3977J0991J9010k2437p029K6976q202k2534K0856J0253k6325M535
1088g419K2667j7011j2671K3054J9k2171J0929J5770j7840o447K0090k796j8389
1101a2215J1357J3598j7888n404K1908n552k0136J6866J2237k4490L72K5663j4957
1114A359j8056K5237L773k7713J1713K0516k3458o968K6658p932k1809J9521J0690
1127A3531k4043K112K1618j2069j4643J9012N247k0880M886J8745j4220j2017
1139a2721K0472L140k3059Q563J9192j9338r758K5263m311k3725J7412J4283k5787
1152a0374K12K5359j4356j7086K3374L848k4604R497J8689j8326q539K2026k550
1165G170j9155J1394J3352j7637m485J9851n000j8095J4272J1232k0512j445K1718
$$ plain form
1178 12660 2344 -14449 5261 11222 -12340 -5131 14369 -3949 -13279 10201 6662 -14161 521
1191 521 12760 -7531 -8453 11627 2461 -11727 3986 9873 -7981 -5143 11124 791 -10998
1204 -10998 5077 9270 -9381 -4767 12483 -1417 -12433 8106 8081 -13500 -1423 14120 -7575
1217 -7575 -10465 13049 2669 -15117 5271 11481 -11781 -4656 14033 -2826 -11232 9199 6134
1230 6134 -11637 -8 11529 -5337 -8205 9091 4043 -10563 1365 10296 -6291 -7420 10224
1243 10224 2404 -11881 3897 10116 -9833 -5117 13086 -2181 -11971 8921 6757 -13039 424
1256 424 12604 -7233 -8168 11223 1405 -11625 4732 8715 -9186 -3637 10294 -1231 -9221
1269 -9221 5401 6503 -8122 -2498 9657 -1738 -8674 6901 6127 -10010 -983 11556 -5225
$$ packed form
1178A2660j0316j6793J9710N961k3562P209J9500j8318r330K3480l539k0823J4682
1191E21J2239k0291r22K0080r166j4188J5713N887j7854K838J6267j0333j1789
1204a0998J6075M193j8651M614J7250j3900j1016K0539k5k1581J2077J5543k1695
1217g575k890K3514j0380j7786K0388O210k3262P125J8689j6859q406K0431l065
1230F134j7771J1629J1537j6866k868J7296n048j4606J1928Q931j6587j129J7644
1243A0224p820j4285J5778O219j9949M716J8203j5267r790K0892k164j9796J3463
1256D24J2180j9837r35J9391r818j3030J6357L983j7901N549J3931j1525p990
1269i221J4622J102j4625N624J2155j1395o936J5575p74j6137R027J2539j6781
$$ plain form
1282 -5225 -8949 10392 3359 -12821 3907 10381 -10331 -4864 12675 -2731 -11177 8537 5795
1295 5795 -11286 489 10678 -6079 -7044 9350 2363 -9468 2821 8437 -5895 -4679 8967
1308 8967 1308 -9140 3708 7988 -7911 -4463 10380 -1227 -10861 6570 6743 -11317 -1296
1321 -1296 11243 -6309 -8958 10755 2200 -12244 4083 9633 -9290 -3908 11601 -1859 -8842
1334 -8842 7308 6120 -9261 -267 9551 -3571 -7019 7329 3755 -9034 392 8821 -5326
1347 -5326 -6815 8646 2399 -10558 2385 8438 -8207 -4925 10294 -1182 -10169 6567 6504 -10257
1361 -10257 -445 10957 -4804 -7388 9348 2680 -9859 3123 8378 -6672 -4142 9081 -340
1374 -340 -8612 4124 5927 -7703 -2803 8614 -2112 -8321 5394 4877 -9245 -1144 9306 -4543
$$ packed form
1282e225l724J9341p033j6180J6728O474k0712N467J7539j5406q446J9714k742
1295E795j7081J1775J0189j6757r65J6394o987j1831J2289N616j4332J216J3646
1308H967p659j0448J2848M280j5899L448J4843j1607r634J7431J73j8060J0021
1321a296J2539j7552k649J9713q555j4444J6327N550j8923N382J5509j3460o983
1334h842J6150j188j5381Q994R818j3122l448J4348l574j2789R426Q429j4147
1347e326j489J5461o247j2957J2943O053j6645L282J5219j1476q987J6736o3j6761
1361a0257R812J1402j5761k584J6736o668j2539J2982N255j5050K530J3223r421
1374c40q272J2736J803j3630M900J1417j0726o209J3715n17j4122Q101J0450j3849
$$ plain form
1388 -4543 -7609 8247 3187 -9918 2888 9167 -7033 -4676 10469 149 -8946 5779 6330
1401 6330 -8597 -997 8936 -3812 -7499 6737 2943 -9320 864 7851 -5248 -6011 7789
1414 7789 1354 -8778 2632 7049 -6828 -3636 9160 -734 -8502 5308 5459 -8359 -869 9331
1428 9331 -3756 -7036 8084 2974 -9414 2727 7785 -6298 -4682 8407 -153 -8252 4861
1441 4861 5497 -8129 -1896 8514 -2944 -7604 6297 3745 -8331 328 8147 -4930 -5931 7549
1455 7549 1601 -8545 2917 7174 -6586 -3176 8515 -1027 -7834 5142 5199 -7926 -991 8083
1469 8083 -3515 -6754 7027 2842 -8631 1693 7529 -5160 -4872 7739 707 -8159 3508
1482 3508 6548 -6895 -3010 8226 -1647 -7709 5368 4396 -8358 -646 8507 -4177 -6129 7658
$$ packed form
1388d543l066J5856n060j3105J2806O279j6200K357J5145j0320r095J4725N51
1401F330j4927P600R933j2748l687J4236l794j2263J0184O987j3099p63J3800
1414G789o435j0132J1410M417j3877L192J2796r894p768J3810J51j3818P490J0200
1428I331j3087l280J5120n110j2388J2141N058j4083J616J3089q560q099J3113
1441D861O36j3626O233J0410j1458m660J3901k552j2076Q659P819j3077j001J3480
1455G549n948j0146J1462M257j3760L410J1691r542o807J2976N7j3125O935R074
1469H083j1598l239J3781m185j1473J0324N836j2689K88J2611p032q866J1667
1482C508L040j3443L885J1236r873o062J3077r72j2754P712R153j2684j952J3787
$$ plain form
1496 7658 2564 -8508 2210 7540 -5890 -4298 8690 -227 -8493 4807 6064 -7995 -2014
1509 -2014 8627 -2934 -7916 6298 3830 -9032 484 7962 -5608 -5912 7762 1555 -8673
1522 -8673 3214 7009 -6611 -3334 8478 -659 -8085 5611 5564 -7229 -1388 8458 -2827 -6972
1536 -6972 6545 3305 -8239 684 8132 -5093 -5739 7590 1046 -9050 3313 6625 -7347
1549 -7347 -3534 8489 -1596 -7571 5736 4921 -7836 -245 8630 -3341 -6113 7031 3121 -7658
1563 -7658 1708 7253 -5331 -4430 7725 447 -8468 3092 5981 -6571 -3587 8276 -1933 -7692
1577 -7692 5207 4429 -8225 -721 8338 -3692 -6417 7198 2436 -8187 2559 7110 -4991
1590 -4991 -3081 7399 -180 -6941 3657 5080 -5714 -1487 6744 -1574 -6356 4373 3668 -7092
$$ packed form
1496G658n094j1072J0718N330j3430J592J2988q917q266J3300J257j4059N981
1509b014J0641j1561m982J4214k468j2862R516P478j3570l04J3674o207j0228
1522h673J1887L795j3620L277J1812r137p426J3696m7j2793N841R846j1285m145
1536f972J3517l240j1544Q923P448j3225o46J3329o544j0096J2363L312j3972
1549g347L813J2023j0085n975J3307q15j2757P591Q875j1971k772J3144l910j0779
1563g658R366N545j2584R01J2155p278q915J1560K889j2552K984J1863j0209n759
1577g692J2899p78j2654P504R059j2030k725J3615m762j0623J0746M551j2101
1590d991J910J0480p579o761J0598J423j0794M227Q231q318m782J0729p05j0760
$$ plain form
1604 -7092 -1207 7297 -2845 -6212 5746 2799 -7984 1448 7470 -5918 -3868 7995 -485 -7754
1618 -7754 4573 5474 -7261 32 7795 -3228 -5150 6594 1845 -6928 2178 5459 -4502 -3049
1632 -3049 5520 179 -5950 2538 3871 -4739 -2183 4920 -63 -5864 3030 3892 -5303 -1526 6593
1647 6593 -2040 -5429 5398 2818 -7089 1150 6466 -4691 -3127 6972 -295 -6004 3760 4187
1661 4187 -6237 -383 6199 -2753 -4551 4378 1731 -5343 771 4650 -3182 -3419 4765 1316 -5055
1676 -5055 1281 4530 -3788 -2856 5437 154 -5823 3583 4119 -6272 -1083 6494 -2759 -4811 6217
1691 6217 1682 -6713 2628 5598 -4945 -1906 5775 -986 -5045 3999 2586 -5034 124 4651 -1846
1706 -1846 -3787 3491 2072 -4462 -317 4159 -2998 -3398 4315 1264 -5223 1135 5174 -4620 -2659
$$ packed form
1604g092N885Q504j0142l367J1958k947j0783R432O022j3388K050J1863q480p269
1618g754J2327R01j2735P293P763j1023j922J1744m749q773R106L281r961J453
1632c049Q569n341o129Q488J333q610K556P103m983n801Q894Q62r195L777Q119
1647F593q633l389J0827k580r907Q239N316j1157J564J0099p267n709R764M27
1661D187j0424N854O582q952j798Q929k647p074O114L879p832k37Q184l449o371
1676e055O336L249q318R32Q293n283n977R406N36j0391N189P577r253k052J1028
1691F217m535q395R341K970j0543L039P681o761m059R044j413p620N158M527o497
1706a846j941P278j419o534M145M476p157m00P713l051o487O358M039r794J961
$$ plain form
1721 -2659 6025 -855 -6489 3840 3940 -6168 122 6604 -3199 -4432 5931 951 -6201 2229
1735 2229 4943 -5216 -2493 5712 -1193 -4931 3262 3098 -4754 -823 4848 -1859 -4368 3682 2648
1750 2648 -4695 -260 5234 -2425 -3555 5556 2325 -5883 1799 5582 -4245 -2417 6706 -344 -6279
1765 -6279 4150 3320 -6682 -646 5215 -2624 -4227 4780 1396 -5635 733 4632 -4111 -3937 4996
1780 4996 379 -5519 1492 4859 -4059 -2156 5963 177 -5354 3499 3556 -5915 -523 5670 -2681
1795 -2681 -5184 5080 1631 -6426 1969 4943 -4810 -2543 5678 -738 -5834 3332 3805 -5522 -700
1810 -700 5674 -1492 -4702 4525 2486 -4677 -462 5180 -1875 -3778 5052 2243 -5425 1436 4991
1825 4991 -3918 -3150 6064 -418 -5663 3133 3715 -5594 -931 5377 -2676 -4771 4069 2215 -5231
$$ packed form
1721b659Q684o880n634J0329J00j0108O290O482r803j233J0363m980p152Q430
1735B229K714j0159K723Q205o905l738Q193j64p852L931N671o707k509Q050j034
1750B648p343M435N494p659j130R111l231q208P682L783r827J828R123p050n935
1765f279J0429q30j0002O036N861p839j603R007l384p031O368L899q743J74Q933
1780D996m617n898P011L367q918J903Q119n786n531Q853N7r471N392O193q351
1795b681k503J0264l449q057Q395K974r753K267Q221o416n096R166M73r327M822
1810g00O374p166l210R227k039p163M215N642p055j903Q830k809p668O861L555
1825D991q909P68R214o482n245Q796N82r309M663O308q053k095Q840j854p446
$$ plain form
1840 -5231 1329 5278 -3145 -3181 4663 499 -5095 2362 4103 -4440 -1308 5384 -613 -4812 2995
1855 2995 3528 -4540 -622 5471 -2407 -4727 4574 1706 -6092 1197 4751 -3968 -2427 5423 -424
1870 -424 -5192 3023 3848 -4641 -1436 5185 -1513 -4060 3667 2784 -4721 154 5049 -2609 -3268 4162
1886 4162 1649 -5222 832 5155 -3931 -2902 5346 -195 -5170 2863 3129 -5317 -975 5486 -2234
1901 -2234 -4451 4578 1880 -5745 1213 4202 -3868 -3117 4455 68 -5292 2564 4039 -4365 -1889
1916 -1889 5304 -562 -4511 2602 3328 -4512 -482 5001 -2215 -4118 4715 1839 -5013 1279 4719
1931 4719 -3689 -3405 5040 140 -5491 2793 3053 -5202 -1329 5180 -1480 -4616 4190 2455 -5255
1946 -5255 -83 4637 -3088 -3152 4616 1519 -4555 1281 3982 -3262 -2551 4895 143 -5200 2827 3546
$$ packed form
1840e231O560L949q423l6P844m164n594P457J741q543L132O692n997m199P807
1855B995N33q068L918O093p878k320R301k868p798P289L554q719J541P850n847
1870d24m768Q215Q25q489L205O621o698k547P727q83p505M875M895p658o59P430
1886D162k513o871O054M323r086J029Q248n541m975Q033K66q446M342O461p720
1901b234k217R029k698p625O958K989q070P51P572m387n360P856J475q404K476
1916a889P193n866l949P113P26p840M030N483p216j903Q833k876o852O292L440
1931D719q408K84Q445m900n631Q284K60q255L873O509o660l136Q806j735p710
1946e255N172M720p725o4P768l097o074N836K701p244P11P446m752n343Q027P19
$$ plain form
1962 3546 -4457 -1293 4938 -1743 -4859 3874 2026 -5075 -157 4217 -3172 -3044 4875 704 -5303
1977 -5303 1931 4100 -3595 -1776 4967 -329 -4805 2738 3449 -4638 -528 4800 -1649 -4261 3449
1992 3449 2109 -4817 125 4217 -2887 -2929 3995 881 -5012 1662 4019 -3833 -1734 4325 -209
2007 -209 -4371 2984 2398 -4408 341 4958 -2221 -3909 4127 1355 -4594 1112 3988 -3146 -1933
2022 -1933 4524 -516 -4573 2163 2699 -3730 -1269 4045 -1522 -3923 3189 1309 -3533 203 3089
2037 3089 -1918 -2081 3378 928 -3254 1491 3257 -2782 -1987 3777 337 -4189 1899 2290 -3594 -402
2053 -402 3622 -1664 -3687 3199 1765 -4121 237 3751 -2880 -1973 3576 423 -3283 1455 2945
2068 2945 -2265 -624 3447 -960 -2780 2581 2215 -3078 93 3732 -1344 -2788 2930 1292 -3436
$$ packed form
1962C546q003L164O231o681l116Q733j848p101M918M374p389J28P919m171o007
1977e303P234K169p695J819O743n296m476P543P11q087M110N328o449k612P710
1992C449j340o926M942M092p104m2O924l114n893O674K357p852K099O059m534
2007b09m162P355n86o806M749M617p179j688Q036k772n949N706K876p134J213
2022a933O457n040m057O736N36o429K461N314n567k401P112j880m842L736K886
2037C089n007j63N459k450m182M745J766o039P95N764l440m526O088L91n884L192
2053d02M024n286k023O886j434n886M358L514o631R07N549l153l706M738J490
2068B945n210J641M071m407j820N361l66n293L171L639n076j444N718j638m728
$$ plain form
2083 -3436 1253 3493 -2362 -1277 3551 -565 -3546 2401 1700 -3349 -958 3454 -1215 -2965 3121
2098 3121 1052 -2870 11 2779 -2596 -1575 2848 -48 -3149 1425 2368 -2705 -1371 2682 -710
2113 -710 -2431 2724 1514 -3946 471 3213 -1619 -2383 2717 312 -3870 1132 2887 -3171 -1539
2128 -1539 3424 -693 -2556 2405 2113 -3822 236 3574 -2059 -2189 2628 1212 -3440 461 2866
2143 2866 -2348 -1956 3167 -57 -2602 1377 2353 -2903 -834 3462 -597 -3268 2540 1675 -4377 51
2159 51 3381 -2188 -2667 3481 873 -4169 1107 2905 -3722 -1828 3664 305 -3083 2547 2193 -2904
2175 -2904 -533 3747 -1259 -2759 2356 1717 -3767 64 3785 -2327 -2697 3356 659 -4094 1499
2190 1499 2893 -3531 -1503 4150 -1129 -4090 2907 1811 -4245 -58 3155 -1896 -2589 2855 497
$$ packed form
2083c436M689K240n855J085M828m116k981N947p01n049K391M412m669j750O086
2098C121k069l922K881K768n375J021M423k896l101M574R43n073J334M053l392
2113g10j721N155j210n460M417K742m832p64N100k405m182N002J755o058J632
2128a539M963m117j863M961k92n935M058L338n633j30M817j416m652L901K405
2143B866n214L92N123l224k545L979R76n256K069M296m059k671N808q65o052M428
2159E1L330n569m79O148k608n042N276J798o627J894N492l359l388N630l54n097
2175b904K371M280n006j500N115o39n484L831L721o112l70O053k697m753N593
2190A499J394o424K028N653n279k961O997j096o056M187L213n051o93N444k358
$$ plain form
2205 497 -3144 911 3213 -2172 -1430 3238 740 -3338 1089 2703 -2998 -1287 3710 -497 -3504
2220 -3504 1731 2550 -3869 -371 3508 -1889 -3045 3457 1019 -3880 1153 3612 -2883 -1910 3919
2235 3919 -375 -3296 2099 2790 -2725 -106 3787 -1090 -2305 1842 914 -2938 196 2688 -1738
2250 -1738 -2361 2276 1072 -3364 414 3089 -2589 -2261 3180 -255 -3807 1967 2419 -3714 -24 4612
2266 4612 -1579 -2626 3677 1152 -2890 727 2809 -1819 -1738 3337 203 -2952 1258 1994 -2517 -1384
2282 -1384 3008 -71 -2785 1738 1934 -2946 -645 3418 -1347 -2363 2628 1398 -3632 549 3349
2297 3349 -2597 -1586 3703 -113 -3705 2353 2102 -3251 -253 2823 -1523 -2233 2598 467 -2794
2312 -2794 499 2180 -1704 -1648 2284 70 -2962 917 2279 -2006 -1226 2874 20 -2630 1383 1593
$$ packed form
2205D97l641M055K302n385P42M668k498m078M427J614n701J711M997m207l007
2220c504N235Q19o419L498L879n397j156O502k438m899N033K459o495R73N829
2235C919m294k921N395O91n515K619L893m877j215M147r28l852L134K492m426
2250a738o23M637j204m436L778K675n678L28N441l435l552N774M52o133L690M636
2266D612o191j047O303k525m042L617K082m628Q1N075l134l155M210P36m511J133
2282a384M392l079k714M523J96m880K301M063m765j016M991j230n030M181K800
2297C349n946J011N289l816l592O058k51n353K998L076m346p10M831k131l261
2312b794L293J681l884N6L932k214l032L879J362m285P80M100k854k650M013K10
$$ plain form
2328 1593 -2521 -1171 3198 -1401 -2632 3212 1039 -3023 626 3011 -2859 -1106 3307 -258 -3133
2343 -3133 2095 2116 -2554 -515 2839 -1345 -1890 2242 1402 -2286 496 1917 -1531 -1716 1996 1005
2359 1005 -2692 817 2178 -1723 -1514 2725 279 -3452 2419 2488 -2827 -159 3124 -1382 -2134 2976
2375 2976 861 -2734 396 2343 -2139 -1354 2563 425 -2600 1086 1822 -2369 -936 2402 -487
2390 -487 -2599 1573 1964 -2716 -706 2950 -1413 -2544 2527 1232 -2953 457 3001 -1925 -1499 3251
2406 3251 53 -3016 2192 2365 -2317 -626 2850 -1369 -2293 1934 962 -3004 731 1866 -1657 -1535
2422 -1535 2016 268 -2340 1216 2488 -1832 -1156 2751 332 -1986 1502 2062 -2101 -409 3059
2437 3059 -972 -2651 2482 1877 -2297 313 2513 -1951 -2026 2405 -143 -2743 518 1829 -2307 -914
$$ packed form
2328A593m114J350M369m599j231N844k173m062L649K385n870J753M413l565k875
2343c133N228K1m670K039L354m184n45M132q40l688K782J421l448j85L712r91
2359A005l697L509J361l901K09M239k446l731N871O9n315K668L283m506p52N110
2375B976k115l595L130J947m482P85L917k138l025L686P36m191J433L338k889
2390d87k112M172L91m680K010L656m363j131N071j295m185L410K544m926M26M750
2406C251l198l069N208J73m682J691L476m219r24M227r72l966L735J135l523J22
2422a535L551j748k608L556J272m320O76L907k419k318L488N60m163J692L468
2437C059m031j679N133o05m174K610K200m464p5M431k548k600L261J311m136J393
$$ plain form
2453 -914 2663 -499 -1940 1792 1515 -2110 249 2565 -972 -1717 2176 1006 -2802 732 2242 -1387
2469 -1387 -1323 2853 189 -2745 1266 1846 -2370 -578 2358 -1071 -1820 2250 953 -2599 436 1760
2485 1760 -1705 -1704 1995 463 -1882 1000 1601 -1967 -1217 2569 -999 -1749 1855 1250 -1878 -83 2388
2502 2388 -961 -1935 1901 909 -2366 575 1985 -1716 -1492 2242 -330 -2447 1252 1655 -2399 -948
2518 -948 2617 -815 -1542 2236 1246 -2434 44 2498 -1477 -1414 2290 322 -2379 883 2147 -1761
2534 -1761 -1173 2514 -219 -2328 1563 2028 -2216 -697 2696 -982 -1767 2145 663 -2585 131 2072
2550 2072 -1387 -2005 2020 111 -2564 1194 1457 -2009 -460 3088 -605 -1764 1748 1186 -1931 425
2566 425 3082 -1221 -1868 2622 978 -2577 512 2314 -1984 -1242 2499 260 -2646 1444 1923 -2685
$$ packed form
2453i14L577l162j441L732k77l625K359K316l537p45L893j170l808L534J510l629
2469a387O4M176k664k934M011N80m216J792K936l429p49M070j297l552L035J324
2485A760l465JL699j532k345K882O01l568P50L786l568p50L604o05l128J795K471
2502B388l349r74L836r92l275K941J410l701K24L734k572k117L699M03m054J451
2518i48L565l432p27L778r90l680K478K454l975O3L704j968k701L262J264l908
2534a761N88L687k733k109L891M65m244J519L393l678p85L912j482l248K716J941
2550B072l459o18M025j909k675L758K63l466J549L548l693j159L512n62l117K356
2566D25K657m303o47M490j644l555L089J802m298P42L741k239k906M090M79m608
$$ plain form
2582 -2685 -1027 2801 -763 -2923 2229 1170 -2427 -34 2602 -1318 -1898 2672 763 -2891 850
2597 850 2323 -2182 -1086 2943 -33 -2509 1485 1916 -2542 -571 2316 -511 -2075 1854 1075 -2600
2613 -2600 236 2432 -1409 -1875 2128 979 -2832 812 2596 -1936 -1369 2556 145 -2482 1730
2628 1730 2238 -2213 -643 3333 -489 -1982 2214 1307 -2753 329 2416 -1810 -1789 2280 6 -2572
2644 -2572 636 1757 -1911 -1264 2087 -388 -2317 1254 1766 -2246 -505 2650 -333 -1876 2042
2659 2042 1467 -2161 424 2776 -1195 -1679 2512 563 -2453 877 2018 -1927 -1112 2363 -616 -2287
2675 -2287 1201 1309 -2253 -439 2230 -796 -1639 1494 565 -2030 131 2169 -1261 -1398 1921 373
2691 373 -1896 917 1968 -1518 -996 2427 -382 -2063 1334 1270 -2131 -91 2022 -1050 -1791 1802
$$ packed form
2582b685J658L828l564k160N152j059l597K393K636l920n80M570j909l654L741
2597H50J473m505J096M029k976k476L994M31m458J971K887k827j564L929p79l675
2613b600K836K196l841m66M003j149l811L644J784m532N67L925k411k627M212
2628A730N08m451J570L976l822j493M196r07m060L082K087m226K1M069k274k578
2644b572L208J121l668O47L351k475j929L571N12m012J741L155k983j543L918
2659B042n75l628K585K352l971m84M191j949l016L330J141l945Q15L475k979j671
2675b287L488J08l562J814K669l026q43L133r29k595K161K038l430j37L319j548
2691C73k269K813J051l486N22L423k809j681L397o4l401K040K113l072p41L593
$$ plain form
2707 1802 318 -2087 611 1586 -1279 -1158 1870 -263 -1572 964 1067 -1335 -262 1575 -379 -1350
2723 -1350 1213 871 -1556 -153 1639 -798 -1391 1536 337 -1948 496 1465 -1362 -754 1872 -251
2739 -251 -1669 1110 978 -1736 -41 1747 -729 -1165 1508 490 -1559 569 1184 -1284 -729 1403
2755 1403 48 -1525 892 1130 -1239 -281 1397 -310 -1372 1247 832 -1670 68 1593 -828 -1093
2771 -1093 1375 410 -1643 801 1318 -1344 -411 1587 -475 -1500 957 746 -1741 -238 1215 -1079
2787 -1079 -1060 1408 344 -1575 710 1275 -852 -586 1778 -182 -1345 1068 1033 -1402 -392 1600
2803 1600 -805 -1606 1348 866 -1605 3 1349 -1080 -861 1564 77 -1394 616 1154 -1241 -600
2819 -600 1741 86 -1324 796 947 -1486 -249 1628 -479 -1142 1399 633 -1495 436 1650 -1098
$$ packed form
2707A802j484k405K698R75k865J21L028k133j309K536J03k402J073J837j954r71
2723a350K563l42k427J403J792k437n93K927j199k285K444R69k827O08K626k123
2739b51j418K779j32k714J695J788k476m36K673j018k049K128O15k468N55K132
2755A403j355j573K417K38k369R58J678j707j062K619m15k502J738J525k421k65
2771a093K468r65k053K444N17k662R33J998k062j025K457k11k487J503J453k294
2787a079J9K468j064j919K285N65k127K66K364j960j163K413l5k435J010J992
2803A600k405q01K954m82k471J608J346k429K19K425j487j471K010N38k395O41
2819f00K341j655j410K120J51k433J237J877k107o63K541p66k128J931J214k748
$$ plain form
2835 -1098 -1237 1540 -77 -1846 734 1112 -1669 -527 1633 -765 -1305 1112 816 -1422 55 1516
2851 1516 -773 -498 1469 224 -1301 471 1021 -1135 -647 1431 145 -1451 614 1147 -1470 -547
2867 -547 1495 -569 -1401 1133 684 -1583 215 1600 -1116 -1036 1469 -33 -1524 610 1040 -1035
2883 -1035 -205 1614 -99 -1084 1037 801 -1186 63 1507 -489 -1084 1143 391 -1338 32 1363
2899 1363 -968 -850 1187 75 -1600 558 1152 -1515 -503 1622 -504 -1422 1231 853 -1472 415
2915 415 1512 -807 -559 1487 252 -1187 717 939 -1061 -500 1088 -121 -1219 719 714 -1231 -202
2932 -202 1080 -313 -1238 1033 602 -1491 61 1469 -875 -990 1568 131 -1485 737 1224 -1341
2948 -1341 -329 1615 -444 -1324 1300 787 -1513 178 1468 -903 -808 1343 336 -1379 378 1164
$$ packed form
2835a098j39K777j617j769K580L78k781J142K160k398n40K417k96k238J477J461
2851A516k289K75J967j245j525J772N50k156M88K078j286j596K065N33k617R23
2867e47K042k064q32K534m49k267J798J385k716Q0K505j502j491K134M30k075
2883a035Q30J819j713r85K121k36j987J249J444j996n95K227p52j729J370J331
2899A363k331J18K037j112j675K158N94k667J012K125k126r18K653l78k325J887
2915D15J097k319K48K046j235j439J904K22k000N61J588j209j098J938nj945J029
2932b02J282j393r25K271m31k093J552J408k344j15K558j437j616K222M87k565
2948a341J012J944k059q80K624n13k300J691J290k371R5K151j007j715J757P86
$$ plain form
2964 1164 -1138 -684 1437 -78 -1495 670 1019 -1348 -313 1428 -469 -1308 1189 742 -1511 179
2980 179 1670 -1108 -1031 1316 180 -1443 793 1138 -1270 -451 1695 -282 -1428 1125 808 -1434
2996 -1434 29 1501 -557 -1071 997 597 -1559 -25 1434 -894 -1147 1310 324 -1714 367 1362
3012 1362 -1171 -660 1641 -168 -1480 921 894 -1476 -64 1665 -562 -1017 1348 530 -1608 157
3028 157 1220 -921 -849 1290 -130 -1600 436 1009 -1313 -546 1516 -389 -1388 936 979 -1374 -105
3045 -105 1580 -660 -1226 1322 713 -1540 377 1655 -972 -853 1433 44 -1434 636 1121 -1286
3061 -1286 -539 1287 -324 -1452 861 570 -1387 -294 1160 -549 -1216 1187 471 -1323 277 1334
3077 1334 -795 -745 1533 89 -1207 803 1124 -1159 -395 1438 -359 -1307 789 579 -1210 -47
$$ packed form
2964A164k302M54K121j515j417K165L49k367J035J741j897q39K497m47k253J690
2980A79J491k778P7K347j136j623K236L45k408Q19K146j977j146K553l17k242
2996a434J463J472k058n14K068m00k156J534J459k328k53K457r86k038K081R95
3012A362k533N11K301j809j312K401k7k370J412J729k227m55K365q18k138J765
3028A57J063k141P2K139j420j470K036N73k322P67K062j905r99K324M3k353J269
3045a05J685k240n66K548o09k253J917J278k627J19K286j389j478K070M85k407
3061a286P47J826j611j128K313k91j957J093J454j709o67K403p16j794J600J057
3077A334k129N0K278j444j296K010L21k283P64J833j797r48K096k10j789J163
$$ plain form
3093 -47 1175 -864 -1103 938 86 -1379 282 825 -751 -784 1149 61 -1223 674 774 -895 -110
3110 -110 1278 -171 -942 1054 708 -1067 136 1191 -543 -860 835 111 -997 307 582 -873
3126 -873 -619 616 -5 -995 710 250 -1154 -289 758 -163 -476 642 875 -1074 444 1025 -609
3143 -609 -378 991 -618 -753 464 513 -713 37 1493 -216 -911 158 301 -764 -176 773 -939
3160 -939 -497 1003 310 -1464 243 437 -988 -496 684 115 -621 777 333 -1050 528 779 -444
3177 -444 -452 825 -411 -759 133 738 -96 285 884 103 -939 141 445 -647 -209 933 -389 -733
3195 -733 628 679 -1035 -737 1067 -525 -783 893 -198 -1039 520 232 -806 -136 1137 -340 -900
3212 -900 588 391 -737 5 783 -143 -579 894 206 -752 279 685 -698 -298 567 278 -1264 266
$$ packed form
3093d7J222k039k39K041q52j465J661N43j576l3J933j088j284J897J00j669P85
3110a10J388j449p71J996l46j775J203J055j734l17J695p24j108J304K75j455
3126h73K54J235o21r90J705m60j404Q65J047r21l13J118K33j949J518N81j634
3143f09K31J369j609j35J217M9j226P50J456j709o95J069J43j065N88R49j712
3160i39M42J500o93j774J707J94j425M92J180n69p36J398m44j383J578K51j223
3177d44qJ277j236l48Q92O05q34L81N99p81j042J080L04j092M38J142j322l44
3195g33J361N1j714K98J804j592k58J676j091q41J559k88j038O70J273j477n60
3212i00J488j97j128P42P78r26m36J473o88r58J031M06j383M00Q65k89j542J530
$$ plain form
3230 266 821 -1410 -460 1005 -280 -1063 712 309 -1105 196 1316 -554 -564 1176 74 -826 612
3247 612 732 -874 -224 1062 -364 -925 896 392 -784 -33 902 -214 -826 343 394 -1087 -116 843
3265 843 -631 -846 620 238 -1482 240 1387 -977 -510 1112 46 -997 743 979 -1060 -16
3281 -16 1020 -854 -892 527 126 -1046 600 671 -553 -156 251 -328 -1110 15 924 -411 200 761
3299 761 121 -712 417 985 -892 -322 1230 -287 -1087 522 653 -1107 360 1131 -491 -292 1329
3316 1329 -201 -819 300 239 -813 -348 876 -412 -922 644 426 -693 -71 683 -203 -599 723
3333 723 327 -742 222 947 -380 -561 913 221 -952 369 936 -897 -271 1028 -262 -988 851
3350 851 431 -997 18 1057 -674 -631 684 83 -753 461 431 -524 -318 852 58 -650 535 387
$$ packed form
3230B66N55k231R50J465j285p83J775m03j414J301J120j870j0J740j102r00J438
3247F12J20j606O50J286j426n61J821n04j176P51R35j116o12J169N1j481R71R59
3265H43j474k15J466l82j720J722J147k364M67J622j066j043J740K36k039J044
3281a6J036j874l8J419m01j172J646P1j224L97M07n79p82J125R09j335O11N61
3299G61o40q33J129N68j877N70J552j517q00J609J31j760J467P71j622J99J621
3316A329j530o18J119o1j052M65J224j288n10J566k18j119O22P54q86l96J322
3333G23l96j069R64P25j327j81J474o92j173J321N67j833O26J299j290p26J839
3350H51m20j428J015J039j731M3J315o01q36J214l0r55K06J170p94p08J185j48
$$ plain form
3368 387 -553 -141 704 -308 -615 538 449 -822 -49 852 -360 -449 870 125 -1007 359 572 -720
3386 -720 -490 839 -96 -550 638 491 -776 80 698 -331 -584 639 344 -703 219 638 -354 -357 822
3405 822 -51 -703 306 408 -622 -225 717 -190 -620 653 246 -753 -31 622 -386 -379 571 292 -797
3424 -797 190 651 -736 -249 620 -64 -726 335 375 -792 -48 745 -270 -552 569 449 -603 139
3442 139 828 -386 -409 890 35 -803 258 533 -555 -199 803 -161 -709 468 473 -789 -220 175 -325
3461 -325 -323 1001 105 -673 -118 625 -487 -693 615 174 -551 84 589 -532 -41 562 134 -665 461
3480 461 398 -845 -295 736 -248 -605 580 -109 -786 -3 483 -459 -460 663 -64 -542 224 491 -196 56
3500 56 764 -30 -518 515 381 -374 -39 552 -102 -465 553 153 -596 35 422 -688 -497 394 -336
$$ packed form
3368C87r40M12Q45j012l07J153q9j271P73R01j212q9J319p45j132J366K13j292
3386g20K30J329r35m54J188j47j267Q56O18j029k53J223k95j047R22M19r92lJ179
3405H22q73o52J009J02j030L97R42r07m30J273m07r99P22O53j008PR50k79j089
3424g97R87M61j387M87Q69o84o62J061M0j167P44P93j015k82J121j20j052P42
3442A39O89j214k3J299q55q38J061K75j088L56J002r64n48J177Nj262N69L95n00
3461c25KJ324q96p78N55P43j112k06J308m41p25O35N05j121M91O03m28p99J126
3480D61o3j243N50J031r84l57J185o89o77P83M86r42jJ123p27m78P66K67o87K52
3500E6P08p94m88J033j34p55L35N91o54l63J018m00p49O31L87j110J91Q91p30
$$ plain form
3519 -336 -484 292 319 -713 -138 499 -179 -330 320 146 -457 228 438 -318 -48 487 115 -145 204 314
3539 314 -415 -115 514 -118 -214 286 379 86 -185 -221 -392 -267 416 44 -539 16 -12 54 -221 86 41 -97
3561 -97 173 -165 -241 242 504 -322 142 483 239 -174 322 280 -136 1 575 -159 -131 465 -66 -626 -321
3582 -321 529 -614 -370 442 141 -482 -63 113 -1006 -277 114 -22 173 435 -174 -282 -218 220 -115 -355
3602 -355 578 317 -447 1 318 -342 -437 219 191 -711 241 308 -446 -122 143 -283 -78 307 83 -952 272
3623 272 518 -443 -268 861 -132 -413 473 -35 -391 -165 473 260 -687 226 413 -170 -167 675 -480 -268
3643 -268 308 -89 -790 -144 275 -548 -72 656 22 -770 80 506 -534 -385 755 -99 -899 126 381
3662 381 -887 151 765 -51 -584 525 276 -840 51 873 -154 -414 889 329 -573 128 980 -454
$$ packed form
3519c36j48P76K7j032N75O37o78j51O50j74o03O85K10p56K70N35l72k60L49J10
3539C14p29L00O29o32r6N00R3k93k71l6j71J25O83l72n83N55k8O6k75L07m5j38
3561i7K70l38p6M83K62q26M64L41k44m13M96m2m16J37N74p34K8N96n31n60L05
3582c21Q50j143K44Q12l01o23M19J76j119P29L91j36J95K62o09j08O4M38l35k40
3602c55R33k61p64M48L17o60r5O56k8r02R52O7p54L24K65m26K05L85k24j035J224
3623B72K46r61J75J129r93k81Q86n08l56K26O38k13r47R13J87n83LQ42j155K12
3643b68N76l97p01O46M19q23M76P28o34p92Q50M26j040J49J140q54q00J025K55
3662C81j268J038O14q16n33J109k49j116Q91Q22j027k60J303n60r02P01Q52j434
$$ plain form
3680 -454 -224 331 196 -781 844 135 -77 -51 823 35 -495 350 288 -1145 -22 259 -585 -74 769 224
3700 224 -547 -147 323 -31 -126 808 -207 -718 -507 52 -520 289 919 183 -669 647 377 -456 -382 608
3720 608 -181 -839 1113 198 -568 381 521 -250 -311 1073 13 -173 226 708 -345 298 339 -223 -270 574
3740 574 328 -648 -490 744 -457 -232 710 451 -849 -92 298 -747 -48 594 -45 -209 662 412 -164
3759 -164 -605 976 -390 -1000 853 -234 -1143 -66 1030 -213 -617 579 -67 -368 -45 349 -431
3776 -431 -560 105 -164 -627 -109 133 -805 -558 493 -428 -179 195 -27 -667 126 483 -332 -511 543
3795 543 428 -431 543 670 -155 -621 318 -306 -354 -219 250 -675 423 426 -1026 -192 585 25 -161 -164 58
3816 58 -556 -279 485 58 -527 -8 -155 -263 -326 295 -274 -269 373 -10 -273 -153 460 -545 -285 85 46
$$ packed form
3680d54K30N55j35r77J625p09k12K6Q74p88n30Q45o2j433J123K81q44N11Q43n45
3700B24p71M00M70l54r5R34j015n11K11N59n72Q09O30p36q52J316k70q33P4R90
3720F08p89o58J952r15p66R49J40p71o1J384j060j86L99M82j053O43M1n62m7Q44
3740E74k46r76J58J234j201K25R42k59j300P57L90j045O99O42o39j64Q71k50n76
3759a64m41J581j366o10J853j087r09J077J096j243m04J196o46l01L23L94p80
3776d31j29O65k69m63N18K42r38K47J051r21K49L74k22o40P93L57q15j79J054
3795E43j15q59R74J27q25m66R39o24m8J35M69r25J098Lj452Q34P77n60j86lK22
3816E8o14K77P64m27n85N19j47j08o3O21n69NO42l83k63J20O13j005K60L70l9
$$ plain form
3837 46 -636 380 399 -216 -402 464 -141 -237 227 162 -596 -75 508 -410 -85 252 -48 -647 217 229 -172
3858 -172 -59 294 86 -366 419 -2 -398 -74 226 -95 -313 191 238 -388 18 398 -183 -211 350 31 -494
3879 -494 67 514 -189 -218 499 -155 -523 232 224 -332 76 505 -138 -357 512 130 -319 129 409 -258 -40
3900 -40 214 93 -348 28 124 -384 -200 390 -172 -394 90 199 -441 -93 468 -321 -205 381 285 -354 207
3921 207 396 -405 -58 449 15 -175 214 330 -324 69 503 -83 -361 125 63 -243 -17 200 -253 -107
3941 -107 116 80 -343 -186 307 -269 89 347 52 -340 274 291 -312 -178 505 -169 -336 270 253 -205 127
3962 127 163 -169 -168 362 -232 -281 150 108 -156 -60 233 -131 -113 275 215 -114 30 227 -90 -169 197 119 -262
3985 -262 52 268 -271 -129 376 -120 -516 209 -87 -417 108 354 -248 -418 235 85 -307 119 178 -360
$$ packed form
3837D6o82J016J9o15j86Q66o05r6M64o5p58N21N83r18L25L37l00n99Q64J2m01
3858a72J13L53k08m52P85m21l96L24L00l21k18N04M7o26M06L80n81k8N61l19n25
3879d94N61M47p03k9P17o54l68P55qn56M08M29o43k19Q69l82m49M48K80o67K18
3900d0K54j21m41L76R6n08J84N90n62k22M84J09o40L48N61p89J16N86r6o39N61
3921B07J89q01L47N07m34j90L89J16o54L93M34n86k78M86o2l06K26K17m53J46
3941a07K23l6m23J57M93n76L58K58k95l92O14J7o03J34O83o74j67O06j7m58L32
3962A27L6l32JN30n94m9M31m2k64R6K93l64J8L88o0l29J44J97l17p9L66p8l81
3985b62L14K16n39J42N05m96l96P25k96l30N25K46o02j70O53j50l92M26N9n38
$$ plain form
4005 -360 -146 213 40 -187 111 260 -314 -47 246 29 -186 159 64 -271 71 249 -27 -215 366 94
4025 94 76 12 -15 -287 92 639 -2 -22 42 188 -75 -78 312 -171 -221 336 92 -738 12 267 -312 -354 -15
4048 -15 94 -488 -215 242 -244 25 37 -65 -188 225 293 -271 2 272 -99 -507 127 -121 -251 684 302
4069 302 -7 -151 789 -135 -80 -223 -276 -107 -32 585 -113 1 311 291 -247 -269 721 -337 -393 -12 581 50
4091 50 229 -217 -163 -430 956 487 -432 206 -260 -202 -470 -12 -334 -1051 278 348 -401 -244 458 -488 -565
4112 -565 535 -12 -729 241 514 -412 -294 294 97 -28 132 496 -566 -194 151 -262 -409 -5 132
4131 132 -522 -201 290 -154 -335 554 59 -348 190 338 -228 -425 637 -409 -115 450 290 -233 67
4150 67 334 -43 -135 607 294 -357 242 296 -414 -408 290 -149 -316 -82 262 -292 -496 120 -135 -274 52 228
$$ packed form
4005c60K14L59j73k27K98J49n74K67K93k17k15L45r5l35L42J78k76j88N81k72
4025I4j8o4k7k72L79N47o41k0O4J46k63lL90m83n0N57k44q30P50K55n79m2L39
4048a5J09n82K73M57m86K69J2j02j23M13O8n64K73K70l71m08O34k48j30R35l82
4069C02l09j44R40r24N5j43n3J69P5O17o98J14L10k0n38k2R90j058n6L81N93n31
4091E0J79m46N4k67J386m69r19O38m66N8k68M58l22p17J329P0p49J57P02r46p7
4112e65J100n47p17R70K73r26J18N88j97j25J60L64j062L72L45m13j47M04J37
4131A32o54L21M91m44j81Q89m95m07N38J48n66j97J062j046K94N65j60n23L00
4150F7K67l77r2P42l13o51N99N4p10OO98m39j67K34L44n54k04O16k55j39L26J76
$$ plain form
4172 228 -217 -8 381 -122 -155 275 2 -461 -12 372 -183 -53 180 18 -348 50 326 -204 -233 289 -257
4193 -257 -284 133 244 -446 9 284 -140 -117 15 -70 -324 0 296 -218 -159 444 218 -339 88 153 -108 -14
4215 -14 325 -209 -150 244 40 -337 137 403 -60 -57 158 14 -237 103 -9 -208 6 234 -8 -224 61
4236 61 247 -322 28 185 -54 -21 361 215 -209 126 110 -175 -105 164 -87 -187 167 124 -199 -50 212 -62
4258 -62 -106 149 57 -197 153 126 -134 -79 258 -27 -104 91 166 -270 -235 163 -111 -142 161 -13 -253 -53 214
4281 214 -134 -116 467 -83 -202 157 110 -129 -364 430 118 -258 172 82 -343 -178 103 -210 -124 289 18
4302 18 -635 -103 279 -318 -178 374 -10 -109 84 162 -495 -291 470 -131 54 328 254 -351 118 297 -92
4323 -92 -299 240 67 -138 159 304 -293 1 -75 -141 -290 303 362 -307 45 241 -101 -195 381 222 -82 212
$$ packed form
4172B28m45K09L89n03l3M30k73m63M49L84n55J30K33j62l66L98K76n30k9N22n46
4193b57k7M17J11o90M55K75m24K3J32q5k54L24K96n14N9O03k26n57M27O5k61R4
4215a4L39n34N9L94k04l77M74K66m63LK15j44k51L40j12j99K14K28k42k16K85
4236F1J86n69L50J57k39L3L82j46m24L35j6k85P0K69k51j00L54m3l23J49K62k74
4258f2m4K55r2k54L50k7k60N5L37k85p7J95P5m36L5L98k74l1L03j74k40K00K67
4281B14l48J8N83n50j19L59m7k39k35P94l12l76M30r0m25J65K81l13Q6M13k71
4302A8o53N32L82n97J40N52l84r9J93P8o57K04P61o01J85K74p4o05M69J79l89
4323i2k07N39j73k05K97J45n97K94p6o6j49N93N9o69L52J96l42r4N76j59l04K94
$$ plain form
4345 212 123 -27 -118 327 147 -55 237 123 -331 -265 130 -114 -13 153 243 -265 98 415 -167 -305 -84
4366 -84 436 -107 22 210 -212 -271 240 214 -347 114 258 -474 -33 214 -243 -49 286 -316 -248 251 451
4387 451 -204 -289 125 70 -410 166 194 -133 -40 240 -96 -279 -78 242 -272 -150 253 8 -194 259 366
4408 366 -112 146 335 -56 -15 233 -158 -807 104 297 -337 -185 155 30 -33 356 -258 -313 6 288 -221
4429 -221 -60 259 450 -261 181 31 260 -275 400 -191 -424 -83 336 -281 85 148 103 54 240 213 -95
4450 -95 306 383 42 -126 168 167 -514 22 351 -43 -107 406 78 -167 393 255 -347 -2 -130 -268 -115 50
4472 50 388 -207 -17 85 -92 -122 -49 232 -387 38 138 98 -298 128 -48 -491 -199 85 -184 30 565
4493 565 326 -307 420 129 -117 352 284 8 91 64 97 -324 205 -91 -106 -83 241 -72 -154 227 521 -178
$$ packed form
4345B12q9j50r1M45j80k02K92j14m54O6L95k44J01J66R0n08L63L17n82j38K21
4366h4N20n43J29J88m22n9N11k6n61M61J44p32M41K47m57J94L35o02O8M99K00
4387D51o55q5M14n5m80N76K8l27R3K80l36j83K01L20n14J22M03k45k02M53J07
4408C66m78K58J89l91M1K48l91o49R11J93o34J52L40j25o3L89o14n5L19K82n09
4429b21J61L19J91p11M42j50K29n35O75n91k33L41M19o17L66O3m5m9J86k7l08
4450i5M01P7l41j68K94jo81N36L29l94o4N13l28k45N60j38o02L45j28j38J53J65
4472E0L38n95J90J02j77l0P3K81o19M25J00m0l96M26j76m43K92K84k69K14N35
4493E65k39o33P27k91k46M69o8k76Q3k7L3m21N29k96j5K3L24l13q2L81K94o99
$$ plain form
4515 -178 -249 187 -62 -367 -37 12 -646 -102 171 -251 -138 236 -12 -295 340 480 -338 -336 209 124 -403 267
4537 267 322 -143 -24 270 63 98 253 401 147 57 367 -58 -269 116 -105 -114 -212 304 -386 -204 235 -174
4559 -174 -332 44 190 -171 154 -14 -263 -250 270 258 -252 -42 69 -188 -79 467 -54 -320 79 -72 -925
4580 -925 -122 -36 361 47 28 11 -188 -185 268 199 7 247 -182 91 302 413 206 -233 390 88 -298 -47
4602 -47 -27 93 -11 -120 49 73 4 -127 -309 123 33 5 -282 401 -41 -211 -124 153 -77 12 -18 -113 -541
4625 -541 -1 209 -347 37 134 -79 -294 241 -28 182 95 -133 131 159 199 20 -450 162 113 -476 130 172
4647 172 66 -137 -299 38 -321 -63 65 -6 123 118 4 -145 -77 306 -194 102 191 71 196 148 -43 -170
4669 -170 59 67 -378 261 456 11 254 59 -5 -465 85 311 -93 -177 289 257 -113 416 -376 130 56 460
$$ packed form
4515a78p1M36k49l05L30M9o58N44K73m22J13L74k48k83O35J40q18KN45q5n27O70
4537B67N5m65J19K94k07L5J55J48k54r0L10m25k11L85k21rr8N16o90J82M39m09
4559a74j58L76J46l61L25j68k49J3N20j2n10K10J11k57J09N46n21k66L99j51q53
4580i25Q03Q6L97l14j9j7j99LM53o9j92K40m29K73K11J11k07m39O23l02l86K51
4602d7K0J20j04j09J69K4o9j31j82M32r0k8k87O83m42j70Q7K77k30Q9l0r5m28
4625e41N40K10n56L84R7k13k15N35k69K10q7k28K64K8M0j79m70O12m9n89O06M2
4647A72j06k03j62L37l59K58J28p1J29nj14j49O8L83n00K96Q9j20J25m8j91j27
4669a70K29Qm45O39J95m45K43j95o4m60N50K26m04q4M66l2l70N29p92N06p4M04
$$ plain form
4691 460 -464 52 195 -169 405 -241 -211 -147 -179 121 115 194 187 208 222 -167 -342 -233 -503 227 -97 66 65 4
4715 4 -448 -226 480 18 -386 288 301 -315 -27 -95 -411 -230 -471 477 -52 -65 8 181 -697 -360 416 -129
4737 -129 33 595 20 -474 -4 -3 -87 73 704 -204 -493 135 186 -640 102 296 -186 -403 101 50 -199 290
4759 290 482 -136 17 86 -228 -288 169 333 208 -65 258 50 -590 530 223 -166 -86 297 -379 -213 252
4780 252 -212 -618 138 -260 -315 -327 381 -36 11 173 224 -312 -91 -345 -102 -37 130 -220 177 36 52 -3
4802 -3 445 111 -65 213 -144 -324 -305 519 -211 -284 -336 203 -191 -210 -66 -227 -370 -140 143 -71 -252 28
4824 28 -246 -268 -441 148 -182 -574 172 -87 -9 -292 67 267 -129 -306 -364 -289 303 261 247 -520 215 -107
4846 -107 -245 -231 128 -437 -168 360 227 -86 457 783 74 -123 -317 -2 -225 -204 59 -262 -109 319 405
$$ packed form
4691D60r24N16J43l64N74o46L0O4l2L00oP9pK1J4l89j75J09k70P30l24J63jo1
4715Dm52K22P06m62m04O74J3o16K88o8l16J81k41R48n29j3P3J73q78L37P76n45
4737a29J62N62n75m94M70Jq4J60O31r08k89O28N1q26P42J94m82k17N04n1k49M89
4759B90J92o18J53O9l14o0M57J64j25k73L23k08o40J120l07l89Q0L83o76J66M65
4780B52m64m06P56l98n5j2P08m17M7J62N1n36K21k54K43O5J67l50L97j41J6n5
4802cM48l34j76K78l57j80J9Q24p30p3n2N39l94j9J44j61j43K30K83k14j81K80
4824B8k74k2j73N89l30l92P46k59P8k83L59K00l96j77n8P5N92m2j4p67P35l22
4846a07j38J4L59n65K69N28j33l13N43L26p09j97j94L15k23K1K63l21J53M28Q6
$$ plain form
4867 405 -219 -373 288 -21 -276 227 -152 -168 304 -436 346 -365 288 -429 -362 -111 -408 496 123 -122 -136
4888 -136 63 666 77 335 -202 272 369 84 -177 26 -129 -507 316 -212 69 777 180 -6 -14 -98 93
4909 93 101 -124 -383 591 -12 -152 82 462 514 70 -435 -109 144 -556 266 27 -279 21 -286 -367 -202 66
4931 66 238 501 798 30 64 279 162 26 580 468 -11 -254 151 121 -287 -272 153 -140 17 82 209 -240
4953 -240 -212 -85 -120 -714 127 -428 -235 276 -99 -353 122 289 -103 -167 180 13 -310 -95 235 -249 -150
4974 -150 -131 -233 -225 99 289 -164 -120 11 -47 197 -184 138 -59 111 160 57 113 145 57 -92 48 240 -19
4997 -19 -166 -86 -128 95 72 80 -195 -175 52 68 -320 46 8 128 402 332 283 149 110 -13 173 233 181 228 318
5022 318 197 557 -232 130 -19 -98 8 135 -356 173 -89 38 282 146 -67 -60 170 -40 70 -107 235
$$ packed form
4867D05o24j54O61l09k55N03l79j6M72p40P82p11O53p17O7K51k97R04l73k45j4
4888a36J99O03n89K58n37M74R7k85k61K03j55l78Q23n28K81P08n97j86qq4J91
4909I3Qk25k59R74o03j40K34L80N2m44n05L26K53p00Q22k39l06L00l07q1J65K68
4931F6J72K63K97p68L4K15j17j36N54j12m79k43M05l0m08J5M25k93J57O5J27m49
4953b40K8J27l5n94Q41n55J93N11l75k54M75J67l92o4L47j67l23K15L30m84R9
4974a50J9j02QL24J90m53M4J31n8K44l81L22j97J70M9j03N6L2q8j49J40J92k59
4997a9j47Q0m2K23k3Qk75K0K27J6l88L66l8J20K74p0m9j34l9j23J86O0n2M7R0
5022C18j21L60p89L62j49p9J06J27m91N29k62J27K44j36k13PK30k10J10j77L42
$$ plain form
5043 235 8 -77 -454 199 1 -124 732 517 -225 -114 1 -372 171 -61 -177 148 23 294 -24 -341
5063 -341 329 273 176 109 -230 98 -113 267 276 -48 72 -549 -536 -314 -29 128 -91 -57 144 172 245 -151 -69
5086 -69 -153 154 -133 -83 235 100 -267 -85 30 -70 -231 145 53 -230 326 0 -74 -100 262 166 -318 -298 174
5109 174 78 391 213 -123 -33 269 -106 306 37 179 50 161 -29 54 -305 468 28 -8 58 -40 -160 -250
5131 -250 221 167 -25 167 -194 -61 3 231 148 -171 -32 -326 -127 -280 -69 -9 -179 479 81 239 423
5152 423 245 -183 -43 254 42 -138 51 283 132 -123 -35 -49 -136 47 -214 -279 -154 9 -34 -159 -67 -73 -173
5175 -173 -162 -51 -153 -187 -73 -27 -111 -318 30 -126 -268 43 -66 -247 318 296 41 -58 149 141 -126 33 323
5198 323 -114 -80 67 -258 -57 334 -215 72 58 206 -262 -17 -124 170 -230 113 437 -21 97 -46 134
$$ packed form
5043B35k27q5l77O53j98j25Q56k15p42J11J15l73N43k32j16L25j25K71l18l17
5063c41O70n6r7o7l39L28k11L80Rl24J20o21J3K22K85J57k19L4K01K8P3l96Q2
5086f9q4L07k87N0L18j35l67J82J15j00j61L76r2k83N56l26p4k6L62r6m84K0M72
5109A74r6L13j78l36R0L02l75M12k69J42j29J11j90Q3l59P73m40l6O6r8j20r0
5131b50M71n4j92J92l61J33O4K28q3l19J39k94J99j53K11O0j70O58l98J58J84
5152D23j78m28J40K97k12j80J89K32j51k55Q8j4q7J83k61o5J25J63m3j25R2oj00
5175a73J1J11j02l4J14M6q4k07L48j56j42L11j09j81N65k2k55r9K07qk67J59K90
5198C23m37L4J47l25K01L91n49K87j4J48m68K45j07K94m00L43L24m58J18j43J80
$$ plain form
5219 134 -121 99 38 -184 -149 161 243 3 -64 136 -233 -81 -69 -135 -101 155 -60 -110 0 64 -42 146 141 74
5243 74 -102 -66 124 -30 136 170 -40 28 92 31 -84 -72 51 -7 -209 -18 2 -255 15 110 -235 -153 82 -57
5267 -57 -369 -65 74 -86 109 136 -9 3 124 12 -102 73 -58 -24 -16 94 217 123 -46 26 50 -103 -38
5290 -38 -18 -79 -19 -47 -55 190 3 6 -51 -36 -22 -176 -38 211 -134 -54 119 72 -85 -128 -18 -251 150 113 1
5315 1 -102 188 -13 -37 31 -104 131 78 -76 45 -63 50 -13 28 137 35 -71 27 -23 64 -28 -243 54 -8
5339 -8 -31 95 -44 -199 -24 134 70 77 -20 -29 -22 -15 189 33 -139 -23 -311 -33 31 -20 -168 187 -119 -281 27
5364 27 -13 -160 -39 151 52 -60 -5 140 -22 -224 19 70 -163 26 -26 78 -45 126 54 -59 42 6 -95
5387 -95 -39 145 92 -13 20 -101 -119 13 152 -164 -21 59 -134 -16 -41 11 -68 -128 -33 -44 -175 97 -11 38
$$ packed form
5219A34k55K20o1k22L5L10Q2k40o7K00l69J52J2o6L4K56k15n0J10O4j06J88no7
5243G4j76L6J90j54J66L4k10O8O4o1j15J2J23n8k02J91K0k57K70R5l45Q2K35j39
5267e7l12L04J39j60J95K7j45J2J21j12j14J75j31L4QJ10J23r4j69P2K4j53O5
5290c8K0o1O0k8qK45j87Ln7J5J4j54J38K49l45Q0J73m7j57m3J10k33M01l7j12
5315Aj03K90k01k4O8j35K35n3j54J21j08J13o3M1J09j02j06R8n0Q7r2k15K97o2
5339hk3J26j39j55J75J58o4Pr7rPPK04j56j72J16k88K78O4n1j48L55l06j62L08
5364B7m0j47J21J90r9j12N5J45j62k02K43N1k33J89n2J04j23J71p2j13J01l6j01
5387i5N6J84n3j05L3j21j8J32J39l16J43Q0j93J18k5N2p9o0R5j1j31K72j08M9
$$ plain form
5411 38 3 60 -7 114 15 -29 -87 34 48 -5 2 -16 -75 1 -188 -67 136 -117 110 -70 -75 -71 113 -94 -39 102
5437 102 -30 5 199 91 -150 11 34 -106 -10 104 -7 -194 -16 10 -32 -100 -72 -9 -170 150 -3 -228 -18
5460 -18 -34 46 -31 37 26 -171 -21 85 -51 -97 -24 30 129 -14 -39 44 -12 176 109 12 -44 -86 -83 -34 -34 -65 -97 15
5488 15 -82 -57 49 -6 -78 -150 173 46 -141 65 -183 -9 -52 51 91 -120 89 205 -14 -4 130 51 -190
5511 -190 98 30 49 79 52 -237 7 118 -155 -101 -38 142 36 -182 159 -183 -41 196 69 -107 8 -8
5533 -8 -50 -9 -49 -98 -19 32 194 10 -9 157 159 -65 -60 182 -28 -80 113 -98 -37 37 37 -140 -72 -73 -130 126 111 -29
5561 -29 -136 -38 -12 -158 -90 -163 111 49 -47 -67 -184 -42 39 227 -218 297 105 -66 54 -11 -6 -248 36 -15
5585 -15 -45 77 101 -222 -89 -74 69 -119 -18 101 -125 -163 46 -26 -145 61 14 -59 -29 105 -115 -146 95
$$ packed form
5411C8l5N7o7J21r9m4n8J21J4n3Pj8n9P6j89J21K03k53K27j80nMJ84k07N5J41
5437A02j32L5J94j08k41J61K3j40R6J14j11j87J78K6m2o8K8O3j61L20j53k25K10
5460a8j6Q0p7O8j1j97J50J06j36m6P3N4R9j43k5Q3n6J88o7r7n6m2LM9%l1l2J12
5488A5r7K5J06n5p2p2L23j27j87K06k48J74m3J03M0k11K09J16k19J0J34p9k41
5511a90K88o8J9L0k7k89K44J11k73N4O3J80j06k18L41l42J42K37j27j76J15j6
5533hm2M1m0m9P9N1J62j84j9J66Kk24NK42k10n2J93k11O1P4%j77O8jn7K56j5j40
5561b9j07R8K6j46O8p3K74o2r6k0j17J42Q1J88m45N15j92j71J20o5Nk42K84n1
5585a5l0J22K4l23J33J5J43j88J01J19k26l8K09p2j19K06m7p3L0J34k20l1K41
$$ plain form
5608 95 55 50 40 264 -39 -11 105 -66 -300 65 79 -15 33 -61 23 -46 128 17 -145 -103 66 -196 -122 -52 95
5633 95 -21 61 67 96 -1 174 -30 -44 175 56 -161 42 72 -66 -194 165 -67 -124 -67 -237 -134 -81 -5 -44
5657 -44 -173 -29 213 86 -172 -5 36 -60 -86 40 -86 -38 -55 -123 93 77 29 -7 5 89 -43 158 3 129
5681 129 92 27 169 -177 -160 15 8 84 93 26 -90 -22 147 -17 -148 -16 -25 -1 95 124 54 50 135 29 -75 -49 -76
5708 -76 15 -32 -36 -15 114 5 -20 70 3 -67 -86 5 76 7 77 -3 58 -7 -1 12 -55 -50 297 -11 -27 44 -74 67 -3
5737 -3 -37 118 -156 -1 37 -125 27 -46 -146 -176 92 -64 36 -15 -87 55 54 -24 114 -61 -87 21 57 237
5761 237 79 67 -90 15 62 -129 -55 -19 1 -25 -4 9 47 115 68 -40 -29 142 -148 -86 52 57 82 -174 28
5786 28 -21 77 25 11 36 -32 -37 -8 79 -70 -12 3 -60 1 76 -29 7 -27 -61 96 53 -68 -24 87 -64 -23 39 -63
$$ packed form
5608I5m0nj0K24l03K8J16j71k34L65J4r4M8r4Q4o9J74j11j62M2J69k62P4P0J47
5633I5j16Q2OK9r7J75k04j4K19j19k17K03L0j38j28L59k32n7N7j70J03N3P6l9
5657d4j29J44K42j27k58J67M1r6k6J26j26M8j7o8K16j6m8l6J2Q4j32K01j55J26
5681A29l7o5J42l46J7J75pP6Ro7j16O8J69j64j31J32rK4R6K9p0mQ5j06j04K6k7
5708g6R1m7mK1J29j09k5R0o7p0j9R1P1o9P0q0O1o5OJ3o7NL47l08j6P1j18J41p0
5737cl4J55k74J55L8j62J52p3j00l0K68j56J00n1p2J42jp8J38j75k6J08L6J80
5761B37j58j2j57J05M7j91P4L6K0k6K1J3L8O8m7j08J1J71k90O2J38NK5k56K02
5786B8m9R8n2j4K5o8nK9Q7j49N8J5o3O1P5j05L6l4l4J57m3j21M4J11j51M1O2j02
$$ plain form
5814 -63 -139 -43 -137 -140 114 -13 6 72 28 -87 -77 -104 -29 -8 -32 205 8 -45 124 -33 59 -102 46 14 -74 -132
5840 -132 -5 -33 27 61 -183 -173 -22 -17 -120 20 78 -88 -103 -16 15 42 12 137 -73 -10 108 72 6 -11 -17 1
5866 1 17 136 116 -77 68 170 108 -42 -25 -64 -53 47 9 28 66 14 -6 129 146 -13 1 -46 -45 -76 52 -17 67
5893 67 -107 -15 74 -13 25 49 -40 -78 -78 54 52 -183 65 -59 -12 -58 -103 -58 46 32 -30 13 7 14 -92 141 171 -4
5921 -4 -5 168 30 -25 -48 24 119 -132 85 9 71 115 58 57 58 -74 -113 63 -40 15 -78 -17 -22 25 58 80 -10 -110 -99
5950 -99 -95 -159 -6 21 71 -25 66 50 -157 42 96 69 65 91 -33 -64 -56 102 -240 70 -10 -154 -22 -101 -18 37 -195
5977 -195 -59 101 -67 -80 -231 -109 -145 -2 33 6 -2 133 -106 -75 89 10 -8 104 -150 -60 -106 51 -8 -56
6001 -56 -18 -33 39 31 -24 72 143 -89 -45 43 -31 -195 43 27 44 -20 32 55 161 -45 16 61 -101 -15 44 71 -106
$$ packed form
5814f3p6R6r4lK54j27J9O6m4j15J0k7P5K1k4K37j97n3J69j57R2j61J48l2q8n8
5840a32J27k8O0L4k44J0J51Nj03J40N8j66j5Q7L1K7l0J25k10O3J18l6o6j7oJ8
5866AJ6J19k0j93J45J02o2j50J7l9J1J00l8J9L8n2k0J35J7j59J4m7Jl1J28o9Q4
5893F7j74R2Q9q7L8K4q9l8%J32kk35K48j24M7m6m5M5J04j4o2M3oPj06K33L0j75
5921djJ73j38n5k3P2R5k51K17p6O2M4n7jJj32l9J76j03N5r3O1nM7L3K2r0j00J1
5950i9Mo4J53K7N0r6R1j6k07J99N4k7mK6j24l1QJ58l42L10q0j44J32p9Q3N5k32
5977a95J36J60j68j3j51J22l6J43L5k7qJ35k39L1J64p9j8J12k54R0m6J57n9m8
6001e6L8j5P2qn5R6P1k32M4Q8p4j64K38j6J7o4N2K3J06k06O1M5j62Q6N9K7j77
$$ plain form
6028 -106 110 24 -80 26 -20 44 60 -9 175 -54 -195 107 -90 87 21 71 -68 -196 -71 -17 -38 -4 -90 -23
6052 -23 -16 67 219 -22 20 -47 80 -58 9 -138 109 81 -92 71 201 -202 -87 71 54 -49 -67 -110 84 26
6076 26 -213 171 1 45 59 -66 20 77 -48 96 3 -117 -2 75 1 -65 -69 125 39 -99 -16 -45 -42 -19 45 -57
6102 -57 -122 34 -10 138 -71 -40 -77 -152 -52 -20 168 -67 -26 -139 -65 17 -74 30 -18 75 -8 263 60 6 31
6127 31 59 150 -61 -48 114 8 -69 -99 -149 -70 19 -134 -50 -57 13 -158 129 57 -27 -71 -26 -50 6 -15 49 74 -164
6154 -164 1 -84 108 -51 -12 -12 95 101 53 -202 35 -107 -25 136 36 144 38 77 -49 -68 6 -101 51 73
6178 73 95 56 -92 7 27 46 81 57 -34 -24 -26 228 22 -82 -17 -47 133 -98 -53 21 178 104 -170 -129 -30 22 -38
6205 -38 -45 36 -9 -18 71 1 -53 24 29 -174 -22 61 -169 34 99 -143 -100 160 -71 54 -154 91 -321 99 100 57
$$ packed form
6028a06K16q6j04J06m6O4J6o9J84k29j41L02j97J77o6N0j39j28J25N4k1L4q6O7
6052b3PQ3J52k41M2o7J27j38O7j47K47k8j73J63J30m03J15J58j7j03j8m3J94n8
6076B6k39L84j70M4J4j25Q6N7j25J44r3j20J15P7p4o6mJ94q6j38Q3k9LK3O4j02
6102e7o5J56m4J48k09L1l7p5J00L2J88k35M1j13P4Q2r1J04m8R3q3K71k03n4K5
6127C1K8R1k11J3J62j06p7l0n0P9Q9j53Q4pP0j71K87p2q4m4M5k4N6k1O4K5k38
6154a64J65q5J92j59L9%J07Om8k55K37j42Q2J61j00J08j06L9j26j9P4j07J52K2
6178G3K2l9j48R9K0J9L5k4r1J0kK54k06j04O5l0J80k31M5P4J57p4k74M1R9N2o0
6205c8pQ1m5rQ9p0n4P7Nk03J52Q3k30K03O5k42M3K60k31J25k08K45m12M20Jm3
$$ plain form
6231 57 -42 75 -79 -45 -47 116 31 -161 176 -61 -76 -140 84 4 -182 66 -26 54 76 106 -17 8 -57 62 -61
6256 -61 -114 192 156 18 -127 -39 44 -130 -36 131 31 -115 27 -23 -95 -62 -118 -91 -21 57 -65 -88 45 8 -36
6281 -36 145 -16 -87 60 -67 -74 -182 93 44 -85 -93 0 31 43 155 -72 5 -37 30 -58 -49 -98 -45 94 -126 27
6307 27 -5 64 -29 -47 -48 49 -20 18 138 -116 61 -18 1 84 37 7 -84 -13 13 71 -97 -50 -25 -58 0 44 -33 60 53
6336 53 -60 -38 -6 27 19 -162 30 49 -16 32 83 148 113 -37 36 31 20 99 133 -88 -10 -49 72 -209 -174 -98 216
6363 216 -61 -167 -283 -524 213 -77 -100 -146 -81 -174 -3 8 -27 -199 163 -121 -68 106 -155 -65 84 16 -79
6386 -79 237 73 9 -48 9 121 -218 93 66 -78 -37 71 403 -164 -213 62 8 132 250 -42 -18 -177 -159
6409 -159 48 -467 -285 188 -167 63 -24 6 -148 -189 252 7 340 114 -13 -127 -388 -69 57 -283 690
$$ packed form
6231E7r9J17j54L4kJ63q5j92L37k37j5o4K24q0j86K48r2Q0K2L0j23K5o5J19j23
6256f1n3L06l6j38j45Q8Q3j74R4J67j00j46J42n0p2L3n6K7P0P8j22k3J33l7m4
6281c6J81j61p1J47j27pj08K75m9j29qR3L1J2J12k27P7m2O7q8Rm9N3J39k20J53
6307B7l2O9r3j8jR7o9L8J20k54J77p9J9Q3m7l0r1P1K6N8j68M7K5l3N8M4p7R3p
6336E3j13K2L2L3qj81J92J9o5M8N1O5l5j50P3nj1P9L4k21P8l9J21k81L5P6L14
6363B16k77j06j16k41P37k90k3m6O5r3J71J1l5j72L62k84N3J74k61R0J49o8r5
6386g9L16j64o4n7N7J12l39L11k7j44M1J08L32n67m9K75n4J24J18k92K4j59J8
6409a59K07n15J82M73l55K30q7L0j54m1M41k45L33k26j27j14k61L19J26l40R73
$$ plain form
6430 690 25 -163 -293 299 324 270 -117 120 80 372 -170 51 20 -71 29 178 -54 265 165 -456 -23 80
6452 80 -238 -409 186 4 -424 -68 228 56 -138 10 266 -114 191 -163 238 275 -86 131 226 68 77 -17
6474 -17 216 -153 -358 -4 213 -59 -169 -290 -331 34 187 316 -273 238 -207 11 132 -65 78 -191 156
6495 156 58 247 -125 -49 -118 -107 -159 15 139 -116 13 -156 -166 423 177 -49 78 -108 178 67 -2 -51 -418
6518 -418 103 211 115 112 -289 -174 39 256 261 158 -71 -456 94 -48 -98 -348 -240 -234 -147 -74 187 72 -73
6541 -73 -83 -159 262 165 -330 -171 -4 18 -76 -202 -38 214 -222 -28 -15 11 186 -174 -293 115 139 -77 -190
6564 -190 171 -164 -141 207 238 78 41 -254 178 110 -184 -30 11 69 -479 -102 43 -162 -29 -354 108 -33
6586 -33 222 5 -82 -158 168 -24 -26 248 -115 116 190 -61 10 -331 -87 -159 -196 -288 -55 -7 332 -20 -138 324
$$ packed form
6430F90o65j88j30N92K5n4l87K37m0K92n42K21l1r1J00J49k32L19j00o21M33J03
6452H0l18j71N95j82m28L56K96j72j94J48K56l80L05l54M01L7l61K17R5j58Rr4
6474a7K33l69k05L54K17k72j10j21m1L65J53J29n89N11m45K18J21j97J43k69L47
6495A56r8J89l72P6o9J1n2J74J24k55J29j69j0N89k46k26J27j86K86j11o9m9l67
6518d18N21J08r6lm01J15K13K17Nj03k29l85N50j42n0k50J08OQ7P3K61j15j45
6541g3j0p6M21r7m95J59J67K2r4j26J64K52m36J94J3K6J75l60j19M08K4k16j13
6564a90L61l35K3L48L1j60l7k95M32o8k94J54M1N8n48L77J45k05J33l25M62j41
6586c3K55k17q7p6L26j92kK74l63K31P4k51P1l41K44p2l7r2K33M8L39l52j18M62
$$ plain form
6610 324 116 102 -370 130 -61 -322 -192 -246 -188 88 -64 -318 -194 118 448 -9 -190 -224 17 -380 95
6631 95 50 -184 -114 192 -80 99 285 53 64 75 4 -61 152 20 -66 69 -181 299 274 29 62 45 -96 158
6655 158 -301 32 281 -219 -73 76 1 -243 0 -138 537 23 28 -64 -338 8 145 79 -121 378 -96 -406
6677 -406 -244 116 125 128 -95 -218 108 30 110 -35 191 203 20 -371 -176 -43 -67 24 79 101 152 57 -80 40
6701 40 54 32 177 500 -181 239 412 -139 108 258 5 261 -140 329 -157 -310 -154 64 -58 30 77 436
6723 436 -45 -313 -166 144 52 155 107 -419 -127 -48 -38 198 105 -75 116 232 180 -93 89 131 359 -228
6745 -228 -59 74 83 489 -153 -165 -258 -457 59 -28 -357 212 5 -351 -415 451 174 -102 356 -165 -50 -108
6767 -108 260 197 120 131 -185 -105 -235 108 -52 -230 207 142 195 -13 -2 -133 -212 -566 287 -540 -330 271 222
$$ packed form
6610C24k08j4m72N00j91k61J30n4N8K76j52k54J24L12L30m57j81l4K41l97M75
6631I5m5k34P0L06k72J79J86k32J1J1p1o5K13j32q6J35k50M80k5k45L3j7j41K54
6655A58m59L33K49n00J46J49p5k44K43j38O75n14Nr2k74L46J37o6k00M99m74l10
6677d06J62L60RLk23j23L26p8Q0j45K26J2j83l91J95J33k4R1N5K2N1r5j37J20
6701D0J4k2J45L23o81M20J73n51K47J50k53K56m01M69m86j53J56K18j22Q8M7L59
6723D36m81k68J47L10r2J03m8n26K92P9J0K36r3j80J91J16n2k73J82M2K28n87
6745b28J69J33RM06o42j2r3j99N16q7l29N69k07l56o4Q66k77k76M58n21J15n8
6767a08L68o3p7J1l16Q0j30L43j60j78M37o5N3k08J1j31p9l54Q53q27K10O01m9
$$ plain form
6790 222 165 -99 358 -453 -503 -514 -100 366 -237 -135 -430 -201 -80 212 91 -188 -379 -417 -34 -13 127 13
6812 13 103 183 -135 -154 -25 -47 -317 130 -240 -65 13 -53 186 171 -128 -173 116 398 -111 -93 381 236 30
6835 30 249 82 -606 -106 -352 -133 -498 -538 -78 -345 -304 207 408 -200 -50 367 115 -65 -159 -246 -227 460
6857 460 246 -69 -6 356 -125 96 214 -62 213 -102 3 44 129 222 85 231 26 -121 109 -8 213
6878 213 -133 371 469 -219 130 138 66 -502 -175 317 -413 -223 -87 -335 -372 -53 81 -109 118 -168 -528 385
6900 385 22 -272 316 585 132 -142 177 152 171 -284 -198 -187 -398 99 -149 44 -158 -240 196 -43 -56 156
6922 156 121 73 -281 -250 -291 -592 -629 178 190 115 686 191 -79 -160 -62 139 73 306 91 46 -248 147 -249 -230
6946 -230 -608 411 -156 -42 128 142 267 75 0 260 -387 358 -493 -116 -333 196 427 42 4 -298 83
$$ packed form
6790B22n7k64M57q11n0j1M14M66o03J02k95K29J21K92j21k79j91l8L83K1J40j14
6812A3R0Q0l18j9J29k2k70M47l70J75P8o6K39j5k99m5K89K82n09J8M74j45k06
6835C0K19j67o88N00k46K19l65m0M60k67M1N11K01o08J50M17k52j80r4q7J9O87
6857D60k14l15O3L62m81K21J18k76K75l15J05M1Q5R3j37J46k05j47K30j17K21
6878B13l46N04R8o88L49Qp2n68L27M92p30J90J36k48l7L19J34j90K27k86l60R13
6900C85l63k94N88K69m53k74L19k5J9m55Q6J1k11M97k48J93k02q2M36k39j3K12
6922A56l5m8l54L1m1l01l7Q07J2p5N71m95k70q1R8K01o6K33k15m5k94L95l96J9
6946b30l78J019n67J14J70J4J25j92p5K60o47P45q51L77k17N29K31l85l8l02L81
$$ plain form
6967 83 -110 -122 -269 52 -52 -23 -2 127 -59 265 184 -155 -94 -88 149 -16 176 113 -16 -97 4 -243 -149 86
6991 86 52 10 213 193 189 -169 -88 12 -76 -52 70 84 134 44 -156 191 290 -32 -105 18 -74 235 -107 283 57
7016 57 25 -409 -423 296 -13 66 8 112 -159 -246 288 -418 -168 -299 26 201 -86 66 45 87 112 98 -74
7039 -74 -219 -154 362 -106 -124 -217 487 -21 76 13 49 -81 -164 -93 -346 62 -104 -178 -79 -118 75 298 -95 -64
7063 -64 63 157 237 89 -19 432 300 6 -18 -43 221 -86 275 -296 84 380 -165 38 -27 35 283 41
7085 41 49 -345 -105 62 210 74 -122 -268 -55 -433 -86 110 -190 13 -487 7 125 -95 -443 198 174
7106 174 -126 -82 120 194 -211 68 3 -222 21 48 348 -115 -182 -182 311 -401 61 -103 -254 -243 -139 44 348
7129 348 642 -52 156 -61 -35 34 310 -251 -205 277 -432 -399 21 -100 -205 -38 21 276 -155 86 78 178
$$ packed form
6967H3j93j2j47L21j04K9K1J29j86L24q1l39O1OK37j65J92o3j29q1J01k47R4K35
6991H6l4m2K03k0ml58Q1J00q8K4J22J4N0r0k00L47R9l22p3J23r2L09l42L90k26
7016E7l2m34j4P19l09P9n8J04k71q7N34p06K50j31L25J75k87J52k1M2K5j4j72
7039g4j45O5N16m68j8r3P04n08R7o3L6j30q3P1k53M08j66p4R9l9J93K23l93L1
7063f4J27R4Q0j48j08M51j32k94k4k5K64l07L61n71L80K96n45K03o5O2K48k42
7085D1Ql94K40J67J48j36j96j46K13l78L47J96l00K03n00M94J18k20l48O41k4
7106A74l00M4K02P4m05K79o5k25K43K7L00m63o7%M93p12M62j64j51J1J04J83L04
7129C48K94o94K08k17K6O9K76n61M6M82p09L3M20j21j05J67N9K55m31K41qJ00
$$ plain form
7151 178 -166 300 206 177 -326 -13 -242 -6 -403 79 92 -246 -153 -429 -558 26 51 -36 -95 412 -271 52
7173 52 78 -199 -72 33 95 -193 -106 88 146 281 325 201 159 2 131 29 151 642 -165 96 -64 131
7195 131 21 135 125 -257 -65 193 -311 -220 -140 -111 161 -279 -87 -93 -198 -230 181 -182 -147 -26 -114 436 83
7218 83 -492 -187 -191 -27 69 -54 90 -178 282 223 -445 -81 -162 -374 -189 80 327 120 -296 168 97 190 -126
7241 -126 -271 205 23 -117 71 -382 -1 -93 -130 120 -556 51 -145 375 338 138 -134 115 258 -195 -218
7262 -218 -466 101 -63 273 128 -300 -38 95 -398 311 -120 -201 46 232 -435 -60 42 170 -44 -341
7282 -341 -337 -64 167 -56 107 -497 -109 -161 -378 78 10 -325 -39 332 -72 -111 -232 22 -79 -579 -213 11
7304 11 189 205 383 -256 30 131 158 623 -173 -597 243 164 313 -385 251 -167 244 -11 -251 73 -339
$$ packed form
7151A78l44M66r4k9n03L13k29K36l97M82J3l38R3k76j29N84K5q7n9N07o83L23
7173E2K6k77J27J05O2k88Q7J94N8J35M4j24m2j57J29j02J22M91q07K61j60J95
7195A31j10J14j0l82J92K58n04R1Q0K9K72m40J92oj05l2M11l63L5J21q8N50l53
7218H3n75L05mJ64R6j23J44k68M60n9o68L64q1k12J85K69K47k07m16M64p1R3l16
7241a26j45M76j82j40J88m53L81r2l7K50o76O07j96N20l7k00k72K49J43m53k3
7262b18k48N67j64L36j45m28K62J33m93P09m31q1K47J86o67L75J02J28k14k97
7282c41MK73K31k23J63o04L88n2k17M56o8l35K86L71m04l9j21K54j01n00L66K24
7304A1J78J6J78o39K86J01K7M65p96m24Q40p9J49o98O36m18M11k55k40L24m12
$$ plain form
7325 -339 -72 45 -100 -178 -160 394 -191 -190 -320 304 632 67 -176 251 79 -296 -196 -12 628 -487 154
7346 154 519 69 -350 91 -151 97 626 293 328 15 66 -263 -81 45 -250 -23 -510 -313 -115 376 -381
7367 -381 304 161 -441 -350 34 -216 26 196 -200 429 -276 163 -37 -256 301 -158 141 -346 554 -93
7387 -93 -81 123 206 328 198 101 -517 -245 7 -65 -50 -118 -136 -230 167 -147 396 241 -746 -171 29 254 -648
7410 -648 80 -498 -518 233 592 151 -34 156 185 -248 -86 -57 -664 431 39 -72 -611 100 503 -187 -72
7431 -72 207 174 43 683 -16 -341 658 395 -128 -180 -26 129 -144 -78 -255 141 299 175 181 233 -226 -93
7453 -93 94 -176 279 -124 221 -39 66 -84 1 -294 199 265 203 -13 -38 -296 84 -164 222 -191 -84 106
7475 106 -10 -299 -75 280 -38 226 241 58 30 507 245 135 78 -111 -223 294 -85 139 182 265 -26 91
$$ packed form
7325c39K67J17j45p8J8N54n85Jj30O24L28n65k43M27j72l75J00J84O40j115O41
7346A54L65m50m19M41k42K48N29l33L5l13N1l29J82J26k95K27m87J97J98M91p57
7367c81O85j43o02R1L84k50K42J70l96O29p05M39k00k19N57m59K99m87R00o47
7387i3J2K04Q3J22j30r7o18K72K52p2J5o8j8r4L97l14N43j55r87N75K00K25r02
7410f48P28n78k0P51L59m41j85J90K9m33J62K9o07J095l92j11n39P11M03o90J15
7431g2K79l3j31O40o99l25R99k63n23n2J54J55k73O6j77L96J58j24ON2m59J33
7453i3J87k70M55m03L45k60J05j50Q5k95M93O6o2k16k5k58L80k48L86m13J07J90
7475A06j16k89K24L55l18K64J5j83k8M77k62j10n7j89j12N17l79K24M3Q3k91J17
$$ plain form
7497 91 16 259 145 215 -27 -161 -145 -68 -294 137 103 -85 183 125 189 94 -204 19 39 101 52 146 92 -365 25
7522 25 -346 -270 -177 296 200 150 231 -338 -128 70 -4 347 31 -98 -48 -77 217 78 154 -39 -415 -150 17
7545 17 285 163 382 -36 -90 39 -12 195 -77 96 132 35 -215 296 95 9 43 31 -420 218 -122 139 -283
7568 -283 -76 256 16 58 -263 -97 84 -45 -131 32 -220 126 39 -152 125 -299 258 -205 -185 40 -141
7589 -141 209 111 -181 52 -345 -68 172 -204 -31 -127 -108 -58 -16 143 92 176 256 286 50 145 175 -143 166 -286
7613 -286 4 -51 -290 -59 -45 -286 -175 -136 80 -30 157 350 -70 -525 -139 262 49 -29 -151 -98 -16 205
7635 205 -167 40 -99 186 133 254 -179 -57 164 218 82 -117 103 -87 -58 128 405 -19 -101 169 -58
7656 -58 -124 310 166 114 -175 78 374 -174 48 66 39 -98 138 318 183 56 10 1 -253 -122 229 287 -62
$$ packed form
7497I1p5K43j14P0k42j34J6P7k26M31l4j88K68n8O4r5k98K23K0O2m9R4n4m57L90
7522B5l71P6R3M73r6n0Q1n69K10J98p4L51l16j29N0k9K94j39P6j93l76K65J67
7545A7K68j22K19m18n4J29n1K07k72J73L6r7k50N11k01q6L4j2m51O38l40K61m22
7568b83K07L32k40M2l21J66J81j29q6J63k52L46q7j91K77m24N57m63K0K25j81
7589a41L50r8k92K33l97K77K40l76J73r6J9N0M2J59n1Q4Q0L0k36R5L0l18L09m52
7613b86K90n5k39K31J4k41J11L9K16j10J87J93m20m55L86M01k13p8j22N3Q2K21
7635B05l72K07j39K85n3J21m33J22K21N4j36j99K20j90K9J86K77m24q2K70k27
7656e8o6M34j44n2k89K53K96n48K22J8k7j37K36J80j35j27m6rk54J31L51N8l49
$$ plain form
7679 -62 98 83 -132 117 64 147 101 -42 63 18 -38 -188 119 100 -305 94 266 -252 95 -83 -42 107 -168
7702 -168 28 9 163 305 224 -396 88 11 397 45 202 116 9 114 -27 -145 46 303 58 89 -201 -208
7724 -208 -83 -203 -51 242 -339 28 142 -296 161 -111 -24 559 136 331 25 11 65 6 210 -4 55 -46
7746 -46 93 310 -167 -49 -91 58 -104 70 -183 114 -86 -162 243 87 -101 -53 368 -53 -145 64 -209 -145
7768 -145 -160 37 95 133 -194 25 -103 -58 54 65 -9 -28 34 -128 157 -101 180 371 166 -30 212 -97 -127
7791 -127 47 283 -441 237 -22 -87 257 80 -74 295 -116 39 301 47 -82 -31 -25 -98 103 -67 -184 103
7813 103 -369 -68 -110 94 41 -93 -35 93 -105 97 -243 101 186 130 77 -79 139 -184 119 2 -181 96
7835 96 103 176 2 -39 537 -78 -223 -14 206 -152 -120 29 331 -290 -262 164 167 -170 115 -199 -343 325 -288
$$ packed form
7679f2J60j5k15K49n3Q3m6j43J05m5n6j50L07j9m05L99J72n18L47j78M1J49k75
7702a68J96j9J54J42q1o20M84p7L86l52J57q6j07J05j41j18J91K57k45L1k90p
7724b08J25j20J52K93n81L67J14m38M57k72Q7N83m23J95l06j4N4n9K04k14N9j01
7746d6J39K17m77J18m2J49j62J74k53K97k00p6M05j56j88M8M21m21r2K09k73O4
7768a45j5J97N8L8l27K19j28M5J12J1p4j9O2j62K85k58K81J91k05j96K42l09l0
7791a27J74K36p24O78k59o5L44j77j54L69m11J55K62k54j29N1Op3K01j70j17K87
7813A03m72L01m2K04n3j34N8J28j98K02l40L44Q5n6n3j56K18l23L03j17j83K77
7835I6PP3j74m1N76o15j45K09K20l58L2J49L02o21K8M26Ll37K85l14j44O68o13
$$ plain form
7858 -288 -171 -179 -169 -41 276 106 68 192 331 219 96 99 124 243 -26 24 55 -236 -109 -23 16 -66 -197 410
7882 410 100 -90 56 -96 -123 171 -79 66 58 -157 49 85 29 -139 304 -301 -337 -23 -80 -15 20 -147 -321
7905 -321 88 134 -79 -193 -20 200 -191 -1 -174 131 242 -135 110 -150 -495 -130 313 222 193 58 -42
7926 -42 -81 -278 -70 -89 -31 224 -26 -131 29 139 -64 71 -95 96 -111 -73 88 341 294 -57 -211 282
7948 282 317 -78 54 -364 -85 -201 -22 4 -126 -127 -214 222 25 -28 -22 -64 91 -89 31 180 19 83 154 91
7972 91 131 110 80 -82 85 -207 -210 -93 -354 237 38 182 26 101 57 447 117 -53 221 -180 95 -237 7
7995 7 115 -366 71 -311 -345 -1 -195 264 37 282 53 78 -330 -124 142 -203 35 44 393 -285 -17 1
8017 1 -82 -246 -180 55 -122 100 -54 -26 -178 -128 23 -80 -61 57 230 244 216 149 -318 99 -84 31 -64 71
$$ packed form
7858b88J17qJ0J28L17j70l8J24J39j12j23LK5J19k69N0L1k91J27Q6L9q2j31O07
7882D10l10j90J46j52k7K94k50J45qk15K06L6n6j68M43o05l6L14n7O5L5j67j74
7905c21M09M6k13j14J73K20l91J90j73L05J11l77K45k60l45L65M43r1k9j35j00
7926d2l9j97K08j9N8K55k50j05J60J10k03J35j66J91k07L8J61K53m7l51j54M93
7948B82L5l95J32m18K79j16J79K6j30jq7M36j97n3Om2J55j80J20J49j61O4P1o3
7972I1M0k1l0j62J67k92lJ17k61N91j99J44j56P5m4L90l30j70K74m01K75l32K44
7995GJ08m81M37l82l4L44j94M59k27K45k29K5m08K06K66l45K38RL49o78K68J8
8017Aq3j64O6K35j77K22j54K8j52N0J51j03J9J18J73J4k8o7m67M17j83J15r5J35
$$ plain form
8041 71 96 -156 58 116 -86 208 125 -288 94 367 -16 -71 52 202 -18 256 -177 -45 165 -235 18 110
8063 110 -108 -100 214 119 -156 210 76 96 55 -99 314 136 -98 133 172 -72 -94 -171 -18 -350 -220 59 -31
8086 -31 -221 -203 351 -284 69 -60 -67 69 138 2 -36 120 -178 -6 209 132 131 -164 -267 23 100 -46 142
8109 142 -126 -21 -419 74 41 273 6 -131 215 -326 43 30 143 -117 -323 -119 359 -205 -240 -251 -16
8130 -16 -132 10 279 29 84 -51 -101 246 -279 -92 -252 -68 179 120 -221 42 -251 288 99 -48 -246
8151 -246 112 -35 -18 -159 48 92 40 -127 -122 49 122 -80 196 27 -231 34 113 -16 42 -14 -105 57 26 59
8175 59 -84 69 -42 -5 -74 25 65 -48 -60 67 -19 114 -20 155 -11 -71
$$ packed form
8041G1K5k52K14N8k02K94q3m13L82K73l83n5J23J50k20K74m33J32K10m00K53R2
8063A10k18QL14r5k75L66j34K0m1j54M13j78k34K31L9k44k2p7J53l32J30K79r0
8086c1j90J8N54o35L53j29pJ36O9j36l8J56k98J72K15p7jk95j03K90P7j46J88
8109A42k68J05l98M93l3K32k67j37L46n41L69j3J13k60k06K04M78n64l5j1K35
8130a6j16J42K69k50N5j35n0L47n25J87j60J84K47n9l41K63k93N39j89j47j98
8151b46L58j47J7j41K07M4n2j67NJ71P3k02K76j69k58K65P9j29N8n6r1J62l1L3
8175E9j43J53j11L7o9R9M0j13j2J27q6J33j34J75j66o0
8191g1
$$ Imaginary data points
##PAGE= N=2
##DATA TABLE= (X++(I..I)), XYDATA
$$ plain form
0 0 0 0 0 0 0 0 0 0 0 0 0 -8 8 -8 8 -16 16 -23 24 -32 32 -40 48 -56 67 -80 91 -104 120 -137 157 -179 203
33 203 -228 258 -290 324 -361 402 -448 502 -554 614 -679 750 -829 915 -1006 1109 -1221 1347
51 1347 -1483 1636 -1805 1999 -2216 2465 -2753 3092 -3496 3986 -4597 5380 -6423 7890 -10084
66 -10084 13723 -20788 39265 -182644 -324373 323473 24070 -359056 158343 266710 -251155
77 -251155 -34420 289784 -78399 -195148 161390 69285 -185761 -10429 148911 -44906
87 -44906 -113076 87585 101471 -122138 -53525 160949 -24337 -177421 116844 115292 -205568
98 -205568 -12333 212292 -129038 -143926 219240 15863 -212495 133689 139259 -199785 -4901
109 -4901 184942 -118379 -114923 161668 10117 -141292 79377 101900 -99422 -37850 97952
$$ packed form
0@%%%%%%%%%%%qJ6j6J6k4L2l9M7n6O4p2Q8j04J23j47J71j95K24k57K94l36L82
33B03m31M86n48O14o85P63q50R50j056J168j293J429j579J744j921K115k330K568
51A347k830L119l441L804m215M681n218N845o588P482q583R977j1803J4313j7974
66a0084K3807l4511O0053k21909j41729O47846k99403l83126N17399J08367n17865
77b51155K16735L24204l68183j16749L56538r2105k55046J75332J59340j93817
87d4906o8170K00661J3886k23609O8613K14474j85286j53084K94265j552l20860
98b05568J93235K24625l41330j4888L63166k03377k28358L46184N570l39044J94884
109d901J89843l03321L456K76591j51551j51409K20669K2523k01322O1572J35802
$$ plain form
120 97952 -12259 -99110 30690 80476 -67804 -61710 112200 24186 -137332 49360 125220
131 125220 -134925 -66273 179730 -42155 -165573 146999 85534 -196434 37552 176123
141 176123 -139815 -87293 186642 -22141 -160773 111486 89508 -147989 -8497 131927
151 131927 -57084 -92068 90305 48063 -98094 -4285 98799 -36471 -93142 73805 62152
162 62152 -115073 -10697 133987 -57460 -107559 125669 40825 -156127 49240 128096 -129008
173 -129008 -52157 160396 -41641 -128842 117745 56424 -141671 27909 114337 -89227 -56383
184 -56383 109011 -5056 -93834 50132 61576 -72346 -26225 77916 -7710 -75096 39310
195 39310 60940 -69685 -31664 89974 -15333 -90336 65622 56615 -103029 2271 107140
$$ packed form
120I7952j10211q6851J29800M9786j48280O094J73910q8014j61518J86692P5860
131A25220k60145O8652K46003k21885j23418L12572o1465k81968K33986J38571
141A76123l15938N2522K73935k08783j38632K72259k1978k37497J39492J40424
151A31927j89011l4984J82373m2242j46157R3809J03084j35270n6671J66947j1653
162F2152j77225J04376J44684j91447n0099K33228q4844j96952K05367P8856k57104
173a29008P6851K12553k02037q7201K46587o1321j98095J69580Q6428k03564L2844
184e6383J65394j14067q8778J43966J1444j33922M6121J04141q5626o7386J14406
195C9310K1630j30625L8021J21638j05307p5003J55958r007j59644J05300J04869
$$ plain form
206 107140 -65567 -70483 108385 6629 -111498 58697 75039 -97526 -14436 102125 -40286
217 -40286 -71250 76709 28226 -83426 14005 70728 -44794 -48224 62098 20321 -72563
228 -72563 8833 69981 -44380 -56212 74053 19384 -93037 28872 82202 -78258 -41196
239 -41196 106897 -18390 -97624 77131 55593 -105934 9370 101110 -63432 -58256 94910
250 94910 4260 -90656 44473 61583 -73270 -22263 76508 -17170 -66679 43006 41421 -64108
262 -64108 -15363 69050 -19146 -64537 51676 41363 -76430 -1671 82967 -42472 -59928
273 -59928 81392 18049 -90745 37638 72973 -77167 -25619 93075 -26565 -74253 67468
284 67468 32707 -84011 12087 70572 -50851 -43342 65995 5461 -67283 23772 50911 -48062
$$ packed form
206A07140j72707m916J78868j01756j18127J70195J6342j72565Q3090J16561j42411
217d0286l0964J47959m8483j11652R7431N6723j15522l430J10322m1777r2884
228g2563Q1396O1148j14361j1832J30265n4669j12421J21909N3330j60460L7062
239d1196J48093j25287p9234J74755k1538j61527J15304R1740j64542N176J53166
250I4910r0650r4916J35129J7110j34853N1007R8771r3678m9509J09685j585j05529
262f4108M8745Q4413q8196m5391J16213j0313j17793P4759Q4638j25439j7456
273e9928J41320o3343j08794J28383L5335j50140N1548J18694j19640m7688J41721
284F7468l4761j16718R6098N8485j21423P509J09337o0534p2744R1055K7139r8973
$$ plain form
296 -48062 -28951 60707 784 -61829 30087 51242 -55329 -22720 72651 -12173 -65840 52132
308 52132 41613 -74820 1360 76304 -43904 -51665 72047 10040 -77554 30978 56103
319 56103 -62411 -22567 69576 -16729 -59796 44482 33550 -60294 -4145 59569 -24414 -46021
331 -46021 47949 24630 -58987 6290 59756 -34897 -42193 59987 13651 -67671 24054 57361
343 57361 -55841 -27305 72110 -13079 -66255 49096 37526 -71177 53 67834 -38991
354 -38991 -46486 62119 11646 -66965 23299 52337 -49870 -25187 61731 -5952 -56383 35397
366 35397 38861 -53730 -10366 60162 -19628 -49699 46020 26571 -60100 4644 57365 -35823
378 -35823 -38688 56745 7730 -61319 24856 47324 -50719 -20571 60503 -12344 -53283 40108
$$ packed form
296d8062J9111Q9658n9923o2613R1916K1155j06571L2609R5371q4824n3667J17972
308E2132j0519j16433P6180P4944j20208p761J23712o2007q7594J08532K5125
319E6103j18514L9844R2143q6305m3067J04278j0932r3844N6149O3714q3983k1607
331d6021R3970k3319q3617O5277N3466r4653p296J02180m6336q1322R1725L3307
343E7361j13202K8536R9415q5189n3176J15351j1570j08703P1230O7781j06825
354c8991p495J08605n0473p8611R0264K9038j02207K4683Q6918o7683n0431R1780
366C5397L464r2591M3364P0528p9790l0071R5719j9449q6671O4744N2721r3188
378c5823k865R5433m9015o9049Q6175K2468r8043L0148Q1074p2847m0939R3391
$$ plain form
390 40108 31099 -55958 -1668 55913 -27747 -40807 48613 15302 -56064 13907 48567 -39420
402 -39420 -27845 54615 308 -54024 28572 39610 -48792 -13353 55981 -16034 -46689 41235
414 41235 25294 -54158 3237 52160 -30345 -36391 48313 10539 -53876 16229 43819 -40510
426 -40510 -23995 51632 -3946 -50735 29807 35064 -48637 -9866 54323 -17917 -44114 42453
438 42453 23153 -53082 6893 51011 -32347 -32104 50439 6086 -52538 21846 40662 -43730
450 -43730 -18954 51961 -9279 -48187 32038 29743 -49142 -5896 50522 -22314 -40829 43369
462 43369 18072 -53641 10387 49593 -35928 -29644 53285 2871 -52395 27943 39021 -47267
474 -47267 -11102 54076 -17387 -43230 40083 20736 -50155 4901 43945 -29353 -29635 40855
$$ packed form
390D0108r009q7057N4290N7581q3660j3060Q9420l3311p1366O9971L4660q7987
402c9420J1575Q2460n4307n4332Q2596J1038q8402L5439O9334p2015l0655Q7924
414D1235j5941p9452N7395M8923q2505o046Q4704l7774o4415P0105K7590q4329
426d0510J6515P5627n5578m6789Q0542N257q3701L8771O4189p2240k6197Q6567
438D2453j9300p6235N9975M4118q3358K43Q2543m4353n8624P4384J8816q4392
450d3730K4776P0915o1240l8908Q0225k295p8885M3246N6418p2836j8515Q4198
462D3369k5297p1713O4028L9206q5521O284Q2929n0414n5266Q0338J1078q6288
474d7267L6165O5178p1463k5843Q3313j9347p0891N5056L9044p3298k82P0490
$$ plain form
486 40855 6090 -44489 14094 34776 -32361 -19381 41334 -837 -40732 22337 31683 -37353
498 -37353 -11449 45943 -10081 -39379 33268 24027 -44760 1975 45359 -26361 -31095 43014
510 43014 7108 -47626 16989 36045 -37475 -17929 43246 -7151 -40199 25837 24754 -38686
522 -38686 -5740 40696 -14493 -32993 32084 18620 -40202 3273 40986 -22576 -28085 39577
534 39577 8809 -43293 15903 35745 -35313 -16197 43980 -8717 -40012 29009 22257 -41730
546 -41730 -1172 38703 -20711 -27370 32498 7909 -35935 10560 29718 -24920 -16696 33729
558 33729 1571 -33332 16061 27412 -28564 -11930 36556 -6352 -33517 25632 21089 -38064
570 -38064 -261 38765 -22109 -27457 36684 5658 -40552 16426 29630 -33376 -10813 37481
$$ packed form
486D0855l4765n0579N8583K0682o7137J2980O0715m2171l9895O3069R346o9036
498c7353K5904N7392n6024k9298P2647r241o8787M6735M3384p1720m734P4109
510D3014l5906n4734O4615J9056p3520J9546O1175n0397l3048O6036j083o3440
522c8686L2946M6436n5189j8500O5077j3464n8822M3475L7713o3562n509O7662
534C9577l0768n2102N9196J9842p1058J9116O0177n2697l1295O9021o752o3987
546d1730M0558L9875n9414o659N9868k4589m3844M6495J9158n4638Q224N0425
558C3729l2158l4903M9393J1351n5976J6634M8486m2908k7165N9149m543n9153
570c8064L7803L9026o0874n348O4141l1026m6210N6978J3204o3006K2563M8294
$$ plain form
582 37481 -10593 -30451 26051 15278 -32691 2044 30397 -16466 -20765 26295 8899 -29370
594 -29370 5243 27486 -18043 -18465 28286 4665 -31566 12410 26260 -27620 -12172 35354
606 35354 -7268 -32008 25408 17820 -35377 2151 33452 -21174 -21051 31981 2540 -32533 14281
619 14281 23332 -25655 -9830 29136 -4489 -25713 16155 17396 -24237 -5975 27790 -7333
631 -7333 -24744 21178 16061 -30577 259 33433 -17844 -24647 33088 7551 -37487 14419 29411
644 29411 -32024 -11144 37814 -11806 -31587 28153 13791 -35638 4858 30125 -20969 -17672
656 -17672 28231 2545 -27579 11317 21510 -20215 -11145 26348 726 -26073 13041 22163
668 22163 -23218 -10292 31287 -5423 -29455 22173 17925 -34175 129 33579 -21347 -23489
$$ packed form
582C7481m8074j9858N6502j0773m7969L4735K8353m6863m299M7060j7396l8269
594b9370L4613K2243m5529m22M6751k3621l6231M3976J3850n3880J5448M7526
606C5354m2622k4740N7416p588n3197L7528L1301n4626J23N3032k9441l5073M6814
619A4281R051m8987J5825L8966l3625k1224M1868J241m1633J8262L3765l5123
631g333j7411M5922n117m6638L0836L3174n1277o803N7735k5537m5038N1906J4992
644B9411o1435K0880M8958m9620j9781N9740j4362m9429M0496K5267n1094L297
656a7672M5903k5686l0124L8896J0193m1725R070L7493k5622k6799L9114R122
668B2163m5381J2926M1579l6710k4032N1628m248n2100L4304L3450n4926k142
$$ plain form
680 -23489 34078 2315 -36848 17190 25036 -31791 -7781 33440 -10936 -25725 23712 12582
692 12582 -26810 3350 25763 -13185 -17250 22011 9025 -24156 2769 24937 -13745 -18658
704 -18658 24058 6687 -30023 8368 26751 -25436 -15099 33326 -4944 -33082 22457 19093
716 19093 -34534 -240 33718 -18567 -21965 30678 5170 -30479 12553 24020 -22664 -9955
728 -9955 27993 -2212 -24441 14608 18005 -22120 -7521 25628 -5107 -24856 16827 16015 -27727
741 -27727 -3679 29653 -13951 -24923 27125 9580 -34132 8817 28962 -25286 -13897 33836
753 33836 -4275 -29440 21826 17863 -29214 -302 28977 -13835 -19526 23644 7171 -26035
765 -26035 5403 22200 -16161 -14755 22148 3004 -24895 8036 20411 -19835 -11798 26029
$$ packed form
680b3489N7567l1763l9163N4038P846n6827K4010M1221m4376j4789M9437j1130
692A2582l9392L0160K2413l8948m065L9261j2986l3181K6925K2168l8682m913
704a8658M2716j7371l6710L8391J8383n2187J0337M8425l8270k8138N5539l364
716A9093n3627L4294L3958n2285l398N2643k5508l5649M3032J1467m6684J2709
728i955L7948l0205k2229L9049L397m0125J4599L3149l0735j9749M1683q12m3742
741b7727K4048L3332m3604j0972N2048j7545m3712M2949K0145n4248J1389M7733
753C3836l8111k5165N1266l963m7077K8912K9279m2812n691M3170j6473l3206
765b6035L1438J6797l8361J406L6903j9144k7899L2931J2375m0246Q037L7827
$$ plain form
777 26029 -1911 -26195 16074 18111 -26143 -3575 28729 -11768 -21180 24652 8392 -28235
789 -28235 8039 23985 -20023 -11848 25989 -1712 -23695 13850 15524 -21468 -4700 22846
801 22846 -7133 -19457 15939 11333 -21899 -1132 22221 -10436 -17656 19867 7908 -24484
813 -24484 4690 22751 -16901 -13810 24904 526 -24966 13566 17790 -22995 -5177 25901
825 25901 -8685 -20460 19352 10063 -23977 2906 22149 -14147 -14331 21400 3265 -22849 8134
838 8134 18285 -17576 -9719 22228 -2090 -21724 12991 14541 -21556 -3955 23465 -9045 -19256
851 -19256 19181 8911 -23851 4262 21688 -15671 -12693 23173 968 -22723 11699 16846
863 16846 -19568 -5787 22705 -5828 -18974 15847 10414 -21247 149 20477 -11205 -15392
$$ packed form
777B6029k7940k4284M2269K037m4254K2568L2304m0497r412M5832j6260l6627
789b8235L6274J5946m4008Q175L7837k7701k1983L7545J674l6992J6768K7546
801B2846k9979j2324L5396m606l3232K0767K3353l2657p220L7523j1959l2392
813b4484K9174J8061l9652L091L8714k4378k5492L8532M224m0785J7818L1078
825B5901l4586j1775L9812r289l4040K6883J9243l6296j84L5731j8135k6114L0983
838H134J0151l5861P857L1947k4318j9634L4715J550l6097J7601K7420l2510j0211
851a9256L8437j0270l2762K8113J7426l7359K978L5866k2205k3691L4422N147
863A6846l6414J3781K8492k8533j3146L4821n433l1661K1396K0328l1682m187
$$ plain form
875 -15392 18000 5075 -21605 5270 17996 -15439 -10564 20491 -180 -20326 10839 14850
887 14850 -17845 -4362 21208 -5720 -17050 15718 9907 -19876 1263 19576 -10877 -13558
899 -13558 17852 3856 -20355 6183 16167 -15611 -9246 19153 -1857 -19573 10829 12829 -18234
912 -18234 -3896 19648 -6704 -16087 15565 8472 -19011 2550 18940 -11162 -11856 18661 3206
925 3206 -19326 7650 15897 -15750 -7515 19542 -3214 -18692 12322 10743 -19348 -1851 19045
938 19045 -9696 -14967 16288 5291 -19513 4505 16393 -13014 -8581 18026 -224 -16305
950 -16305 9866 12161 -14688 -3281 17435 -4377 -14016 12049 8579 -16090 -455 15958 -8381
963 -8381 -12551 14453 4100 -17955 4440 14900 -13632 -8666 17576 -1625 -17111 11045 11082
$$ packed form
875a5392L3392j2925k6680K6875J2726l3435M875L1055k0671k0146L1165M011
887A4850l2695J3483K5570k6928j1330L2768n811k9783K1139J8313l0453k681
899a3558L1410j3996k4211K6538R984l1778O365K8399k1010j7716L0402K000l1063
912a8234J4338K3544k6352r383L1652p093k7483K1561J6390l0102o94L0517j5455
925C206k2532K6976Q247l1647Q235K7057k2756j5478L1014j579l0091J7497K0896
938A9045k8741n271L1255j0997k4804K4018J1888k9407M433K6607j8250j6081
950a6305K6171K295k6849J1407K0716k1812r639K6065l470k4669J5635J6413k4339
963h381m170K7004j0353k2055K2395J0460k8532M966K6242j9201j5486K8156L7
$$ plain form
976 11082 -16571 -1410 17731 -7460 -12187 14628 4504 -15836 4758 13646 -10754 -7160 14195
989 14195 254 -13761 6120 10016 -11267 -5131 13284 -2299 -13226 8359 8857 -14088 -2528
1002 -2528 15474 -6049 -12769 13312 5597 -16623 3881 14721 -11902 -7546 16673 -1437 -15197
1015 -15197 10372 9289 -14865 -855 15120 -6750 -10681 12006 4116 -13444 2565 11652 -8136
1028 -8136 -7525 11856 1726 -13243 4523 11880 -10800 -6969 14704 -663 -14791 8853 10307
1041 10307 -15554 -1652 17160 -8542 -12514 15725 3844 -17719 6457 13865 -13703 -5387
1053 -5387 16490 -3629 -13330 10799 7427 -13802 294 13167 -6039 -9146 10362 4452 -12298
1066 -12298 1152 11801 -6986 -9214 11427 3384 -14249 3570 12437 -11246 -7035 15611 -1725
$$ packed form
976A1082k7653J5161J9141k5191m727K6815j0124k0340K0594Q888k4400L594K1355
989A4195j3941j4015J9881L896k1283O136J8415j5583j0927K1585M98k2945J1560
1002b528J8002k1523o720K6081p715k2220K0504J0840k6623M356K4219j8110j3760
1015a5197K5569j083k4154J4010J5975k1870l931K2687p890j7560J6009R087j9788
1028h136O11J9381j0130j4969J7766P357k2680L831K1673j5367j4128K3644J454
1041A0307k5861J3902J8812k5702l972K8239j1881k1563K4176P408k7568Q316
1053e387K1877k0119r701K4129l372k1229J4096J2873j9206l107J9508n910j6750
1066a2298J3450J0649j8787k228K0641q043j7633J7819Q867k3683M211K2646j7336
$$ plain form
1079 -1725 -15434 10424 10023 -15669 -776 16655 -8094 -10933 14740 3100 -15162 5702 11959
1092 11959 -11375 -5466 13634 -1351 -12682 6656 8816 -11416 -3946 12458 -2759 -12442 8087
1105 8087 8223 -13516 -2042 15113 -5925 -12304 13614 5928 -16747 4061 15398 -12014 -7830
1118 -7830 17433 -1147 -15576 10615 9622 -15488 -1063 15315 -7245 -11665 12008 4398 -14466
1131 -14466 1872 11857 -8608 -8607 11601 2338 -13700 3974 12172 -10228 -7326 14688 500
1144 500 -14551 8275 11531 -13854 -2808 16926 -5622 -12878 13439 5971 -16260 3195 13963
1157 13963 -11090 -8212 14350 -296 -14547 6485 9544 -11851 -4341 12610 -2651 -11454 7872
1170 7872 7855 -11703 -1812 13504 -4202 -10946 10967 6602 -13555 1798 13956 -8920 -8305 14290
$$ packed form
1079a725j3709K5858m01k5692J4893J7431k4749k839K5673j1640j8262K0864O257
1092A1959k3334N909J9100j4985j1331J9338K160k0232P470J6404j5217r683K0529
1105H087J36k1739J1474J7155k1038o379K5918p686k2675K0808J1337k7412M184
1118g830K5263j8580j4429K6191r93k5110J4425J6378k2560m420K3673p610j8864
1131a4466J6338R985k0465JK0208r263j6038J7674Q198k2400K902K2014j4188
1144E00j5051K2826L256k5385J1046J9734k2548p256K6317p468k2231J9455J0768
1157A3963k5053K878K2562j4646j4251K1032L059k1395P510J6951j5261q803J9326
1170G872j7j9558R891J5316j7706o744K1913m365k0157J5353J2158k2876O15K2595
$$ plain form
1184 14290 620 -14491 7386 10249 -13057 -3413 13675 -4667 -11378 9565 5060 -12197 519
1197 519 10806 -6393 -7660 9741 3258 -11159 2261 10664 -7123 -7048 11670 2190 -12889 5138
1211 5138 10928 -10909 -4671 14619 -3145 -12802 10695 6943 -14789 1224 13697 -9149 -8696
1224 -8696 13036 702 -13191 6125 8928 -10737 -3029 11707 -2875 -9871 7403 6375 -10108
1237 -10108 -1145 10782 -3653 -9049 8480 5164 -11411 712 11701 -7028 -7966 11820 1556
1250 1556 -12954 5786 9841 -11414 -3640 13224 -3933 -10722 9673 4842 -11975 1721 10515
1263 10515 -7061 -6175 9724 980 -10031 3315 8002 -7076 -4529 8970 201 -9660 4508
1276 4508 8030 -8586 -3485 11107 -2009 -10498 8464 6645 -12026 505 12298 -7385 -7937
$$ packed form
1184A4290j3670j5111K1877K863k3306R644J7088j8342o711K0943m505j7257J2716
1197E19J0287j7199j267J7401o483j4417J3420Q403j7787P5J8718r480j5079J8027
1211E138N790k1837O238J9290j7764r657K3497l752k1732J6013J2473k2846M53
1224h696K1732j2334j3893J9316K803j9665P708J4736j4582o996J7274j028j6483
1237a0108Q963J1927j4435n396J7529l316j6575J2123J0989j8729r38J9786j0264
1250A556j4510J8740M055k1255P774J6864j7157o789K0395m831j6817J3696Q794
1263A0515j7576Q86J5899q744j1011J3346M687j5078K547J3499q769r861J4168
1276D508L522j6616N101J4592j3116q489J8962j819j8671J2531J1793j9683n52
$$ plain form
1289 -7937 11990 1135 -12444 5873 8656 -10630 -3010 11144 -3506 -9308 7833 4434 -10100
1302 -10100 209 9029 -4590 -6859 7874 3145 -9248 1421 9220 -5595 -6288 9768 2114
1315 2114 -10789 4415 9393 -9196 -4367 12253 -2440 -11035 8466 5792 -12361 596 11372
1328 11372 -7262 -7712 10374 769 -10939 4527 7888 -8586 -3220 10201 -1433 -8205 6249
1341 6249 6004 -8134 -1236 9467 -2662 -7748 7182 5230 -9671 129 9914 -5491 -7078 9673
1355 9673 1786 -11332 3919 8313 -9497 -4071 10794 -2531 -9509 7469 4957 -9978 212
1368 212 9415 -5138 -6070 8804 2426 -8643 2616 8049 -5795 -4544 8282 764 -9098 4096
1382 4096 6760 -7609 -3288 9274 -1968 -9114 6022 5164 -9791 -747 9431 -5039 -6898
$$ packed form
1289g937J9927j0855j3579J8317K783j9286P620J4154j4650n802J7141l399j4534
1302a0100J0309Q820j3619k269J4733m729j2393J0669P799j4815o93J6056p654
1315B114j2903J5204M978j8589M829J6620j4693q595J9501k674j8153J2957J0776
1328A1372j8634m50J8086r605j1708J5466L361j6474N366J3421j1634o772J4454
1341F249k45j4138O898J0703j2129n086J4930j952j4901R800R785j5405j587J6751
1355I673p887j3118J5251M394j7810N426J4865j3325o978J6978k512j4935J0190
1368B12R203j4553r32J4874o378j1069J1259N433j3844J251J2826p518r862J3194
1382D096K664j4369M321J2562j1242p146J5136q58j4955R044J0178j4470j859
$$ plain form
1395 -6898 8953 2008 -9949 3649 8279 -7220 -3322 9667 -677 -7804 5554 5545 -7958 -1257
1409 -1257 8628 -3103 -6712 6679 3257 -8742 714 8341 -5332 -5801 7723 1476 -9161 3067
1423 3067 7246 -7521 -3502 9678 -1392 -8434 6403 5279 -8669 -401 8865 -4100 -6439
1436 -6439 8118 2281 -8675 2590 7312 -6976 -4498 8800 -396 -8429 4578 5402 -7569
1449 -7569 -1846 8323 -2665 -7039 6195 3614 -8648 492 7695 -4949 -5489 7372 1055 -8503
1463 -8503 3356 6902 -6421 -3272 8065 -1011 -7376 5427 4621 -7959 -1091 8391 -3784 -6765
1477 -6765 6562 3014 -8323 1274 7998 -5361 -4615 7991 541 -8647 4097 6109 -7300 -3078
1491 -3078 8400 -2128 -7826 5558 4328 -8388 -255 8677 -4267 -6245 7805 2441 -8639
$$ packed form
1395f898J5851o945j1957J3598M630j5499L898J2989j0344p127J3358rj3503O701
1409a257R885j1731l609J3391l422j1999R456P627j3673m69J3524o247j0637J2228
1423C067M179j4767M019J3180j1070p042J4837j124j3948Q268R266j2965k339
1436f439J4557n837j0956J1265M722j4288K478J3298r196q033J3007Q24j2971
1449g569N723J0169j0988m374J3234k581j2262R140P203j2644n40J2861o317r558
1463h503J1859L546j3323L149J1337r076o365J2803q06j2580O868R482j2175k981
1477f765J3327l548j1337R597O724j3359P46J2606p450r188J2744K012j3409M222
1491c078J1478j0528n698J3384j230j2716Q133Q932j2944j978J4050n364j1080
$$ plain form
1504 -8639 2726 7424 -6093 -4253 8945 1 -8345 5067 5813 -7904 -2148 8544 -2972
1517 -2972 -7503 6515 3184 -8905 1032 7899 -5086 -5851 7546 1369 -8568 2719 6770 -6382
1531 -6382 -3576 8589 -721 -7933 5430 5828 -7425 -856 9140 -2836 -6640 7105 3893 -8442
1545 -8442 968 8295 -5630 -5518 7986 1004 -8758 3218 5866 -7521 -3167 8061 -1658 -7778
1559 -7778 5162 4747 -7704 -594 7909 -3261 -6107 6708 3147 -7599 1576 7871 -5004 -4751
1573 -4751 7889 1127 -8203 3523 6283 -7010 -2984 7949 -1991 -7587 5610 3810 -8333
1586 -8333 -259 7173 -4520 -5680 6741 1886 -6978 1888 6167 -4838 -3210 6694 775 -6529
1600 -6529 3394 5684 -5818 -2025 7385 -812 -6737 4656 4810 -7441 -685 7594 -3862 -6462
$$ packed form
1504h639J1365M698j3517J840J3198q944q346J3412P46j3717N756J0692j1516
1517b972m531J4018l331j2089R937O867j2985p65J3397o177r937J1287M051j3152
1531f382K806J2165r310p212J3363L98j3253O569R996j1976l804J3745l212j2335
1545h442R410P327j3925J12J3504o982r762J1976K648j3387M354J1228r719o120
1559g778J2940m15j2451P110Q503j1170k846J2815l561j0746R175O295j2875K53
1573d751J2640o762r330J1726K760j3293M026J0933r940n596J3197j800j2143
1586h333Q074P432j1693j160J2421m855q864Q866M279j1005J628R904n919p304
1600f529R923K290j1502L793R410q197n925J1393J54j2251O756Q279j1456k600
$$ plain form
1614 -6462 6968 1778 -8655 2313 6647 -6353 -3571 7599 -1674 -6694 5437 3524 -7157
1627 -7157 585 6917 -3498 -4419 5377 1740 -5644 1139 5046 -3539 -3209 5114 935 -5554 1549
$$ packed form
1614f462J3430n190j0433J0968M334j3000K782J1170r273n020J2131j913j0681
1627g157P742O332j0415r21R796l637p384O783L907q585L30Q323m179o489P103
$$ [...]
8191E7
##END NTUPLES=NMR FID
##END=
