##TITLE=1H_3d1411F
 aceton-d6
 8 sc, 
 15.11.2022
##JCAMPDX= 6.0         $$ Bruker NMR JCAMP-DX V2.0
##DATA TYPE= NMR FID
##DATA CLASS= NTUPLES
##ORIGIN= UXNMR, Bruker Analytische Messtechnik GmbH
##OWNER= root
$$ XWIN-NMR		Version 3.5
$$ Tue Nov 15 14:26:47 2022 Russian Standard Time (UT+4h)  she@DPX200
##.OBSERVE FREQUENCY= 200.1313499994
##.OBSERVE NUCLEUS= ^1H
##.DELAY= (6, 6)
##.ACQUISITION MODE= SIMULTANEOUS
##.ACQUISITION SCHEME= undefined
##.AVERAGES= 8
##.DIGITISER RES= 18
##SPECTROMETER/DATA SYSTEM= spect
##.PULSE SEQUENCE= zg30
##.SOLVENT NAME= Acetone
##.SHIFT REFERENCE= (INTERNAL, Acetone, 0, 15.7039)
##AUDIT TRAIL= $$ (NUMBER, WHEN, WHO, WHERE, WHAT)
$$ ##TITLE= Audit trail, XWIN-NMR		Version 3.5
$$ ##JCAMPDX= 5.01
$$ ##ORIGIN= Bruker BioSpin GmbH
$$ ##OWNER= she
$$ F:/spectra/data/she/nmr/H-F/1/audita.txt
$$ ##AUDIT TRAIL=  $$ (NUMBER, WHEN, WHO, WHERE, WHAT)
(   1,<2022-11-15 14:24:52.28 +0400>,<she>,<DPX200>,
      <created by zg, POWCHK disabled, PULCHK disabled
       configuration hash MD5:
       00 E9 B6 7A A2 85 ED C7 34 08 36 98 17 FE 4E 26
       data hash MD5: 16K
       76 11 AB C4 E7 21 69 F3 B6 41 86 2A BF 8B 0E 53>)
$$ ##END=
$$ 
$$ hash MD5
$$ E9 8C 8B 7D FA E5 E6 66 BA 03 AE EC 39 21 D6 E5
##$RELAX= 
##$RELAX= 
##$RELAX= 
##$RELAX= 
##$RELAX= 
##$RELAX= 
$$ Bruker specific parameters
$$ --------------------------
##$DU= <F:/spectra>
##$EXPNO= 1
##$NAME= <H-F>
##$PROCNO= 1
##$TYPE= <nmr>
##$USER= <she>
##$AMP= (0..31)
100 100 100 100 100 100 100 100 100 100 100 100 100 100 100 100 100 100 
100 100 100 100 100 100 100 100 100 100 100 100 100 100 
##$AQSEQ= 0
##$AQ_mod= 1
##$AUNM= <au_zg>
##$AUTOPOS= <>
##$BF1= 200.13
##$BF2= 200.13
##$BF3= 200.13
##$BF4= 200.13
##$BF5= 200.13
##$BF6= 200.13
##$BF7= 200.13
##$BF8= 200.13
##$BYTORDA= 1
##$CFDGTYP= 0
##$CFRGTYP= 5
##$CHEMSTR= <none>
##$CNST= (0..31)
1 1 145 1 1 1 1 1 1 1 1 1 1 1 1 1 1 1 1 1 1 1 1 1 1 1 1 1 1 1 1 1 
##$CPDPRG= <>
##$CPDPRG1= <>
##$CPDPRG2= <>
##$CPDPRG3= <>
##$CPDPRG4= <mlev>
##$CPDPRG5= <mlev>
##$CPDPRG6= <mlev>
##$CPDPRG7= <mlev>
##$CPDPRG8= <mlev>
##$CPDPRGB= <>
##$CPDPRGT= <>
##$D= (0..31)
0 1.2 0 0 0 0 0 0 0 0.06 0 0.03 0 0 0 0 0.0002 0 0 0 0 0 0 0 0 0 0 0 0 
0 0 0 
##$DATE= 1668507891
##$DBL= (0..7)
120 120 120 120 120 120 120 120 
##$DBP= (0..7)
150 150 150 150 150 150 150 150 
##$DBP07= 0
##$DBPNAM0= <>
##$DBPNAM1= <>
##$DBPNAM2= <>
##$DBPNAM3= <>
##$DBPNAM4= <>
##$DBPNAM5= <>
##$DBPNAM6= <>
##$DBPNAM7= <>
##$DBPOAL= (0..7)
0.5 0.5 0.5 0.5 0.5 0.5 0.5 0.5 
##$DBPOFFS= (0..7)
0 0 0 0 0 0 0 0 
##$DE= 6
##$DECBNUC= <off>
##$DECIM= 32
##$DECNUC= <off>
##$DECSTAT= 4
##$DIGMOD= 1
##$DIGTYP= 9
##$DL= (0..7)
0 120 120 120 120 120 120 120 
##$DP= (0..7)
150 150 150 150 150 150 150 150 
##$DP07= 0
##$DPNAME0= <>
##$DPNAME1= <>
##$DPNAME2= <>
##$DPNAME3= <>
##$DPNAME4= <>
##$DPNAME5= <>
##$DPNAME6= <>
##$DPNAME7= <>
##$DPOAL= (0..7)
0.5 0.5 0.5 0.5 0.5 0.5 0.5 0.5 
##$DPOFFS= (0..7)
0 0 0 0 0 0 0 0 
##$DQDMODE= 0
##$DR= 18
##$DS= 0
$$ [...]
##$SUBNAM2= <"">
##$SUBNAM3= <"">
##$SUBNAM4= <"">
##$SUBNAM5= <"">
##$SUBNAM6= <"">
##$SUBNAM7= <"">
##$SUBNAM8= <"">
##$SUBNAM9= <"">
##$SW= 18.0517283424941
##$SWIBOX= (0..15)
0 0 2 0 0 0 0 0 0 0 0 0 0 0 0 0 
##$SW_h= 3612.71676300578
##$TD= 16384
##$TD0= 1
##$TE= 0
##$TE2= 300
##$TE3= 300
##$TEG= 300
##$TL= (0..7)
0 120 120 120 120 120 120 120 
##$TP= (0..7)
150 150 150 150 150 150 150 150 
##$TP07= 0
##$TPNAME0= <>
##$TPNAME1= <>
##$TPNAME2= <>
##$TPNAME3= <>
##$TPNAME4= <>
##$TPNAME5= <>
##$TPNAME6= <>
##$TPNAME7= <>
##$TPOAL= (0..7)
0.5 0.5 0.5 0.5 0.5 0.5 0.5 0.5 
##$TPOFFS= (0..7)
0 0 0 0 0 0 0 0 
##$TUNHIN= 0
##$TUNHOUT= 0
##$TUNXOUT= 0
##$USERA1= <user>
##$USERA2= <user>
##$USERA3= <user>
##$USERA4= <user>
##$USERA5= <user>
##$V9= 5
##$VALIST= <valist>
##$VCLIST= <CCCCCCCCCCCCCCC>
##$VD= 0
##$VDLIST= <DDDDDDDDDDDDDDD>
##$VPLIST= <PPPPPPPPPPPPPPP>
##$VTLIST= <TTTTTTTTTTTTTTT>
##$WBST= 1024
##$WBSW= 4
##$XGAIN= (0..3)
0 0 0 0 
##$XL= 0
##$YL= 0
##$YMAX_a= 793606
##$YMIN_a= -606586
##$ZGOPTNS= <>
##$ZL1= 120
##$ZL2= 120
##$ZL3= 120
##$ZL4= 120
##$ABSF1= 10
##$ABSF2= 0
##$ABSG= 5
##$ABSL= 3
##$ALPHA= 0
##$AQORDER= 0
##$ASSFAC= 0
##$ASSFACI= 0
##$ASSFACX= 0
##$ASSWID= 0
##$AUNMP= <proc_1d>
##$AZFE= 0.1
##$AZFW= 0.1
##$BCFW= 1
##$BC_mod= 2
##$BYTORDP= 1
##$COROFFS= 0
##$CY= 11.3945322036743
##$DATMOD= 1
##$DC= 2
##$DFILT= <>
##$DTYPP= 0
##$F1P= 2.36226072786647
##$F2P= -0.459571619588291
##$FCOR= 0.5
##$FTSIZE= 0
##$FT_mod= 4
##$GAMMA= 1
##$GB= 0.15
##$INTBC= 1
##$INTSCL= 1
##$ISEN= 128
##$LB= 0.24
##$LEV0= 0
##$LPBIN= 0
##$MAXI= 10000
##$MC2= 0
##$MEAN= 0
##$ME_mod= 0
##$MI= 1.114404
##$NCOEF= 0
##$NC_proc= 0
##$NLEV= 6
##$NOISF1= 3.799351
##$NOISF2= 2.8
##$NSP= 1
##$NTH_PI= 0
##$NZP= 0
##$OFFSET= 15.70392
##$PC= 1
##$PHC0= -17939.58
##$PHC1= 8.200696
##$PH_mod= 1
##$PKNL= yes
##$PPARMOD= 0
##$PSCAL= 0
##$PSIGN= 0
##$REVERSE= no
##$SF= 200.130013532006
##$SI= 16384
##$SIGF1= 3
##$SIGF2= 2
##$SINO= 400
##$SIOLD= 16384
##$SREGLST= <1H.CDCl3>
##$SSB= 0
##$STSI= 0
##$STSR= 0
##$SW_p= 3612.71676300578
##$SYMM= 0
##$S_DEV= 0
##$TDeff= 0
##$TDoff= 0
##$TI= <>
##$TILT= no
##$TM1= 0
##$TM2= 0
##$TOPLEV= 0
##$USERP1= <user>
##$USERP2= <user>
##$USERP3= <user>
##$USERP4= <user>
##$USERP5= <user>
##$WDW= 1
##$XDIM= 8192
##$YMAX_p= 0
##$YMIN_p= 0
$$ End of Bruker specific parameters
$$ ---------------------------------
##NTUPLES= NMR FID
##VAR_NAME=  TIME,          FID/REAL,        FID/IMAG
##SYMBOL=    X,             R,               I
##VAR_TYPE=  INDEPENDENT,   DEPENDENT,       DEPENDENT
##VAR_FORM=  AFFN,          ASDF,            ASDF
##VAR_DIM=   8192,          8192,            8192
##UNITS=     SECONDS,       ARBITRARY UNITS, ARBITRARY UNITS
##FACTOR=    0.0002768,     1,               1
##FIRST=     0,             0,               0
##LAST=      2.2672688,     0,               0
##MIN=       0,             -606586,         0
##MAX=       2.2672688,     793606,          0
$$ Real data points
##PAGE= N=1
##DATA TABLE= (X++(R..R)), XYDATA
$$ plain form
0 0 0 0 0 0 0 0 -8 8 -8 8 -16 21 -24 32 -40 48 -56 72 -88 104 -121 144 -169 198 -231 269 -309 355 -404
29 -404 459 -521 587 -664 744 -833 932 -1042 1159 -1287 1426 -1579 1746 -1925 2119 -2334
45 -2334 2567 -2820 3097 -3403 3740 -4110 4521 -4982 5499 -6082 6746 -7509 8401 -9451
59 -9451 10710 -12248 14168 -16631 19901 -24435 31102 -41762 61280 -107750 405726 530142
71 530142 -410319 -102407 -225282 793606 -521852 -70103 85086 94821 137837 -443062
81 -443062 422919 -303264 221031 -57737 -42587 22630 -207411 506617 -380856 836
91 836 -42464 293393 -29237 -476894 422085 -30453 86889 -405072 243119 252406 -370083
102 -370083 125249 -89495 338062 -419487 125196 217918 -229737 55790 -151347 462915
$$ packed form
0@%%%%%%qJ6j6J6k4L7m5N6p2Q8j04J28j60J92k25K65l13L67m29N00n78O64p59
29d04Q63r80J108j251J408j577J765j974K201k446K713l005L325l671M044m453
45b334M901n387N917o500P143p850Q631r503J0481j1581J2828j4255J5910j7852
59i451K0161k2958K6416l0799L6532m4336N5537p2864J03042j69030N13476J24416
71E30142r40461L07912j22875J018888j315458M51749J55189R735M3016n80899
81d43062Q65981p26183N24295k78768J5150O5217k30041P14028q87473L81692
91H36m3300L35857l22630m47657Q98979m52538J17342m91961O48191R287o22489
102c70083M95332k14744M27557p57549N44683R2722m47655K85527k07137O14262
$$ plain form
112 462915 -443793 47105 139418 24746 -1266 -340619 466540 -228904 93041 -173153
122 -173153 109588 119772 -236501 252310 -269206 196589 -101604 139895 -92112 -210076
132 -210076 350909 -100579 2195 -300397 331732 140106 -328595 -17846 73599 356708
142 356708 -411707 -53699 194109 94194 -68243 -282983 313345 -68674 44580 -123840
152 -123840 -14902 151995 -101659 134155 -263364 156810 52344 6928 -91729 -145604
162 -145604 335016 -132854 -26166 -166044 237461 70551 -256307 75857 9629 192784
172 192784 -266182 57660 82123 -21780 1093 -105032 179467 -146408 58759 5804
182 5804 -1617 -7568 -76269 172293 -127066 18941 -21193 60517 14258 -110482 100428 -73284
$$ packed form
112D62915r06708M90898R2313j14672k6012l39353Q07159o95444L21945k66194
122a73153K82741J0184l56273M88811n21516M65795k98193K41499k32007j17964
132b10076N60985m51488J02774l02592O32129j91626m68701L10749R1445K83109
142C56708p68415L58008K47808r9915j62437k14740N96328l82019J13254j68420
152a23840J08938J66897k53654K35814l97519M20174j04466m5416r8657n3875
162a45604M80620m67870J06688j39878M03505j66910l26858L32164o6228J83155
172A92784m58966L23842K4463j03903K2873j06125K84499l25875K05167n2955
182E804p421n951o8701K48562k99359J46007m0134Q1710m6259j24740K10910j73712
$$ plain form
194 -73284 91569 -59681 -6089 3861 -17014 116104 -129095 14754 -15013 122179 -38418
205 -38418 -157198 105294 60047 45641 -218750 65708 143192 -24204 -106383 -79972 213857
216 213857 -30874 -70058 -91164 107344 98623 -116656 -39024 -10991 151567 -45038 -97954
227 -97954 -11056 88166 83561 -153159 -28766 73424 96396 -81516 -116083 99562 64575
238 64575 -10085 -134340 44912 99066 -22211 -69438 -34357 110541 -12192 -40660 -35310
249 -35310 39601 48117 -49769 -10907 -8240 51502 -16366 -25006 8161 -401 24541 -26147 13768
262 13768 -17308 8809 9184 -472 -1064 -29466 24108 18483 -633 -45975 3034 54834 2698
275 2698 -55810 -21750 64109 35130 -66329 -44391 53367 66779 -49597 -76219 34979 83180
$$ packed form
194g3284J64853j51250N3592R950k0875J33118k45199J43849k9767J37192j60597
205c8418j18780K62492m5247j4406k64391K84458P7484j67396q2179K6411K93829
216B13857k44731l9184k1106J98508q721k15279P7632K8033J62558j96605n2916
227i7954Q6898R9222m605k36720J24393J02190K2972j77912l4567K15645l4987
238F4575p4660j24255J79252N4154j21277m7227L5081J44898j22733k8468N350
249c5310P4911Q516r7886L8862K667N9742o7868q640L3167q562K4942n0688L9915
262A3768l1076K6117L75r656n92k8402N3574n625j9116m5342M9009N1800n2136
275B698n8508L4060Q5859k8979j01459K1938R7758J3412j16376k6622J11198M8201
$$ plain form
287 83180 -9479 -100142 -2298 96701 30573 -102216 -47753 96322 64585 -84436 -78545 66032
299 66032 91065 -45557 -98059 20764 103179 3835 -106560 -21646 98734 42683 -91256
310 -91256 -55989 77522 64091 -57449 -71174 36922 76274 -22225 -68259 -3961 72804
321 72804 11227 -61004 -24592 52194 33944 -47953 -27399 28173 32162 -22726 -21238 7493
333 7493 17073 356 -10321 -5809 5334 5485 402 -2644 -2943 -6203 5486 18909 -10236 -27572
347 -27572 7733 40107 -6430 -47809 1619 50735 7793 -48795 -25073 52974 29713 -34517
359 -34517 -57920 35992 68067 -27422 -72754 3032 98490 -11722 -79825 -17817 83970 33147
371 33147 -83670 -32513 49450 70622 -54154 -72582 37812 72250 -2358 -104070 16747
$$ packed form
287H3180r2659r0663R7844R8999o6128j32789N4463J44075l1737j49021N891J44577
299F6032K5033j36622n2502J18823Q2415r9344j10395Q4914J20380n6051j33939
310i1256L5267J33511j3431j21540j3725J08096L9352r8499m6034O4298P6765
321G2804o1577p2231L6412P6786j8250q1897K0554N5572L989n4888J488K8731
333G493R580j6717j0677M512J1143J51n083l046k99l260J1689J3423k9145j7336
347b7572L5305L2374m6537m1379M9428M9116m2942n6588K3722P8047k3261o4230
359c4517k3403R3912L2075r5489m5332P5786R5458j10212o8103O2008J01787n0823
371C3147j16817N1157Q1963K1172j24776j8428J10394L4438p4608j01712J20817
$$ plain form
382 16747 75596 18840 -77863 -39319 86445 23514 -37306 -71922 53034 62866 -34963 -57687
394 -57687 -2749 94971 -25868 -58352 -3287 56122 20501 -73743 20080 8229 29264 -26805
406 -26805 -16694 21710 -14316 40720 -50786 21111 -9316 18607 2055 -34674 36900 -33117
418 -33117 42138 -33404 10928 -2899 -11863 41420 -41674 24656 -43259 51016 8779 -45995
430 -45995 149 1766 87341 -93316 -18932 36582 60045 -34316 -105203 100402 20488 -4947
442 -4947 -90953 37576 75031 -48398 -3987 -59497 91491 -6969 -20687 -34969 -9553 110491
454 110491 -71432 -9470 -53987 107159 16560 -106354 11871 23856 113785 -148853 -6748
465 -6748 62362 47256 -42582 -107249 133551 -20790 137 -68905 45412 47243 -72824 54587
$$ packed form
382A6747N8849n6756r6703L8544J25764o2931o0820l4616J24956R832r7829k2724
394e7687N4938R7720j20839l2484N5065N9409l5621r4244R3823j1851K1035n6069
406b6805J0111L8404l6026N5036r1506P1897l0427K7923j6552l6729P1574p0017
418c3117P5255p5542M4332j3827q964N3283q3094O6330o7915R4275m2237n4774
430d5995M6144J617Q5575j80657P4384N5514K3463r4361p0887K05605p9914k5435
442d947q6006J28529L7455j23429M4411n5510J50988r8460j3718j4282K5416J20044
454A10491j81923O1962m4517J61146r0599j22914J18225J1985Q9929k62638J42105
465f748O9110j5106q9838o4667K40800j54341K0927o9042J14317J831j20067J27411
$$ plain form
477 54587 -61398 58407 -34630 31430 -10970 -63003 98179 -46732 25002 -78729 76722
488 76722 21968 -77475 39992 -27883 83190 -103978 42615 25212 -34486 16045 -41430
499 -41430 110684 -123015 32991 33831 14538 -38701 -78087 167841 -79059 -13528 -53764
510 -53764 104638 17366 -128480 74755 -18133 78850 -112261 37605 24645 -33161 60857
521 60857 -81834 55128 -60749 96738 -28507 -93357 72173 14219 61680 -179472 79559
532 79559 84211 -29978 -73164 -48705 200011 -106295 -38597 -19178 100736 6385 -134856
543 -134856 104373 -39779 61986 -82543 40017 11072 -56731 98747 -86248 46738
553 46738 -74197 108653 -20718 -97390 73818 -2098 64738 -161517 97860 36788 -43723
$$ packed form
477E4587j15985J19805r3037O6060m2400n2033J61182j44911P1734j03731J55451
488G6722n4754r9443J17467o7875J11073j87168J46593j7403n9698N0531n7475
499d1430J52114k33699J56006Q40j9293n3239l9386K45928k46900O5531m0236
510e3764J58402q7272j45846K03235r2888R6983j91111J49866j2960n7806R4018
521F0857j42691J36962j15877J57487j25245o4850J65530n7954M7461k41152K59031
532G9559M652j14189m3186K4459K48716l06306O7698J9419J19914r4351j41241
543a34856K39229j44152J01765j44529J22560k8945o7803J55478j84995J32986
553D6738j20935J82850j29371p6672J71208p5916O6836k26255K59377o1072q0511
$$ plain form
564 -43723 -20711 -17407 122134 -132234 42702 11308 18614 -33043 -45834 133782 -104228
575 -104228 9950 -10695 79200 -35838 -102128 129050 -35626 19857 -96760 85152 26626
586 26626 -78243 51205 -53756 86009 -84296 58613 -20260 -43573 74041 -38185
596 -38185 46204 -131120 121205 21164 -67801 -31713 20701 142586 -168678 12875 28767
607 28767 84263 -70452 -90545 128540 -27738 17361 -94860 76590 15980 -44334 34491
618 34491 -56900 64666 -42480 48301 -44215 -31620 83477 -33977 10008 -85306 102460
629 102460 8576 -67762 2202 10001 91047 -125074 31432 25631 18050 -31491 -42998 101882
641 101882 -78264 29878 -22847 41855 -26067 -38688 84372 -59868 26795 -52453 75450
$$ packed form
564d3723K3012L304J39541k54368J74936l1394P306n1657j2791J79616k38010
575a04228J14178k0645Q9895j15038o6290K31178j64676N5483j16617J81912n8526
586B6626j04869J29448j04961J39765j70305J42909p8873k3313J17614j12226
596c8185Q4389j77324K52325j00041q8965L6088N2414J21885l11264J81553J5892
607B8767N5496j54715k0093K19085j56278M5099j12221J71450o0610o0314P8825
618C4491r1391J21566j07146R0781r2516J2595J15097j17454M3985r5314J87766
629A02460r3884p6338O9964P799Q1046k16121J56506n801p581m9541j1507J44880
641A01882j80146J08142n2725O4702o7922j2621J23060j44240Q6663p9248J27903
$$ plain form
652 75450 -20937 -45083 39742 -18202 48161 -76465 50743 -15301 1276 16418 -31701 28656
664 28656 -41132 64036 -31613 -27449 14744 23094 29456 -95140 37792 40407 8702 -63869
676 -63869 -20903 102614 -36523 -28687 -33028 72029 8190 -58887 13541 -6330 59638 -50733
688 -50733 -2796 -5314 23168 29286 -62895 18047 -6468 59526 -47416 -32690 36330 19299
700 19299 8398 -77849 49496 18727 1510 -42768 -2585 56425 -27334 -8099 -19816 40779
712 40779 -6820 -21339 12130 -6697 15641 -15018 10588 -10098 -2799 19945 -16017 5874
724 5874 -12627 17166 -4360 -4959 6540 -15571 19651 -8569 8253 -18973 4371 20372 -9882
737 -9882 -5879 -19266 35928 -272 -19049 -14770 17691 32213 -35003 -14963 8121 41622 -19968
$$ packed form
652G5450r6387k4146Q4825n7944O6363j24626J27208o6044J6577J5142m8119O0357
664B8656o9788J05168r5649M164M2193Q350O362j24596J32932K615l1705p2571
676f3869M2966J23517j39137P836m341J05057o3839o7077P2428j9871O5968j10371
688e0733M7937k518K8482O118r2181Q0942k4515O5994j06942J4726O9020j7031
700A9299j0901q6247J27345l0769j7217m4278M0183N9010q3759J9235j1717O0595
712D0779m7599j4519L3469j8827K2338l0659K5606k0686P299K2744l5962K1891
724E874j8501K9793k1526n99J1499k2111L5222k8220J6822k7226K3344J6001l0254
737i882M003j3387N5194l6200j8777M279L2461J4522o7216K0040K3084L3501o1590
$$ plain form
750 -19968 -37334 15760 30343 3837 -45147 4683 27440 15471 -29462 -23989 27999 27687 -18326
763 -18326 -38752 17136 40550 -12432 -37988 2335 38348 4542 -35733 -9613 26928 22086
775 22086 -27846 -22264 19030 26972 -13175 -29741 10264 25835 -2114 -25820 -771 21351
787 21351 4043 -15856 -7642 11405 9310 -6752 -10502 3657 10186 -1803 -9006 2499 4752
800 4752 -2924 614 1547 -1807 -6676 10414 1990 -6955 -6933 7555 10575 -8712 -8351 -1847 19844
815 19844 -1477 -16923 -7181 20959 12218 -23845 -13123 18242 21791 -18665 -23822 13954 25588
828 25588 -5932 -30295 1411 29809 5984 -28349 -15834 31101 17486 -24603 -25020 22364
840 22364 27442 -17402 -27134 7853 30414 -2415 -29076 -5164 27710 12352 -27278 -15595
$$ packed form
750a9968j7366N3094J4583k6506m8984M9830K2757j1969m4933N473N1988l12m6013
763a8326k0426N5888K3414n2982k5556M0323L6013l3806m0275K6120L6541m842
775B2086m9932N582M1294P942m0147j6566M0005J5571k7949k3706K5049K2122
787B1351j7308j9899Q214J9047k095j6062l750J4159O529j1989p203J1505K253
800D752p676L538R33l354m869J7090q424q945K2J4488L020j9287L61O504K1691
815A9844k1321j5446R742K8140q741l6063J0722L1365L549m0456n157L7776J1634
828B5588l1520k4363L1706K8398k3825l4333J2515M6935j3615m2089m17M7384
840B2364N078m4844r732L4987K2561l2829k6661K3912L2874j5358l9630J1683
$$ plain form
852 -15595 23343 18449 -17892 -21994 15153 19738 -6946 -21446 3177 19235 1660 -17111 -5213
865 -5213 14289 7813 -11864 -8335 8890 6920 -3884 -8777 5745 1429 1200 -2891 -57 -5 -1338
880 -1338 5756 -3289 -1218 -3537 4902 5545 -6667 -4000 -1195 14971 -3902 -13488 451 12512
894 12512 10284 -24732 -1414 12358 16033 -18032 -19220 20859 13247 -4457 -31621 14976 22874
907 22874 -5120 -22678 -7142 34577 -3214 -16602 -15036 20765 19582 -23418 -10033 -545 33912
920 33912 -12330 -23214 1496 20570 16206 -39608 1891 15893 19861 -24062 -21648 30322 5026
933 5026 -3700 -28973 20556 14010 -13183 -3213 -9726 26470 -16163 4897 -8237 1949 13222
946 13222 -14026 11175 -21710 24302 -6420 -4225 -2011 -2369 21027 -26397 14948 -7726 8255
$$ packed form
852a5595L8938m894l6341m102L7147M585k6684j4500K4623J6058j7575j8771J1898
865e213J9502o476j9677L529J7225j970j0804m893J4522m316k29m091K834N2j333
880a338P094r045K071k319Q439O43j2212K667K805J6166j8873r586J3939J2061
894A2512k228l5016K3318J3772L675l4065j188M0079p612j7704k7164M6597P898
907B2874k7994j7558J5536M1719l7791j3388J566L5801j183m3000J3385R488L4457
920C3912m6242j0884K4710J9074m364n5814M1499J4002L968m3923K414N1970k5296
933E026q726k5273M9529o546k7193R970o513L6196m2633K1060j3134J0186J1273
946A3222k7248K5201l2885M6012l0722K195K214l58K3396m7424M1345k2674J5981
$$ plain form
959 8255 -5335 -4751 18661 -25669 15805 -5296 14660 -19361 -9169 33661 -14615 -2833 -24626
972 -24626 41749 -2980 -28234 5170 7935 27135 -43738 11823 5572 9630 -3104 -24634 25732
985 25732 -14634 25153 -25020 -4537 13567 3974 12825 -50684 34498 8245 5702 -36081 -1994
998 -1994 53363 -29347 -8968 -21230 52993 -11203 -34076 14493 6800 22917 -46210 22901
1010 22901 1297 -669 3701 -16154 21465 -27230 33521 -17209 -8672 6674 3768 19648 -48002
1023 -48002 31287 -53 6079 -21154 -2887 38588 -36652 13500 -12297 27194 -21091 -11294
1035 -11294 34937 -26199 10413 -23320 43801 -22762 -21591 25622 107 12077 -51840 45468
1047 45468 -189 -10435 -10613 917 33800 -40342 22516 -14486 11048 -716 -5087 13539
$$ packed form
959H255j3590N84K3412m4330M1474k1101J9956l4021J0192M2830m8276J1782k1793
972b4626O6375m4729k5254L3404K765J9200p0873N5561o251M058j2734k1530N0366
985B5732m0366L9787n0173K0483J8104r593Q851o3509Q5182k6253k543m1783L4087
998a994N5357q2710K0379j2262P4223o4196k2873M8569p693J6117o9127O9111
1010B2901k1604j966M370j9855L7619m8695O0751n0730Q537J5346k906J5880o7650
1023d8002P9289l1340O132k7233J8267M1475p5240N0152k5797L9491m8285R797
1035a1294M6231o1136L6612l3733O7121o6563J171M7213k5515J1970o3917R7308
1047D5468m5657j0246j78J1530L2883p4142O2858l7002K5534j1764m371J8626
$$ plain form
1059 13539 -35491 38854 -8745 -2555 -21780 14091 38372 -48976 4140 740 44047 -37064
1071 -37064 -26271 40052 677 2084 -47604 45398 936 -13761 -3670 -5314 31851 -36047
1083 -36047 25764 -18219 5248 6193 -3766 11664 -40388 44695 -10127 -4622 -19188 17304 28185
1096 28185 -47106 16464 -1752 25865 -30844 -4600 29022 -17310 6219 -19836 32758 -18419
1108 -18419 -9541 19076 -7417 6532 -28749 38072 -11492 -13146 3843 4944 18940 -40650
1120 -40650 26036 -4718 6882 -10817 -3960 20947 -26894 26140 -17283 6020 -8881 11929
1132 11929 12826 -39266 23922 961 16293 -36842 4698 32837 -15173 -7435 -21280 45568
1144 45568 -13270 -17197 -1194 13213 16350 -34165 14505 -2703 11611 -6327 -9932 10575
$$ packed form
1059A3539m9030P4345m7599O190j9225L5871K4281q7348N3116l400M3307q1111
1071c7064J0793O6323l9375J407m9688R3002m4462j4697J0091j644L7165o7898
1083c6047O1811m3983K3467R45r959J5430n2052Q5083n4822N505j4566L6492J0881
1096B8185p5291O3570j8216K7617n6709K6244L3622m6332K3529k6055N2594n1177
1108a8419Q878K8617k6493J3949l5281O6821m9564j654J6989J101J3996n9590
1120d0650O6686l0754J1600j7699O857K4907m7841N3034m3423K3303j4901K0810
1132A1929Q97n2092O3188k2961J5332n3135M1540K8139m8010P738j3845O6848
1144D5568n8838l927J6003J4407L137n0515M8670j7208J4314j7938l605K0507
$$ plain form
1156 10575 -10197 22600 -19529 -2289 3674 10255 4869 -33293 23465 3328 5650 -25465 5446
1169 5446 26058 -19936 1199 -11079 26602 -14610 -5402 7209 -3721 10549 -18692 18007
1181 18007 -11091 3247 740 -736 6027 -17454 19239 -8162 3082 -8209 5309 7419 -12613
1194 -12613 9206 -8880 8951 -4549 2575 -1274 -8019 13586 -3837 -1204 -10500 10748 10871
1207 10871 -17050 -1708 3142 18039 -15912 -9651 11012 6572 1413 -21700 12353 5870 3533
1220 3533 -13703 -4224 17002 -3070 -1661 -14034 12687 6070 -4069 -8953 -2925 19280 -6034
1233 -6034 -8233 -6374 15822 3925 -14553 -2020 6448 11477 -12904 -5039 5532 8131 -3973
1246 -3973 -9288 4781 4879 455 -5905 -1638 5657 1010 -2413 -3565 2638 3437 -3273 415 -2238
$$ packed form
1156A0575k0772L2797m2129J7240N963O581n386l8162N6758k0137K322l1115L0911
1169E446K0612m5994K1135j2278L7681m1212R208J2611j0930J4270k9241L6699
1181A8007k9098J4338k507j476O763k3481L6693k7401J1244j1291J3518K110k0032
1194a2613K1819j8086J7831j3500P124l849o745K1605j7423K633r296K1248J23
1207A0871k7921J5342M850J4897l3951O261K0663m440n159k3113L4053o483k337
1220C533j7236R479K1226k0072J409j2373K6721o617j0139m884O028K2205k5314
1233f034k199J859K2196j1897j8478J2533Q468N029k4381P865J0571K599j2104
1246c973n315J4069R8m424o360M267P295m647l423j152O203P99o710L688k653
$$ plain form
1261 -2238 3734 -1676 774 -973 -746 1653 -1239 3248 -4085 -91 1146 4109 -3254 -4806 3928
1276 3928 4111 -931 -7435 1773 6504 1329 -8167 -2864 8865 3724 -7399 -6857 8198 6388 -4378
1291 -4378 -10166 4324 10036 -1421 -10961 -1619 13083 825 -9019 -6637 11517 5438 -7645
1304 -7645 -8462 5898 10679 -5830 -8832 1081 11184 -676 -9493 -2088 8634 4607 -8331 -5675
1318 -5675 7293 5863 -4794 -7441 4584 5875 -1871 -5533 -680 6565 -21 -3741 -2753 4526
1332 4526 2202 -3712 -828 784 2503 -1867 -151 76 -497 1355 -899 1591 -2999 987 1060 1422
1348 1422 -2039 -2813 3527 1786 -594 -5674 2279 5063 -235 -6785 -533 7495 1318 -7204 -2761
1363 -2761 6532 4489 -5644 -6210 4561 7554 -2545 -9792 2218 9571 -15 -10113 -1504 9644
$$ packed form
1261b238N972n410K450j747K27K399k892M487p333L994J237K963p363j552Q734
1276C928J83n042o504R208M731n175r496N303J1729n141j1123N42J5055j810j0766
1291d378n788J4490N712j1457r540R342J4702j2258r844K382J8154o079j3083
1304g645q17J4360M781j6509l002R913J0103j1860q817P405J0722m027j2938K656
1318e675J2968j430j0657k647J2025J291p746l662M853P245o586l720R88P279
1332D526k324n914K884J612J719m370J716K27n73J852k254K490m590L986P3L62
1348A422l461p74O340j741k380n080P953K784n298o550O252Q028o177q522M443
1363b761R293k043j0133n66J0771K993j0099p247J2010P353r586j0098Q609J1148
$$ plain form
1377 9644 3025 -8310 -4984 6661 7317 -6103 -7457 3246 9283 -1887 -9916 1104 8162 2467
1391 2467 -9594 -2126 7433 3449 -5458 -5601 5607 4337 -2524 -5248 627 6923 -2288 -3171 -1873
1406 -1873 5326 413 -3913 926 -711 3784 -3244 1139 -1878 1360 2064 -3186 1786 -2209 3130
1421 3130 -2027 813 548 -3446 3994 -1167 2081 -6128 2662 5111 -3459 -1977 -3667 10909 -3920
1436 -3920 -4027 -2104 5893 5347 -11161 1184 1885 8182 -7616 -5518 6858 1714 1992 -10587 4935
1451 4935 2966 1820 -3176 -7966 10196 178 1098 -11914 5529 10208 -6587 -4784 -3784 16537
1465 16537 -6904 -6716 368 6665 4806 -14148 5957 206 5781 -6429 -3244 7434 -4831
1478 -4831 6433 -9209 5890 -2680 2677 2045 -9361 8338 -3772 7161 -11145 3739 6164
$$ packed form
1377I644o619j1335L326J1645O56j3420j354J0703O037j1170q029J1020P058n695
1391B467j2061P468R559l984q907j43J1208j270o861k724N875O296r211q83J298
1406a873P199m913m326M839j637M495p028M383l017L238P04n250M972l995N339
1421C130n157K840k65l994P440n161L248q209Q790K449q570J482j690J4576j4829
1436c920j07J923P997n46j6508J2345P01O297j5798K098J2376n144K78j2579J5522
1451D935j969j146m996m790J8162j0018R20j3012J7443M679j6795J803J000K0321
1465A6537k3441J88P084O297j859j8954K0105n751N575j2210L185J0678j2265
1478d831J1264j5642J5099q570N357o32j1406J7699j2110J0933j8306J4884K425
$$ plain form
1491 6164 -5516 1649 -5805 11928 -9534 1255 3259 -1926 1384 -7304 13651 -9463 -743
1504 -743 1522 4299 1092 -14222 13521 -2065 2141 -10067 4097 9988 -10555 3400 -6410
1517 -6410 12192 -6785 -1194 2582 -5159 10102 -8506 5787 -10264 8967 5345 -11440 1481
1530 1481 -1563 17581 -18109 -1716 7006 6273 -3620 -16320 18511 -2373 -109 -10275 6450
1543 6450 8429 -11587 5846 -6641 9532 -6102 1436 1777 -7699 11104 -6963 5306 -10607
1556 -10607 8152 5579 -10939 3183 -2899 14268 -15474 1498 6294 -896 -338 -9700 16295
1569 16295 -10166 1160 -211 3231 909 -11709 15449 -7341 1616 -6834 8564 3508 -13648
1582 -13648 8898 -3003 8440 -12471 4366 4599 -5099 4594 -7605 9147 -8154 5965 173
$$ packed form
1491F164j1680P165p454J7733k1462J0789K004n185L310q688K0955k3114Q720
1504g43K265K777l207j5314K7743j5586M206j2208J4164N891k0543J3955r810
1517f410J8602j8977N591L776p741J5261j8608J4293j6051J9231l622j6785J2921
1530A481l044J9144l5690J6393Q722p33r893j2700L4831k0884K264j0166J6725
1543F450J979k0016J7433j2487J6173j5634P538L41r476J8803j8067J2269j5913
1556a0607J8759k573j6518J4122o082J7167k9742J6972M796p190N58r362K5995
1569A6295k6461J1326j371L442k322j2618K7158k2790Q957q450J5398n056j7156
1582a3648K2546j1901J1443k0911J6837K33r698R693j2199J6752j7301J4119n792
$$ plain form
1595 173 -6598 4985 -2207 9685 -15646 4562 7499 -1208 -5489 -7852 19945 -8753 -3796 -3851
1609 -3851 10191 3377 -15157 8256 -1735 7989 -10605 1816 4593 -4563 6647 -8948 6521
1622 6521 -5888 7474 -1201 -8602 7208 -1129 6677 -14523 6673 5389 -2785 -3357 -4247 14016
1636 14016 -9102 -563 -353 4661 -185 -8061 9403 -4894 2197 -3422 3728 1029 -7550 8054
1650 8054 -3819 3748 -7403 4849 3324 -6239 3300 -3838 7945 -7768 3376 -3 -2272
1663 -2272 4066 -3877 4707 -8242 7108 825 -3690 -1243 -229 9782 -9955 -204 1282 6469
1677 6469 -3152 -8552 8131 570 1350 -8223 3696 4570 -2747 -600 -4082 6684 -1497 -596 -2202
1692 -2202 -603 6044 -3622 -106 -4230 6492 1453 -6173 222 1517 6636 -8764 595 2429
$$ packed form
1595A73o771J1583p192J1892k5331K0208K937q707m281k363K7797k8698M957n5
1609c851J4042o814j8534K3413r991R724j8594J2421K777r156J1210j5595J5469
1622F521j2409J3362q675p401J5810q337P806k1200K1196j284q174n72q90J8263
1636A4016k3118Q539K10N014m846p876J7464j4297P091n619P150k699q579J5604
1650H054j1873P567j1151J2252j525r563R539p138J1783j5713J1144l379k269
1663b272O338p943Q584j2949J5350o283m515K447J014J0011j9737R751J486N187
1677F469r621n400J6683p561P80r573J1919Q74p317K147l482J0766q181R01j606
1692b202J599O647r666L516m124J0722n039p626O395J295N119j5400R359J834
$$ plain form
1706 2429 2673 -2004 -5001 5871 -1397 1685 -4524 2323 1728 -2019 1393 -2786 3335 -2280 1790
1721 1790 -991 -1186 2207 -1469 1852 -2889 1889 -196 -35 345 -1524 1675 -1245 1625 -843 -1406
1737 -1406 1064 964 785 -3945 1384 2930 -836 -2495 -1238 5001 -1189 -1764 -2240 3308 2488 -3685
1753 -3685 -1418 746 4956 -3296 -2467 525 3695 315 -4513 197 2555 2581 -3964 -2054 2811 2840
1769 2840 -1840 -3986 1988 3386 -481 -4161 369 3717 267 -3242 -814 2663 1233 -1721 -2178
1784 -2178 1660 1873 -451 -2959 1014 2030 -185 -1998 6 1725 -238 -429 -898 975 146 9
1800 9 -719 328 141 44 22 76 -470 5 710 123 -651 -963 1583 390 -667 -1735 1434 1491 -1036 -1474
1820 -1474 -27 2573 -437 -1657 -1203 2416 1705 -2945 -1314 1661 3026 -2702 -2065 1314 2614 -381
$$ packed form
1706B429K44m677k997J0872p268L082o209O847n95l747L412m179O121n615M070
1721A790k781j95L393l676L321m741M778k085J61L80j869L199k920K870k468n63
1737a406K470j00j79m730N329J546l766j659J257O239o190n75m76N548q20o173
1753c685K267K164M210q252Q29K992L170l380m828M710K358K6o545J910M865K9
1769B840m680k146N974J398l867l680M530L348l450l509K428L477j430k954m57
1784b178L838K13k324k508L973J016k215j813K004J719j963j91m69J873q29j37
1800Ip28J047j87r7k2N4n46M75P05n87p74l12K546j193j057j068L169N7k527m38
1820a474J447K600l010j220M54L619p11m650J631K975J365n728O37L379J300k995
$$ plain form
1836 -381 -3525 716 2355 1394 -3627 -1012 2833 1738 -2386 -2454 2344 2366 -1357 -2804 881 2918
1852 2918 -323 -2746 -211 2256 1164 -2564 -933 1432 1986 -1670 -1794 1285 1443 -352 -1891 681
1868 681 940 315 -982 -582 948 447 -429 -757 596 358 -382 72 -78 -6 -171 577 -168 -450 -238
1887 -238 867 218 -754 -759 851 1046 -957 -997 177 2082 -796 -1378 -483 2302 472 -2386 -473 1680
1905 1680 1744 -2399 -1215 1365 1832 -763 -2642 956 2010 257 -2581 -714 2921 283 -1401 -2168
1921 -2168 2367 1604 -1414 -1871 288 3367 -1514 -1802 -326 2706 397 -2935 334 1093 1652 -2413
1937 -2413 -683 1611 259 132 -2242 1805 -281 579 -818 -805 1572 -824 1153 -2205 1410 178
1953 178 -220 -14 -1125 2120 -1547 753 -532 339 278 -1293 2265 -1971 594 -594 1600 -274
$$ packed form
1836c81l144M241J639r61n021K615L845j095m124o8M798K2l723j447L685K037
1852B918l241k423K535K467j092l728J631K365N54l656j24L079J58j795j539K572
1868F81K59o25j297M00J530n01q76l28J353k38p40M54j50P2j65P48p45k82K12
1887b38J105o49r72nJ610J95k003m0J174J905k878n82Q95K785j830k858J913K153
1905A680O4m143J184K580M67k595j879L598J054j753k838J867L635k638j684p67
1921b168M535p63l018m57K159L079m881k88J476L032k309l332L269P59N59m065
1937b413J730K294j352j27k374M047k086Q60j397J3K377k396J977l358L615j232
1953A78l98K06j111L245l667K300j285Q71o1j571L558m236K565j188K194j874
$$ plain form
1969 -274 -2647 2514 -289 1129 -3452 1663 1858 -1316 -567 -1476 3884 -1868 -444 -558 792 1745
1985 1745 -2662 1259 -1693 2670 -486 -1694 282 -139 3697 -4353 227 649 2605 -1455 -3953
2000 -3953 4197 -33 580 -4172 2440 2278 -2391 136 -1603 3944 -2586 338 -106 -385 2009 -2472
2016 -2472 2301 -3046 2647 -63 -1113 132 -1042 4004 -3992 882 -79 1653 -803 -2685 3868
2031 3868 -1952 831 -1834 2124 47 -2763 3124 -1532 1370 -3096 2800 710 -2793 1295 -807
2046 -807 3518 -4393 1310 810 116 70 -2595 3718 -2575 1730 -1267 60 779 -1267 2992 -4166
2062 -4166 2054 73 1379 -1989 -2144 5111 -2133 -233 -2853 4367 239 -3704 1311 161 2873
2077 2873 -4324 1234 1037 -220 412 -2332 2919 -2179 1736 -779 -841 1092 -962 2789 -4090 1840
$$ packed form
1969b74k373N161k803J418m581N115J95l174P49r09N360n752J424j14J350R53
1985A745m407L921k952M363l156j208J976m21L836q050M580M22J956m060k498
2000c953Q150m230O13m752O612j62m669K527j739N547o530K924m44k79K394m481
2016b472M773n347N693k710j050J245j174N046p996M874r61J732k456j882O553
2031C868n820K783k665L958k077k810N887m656K902m466N896k090l503M088k102
2046h07M325p911N703n00o94m6k665O313o293M305k997J327P19k046M259p158
2062d166O220j981J306l368j55P255p244J900k620P220m128l943N015j150K712
2077B873p197N558j97j257O32k744N251n098L915k515o2J933k054L751o879N930
$$ plain form
2093 1840 533 654 -1365 -1838 4478 -2554 289 -1624 2792 -256 -2749 2578 -1152 1566 -2882
2108 -2882 2416 70 -1932 1629 -879 2097 -3587 2349 333 -836 -53 -979 3075 -2902 1144
2123 1144 -591 821 82 -1456 2117 -2191 1612 -532 317 -699 -818 3228 -2586 129 -683 2699
2139 2699 -823 -2959 2543 58 1153 -3712 2041 1246 -1016 -337 -1152 2929 -1993 751 -923 334
2155 334 1056 -1210 1009 -2061 2311 -456 -466 -547 26 2394 -2501 314 -302 1966 -1094 -1648 1865
2172 1865 -182 396 -1869 1463 310 -932 503 -637 1201 -1350 866 -52 -602 613 -623 1341
2188 1341 -1709 970 -101 29 -19 -744 1330 -1189 925 -744 310 41 -211 790 -1291 742
2204 742 -151 724 -862 -641 1473 -273 -225 -1242 1570 294 -991 -226 261 1248 -1205 -196 94
$$ packed form
2093A840j307J21k019m73O316p032K843j913M416l048k493N327l730K718m448
2108b882N298k346k002L561k508K976n684N936k016j169P83r26M054n977M046
2123A144j735J412p39j538L573m308L803k144Q49j016j19M046n814K715q12L382
2139B699l522k136N502k485J095m865N753p95k262O79q15M081m922K744j674J257
2155C34P22k266K219l070M372k767j0q1N73K368m895K815o16K268l060n54L513
2172A865k047N78k265L332j153j242J435j140J838k551K216r18n50J215j236J964
2188A341l050K679j071J30m8p25K074k519K114j669J054k69k52J001k081K033
2204G42q93Q75j586K21K114j746M8j017K812j276j285P65M87R87k453J009K90
$$ plain form
2221 94 806 32 -1086 395 222 665 -798 -546 751 296 158 -1425 764 635 -59 -801 -314 1405
2239 1405 -401 -265 -809 1033 261 -709 -241 207 762 -728 -87 26 363 35 -450 108 64 334 -342
2258 -342 -162 218 40 53 -259 164 -31 58 -16 -66 21 -77 102 109 -240 -49 110 311 -319 -208 218 217 28
2281 28 -523 246 278 214 -666 -48 480 178 -435 -393 461 366 -229 -615 292 581 -35 -803 85 571 175 -631
2303 -631 -249 570 304 -345 -606 509 451 -232 -571 118 634 -161 -344 -240 584 150 -460 -235 234 500
2323 500 -502 -120 54 454 -115 -334 52 208 138 -360 29 136 92 -88 -71 60 82 -62 6 -121 163
2344 163 -148 139 -48 -84 -30 86 206 -351 46 10 270 -192 -206 91 196 117 -457 49 298 113 -345 -249
2366 -249 435 124 -181 -440 271 378 -162 -422 -14 545 -82 -349 -205 498 203 -335 -339 391 341 -280 -406
$$ packed form
2221I4P12p74j118J481j73M43j463K52J297m55j38j583K189j29o94p42M87J719
2239A405j806J36n44J842p72r70M68M48N55j490O41J13L37l28m85N58m4K70o76
2258c42J80L80j78J3l12M23j95Q9p4n0Q7r8J79Pl49J91J59K01o30J11M26jj89
2281B8n51P69L2o4q80O18N28l02o13M2Q54r5n95l86R07K89o16p68Q88M86l96q06
2303f31L82Q19k66o49k61J115n8o83l39O89N16p95j83J04Q24m34o10K25M69K66
2323E00j002L82J74M00n69k19L86J56p0m98L89J07m4j80J7J31K2j44O8j27K84
2344A63l11K87j87l6N4J16J20n57L97l6K60m62j4K97J05p9n74N06K49j85m58R6
2366b49O84l11l05k59P11J07n40k60M08N59o27k67J44P03k95n38mP30n0o21j26
$$ plain form
2387 -406 180 389 -85 -357 -59 427 59 -310 -235 368 164 -233 -242 224 188 -97 -227 57 200 -11 -151
2408 -151 -54 201 11 -21 -135 101 45 -46 -31 -15 86 -74 58 30 -59 79 -59 124 -177 68 -8 109 -22
2431 -22 -212 190 23 161 -404 125 198 -3 -189 -156 362 -85 -127 -179 158 216 -226 -60 -47 378 -83 -270
2453 -270 43 113 309 -455 28 56 306 -176 -374 302 81 115 -551 168 314 -62 -168 -212 534 -167 -76 -41
2475 -41 81 232 -311 213 -278 329 -94 -71 -11 -77 382 -368 139 -108 214 -48 -268 281 -123 184 -267
2496 -267 199 63 -221 212 -193 299 -414 229 83 -147 7 -163 487 -414 72 5 192 -40 -336 375
2516 375 -186 183 -215 50 121 -171 282 -360 235 -84 156 -110 -254 442 -136 98 -439 363 129 -294
2536 -294 -16 -31 464 -445 -32 101 117 28 -332 367 -205 111 -140 0 110 -191 329 -354 172 -74 153
$$ packed form
2387d06N86K09m74k72K98M86l68l69P5O03k04l97rM66l6k85j30K84J43k11j40
2408a51R7K55j90l2j14K36n6r1J5J6J01j60J32k8q9J38j38J83l01K45p6J17j31
2431b2j90M02j67J38n65N29P3k01j86L3N18m47m2n2L37N8m42J66J3M25m61j87
2453b70L13P0J96p64M83K8K50m82j98O76k21L4o66P19J46l76j06m4P46p01R1L5
2475d1J22J51n43N24m91O07m23K3O0o6M59p50N07k47L22k62k20N49m04L07m51
2496b67M66j36k84M33m05M92p13O43j46k30J54j70O50r01M86o7J87k32k96P11
2516C75n61L69l98K65P1k92M53o42N95l19K40k66j44O96n78K34n37Q02k34m23
2536b94K78j5M95r09M13J33J6q9l60O99n72L16k51J40J10l01N20o83N26k46K27
$$ plain form
2557 153 -95 -265 358 -162 95 -273 273 82 -247 123 -85 271 -312 146 79 -130 58 -147 387 -401
2577 -401 149 8 42 -55 -238 461 -267 95 -166 178 53 -255 256 -254 196 -175 104 -35 -180 303 -248
2598 -248 161 -261 335 -46 -273 165 1 232 -471 169 133 28 -112 -135 355 -216 5 -98 127 77 -191
2619 -191 176 -170 186 -74 62 -70 -51 248 -186 65 -111 248 -51 -151 129 -23 118 -205 124 40 -51
2640 -51 -1 -39 167 -155 53 -1 -7 11 -51 151 -108 63 -15 53 6 -98 112 -42 31 -52 52 23 -44 71 -58
2665 -58 3 -21 40 -7 -75 97 -35 50 -116 84 39 -31 -21 -33 118 -120 -10 -14 61 0 -74 54 -53 39 -42 -2
2691 -2 22 -17 38 -72 68 3 47 -45 -27 52 -15 -6 -58 52 -6 -39 -9 -11 45 -39 -15 15 -21 27 -10 28 -27 13 -9 10
2721 10 1 -2 47 -63 6 -11 -9 3 -20 4 -25 6 12 -9 6 -23 11 -24 23 15 -3 -23 -12 -6 36 25 -11 24 -4 12 -32 -11 2
$$ packed form
2557A53k48j70O23n20K57l68N46j91l29L70k08L56n83M58o7k09J88k05N34p88
2577d01N50j41L4r7j83O99p28L62k61L44j25l08N11n10M50l71K79j39j45M83n51
2598b48M09m22N96l81k27M38j64K31p03O40l6j05j40k3M90n71K21j03K25n0k68
2619a91L67l46L56k60J36j32J9K99m34K51j76L59k99j00K80j52J41l23L29q4r1
2640e1N0l8K06l22K08n4oJ8o2K02k59J71p8O8m7j04K10j54P3q3J04k9o7J15j29
2665e8O1k4O1m7o8J72j32Q5j66K00m5p0J0j2J51k38J10mP5o1p4J28j07R2q1M0
2691bK4l9N5j10J40o5M4r2J8P9o7Rn2J10n8l3L0kN6q4K4L0l6M8l7L8n5M0k2J9
2721A0rlM9j10O9j7KJ2k3K4k9L1Ok1J5k9L4l5M7qj8k0J1OM2j1l6L5k8J6m4K1J3
$$ plain form
2754 2 1 0 -3 5 35 8 0 -20 -22 24 7 -17 -7 15 -13 -15 0 16 0 4 -33 2 -20 -5 -2 -14 6 -11 -18 0 -4 11 1 4 9 -4 -16
2791 -16 -11 6 -42 9 -27 18 -31 -2 4 -2 -2 -15 17 -19 21 -11 -30 -3 -17 1 -9 5 -4 -13 16 -40 33 -21 19 -17 7 10 -14 0
2825 0 -4 48 10 6 -12 6 19 -11 -24 12 1 15 -61 21 -50 29 -17 -3 31 6 8 -75 9 -14 -7 -53 -27 3 -17 -8 -24 17 -16
2858 -16 6 6 -38 47 -40 2 -12 9 28 -62 26 -5 51 -27 16 -4 2 27 -11 21 -12 1 -24 -29 39 -36 37 -11 17 1 -17 37
2890 37 -38 -15 -20 55 -40 5 0 -9 27 -10 6 23 60 10 -33 24 3 16 -56 13 38 -4 31 -16 54 -14 -15 -19 13 -5 -8 -6 28 63
2924 63 -36 -36 -19 43 11 -32 3 12 -9 -4 -19 36 6 47 -64 22 -6 -13 -18 -11 22 -43 18 -26 35 -11 3 -15 7 1 2 -14 -3 14
2958 14 2 -40 -1 -16 26 -22 14 -7 -32 13 -27 6 -36 48 -25 24 -32 18 -5 -25 -10 -27 43 -1 -32 10 -11 31 -53 18
2988 18 -6 18 40 -38 15 -36 67 -35 6 17 18 11 -83 84 4 -14 -41 16 55 -57 27 -10 33 3 -14 16 -51 64 -66
$$ packed form
2754BjjlQL0k7qk0kM6j7k4J0K2k8kJ5J6j6Ml7L5k2J5Lj2K0j7pJ8mJ5j0LNj3j2
2791a6NJ7m8N1l6M5m9K9Oo%j3L2l6M0l2j9K7j4J8j0J4rrK9n6P3n4M0l6K4Lk4J4
2825@mN2l8mj8J8J3l0j3L6j1J4p6Q2p1P9m6J4L4k5Kq3Q4k3Pm6K6L0k0Rj6M1l3
2858a6K2%m4Q5q7M2j4K1J9r0Q8l1N6p8M3k0OK5l8L2l3J3k5nO8p5P3m8K8j6j8N4
2890C7p5K3nP5r5M5nrL6l7J6J7L7n0m3N7k1J3p2O9K5m2L5m7P0o8jmL2j8lKL4L5
2924F3r9%J7O2l2m3L5Rk1Nj5N5l0M1j11Q6k8pnPL3o5O1m4O1m6J4j8K2oJj6J1J7
2958A4j2m2L9j5M2m8L6k1k5M5m0L3m2Q4p3M9n6N0k3k0J5j7P0m4l1M2k1M2q4P1
2988A8k4K4K2p8N3n1J03j02M1J1Jpr4J67q0j8k7N7L9j12Q4l7M3l0j7L0o7J15j30
$$ plain form
3017 -66 43 -48 24 39 -41 19 -26 89 -84 25 -4 13 -4 -43 73 -33 5 1 3 35 -39 65 -41 32 -55 12 25
3044 25 -85 51 -39 43 -71 28 9 21 -5 -34 54 -43 34 7 -18 32 -26 83 -50 37 13 -18 11 -90 82 -76
3070 -76 42 -56 68 -16 -54 43 -28 72 -59 53 11 -6 11 -48 49 -25 56 -4 -42 34 -53 102 -123 65 1 9 -2
3097 -2 -59 113 -68 41 -36 75 -10 -32 39 -46 17 -28 7 20 -62 104 -66 59 -98 83 -16 -60 18 -21 59 -118
3123 -118 82 -29 9 1 -12 33 -96 48 4 -33 -20 -16 94 -87 18 -43 57 -6 -67 81 -47 57 -105 90
3147 90 -19 -16 3 0 43 -64 43 -11 -47 26 -18 37 -86 73 2 -31 24 -10 109 -108 61 -65 79 -41 -8 42
3173 42 -33 31 -32 65 -29 -23 -1 -4 11 6 30 -25 -41 25 -64 79 -83 62 -11 14 -22 2 24 -58 44 -3 27 -22 19 13
3203 13 -36 31 26 3 -23 -37 27 -56 31 -42 35 -18 -16 16 -11 39 -44 51 -53 47 -42 28 -37 8 -9 2 -2 3 -19 -24 -5 48
$$ packed form
3017f6J09r1P2J5q0O0m5J15j73J09k9J7j7l9J16j06L8mKL2p4J04j06P3q7O7J3
3044B5j10J36r0Q2j14R9j9J2k6k9Q8r7P7k7k5N0n8J09j33Q7k4l1K9j01J72j58
3070g6J18r8J24q4l8R7p1J00j31J12m2j7J7n9R7p4Q1o0l8P6q7J55k25J88o4Qj1
3097bn7J72j81J09p7J11q5k2P1q5O3m5L5J3q2J66j70J25j57J81r9m4P8l9Q0j77
3123a18K00j11L8qj3M5j29J44m4l7J3MJ10j81J05o1J00o3o1J48j28J04j62J95
3147I0j09LJ9lM3j07J07n4l6P3m4N5j23J59p1l3N5l4J19k17J69j26J44j20L3N0
3173D2p5O4o3R7r4OK2lJ5nK4n5j6O6q9J43j62J45p3K5l6K4K2q2J02m7L0m9M1o
3203A3m9O7nk3k6j4O4q3Q7p3P7n3KL2k7N0q3R5j04J00q9P0o5M5j7J1mNk2nJ9N3
$$ plain form
3235 48 15 -14 9 20 22 -29 11 -40 35 -46 41 -54 20 -27 19 -35 38 4 8 -4 -2 17 1 0 -36 42 -6 22 -18 28 -28 37
3267 37 -44 44 -44 39 -39 19 -6 -23 41 -56 11 -35 62 -46 61 -22 24 -6 -19 -9 -7 10 -10 -2 -12 -28 53 5 16 7 -1
3298 -1 33 -20 33 -62 69 -52 54 -28 18 -4 -4 17 17 10 5 -2 12 -19 10 -26 0 17 -81 67 -45 75 -90 50 -37
3327 -37 11 -6 -41 58 -59 41 -52 56 -16 -17 46 -33 4 2 1 -4 -34 53 -65 58 -65 39 -30 20 12 -48 57 -72
3355 -72 67 -17 25 -36 1 -9 -14 14 16 -21 58 -54 31 -65 46 -24 11 18 -31 66 -68 81 -88 72 -38 27 -7 6
3383 6 16 -4 9 -33 -12 23 -38 32 -4 8 -20 -11 34 -52 37 -86 43 -24 24 -40 31 -7 -3 -3 -19 -18 19 -24 8 -39 28 -3
3415 -3 8 42 -43 56 -59 51 -54 58 -63 15 18 -14 -44 -4 26 -30 23 -3 -3 -9 15 -5 35 -53 37 -40 66 -47 19
3444 19 -11 13 -3 -29 17 8 20 -38 -18 50 -10 -6 -9 -29 70 -18 21 -73 103 -47 22 -53 24 28 -27 48 -36 68 -29 3 -6
$$ packed form
3235D8l3k9K3J1Kn1M0n1P5q1Q7r5P4m7M6n4P3l4Mj2KJ9j6jl6P8m8K8m0M6n6O5
3267C7q1Q8q8Q3p8N8k5j7O4r7O7m6R7j08J07q3M6l0j3J0KJ7k0Qj0j6Q1m8J1rq
3298aL4n3N3r5J31j21J06q2M6k2%K1%pnpJ4l1K9l6K6J7r8J48j12J20j65J40q7
3327c7M8j7l5R9j17J00r3J08p2jO3p9L7kjnl0Q7j18J23j23J04o9N0qo0J05j29
3355g2J39q4M2o1L7j0nK8Kl7P9j12Q5r6J11p0L5Pm9R7j34J49j69J60j10O5l4J3
3383FJ0k0J3m2K1L5o1P0l6J2k8RM5q6Q9j23J29o7M8o4P1l8M%j6JL7m3L2m7O7l1
3415cJ1L4q5R9j15J10j05J12j21P8Ll2l0M0L0n6N3k6%oK4k0M0q8R0p7J06j13O6
3444A9l0K4j6k6M6rJ2n8K0O8o0Mlk0R9q8L9r4J76j50O9p5P7Mn5P5q4J04r7L2r
$$ plain form
3475 -6 6 -43 -42 2 12 -60 57 -75 60 -68 25 -21 -31 73 -74 78 -110 66 -26 20 -31 -32 3 -48 2 30 -46
3502 -46 20 -33 67 -114 34 -21 31 4 -98 105 -105 105 -133 131 -11 -34 46 -22 73 -105 34 13 -36 23
3526 23 -109 99 -74 64 15 -36 79 -87 177 -198 149 -35 45 -74 -39 163 -112 65 -106 69 -6 -75
3548 -75 62 -45 105 -70 19 30 -100 131 -160 147 -166 140 -72 -29 52 -80 140 -184 107 -39 14 -33
3570 -33 -54 108 -138 57 -23 26 24 -100 195 -193 134 -98 114 -13 -100 114 -112 136 -190 136 -55 3 12
3593 12 -57 120 -132 68 -11 -35 89 -98 176 -178 127 -47 -19 9 -102 221 -197 117 -109 148 -78 -69 111
3616 111 -71 75 -109 88 5 -84 58 -113 106 -143 84 -30 -42 112 -139 195 -221 215 -76 40 -56
3637 -56 -61 170 -172 125 -82 60 -24 -79 131 -117 82 -106 98 0 -119 187 -173 162 -185 192 -52 -59 64
$$ packed form
3475fJ2m9JM4J0p2J17j32J35j28R3m6j0J04j47J52j88J76r2M6n1jL5n1N0K8p6
3502d6O6n3J00j81J48n5N2k7j02K03k10K10k38K64j42k3Q0o8R5j78J39k1m9N9
3526B3j32K08j73J38m9n1J15j66K64l75L47j84Q0j19L5K02k75J77j71J75p5o9
3548g5J37j07J50j75Q9J1j30K31k91L07l13L06k12M3Q1j32K20l24K91j46N3m7
3570c3k1J62k46J95q0M9kj24K95l88L27k32K12j27q7K14k26K48l26L26j91N8R
3593A2o9J77k52K00p9k4J24j87K74l54L05j74K8K8j11L23m18L14k26K57k26RJ80
3616A11j82J46j84J97q3q9J42j71K19k49K27j14j2J54k51L34m16M36k91J16r6
3637e6nK31l42K97k07J42q4n5K10k48J99j88K04r8j19L06l60L35l47L77k44pJ23
$$ plain form
3660 64 -94 156 -200 159 -86 23 1 -46 86 -94 117 -37 -15 40 -82 180 -215 141 -55 85 -51 -76
3682 -76 190 -124 122 -154 161 -35 -26 42 -30 126 -90 40 -12 -50 84 -128 126 -138 143 -71 -39 42 -47
3705 -47 138 -213 194 -79 109 -77 -7 72 -59 38 -115 67 -25 -14 37 -80 88 -71 63 -25 -41 99 -105
3728 -105 116 -133 133 -77 31 -28 -26 81 -55 84 -46 -3 8 -8 59 -74 48 22 -11 -6 -49 95 -116 93
3752 93 -117 92 -52 -18 -20 38 85 -89 42 -58 107 -51 -3 9 8 -1 -32 -41 71 -7 35 -50 77 -5 3 -43 2 51
3780 51 -49 39 -19 85 -34 -13 -36 53 -4 34 -60 35 11 14 -80 46 -17 25 -24 14 -6 -16 50 -66 74 -74 67
3807 67 -58 64 -65 48 -38 48 -22 6 66 -27 -3 -54 86 -38 11 -28 53 9 1 -47 18 -18 42 -65 14 1 68
3834 68 -54 -21 33 22 11 -65 32 -13 36 -94 11 30 21 -61 1 8 65 -74 21 -85 101 -23 -14 1 12 59 -112 44
$$ packed form
3660F4j58K50l56L59k45J09k2m7J32j80K11j54K2N5j22K62l95L56j96J40j36k5
3682g6K66l14K46k76L15j96RO8p2J56k16J30n2l8J34k12K54k64K81k14L2Q1q9
3705d7J85l51M07k73J88j86P0P9j31R7j53J82r2J1N1j17J68j59J34q8j6J40k04
3728a05K21k49K66k10J08n9KJ07j36J39j30M3J1j6O7j33J22k6l3Nm3J44k11K09
3752I3k10K09j44L4kN8M7j74J31j00J65j58M8J2jrl1rJ12p8M2q5J27q2Qm6M5M9
3780E1j00Q8n8J04j19K1k3Q9n7L8r4R5k4Lr4J26o3M2m9L8k0j0O6j16J40j48J41
3807F7j25J22j29J13q6Q6p0K8O0r3K4n1J40j24M9l9Q1m4qm8O5l6O0j07P9j3O7
3834F8j22L3N4j1j1p6R7m5M9j30J05J9rq2O2PN7j39R5j06J86j24RJ5J1M7j71J56
$$ plain form
3862 44 -48 110 -100 34 -17 50 -45 -37 49 14 6 -16 -27 -5 14 3 -44 7 46 -74 46 -44 20 -60 77 -36 51 -24
3890 -24 1 -16 -3 -27 22 15 -8 2 5 34 -39 3 -42 71 -80 27 -61 102 -32 3 -37 58 23 -32 -17 -40 65 -20
3918 -20 -26 -65 115 -36 3 -51 91 -36 21 -42 -7 83 -41 -46 17 59 -9 -37 -1 10 19 -16 -44 70 -24 47 -114 109
3946 109 -57 56 -66 -18 4 -55 49 -95 83 -37 23 20 -22 16 -11 -6 1 -37 88 -110 125 -115 94 -71 48
3971 48 5 -108 117 -101 116 -141 109 -32 -15 11 -79 107 -88 15 -6 -27 100 -126 150 -146 139 -41
3993 -41 -33 56 -78 210 -227 134 -134 128 -49 -70 90 -51 82 -131 57 68 -134 111 -139 144 -135 34
4015 34 -11 -104 183 -239 206 -231 205 -97 20 22 -96 231 -237 129 -78 52 -28 -155 202 -175 130 -107
4037 -107 61 68 -180 226 -236 240 -264 168 -37 -115 121 -188 231 -275 193 -71 -20 57 -173 224 -217 125
$$ packed form
3862D4r2J58k10J34n1O7r5QQ6l5qk2j1K2J9j1m7N1L9j20J20r0O4q0J37j13Q7p5
3890b4K5j7J3k4M9pk3J0LK9p3M2m5J13j51J07q8J63j34L5m0R5l5n5J5k3J05q5
3918b0ol9J80j51L9n4J42j27N7o3L5R0j24nO3M2o8k8L6J1Rl5k8J14r4P1j61K23
3946A09j66J13j22M8K2n9J04j44J78j20O0lm2L8k7NPl8J25j98K35k40K09j65J19
3971D8m3j13K25k18K17k57K50j41J7K6r0J86j95J03k1k1J27k26K76k96K85j80
3993d1QQ9j34K88m37L61k68K62j77k1J60j41J33k13J88J1k02K45k50K83k79J69
4015C4m5r3K87m22M45m37M36l02J17Kj18L27m68L66k07J30q0j27L57l77L05k37
4037a07J68Pk48M06m62M76n04M32k05p8K36l09M19n06M68k64N1P7k30L97m41L42
$$ plain form
4059 125 -60 -27 163 -226 305 -319 217 -117 97 -19 -199 339 -264 209 -261 239 -25 -144 155 -193
4079 -193 271 -252 125 18 -112 151 -284 308 -273 218 -77 -56 122 -239 313 -385 268 -151 120 -44
4099 -44 -149 279 -212 162 -195 158 30 -230 263 -239 231 -250 170 26 -175 241 -293 353 -359 257
4119 257 -92 6 51 -208 315 -302 206 -105 30 48 -176 273 -284 217 -124 38 19 -210 332 -357 242
4140 242 -257 253 -63 -202 222 -173 251 -381 201 -67 -71 70 -163 227 -221 149 -103 -23 135 -222 282
4161 282 -302 277 -123 23 17 -114 320 -312 205 -166 221 -85 -116 187 -140 142 -195 109 18 -149 186
4182 186 -222 257 -251 150 -64 -68 128 -169 265 -322 256 -169 88 -37 -71 160 -178 155 -104 47 21
4203 21 -99 172 -191 119 -98 112 -20 -130 209 -189 189 -260 208 -69 -47 29 -105 137 -186 69 -76
$$ packed form
4059A25j85L3J90l89N31o24N36l34K14j16j80N38o03M73m70N00k64j19K99l48
4079a93M64n23L77j07j30K63m35N92n81M91k95K1J78l61N52o98O53m19K71j64
4099d4j05M28m91L74l57L53j28k60M93n02M70m81M20j44k01M16n34O46p12O16
4119B57l49R8M5k59N23o17N08l11J35J8k24M49n57N01l41J62j9k29N42o89N99
4140B42m99N10l16j39M24l95M24o32N82k68mJ41k33L90m48L70k52Q0J58l57N04
4161B82n84N79m00J46oj31M34o32N17l71L87l06l1L03l27K82l37L04r1j67L35
4182A86m08M79n08M01k14mJ96k97M34n87N78m25K57j25l4K31l38L33k59J51k6
4203B1j20K71l63L10k17K10j32j10L39l98L78m49M68k77K2P6j34K42l23K55j45
$$ plain form
4224 -76 15 34 -118 90 -104 125 -68 -48 81 -87 159 -286 214 -106 95 -66 -53 121 -78 82 -162 132
4246 132 -45 4 -1 -23 84 -59 -6 -2 -40 116 -126 102 -110 121 -85 -8 25 -52 89 -118 109 -82 59 -63
4270 -63 12 -7 -16 27 -23 -19 34 -51 77 -96 35 -57 60 -9 -56 49 -65 104 -133 89 -59 101 -98 18 -13
4295 -13 28 -18 -24 -38 30 19 -69 -9 26 21 -66 19 -16 93 -85 26 -15 92 -60 -22 -25 37 -3 -24 -34 44 8 -27 13
4324 13 -16 61 -56 21 -7 80 -56 21 -61 80 -19 -4 -29 48 -8 13 -45 -11 8 -32 29 -84 64 -71 107 -66
4350 -66 73 -75 78 -31 -25 13 -3 32 -54 9 -23 37 -25 -13 -16 74 -39 3 -71 70 -15 80 -83 68 16 19 -58 17
4378 17 67 -43 -19 -20 50 -15 -1 -86 50 -18 33 -114 107 -50 67 -89 49 -2 34 -83 -77 70 -34 26 -80
4403 -80 82 -78 61 -86 50 -27 44 -64 33 2 4 -14 2 40 -3 26 -10 12 -8 4 -33 63 -22 18 -35 78 -124
$$ packed form
4224g6R1J9j52K08j94K29j93K0J29j68K46m45N00l20K01j61J3J74j99J60k44K94
4246A32j77M9nk2J07j43N3Ml8J56k42K28k12K31k06P7L3p7J41k07K27j91J41j22
4270f3P5j9rM3n0MN3q5J28j73J31r2J17o9m7J05j14J69k37K22j48J60j99J16l1
4295a3M1m6oj4O8j1q8O0L5nq7Q5l5J09j78J11m1J07j52L8lO2m0k1j0P8l6l5M0
4324A3k9P7j17P7k8Q7j36P7q2J41r9J5k5P7n6K1n8L4J9m0O1j13J48j35J78j73
4350f6J39j48J53j09OL8j6L5q6O3l2O0o2J2lR0j13M2p4J41q5R5j63J51n2Lp7P5
4378A7N0j10K4jP0o5J4q5J36o8N1j47K21j57J17j56J38n1L6j17OJ47j04O0j06
4403h0J62j60J39j47J36p7P1j08R7l1Kj8J6L8m3K9l6K2k0J2l7R6q5M0n3J13k02
$$ plain form
4430 -124 84 -42 85 -87 -8 7 16 16 -76 44 -2 23 -82 4 -13 38 -33 17 -24 94 -107 59 -63 111 -61
4455 -61 -19 1 -25 115 -139 87 -110 126 -99 -6 52 4 14 -117 45 26 -41 33 -89 148 -112 48 -33 34
4479 34 32 -102 136 -166 165 -109 78 -66 33 53 -126 96 -92 39 -23 -55 116 -95 104 -132 114 1
4501 1 -117 144 -184 243 -250 235 -162 45 -13 -95 166 -206 153 -132 99 -84 -79 169 -133 153 -136 66
4523 66 10 -110 181 -302 291 -234 177 -169 9 152 -174 188 -294 295 -134 -11 1 -59 180 -248 160
4544 160 -26 50 95 -174 282 -254 290 -218 130 -30 -121 237 -280 293 -272 232 -215 24 145 -177 167
4565 167 -223 249 -118 -26 101 -172 257 -343 219 -152 33 22 -132 296 -413 355 -258 188 -133 -28 189
4586 189 -255 228 -237 205 -82 -61 191 -232 271 -265 238 -106 -48 206 -305 305 -368 388 -299 62 62
$$ packed form
4430a24K08j26J27j72P9J5R%r2J20m6K5j05Q6j7N1p1N0m1J18k01J66j22J74j72
4455f1M2K0k6J40k54K26j97K36k25R3N8m8J0j31J62j9o7P4j22K37k60J60q1O7
4479C4kj34K38l02L31k74J87j44R9K0j79K22j88J31o2l2J71k11J99k36K46j13
4501Aj18K61l28M27m93M85l97K07n8q2K61l72L59k85K31j83NK48l02K86k89K02
4523F6n6j20K91m83N93n25M11l46J78J43l26L62m82N89m29J23J2o0K39m28M08
4544A60j86P6M5k69M56n36N44n08L48j60r1L58n17N73n65N04m47K39J21l22L44
4565A67l90M72l67R2J27k73M29o00N62l71J85j1j54M28p09P68o13M46l21J05K17
4586A89m44M83m65M42k87K1K52m23N03n36N03l44N8K54n11O10o73P56o87L61%
$$ plain form
4607 62 -78 194 -373 336 -220 156 -152 -72 242 -282 216 -237 189 -63 -116 221 -324 367 -339 247 -167
4628 -167 73 136 -241 263 -308 374 -257 82 41 -54 163 -302 284 -164 53 -1 -150 257 -342 315 -237
4649 -237 199 -89 -54 232 -331 324 -321 297 -259 52 96 -168 193 -251 217 -163 81 78 -178 239 -269
4670 -269 289 -226 91 77 -150 213 -349 392 -272 196 -154 78 142 -240 212 -168 221 -181 -13 110 -180
4691 -180 217 -231 190 -69 -2 124 -241 287 -262 289 -276 120 30 -64 124 -234 281 -189 91 -52 24
4712 24 114 -182 175 -112 97 -39 -69 190 -191 240 -223 199 -140 72 17 -121 179 -196 209 -199 134
4733 134 -24 -12 54 -92 107 -86 71 27 -76 85 -133 190 -153 72 -34 -3 76 -183 205 -149 152 -155
4755 -155 91 10 -52 36 -81 77 -40 -27 24 -61 149 -127 67 -57 49 17 -118 92 -110 204 -183 116
$$ packed form
4607F2j40K72n67P09n56L76l08Q0L14n24M98m53M26k52n3L37n45O91p06N86m14
4628a67K40O3l77N04n71O82o31L39m1r5K17m65N86m48K17n4j49M07n99O57n52
4649b37M36k88L5K86n63O55o45O18n56L11M4k64L61m44M68l80K44lk56M17n08
4670b69N58n15L17j4k27L63n62P41o64M68l50K32O4l82M52l80L89m02J68J23k90
4691a80L97m48M21k59O7J26l65N28n49N51n65L96r0r4J88l58N15m70K80j43P6
4712B4R0k96L57k87K09j36l0K59l81M31m63M22l39K12n5j38L00l75M05m08L33
4733A34j58J2O6j46J99j93J57m4j03J61k18L23l43K25j06L1P9k59L88l54L01l07
4755a55K46q1o2Q8j17J58j17J3N1q5K10k76J94j24J06l2j35K10k02L14l87K99
$$ plain form
4777 116 -73 85 -62 -36 67 -16 46 -71 7 71 -20 -1 -19 33 44 -37 57 -74 165 -106 80 -62 93 -27
4801 -27 0 26 -19 42 -82 63 -17 23 -5 6 -2 -13 5 40 -39 33 -72 65 -69 41 -71 46 21 -44 19 -25 60
4828 60 -69 55 -47 111 -68 23 -94 104 -47 9 -58 70 -7 -4 -37 0 40 -57 9 -46 83 -34 8 -68 82
4853 82 -41 28 -85 88 21 -6 -57 34 37 12 -7 -36 43 -4 -7 -43 44 -16 21 -55 65 -29 54 -91 73 -24 61 -75
4881 -75 0 15 -26 24 -52 65 -71 105 -52 77 -53 48 -67 51 -50 9 -4 11 -29 -13 63 -8 2 -80 60
4906 60 -16 21 -62 18 42 33 -81 21 -10 55 -49 0 -27 99 -86 -92 30 10 45 -112 38 -16 42 -55 -12 8 67
4933 67 -43 -5 -20 82 -76 54 -75 85 6 -46 57 -68 148 -156 119 -102 115 -56 -11 10 -17 73 -87
4956 -87 26 -10 -11 24 -47 104 -60 82 -32 -50 97 -131 179 -157 139 -132 110 0 -71 82 -96 95 -135
$$ packed form
4777A16j89J58j47K6J03q3O2j17P8O4r1J9j8N2J1q1R4j31K39k71J86j42J55j20
4801b7K7K6m5O1j24J45q0M0k8J1qj1J8L5p9P2j05J37j34J10j12J17k5o5O3m4Q5
4828F0j29J24j02J58j79R1j17J98j51N6o7J28p7Ll3L7M0r7O6n5J29j17M2p6J50
4853H2j23O9j13J73o7k7n1R1Lk5j9k9P9m7ll6Q7o0L7p6J20r4Q3j45J64r7Q5j36
4881g5P5J5m1N0p6J17j36J76j57J29j30J01j15J18j01N9j3J5m0J6P6p1J0q2J40
4906F0p6L7q3Q0K4rj14J02l1O5j04M9k7J26j85oJ22k0L5j57J50n4N8r7M3K0N9
4933F7j10L8j5J02j58J30j29J60p9n2J03j25K16l04K75k21K17j71M5K1k7R0j60
4956h7J13l6jL5p1J51j64J42j14j8J47k28L10l36K96k71K42j10p1J53j78J91k30
$$ plain form
4979 -135 50 10 -15 65 -142 140 -70 37 23 -103 192 -215 208 -275 195 -80 4 7 -132 284 -277 146
5001 146 -166 151 -22 -170 122 -132 203 -176 47 79 -149 178 -278 268 -214 145 -87 -106 199 -242 269
5022 269 -277 241 -113 26 23 -138 273 -240 140 -94 37 120 -248 322 -303 266 -189 68 66 -209 301 -352
5044 -352 390 -390 236 -48 -66 115 -265 367 -330 206 -83 -21 171 -265 322 -325 280 -135 -10 171 -278
5065 -278 426 -441 350 -242 230 -26 -207 345 -317 348 -358 249 8 -132 202 -327 435 -328 125 -57
5085 -57 -91 272 -442 467 -463 416 -196 -11 103 -268 412 -505 387 -253 225 -22 -207 349 -342 333 -305
5106 -305 203 65 -227 315 -385 433 -399 284 -66 -116 302 -415 497 -481 360 -215 77 100 -277 414 -391
5127 -391 304 -213 60 117 -275 418 -484 398 -261 147 21 -252 438 -478 439 -477 378 -92 -117 200 -271
$$ packed form
4979a35J85m0k5Q0k07K82k10J07j4j26K95m07M23m83M70k75Q4Lj39M16n61M23
5001A46l12L17j73j48K92k54L35l79K23L2k28L27m56N46m82L59k32j9L05m41N11
5022B69n46N18l54J39lj61M11n13L80k34J31Q3l68N70o25N69m55K57kk75N10o53
5044c52P42p80O26k84j8J81l80O32o97N36k89O2J92m36N87o47O05m15J25J81m49
5065b78P04q67P91n92M72k56j81N52o62O65p06O07k41j40L34n29P62p63M53j82
5085e7l4L63p14R09r30Q79o12J85J14l71O80r17Q92o40M78k47j85N56o91O75o38
5106c05N08j38k92N42p00Q18q32O83l50n0M18p17R12r78Q41n75K92K3l77O91q05
5127c91O95n17K73N7l92O93r02Q82o59M08j26k73O90r16R17r16Q55m70k5L17m71
$$ plain form
5148 -271 423 -489 284 -106 20 157 -345 405 -327 298 -186 -18 209 -295 441 -549 454 -266 155 -101
5168 -101 -202 413 -421 320 -325 283 -67 -133 231 -280 344 -349 191 -29 -109 265 -376 453 -447 358 -198
5189 -198 27 125 -243 358 -440 403 -274 159 12 -128 282 -280 298 -211 106 16 -195 330 -363 333 -282
5210 -282 242 -130 -142 238 -288 338 -398 335 -167 59 -8 -179 294 -285 205 -160 61 83 -201 242 -266
5231 -266 307 -194 29 44 -119 279 -371 295 -250 263 -168 -33 139 -120 175 -245 200 -52 -5 35 -148
5252 -148 182 -184 117 -83 19 139 -220 202 -271 272 -189 102 -55 -56 130 -195 170 -131 96 -47 -3
5273 -3 66 -89 95 -62 29 17 -72 167 -176 183 -184 156 -57 -28 43 -88 156 -169 117 -106 117 -29 -53
5296 -53 29 -21 41 -66 -11 67 -64 50 -165 129 -23 3 -53 -40 142 -134 58 -101 129 -55 34 -53 92 39
$$ packed form
5148b71O94r12P73l90J26J37n02P50p32O25m84J68K27n04P36r90J003p20M21k56
5168a01j01O15q34P41o45O08l50o6L64n11O24o93N40k20q0L74o41Q29r00Q05n56
5189a98K25R8l68O01p98Q43o77M33j47j40M10n62N78n09L17r0k11N25o93O96o15
5210b82N24l72j2L80n26O26p36P33n02K26o7j71M73n79M90l65K21K2k84M43n08
5231b66N73n01K23J5j63L98o50O66n45N13m31J35J72k59K95m20M45k52M7M0j83
5252a48L30l66L01k00J02J20l59M22m73N43m61K91j57jJ86l25L65l01K27j43M4
5273cO9j55J84j57R1j2q9K39l43L59l67L40k13K9P1j31K44l25K86k23K23j46k4
5296e3Q2n0O2j07N5P8j31J14k15K94j52K6n6J3J82k76J92j59K30j84Q9q7J45n3
$$ plain form
5320 39 -16 -14 58 16 18 -85 59 4 3 -8 -58 131 -82 106 -134 141 -79 57 -67 29 0 -17 -1 17 10 2 -9 -26
5348 -26 7 -12 25 -25 57 -76 65 -73 54 -69 42 -14 39 -57 27 23 32 -22 -14 18 49 15 -60 72 -12 70 -154 78
5376 78 -39 81 -138 38 -7 30 -36 -63 52 6 18 -107 23 -16 54 -115 53 2 68 -81 13 -2 94 -70 -10
5401 -10 -32 33 -14 -57 58 -5 51 -84 15 -24 82 -89 27 -32 36 -54 26 -40 48 -33 42 -48 50 -30 -4 15 -31 48
5429 48 -103 129 -128 120 -127 122 -84 10 24 -4 42 -84 26 -15 49 -13 -47 84 -2 30 -42 -31 133 -87
5453 -87 101 -148 206 -92 33 -60 15 118 -123 81 -121 146 -64 -39 30 -9 93 -129 11 12 -58 97 -211
5476 -211 211 -178 168 -127 63 45 -140 198 -233 288 -192 102 -96 15 126 -121 154 -139 129 -23
5496 -23 -119 164 -169 244 -239 181 -27 -65 122 -211 261 -310 268 -185 101 -7 -121 238 -230 177 -180
$$ packed form
5320C9n5KP2m2Kj03J44n5jj1n0J89k13J88k40K75k20J36j24R6k9j7J6J8pqj1j7
5348b6L3j9L7n0Q2j33J41j38J27j23J11n6N3r6Q4mRn4QL2L1l4p5J32q4Q2k24K32
5376G8j17J20k19J76m5L7o6k7J15m6J2j25J30l9P0j69J68n1O6j49R4j5R6j64O0
5401a0k2O5m7m3J15o3N6j35R9l9J06j71J16n9O8r0Q0o6Q8q1P5r0R8q0K6J9m6P9
5429D8j51K32k57K48k47K49k06R4J4k8M6j26J10m1O4o2l4J31q6L2p2J1J64k20
5453h7J88k49L54k98J25r3P5J03k41K04k02K67k10K5O9l9J02k22J40Jp0J55l08
5476b11M22l89L46k95J90j8j85L38m31N21m80K94j98J11J11k47K75k93K68j52
5496b3r6K83l33M13m83M20k08l8J87l33M72n71N78m53K86j08j14L59m68M07l57
$$ plain form
5517 -180 122 53 -161 228 -279 299 -270 108 11 -104 261 -378 401 -344 315 -221 24 137 -187 304 -389
5538 -389 346 -170 31 -2 -141 311 -304 266 -166 108 102 -266 317 -396 446 -364 219 -47 -109 277 -386
5559 -386 369 -377 338 -181 -26 226 -297 302 -391 295 -129 -51 168 -340 472 -495 415 -271 119 38 -217
5580 -217 410 -511 475 -392 281 -121 -75 254 -364 385 -374 258 -57 -115 254 -360 472 -456 351 -208 -7
5601 -7 280 -400 469 -514 542 -375 113 7 -184 385 -478 404 -271 238 -32 -233 418 -443 452 -409
5621 -409 270 -28 -144 338 -518 570 -488 424 -300 76 201 -317 409 -472 479 -297 60 80 -183 327
5641 327 -470 383 -244 84 63 -266 408 -505 500 -413 282 -120 -130 307 -433 455 -435 394 -236 10
5661 10 223 -295 377 -374 318 -191 43 172 -333 451 -462 485 -302 116 45 -178 373 -520 508 -356
$$ packed form
5517a80L02o9k14L89n07N78n69L78r7j15L65o39P79p45O59n36K45J13l24M91o93
5538c89P35n16K01l3j39M52o15N70m32K74ol68N83p13Q42q10N83k66o2L86o63
5559c86P55p46P15n19J55K52n23N99o93O86m24P8K19n08Q12r67R10o86L90q1k55
5580b17O27r21R86q67O73m02M6L29o18P49p59O32l15n8L69o14Q32r28Q07n59K01
5601gK87o80Q69r83J056r17M88j06j91N69q63Q82o75N09k70k01O51q61Q95q61
5621d09O79k98j16M82q56J088j058R12p24L76J25n18P26q81R51p76L57K0k63N10
5641C27p97Q53o27L28k1l29O74r13J005r13O95m02j0M37p40Q88q90Q29o30K46
5661A0K13n18O72p51O92n09K34J29n05P84r13R47p87M18p1k23N51q93J028q64
$$ plain form
5681 -356 232 -151 -40 241 -346 323 -337 231 -76 -97 212 -317 378 -351 254 -161 -23 175 -342 382
5701 382 -415 405 -326 125 40 -105 246 -361 360 -228 125 -59 -141 264 -339 299 -279 165 -12 -118 261
5722 261 -353 389 -383 270 -179 18 86 -222 287 -331 279 -177 30 33 -133 174 -225 215 -178 38 113
5743 113 -177 206 -292 316 -223 141 -51 -54 178 -266 230 -211 209 -147 11 100 -119 144 -187 131 -36
5764 -36 -16 81 -207 236 -224 159 -129 27 66 -142 181 -210 258 -182 71 -67 41 63 -104 63 -89 65
5786 65 6 -81 94 -92 111 -134 87 22 -5 83 -148 183 -144 139 -132 91 -28 -19 13 -43 54 -50 19 17 -59
5811 -59 22 -49 44 -3 -50 62 -79 108 -140 157 -97 42 -67 1 22 -20 35 -61 45 -27 -11 -29 21 13 14 -51 49
5838 49 -49 79 -114 96 -33 58 -57 -11 45 -5 23 -57 53 17 0 -53 34 12 30 -79 55 -53 125 -98 21
$$ packed form
5681c56N88l83J11K81n87O69o60N68l07k1L09n29O95p29O05m15J38J98n17P24
5701C82p97Q20p31M51q5j45L51o07P21n88L53j84q2M05o03O38n78M44j77j06L79
5722B61o14P42p72O53m49J97O8l08N09o18O10m56K07Lj66L07l99M40l93K16P5
5743A13k90L83m98O08n39L64j92lK32m44M96m41M20l56J58Q9k19K63l31L18j67
5764c6K0R7k88M43m60L83k88J56L9k08L23l91M68m40K53j38J08K2j67J67j52J54
5786F5n9q7J75j86K03k45K21o5k7Q8k31L31l27K83k71K23j19RL2n6R7j04O9kp6
5811e9Q1p1R3m7m7J12j41J87k48K97k54J39j09O8K1m2N5r6J06p2J6j8N0qJo5J00
5838D9r8J28j93K10j29R1j15M6N6n0K8q0J10l6j7n3Q7k2J8j09J34j08J78k23J19
$$ plain form
5863 21 -65 64 -3 -22 21 -30 21 -59 56 -44 39 -26 3 -16 51 -38 35 -56 90 -49 45 -30 57 13 -18 -11 -52 38
5891 38 -73 76 -53 33 -50 32 -28 7 -20 17 -12 17 -11 52 -48 -4 -68 27 4 -36 33 -54 94 -110 49 -112
5917 -112 79 -46 33 -29 26 18 -31 21 -2 74 -66 -6 3 62 6 -24 -17 38 -39 35 -84 72 -75 34 -54 18 -17 -73
5945 -73 22 -70 73 -87 10 -48 19 -9 -54 12 -47 23 6 -63 75 -86 110 -125 86 -53 7 29 -107 130 -144
5970 -144 178 -135 118 -73 17 49 -43 84 -75 72 -39 -22 65 -116 117 -121 61 -45 -19 69 -171 190
5992 190 -189 181 -144 76 -15 -42 80 -167 157 -119 74 -48 -28 129 -154 156 -157 151 -7 -103 146
6013 146 -196 266 -249 192 -135 84 37 -146 192 -228 221 -186 102 1 -66 93 -189 187 -135 39 7
6034 7 -125 166 -262 257 -255 192 -47 -45 152 -267 275 -314 239 -172 30 63 -150 202 -227 249 -132 51
$$ packed form
5863B1q6J29o7j9M3n1N1q0J15j00Q3o5K9j9O7q9P3r1J46j39R4p5Q7m4l1Pm1R0
5891C8j11J49j29Q6q3Q2o0L5k7L7k9K9k8O3j00M4o4R5k3m0O9q7J48k04J59j61
5917a12J91j25P9o2N5qm9N2k3P6j40O0RN9n6l0PN5p7P4j19J56j47J09q8P2l5n6
5945g3R5r2J43j60R7n8O7k8m5O6n9P0j7o9J38j61J96k35K11j39O0K2j36K37k74
5970a44L22l13K53j91R0L2r2J27j59J47j11J7Q7j81K33k38J82j06K6Q8k40L61
5992A90l79L70l25K20r1k7J22k47L24k76J93j22K0J57k83L10l13L08j58r6K49
6013A46l42M62n15M41l27K19m7j83L38m20M49m07K88j01o7J59k82L76l22J74l2
6034Gj32K91m28N19n12M47k39KJ97m19N42n89N53m11K02L3k13L52m29M76l81J83
$$ plain form
6056 51 61 -199 276 -303 282 -249 167 -2 -148 227 -310 372 -335 260 -173 50 95 -276 257 -257 219
6077 219 -179 4 86 -222 251 -313 266 -163 28 31 -221 317 -376 356 -289 185 -19 -94 192 -292 329
6098 329 -314 171 -96 -27 186 -283 307 -281 219 -123 -39 210 -288 375 -398 335 -274 102 46 -213 293
6119 293 -349 333 -309 174 -74 -83 201 -281 297 -228 176 -22 -102 236 -289 359 -350 251 -121 -13 184
6140 184 -280 346 -359 335 -230 77 82 -125 224 -265 296 -199 68 57 -124 289 -289 292 -272 159 -45
6161 -45 -119 238 -335 346 -375 236 -180 35 70 -263 291 -280 203 -162 14 89 -214 273 -263 275 -155
6182 -155 70 101 -164 289 -320 357 -311 177 -36 -69 154 -251 289 -280 174 -79 -31 69 -201 198 -229
6203 -229 168 -87 -22 153 -232 275 -259 220 -219 94 12 -122 223 -240 218 -224 116 -47 -35 81 -170
$$ packed form
6056E1J0k60M75n79N85n31M16j69j46L75n37O82p07N95m33K23M5l71N33n14M76
6077B19l98J83Q2l08M73n64N79m29J91Lk52N38o93P32o45M74k04p5K86m84O21
6098C29o43M85k67O9K13m69N90n88N00l42Q4K49m98O63p73P33o09L76n6k59N06
6119B93o42O82o42M83k48rK84m82N78n25M04j98q0L38n25O48p09O01l72J08J97
6140A84m64O26p05O94n65L07Nk07L49m89N61m95K67j1j81M13n78N81n64M31k04
6161d5p4L57n73O81p21O11m16K15L5l33N54n71M83l65J76P5l03M87n36N38m30
6182a55K25L1k65M53o09O77o68M88k13l3K23m05N40n69M54k53M8J00k70L99m27
6203b29L97k55O5J75l85N07n34M79m39L13q2j34L45m63M58m42L40j63J2J16k51
$$ plain form
6224 -170 156 -159 93 -7 -49 118 -215 224 -234 184 -63 -45 100 -163 230 -245 212 -160 61 12 -117
6245 -117 111 -141 111 -112 32 33 -106 110 -169 139 -86 54 -28 -102 157 -178 196 -191 137 -91 31
6266 31 -4 -56 127 -110 69 -29 31 30 -64 82 -95 77 -10 -27 62 -106 116 -152 138 -129 81 -32 -16 34
6290 34 -68 69 -86 42 -31 -10 35 -41 43 -29 16 18 -48 56 -94 104 -97 64 -47 45 -5 -59 53 -81 78
6315 78 -46 35 -20 34 -28 4 0 -1 -34 69 -68 65 -60 36 -23 24 4 -61 41 -46 39 -81 26 -32 23 -30 7
6342 7 -15 6 -37 14 -33 28 -34 -19 -5 -10 -5 -52 11 -69 70 -34 42 -27 45 -5 40 -36 11 -12 39 -2 32 -17 -16 31 0
6373 0 22 -34 60 -65 52 -42 33 -46 -15 -32 -22 -3 8 -1 23 18 10 -18 -2 30 -26 20 -44 48 -78 47 -54 58 -57
6402 -57 20 -37 29 -11 -12 -10 -19 36 -24 13 -41 44 -39 20 -38 55 -41 37 -56 42 -38 20 -55 -6 -24 -10 32 -53 21 -51 20 -43
$$ packed form
6224a70L26l15K52j00m2J67l33M39m58M18k47J8J45k63L93m75M57l72K21m9j29
6245a17K28k52K52k23J44Jj39K16k79L08k25J40q2p4K59l35L74l87L28k28J22
6266C1l5n2J83k37J79r8O0jr4J46j77J72q7j7Q9j68K22k68K90k67K10j13J6N0
6290C4j02J37j55J28p3K1M5p6Q4p2M5Ko6J04j50J98k01J61j11R2n0n4J12j34J59
6315G8j24Q1n5N4o2L2mjl3J03j37J33j25R6n9M7k0o5J02q7Q5j20J07n8N5n3L7
6342Gk2K1m3N1m7O1o2J5J4nNm7O3q0J39j04P6o9P2n0M5p6M7k3N1m1L4m9JM7l1
6373@K2n6R4j25J17r4P5p9L1j7J0J9J1rK4nqk8J6L2n6M6o4R2j26J25j01J12j15
6402e7P7n7O6m0jKrN5o0L7n4Q5q3N9n8R3r6P8r3R8q0N8p5M9j8J4M2q5P4p2P1o3
$$ plain form
6434 -43 36 -45 37 -15 9 -15 20 -2 -6 -23 30 -6 30 -25 22 6 4 40 -63 46 -77 75 -114 46 -79 29 -37
6461 -37 0 35 -28 10 -49 6 -18 -18 12 -13 33 -16 -37 31 -83 105 -94 97 -103 81 -28 -29 21 -47 85 -104 41
6488 41 -47 4 1 -30 41 -28 62 -4 -22 48 -89 117 -117 115 -102 60 -3 -59 70 -110 125 -148 82 -58 27
6513 27 2 -68 68 -51 46 -14 -36 80 -127 110 -160 109 -55 4 69 -102 188 -173 170 -118 88 -22 -20
6536 -20 95 -105 97 -127 70 -24 -49 78 -137 157 -134 86 -69 -52 98 -188 160 -220 182 -152 63
6557 63 -16 -120 111 -183 163 -127 72 -9 -85 118 -130 139 -90 54 39 -113 185 -232 232 -201 155 -59
6579 -59 -18 94 -174 204 -194 165 -145 72 43 -117 147 -163 145 -112 16 58 -128 193 -249 233 -186
6600 -186 117 -24 -82 149 -223 229 -235 182 -62 -8 46 -131 182 -156 124 -88 8 106 -171 223 -187 152
$$ packed form
6434d3P9q1Q2n2K4k4L5k2mj7N3l6L6n5M7j6kL6j03J09j23J52j89J60j25J08o6
6461c7L7L5o3L8n9N5k4%L0k5M6m9k1O8j14J88j99J91k00J84j09jN0o8J32j89J45
6488D1q8N1ll1P1o9R0o6j8P0j37K06k34K32k17J62o3n6J29j80K35k73K30j40Q5
6513B7k5p0J36j19R7o0k2J16k07K37k70K69j64N9O5j71K90l61L43k88K06j10K
6536b0J15k00K02k24J97r4k5J27k15K94k91K20j55J7J50k86L48l80M02l34K15
6557F3p9j04K31k94L46k90J99q1p6K03k48K69k29J44j5j52K98m17M64m33L56k14
6579e9M1J12k68L78l98L59l10K17k9j60K64l10L08k57J28M2j86L21m42M82m19
6600a86L03j41n8K31l72M52m64M17k44N4N4j77L13l38K80k12R6R8k77L94m10L39
$$ plain form
6622 152 -107 23 48 -112 229 -282 261 -201 135 -45 -54 135 -176 176 -197 113 -25 -42 119 -188 198
6643 198 -205 142 -40 -60 124 -210 234 -251 231 -158 61 43 -114 193 -181 184 -152 83 -2 -80 150
6664 150 -142 170 -123 57 22 -79 176 -238 218 -190 132 -82 -3 75 -176 215 -239 162 -139 26 17 -112
6686 -112 127 -142 116 -85 30 62 -119 170 -175 192 -115 92 -2 -85 142 -177 200 -183 188 -69 12
6707 12 53 -108 136 -114 103 -33 -27 63 -113 144 -141 113 -50 -15 57 -133 163 -207 191 -166 59 -24 -14
6730 -14 90 -121 131 -133 83 -26 -51 67 -93 108 -110 68 -7 -22 93 -138 147 -144 114 -94 28
6751 28 21 -77 80 -113 115 -60 34 -2 -29 79 -66 55 -40 5 37 -61 112 -139 101 -80 49 -7 3 65 -90
6776 -90 103 -105 74 -42 27 -7 -38 47 -46 47 -26 -17 72 -83 67 -46 94 -25 -19 9 -62 78 -97 82 -72
$$ packed form
6622A52k59J30K5j60L41n11N43m62L36j80rJ89l11L52l73L10j38j7J61l07L86
6643A98m03L47j82k0J84l34M44m85M82l89K19j8j57L07l74L65l36K35q5p8K30
6664A50k92L12k93J80l5j01K55m14M56m08L22k14P9P8k51L91m54M01l01J65rj29
6686a12K39k69K58k01J15L2j81K89l45L67l07K07r4q3K27l19L77l83L71k57Q1
6707A2M1j61K44k50K17j36OR0j76K57k85K54j63L5P2j90K96l70L98l57K25q3J0
6730a4J04k11K52k64K16j09k5J18j60K01k18J78p5j5J15k31K85k91K58k08J22
6751B8pr8J57j93K28j75R4l6k7J08j45J21r5M5L2r8J73k51K40j81J29n6J0O2j55
6776i0J93k08J79j16O9l4l1Q5r3R3p3RQ9j55J50j13J40j19OK8p1J40j75J79j54
$$ plain form
6801 -72 49 -26 24 -19 -23 20 -22 4 5 -28 22 -54 37 -13 -10 28 -30 52 -48 72 -56 66 -37 17 1 9 27 20 -8 3
6831 3 -14 -7 -11 23 22 2 34 -18 54 -38 62 -51 49 -53 39 -20 -2 -3 -28 31 -6 -21 15 12 -10 10 -43 24 -21 55 -32
6862 -32 70 -21 45 -29 36 3 -32 8 -40 13 -15 42 -3 31 -9 35 3 37 -50 29 -53 22 -50 35 -33 1 26 -13 -18 -39
6892 -39 40 -3 14 -16 24 -35 4 -12 15 3 9 -43 50 -44 37 -28 22 -6 14 44 -11 65 -50 58 -45 35 -45 38 7
6921 7 27 -14 7 -17 -6 -25 -8 -5 29 -12 18 6 -12 1 -20 19 -36 50 -84 36 -14 24 -43 19 -40 -26 8 -51 22 3
6951 3 -2 -17 12 22 1 -18 42 -23 71 -47 47 -50 42 -29 17 7 -28 29 -35 43 -69 22 -36 6 -7 16 23 -5 -9 -2 -37 44
6983 44 -59 52 -56 40 -45 -13 5 -36 68 -55 92 -61 38 -37 18 -2 -23 15 -9 27 23 -9 59 -39 40 -41 0
7010 0 -2 -34 69 -90 100 -105 76 -69 39 -16 -32 44 -85 75 -82 13 -7 -31 27 -50 87 -49 34 -2 -57
$$ packed form
6801g2J21p5N0m3mM3m2K6Jl3N0p6R1n0LL8n8Q2j00J20j28J22j03N4j6QJ8pk8J1
6831Cj7PmL4jk0L2n2P2r2J00j13J00j02R2n9J8jk5N9l7j5L6lk2K0n3O7m5P6q7
6862c2J02r1O6p4O5l3l5M0m8N3k8N7m5L4m0M4l2L4q7P9q2P5p2Q5o8L4K5l9nk1
6892c9P9m3J7l0M0n9L9j6K7j2On2R3r4Q1o5N0k8K0L0n5P6j15J08j03Q0q0Q3l1
6921GK0m1K1k4J1j9J7LL4m1L0j2j8J3k1L9n5Q6j34J20n0L8o7O2n9J4L4n9P3j9
6951Cnj5K9J0k1j9O0o5R4j18R4r7R2p1M6j0l5N7o4P8j12R1n8M2j3K3Pk8mPl5Q1
6983D4j03J11j08R6q5L2J8m1J04j23J47j53R9p5N5k0k1L8k4L6ml2O8r8P9q1M1
7010@kl2J03j59J90k05J81j45J08n5j6P6j29J60j57R5k0k4N8p7J37j36Q3l6n5
$$ plain form
7035 -57 81 -121 128 -106 78 -34 22 20 -67 91 -93 74 -45 62 29 -38 85 -56 80 -26 20 31 -80
7058 -80 86 -122 95 -80 62 -4 -35 116 -120 125 -118 94 -69 4 35 -63 79 -100 52 -34 21 27 -68 109
7082 109 -98 107 -58 18 18 -103 126 -142 120 -101 81 -48 -38 68 -99 89 -89 47 -13 -41 62 -84
7104 -84 91 -100 57 -46 -14 112 -129 123 -156 121 -108 15 -1 -77 100 -135 129 -82 64 0 -42 82
7126 82 -100 141 -64 32 3 -23 120 -138 184 -153 110 -43 11 44 -93 119 -140 105 -73 17 14 -56 95
7149 95 -106 56 -82 43 6 -101 100 -145 135 -129 49 -25 -52 125 -123 118 -141 108 -91 24 28 -71
7171 -71 104 -108 74 -33 -16 42 -58 112 -93 93 -24 10 44 -102 93 -142 118 -97 76 -38 -53 42
7193 42 -82 68 -74 -2 -16 -24 58 -98 77 -91 53 -36 -39 49 -123 124 -118 79 -64 15 6 -55 65 -108 85
$$ packed form
7035e7J38k02K49k34J84j12N6kq7J58j84J67j19J07l3o7J23j41J36j06M6J1j11
7058h0J66k08K17j75J42o6l1J51k36K45k43K12j63P3L1r8J42j79J52q6N5Or5J77
7082A09k07K05j65P6%j21K29k68K62k21J82j29J0J06j67J88j78J36o0k8J03j46
7104h4J75j91J57j03L2J26k41K52k79K77k29J23j6p6J77k35K64k11J46o4m2J24
7126H2j82K41k05R6k9k6J43k58L22l37K63j53N4L3j37K12k59K45j78R0lp0J51
7149I5k01J62j38J25l7j07K01k45K80k64J78p4k7J77k48K41k59K49j99J15Mr9
7171g1J75k12J82j07J7N8j00J70k05J86j17L4L4j46J95k35K60k15J73j14j5R5
7193D2j24J50j42P2j4qQ2j56J75j68J44q9lQ8j72K47k42J97j43P9ro1J20j73J93
$$ plain form
7218 85 -49 47 -11 -45 53 -55 105 -26 17 18 -44 73 -99 97 -85 58 -13 -40 26 -76 79 -68 78 -52
7242 -52 8 3 -41 44 -66 19 11 -4 40 -71 41 -72 53 -34 16 18 -27 65 -77 74 -32 36 -15 -11 8 -22 52 -15
7270 -15 24 21 -32 38 -21 55 -44 31 -6 -50 46 -49 57 -69 32 -61 23 -8 -20 32 -70 28 -17 -6 -7 -27 26 -38 11
7299 11 -3 -19 6 -33 52 -39 71 -37 37 -16 4 13 -7 -2 -41 7 -3 -18 2 -1 16 -5 -27 14 -28 22 -36 -4 -44 24 -26
7330 -26 28 -22 -43 32 -29 13 -39 29 14 -21 -29 29 3 29 -1 36 -15 16 -55 35 -6 -16 6 -34 24 -56 18 -49 19 -18 -21
7361 -21 -10 -7 -18 2 -33 30 -36 0 -41 8 5 -14 -14 -19 35 -60 26 -71 10 -2 21 2 17 4 -1 5 44 -20 34 -1 23 -11 -6 10
7395 10 -16 45 -54 22 -20 41 -23 7 -31 18 29 4 -15 -27 -13 -8 -14 -11 -22 -19 13 5 26 -28 34 -30 5 -33 17 -13 -8 -21 -26 22
7429 22 -21 5 -1 -3 13 -15 -26 -5 2 -7 -29 39 -16 20 -29 -6 -39 -4 -2 -8 6 -32 -18 -44 0 -44 -3 -32 -18 -8 -9 -33 -19 -41
$$ packed form
7218H5j34R6n8l4R8j08J60j31M3Jo2J17j72J96j82J43p1k7O6j02J55j47J46j30
7242e2O0nm4Q5j10Q5qj5M4j11J12j13J25q7N0Km5R2j42J51j06O8n1MJ9l0P4o7
7270a5L9ln3P0n9P6r9P5l7m4R6r5J06j26J01r3Q4l1j2N2j02R8m5J1jk0N3o4M9
7299A1j4j6K5l9Q5r1J10j08P4n3K0Rk0Nl9M8j0j5K0lJ7k1k2M1m2N0n8L2m0O8n0
7330b6N4n0k1P5o1M2n2O8j5l5qN8k6K6l0L7n1L1p1R0m1j0K2m0N8q0P4o7O8l7l
7361b1J1Lj1K0l5O3o6L6m1M9lj9%nN4r5Q6r7Q1j2K3j9J5j3nOL9o4N4l5K4l4NJ6
7395A0k6O1r9P6m2O1o4L0l8M9J1k5j9j2J4NoLj1LL2qK1n4O2o4L5l8N0l0Nj3nM8
7429B2m3K6okJ6k8j1K1Prk2O8n5L6m9K3l3L5KoJ4l8J4k6M4m4M1k9J4J0jk4J4k2
$$ plain form
7463 -41 26 -26 16 -7 19 -17 14 3 -3 30 -23 39 -55 19 -34 18 -20 -11 17 -15 15 -40 -20 29 -8 6 -33 -18 -39 -13 -16 -46
7495 -46 16 -47 38 -67 -12 -24 -4 -10 -42 37 -38 -5 -18 40 -15 19 38 -4 3 -27 3 -16 -51 39 -42 57 -48 42 -20 12
7525 12 48 -44 39 -30 58 -51 14 -3 2 1 -22 4 -14 -2 4 -40 5 -75 24 -36 -25 4 -46 16 -43 53 -56 37 -15 19 3
7556 3 -26 51 -36 15 -12 21 30 -33 26 -46 45 -11 16 14 -9 58 -60 61 -84 27 -58 20 26 -59 16 -58 16 -34 -12 21
7586 21 -40 27 -27 -3 7 -10 29 -48 76 -51 69 -43 2 -3 -7 40 -45 56 -50 44 -4 29 36 -35 56 -39 24 -13 -41
7615 -41 40 -66 30 -79 25 -10 -3 15 -26 51 -88 52 -27 17 7 -19 25 -42 38 -4 -2 2 -29 34 -54 51 -36 44 3
7644 3 -43 23 -57 84 -60 39 -39 16 59 -39 46 -42 30 14 -5 20 -23 50 -34 15 -1 -24 16 -19 36 -51 57 -60 50
7673 50 -11 -6 7 -26 37 -29 34 7 -3 5 -46 27 -28 35 4 -44 55 -22 77 -58 37 -17 1 21 -28 41 -46 51 -32 8 -2
$$ packed form
7463d1O7n2M2k3K6l6L1j1oL3n3O2r4P4n3N2l8RK8l2L0n5K0M9l7J4l9J5k1K6ll0
7495d6O2o3Q5j05N5j2K0ol2P9p5L3j3N8n5L4J9m2Pl0L0j9l5R0q1R9j05R0o2L2
7525A2L6r2Q3o9Q8j09O5j7Njk3K6j8J2Om4M5q0R9o0J1K9n0O2n9R6j09R3n2L4j6
7556Ck9P7q7N1k7L3Ro3N9p2R1n6K7kk3O7j18J21j45J11q5P8Oq5P5p4P4n0K2L3
7586B1o1O7n4K4J0j7L9p7J24j27J20j12M5nmM7q5J01j06R4m8L3Pp1R1r5O3l7k8
7615d1Q1j06R6j09J04l5PJ8m1P7j39J40p9M4j0k6M4o7Q0m2KMl1O3q8J05q7Q0m1
7644Cm6O6q0J41j44R9p8N5M3r8Q5q8P2j6j9K5m3P3q4M9j6k3M0l5N5q7J08j17J10
7673E0o1NJ3l3O3o6O3k7j0Qn1P3n5O3l1m8R9p7R9j35R5n4J8K0m9O9q7R7q3M0j0
$$ plain form
7704 -2 10 27 -27 18 -19 16 28 -60 41 -57 25 -45 34 -12 -38 54 -56 36 -42 49 -33 10 29 -27 20 -14 -9 8 -8 43
7734 43 -17 22 -18 27 -29 -1 26 -19 26 -52 63 -26 -7 -1 -4 -7 -34 26 -22 -12 18 -18 13 -34 -14 -33 -14 1 -25 9 -46
7765 -46 32 -46 47 -16 10 11 7 23 -11 9 -5 -5 1 -10 14 -21 1 17 -30 6 -12 7 -36 8 -31 -1 10 -20 10 -47 17 -30
7797 -30 -7 -9 -5 -8 8 5 -13 -27 7 -18 27 -39 11 -36 6 4 -23 5 -25 53 -7 11 -14 -5 -13 9 13 3 20 3 -12 -13 -28 28 -20
7832 -20 -2 1 -11 15 -46 5 -34 24 -27 24 -20 -4 -18 -9 -23 -4 11 -18 -7 1 -1 -1 -6 -9 28 -29 30 -41 27 -36 35 -22 36 1
7866 1 -9 19 -6 14 1 -5 31 -3 -3 -22 -9 -8 -35 -1 -15 33 -41 9 -29 -10 9 -12 -6 8 -29 -33 23 7 11 5 2 2 -3 2 -19 -22 -9
7903 -9 -12 26 -35 -8 3 -6 10 -16 25 -14 36 23 7 0 -20 -7 24 30 -6 -13 23 -20 -24 -35 26 -39 -3 -9 -23 21 -31 3 -18 2
7937 2 -10 18 -2 -21 19 19 24 2 -19 8 -5 26 6 1 23 9 10 -35 59 -13 38 -26 22 -11 18 21 -1 19 -14 -9 -6 -20 -15 -20 -18 -5
$$ packed form
7704bJ2J7n4M5l7L5J2q8J01r8Q2p0P9m6k6R2j10R2p8R1q2M3J9n6M7l4NJ7j6N1
7734D3o0L9m0M5n6K8K7m5M5p8J15q9J9Ollk7O0m8J0L0l6L1m7K0j9J9J5k6L4n5
7765d6P8p8R3o3K6JmJ6l4K0j4%Oj1K4l5K2J6m7L6j8J9m3M4l9L0J1l0L0n7O4m7
7797c0K3kMlJ6lj8j4L4k5M5o6N0m7M2kk7K8l0P8o0J8k5RqK2Mj0J7j7j5jj5N6m8
7832b0J8Lj2K6o1N1l9N8n1N1m4J6j4Rj4J9J5k9J1Qk%nlL7n7N9p1O8o3P1n7N8l5
7866Aj0K8k5K0j3oL6l4%j9J3Jk7L4j4M8p4N0l8J9J9k1OJ4l7mN6j6Mol%nNk1lJ3
7903ilL8o1K7J1rJ6k6M1l9N0j3j6pk0J3L1Ol6pL6m3mj1O1o5L6oj4M4n2L4k1K0
7937Bj2K8k0j9M0%Nk2k1K7j3L1k0nK2j4Jm5R4p2N1o4M8l3K9Lk2K0l3NLj4NnKJ3
$$ plain form
7973 -5 32 -4 -41 33 -33 25 -31 17 -28 1 4 -14 18 -8 6 4 16 1 27 28 2 13 -13 -13 -5 21 -2 -52 57 -20 32 6 18
8006 18 -5 -18 17 -21 14 -24 10 -13 11 3 -20 24 2 3 -13 -23 37 2 44 -12 5 -4 -6 29 -20 34 -27 35 -10 42 9 -9
8038 -9 42 -40 19 -27 12 -3 -12 24 -32 47 10 -24 -13 -19 18 -38 15 -47 20 -16 4 9 -24 14 -42 6 -17 19 -11 -6 12 -45 23
8071 23 6 -3 34 -43 56 -28 22 -9 26 11 -11 -3 -56 48 -52 50 -27 23 13 -52 31 -41 18 1 -13 34 -55 5 -43 -3
8101 -3 -13 -8 12 -16 23 -58 37 -34 39 14 3 27 -57 28 -9 -3 3 -29 25 -50 49 -39 18 0 -11 35 -52 52 -82 21 -38
8132 -38 16 13 -15 37 -28 34 -29 4 -9 -40 23 -56 8 -33 4 -21 -25 46 -45 40 -58 33 -14 14 -7 -53 65 -31 37 -10 12
8163 12 33 -23 66 -19 1 0 -28 36 -33 55 -54 39 -10 4 6 -13 21 -46 62 -74 -3 -22 -36 40 -51 48 -38 4
$$ packed form
7973eL7l6l7P4o6N8n6M8m5K9Lj8L2k6J4kJ2j5K6Jk6J1k6%QK6k3n0J09p7N2k6J2
8006A8k3j3L5l8L5l8L4k3K4qk3M4k2Jj6j0O0l5M2n6J7rkL5m9N4o1O2m5N2l3j8
8038iN1q2N9m6L9j5rL6n6P9l7l4J1oL7n6N3o2O7l6K0Nl3L8n6M8k3L6l0NJ8n7O8
8071B3j7rL7p7R9q4N0l1L5j5k2Qn3J04j00J02p7N0j0o5Q3p2N9j7j4M7q9O0m8M0
8101cj0NK0k8L9q1R5p1P3k5j1K4q4Q5l7OOl2N4p5R9q8N7j8j1M6q7J04j34J03n9
8132c8N4lk8N2o5O2o3L3j3l1O3p9O4m1L7k5mP1r1Q5r8R1m7K8k1m6J18r6O8m7K2
8163A2K1n6Q9q5K0jk8O4o9Q8j09R3m9J4Kj9L4o7J08j36P1j9j4P6r1R9q6M2
8191D
$$ Imaginary data points
##PAGE= N=2
##DATA TABLE= (X++(I..I)), XYDATA
$$ plain form
0 0 0 0 0 0 0 0 0 8 -8 8 -16 17 -24 32 -48 57 -73 90 -113 137 -169 202 -242 287 -343 405 -472 550 -638
29 -638 739 -848 971 -1109 1262 -1430 1615 -1822 2049 -2298 2569 -2868 3194 -3552 3939 -4366
45 -4366 4829 -5335 5888 -6489 7148 -7873 8667 -9539 10506 -11579 12778 -14123 15645
58 15645 -17384 19390 -21736 24525 -27906 32114 -37520 44796 -55255 72027 -105829 322611
70 322611 -482163 -196062 10084 455625 -62594 -606586 541389 -181656 277539 -471345
80 -471345 268527 34611 -154837 250623 -305124 222887 -242173 351587 -123238 -296361
90 -296361 279059 -9272 185059 -555217 353803 159199 -174603 -112397 -53421 492943
100 492943 -469645 67451 62427 116409 -102024 -232900 487498 -358510 78235 -71876
$$ packed form
0@%%%%%%%Qj6J6k4L3m1N6q0J05j30J63k03K50l06L71m44N29o30P48q77J022j188
29f38J377j587J819k080K371k692L045l437L871m347M867n437O062o746P491q305
45d366R195j0164J1223j2377J3637j5021J6540j8206K0045k2085K4357k6901K9768
58A5645l3029L6774m1126M6261n2431O0020o9634Q2316j00051J27282j77856M28440
70C22611q04774K86101K06146M45541n18219n43992J147975p23045M59195p48884
80d71345P39872k33916j89448M05460n55747N28011m65060N93760m74825j73123
90b96361N75420k88331J94331p40276R09020j94604l33802O2206N8976N46364
100D92943r62588N37096n024N3982k18433j30876P20398q46008M36745j50111
$$ plain form
110 -71876 250805 -119716 -308631 449528 -195634 109325 -331607 329158 31976 -237205
120 -237205 140033 -146396 319653 -334560 188907 -83487 -24047 141749 -134946 139708
130 139708 -315240 342405 -25260 -146626 -74939 93286 326142 -449854 29405 122184
140 122184 226630 -234543 -261609 393920 -31150 -29319 -271171 238192 104960 -176965
150 -176965 50773 -129113 239940 -129453 47203 -97525 -16512 226115 -169155 31640
160 31640 -174400 289092 -32149 -183974 25706 56273 216132 -348925 90562 71267
170 71267 86784 -128546 -112600 244804 -122498 40977 -107996 129411 -30175 -81520 123596
181 123596 -93482 59210 -95055 130716 -41038 -89708 89876 -30902 75829 -141129
$$ packed form
110g1876L22681l70521j88915P58159o45162L04959m40932O60765k97182k69181
120b37205L77238k86429M66049o54213N23467k72394N9440J65796k76695K74654
130A39708m54948O57645l67665j21366P1687J68225K32856p75996M79259R2779
140A22184J04446m61173k7066O55529m25070J831k41852N09363j33232k81925
150a76965K27738j79886L69053l69393J76656j44728Q1013K42627l95270K00795
160C1640k06040M63492l21241j51825K09680L0567J59859n65057M39487j9295
170G1267J5517k15330J5946L57404l67302J63475j48973K37407j59586n1345K05116
181A23596k17078J52692j54265K25771j71754m8670J79584j20778J06731k16958
$$ plain form
191 -141129 85290 -1806 -7873 32446 -92374 84381 -56621 97945 -82028 -45889 74189
202 74189 19175 33846 -188944 115426 79229 -18222 -132649 -15336 221806 -92300 -79852
213 -79852 -65242 184903 17489 -153017 -5130 53964 134590 -149174 -41069 37306 97617
224 97617 -5867 -146340 43135 67038 69760 -134771 -54086 121942 46638 -56256 -129664
235 -129664 110569 77866 -50654 -94847 13849 136602 -54767 -64688 -21992 99381 10375
246 10375 -82414 788 23945 58587 -58191 -21128 17435 28404 5101 -51149 25722 -305
258 -305 18294 -18072 -5557 8627 -10284 24291 -16382 4763 -22071 17852 22059 -13657 -29389
271 -29389 -1863 54954 -4103 -53460 -12713 60143 29199 -66768 -39273 60918 54163 -49501
$$ packed form
191a41129K26419q7096o067M0319j24820J76755j41002J54566j79973L6139J20078
202G4189n5014J4671k22790L04370l6197r7451j14427J17313K37142l14106J2448
213g9852J4610K50145j67414j70506J47887N9094Q0626k83764J08105P8375O0311
224I7617j03484j40473J89475K3903K722k04531Q0685J76028p5304j02894p3408
235a29664K40233l2703j28520m4193J08696J22753j91369r921M2696J21373q9006
246A0375r2789Q3202K3157L4642j16778L7063L8563J0969k3303n6250P6871k6027
258c05J8599l6366J2515J4184j8911L4575m0673K1145k6834L9923M207l5716j5732
271b9389K7526N6817n9057m9357M0747P2856l0944r5967K7495J00191o755j03664
$$ plain form
283 -49501 -75056 46521 76483 -19776 -93900 4662 99002 15644 -98621 -41037 101552
294 101552 55246 -90188 -72669 76581 84341 -55280 -96005 34566 99609 -6898 -106620
305 -106620 -12231 102860 32580 -95332 -50171 85140 60669 -68489 -66952 45874 75592
316 75592 -30616 -72040 9138 69598 10245 -70188 -14904 53157 33315 -53133 -29164 37032
328 37032 30527 -25068 -27813 16151 17841 -1857 -14730 -2624 6890 7032 -3244 -3642 -2951 41
342 41 2852 13658 -9061 -22569 8899 34240 -7552 -44182 3979 50699 1265 -48629 -17563
355 -17563 52282 27137 -45363 -40769 30931 68859 -38015 -65047 10792 88914 -7725 -92401
367 -92401 2081 76049 32325 -90700 -28237 65107 50281 -47416 -78798 53990 65334 -14400
$$ packed form
283d9501k5555J21577K9962r6259p4124R8562R4340q3358j14265N7584J42589
294A01552m6306j45434J7519J49250P760j39621m0725J30571O5043j06507r9722
305a06620R4389J15091p0280j27912M5161J35311k4471j29158J537J12826K9718
316G5592j06208m1424Q1178O0460n9353q0433N5284O8061j9842q6448K3969O6196
328C7032o505n5595k745M3964J690j9698j2873J2106R514J42j0276l98O91K992
342D1K811J0806k2719j3508L1468K5341m1792l6630M8161M6720m9434m9894L1066
355a7563O9845k5145p2500M594P1700L7928j06874k7032P5839P8122r6639q4676
367i2401R4482P3968m3724j23025O2463R3344j4826r7697l1382J32788J1344p9734
$$ plain form
379 -14400 -91315 8190 95866 -7727 -66364 -40433 92423 24914 -59834 -45336 38125 78094
391 78094 -55742 -49399 7220 81116 -10111 -83606 21533 44964 24816 -75386 4659 42769
403 42769 -3846 -2926 -41344 43151 -15677 21659 -22378 -15282 34462 -20867 29030 -50188 36631
416 36631 -10804 5140 7306 -32279 37717 -35372 44233 -31447 -1314 3210 -600 47409 -74484
429 -74484 21487 3121 55756 -48996 -63401 85152 13432 -7573 -108479 85832 56214
440 56214 -58317 -39847 -2751 111963 -70998 -18403 -16074 45617 41571 -82063 17969
451 17969 -27365 101266 -49038 -56465 20191 33462 70524 -146546 34816 36487 66768 -85894
463 -85894 -77868 136516 -11232 -12443 -112835 112144 35368 -75576 -413 -12220 98193
$$ packed form
379a4400p6915R9505Q7676j03593n8637K5931J32856o7509q4748J4498Q3461L9969
391G8094j33836O343N6619P3896r1227p3495J05139K3431k0148j00202Q0045L8110
403D2769m6615R20l8418Q4495n8828L7336m4037P096M9744n5329M9897p9218Q6819
416C6631m7435J5944K166l9585O9996p3089P9605p5680L0133M524l810M8009j21893
429g4484R5971j8366N2635j04752j4405J48553p1720k1005j00906J94311k9618
440E6214j14531J8470L7096J14714j82961N2595K329O1691m046j23634J00032
451A7969m5334J28631j50304p427P6656J3271L7062k17070J81362J671L0281j52662
463h5894Q026K14384j47748j211j00392K24979p6776j10944P5163j1807J10413
$$ plain form
474 98193 -96895 32180 -8505 -978 32882 -45945 52145 -88900 89460 -12890 -32534
485 -32534 -3182 -2376 90046 -120590 47960 -3199 33813 -31429 -44855 102296 -82950 39347
497 39347 -39047 67568 -41804 -57690 114366 -56085 13628 -91604 136511 -14939 -97968
508 -97968 39485 17467 86151 -168027 71173 28945 8914 -33855 -52452 113288 -84419
519 -84419 62475 -56594 11827 16001 -3779 55775 -142863 97067 17123 15511 -98313
530 -98313 -10236 168847 -102238 -29316 -52881 166558 -38516 -131665 74664 25136 64212
541 64212 -167141 86732 28360 -23578 2295 -52183 98673 -102382 90982 -46468 -15261
552 -15261 17404 -690 74397 -158605 100508 5425 21133 -84874 -582 135423 -118490
$$ packed form
474I8193j95088J29075m0685P527L3860p8827R8090j41045J78360j02350j9644
485c2534K9352Q06R2422k10636J68550n1159L7012o5242j3426J47151j85246J22297
497C9347p8394J06615j09372j5886J72056j70451O9713j05232K28115j51450q3029
508i7968J37453k2018O8684k54178K39200m2228k0031m2769j8597J65740j97707
519h4419J46894j19069O8421M174j9780N9554j98638K39930p9944j612j13824
530i8313Q8077J79083k71085P2922k3565K19439k05074r3149K06329m9528L9076
541F4212k31353K53873n8372n1938K5873n4478J50856k01055J93364j37450L1207
552a5261L2665j8094P5087k33002K59113r5083J5708j06007Q4292J36005k53913
$$ plain form
563 -118490 21850 -32323 104201 -71597 -46256 97279 -51680 24097 -76416 117662
573 117662 -47139 -63968 68245 -1820 32690 -137513 121803 9761 -50952 -14728 -233
584 -233 107221 -131676 57062 -19574 31229 -8293 -40663 74188 -101193 96886 -38179
595 -38179 11198 -51764 21753 110784 -141794 24902 -3425 124434 -115091 -65453 119361
606 119361 -143 -4453 -135137 141443 2673 -43986 -27295 6918 90348 -100705 47189
617 47189 -35162 29939 8570 -24814 27974 -76060 100017 -29849 -20537 -27138 32367 74469
629 74469 -120977 34133 6115 67132 -75478 -38490 98617 -40059 9775 -67694 96149
640 96149 -34035 -35516 43266 -22682 35041 -79356 90811 -36473 -17318 7835 6045 45452
$$ packed form
563a18490J40340n4173J36524j75798K5341J43535j48959P5777j00513J94078
573A17662j64801j6829J32213p0065L4510j70203K59316j12042o0713L6224J4495
584b33J07454k38897J88738p6636N0803l9522l2370J14851j75381J98079j35065
595c8179M9377o2962P3517Q9031k52578J66696k8327J27859k39525M9638J84814
606A19361j19504m310j30684K76580j38770m6659J6691L4213Q3430j91053J47894
617D7189q2351O5101k1369l3384N2788j04034J76077j29866R312o601N9505M2102
629G4469j95446J55110k8018O1017j42610L6988J37107j38676M9834p7469J63843
640I6149j30184j481P8782o5948N7723j14397J70167j27284J9155K5153j790L9407
$$ plain form
652 45452 -96843 67172 -17377 25007 -37362 -4329 48711 -51178 45607 -44496 27716 -16495
664 -16495 18417 14514 -63924 45864 2991 25100 -69426 4950 76737 -30944 -31551 -36395
676 -36395 102109 -19505 -63506 8706 35781 41072 -88518 23879 10602 30588 -20222
687 -20222 -42356 40859 -9148 40062 -62550 6978 24303 15759 -7155 -65853 64166 4924
699 4924 3229 -59545 23337 53864 -36147 -14307 -20235 66425 -25052 -25089 2442 20038 15598
712 15598 -42451 20637 -1718 7128 -5001 -5679 8748 -15122 23964 -13443 -3792 2056 1855
725 1855 11215 -20273 14864 -13380 12045 1785 -8039 396 -9844 28867 -16054 -6350 -8414
738 -8414 21311 12634 -33864 850 10029 31104 -32140 -20795 22015 25143 -8573 -46652 25293
$$ packed form
652D5452j42295J64015q4549M2384o2369L3033N3040r9889R6785r0103P2212m4211
664a6495L4912l903p8438J09788m2873K2109r4526P4376P1787j07681o07m844
676c6395J38504j21614m4001P2212K7075N291j29590J12397j3277J9986n0810
687b0222k2134Q3215n0007M9210j02612O9528J7325q544k2914n8698J30019n9242
699D924j695o2774Q2882L0527r0011K1840n928Q6660r1477l7K7531J7596m440
712A5598n8049O3088k2355Q846j2129o78J4427k3870L9086l7407R651N848k01
725A855R360l1488L5137k8244K5425j0260r824Q435j0240L8711m4921R704k064
738h414K9725q677m6498L4714R179K1075o3244J1345M2810L128l3716l8079P1945
$$ plain form
751 25293 27586 -1247 -40916 1472 37533 2682 -25040 -23298 31846 23744 -21829 -34017 17710
764 17710 40496 -15394 -39476 8044 37352 2425 -38685 -5710 30353 16428 -27143 -23293
776 -23293 24931 23167 -14437 -30046 12787 27310 -5890 -25854 236 24164 2102 -18421
788 -18421 -6065 13608 8679 -9065 -9876 4875 10663 -2693 -9521 1622 7678 -3486 -1151
801 -1151 1390 -630 -4360 6052 5199 -10531 -2132 4950 11228 -10722 -7469 2384 14398 725
815 725 -19848 -852 16883 11835 -24512 -11233 20443 17619 -18323 -23527 17247 24152 -9780
828 -9780 -27876 3159 31044 1152 -28080 -11871 30336 16811 -28527 -20471 22457 27675 -21258
841 -21258 -26372 12093 29100 -5088 -30061 -1096 28208 9024 -27459 -14495 26069 16442
$$ packed form
751B5293K293k8833l9669M2388L6061l4851k7722J742N5144q102m5573j2188N1727
764A7710K2786n5890k4082M7520K9308l4927m1110L2975L6063j3925m3571L850
776b3293M8224j764l7604j5609M2833J4523l3200j9964K6090K3928k2062k0523
788a8421J2356J9673m929j7744q11J4751N788j3356o828J1143O056j1164K335
801a151K541k020l730J0412q53j5730Q399P082O278k1950L253R853J2014j3673
815G25k0573J8996J7735n048l6347J3279L1676k824l5942n204M0774O905l3932
828i780j8096L1035K7885k9892k9232J6209M2207j3525m5338Q056M2928N218m8933
841b1258n114L8465J7007l4188k4973K8965K9304j9184l6483J2964M0564r627
$$ plain form
853 16442 -20029 -20921 16943 20896 -11307 -20154 4365 21154 -1358 -17602 -4131 16316 6064
866 6064 -12369 -9115 11340 6696 -5364 -8726 5141 5357 -3007 -822 -2518 3365 -2347 4396
880 4396 -1942 -3585 829 1703 6177 -7560 -3525 2465 8824 328 -16997 5509 9849 7466 -20253
895 -20253 -5648 20260 5507 -10998 -22502 24219 12507 -10583 -22738 8052 30817 -14698
907 -14698 -18066 -5210 31703 1016 -27115 -2403 13805 23038 -27554 -10825 9663 21272
919 21272 -2485 -34351 13930 14832 13504 -34198 -6041 29788 4299 -13387 -28335 34181 8481
932 8481 -14970 -15861 7680 28667 -25224 -483 -4754 18351 -2768 -15119 11642 -11570 21574
945 21574 -17622 5879 -6996 5181 13581 -23549 13163 -10181 21002 -17999 -1639 12448
$$ packed form
853A6442l6471q92L7864L953l2203q847K4519J6789k2512j6244J3471K0447j0252
866F064j8433L254K0455m644j2060l362J3867K16q364K185j696N883n712O743
880D396o338j643M414Q74M474j3737M035N990O359q496j7325K2506M340k383k7719
895b0253J4605K5908j4753j6505j1504M6721j1712k3090j2155L0790K2765m5515
907a4698l368J2856L6913l0687k8131K4712J6208R233n0592J6729K0488J1609
919B1272k3757l1866M8281R02j328m7702K8157L5829k5489j7686j4948O2516k5700
932H481k3451q91K3541K0987n3891K4741m271K3105k1119j2351K6761k3212L3144
945B1574l9196K3501j2875J2177Q400l7130L6712k3344L1183l9001J6360J4087
$$ plain form
957 12448 -10489 11238 -17640 22035 -17687 1734 11904 -6994 2971 -23707 38260 -12191
969 -12191 -12841 -5465 17775 19972 -47305 17051 6835 18856 -29021 -10124 32453 -12532 8753
982 8753 -29715 24117 217 -1359 1602 -26419 33853 -10641 12412 -35781 13306 33622 -24368
995 -24368 -7998 -20042 60421 -26013 -24333 3475 25263 16273 -58275 28088 7237 13382 -29976
1008 -29976 -3105 32775 -24940 16143 -21778 19528 -10954 5196 12396 -33767 27425 -9378
1020 -9378 19796 -34592 8104 28599 -23096 4079 -20930 45158 -28026 -7427 13874 -1509
1032 -1509 9373 -36017 44856 -21416 -3751 -101 10985 12416 -49439 42698 -6103 5909
1044 5909 -32564 15992 33950 -41844 11607 -11368 36997 -30482 -2593 17029 -15800 21034
$$ packed form
957A2448k2937K1727k8878L9675l9722J9421J0170j8898R965k6678O1967n0451
969a2191o50P376K3240K197o7277O4356j0216J2021m7877J8897M2577m4985K1285
982H753l8468N3832k3900j576K961k8021O0272m4494K3053m8193M9087K0316n7990
995b4368J6370j2044Q0463q6434J680K7808K1788q990p4548Q6363k0851O145m3358
1008b9976K6871L5880n7715M1083l7921M1306l0482J6150P200m6163O1192l6803
1020i378K9174n4388M2696K0495n1695K7175k5009O6088p3184K0599K1301j5383
1032a509J0882m5390Q0873o6272J7665L650J1086J431o1855R2137m8801J2012
1044E909l8473M8556J7958p5794N3451k2975M8365o7479K7889J9622l2829L6834
$$ plain form
1056 21034 -23687 21447 -25614 17419 15438 -29233 6678 -7199 45451 -43923 -10129 24458
1068 24458 13866 -7170 -50846 55284 -1145 -8786 -28333 18953 33543 -43736 14116 -11823
1080 -11823 30612 -22712 -2527 15360 -22556 28236 -21495 18041 -29396 21281 17631 -33622
1092 -33622 9040 -5133 39950 -45792 2476 20684 421 -4910 -28379 44199 -19045 -2405
1104 -2405 -5052 11146 8228 -32509 31855 -11271 3027 -15273 14876 15131 -36766 21327 -4675
1117 -4675 19134 -30389 5548 22007 -18749 9573 -19663 29355 -21725 7797 5425 -16232
1129 -16232 14834 -10381 24677 -37629 13629 17526 -6820 -11071 -17312 48286 -22860 -9914
1141 -9914 -9088 27660 8001 -39606 16712 3942 18886 -30980 2206 17113 -6799 6329
$$ packed form
1056B1034m4721M5134m7061M3033j981m4671L5911j3877N2650q9374L3794L4587
1068B4458j0592k1036m3676J06130n6429p641j9547M7286J4590p7279N7852k5939
1080a1823M2435n3324K0185J7887l7916N0792m9731L9536m7437N0677l650n1253
1092c3622M2662j4173M5083q5742M8268J8208k0263n331k3469P2578o3244J6640
1104b405k647J6198k918m0737O4364m3126J4298j8300L0149K55n1897N8093k6002
1117d675K3809m9523L5937J6459m0756K8322k9236M9018n1080K9522k372k1657
1129a6232L1066k5215L5058o2306N1258L897k4346m251o241O5598p1146J2946
1141i914Q26L6748j9659m7607N6318j2770J4944m9866L3186J4907k3912J3128
$$ plain form
1153 6329 -20007 17090 -6533 8990 -3539 -17548 19674 -3205 9944 -29315 13437 18347
1165 18347 -12961 -6966 -9938 36357 -22079 -5835 1546 11503 3299 -24057 20595 -8854 9725
1178 9725 -12514 5049 6180 -13034 13915 -10911 11000 -14966 10445 4315 -10998 5382
1190 5382 -5793 15305 -15796 5834 -538 -350 4761 -7518 6756 -10128 11195 80 -7536
1203 -7536 -1149 2363 15071 -18170 -3213 8853 9174 -6895 -18226 18858 2786 -434 -16981
1216 -16981 6260 15184 -7693 -5159 -9183 20528 -3522 -6931 -5991 5908 12953 -12321 -3224
1229 -3224 -3455 17280 -3265 -13683 1145 9647 8398 -18692 191 8099 8204 -10051 -8944 10619
1243 10619 4864 -2922 -10455 5595 6448 -2022 -5155 -1526 6162 1265 -4267 -1698 1536 4745 -4122
$$ packed form
1153F329k6336L7097k3623J5523j2529j4009L7222k2879J3149l9259M2752M910
1165A8347l1308N995k972M6295n8436J6244P381R957q204k7356M4652k9449J8579
1178I725k2239J7563J131j9214K6949k4826K1911k5966K5411o130j5313J6380
1190E382j1175K1098l1101K1630o372J88N111j2279J4274j6884K1323j1115p616
1203g536O387L512J2708l3241J4957J2066L21j6069j1331L7084j6072l220j6547
1216a6981K3241Q924k2877K534m024K9711k4050l409R40J1899P045k5274R097
1229c224k31K0735k0545j0418J4828Q502j249k7090J8883P908J05j8255J107J9563
1243A0619n755p786p533J6050Q53q470l133L629P688m897n532K569L234L209q867
$$ plain form
1258 -4122 -603 53 1527 1062 -2689 1900 -2551 3185 -1722 1808 -1962 -1657 3154 1294 -1174 -5604
1274 -5604 4741 3625 -1924 -6006 1365 7261 -693 -6748 -2722 9219 2694 -7712 -5634 8108
1288 8108 6577 -6518 -7834 3692 11006 -3956 -9393 -1221 13095 411 -10701 -3755 9958
1301 9958 6790 -10646 -5754 5483 10792 -6884 -9115 3130 10096 -714 -10718 -292 8749
1314 8749 3604 -8544 -5261 8014 5665 -5966 -6634 4465 7195 -3884 -4957 -116 6616 60
1328 60 -5127 -1180 3682 3187 -4839 -987 1917 1743 -1051 -1896 1719 -1079 1543 -840 393 -1035
1344 -1035 -619 2774 -822 -500 -3203 3812 1489 -1640 -3862 1409 5699 -1693 -5448 -577 7606
1359 7606 561 -7144 -2170 7086 3386 -5868 -5606 5429 6590 -3289 -8862 2485 9821 -1317
$$ packed form
1258d122L519O56J474m65l751M589m451N736m907L530l770L05M811j860k468m430
1274e604J0345j116n549m082P371N896p954o055M026J1941o525j0406K078J3742
1288H108j531j3095j316J1526P314j4962n437Q172J4316j2684j1112O946J3713
1301I958l168j7436M892J1237N309j7676k231J2245O966j0810j0004J0426R041
1314H749n145j2148L283J3275k349j1631o68J1099K730j1079j073M841O732o556
1328F0n187L947M862m95q026L852K904j74k794q45L615k798K622k383J233j428
1344a035M16L393l596L22k703P015k323l129k222N271M290p392l755M871Q183
1359G606p045p705M974R256l700r254K62J1035J161r879n573J1347P336j1138
$$ plain form
1373 -1317 -9723 -870 10093 2158 -9053 -3887 7389 6228 -6411 -7584 4993 7919 -1975 -10250
1387 -10250 2049 8686 841 -8857 -2625 9078 2227 -5944 -4886 5660 5144 -4522 -4118 835
1401 835 6792 -1809 -5129 684 3317 2505 -6162 1738 423 2173 -1345 -1882 1806 -1469 3787 -3924
1417 -3924 1057 -90 579 920 -2651 3053 -3818 3104 417 -1160 -1433 -1536 8015 -5624 -1304 -1611
1433 -1611 7018 374 -9077 3380 2103 6562 -10910 -598 6198 2647 -2909 -9467 10097 1162
1447 1162 -800 -6690 793 8712 -4362 109 -7887 9001 2953 -4807 -4374 -648 14715 -9817
1461 -9817 -4331 -697 11391 -663 -14026 7023 2897 5850 -13126 1904 7553 -2093 96
1474 96 -8743 11195 -4358 1738 -2714 -1674 6444 -6064 7399 -10808 6864 784 -501 -1811
$$ packed form
1373a317q406Q853J0963p935j1211N166J1276j161j2639j173J2577K926r894q275
1387a0250J2299O637p845r698O232J1703o851q171J058J0546n16r666M04M953
1401H35N957q601l320N813K633q12q667P900j315J750l518n37L688l275N256p711
1417c924M981j147O69L41l571N704o871O922k687j577k73j03R551j3639M320l07
1433a611Q629o644r451J2457j277M459j7472J0312O796l551n556o558J9564q935
1447A162j962n890P483P919j3074M471p996J6888o048p760M33L726J5363k4532
1461i817N486L634J2088j2054j3363K1049m126K953j8976J5030N649r646K189
1474I6q839J9938j5553O096m452J040Q118j2508J3463j8207J7672o080j285j310
$$ plain form
1488 -1811 -5374 13376 -9511 2041 -3081 6256 -879 -8155 10527 -6305 3499 -5998 7747
1501 7747 -628 -9752 9694 -2499 4773 -13419 8830 5597 -7446 -362 -3897 15426 -12235
1514 -12235 203 515 3726 2688 -11293 10136 -7280 8020 -4198 -1920 1292 -2602 13452
1527 13452 -16291 3522 996 9858 -7640 -12680 17563 -1976 656 -16401 14410 6005 -10775
1540 -10775 -355 -1731 14913 -14135 2447 856 1148 3143 -8621 9354 -9910 8964 -2050
1553 -2050 -2876 452 -2884 13695 -15390 3865 507 6906 -5178 -9796 15962 -6983 2237 -8765
1567 -8765 10692 -211 -10036 9403 -4635 6454 -12564 10752 923 -8182 3786 -1649 11105
1580 11105 -16957 7338 2634 177 -2884 -5842 13673 -10203 4832 -4646 3671 546 -4454
$$ packed form
1488a811l563J8750k2887J1552n122R337p135p276J8682j6832R804r497J3745
1501G747q375r124J9446j2193P272j8192K2249l233j3043P084l535J9323k7661
1514a2235J2438L12L211j038j3981K1429j7416J5300j2218K278L212l894J6054
1527A3452k9743J9813k526Q862j7498n040L0243j9539K632j7057L0811q405j6780
1540a0775J0420j376J6644k9048J6582j591K92J995j1764J7975j9264J8874j1014
1553b050q26L328l336J6579k9085J9255l358O399j2084m618K5758k2945R220j1002
1567h765J9457j0903r825J9439j4038J1089j9018K3316r829r105J1968n435J2754
1580A1105k8062K4295m704k457l061k958J9515k3876J5035r478Q317l125n000
$$ plain form
1593 -4454 8460 -11271 7130 -1405 4142 -6422 -4992 15723 -7962 -1402 -7666 15546 -1149
1606 -1149 -13421 5984 2182 8936 -17666 6146 4909 -428 -2041 -7110 12612 -8248 5272
1619 5272 -4839 623 2904 -2716 6864 -13116 8905 284 1560 -6560 -2050 13530 -9201 137
1633 137 -4571 11279 -3296 -8244 6857 -891 3946 -9880 7282 532 -4216 2911 -2459 5955
1647 5955 -9274 6362 324 -2268 -59 -2497 9283 -9698 3557 -1262 3419 -1387 -4433 7150
1661 7150 -6634 5757 -3857 2221 -2596 127 6926 -8688 2489 -1377 7768 -5958 -5305 7205
1675 7205 721 837 -10557 8177 2976 -3006 -3679 -485 8655 -5647 -450 -2121 4190 1731 -4961
1690 -4961 1527 -2084 5965 -2795 -2616 180 1923 4914 -8735 1702 2031 4333 -5385 -3782 7264
$$ packed form
1593d454J2914j9731J8401q535N547j0564J430K0715k3685O560o264K3212j6695
1606a149j2272J9405l802O754k6602K3812j237n337j613n069J9722k0860J3520
1619E272j0111N462K281n620R580j9980K2021q621J276q120M510J5580k2731R338
1633A37m708J5850j4575m948J5101p748M837j3826J7162o750m748P127n370Q414
1647E955j5229J5636o038k592K209k438J1780j8981J3255m819M681m806l046J1583
1661G150j3784J2391r614O078m817K723O799j5614J1177l866R145j3726O53J2510
1675G205o484J16j1394J8734n201n982o73L194R140j4302N197j671O311k459o692
1690d961O488l611Q049q760J79K796J743K991j3649J0437L29K302r718J603J1046
$$ plain form
1705 7264 -1187 244 -6099 5707 756 -1910 -859 -1104 4989 -4109 1602 -1663 1551 415 -1601
1720 -1601 1965 -3117 3186 -1412 602 -900 -335 2158 -2088 1400 -1790 1420 -203 -182 648 -2117
1736 -2117 1619 654 148 -2484 -53 4145 -1969 -1881 -872 4203 -139 -3665 214 1527 3495 -4643
1752 -4643 -976 1544 3541 -2051 -4093 2564 2305 740 -4914 561 3169 1306 -3193 -2620 3778
1767 3778 1989 -1941 -3705 2121 3585 -1298 -3662 229 4157 -254 -3313 -733 3141 810 -2022
1782 -2022 -1883 1845 1965 -1019 -2409 597 2771 -946 -1645 -289 2262 -493 -802 -506 786 551
1798 551 -540 -346 -27 620 -330 122 -177 -85 -258 861 -211 -458 -754 1279 604 -1160 -949 784
1816 784 1942 -1634 -1137 216 2195 -290 -2202 -115 1691 1828 -3095 -1171 2120 2211 -2083 -2855
$$ packed form
1705G264q451J431o343J1806m951k666J051k45O093r098N711l265L214j136k016
1720a601L566n082O303m598K014j502N65K493m246L488l190L210j623K1Q30k765
1736b117L736r65n06k632K431M198o114Q8J009N075m342l526L879J313J968q138
1752d643L667K520J997n592k042O657k59j565n654N475K608j863m499N73O398
1767C778j789l930j764N826J464m883k364L891L928m411l059K580L874k331k832
1782b022J39L728J20k984j390L006K174l717o99J356K551k755l09K96J292k35
1798E51j091J94L19O47r50M52k99R2j73J119j072k47k96K033o75j764K11J733
1816G84J158l576M97J353J979k485j912K087J806J37m923J924L291R1m294p72
$$ plain form
1832 -2855 2492 1809 -319 -3517 887 2762 371 -2860 -1408 3550 1027 -2329 -2373 2561 2255 -1809
1848 -1809 -2619 1154 2845 -549 -2949 241 2386 796 -2490 -1034 2033 1294 -1331 -2183 1762 1354
1864 1354 -615 -1830 559 1468 -287 -842 -609 1109 471 -647 -613 448 675 -634 -38 69 35 -82
1882 -82 295 39 -573 47 557 340 -931 -292 597 1125 -1191 -784 371 1677 -578 -1802 373 1576
1900 1576 805 -2751 -138 1797 1297 -2104 -1541 2049 1307 -877 -2418 950 2400 -520 -2020 -790
1916 -790 3056 234 -2050 -1168 1690 2269 -2402 -1194 371 3011 -1051 -2623 876 1832 860 -3348
1932 -3348 389 1825 618 -1492 -1648 2627 -177 -202 -1604 883 1251 -1181 516 -1624 2057 -720
1948 -720 190 -740 -160 1832 -1654 780 -1250 1599 -428 -865 1067 -978 1302 -1636 1645 -622
$$ packed form
1832b855N347o83k128l198M404J875k391l231J452M958k523l356m4M934l06m064
1848a809q10L773J691l394k400L190K145j590l286J456L067p39k625q52L945m08
1864A354j969j215K389R09j755n55K33J718o38j118L4J061K27j309N96J07l4j17
1882h2L77k56o12O20N10k17j271O39Q89N28k316M07J155J306k255j224K175J203
1900A576p71l556K613J935n00l401N63L590p42k184j541L368J450k920j500J230
1916g90L846k822k284Q82K858N79m671J208J565K640m062j572L499R56r72m208
1932c348L737J436j207k110j56M275k804k5j402K487L68k432J697k140L681k777
1948g20R10r30N80J992l486K434k030K849k027m37J932k045K280k938L281k267
$$ plain form
1964 -622 -1011 1303 -425 1262 -3263 2376 583 -552 -1233 -471 3731 -2700 -99 -939 2632 -172
1980 -172 -2697 1587 -477 2233 -2675 280 462 182 1541 -3416 1711 -447 2541 -2454 -1991 3318
1996 3318 -105 408 -4734 3994 1255 -1698 -1607 -37 4567 -3873 249 -510 2229 -184 -2700 2601
2012 2601 -1934 2546 -2212 828 -283 -473 2713 -3445 1758 -1433 3033 -1938 -1777 2809 -925
2027 -925 1142 -3665 3474 -310 -1502 670 -470 2348 -3950 2796 -219 -709 -315 -328 3414 -4460
2043 -4460 1844 -217 1759 -1750 -1798 3879 -2204 1276 -2770 2829 -336 -1364 1634 -2209 2659
2058 2659 -2215 2277 -2063 -580 2888 -1680 594 -3419 4982 -989 -2330 -26 1370 2895 -5615
2073 -5615 2058 756 1394 -2280 -1413 3751 -2077 1034 -2158 1903 3 -1094 1722 -2641 2388
$$ packed form
1964f22l89K314j728J687m525N639j793j135o81P62M202o431K601q40L571k804
1980a72k525M284k064K710m908K955J82k80J359m957N127k158K988m995M63N309
1996C318l423N13n142Q728k739k953R1J570M604q440M122p59K739k413k516N301
2012B601m535M480m758L040j111j90L186o158N203l191M466m971J61M586l734
2027i25K067m807P139l784j192K172j140K818o298O746l015m90L94j3L742p874
2043d460O304k061J976l509m8N677o083L480m046N599l165j028K998l843M868
2058B659m874M492m340J483L468m568K274m013Q401n971j341K304J396J525q510
2073e615P673j302O38l674Q67N164n828L111l192M061j900j097K816m363N029
$$ plain form
2088 2388 -1376 1754 -1880 -789 3205 -1909 580 -2745 4156 -1077 -1981 972 218 2042 -4253
2103 -4253 2751 -116 -125 -636 -394 2669 -3593 2159 -615 897 -1442 -338 2906 -2911 1221 -1357
2119 -1357 2468 -1412 -1033 1770 -1176 1494 -2267 1887 -863 -222 1308 -1478 1015 -1676 2835
2134 2835 -1438 -1456 1410 435 1039 -4067 2815 675 -347 -1784 -95 3425 -2708 382 -1008 2227
2150 2227 -646 -1340 1202 -1183 2019 -1751 686 -819 595 1263 -2213 939 -748 2280 -1828
2165 -1828 -831 1287 336 325 -2687 2223 116 -449 -863 279 1631 -1863 758 -355 618 -351 -472
2182 -472 1197 -1397 1030 -618 752 -657 -351 1299 -1180 782 -1127 1210 -584 -125 400 -744
2198 -744 933 -852 892 -934 147 635 -295 85 -1175 1620 -207 -641 -520 728 1072 -1701 191
$$ packed form
2088B388l764L130l634J091L994n114K489l325O901n233r04K953p54J824o295
2103d253P004k867rn11K42L063o262N752k774J512k339J104L244n817M132k578
2119a357L825l880L79K803k946K670l761M154k750O41J530k786K493k691M511
2134B835m273j8K866r75O04n106O882k140j022j437J689L520o133L090j390L235
2150B227k873o94K542k385L202l770K437j505J414O68l476L152j687L028m108
2165a828R97K118r51j1l012M910k107n65m14J142J352l494K621j113R73r69j21
2182d72J669k594K427j648J370j409L06J650k479J962j909K337j794M59N25j144
2198g44J677j785J744j826J081M88r30L80j260K795j827m34J21J248L44k773J892
$$ plain form
2215 191 267 1037 -874 -734 792 263 273 -1210 375 565 90 -340 -864 1041 149 -143 -920 227 1236
2234 1236 -701 -344 -475 1388 -295 -728 -159 520 759 -1188 52 227 687 -592 -425 472 109 164
2252 164 -540 139 223 140 -179 -371 420 -15 -33 -214 81 156 -101 62 -101 95 -20 47 108 -215 -39 206
2274 206 139 -165 -366 425 83 -5 -509 161 411 -48 -436 -220 679 19 -383 -411 537 304 -282 -535 264
2295 264 600 -141 -711 42 718 -35 -580 -303 710 207 -391 -496 459 559 -404 -460 141 678 -170 -457
2315 -457 -43 427 277 -601 -76 255 462 -418 -323 301 248 1 -482 205 167 108 -330 -39 277 39 -135
2336 -135 -58 83 99 -95 -23 -61 87 9 -62 133 -223 104 -48 268 -293 -21 190 77 -32 -306 240 133
$$ packed form
2215A91P6P70j911J40J526n29J0j483J585J90m75m30n24J905q92k92p77J147J009
2234A236j937L57j31J863j683m33N69O79K39j947J240J75M60j279J67Q97l63N5
2252A64p04O79Q4q3l19j92P91m35j8j81K95P5k57J63j63J96j15O7O1l23J76K45
2274B06o7l04k01P91l42q8n04O70K50m59l88K16Q99o60m02k8R48k33n86k53P99
2295B64L36p41n70P53O76p53n45K77J013n03n98j05R55J00r63n6O01N37q48k87
2315d57M14M70j50q78N25L31K07q80R5O24n3k47m83O87l8n9m38K91L16k38j74
2336a35P7J41J6j94P2l8J48p8p1J95l56L27j52L16n61K72K11j13j09k74N46j07
$$ [...]
8191B0
##END NTUPLES=NMR FID
##END=
