##TITLE=1H_3d1411A
 aceton-d6
 8 sc, 
 15.11.2022
##JCAMPDX= 6.0         $$ Bruker NMR JCAMP-DX V2.0
##DATA TYPE= NMR FID
##DATA CLASS= NTUPLES
##ORIGIN= UXNMR, Bruker Analytische Messtechnik GmbH
##OWNER= root
$$ XWIN-NMR		Version 3.5
$$ Tue Nov 15 14:42:32 2022 Russian Standard Time (UT+4h)  she@DPX200
##.OBSERVE FREQUENCY= 200.1313499994
##.OBSERVE NUCLEUS= ^1H
##.DELAY= (6, 6)
##.ACQUISITION MODE= SIMULTANEOUS
##.ACQUISITION SCHEME= undefined
##.AVERAGES= 8
##.DIGITISER RES= 18
##SPECTROMETER/DATA SYSTEM= spect
##.PULSE SEQUENCE= zg30
##.SOLVENT NAME= Acetone
##.SHIFT REFERENCE= (INTERNAL, Acetone, 0, 15.7039)
##AUDIT TRAIL= $$ (NUMBER, WHEN, WHO, WHERE, WHAT)
$$ ##TITLE= Audit trail, XWIN-NMR		Version 3.5
$$ ##JCAMPDX= 5.01
$$ ##ORIGIN= Bruker BioSpin GmbH
$$ ##OWNER= she
$$ F:/spectra/data/she/nmr/H-F/1/audita.txt
$$ ##AUDIT TRAIL=  $$ (NUMBER, WHEN, WHO, WHERE, WHAT)
(   1,<2022-11-15 14:40:33.43 +0400>,<she>,<DPX200>,
      <created by zg, POWCHK disabled, PULCHK disabled
       configuration hash MD5:
       00 E9 B6 7A A2 85 ED C7 34 08 36 98 17 FE 4E 26
       data hash MD5: 16K
       72 8D 45 39 95 91 1D 2B CF E6 99 12 82 74 2B 99>)
$$ ##END=
$$ 
$$ hash MD5
$$ 63 A9 78 3F 38 6C C7 E6 27 18 96 2D 44 5D DD 25
##$RELAX= 
##$RELAX= 
##$RELAX= 
##$RELAX= 
##$RELAX= 
##$RELAX= 
$$ Bruker specific parameters
$$ --------------------------
##$DU= <F:/spectra>
##$EXPNO= 1
##$NAME= <H-F>
##$PROCNO= 1
##$TYPE= <nmr>
##$USER= <she>
##$AMP= (0..31)
100 100 100 100 100 100 100 100 100 100 100 100 100 100 100 100 100 100 
100 100 100 100 100 100 100 100 100 100 100 100 100 100 
##$AQSEQ= 0
##$AQ_mod= 1
##$AUNM= <au_zg>
##$AUTOPOS= <>
##$BF1= 200.13
##$BF2= 200.13
##$BF3= 200.13
##$BF4= 200.13
##$BF5= 200.13
##$BF6= 200.13
##$BF7= 200.13
##$BF8= 200.13
##$BYTORDA= 1
##$CFDGTYP= 0
##$CFRGTYP= 5
##$CHEMSTR= <none>
##$CNST= (0..31)
1 1 145 1 1 1 1 1 1 1 1 1 1 1 1 1 1 1 1 1 1 1 1 1 1 1 1 1 1 1 1 1 
##$CPDPRG= <>
##$CPDPRG1= <>
##$CPDPRG2= <>
##$CPDPRG3= <>
##$CPDPRG4= <mlev>
##$CPDPRG5= <mlev>
##$CPDPRG6= <mlev>
##$CPDPRG7= <mlev>
##$CPDPRG8= <mlev>
##$CPDPRGB= <>
##$CPDPRGT= <>
##$D= (0..31)
0 1.2 0 0 0 0 0 0 0 0.06 0 0.03 0 0 0 0 0.0002 0 0 0 0 0 0 0 0 0 0 0 0 
0 0 0 
##$DATE= 1668508833
##$DBL= (0..7)
120 120 120 120 120 120 120 120 
##$DBP= (0..7)
150 150 150 150 150 150 150 150 
##$DBP07= 0
##$DBPNAM0= <>
##$DBPNAM1= <>
##$DBPNAM2= <>
##$DBPNAM3= <>
##$DBPNAM4= <>
##$DBPNAM5= <>
##$DBPNAM6= <>
##$DBPNAM7= <>
##$DBPOAL= (0..7)
0.5 0.5 0.5 0.5 0.5 0.5 0.5 0.5 
##$DBPOFFS= (0..7)
0 0 0 0 0 0 0 0 
##$DE= 6
##$DECBNUC= <off>
##$DECIM= 32
##$DECNUC= <off>
##$DECSTAT= 4
##$DIGMOD= 1
##$DIGTYP= 9
##$DL= (0..7)
0 120 120 120 120 120 120 120 
##$DP= (0..7)
150 150 150 150 150 150 150 150 
##$DP07= 0
##$DPNAME0= <>
##$DPNAME1= <>
##$DPNAME2= <>
##$DPNAME3= <>
##$DPNAME4= <>
##$DPNAME5= <>
##$DPNAME6= <>
##$DPNAME7= <>
##$DPOAL= (0..7)
0.5 0.5 0.5 0.5 0.5 0.5 0.5 0.5 
##$DPOFFS= (0..7)
0 0 0 0 0 0 0 0 
##$DQDMODE= 0
##$DR= 18
##$DS= 0
$$ [...]
##$SUBNAM2= <"">
##$SUBNAM3= <"">
##$SUBNAM4= <"">
##$SUBNAM5= <"">
##$SUBNAM6= <"">
##$SUBNAM7= <"">
##$SUBNAM8= <"">
##$SUBNAM9= <"">
##$SW= 18.0517283424941
##$SWIBOX= (0..15)
0 0 2 0 0 0 0 0 0 0 0 0 0 0 0 0 
##$SW_h= 3612.71676300578
##$TD= 16384
##$TD0= 1
##$TE= 0
##$TE2= 300
##$TE3= 300
##$TEG= 300
##$TL= (0..7)
0 120 120 120 120 120 120 120 
##$TP= (0..7)
150 150 150 150 150 150 150 150 
##$TP07= 0
##$TPNAME0= <>
##$TPNAME1= <>
##$TPNAME2= <>
##$TPNAME3= <>
##$TPNAME4= <>
##$TPNAME5= <>
##$TPNAME6= <>
##$TPNAME7= <>
##$TPOAL= (0..7)
0.5 0.5 0.5 0.5 0.5 0.5 0.5 0.5 
##$TPOFFS= (0..7)
0 0 0 0 0 0 0 0 
##$TUNHIN= 0
##$TUNHOUT= 0
##$TUNXOUT= 0
##$USERA1= <user>
##$USERA2= <user>
##$USERA3= <user>
##$USERA4= <user>
##$USERA5= <user>
##$V9= 5
##$VALIST= <valist>
##$VCLIST= <CCCCCCCCCCCCCCC>
##$VD= 0
##$VDLIST= <DDDDDDDDDDDDDDD>
##$VPLIST= <PPPPPPPPPPPPPPP>
##$VTLIST= <TTTTTTTTTTTTTTT>
##$WBST= 1024
##$WBSW= 4
##$XGAIN= (0..3)
0 0 0 0 
##$XL= 0
##$YL= 0
##$YMAX_a= 442963
##$YMIN_a= -485301
##$ZGOPTNS= <>
##$ZL1= 120
##$ZL2= 120
##$ZL3= 120
##$ZL4= 120
##$ABSF1= 10
##$ABSF2= 0
##$ABSG= 5
##$ABSL= 3
##$ALPHA= 0
##$AQORDER= 0
##$ASSFAC= 0
##$ASSFACI= 0
##$ASSFACX= 0
##$ASSWID= 0
##$AUNMP= <proc_1d>
##$AZFE= 0.1
##$AZFW= 0.1
##$BCFW= 1
##$BC_mod= 2
##$BYTORDP= 1
##$COROFFS= 0
##$CY= 11.3945322036743
##$DATMOD= 1
##$DC= 2
##$DFILT= <>
##$DTYPP= 0
##$F1P= 2.36226072786647
##$F2P= -0.459571619588291
##$FCOR= 0.5
##$FTSIZE= 0
##$FT_mod= 4
##$GAMMA= 1
##$GB= 0.15
##$INTBC= 1
##$INTSCL= 1
##$ISEN= 128
##$LB= 0.24
##$LEV0= 0
##$LPBIN= 0
##$MAXI= 10000
##$MC2= 0
##$MEAN= 0
##$ME_mod= 0
##$MI= 1.114404
##$NCOEF= 0
##$NC_proc= 0
##$NLEV= 6
##$NOISF1= 3.799351
##$NOISF2= 2.8
##$NSP= 1
##$NTH_PI= 0
##$NZP= 0
##$OFFSET= 15.70392
##$PC= 1
##$PHC0= -17939.89
##$PHC1= 9.200696
##$PH_mod= 1
##$PKNL= yes
##$PPARMOD= 0
##$PSCAL= 0
##$PSIGN= 0
##$REVERSE= no
##$SF= 200.130013532006
##$SI= 16384
##$SIGF1= 3
##$SIGF2= 2
##$SINO= 400
##$SIOLD= 16384
##$SREGLST= <1H.CDCl3>
##$SSB= 0
##$STSI= 0
##$STSR= 0
##$SW_p= 3612.71676300578
##$SYMM= 0
##$S_DEV= 0
##$TDeff= 0
##$TDoff= 0
##$TI= <>
##$TILT= no
##$TM1= 0
##$TM2= 0
##$TOPLEV= 0
##$USERP1= <user>
##$USERP2= <user>
##$USERP3= <user>
##$USERP4= <user>
##$USERP5= <user>
##$WDW= 1
##$XDIM= 8192
##$YMAX_p= 0
##$YMIN_p= 0
$$ End of Bruker specific parameters
$$ ---------------------------------
##NTUPLES= NMR FID
##VAR_NAME=  TIME,          FID/REAL,        FID/IMAG
##SYMBOL=    X,             R,               I
##VAR_TYPE=  INDEPENDENT,   DEPENDENT,       DEPENDENT
##VAR_FORM=  AFFN,          ASDF,            ASDF
##VAR_DIM=   8192,          8192,            8192
##UNITS=     SECONDS,       ARBITRARY UNITS, ARBITRARY UNITS
##FACTOR=    0.0002768,     1,               1
##FIRST=     0,             0,               0
##LAST=      2.2672688,     0,               0
##MIN=       0,             -485301,         0
##MAX=       2.2672688,     442963,          0
$$ Real data points
##PAGE= N=1
##DATA TABLE= (X++(R..R)), XYDATA
0@%%%%%%%%%%%Qj6J6j6K4l2L2l8M6n6O8p6Q8j08J29j49J71j95K24k56K92l29L70
$$ 0 0 0 0 0 0 0 0 0 0 0 0 8 -8 8 -8 16 -16 16 -22 24 -32 36 -40 48 -60 69 -80 91 -104 120 -136 156 -173 197
34A97m21M74n31N94o66P44q23R11j012J122j240J366j507J664j833K018k221K447
$$ 197 -224 250 -281 313 -353 391 -432 479 -533 589 -651 715 -792 872 -961 1057 -1164 1283
52A283k699K979l293L649m054M523n069N715o497P460q684J0294j2511J5766k0988
$$ 1283 -1416 1563 -1730 1919 -2135 2388 -2681 3034 -3463 3997 -4687 5607 -6904 8862 -12126
67a2126L0641n3907K01635J41126o85957K48910N72641m71464m26921O21747K72054
$$ -12126 18515 -35392 166243 307369 -378588 -129678 442963 -28501 -455422 166325 438379
78D38379o76216j72514P24704J2770o93588J82105N59305l69855l08166M35191
$$ 438379 -237837 -410351 314353 327123 -366465 -184360 374945 5090 -303076 132115
88A32115L9228l81039J82944K46901l20449j08160M19044l5383m92241K07519
$$ 132115 171343 -209696 -26752 220149 -100300 -208460 210584 175201 -317040 -109521
98a09521N23212m12735m51146N78580K80628o30966p7289N62707q1290m49817
$$ -109521 413691 956 -450190 128390 409018 -221948 -299237 263470 182180 -267637
108b67637J87462L42194k78237k20459L51920L2256l51186K02719K33514m00390
$$ -267637 -80175 262019 -16218 -236677 115243 147499 -203687 -968 232546 -167844
118a67844l5787M89455j53383m72582K81018M05475l57614l22378M23946K18002
$$ -167844 -203631 285824 132441 -340141 -59123 346352 -11262 -333640 90306 308308
128C08308m82101p1088M90013j02503m01570K44617K22768k99863j9698K65343
$$ 308308 -173793 -244881 245132 142629 -258941 -14324 208444 -91419 -111117 154226
138A54226j42747j91846K51906J16185l38308k6791M08293j03960m24917K57820
$$ 154226 11479 -180367 71539 187724 -150584 -177375 230918 126958 -297959 -40139
148d0139L58587l73413k32890M10852J04660l82466k003L24441q6412k46756J74089
$$ -40139 318448 -54965 -287855 122997 227657 -154809 -156812 167629 81217 -165539 8550
159H550J36041k43356Q873K57886j60793k01065K77865R0021l37169L3640L44530
$$ 8550 144591 -98765 -89892 167994 7201 -193864 84001 174022 -163147 -129507 215023
170B15023j37714l24362K17588K87835k84847k19546L36070J04405l39507L7676
$$ 215023 77309 -247053 -29465 258370 -26477 -246023 90047 194452 -145055 -107379
180a07379K72443j52443j53512K03870K9402k02779P4443J79781j67430j41604
$$ -107379 165064 12621 -140891 62979 92381 -110398 -35955 143826 -23604 -165208
190a65208K57494P0970l24184L3087L36189j42570k88340K23380K03323k61708
$$ -165208 92286 163256 -160928 -127841 208348 65778 -222562 818 204141 -57567
200e7567j07957K62233J7530k32938O4379J77350j34275r4087J83132j3374j94519
$$ -57567 -165524 96709 114239 -118699 -54320 123030 -11245 -105332 77800 64426 -130093
211a30093J27223J59288k17830q9913K65142J2421k74655N7664K61509j25026
$$ -130093 -2870 156418 -61412 -151325 113817 126238 -148417 -90753 170756 45730
221D5730k26553J90140J58121k32940o0621K29034l8021j78710J11155J04419
$$ 45730 -180823 9317 167438 -65502 -126123 102911 64890 -113820 -2665 101754
231A01754j53587k4470J73164n7595j69954J40083J38059k11019p7922K54892
$$ 101754 -51833 -76303 96861 39266 -130688 9395 147454 -63565 -141487 113405
241A13405O99k61980P7534K31148j40725j70857J77281R6735j85785k2343J71983
$$ 113405 114104 -147876 -70342 160806 20081 -150776 26505 123240 -62545 -84888 87095
252H7095m8447j36950J13281P5890j59557P053J70912r1227j46338J55119J01139
$$ 87095 38648 -98302 14979 90869 -68688 -61635 109277 18050 -128288 26831 127970
263A27970j94368m8234K14617j1575k14539P6111J85980j31458j29371J61583
$$ 127970 -66398 -114632 99985 88410 -126129 -50018 135962 4504 -124867 36716
273C6716N8255j61691J3438J36999p7479r2297J27349L2612j55250L3892J57211
$$ 36716 94971 -66720 -53282 83717 6238 -86059 41290 73902 -81348 -47456 109755
284A09755r7991j34700J52764R0410j91004l0012K03006l3895j85399Q5972J44983
$$ 109755 11764 -122936 29828 120238 -70766 -100778 102228 68333 -117066 -31094 113889
295A13889j19725r1773J37317K9828j38122L7464J15598r7519o8319J35389P509
$$ 113889 -5836 -97609 39708 69536 -68586 -31122 84476 -13043 -81362 54027 61536
306F1536j46130N3329J36042j07657j09850J51309O8090j76289j5338J75190l8219
$$ 61536 -84594 -31265 104777 -2880 -112730 38579 106669 -69620 -84958 90232 52013
317E2013j49882Q3043J07167j14855n2942J28450p016j17998O2754Q4434j04483
$$ 52013 -97869 -14826 92341 -22514 -75456 52994 45978 -72020 -9266 75168 -29315
328b9315l6065J29611j7888j37963P2205J26860j19295r3933J49060M5445j56364
$$ -29315 -65380 64231 46343 -91620 -19415 107445 -11850 -105783 43277 88722 -67642
339f7642O697J44016n4152j16653R1834P4753j13688k1346J13326l4604r1322
$$ -67642 -60945 83071 28919 -87734 4100 78853 -34835 -56181 57145 22541 -68781
350f8781Q2533N5381j17051j1427J35396l7137j32048Q4018J05803j18738o4068
$$ -68781 13752 69133 -47918 -59345 76051 38914 -93134 -9116 96687 -22051 -86119
361h6119J35664J8651j36065K3857J21189o1549q9368Q8960M1569r9604J2036
$$ -86119 49545 68196 -67869 -44012 77177 15628 -73740 15220 56789 -42815 -30779
372c0779R1255o0160o8323R5971L4551j16676P167J20234n0843j06506Q8716Q0301
$$ -30779 60476 316 -68007 27964 62515 -54161 -46994 73240 22397 -84109 4607 84908
384H4908j14709m5413J26120M622j18966L7493R1753p1333n0617Q9307O290r1855
$$ 84908 -29801 -75214 50906 55528 -63438 -25945 65808 -5525 -56142 33165 39455 -52400
396e2400L4593Q1090p2052n5971J02783J5773j18640L1181J13972p1162r2596
$$ -52400 -17807 63283 -8769 -64740 38043 53816 -64824 -33643 80329 9167 -83429
407h3429R6610O2497j08203k6927J08424j2270r5729N0417O9110p9075l1221R1610
$$ -83429 13181 75678 -32525 -59452 48972 36702 -59027 -8610 60500 -18575 -49796 41814
419D1814j2305q5309N3503O2244q5313k9515J02687m465j07094L5627J00645o5443
$$ 41814 29509 -55800 -2297 59947 -25366 -54881 47806 43341 -63753 -28126 72519 7076
431G076q1481R2263M7039j06602l289J00355l5556p5891O0616M3189p3425p807
$$ 7076 -74405 17858 64897 -41705 -44994 55361 19805 -56086 4530 47719 -25706 -33513
443c3513P8744l0312p4564O8631N5346r8278k1977J10109j7119j03561N2304Q3454
$$ -33513 45231 14919 -59645 8986 64332 -33946 -55923 54186 37067 -66494 -14190 69264
455F9264p8198n6111R3245K5177r7070Q210Q8637m2051o5178P1238K7023q5811
$$ 69264 -8934 -65045 28200 53377 -43693 -35483 53154 11103 -54075 17163 44186 -41625
467d1625J7685Q0643n5419o0429P8589L5495r0999j0060R8530k0241r8218N5145
$$ -41625 -23940 56703 1284 -59145 19444 54939 -36060 -46120 52410 32169 -66049 -10904
479a0904Q0903q4212m5990R4381M895q4398K9376O3462n2796l9399O8142J2702
$$ -10904 69999 -14213 -60203 34178 39073 -45325 -15949 47513 -5283 -44682 23460 36162
491C6162p6213J9609P3662n5162n6596Q5679K6600j01343Q619R8092l9302q0491
$$ 36162 -40051 -20442 53220 -1942 -58538 27141 53741 -47602 -38983 59109 19807 -60684
503f0684O0153N6712p3371l0178Q1200j667p9798L7950O1522o8221k7389Q0778
$$ -60684 -531 56181 -17190 -47368 33832 32165 -47633 -9683 51839 -16382 -43771 37007
515C7007j0682p4660M1298N9611o3314m2577Q1970K1052r6057R664R6547m4885
$$ 37007 26325 -48335 -7037 52574 -10740 -53317 28653 49705 -46352 -36688 59859 14974
527A4974p7404P2099M3676q1876p982P4878k0610n9034M1677M0069n9201j7745
$$ 14974 -62430 9669 53345 -28531 -36513 38365 17755 -41279 398 40467 -18734 -36479
539c6479P3764j1656p8303M6407O4806p6135l4491Q9803k53q6233K7437P3766
$$ -36479 37285 25629 -52674 -6267 58539 -17596 -52087 37716 37463 -48770 -21333 52433
551E2433m5800n8706O1363L7893p4354o543P5572l0229n8318N9388K7384p2608
$$ 52433 6633 -52073 9290 47183 -27171 -33714 41858 11629 -46689 12699 40083 -32525
563c2525N170P2301l2274o4695N4836N1125p4604k8163Q7811m111q7050L8200
$$ -32525 -27355 44946 12672 -52023 2813 53938 -20666 -48829 38982 34871 -52179 -13979
575a3979O9236o2771l9547P1060Q645o5887J6403N4917l6983m1171N7000J9691
$$ -13979 55257 -7514 -47061 23999 32644 -33243 -16840 38077 1094 -40077 16923 36614
587C6614p3278J2676P5778m8338n9239P2818L1152p9176m357P3423j5933o4491
$$ 36614 -36664 -23988 51790 3452 -55787 17031 48183 -30993 -35350 38073 22140 -42351
599d2351L3988N3048n2871l2985O6940K691o7188L0050N1353n4469k5842O5607
$$ -42351 -8363 44685 -8186 -41171 25769 28460 -38728 -8678 42675 -11794 -37636 27971
611B7971p79o5973K4777N9897m6646m8627O6660K9688q0081k727P9739k6303o3415
$$ 27971 27192 -38781 -14004 45893 -753 -49380 17280 46968 -33113 -35840 43899 17596 -45819
624d5819M7995L7498n7736j1592N8753j1101n5266L3767M5004n6800k2809P2158
$$ -45819 2176 39674 -18062 -29654 29099 17998 -37268 -3501 41503 -15297 -38106 34052
636C4052r130p1198L9969N4737n9510l2301O6969J1907o7621O507O4279k6323
$$ 34052 24922 -46276 -6307 48430 -11080 -43381 23588 35495 -32126 -25619 38660 12337
648A2337n3919M6513L3187o0460m072O1162k5625m7731M7530K6155n8884m172
$$ 12337 -41582 4931 38118 -22342 -26414 34748 9123 -38608 8922 35077 -23807 -27979
660b7979O2362j5412o1058L4917N2888n4583l3973O8595O298o9812K1118N7883
$$ -27979 34383 18971 -42087 -7170 45718 -8865 -42838 25757 32055 -37757 -16639 41244
672D1244l9749l8974M9139J8195n3176M577N2492l0084m2933N3407K2547o6751
$$ 41244 1495 -37479 11660 29855 -23321 -18744 33748 3664 -39269 14138 36685 -30066
684c0066L797O6260k8118n4823M5304L8234n5576j9985O0793J99o0313K1287N1170
$$ -30066 -26269 39991 11873 -42950 2354 40588 -14988 -34973 25820 26019 -34294 -13007 38163
697C8163m1398l1474N4086M699n4610K0965M4204l9035k8585M9247J2075n5472
$$ 38163 -3235 -34709 19377 24076 -30534 -9569 34635 -4400 -32985 16262 28337 -27135
709b7135O082N7967k7148n2456M7039L6220n8456j3179N8078r541m8797K7674
$$ -27135 -21053 36914 9766 -42690 4349 40569 -17887 -31066 27012 17471 -31326 -3652
721c652L5455m1115j9142M9703p41n0768K2835M2098m2632k4761N5453K989n9009
$$ -3652 31803 -9312 -28454 21249 20508 -30260 -7425 34673 -7959 -32720 22733 25722 -33287
734c3287J7964N3772l4653m2311M6195K6628n3398p160N4918j4973m7558L5130
$$ -33287 -15323 38449 3796 -38515 7680 34308 -19090 -26250 28668 13695 -33863 1267
746A267L0538m7173p996M8683j3327m2740L0432L3372m4080k0557N4200K658n7366
$$ 1267 31805 -15368 -23364 25319 11992 -30748 -316 33056 -11024 -31581 22619 25277 -32089
759c2089J8462N0770l7442l5921M9201J7351n2639J071M8718j7932l8570L2355
$$ -32089 -13627 37143 -299 -36220 12981 30332 -22307 -21236 27482 9550 -29020 3335
771C335K3013m3000l309M7522j7872m3740L6989L1195m9741j2652N4119o895n1276
$$ 3335 26348 -16652 -19961 27561 9689 -34051 2938 34133 -15608 -28260 25859 18964 -32312
784c2312K4104M3576l8181l1250M8400J3280n1593Q104M5139k7465l0659L9911
$$ -32312 -8208 35368 -2813 -34063 14337 27617 -23976 -15872 29267 1802 -28857 11054
796A1054J2777m4986N307M4051k2955l7193L8998K4294n0548o696N4487j1948
$$ 11054 23831 -21155 -15848 28203 5248 -31945 7053 31347 -19201 -25897 28590 16642
808A6642m9897K8172L8061l9635k1310M4866K824m3769J4425L6948k8644k5311
$$ 16642 -33255 -5083 32978 -6657 -27967 16899 19723 -24046 -9621 27327 -1317 -26628
820b6628L9127Q827m3970J0710M1237k9136l1392M2162J7611m8590k465M9387
$$ -26628 12499 21326 -22644 -11934 29303 167 -31225 10937 28548 -20042 -22507 26880
832B6880j3286m4472K8681L3151m0532j6402M5289k179m2131J9076L2590l2709
$$ 26880 13594 -30878 -2197 30954 -9578 -25980 19309 17130 -25001 -5925 26665 -6044
844f044j8259M1581P70m4174J7302L9602l2881k8946M3919J4093m9470L254M8287
$$ -6044 -24303 17278 18048 -26126 -8824 30778 -2103 -31049 12870 26963 -22507 -19253 29034
857B9034k0217l9923L3308K6204m0221j0089M1397o488l7349K2452K7723l5391
$$ 29034 8817 -31106 2202 28406 -11815 -21904 19493 13005 -24344 -1892 25831 -9560
869i560j3013M2124m115m1627K0281L5087l3626k4092M2959R707m6838O377M3738
$$ -9560 -22573 19551 15436 -26191 -5910 29177 -4449 -28541 14418 24125 -22713 -16336 27402
882B7402k0964l4576L1833K1353l8256n625L9614j1212l4522K6480K3055l6887
$$ 27402 6438 -28138 3695 25048 -13208 -18833 20781 9569 -24953 1527 24582 -12305
894a2305p585M0880q613l9156K3748L2347l6498k0377M4454M655m5597J1636L9782
$$ -12305 -19890 20990 12377 -26779 -3031 29316 -7182 -27559 16895 21550 -24047 -12411 27371
907B7371k5282k8860L4853J4257l9202K434L7149j8441k8892L0871J6488l8566
$$ 27371 2089 -26771 8082 22339 -16863 -14429 22720 4279 -24613 6258 22746 -15820
919a5820j579M0920j4443l7094K9191K6882l9211j2609M2478k036m0073J5190
$$ -15820 -17399 23521 9078 -28016 1175 28057 -11154 -23763 18715 16679 -23394 -8204
931h204L3563k6790k2666L5462P251l8129J0067L3189k4959k2304L4768Q554l9185
$$ -8204 25359 -1431 -24097 11365 18616 -19513 -9446 23743 -1216 -23520 11248 19802 -19383
944a9383O078L8393k0177l2405L2056K1642l9859p541M2293q258l8299K3047K7840
$$ -19383 -13305 25088 4911 -27494 4562 26204 -13655 -21196 21097 12839 -25460 -2413 25427
957B5427l3416j2924L6973k651l4442J6586K7751k8570j7469L7805L403m1514
$$ 25427 -7989 -20913 16060 13409 -21033 -4447 23304 -5266 -22735 15070 18473 -23041
969b3041J2528L7486k6143k7133L4556J4215l8158r62L8007j2439l3241K4997
$$ -23041 -10513 26973 830 -26303 8253 22468 -15690 -16652 21355 8916 -24325 672
981F72K2644l3873p370L6404r051l2190K3004K2808l2446j0401L6683k687l6453
$$ 672 23316 -10557 -17927 18477 9426 -22764 240 23048 -9398 -19799 16884 14197 -22256
994b2256J5153L2551k6679k4593L6231J1582m0544M794L6708j9645k5967K8948
$$ -22256 -7103 25448 -1231 -25824 10407 21989 -18555 -13761 22947 3302 -22665 6283
1006F283J2810l2850k27L3485j2171l0481K4712K1777l4730p632L8793q242l6144
$$ 6283 19093 -13757 -13984 19501 7330 -23151 1561 23338 -11392 -19024 19769 11527 -24617
1019b4617K1652K8637l0793j8233L5662N683l6221Q009L2133k1089k3213L0966
$$ -24617 -2965 25672 -5121 -23354 12308 17991 -18230 -10221 21912 823 -22390 8576
1031H576J0167l5236M982L2616j8631k4599K7972J4614l3073m413L5458p043l4469
$$ 8576 18743 -16493 -11511 21105 2474 -22125 5847 20461 -12612 -17025 18433 11390 -23079
1044b3079K0365K7400l2167j3911L7206j561l4127J3877K6319k1961j7062K7602
$$ -23079 -2714 24686 -7481 -21392 15814 14253 -19874 -5997 20322 -1639 -18701 8901
1056H901O414l1295O621L0788k0441k4458L1588J2872l6871J151L5434j4420k8637
$$ 8901 15315 -15980 -9359 21429 988 -23470 8118 20990 -15881 -14730 20704 6284 -22353
1069b2353K4696J8891l1047q083L3769l639l2334J6320K5139k7512j2301L3087
$$ -22353 2343 21234 -9813 -17896 15873 12234 -20100 -3780 21359 -6153 -18454 14633
1081A4633k494l1557J4738K5455k3373j7689L0224P962l5040M814L4543j8328
$$ 14633 12139 -19418 -4680 20775 -2598 -20287 9937 17899 -17141 -12327 22216 3888
1093C888k6640K7976J3758l1348l61K9466j0780k4771J9657J7914k6570q417L0674
$$ 3888 -22752 5224 18982 -12366 -12727 16739 5959 -18812 845 18759 -7811 -16228 14446
1106A4446l741l0295J6964K4098k8120j2626L3628n71l2540J1684K6974j9420
$$ 14446 10705 -19590 -2626 21472 -6648 -19274 14354 13783 -18757 -7073 19901 481
1118D81j9563K5409J0149k9853K399K9949j6101k3313K6316J1692l0226O09K9106
$$ 481 -19082 6327 16476 -13377 -10978 18971 2870 -20443 5873 17565 -12661 -12052 17054
1131A7054j1196k5388K0313J9134k7959r330L2055l059l0903J5142K4615k3980
$$ 17054 5858 -19530 783 19917 -8042 -17372 14683 11624 -19279 -4137 20478 -3502
1143c502j4825K8061L853k7709O723K4091j6097j8179K4205R713k9955J758L0838
$$ -3502 -18327 9734 13587 -14122 -7399 16692 595 -17584 6621 16334 -13621 -11863 18975
1156A8975j4474k5026K4194J4408k8211l390K7905n885k5915J4563K1921k3161
$$ 18975 4501 -20525 3669 18077 -10134 -13524 14381 8496 -17419 -2856 19065 -4096
1168d096j3791K9171J445k9197J1435K3261k1216j4012K6836L741k8619O515K6996
$$ -4096 -17887 11284 12729 -16468 -5033 18228 -2988 -17000 9836 13577 -15042 -8527 18469
1181A8469j6347k1733K4481J3106k9393j998K9777r842k4912J9559J6115k5163
$$ 18469 2122 -19611 4870 17976 -11417 -13415 16362 6520 -18392 1167 17282 -7881
1193g881o058K6691l416k5402J2533K1222k1400j2798K7645Q82k8479J1019K3757
$$ -7881 -13939 12752 9336 -16066 -3533 17689 -3711 -16509 11136 12018 -16461 -5442 18315
1206A8315j9331j6431K3909Q691k6367j4K6446j0037k2422J9468J3946k5542k902
$$ 18315 -1016 -17447 6462 15153 -11214 -11228 15218 5181 -17241 2227 16173 -9369 -12271
1219a2271K6697q074k3263J7210J6241k3236p179K5862k392k5533J2009K2021
$$ -12271 14426 6352 -16911 299 16540 -6696 -13875 11987 9595 -15938 -3929 18092
1231A8092k0863j4724K7134L992k8301P279K4074j5972j6743K1373Q384k4561
$$ 18092 -2771 -17495 9639 13631 -14670 -7391 16683 711 -16032 5341 13725 -10836
1243a0836J060K5198j1604k1558K1157J3113k6535k417K6742p425k3362J5475
$$ -10836 -9776 15422 3818 -17740 3417 16530 -10005 -12422 14320 6895 -16467 -992
1255i92J7734k1889r851K5757K77k5875R563K1924j7988j4277K3457M126k4795
$$ -992 16742 -5147 -14998 10759 11036 -14839 -5276 16648 -1340 -15617 7840 11966 -12829
1268a2829O399K1948j5175j6204K1169R133k4857p92K5972r051k2886J8463J5066
$$ -12829 -6430 15518 343 -15861 5308 14441 -10416 -11208 14764 5713 -17173 1290 16356
1281A6356k4287m787K5249m832k2727J2838J7953j9532j0704K4156Q73k4874R731
$$ 16356 -7931 -12718 12531 7699 -15028 -2190 15763 -3769 -14473 9683 10556 -14318 -4587
1294d587K0964j8436j3701K3874M819k5758M399K4204j2967j9211J9509J1771
$$ -4587 16377 -2059 -15760 8114 12933 -12825 -8426 15778 2811 -16400 3109 14880
1306A4880k3425k789K4381o968k1743J6038J5133k2036o103K3763k947k2047J0797
$$ 14880 -8545 -11334 13047 6079 -15664 374 15507 -6529 -12632 11131 8184 -13863 -3066
1319c066J8185j7709j2224K3308L530k5514O487K2912j4937j6636K0283Q749k2755
$$ -3066 15119 -2590 -14814 8494 12024 -13490 -7003 15909 972 -15664 4619 13368 -9387
1332i387j78K2581q667j9216J6632J2562k1923l883K3732n384k1968J4042J6672
$$ -9387 -9565 13016 4349 -14867 1765 14327 -7596 -11479 12253 6869 -15099 -1057 15615
1345A5615k0600q637K3799m98k3370R021K0081j6274j4422K1900O063k4299L969
$$ 15615 -4985 -13622 10177 9679 -13691 -4670 15411 -863 -15285 6615 12678 -11621 -7652
1358g652K2070j3024j5958J9045Q225k2126j9K2687q518k0120J6481J3958k1973
$$ -7652 14418 1394 -14564 4481 12706 -9420 -9439 13248 4730 -15390 1091 15049 -6924
1371f924n287K3677l685k1929J1671J7430j8081j0424K1841J823k2135O819J9119
$$ -6924 -12211 11466 7781 -14148 -2477 14953 -3128 -13552 8289 10112 -12023 -5204 13915
1384A3915j4068j3702J9474O227k2421K833K1683j1706j7124J8313J0124k1848
$$ 13915 -153 -13855 5619 11846 -10575 -7742 13941 2235 -14889 3424 13548 -8300
1396h300k219K2582o036k0384J3915J4852j9792o654K2099k166k0814R983J6890
$$ -8300 -10519 12063 6027 -14357 -442 14410 -5382 -12036 10063 7897 -12917 -2934 13956
1409A3956j6461j0590K0963K223k2099O564J9543j3841j4314J8786P578k1475
$$ 13956 -2505 -13095 7868 10091 -12008 -5444 14099 258 -14056 4730 12308 -9167
1421i167K47K1397q434j7936J5207J1677j9139m197K0241l468j8794J0804J4709
$$ -9167 -8920 12477 4043 -13893 1314 12991 -6148 -10345 9896 6428 -12366 -1562 13147
1434A3147j6860q089K0293N1k0372P737J7482j4366j2112J9087M878k1014L227
$$ 13147 -3713 -11802 8491 8542 -11830 -4093 13389 -977 -13089 5998 10876 -10138 -6911
1447f911J9466j0463j5071J5734R083j9153j776K0340o561j8107J4259J2229j9175
$$ -6911 12555 2092 -12979 2755 11838 -7315 -9091 11249 4688 -13419 840 13069 -6106
1460f106m323K0455l545j8943J0437J5484j6279r846K0195K216k0914N972J8196
$$ -6106 -10429 10026 6481 -12462 -2025 13459 -2820 -12666 7529 9745 -11169 -5197 12999
1473A2999j2927j2978J7855O038k0136J806J9239r272j5441J5090R755j8896k808
$$ 12999 72 -12906 4949 10987 -9149 -7343 11896 2624 -12817 2273 12028 -6868 -9676
1486i676K0506n063j8980J2547J4078j7829o973J9810l45j9127O922J6726j3192
$$ -9676 10830 5767 -13213 -666 13412 -4417 -11390 8420 8075 -11052 -4130 12596 -596
1499e96j2081J8464M582k0585M206J8645j1831j3560J6746P124j9061l08J9157
$$ -596 -12677 5787 10369 -10216 -6010 12635 804 -12756 3990 11114 -7947 -8255 10902
1512A0902o607j6962J3097J2402j8139n809K0659k005j9862R853J5364j5734q322
$$ 10902 4295 -12667 430 12832 -5307 -11116 9543 7538 -12324 -2471 12893 -2841 -11163
1525a1163J8405R09j8378N726J6493j1682j2844J7050O485k0051J719J9101r214
$$ -11163 7242 8151 -10227 -4501 11992 310 -12534 4516 11001 -9050 -7331 11770 2556
1538B556j4920J4323R343j7194l398J8511l173j7647R982J3781j5374p354J8024
$$ 2556 -12364 1959 11302 -5892 -9290 9221 6048 -11599 -1617 12164 -3210 -10564 7460
1551G460k00j7506P202J4429j2633r689J6171M035j7769K024J7473q447j4704
$$ 7460 7260 -10246 -3044 11385 -1248 -10937 5234 9269 -8500 -6476 10997 2550 -12154
1564a2154J4557Q829j8492p57J8538o949j5054J2155J0059j4976m832J6564j093
$$ -12154 2403 11232 -7260 -8017 10521 3572 -11482 673 10732 -4244 -9076 7488 6395
1577F395j6744P936J4209j4264q521J7896J311j8063N346J5714j0664j1716J4487
$$ 6395 -10349 -2413 11796 -2468 -10989 6907 8218 -9845 -4499 11215 551 -11165 3322
1590C322O366j6580j6J6558o643j4023J2422R149j6093k555J6626m005j4441R282
$$ 3322 9688 -6892 -6908 9650 3007 -11016 1406 10555 -5538 -8093 8533 4528 -9913 -631
1604f31J0743j3190o233J6044N07j7263O551J5152j3065r485J6519K312j6317
$$ -631 10112 -3078 -9311 6733 7240 -10023 -3472 11680 -1385 -10870 5649 7961 -8356
1617h356L968J3951q802j0746J2921O419j6051l91J6909o562j4473J2567R211
$$ -8356 -4388 9563 761 -9985 2936 9355 -6696 -7087 9822 3260 -11213 1354 10565
1630A0565j6091k570J6658l845j4807R091J1455j3021p085J5558J636j6263M821
$$ 10565 -5526 -8096 8562 4717 -10090 -999 10456 -2565 -9650 5908 7544 -8719 -3898
1643c898J4097j0819r144J4592K892j5407K683J4280p302j2003J1562Q148j5203
$$ -3898 10199 -620 -9764 4828 7720 -7687 -5004 9276 1974 -10029 1533 9681 -5522
1656e522k092J6459m937j4239J0652R526j3782m141J4737j031j4192O026J2107
$$ -5522 -7614 8845 3908 -10331 321 9847 -3935 -8076 6661 5630 -8562 -2536 9571
1669I571j0752q100J4434K177j5868M693J4225j0784r797J4409M128j5230J246
$$ 9571 -1181 -9281 5153 7330 -8538 -3845 10380 -404 -10201 4208 8336 -6894 -5648
1682e648J4189n996j1967J0507Q276j4467k508J6057m146j4251R691R727j2710
$$ -5648 8541 2545 -9422 1085 9361 -5106 -7614 8443 4297 -9954 -263 9464 -3246
1695c246m456J3803o89j3815N958J2354j1102q626J4795K917j5744L307J3819
$$ -3246 -7702 6101 5412 -8403 -2445 9909 -1193 -9819 4976 7893 -7851 -4544 9275
1708I275q449j0076J1877N459j3570n64J3796m488j2516R538R253j3633l871J5351
$$ 9275 826 -9250 2627 8086 -5484 -6048 7748 3260 -9256 282 9535 -4098 -7969 7382
1722G382k632j3804Q158R918j1581n485J3467J059j4372L826J3673r173j0084
$$ 7382 4750 -9054 -896 9022 -2559 -8044 5423 6482 -7890 -4064 9609 436 -9648
1735i648J3376L967j4780K761J3196q156r927J1724N855j3769j129J4293m230
$$ -9648 3728 7695 -7085 -4324 8872 716 -9211 2513 8368 -5401 -6530 7763 3533
1748C533j2811R540R120j3553l656J5029k232j3767P220J0534j0579o553J2671
$$ 3533 -9278 262 9382 -4171 -7827 7202 4970 -8797 -1577 8957 -1622 -8175 4496
1761D496K085j3665L079J2862q531r423J2767L864j4274J962J3163o521j0614
$$ 4496 6581 -7084 -4005 8857 326 -9097 3670 7534 -6740 -4778 8385 1864 -8750
1774h750R782P247j2277k752J3668k863j2957Q537R685j2568m627J3952q94j2894
$$ -8750 1032 8279 -3998 -6750 6918 4055 -8902 -365 9320 -3248 -7875 6077 5183 -7711
1788g711N770J0216r678o582J2529K122j3973L057J3271q265r991J2233M681j3660
$$ -7711 -1941 8275 -1403 -7985 4544 6666 -7307 -4250 9021 756 -9235 2998 7679 -5981
1802e981R65J2733n590j0450R141P287j1870l015J3416k446j2656P816R307j1435
$$ -5981 -5016 7717 2127 -8323 818 8105 -3765 -6780 6636 4190 -8466 -650 8657 -2778
1816b778m435J2686m89j2192M904J0520q828p674J1884L495j3296J626J2433o692
$$ -2778 -7213 5473 4984 -7208 -2304 8216 -612 -8286 3598 7093 -6203 -4577 7856 1164
1830A164r353J0533M808j2392L9J2262m284j0735P963P924j1005l735J2830j597
$$ 1164 -8189 2344 7152 -5240 -5201 7061 2777 -7958 5 7929 -3076 -6811 6019 4422
1844D422j2548O993R731j0722n416J2279Q49j2133L421J0827p495q123J0870L950
$$ 4422 -8126 -1133 8598 -2124 -7540 4739 5588 -6545 -3124 7703 208 -7915 2955 6905
1858F905j2664J247J2148o215r559R852N745j1825j434J2187k926j1058P005Q479
$$ 6905 -5759 -4512 7636 1421 -8138 1714 7459 -4366 -5800 6387 3461 -7597 -592 7887
1872G887j0422m570J2511l07j2474N144J0239q837o483J0907K175j1602K234J1064
$$ 7887 -2535 -7105 5406 5099 -7375 -2231 8008 -829 -7312 3595 5770 -5832 -3598 7466
1886G466o609q959J0327N154j2492j44J2346m778j0131Q558O737j1019k583J1955
$$ 7466 857 -8102 2225 7379 -5113 -5257 7089 2311 -7820 738 7475 -3544 -6127 5828
1900E828j892j1298O235Q994r812n153J1879M36j2027M309J0241q295p010J0968
$$ 5828 3936 -7362 -1127 7867 -1945 -7098 4781 5217 -6810 -2501 7740 -555 -7565 3403
1914C403K899j2031J481J1549n694r476R229N881j1446j266J1793l365j0355P252
$$ 3403 6302 -5729 -4248 7301 1607 -7869 1360 7241 -4205 -5471 6322 2957 -7398 -146
1928a46P563r992l866J1467n27j1348N015R443q785n988J1117J680j1685K770
$$ -146 7417 -2575 -6441 5026 4499 -6849 -1834 7609 -1176 -7164 3953 5633 -6052 -3282
1942c282J0592o808p950R792M144j1276K60J1054m604r230Q344N958j0792j769
$$ -3282 7310 502 -7448 2344 6488 -4788 -4528 6526 1922 -7308 1036 6994 -3798 -5567
1956e567J1581k784j0439O807P707r805l788J1237m77j1131M734R291q227o044
$$ -5567 6014 3230 -7209 -402 7305 -2500 -6288 4949 4472 -6659 -1925 7366 -861 -6905
1970f905J0399J967j1135K402J0253o458p795R568M036j1100L63J0823m504r032
$$ -6905 3494 5461 -5674 -3272 6981 523 -7272 2296 6332 -4768 -4405 6418 1914 -7118
1984g118P864O163j0183k496J1182j660j0521N709Q165q890m605J0655N19j0807
$$ -7118 746 6909 -3274 -5770 5412 3752 -6769 -1060 7105 -1785 -6390 4265 4784 -6023
1998f023L495R467p086o700R737K869j1009J421J0627n569q460Q781M913j0497
$$ -6023 -2528 6939 -147 -6847 2890 5759 -5250 -3829 6798 1229 -7231 1550 6463 -4034
2012d034p88J0644l288r377O791O983r463l449J0835r16j0408N334Q104q721m485
$$ -4034 -4822 5822 2534 -6843 -52 6931 -2532 -5981 4854 3938 -6470 -1136 6968 -1753 -6238
2027f238J0363N45j0294L033Q991o125o772Q773L459j0372O08J0341m653q427
$$ -6238 4125 4670 -5624 -2591 6400 275 -6497 2276 5735 -4637 -4029 6312 1659 -6768
2041f768P698N205r373j468R739k297q919N593P057q298m061R974J03j0053M060
$$ -6768 930 6135 -3238 -4706 5033 2736 -6183 -590 6467 -1831 -5892 4082 4185 -5868 -1808
2056a808Q390p379n451R218K077r733J396R155m905p371Q124M325j0260j37J0248
$$ -1808 6582 -797 -6248 2970 5047 -4686 -3290 5865 960 -6411 1713 6038 -4222 -4359 5889
2071E889l960q277P010N118q716j684R390j632r232M989P728q002m657R828M36
$$ 5889 1929 -6348 662 5780 -2936 -4620 4770 3138 -6094 -1105 6623 -1379 -6036 3792 4228
2086D228r818L804Q052o938n288Q684K140r149R99Q743m262p340P385M627r503
$$ 4228 -5590 -1786 6266 -672 -5960 2724 4864 -4285 -3286 5457 1195 -6145 1240 5867 -3636
2101c636q01R738l079q185O097N580p983k698R056m26r141L797P780o983m722
$$ -3636 -4437 5301 2222 -5963 134 5714 -2269 -4967 4089 3663 -5478 -1681 6099 -884 -5606
2116e606R046O38r243L118P999n927n865P720L189q797J09Q979l900p761P421
$$ -5606 3440 4078 -5165 -2047 5952 25 -5840 1880 5069 -3728 -3619 5360 1460 -6301 1120
2131A120M966r611j091R668k589q084N431N653p283l078Q535K66r153L229Q234
$$ 1120 6086 -3525 -4616 5052 2463 -5621 -190 5463 -1820 -4898 3637 3903 -5250 -2021 6213
2146F213o714n497Q998J667r417K007Q285m811o374O876L966q425q18R082k894
$$ 6213 -501 -5998 3000 4667 -4750 -2743 5542 731 -5643 1233 5199 -3226 -4044 5038 2144
2161B144q222O315N643q370k135Q764j420p857M478O207o924l993Q725J036r471
$$ 2144 -6078 237 5880 -2490 -4625 4139 2719 -5138 -660 5547 -1377 -5370 3355 4391 -5080
2176e080K710Q307o293n287Q500J441q819J952P822m459o279O501M175q248j065
$$ -5080 -2370 5937 -356 -5643 2857 4298 -4521 -2569 5253 794 -5485 1016 5191 -3057 -4122
2191d122R079k870q035O389N206q355j688Q611j446p832M035O457o260m372P982
$$ -4122 4957 2087 -5948 441 5647 -2708 -4396 4215 2769 -5063 -1028 5429 -831 -5203 2779
2206B779J385q717K341P783n765n291P877K122q405Q33P843l398o577N772M507
$$ 2779 4164 -4553 -2212 5571 -194 -5485 2392 4514 -3891 -3058 4785 1387 -5190 582 5089
2221E089p888j324Q878k541p915N761N285p423k151P689o58p295L310O262n906
$$ 5089 -2799 -4123 4755 2214 -5701 60 5345 -2078 -4229 3460 2802 -4493 -1183 5079 -827
2236h27m252Q058J057q776K673P566n758m917P406J878p744R58P275l547o172
$$ -827 -5079 2979 4036 -4740 -2067 5499 -259 -5176 2230 4108 -3636 -2678 4597 1050 -5122
2251e122N953M222p873j237Q535k312p360N256M842o939j965P385n45p288K931
$$ -5122 831 5053 -2820 -4057 4478 2166 -5194 62 4904 -2035 -4000 3385 2840 -4448 -1517
2266a517O659n453m845P521J735q131J746P117m606m993O300K649p122k51P288
$$ -1517 5142 -311 -5156 2365 4100 -4031 -2285 4832 226 -4767 1533 4182 -2940 -3191 4097
2281D097k304o653M951M777p065j684P777j708o982M580M987o214k719O931M22
$$ 4097 1793 -4860 91 4868 -2197 -3881 3896 2188 -4794 -214 4773 -1441 -4160 2771 3193
2296C193o997K031O338m661m587O906J612p662J607O797m147m889N537K812o353
$$ 3193 -3804 -1773 4565 -96 -4683 2223 3835 -3827 -2220 4577 430 -4459 1078 3890 -2463
2311b463o04O760j959o280M584M611o595j828P171j010o563L450N061n111l127
$$ -2463 -3067 3693 1734 -4546 38 4649 -1946 -3774 3397 2387 -4176 -726 4335 -776 -3903
2326c903O113Q69o520J665O130m260m646O348K044p041P65O345l159m776M791
$$ -3903 2210 3079 -3441 -1776 4354 94 -4552 1796 3840 -3201 -2436 3909 750 -4026 765
2341G65K984n978r31O691j498o392M039M669n907j925O466q41n959L123M778m760
$$ 765 3749 -2229 -3160 3531 2033 -4359 -320 4349 -1558 -3483 2983 2142 -3817 -694 4084 -676
2357f76l211N965J096o492J460N993l955m385N711K078o377M15N987k640m825
$$ -676 -3887 2078 3174 -3318 -1858 4135 180 -4205 1506 3584 -2793 -2378 3609 969 -3856
2372c856M290L335n501j551O236p58o025L279M563n246k229O090j43n914K054
$$ -3856 434 3769 -1732 -3283 2953 2195 -3830 -551 4012 -1234 -3463 2627 2484 -3430 -1376
2387a376N229l722l938N127J910n989O97N836l228m580M967K676n793m57N741
$$ -1376 3853 131 -3807 1320 3230 -2759 -2062 3774 546 -4034 933 3609 -2184 -2641 3100
2402C100j757m957L745L552n227j750O078n24n928K958M586m779k533N690K89
$$ 3100 1343 -3614 131 3683 -1544 -3294 2784 2260 -3668 -710 3876 -903 -3436 2254 2543
2417B543n628J682M893l325l707M827J831n792N78N672k810m565M390K792n173
$$ 2543 -3085 -1403 3490 165 -3542 1285 3116 -2676 -2098 3574 764 -3801 589 3381 -1792
2432a792p69N397j376m968L340L885m879k157N644rn470K238M407m071k748N268
$$ -1792 -2561 2836 1460 -3508 -168 3717 -1162 -3319 2325 2316 -3154 -916 3491 -580 -3328 1940
2448A940P18n564J258N092l110l873M671J979n610L50N595k616m475M211K740
$$ 1940 2658 -2906 -1648 3444 334 -3539 1132 3111 -2499 -2149 3446 830 -3645 566 3306
2463C306n102p31N344j325m987L307L802m768j995N475k17n274K360M345m097
$$ 3306 -1796 -2527 2817 1492 -3495 -188 3614 -1154 -3149 2326 2109 -3165 -805 3540 -557
2478e57k893N327R10n567J110M949k934l729M387K058n306p3N471k021m654L714
$$ -557 -3450 1877 2787 -2780 -1670 3279 345 -3384 1003 3061 -2245 -2318 3153 1132 -3522 192
2494A92L131m816j157N268q98n105K897M086m456k333N252K10n185J834M481l580
$$ 192 3323 -1493 -2650 2618 1720 -3385 -488 3598 -858 -3191 2061 2271 -2914 -1080 3401 -179
2510a79l215M873J348n341P38M947k750l753M214K163n146k49N307j782m577L576
$$ -179 -3394 1479 2827 -2514 -1776 3171 421 -3332 882 3045 -2101 -2350 2957 1175 -3402 174
2526A74L078m771j092N130q15m830K552L869l941k336M793M38m897J438M358l139
$$ 174 3252 -1519 -2611 2519 1704 -3126 -574 3295 -646 -2982 1811 2249 -2648 -1210 3148 9
2542Il188M391J463m882M78M556k236l597L514K310m328p93M672r47m363K771
$$ 9 -3179 1212 2675 -2207 -1729 2827 591 -3006 508 2818 -1510 -2303 2369 1422 -2941 -170
2558a70L149m087j377M584l96m396J984L641l368k316M249O72m605J242M125k877
$$ -170 2979 -1108 -2485 2099 1703 -2693 -709 2932 -436 -2752 1497 2169 -2436 -1194 2931 54
2574E4k967L991J410m505L57M275j933l534L249K318m124p99M541j049m180K782
$$ 54 -2913 1078 2488 -2017 -1660 2615 682 -2852 397 2715 -1409 -2208 2333 1284 -2896 -114
2590a14L074m012j419M402k40m139J601L578k853k678L970J218m531N79M335k287
$$ -114 2960 -1052 -2471 1931 1691 -2448 -847 2731 -122 -2800 1170 2388 -2143 -1564 2771 484
2606D84l350L529J853m101l33M197j241l730K635K796l722j456M367k46m294J984
$$ 484 -2866 663 2516 -1585 -1918 2279 1038 -2692 -57 2739 -983 -2439 1928 1682 -2612 -628
2622f28L462l352k019M047L95m105J055L791k402l079L667J687m431K52M261k127
$$ -628 2834 -518 -2537 1510 1905 -2200 -1145 2646 244 -2835 832 2519 -1912 -1660 2601 474
2638D74l190L309J883l954n14M082p72l902K281L051l566j649M337j79m231J909
$$ 474 -2716 593 2476 -1478 -1992 2090 1318 -2584 -303 2748 -818 -2467 1870 1691 -2540 -631
2654f31L358l137k074L771O67l917O60L732k001l102L258J881m172l7M172j685
$$ -631 2727 -410 -2484 1287 1954 -1963 -1303 2429 428 -2674 584 2465 -1707 -1744 2428 743
2670G43l386K884K231l509r95L750l36l707J928L030l353j674M101j2l967J456
$$ 743 -2643 241 2472 -1037 -2032 1718 1382 -2325 -397 2633 -720 -2394 1707 1695 -2272 -816
2686h16L249k551k151L295R07l727M08L747j836l143L098J913l890k30L876j389
$$ -816 2433 -118 -2269 1026 1933 -1794 -1386 2361 525 -2618 480 2393 -1497 -1727 2149 760
2702G60l145K466K215l152j187L587K6l837J540L448l103k182L939N23l932J034
$$ 760 -2385 81 2296 -856 -2043 1544 1570 -2267 -727 2721 -382 -2564 1375 1898 -2034 -1000
2718a000L340k231k518L175J477l864j41M058j425l453K842K120l745l87L881
$$ -1000 2340 109 -2409 766 2243 -1621 -1762 2296 871 -2582 260 2380 -1365 -1752 2129
2733B129j180l420K354K540l118j458L594J35l795J553L251l044j975L823L62
$$ 2129 949 -2471 -117 2423 -695 -2153 1441 1576 -2219 -666 2585 -459 -2434 1389 1751
2748A751l731J053L093k004k406K855J532l615j68L844j473l199K841J924l542
$$ 1751 -1980 -927 2166 162 -2244 611 2143 -1472 -1640 2204 731 -2468 373 2297 -1245
2763a245n05L596p60l234J783K570k611j645L385K13l629J275L280k663k170L407
$$ -1245 -1750 1846 1086 -2148 -365 2205 -406 -2051 1334 1547 -2082 -807 2473 -190 -2360 1047
2779A047P07l393O30K954j703k416K698J607l504l06L711j264l067K553J783l150
$$ 1047 1754 -1639 -1009 1945 242 -2174 524 2131 -1373 -1679 2032 768 -2299 254 2037 -1113
2795a113m45L187o35l011J691K482k636j522L370J17l502J344K961k542j833L128
$$ -1113 -1558 1629 994 -2017 -326 2156 -480 -2002 1368 1485 -2017 -673 2288 -254 -2087 1041
2811A041N13l179O94K903j691k463K578J687l312l61L503j259k864K588J658l174
$$ 1041 1554 -1625 -931 1972 281 -2182 396 2083 -1229 -1590 1913 654 -2210 378 2036 -1138
2827a138n14L310n01l142J489K641k552j632L402J13l566J412K982k526j913L154
$$ -1138 -1652 1658 1157 -1985 -496 2145 -407 -2039 1363 1476 -2090 -678 2304 -222 -2135 1019
2843A019O78l297N18L127j756k528K837J509l596rL668j565k997K785J792l362
$$ 1019 1697 -1600 -1082 2045 289 -2239 598 2107 -1489 -1498 2170 605 -2392 393 2185 -1177
2859a177n35L413o49l121J763K601k998j424L764j44l723J610K944k601j825L137
$$ -1177 -1712 1701 1052 -2069 -306 2295 -703 -2127 1637 1493 -2230 -620 2324 -277 -2102 1035
2875A035O64l408N80L353j872k800K997J715l683k28L700j297l080K529J992l252
$$ 1035 1699 -1709 -1129 2224 352 -2448 549 2264 -1419 -1647 2053 756 -2324 205 2197 -1055
2891a055p52L501m40l436J736K900l028j687L783Q9l757J497K961k572j940L217
$$ -1055 -1807 1694 1254 -2182 -446 2454 -574 -2261 1522 1611 -2146 -649 2312 -260 -2200 1017
2907A017Q39l581M63L493j811k843K979J575l582k5L526j386k970K481K071l204
$$ 1017 1856 -1725 -1262 2231 420 -2423 556 2131 -1451 -1476 2050 664 -2306 175 2246 -958
2923i58r32L480l08l337J564K848k821j710L568K71l678J174L097k236k180K942
$$ -958 -1890 1590 1282 -2055 -491 2357 -464 -2174 1394 1665 -2013 -839 2258 22 -2158 784
2939G84J115l401J73L434j585k896K841J743l531l24L545r78l109K134K225l023
$$ 784 1899 -1502 -1329 2105 520 -2376 465 2208 -1323 -1647 1898 920 -2189 -55 2170 -853
2955h53j044L449l05l393J663K801k749j736L436L30l496J080K990k245k109L023
$$ -853 -1897 1552 1247 -2146 -483 2318 -431 -2167 1269 1599 -1897 -817 2173 -72 -2181 842
2971H42J069l473J69L517j534k993K772J837l420m61L513q99l112K027K407k972
$$ 842 1911 -1562 -1393 2124 590 -2403 369 2206 -1214 -1675 1838 939 -2173 -146 2261 -711
2987g11j365L599ol609J396L083k628k041L423O90l763Q35L475k157k659L110
$$ -711 -2076 1523 1517 -2092 -696 2387 -241 -2282 1141 1831 -1932 -1097 2378 221 -2438 672
3003F72J488l645m9L660j448l170K817K084l642o41L806q42l433K139K674l229
$$ 672 2160 -1485 -1534 2126 678 -2492 325 2409 -1233 -1874 1932 1090 -2343 -204 2470 -759
3019g59j457L846m7l780J519L127k742k028L496P19l825P30L570k031k780L030
$$ -759 -2216 1630 1583 -2197 -678 2449 -293 -2321 1175 1894 -1931 -1201 2369 338 -2442 588
3035E88J587l649j37L770j321l415K649K428l560j004L889n59l605J957K919l079
$$ 588 2175 -1474 -1611 2159 838 -2577 72 2500 -1060 -2064 1825 1266 -2339 -382 2537 -542
3051e42j827L764M76l929J048L416k401k477L450J195l991L08L889j778l151K968
$$ -542 -2369 1395 1871 -2058 -1010 2406 5 -2472 978 2173 -1818 -1510 2379 601 -2550 418
3067D18J920l656m87L858r39l575K279K723l329j401L912k72l738J737L091k903
$$ 418 2338 -1318 -1805 2053 1114 -2461 -182 2541 -788 -2189 1723 1451 -2287 -550 2541 -362
3083c62k075L668P04l952Q98L576k324k680L402J421l930oL854j424l245K711
$$ -362 -2437 1231 1935 -2017 -1119 2457 133 -2547 855 2276 -1654 -1660 2194 770 -2475 236
3099B36K144l537q15L895o11l754K007L058l246j736L983J8l928J537L309k700
$$ 236 2380 -1157 -1972 1923 1312 -2442 -435 2623 -623 -2359 1624 1642 -2286 -749 2560 -140
3115a40k333L470J051l841M54L743k023k997L300J672l930j43L903j385l268K660
$$ -140 -2473 997 2048 -1793 -1339 2404 381 -2616 684 2356 -1574 -1717 2186 801 -2467 193
3131A93K184l549q40L915n63l805K058L001l233j702L940R2l968J454L355k600
$$ 193 2377 -1172 -2012 1903 1340 -2465 -407 2594 -639 -2341 1599 1691 -2277 -823 2532 -68
3147f8k374L400J189l949L42L988k000l269L286J953l928m06L882j037l425K316
$$ -68 -2442 958 2147 -1802 -1460 2528 528 -2741 545 2498 -1430 -1836 2046 1009 -2416 -100
3163a00K692l419j537M063O7m114J541L457k963k192L807O70m071R19L647k159
$$ -100 2592 -827 -2364 1699 1766 -2348 -807 2650 -313 -2505 1302 1972 -2099 -1180 2467 308
3179C08k845L133J738l847k81M080j420l539K913K250l698p59L856o34l589J908
$$ 308 -2537 596 2334 -1513 -1794 2286 866 -2673 240 2490 -1208 -1967 1889 1255 -2334 -426
3195d26L025l090j922L882L49l998J288L451k679k378L543J067l899L07L708j594
$$ -426 2599 -491 -2413 1469 1818 -2180 -892 2559 -120 -2498 1045 2112 -1787 -1480 2228 634
3211F34l090K773K090l749o00M100j093l687K572K570l418j143L667j88l589J509
$$ 634 -2456 317 2407 -1342 -1942 2158 1065 -2622 -50 2520 -898 -2041 1626 1438 -2151 -642
3227f42L165k821k214L854O52m142J076L639k494k525L290J269l713O0L789j520
$$ -642 2523 -298 -2512 1342 1994 -2148 -1072 2567 73 -2452 838 2107 -1606 -1546 2243 723
3243G23l262K766K295l752q40M083p77l695K217K715l183j426L651J45l769J117
$$ 723 -2539 227 2522 -1230 -2070 2013 1236 -2459 -242 2473 -710 -2136 1515 1660 -2109 -992
3259i92L526k482k712L684J155m105O25L696k072k796K978J795l584o23L916p79
$$ -992 2534 52 -2660 1024 2179 -1926 -1301 2395 323 -2473 505 2300 -1284 -1907 2009 1230
3275A230l766K330K811l520j288M015l71l775J795L033k838j949L425P22l690
$$ 1230 -2536 -206 2605 -915 -2203 1812 1441 -2334 -539 2494 -344 -2293 1132 1854 -1836
3290a836O47L493k091k711L320J322l911L33L660j713k845K599J885l162q21L583
$$ -1836 -1189 2304 213 -2498 822 2144 -1767 -1434 2226 513 -2332 267 2152 -1010 -1831 1752
3306A752n59l560K156K666l263j312L717j00l535J317K941k295k126L139R61l631
$$ 1752 1193 -2367 -211 2455 -808 -2120 1597 1497 -2038 -721 2220 -75 -2201 938 1899 -1732
3322a732M47L594j872k955L103J650l650j84L534j154k963K224K189l052j210
$$ -1732 -1285 2309 437 -2518 585 2235 -1415 -1599 1935 781 -2182 42 2231 -821 -2031
3337b031L684j58l743J697K985k899j661L432K28l441J048L069k105k420L036
$$ -2031 1653 1495 -2248 -551 2434 -465 -2126 1306 1534 -1907 -859 2210 105 -2315 721
3352G21J345l650J36L639j630k939K787J734l399l87L497r23l152K027K539k951
$$ 721 2066 -1584 -1448 2191 561 -2378 409 2143 -1256 -1643 1854 931 -2221 -194 2345 -606
3368f06j493L566R0l639J455L007k746j842L433N46l528N55L365j689k759K758
$$ -606 -2099 1467 1557 -2082 -627 2380 -366 -2208 1225 1771 -1757 -1202 2163 474 -2285 473
3384D73J720l648j60L787j428l228K676K112l301q88L551l96l416J729K802k849
$$ 473 2193 -1455 -1615 2172 744 -2484 192 2304 -997 -1885 1666 1270 -2146 -417 2385 -464
3400d64j780L651K74l790J262L253k516k139L247Q44l434L73L310j658k756K839
$$ -464 -2244 1407 1681 -2109 -847 2406 -110 -2249 998 1842 -1592 -1219 2091 433 -2323 516
3416E16J745l714k09L801j325l163K471K059l108q62L435l83l457J713K967k951
$$ 516 2261 -1453 -1662 2139 814 -2349 122 2181 -927 -1789 1646 1263 -2194 -481 2486 -465
3432d65j841L627M14l675J025L204k300k253L118J160l550M7L565j331l124K550
$$ -465 -2306 1321 1735 -1940 -915 2289 -11 -2264 854 2014 -1536 -1489 2076 745 -2379 171
3448A71K141l428p08L706p99l303K035K466k905j389L391J96l527J089L162k383
$$ 171 2312 -1116 -1824 1882 1083 -2220 -185 2281 -624 -2013 1378 1574 -1953 -864 2298 -85
3464h5k166L295P72l572O45L298j868k635K822J588l373l62L530j065l070K310
$$ -85 -2251 1044 1816 -1756 -1111 2187 319 -2316 506 2094 -1279 -1641 1889 824 -2246 64
3480F4K197l275r23L659m49l427J708K703k631j700L266M63l598R66L345k288
$$ 64 2261 -1014 -1937 1722 1273 -2154 -446 2257 -374 -2074 1192 1655 -1943 -977 2368 80
3496H0k450L257J084l586L37L340j578k698K558J790l291n31L516q62l179K092
$$ 80 -2370 887 1971 -1615 -1278 2062 484 -2214 344 2134 -1157 -1688 1828 966 -2213 -121
3512a21K372k976j258L455j19l294J377K712k446j796L143O44l384N84L209j813
$$ -121 2251 -725 -1983 1472 1353 -1941 -564 2148 -298 -2094 1049 1693 -1691 -1107 2102 289
3528B89k454K799J245l205rL205j203k776K194K038k981q97L318m13l148J660
$$ 289 -2165 634 1879 -1326 -1335 1870 667 -2109 85 2123 -858 -1755 1563 1150 -1998 -338
3544c38K471k596j465L123K96l216Q90K834j929k090K716J094l160J19L140j364
$$ -338 2133 -463 -1928 1195 1491 -1725 -835 1999 70 -2020 696 1790 -1370 -1251 1889 525
3560E25k593K368J672l071m34L186p77k846J807K154k574j179L086r6l070J354
$$ 525 -2068 300 1972 -1099 -1533 1653 876 -1970 -163 1991 -583 -1762 1324 1228 -1842 -488
3576d88K513k237j702K895N33l059O86K782j814k041K581J048k998Q2K969j192
$$ -488 2025 -212 -1914 981 1514 -1545 -859 1923 109 -1932 649 1697 -1301 -1219 1750 558
3592E58k524K174J677k842n75L115o76k825J734K172k560j221L058O5l099J114
$$ 558 -1966 208 1885 -957 -1532 1583 907 -1918 -184 1988 -572 -1793 1265 1330 -1769 -655
3608f55K669k155j808K821P50l131M89K875j518k325K397J409k881l21K988q19
$$ -655 2014 -141 -1949 872 1622 -1509 -1020 1855 337 -1988 409 1818 -1063 -1384 1604 785
3624G85k714J893K000k736q63L032l21k868J416K279k202j424K689M35k903O43
$$ 785 -1929 -36 1964 -772 -1635 1397 1076 -1792 -376 1903 -299 -1723 966 1401 -1502 -859
3640h59K715j731k016K522J011k898J07K828j210k356K108J557k673n76K906n28
$$ -859 1856 125 -1891 631 1642 -1256 -1149 1679 469 -1887 221 1778 -895 -1471 1435 907
3656I07k760J667K099k465j161K932Mk888J081K422j912j734K569Q10k949L50
$$ 907 -1853 -186 1913 -552 -1713 1219 1223 -1665 -584 1838 -74 -1808 761 1571 -1378 -1028
3672a028K842j494k232K368J265k832j46K808q85k445J765J817k520q63K907k70
$$ -1028 1814 320 -1912 456 1721 -1111 -1257 1551 666 -1779 -14 1803 -717 -1580 1327 1057
3688A057k808J417K203k267j271K692K05k689P81K383j659j768K317R63k770J09
$$ 1057 -1751 -334 1869 -398 -1669 1023 1228 -1461 -680 1703 44 -1724 593 1556 -1214 -1105
3704a105K745j187k255K029J418k512m17K656n56k446J434K007k229j220K747
$$ -1105 1640 453 -1802 227 1645 -867 -1284 1372 816 -1630 -196 1811 -418 -1638 1109
3719A109J10k749R99K265j885j496K459N50k644L56K513j221k145K084J363k677
$$ 1109 1219 -1530 -531 1734 -151 -1647 812 1362 -1282 -926 1587 366 -1779 305 1668 -1009
3735a009k37K789r32k381J855J614k365p30K552j84k468J027K160j901j462K569
$$ -1009 -1246 1543 611 -1770 85 1699 -666 -1396 1156 972 -1496 -469 1691 -210 -1672 897
3751H97L90k743P73K390j674j692K244Q69k497jK491r22k230J887J505k544n08
$$ 897 1287 -1456 -683 1707 33 -1659 585 1454 -1043 -1044 1447 525 -1705 182 1687 -857 -1365
3768a365K771n99k471J505J802k046j050K425J48k583Q65K340j808j690K541O46
$$ -1365 1406 807 -1664 -159 1643 -403 -1453 972 1120 -1463 -598 1742 -66 -1756 785 1431
3784A431k731M30K461j400j804K024J063k395k44K557p17k359J686J700k434o26
$$ 1431 -1300 -870 1591 191 -1613 411 1474 -921 -1165 1392 675 -1684 2 1702 -732 -1358
3800a358K613m29k329J281J810j963j072K367K47k525O86K303j597j672K285O54
$$ -1358 1255 826 -1503 -222 1588 -375 -1447 920 1167 -1358 -672 1631 34 -1638 647 1301
3816A301k519M19K297j226j861J863J256k352m66K592n75k357J605J700k348p36
$$ 1301 -1218 -799 1498 272 -1589 274 1530 -822 -1288 1304 729 -1628 -23 1677 -671 -1407
3832a407K648l15k459J181J971j773j363K271N18k539N21K400j568j764K279P93
$$ -1407 1241 926 -1533 -352 1619 -154 -1517 754 1272 -1267 -746 1654 86 -1678 601 1394
3848A394k499J62K329r58j932J637J320k136n44K433m72k308J473J709k144p99
$$ 1394 -1105 -943 1386 428 -1504 133 1453 -683 -1227 1206 734 -1574 -101 1608 -536 -1335
3864a335K328o7k220Q68J859j534j314K094N74k453L35K424j345j784J990R03
$$ -1335 993 926 -1294 -426 1433 -101 -1415 679 1253 -1200 -865 1559 214 -1570 420 1323
3880A323k256MK231p92j994J491J563k163p71K512k40k399J227J839j962r91K268
$$ 1323 -933 -929 1302 510 -1484 7 1570 -593 -1364 1148 908 -1491 -264 1575 -387 -1378 890
3897H90J52k301O39K132j458j609K089Q09k419J82K359j216j787J912R72k243
$$ 890 1042 -1259 -620 1512 54 -1555 534 1343 -1076 -894 1465 249 -1538 374 1346 -897
3913h97j12K230o19k032J330J607k014p93K385k74k270J277J712j890j007K213
$$ -897 -1009 1221 602 -1430 -100 1507 -507 -1300 1085 811 -1459 -182 1530 -360 -1367 846
3929H46K50k267N23K086j339j626K092P85k504K79K438j226j949J900J172k257
$$ 846 1096 -1171 -648 1438 99 -1527 565 1350 -1154 -875 1563 337 -1612 288 1460 -797
3945g97l27K329n42k193J427J709k183q20K580k49k460J220J854j848j079K177
$$ -797 -1124 1205 663 -1530 -103 1606 -577 -1397 1183 934 -1526 -306 1548 -300 -1379 798
3961G98K55k266N86K174j494j631K200P52k476K32K299j200j676J783R92k140
$$ 798 1053 -1213 -627 1547 53 -1578 622 1374 -1102 -870 1429 229 -1447 336 1328 -812
3977h12k31K280o47k073J403J579k017p60K316k04k195J095J686j691j051K054
$$ -812 -1043 1237 590 -1483 -80 1499 -518 -1278 1038 834 -1361 -266 1420 -271 -1322 732
3993G32L32k198M29K111j278j579J904P81k200J31K109r10j745J504J202j934
$$ 732 1064 -1134 -705 1406 128 -1451 453 1234 -966 -835 1274 364 -1381 123 1325 -609
4009f09n07K153l17k042J171J522j744q83K131L5k155Q28J760j432j177J804M71
$$ -609 -1116 1037 720 -1322 -151 1371 -373 -1256 875 910 -1245 -417 1343 -89 -1266 538 1009
4026A009j960K88J917j103j526J771Q03k014NJ933p39j642J340J131j772m51J967
$$ 1009 -951 -663 1254 151 -1375 396 1199 -815 -810 1123 384 -1258 82 1213 -559 -1010 957
4043I57l05j941J130J462j651p87J892P6j897O31J695j328j172J813M72k017L34
$$ 957 652 -1289 -159 1303 -348 -1135 757 833 -1064 -433 1262 -66 -1238 575 1047 -970 -636
4060f36J872j026j536J621Q62j932n8J949p39j603J294J132j727n04J965k70j880
$$ -636 1236 210 -1326 295 1157 -775 -833 1116 377 -1226 68 1200 -527 -1031 934 664 -1216
4077a216J041J414j593p42J849L8j853O62J628j323j134J798L98j913L61J748
$$ -1216 -175 1239 -354 -1096 753 791 -1062 -400 1228 -95 -1229 569 967 -946 -585 1163
4093A163j030j344J556P88j941LJ920p25j627J312J130j756m24J887k68j848J026
$$ 1163 133 -1211 345 1133 -808 -805 1115 390 -1237 75 1205 -551 -975 912 644 -1204 -178
4110a78J453j618p56J804J47j880N71J649j222j156J673N23j900K37J798r32j411
$$ -178 1275 -343 -1099 705 852 -1028 -457 1192 -30 -1186 487 1010 -890 -653 1145 213 -1198
4127a198J422Q73j764j68J854n72j605J219J056j570m26J671j68j652P97J382
$$ -1198 224 1097 -667 -835 1019 447 -1158 61 1117 -453 -879 792 624 -1028 -231 1151
4143A151j377q16J685J25j708N55J476j079j093J490M73j651J59J610p94j312
$$ 1151 -226 -1042 643 768 -940 -385 1091 12 -1081 409 882 -769 -610 1000 206 -1106
4159a106J280Q38j569k91J775m41j605J041J190j509n78J694qj701O62J467j251
$$ -1106 174 1012 -557 -848 927 486 -1119 -78 1112 -397 -975 719 711 -990 -328 1139 -112
4176a12r81J659K79j741M41J519r77j134J397O33j687K4J694o93j435J235R29
$$ -112 -1093 566 845 -896 -455 1064 87 -1047 350 983 -704 -680 1014 321 -1114 121 1050
4193A050j572k98J671l67j540R61J168j414n77J572L6j602N18J488j141j032J600
$$ 1050 -522 -820 851 484 -1056 -95 1073 -341 -918 654 690 -912 -394 1094 -47 -1079 521
4210E21L58j765L54J569q81j195J248P81j602j86J744n11j564J170J066j553m51
$$ 521 879 -886 -532 1037 156 -1039 209 990 -612 -798 946 435 -1129 41 1107 -446 -897
4227h97J692j74j655Q14J328j331q03J638J84j727M84J542j060j158J594M27j721
$$ -897 795 621 -1034 -220 1108 -223 -1026 612 796 -931 -447 1095 35 -1123 471 898 -823
4244h23K44J579q06j250J254P76j533k70J694l74j596J094J100j527m54J630j74
$$ -823 -579 1000 194 -1056 198 974 -559 -829 865 491 -1105 -11 1089 -438 -892 738 564
4261E64j491O67J321j182q93J529L17j669L32J554r43j166J412O07j685N8J649
$$ 564 -927 -260 1061 -121 -1014 515 832 -837 -505 1049 106 -1060 352 959 -726 -668 981
4278I81o62j357J093R99j475m52J692k46j683J021J196j443n93J595%j577N31
$$ 981 319 -1038 55 1054 -421 -873 819 573 -1110 -89 1107 -336 -929 666 666 -911 -380
4295c80J399j049j011J494M25j683K76J541q85j162J290O52j496j06J507m60j303
$$ -380 1019 -30 -1041 453 878 -805 -529 1012 127 -1035 255 907 -589 -695 812 352 -951
4312i51R75R56j358m85J603j32j577P68J262j304o73J486J02j450L65J369q66
$$ -951 24 980 -378 -863 740 608 -969 -201 1061 -243 -916 570 672 -778 -413 956 90
4329I0j133J356O41j655N2J592p09j228J121Q18j452k30J528l25j477R00J166
$$ 90 -1043 313 954 -701 -649 943 234 -994 127 945 -507 -737 791 466 -1011 -111 1055
4346A055j380n93J595l8j575P32J254j266p11J495J46j478L23J380q21j096J314
$$ 1055 -325 -918 677 639 -936 -204 1050 -216 -927 568 714 -764 -441 939 118 -978 336
4363C36N78j644J40J545p71j168J152P36j388k63J484k62j435Q53J097j318n46
$$ 336 914 -730 -590 955 184 -984 168 904 -484 -747 737 475 -960 -107 990 -328 -874
4380h74J548j00j490O58J267j126q33J390K84j481L11J371p91j139J315O33j650
$$ -874 674 574 -916 -258 1009 -117 -950 440 724 -757 -446 925 134 -1005 310 943 -707
4397g07Q1J547o48j234J065P87j328k83J463k32j484Q88J116j340n87J555p7j448
$$ -707 -626 921 273 -961 104 891 -437 -720 743 511 -973 -85 1031 -309 -896 659 582 -866
4415h66O08J175j027q43J400L39j544K53J447q16j158J303O57j587K0J539o44
$$ -866 -258 917 -110 -953 447 786 -758 -505 942 126 -1032 271 928 -659 -639 900 256
4432B56j232J107Q20j404l67J586j66j603Q04J297j380o15J603r5j534O47J329
$$ 256 -976 131 951 -453 -820 766 600 -1003 -199 1098 -282 -897 706 611 -923 -276 1053
4449A053j083j010J447N11j683J90J628r36j162J320O67j607l1J607n58j377J060
$$ 1053 -30 -1040 407 918 -765 -575 1053 117 -1045 275 942 -665 -696 911 353 -1024 36
4466C6R87j438m29J552j35j542P89J234j336o55J584O5j568M87J300q82r82J283
$$ 36 1023 -415 -844 708 573 -969 -180 1054 -282 -937 647 712 -856 -369 931 49 -933 350
4484C50N12j562J45J544q25j242J296P32j484j91J500l69j371R11J067j385n27
$$ 350 862 -700 -555 989 164 -1078 218 950 -534 -725 775 406 -965 -54 1013 -372 -899
4501h99J612p7j578O54J313j170q29J499K42j548L40J395q34j118J258O67j595
$$ -899 713 636 -942 -288 1025 -145 -974 525 767 -781 -441 954 120 -998 260 927 -668
4518f68PJ605o42j276J134P74j403k55J422k19j363P55J116j214o70J475N5j465
$$ -668 -661 944 302 -974 160 934 -469 -724 698 479 -884 -129 987 -227 -897 578 633 -832
4536h32N40J205j000q34J332L76j530K56J361o81j131J113O83j412j39J548n07
$$ -832 -292 913 -87 -921 411 787 -743 -487 874 193 -938 175 858 -554 -693 855 348
4553C48j306R89R53j386l98J446q2j428O21J217j131p87J509J14j498M47J364
$$ 348 -958 31 984 -402 -800 646 564 -864 -243 974 -157 -944 565 679 -819 -372 992
4570I92r53j026J319N24j517O0J506p04j173J154P98j492k53J565l49j418Q95
$$ 992 39 -987 332 856 -661 -601 905 201 -972 182 980 -512 -765 800 451 -967 -72
4587g2J026j265n03J438jj493N65J327j100r36J483L11j584L35J385q06j088J252
$$ -72 954 -311 -814 624 623 -870 -305 1022 -78 -1014 469 780 -804 -469 916 110 -978 274
4605B74O31j519j32J639n14j416J087J009j454m48J590j69j543P97J271j327p70
$$ 274 905 -614 -746 893 379 -1037 50 1059 -395 -843 747 578 -965 -168 1103 -224 -994
4622i94J594J75j651M32J473r85j116J460N39j703J76J607p66j315J223Q49j521
$$ -994 600 775 -876 -444 1029 44 -1072 388 927 -776 -600 1007 241 -1074 149 998 -523
4639e23l39J693l34j551R60J198j444o23J674k4j643O06J449j156r97J573L39
$$ -523 -862 831 497 -1054 -94 1104 -340 -963 711 687 -956 -350 1099 -57 -1054 519 858
4656H58j650K46J547q23j241J328P36j625j37J675n31j425J052J013j417n02J611
$$ 858 -792 -546 1001 178 -1063 265 1001 -624 -761 914 383 -1042 10 1023 -394 -896 715
4673G15j00j591P38J303j244q13J525K18j565L61J451r22j060J312N57j521L2
$$ 715 615 -976 -238 1065 -179 -992 533 751 -814 -453 998 76 -984 328 885 -636 -604
4690f04J469n76j266J042Q99j389l48J510k58j380P88J084j183o39J420J10j477
$$ -604 865 289 -977 65 964 -425 -773 737 479 -901 -113 971 -212 -851 569 679 -798
4707g98M07J330r49r05J289M11j461J42J407o44j157J044P48j365j97J453l21
$$ -798 -391 939 -10 -915 374 785 -676 -534 873 229 -928 116 864 -501 -698 755 434
4724D34j325P93J042j221n58J416j7j389N72J179j016p71J226L72j372J50J340
$$ 434 -891 -98 944 -277 -835 581 564 -825 -253 926 -90 -861 365 737 -635 -485 855
4741H55o93j075J138N92j330o1J275l28j160P69Q66j097m38J246l5j255N08J017
$$ 855 162 -913 225 817 -513 -574 701 373 -787 -18 848 -249 -687 559 524 -731 -223 794
4759G94q90o79J157K24j232K57J129o50r10R62N41j124j52J262l94j125Q82P62
$$ 794 -96 -775 382 606 -626 -369 760 110 -800 162 703 -421 -573 689 295 -830 52 814
4777H14j146l10J221j64j130N40R76r26o44J206J81j273L13J149p74q10J070L56
$$ 814 -332 -642 579 415 -715 -175 801 -125 -769 437 618 -655 -342 807 33 -777 293 649
4795F49j176P4J179n54r45R14N94j114j83J186k97j092P30P84j057l36J158o2
$$ 649 -527 -453 726 172 -773 141 735 -379 -562 624 327 -765 -35 749 -308 -644 514 452
4813D52j113M62R41q08o82J096K55j215K81J083p36p74J026L93j122j3J126l85
$$ 452 -661 -199 742 -66 -748 348 603 -612 -331 752 16 -758 268 661 -461 -474 652 267
4831B67r92P56P15j075k53J209k58j092O42Q32r34m69J080N9j094L26R71o87p46
$$ 267 -725 31 746 -329 -582 627 369 -723 -81 751 -183 -652 428 487 -607 -281 690 3 -743
4850g43R98L90j213J45J113n87p89Q39M86r89j69J083k39j020O71P77j040l25
$$ -743 255 645 -568 -423 690 103 -686 153 639 -350 -519 564 325 -695 -24 753 -287 -612
4868f12J118q4j053M74Q64p98n58J007J45j061K50J014n90q24R25M36j090J4J051
$$ -612 506 422 -631 -157 707 -91 -649 358 503 -558 -308 706 116 -708 217 653 -437 -423 628
4887F28m46q61P95N44r76k41J087j57j091N91Q63r26m78J140l5j056M33Q59p09
$$ 628 182 -679 116 660 -316 -557 530 373 -718 -127 736 -190 -668 472 437 -619 -186 673 -36
4906c6o32R46K88j079J51J007n22p93Q35M55r87j00J040l48q71O48O15q06l45
$$ -36 -668 278 566 -513 -362 645 123 -670 165 620 -367 -467 573 225 -646 2 617 -189 -534
4925e34R42Or70L91Q28p87m70R17J36r56K25Q20m62o91P43M09r46k5R86l90q35
$$ -534 408 414 -556 -165 663 -124 -594 323 459 -497 -272 548 86 -605 138 547 -399 -424 562 172 -663
4946f63P04N54q98j85R18r4q89M49P09p44m37R22J00r83K97Q63o32n93Q43K47
$$ -663 41 595 -303 -488 430 336 -553 -104 605 -139 -576 346 446 -537 -240 623 -9 -602 241 488
4966D88r18J13Q54m12o89O39N07q59j91R47k08q67N98N34p37k59Q23Mq86L33P60
$$ 488 -430 -317 537 125 -564 75 582 -277 -468 479 271 -596 2 536 -201 -460 363 367 -519 -186 574
4987E74o19n41Q44K19r21J51Q45m72o59P27L78q86k7Q80k46q14N63O00p99k98
$$ 574 -45 -586 258 477 -444 -293 552 80 -579 148 526 -360 -387 493 247 -567 -4 596 -203 -501
5007e01R62j29r39N41O80p41m06Q52J03q92K09Q60o02o03Q38K55r15J07Q57m29
$$ -501 461 332 -607 -66 614 -127 -533 319 422 -470 -261 599 -3 -606 232 487 -428 -321 536 107
5027A07o80O71M25q26j01Q53k39p65N14O10p50k85Q52n0q52M00O37o12l93P55
$$ 107 -573 98 523 -303 -404 449 210 -555 -41 569 -181 -466 386 336 -516 -116 521 -91 -484 271
5047B71J08q08J88Q14n38o32P85L23r26R8Q03l53o84O38M27p87j92R47k15q52
$$ 271 379 -429 -241 573 35 -597 188 511 -415 -317 486 133 -551 87 514 -273 -465 482 267 -585
5067e85N45N99p71k93Q76n4q54L89P51o86m71Q42J28q76K16P83n06o36Q19K66
$$ -585 -40 559 -212 -505 371 317 -537 -148 603 -83 -554 288 416 -460 -244 539 33 -603 216 482
5087D82q56P1Q32l89o77O14M78p73k23Q54j07q42N10N98p50l00Q40k2q61L60P05
$$ 482 -374 -303 529 140 -537 77 555 -218 -441 413 306 -536 -26 572 -178 -478 362 340 -521 -161 544
5108E44n98m94Q20J41q61K28P53m87o26P49L34r02N7Q57l97o80O52M47q15j48
$$ 544 -54 -548 272 413 -448 -220 533 46 -580 169 503 -399 -342 515 118 -562 90 537 -278 -426
5128d26R01k16q25N42O19q05k82Q76p2p79L41O83o17m92Q64R6q54K08P52m66o47
$$ -426 475 259 -566 -24 595 -210 -492 384 312 -467 -126 557 -60 -552 312 408 -446 -238 514 48 -599
5149e99P48L16q08J3Q29l63p02O24M59p95j44Q36j41p83M67O21p79k87Q82m7q53
$$ -599 149 465 -343 -330 499 136 -566 58 517 -278 -422 414 273 -510 -43 578 -201 -488 394 347 -506
5170e06L83O82n97n04Q08K11r18J83Q38n18o24P53L19q55k5R17l54p76O21N50
$$ -506 -123 559 -38 -542 266 477 -441 -258 580 62 -562 191 510 -345 -370 547 193 -583 38 588
5190E88q24k08Q59j37p92M50O41p31m08R12K7q85L41P05n53n06Q01J61q64J13
$$ 588 -236 -444 415 278 -514 -64 577 -154 -562 350 377 -508 -167 538 -15 -521 280 441 -423 -310
5210c10Q89n29o07P27L31q24n1Q77k88p90N95N35q02k08Q96j60q12M14P20o94
$$ -310 579 50 -557 170 501 -323 -374 503 215 -575 20 555 -247 -455 441 281 -531 -117 603 -91
5230i1m83Q90J23r18K70P51n49n82P72L27q85J2Q88m00o84O40M27q12j28Q43j59
$$ -91 -574 316 439 -479 -209 542 -7 -589 183 510 -375 -363 525 125 -559 81 508 -304 -432 411 252
5251B52p94M74O11p22l02Q45m5p74K76P17n59n01P75J64q35J83P40m48n61O49
$$ 252 -542 -68 543 -179 -481 364 319 -455 -179 538 -21 -522 253 417 -418 -235 505 57 -504 145
5271A45L48p89j13Q69k79p31N99N08q21j76Q37j23q06L93P08o72m39Q50O5q33
$$ 145 493 -296 -409 460 181 -550 49 557 -264 -440 397 274 -532 -139 569 -103 -542 308 373 -460
5291d60K38P55n28n38P37K42q48R9Q13m06n97N77L88p00j44P89j82p53N24N18
$$ -460 -222 533 5 -533 204 446 -402 -303 510 104 -493 84 472 -228 -372 417 235 -518 6 524
5311E24p13j96P51q6p13L07O25n52m74P45J82q12J80P13m38n29O41K64p60K2P62
$$ 524 -189 -385 366 280 -433 -126 499 -53 -527 218 400 -412 -232 481 43 -486 155 419 -341 -319 443
5332D43l12o47N75M20p06j85Q49k13p80N42N58p16k52P82p4o96K81O45n37m86
$$ 443 131 -516 59 479 -227 -412 437 224 -556 -14 544 -172 -424 358 284 -412 -131 514 -23 -509
5352e09P38J84q33K17O92m56n16O47K67p49j3P49k75o44N55L80o67j66P80j47
$$ -509 229 413 -420 -203 489 33 -483 164 431 -318 -331 418 143 -501 54 434 -233 -399 381 234
5372B34p18M14N57o62k26P25l6o94K66O07m89m65P04J85p91J37P32m63m99O16
$$ 234 -484 -70 487 -175 -401 324 288 -406 -140 467 -22 -487 217 402 -389 -252 480 17 -482 134
5392A34L04o96m7P39k44o80N02M86o77k20P75j13p35L78N48n65l33P09M6o93J98
$$ 134 438 -258 -305 434 190 -490 12 498 -179 -399 376 263 -472 -94 454 -111 -444 265 311 -382 -184
5413a84N99l93m78O03K71p43M5P29l58n72N64K97n96j10O77j34o76M13N36o56
$$ -184 415 22 -456 147 418 -325 -280 449 91 -481 83 380 -216 -326 351 217 -459 -46 490 -166
5433a66k31P10l4o69K70N52m56m37O74J63p20J16O34l27n36N66L21p15k7P36k78
$$ -166 -397 313 279 -390 -120 432 -24 -461 213 376 -344 -228 406 79 -457 109 430 -285 -312 424 146
5454A46o36N43L72o15j45O34m3o50L45N48o52k52P17m3o58K88N14m35m09O02K13
$$ 146 -490 53 425 -190 -335 299 256 -394 -49 499 -153 -405 312 269 -389 -101 413 -22 -431 171 384
5475C84p17J60O14m18m39N49K23o54J1O77k48n67M67L53n95j13O29j02o26L57
$$ 384 -333 -173 441 23 -416 133 356 -298 -287 390 142 -425 42 395 -200 -313 316 214 -412 -55
5495e5N15o05k78P13l2o49L05M90m73l49N96J90p31J28O62m01m43N66K20o62N8
$$ -55 460 -145 -423 290 258 -391 -86 404 -69 -418 178 368 -363 -235 427 26 -417 149 369 -293 -235
5516b35O16k20n98N14L77o55j22O52j47n91L22N13n34k69O59l7o12K34N00l60
$$ -235 381 161 -437 77 454 -201 -323 329 182 -409 -87 426 -108 -377 282 245 -367 -133 367 7
5536Gl70M74K29o28N4O40l46m67N07K65n93p2O07j25n65L70M47n59k20O39o2n96
$$ 7 -363 111 340 -288 -234 406 60 -407 100 365 -228 -300 307 182 -383 -13 434 -125 -345 294 232 -364
5558c64K95M86m56l74O60P1o88J90N90l89l95N01K25o35J4O66k78n61N04L39n89
$$ -364 -69 417 -39 -413 247 318 -370 -180 410 21 -374 127 352 -283 -269 397 119 -442 62 401 -188
5579a88n7N56j54n56L35M94n73k34O42j0o22K57M79l92l23N15J69o38J33N70l66
$$ -188 -245 311 157 -399 -64 430 -143 -377 265 255 -367 -110 369 -23 -346 169 338 -300 -167 403 37
5600C7m70N56K62o28l2O69k37n94N07L35n93r7N97r7o02K82N65n52k89O47M9o59
$$ 37 -433 123 385 -243 -275 394 157 -437 70 405 -188 -285 312 215 -387 -105 460 -92 -381 266 315 -344
5622c44K24N40m34l77N46J90o72R7O28l23m82M96K80n95o1O23j76n67M08M02n76
$$ -344 -120 420 -14 -391 155 345 -327 -230 398 75 -407 89 369 -226 -287 336 160 -407 1 403 -173
5643a73j58O08l8n75K30N18m58l54O60L5o70K43N33l99l66M94K30o71R1O01l03
$$ -173 -331 277 239 -336 -106 412 -46 -400 260 295 -375 -132 401 2 -364 130 360 -311 -220 381 78
5664G8n01N05K88o40k7O23j67n81M35M19o24j72O69j22n90L28N23n28l32O60P0
$$ 78 -423 82 370 -270 -297 326 159 -422 13 432 -192 -364 305 183 -407 -79 444 -84 -416 244 314
5685C14o99K62N60m80l56N78J69o85J30O35l30n82O10K66o30l4O33k14n53M04
$$ 314 -385 -123 437 -43 -399 179 348 -337 -207 428 98 -484 126 392 -238 -272 361 147 -406 -2
5705bM65o25k32P34r3o56L08N23n28k78O09P3p13K43O07m82l69N93J53o44Q3O22
$$ -2 463 -162 -394 340 247 -409 -101 422 -106 -384 225 298 -415 -172 435 -47 -416 177 330 -314 -231 391
5727C91k68n68N39L39p10J8O13j72n84L91M39n70k31O98q6o32L15N06n06l20N90
$$ 391 123 -445 94 433 -277 -259 354 182 -402 -11 428 -142 -373 325 239 -393 -78 428 -78 -398 192
5748A92J12o05R8N99l72m29N68J61o09M8O02k42n23M48L51o12p6O30k01n40L93
$$ 192 304 -301 -203 396 24 -405 163 324 -285 -237 365 123 -400 48 399 -213 -289 341 140 -400 -7
5769gL87n04k45O43k9o35L16M88m89k94N80R1o36J51O30m38m54O30J67o43N0O21
$$ -7 380 -124 -369 274 245 -390 -74 414 -75 -369 211 302 -334 -183 447 9 -445 185 352 -291 -241 380
5791C80k77n55N09L49o17j28P19j92o18M08L96n17k45O70j7o61K69N74m95l61
$$ 380 103 -452 57 406 -211 -339 380 188 -430 -22 374 -143 -388 282 265 -396 -127 447 -48 -409
5811d09N80J41o14P8O28l38m77N60K21o47J2O22j77n82L86L94n58j56O88j77n94
$$ -409 171 312 -302 -224 404 66 -411 149 370 -277 -265 357 180 -402 -16 378 -180 -336 352 175 -419
5832d19L78M41m88k84O17N0o74K15O21n23l80O33J47o51Q7O10l41m78N32K86o39
$$ -419 -41 400 -88 -372 245 295 -379 -164 457 -66 -446 187 334 -317 -230 380 39 -439 93 379 -260
5853b60nO13k03n39L86M13n88j85O97j19o06L33M45m87k39N67O4o02J46N85m09
$$ -260 -265 348 145 -394 -8 405 -183 -368 329 210 -396 -63 382 -105 -344 223 287 -315 -169 416 7
5874Gm53O12J68o29P3N62k65n05M88L21o01r5O44j65n91L95M33n34k58O74l2o35
$$ 7 -446 166 334 -295 -222 340 75 -430 58 379 -222 -317 327 162 -429 -34 399 -135 -393 281 249 -386
5896c86L03M76m81k80N58J12o16J21N89l41m84N94J93o01K2N43k28m69L95L83
$$ -386 -83 393 -88 -368 190 302 -314 -193 396 55 -429 165 358 -243 -221 322 94 -375 20 403
5916D03n54j82O12p7n59L14L93m37k60N42P5n68J28N05l40l40M91J71n42m0O20
$$ 403 -151 -333 279 202 -357 -43 350 -87 -347 195 270 -298 -170 335 -5 -345 146 317 -225 -265 355
5937C55k47n14M81K76n57m1N24j32m41K65L86m51k35N73pn43K04M67l90l07N04
$$ 355 108 -406 75 351 -206 -247 277 145 -296 -31 355 -96 -331 242 235 -308 -104 363 -27 -334 170
5958A70J08n25O1N09k55m53N13K25n87j0N57k20m46L75L17n08j12N18o2m95K45
$$ 170 278 -247 -186 323 68 -385 128 353 -234 -244 313 93 -353 22 339 -169 -281 237 175 -320 -75
5979g5M36m04l10N33J05n86J94M55l35l37M74J01m74K8M93k16m27M09K45m90n2
$$ -75 361 -43 -353 180 285 -301 -107 348 13 -324 150 251 -223 -195 298 82 -345 64 309 -181 -233
6000b33N19j62m46L28L29m66j78N09On46K35M57m31k61N34M6n72J89M90l62l22
$$ -233 286 124 -322 6 335 -131 -309 200 206 -340 -105 352 -79 -340 194 240 -332 -143 347 -15 -337
6021c37M54J55m93kN16j85m47L81L13n36p3N37j21m65K64L39l68k39N25J2n01
$$ -337 117 272 -221 -223 293 108 -339 42 355 -181 -254 283 162 -303 -39 300 -68 -307 218 230 -271
6042b71J78M33l24l42M57J28m78N8M30k16l50L72K19m64p7N08j10m83L28L49m92
$$ -271 -93 340 16 -326 131 259 -219 -161 269 53 -297 75 294 -170 -247 261 151 -332 -4 345 -147
6063a47j21N12q9m81K36M33m00k59M67Q6m84J04M99l34l37M57J48m81J5M99k25
$$ -147 -268 244 155 -326 -90 343 -57 -316 151 237 -247 -143 356 22 -315 142 290 -191 -176 323 98
6084I8l93L63K69m62j30M97q8m46K64L42m32j52M56%m68J88L83l08k57L74J41
$$ 98 -295 68 337 -125 -255 242 154 -292 -28 314 -118 -270 186 186 -282 -94 289 -19 -276 98 239
6105B39m45N4M31k56l27M02J74m77J5M34j56l83L13K72l93j12M34l1m62K37L42
$$ 239 -206 -152 279 23 -304 98 272 -205 -190 244 88 -295 18 290 -103 -215 219 188 -274 -37 305
6126C05l38k48M47N8m35P7M30k89k89L78J71m78J6M52k00l29L22J88l93o3M24
$$ 305 -33 -281 166 224 -211 -134 296 7 -282 96 267 -211 -195 257 57 -272 50 238 -155 -218 206
6147B06o4m27K44L47l83k05M66Rm48J85L41l00k18L76J25m74P5M27k35l54M05
$$ 206 142 -285 -41 306 -77 -282 184 193 -255 -70 271 -29 -247 129 254 -220 -145 282 47 -307 98
6168I8J81m53lM53j79l61K85K68m01j08M34o9l99J80L45l24j87M07Lm32J75L47
$$ 98 279 -174 -177 276 97 -264 21 289 -112 -220 214 145 -254 -74 271 -53 -240 167 170 -262 -87 260
6190B60k93k42M12P6l78J5L74j51l23L07J73l91k4M14j19l47K39K64l78j07M06
$$ 260 -33 -275 137 213 -165 -150 224 73 -250 57 230 -161 -185 229 110 -237 2 266 -112 -219 187
6211A87l4l84K01K83k84j91M01L4m25J19L51k64k53L57J22l77j0M11j93l27L26
$$ 187 153 -231 -30 253 -31 -222 179 213 -212 -93 258 -6 -259 98 220 -157 -167 244 51 -276 50
6232E0K05l91j8L62j36l27K54K61l63j02M05n7l69J70K89k69j92L74N5m06J42
$$ 50 255 -136 -154 208 72 -255 -1 260 -103 -205 200 143 -226 -56 233 -36 -228 146 201 -205 -63
6253f3L35k64k56L48J07l76L1L68j58l31K88K31l93m4L77j12l24K06K61l01j23
$$ -63 272 8 -248 100 207 -169 -138 230 72 -259 29 260 -133 -177 200 88 -236 -30 231 -70 -193
6274a93L47Ol96K03K68k91j72L46P5m21J14L90k40l22L53J47l80qL89j26l54K93
$$ -193 154 160 -236 -33 235 -56 -228 118 193 -228 -114 276 36 -286 67 214 -166 -174 215 89 -265 28
6296B8K33l94o8M10p6m10K20L22l65j22L89kl72J26L26k63k67M26M8m13R9L73
$$ 28 261 -133 -201 209 133 -277 -57 265 -100 -222 167 165 -207 -81 245 -18 -285 141 189 -224 -125 248
6318B48k14k96L55J27m10lM22j47l76L37K19l82j05M33r8l65K65K75l47j69M25
$$ 248 34 -262 93 220 -190 -193 229 82 -294 43 262 -120 -225 208 110 -255 10 285 -62 -231 194
6339A94k7l96J78L46l14k45L74J24m46Q8L77k47k93L70J54m11j4M28j63l50K68
$$ 194 167 -229 -51 295 -19 -264 110 234 -212 -124 253 6 -287 83 237 -174 -188 240 77 -273 -5
6360eK78l95j12M43p6m08K29L15l32j59L86N3m49J28L56k54k73L86J22m14L8M04
$$ -5 273 -122 -234 209 133 -275 -46 269 -63 -222 164 217 -232 -104 252 -2 -275 111 233 -181 -143 261
6382B61k07l12L21K22m55k1M28j21m05K76K85l70j46M23k8m29K10L29l07k17M05
$$ 261 54 -258 63 285 -170 -191 237 116 -289 -13 272 -98 -244 179 151 -278 -68 261 -46 -263 142
6403A42O7m52J12M42l12l02M11J51m86M5M11j12m16L03K66l77j49N18q1m60K29
$$ 142 209 -243 -131 311 -1 -303 108 259 -227 -182 229 117 -299 4 270 -107 -256 262 181 -279 -50
6424e0L35l35k30M33L0m19J70L71l26k69M14J20m55M4M59k10m00L79K13m79qM44
$$ -50 285 -50 -280 153 183 -236 -66 305 -21 -290 124 244 -211 -167 292 82 -318 61 274 -205 -213 231
6446B31j25m20L02K93m07j17M47nn07K55L68l96j81M56M0m81J24M38k96l09M12
$$ 231 106 -314 -12 281 -126 -243 204 199 -308 -53 315 -81 -262 194 234 -247 -123 315 19 -290 122
6467A22J46m73M8M46k14l94L94K26m69n8M95j25m37K93L11m05k08N06j4m83K07
$$ 122 268 -205 -157 289 75 -319 75 301 -168 -226 269 144 -293 0 311 -94 -302 204 190 -293 -86
6488h6M13l57k67M51O7m24N2M60k71l52M21J86m86l8N18j78m36L41L17m69j11
$$ -86 327 -30 -297 154 221 -203 -151 309 38 -314 107 293 -193 -231 287 109 -327 14 331 -138 -249
6509b49N12r1n06K92L87m10k15M94M8n69K25M69m21k49M72O6n14P4N16k42m60
$$ -249 263 172 -334 -42 345 -65 -280 214 262 -307 -82 387 -34 -283 189 255 -259 -185 331 89 -371
6530c71M58K62n78k0N52j73m67L48L63n10j85N64l5n32K15M51l81k85N35P2n81
$$ -371 87 349 -229 -249 303 130 -337 11 374 -136 -321 243 208 -324 -109 342 -39 -324 211 283 -298
6551b98J51N22l74l65N31J27n29M0N27k08m99M51K73n56o8O27k17n11L84L66m84
$$ -298 -147 375 1 -364 167 294 -235 -195 332 124 -375 76 349 -207 -275 352 135 -376 8 374 -110
6572a10j91N39mn86K29N03m56k99N83R0o32J46N69l56m13N16J90n69L6N82k41
$$ -110 -301 238 234 -352 -123 380 -76 -375 208 298 -334 -188 381 25 -388 128 318 -251 -215 367 126
6593A26n24M24L59n65j02N98j53n30L69L62m69k10N74L1o41K31N25m65l23N82
$$ 126 -398 26 385 -180 -282 316 163 -367 2 364 -105 -315 259 290 -351 -120 405 -60 -383 199
6613A99P1n85J35N48l54m07N22K33o30OO07k39m80L86L61n67j22O48j55n25L35
$$ 199 270 -315 -180 368 14 -393 129 362 -268 -262 345 106 -374 12 373 -194 -316 332 177 -348 -13
6634a3M08n10k10N71on79K45M63m02l23N92Q7o09J32N12k77m39M33K54n50m8N82
$$ -13 395 -115 -325 246 240 -339 -94 369 -33 -356 236 323 -286 -154 358 81 -358 75 329 -221 -269 313
6656C13j83n26M10L73n40j76N75m2n57K60M76m63k75N53Q0n84J47N07l55l76N28
$$ 313 130 -396 14 387 -153 -329 246 204 -353 -93 383 -80 -355 198 278 -306 -159 348 -7 -383 145
6677A45J55n36N4N17k74m19M23K96n73p9N98j53n21L49L63m55j58N25j5o01K53
$$ 145 300 -236 -182 335 61 -358 65 361 -212 -291 307 154 -367 -18 345 -110 -268 257 242 -359 -106
6698a06M86m39k91N18J13n19N8N12l02l81M62K10n81O5N11k13m73L76L21n06j03
$$ -106 380 -59 -350 168 281 -238 -180 332 30 -351 111 321 -260 -195 316 103 -370 6 327 -179 -282
6719b82N72j23n54M06L77m94k15N49j0n43K00M74m21k53N55Mn46J48M94l43l45
$$ -282 290 167 -387 19 396 -98 -313 236 226 -317 -117 357 -64 -317 238 242 -304 -156 338 -5 -350
6740c50N02J62n62L4N79k85m29L99K84n07j34N88j13n37L49L91n09j53M94K0n18
$$ -350 152 314 -248 -214 365 80 -349 50 334 -173 -307 281 168 -369 -20 371 -138 -291 203 223 -295
6761b95J72M74l86l01N08J01n28Q5N22l07l60M03K12n41K7N33k17m33L78K83n08
$$ -295 -123 351 -35 -336 172 273 -255 -170 352 45 -315 88 300 -241 -214 319 102 -331 47 330 -178
6782a78j28N60o5n33K88M28m82k10N25M5n58J44N16l78l54N32J31n40N5N20k62
$$ -178 -306 254 189 -344 -56 372 -110 -320 205 250 -308 -164 352 -26 -380 152 283 -257 -202 318 56
6803E6m19M25K53m92p1N18j30m69L34L45m62j55M90rn09J87M56m09k64N08O1m89
$$ 56 -363 62 315 -177 -248 270 140 -329 5 350 -112 -267 223 214 -295 -108 348 -61 -325 183 244 -245
6825b45O3M79k70l50M14K18n43MN17k06m28L53L07m49j21N25r7m95K72L93m19
$$ -245 -182 297 27 -323 91 309 -234 -230 287 81 -347 6 313 -136 -257 268 171 -324 -52 341 -78
6846g8k39N09M4n08J42M72l46l34N06R9m94N5M78k42m25M29K78n21n2N13j43m52
$$ -78 -317 192 236 -272 -130 342 -4 -338 168 267 -227 -172 306 64 -361 68 346 -175 -227 286 143 -309
6868c09L28K86l99k02M98J1n31K32M18l63k83M76Q7n01R9M85k82l93M55J77m93
$$ -309 19 305 -94 -296 202 213 -318 -86 332 -31 -314 162 249 -252 -153 332 50 -343 112 289 -204
6889b04j0N15j82m42L64L11n23r1N41j02m91L05L33m20j88M92K2n19J81M32l69
$$ -204 -214 301 119 -323 41 352 -171 -262 279 177 -314 -9 324 -96 -284 208 230 -289 -108 324 -45
6910d5k87M92J02n04N3N17k72l99M12K29n06J6M65j37m50K90L60m48j80N34m8
$$ -45 -332 160 262 -242 -189 328 56 -343 69 298 -208 -192 273 136 -314 -24 336 -112 -292 242 194
6931A94n18K49L84l87k02M53J12n60J26M90l46l26M65J78n03jN08k51m01L78K60
$$ 194 -324 -75 309 -78 -280 173 285 -275 -149 341 -5 -331 134 312 -191 -192 316 65 -336 42 302
6952C02m91q2N63j38m57L15L10m31j94N34l9n17K39M18l95k23M20J06n08O3N53
$$ 302 -189 -271 292 154 -303 12 322 -109 -303 231 192 -325 -86 332 -63 -286 134 240 -268 -205 348
6973C48l09l75M14K19n12j2N17j80m15L16L08m31j63N21r7m58K59L77l64k62M88
$$ 348 39 -336 78 297 -215 -227 290 110 -305 11 319 -112 -275 246 149 -309 -50 327 -37 -299 189
6994A89M8m89J33M46l37l25M42J54m61mM95k12m20L92K65n11j0M74j74m06K85
$$ 189 237 -252 -119 327 -10 -335 107 261 -200 -204 291 79 -341 51 316 -195 -205 269 95 -311 -26
7015b6L35m12j65M97m3m63K00L83l42k41M49P2m70R7M21k83l12L88J61m52j0M68
$$ -26 309 -103 -268 229 186 -277 -77 306 -36 -277 172 244 -226 -129 292 9 -303 85 246 -206 -216 252
7037B52j73l70L25K75m48p5M22r3l92K04L50l58j99M43L2m83J82L91l37k34M00
$$ 252 79 -291 34 309 -139 -214 208 115 -277 -73 277 -81 -280 163 195 -288 -106 285 -52 -286 114
7058A14J19m61R8M03k51l10L53J93m45K2M18j62l49L23K01l92q2M26p9l94K33
$$ 114 233 -228 -130 273 22 -288 65 258 -187 -165 253 91 -258 65 266 -126 -208 218 139 -255 -22
7079b2K79l13k08M30Pm22J91L19k99k16L54R2l81L9L64j82l02L30J65l90pL80
$$ -22 257 -56 -264 166 173 -249 -58 261 -38 -254 100 192 -189 -150 214 32 -270 60 225 -165 -172 208
7101B08j20l37K49K49l34j30M03m0l57J51L03k96j58L29P0l87J19L13k38k02L17
$$ 208 88 -249 0 249 -85 -215 188 148 -209 -58 245 -51 -209 120 190 -197 -78 235 -3 -205 112
7122A12P5l40M5L59j89l10L32J17l44k3L58j10l27K55J98l00j09L83n1l41J69
$$ 112 187 -153 -108 251 62 -248 84 201 -143 -166 192 82 -245 10 208 -92 -201 182 131 -210 -41
7143d1K80k91j55L09P4l83J10L38k48j95L22R2l73L2L21q7l46K64K00l63k1L60
$$ -41 239 -52 -207 102 176 -207 -97 241 -7 -202 120 212 -161 -129 192 105 -241 23 223 -140 -161 199
7165A99r2l17K20J96k69j43L50j5l17J33K88k79j59K82P0l25Q1K83j81k04K85
$$ 199 107 -210 10 206 -63 -206 144 129 -188 -55 233 -46 -205 77 147 -178 -97 186 5 -199 86
7186H6Q7l26K3L12j35k65K40J99l49n2L70j09k68J92J92k56j41L27K7l52J34K57
$$ 86 173 -153 -130 182 47 -218 22 221 -128 -180 190 81 -187 5 197 -59 -200 127 154 -198 -64 193
7208A93k16k01L17O1l15O0L08j76k32K69J15l31%L26j29k88K48K00l05p4L24n9
$$ 193 -23 -224 93 154 -161 -101 207 31 -201 68 183 -148 -148 178 49 -239 9 209 -96 -170 154 95
7230I5k81J80J96k42j33K85O9l18R5K75k53j42K52P6k90M4K84j47k12K00J70l06
$$ 95 -186 -6 190 -52 -185 100 169 -149 -54 221 -32 -174 78 154 -136 -92 192 45 -167 33 203 -103
7252a03l4L14r7k52J56K02k71p9L05m9k71J06K57k05j88K79P7l32O6L41k06k09
$$ -103 -137 177 80 -172 -16 186 -85 -164 141 92 -179 -73 184 -21 -209 70 147 -185 -119 222 16 -193
7274a93K38J19k90j5L00j05k41K14J84k79o2K67l5k68J24K57k40j51K77K3k72
$$ -193 45 164 -126 -141 159 54 -187 27 211 -68 -130 137 102 -166 -42 215 -25 -176 101 124 -148
7295a48O1K66k05j58K54P6k89M3K60j33k16K12J53k72o6L22r1k74J92K27k70j23
$$ -148 -87 179 -26 -184 70 146 -143 -100 160 27 -189 23 176 -96 -162 160 69 -205 -13 214 -56 -179
7317a79L00l0k68J19K35k02j48K79N4l20P8K80j72j88K22J13k60j8K81j36k27
$$ -179 121 91 -177 -58 177 -25 -173 106 160 -160 -82 198 26 -162 60 173 -87 -105 176 40 -187
7338a87K30J69l02q7L26l1l00J67J99k46j07K73J5k89J09K50k08j75K78N2k84
$$ -187 43 212 -90 -177 149 118 -182 -15 184 -62 -169 104 119 -170 -61 189 -19 -194 84 136 -148
7359a48M8K77j68j94K26J11k79l5L18j06k31J56K35k71r0K85o1k13R5K41j90j86
$$ -148 -100 177 9 -185 41 152 -127 -162 156 50 -181 -25 210 -61 -151 134 73 -140 -45 196 6 -180
7381a80K53N3k83R3K06j42j73K32O7k37NK26j02j91J95J47k83k4K87o8k50J58
$$ -180 73 126 -157 -64 142 0 -173 59 126 -111 -106 120 18 -173 22 169 -114 -138 149 81 -169 -11
7403a1J68k16p4K68k7k67J13K42k32j38K56P3k87O4K31j34j97K14J14k61PK33
$$ -11 157 -59 -133 135 108 -159 -46 196 -36 -174 82 155 -132 -68 163 29 -168 46 160 -101 -94 139
7425A39p5k36K05J31k55n4K71n6k21J27J91k10j13K46J3k61J03K04j71j59K27
$$ 139 64 -172 33 164 -91 -145 126 70 -151 -24 167 -43 -156 90 103 -158 -55 149 -22 -181 46
7446D6R9k82M0K66j61j74K17J16k81MK64r6k39J97J76k35p3K34j7k74J73J75k03
$$ 46 145 -137 -97 169 8 -166 51 167 -114 -110 154 58 -181 16 192 -43 -116 118 101 -173 0 175 -28
7469b8j25K58J1k39M9K36j87j21K27M2k71L1K58j24j79J87R8k17k5K28q1k00J70
$$ -28 -153 105 116 -123 -74 162 -25 -146 81 123 -148 -117 141 17 -162 25 123 -94 -119 109 28 -172 -2
7492bJ52j96j01K73p1j84J12J66j69j32K50L8k54P7J98j57j54J78R6k09K6K09
$$ -2 150 -46 -147 126 55 -129 -17 149 -20 -152 98 136 -118 -41 157 0 -154 24 120 -89 -63 146
7514A46j07j86J81J09k25j8K28p0j64J22J10j85n1J88rj99J11J45j48j22K09N8
$$ 146 39 -147 34 143 -82 -100 128 58 -106 16 126 -59 -110 78 69 -130 -19 126 -22 -144 65 123
7536A23k47P1J90j45j23J84P3j85J8J73r3j52J44J09k00k2J83n4j64J06J75k17
$$ 123 -124 -53 137 -8 -131 53 126 -59 -41 132 39 -113 31 140 -60 -82 101 47 -117 -11 164 -53
7558e3p2K10j7j77L9K10j53j45K56J1k43N5J86r8j71K05J10k47jK36j04j64J32
$$ -53 -125 85 68 -109 -70 140 -13 -158 98 109 -134 -79 107 9 -162 43 153 -94 -95 141 37 -127 5
7581EJ22j95l8K15m4k08J22K23k31q9K04J1k30Q5K34j82j43K19N8k56J9K41j10
$$ 5 127 -68 -106 109 65 -143 -21 202 -29 -118 86 97 -133 -48 186 4 -139 80 138 -118 -99 142 32
7604C2k08K31J08k44m2K67r3k13J41J73k15j07K83j2k71J62J79k16j13K37M0k50
$$ 32 -176 55 163 -81 -123 144 51 -162 -21 152 -63 -170 113 101 -170 -8 171 -45 -158 79 119 -131
7626a31J23J79k02j22K37N2k61M2K69j52j98K02J42k96k7L09j00k29J90J49k36
$$ -131 -8 171 -31 -153 84 136 -125 -83 186 34 -164 38 180 -116 -143 166 66 -163 27 176 -60
7647f0j20K99j8k64J07K69k58j47K79L2k60N3K18j16k01K03J56k72n7L09q0k55
$$ -60 -180 119 101 -163 -56 213 -45 -192 87 119 -141 -88 130 14 -187 16 172 -100 -157 152 72 -183
7669a83J82J69k59n7K48Nk78J46K35k44j21K63L6k87P4K58j97j39K24O9k59J1
$$ -183 -1 168 -91 -148 100 105 -173 -27 208 -36 -157 106 142 -145 -71 187 -10 -149 75 144 -115 -104
7691a04K96j52k64K39J72k91p6L32p8k82J84K09k66q7L02nl14J27K66k36j63L01
$$ -104 192 40 -224 15 187 -104 -180 152 74 -208 -24 185 -81 -168 134 129 -185 -58 208 -28 -191 110
7713A10M3k95M9L01j78k09K28J66l33l1L39j17k76K27J82k83j19L81q1l26J95
$$ 110 153 -142 -93 208 30 -179 49 215 -118 -149 190 73 -203 24 206 -77 -196 185 104 -222 -27
7734b7K34k77j37L21K6l00O8K82k10j98L14R0l38K0L04j30k30K01J76k81o6L36
$$ -27 207 -70 -207 114 140 -160 -92 190 -20 -218 96 186 -152 -132 172 42 -188 13 189 -92 -158 178
7756A78q3k99K13K25l00j17L36Ol62J73K72k66j80L24O6l52M3L38j92k64L11J19
$$ 178 95 -204 9 234 -66 -183 153 159 -203 -30 242 -24 -204 120 186 -166 -123 215 23 -241 70 189
7778A89l45K3L45j67k97K70K10l23j11M07n4l83J77L07l17j43L87j9l76J25L37
$$ 189 -156 -133 212 45 -252 18 228 -95 -206 201 147 -236 -59 248 -69 -212 175 156 -220 -95 242
7799B42k50k30L44J21m09O2L72k06l01L35J46l86oL95j47l31K45K57l64j00M16
$$ 242 -8 -238 106 227 -182 -120 252 46 -255 80 226 -160 -166 229 82 -249 -4 253 -111 -211 205
7820B05o1l92K13K89l11j85L53P3l95Q0L73k41k60L40J50m22N1L87k03l00L14
$$ 205 144 -248 -35 254 -57 -242 111 184 -211 -131 242 1 -259 81 231 -191 -140 247 44 -256 58
7841E8J69l76l4M11j44l30K48K61l39j46M40n9m16K08L13l26j76L71M3l71R4L67
$$ 58 227 -149 -183 228 84 -246 2 263 -76 -222 218 159 -257 -49 264 -62 -238 133 176 -195 -101 266
7863B66k82k43L63J12l89J8L75j70l38L19K22m04n2M18q8l74K38K70l43j58M07
$$ 266 -16 -259 104 216 -173 -155 220 50 -288 31 253 -151 -203 215 127 -247 -9 261 -82 -240 167
7884A67K0m25J61L66l22j98L58J18m27N3M13k47l22L79J52m04m1M33j69l46L10
$$ 167 187 -238 -77 289 -33 -231 127 245 -182 -129 284 37 -285 94 246 -158 -199 234 65 -281 29
7905B9K33m03p3M28r7l76K37L17l74j73M18qm00J41L85k95k65L92J12m46N9M13
$$ 29 262 -141 -214 214 117 -259 -22 295 -79 -252 166 158 -242 -101 284 -11 -276 116 228 -218 -159 254
7927B54j77l39K99K32m13m9M23j20l85K85K68l60j55M52l8m25J93L40l38k27M03
$$ 254 77 -262 37 269 -144 -193 230 110 -275 10 278 -82 -237 215 177 -248 -55 285 -53 -280 123
7948A23Q2m09N3M27k33l28M03J32m41L1L85j57l67L16K59m13p5M36j11l78K57
$$ 123 205 -204 -151 276 43 -285 118 250 -191 -160 225 68 -299 17 276 -137 -212 224 113 -265 -8
7969hK87l78j40M35k1m06J61L78l55j92L40J09l94L5M15k22l29L55J77m29m1M41
$$ -8 279 -99 -239 196 175 -231 -70 308 -47 -239 101 210 -184 -149 266 44 -285 70 247 -182 -223 218
7991B18j12l74K47K83l73j08M35r0m01K39L11l45j81L91L9m15J39L67k82k45L87
$$ 218 106 -268 -21 262 -111 -219 216 126 -275 -36 275 -70 -251 140 179 -236 -97 270 -12 -257 130
8012A30J01m18L7M11k06l28L46J66l78n2M69j94l31K27K86l48j37M15k9m11K15
$$ 130 231 -187 -150 261 55 -273 73 239 -139 -191 278 84 -247 -20 266 -82 -219 196 167 -244 -29
8033b9K75k86k16L83J05m26N7M07k64k65L22J65m01pL67q9l94L17K22l77q6M29
$$ -29 246 -40 -256 127 232 -194 -137 270 6 -259 63 228 -173 -180 187 98 -296 21 243 -134 -220 209
8055B09p7l99K39K90l01k18M10K5m22J79L36k84k13L41J04l98P1L72k27k90K94
$$ 209 132 -267 -28 262 -39 -257 153 178 -244 -65 271 -13 -226 115 219 -179 -108 264 37 -253 41
8076D1J81l89%L81j27l36K47K46l61j03L98l9l76J62L22l26j53L71N2m19R9L93
$$ 41 222 -167 -167 214 87 -249 -2 244 -117 -220 178 139 -237 -75 247 -79 -232 139 191 -228 -129 264
8098B64k23k99L37J37l80K2L88j61l72L39K02l86o3L97r8l52K04L23l73j45L91
$$ 264 41 -258 79 216 -164 -142 246 85 -287 52 254 -132 -195 202 104 -248 -44 279 -94 -239 152
8119A52J8m23J77L32k98k27M08O0l95N7M02k40k92L23J79l90k5M27j37l70K84
$$ 152 170 -253 -76 256 -42 -269 139 199 -196 -139 263 23 -269 54 233 -157 -182 245 108 -262 22
8140B2K45l78r1L86om49K11L46l11k36M05N8m16J02M00k61k99L60J64m18j4M48
$$ 22 267 -111 -202 184 178 -271 -60 286 -25 -261 144 202 -214 -112 288 27 -272 88 252 -166 -180 268
8162B68k04l55L20K38l96n7L82l9m25K32L27l75j79M22K0m30J50L51k52k40L55
$$ 268 64 -291 29 267 -129 -186 196 157 -268 -36 291 -84 -263 159 179 -251 -101 250 -2 -242 113
8183A13N6l89R0L93k35l09L53J63
$$ 113 169 -220 -130 263 28 -281 72 235
8191B35
$$ Imaginary data points
##PAGE= N=2
##DATA TABLE= (X++(I..I)), XYDATA
0@%%%%%%%%qJ6j6J6k4L2l2M0n6P2q8J04j28J57j82K12k51K96l45M01m63N32o12
$$ 0 0 0 0 0 0 0 0 0 -8 8 -8 8 -16 16 -16 24 -32 40 -48 56 -72 85 -97 115 -136 160 -185 216 -247 285 -327
31c27O98p93R00j019J150j292J449j624J812k019K247k494K766l062L385l735
$$ -327 371 -422 478 -541 609 -683 766 -858 954 -1065 1182 -1312 1454 -1608 1777 -1958
47a958M118m543N008n514O073o693P380q148R008r982J1097j2383J3884j5665
$$ -1958 2160 -2383 2625 -2889 3184 -3509 3871 -4277 4731 -5251 5846 -6537 7347 -8318
61h318J7825k0503K3921k8461L4820m4428O0775r5713K94284l29777l89726P65854
$$ -8318 9507 -10996 12925 -15536 19284 -25144 35631 -60082 234202 -95575 -485301 280553
73B80553n5077m67887J69343L12893l24651j00334L59254l8550m30471K87533
$$ 280553 225476 -242411 -73068 239825 -84826 -185160 174094 135544 -294927 -7394
83g394L62380n08577k18438O90242k6311p02549K23338O27546l65134m86496M23526
$$ -7394 354986 -153591 -372029 318213 291902 -410647 -187309 440237 75103 -411393 12133
94A2133L58642m69632j94564M77804m109m24061K20986K53894l55444k2692L70580
$$ 12133 370775 -98857 -293421 184383 180274 -243787 -22801 231093 -124351 -147043 223537
105B23537j98684k98861L52529K22618m70019j50791N71893L9469o27379J41150
$$ 223537 24853 -274008 78521 301139 -168880 -319671 252222 291691 -335688 -194538
115a94538N72889l28931m03767M38794J92121m31870j8504L48269r6615k39762
$$ -194538 378351 49420 -354347 84447 276568 -155302 -173806 174463 77848 -161914
125a61914J86164J20832k77494K7126L45959k11874l40498L92162K33902n04710
$$ -161914 24250 145082 -132412 -105286 240673 28799 -311699 80463 314365 -190345
135a90345o6481N15221q8483m53245J89436L71748k52115k83112L03808J60857
$$ -190345 -256826 258395 169912 -283333 -93897 277851 25736 -257376 46432 207289
145B07289l26114N141K78740j68103j56240K69065O333k94023J22090K73044k23897
$$ 207289 -118825 -113684 165056 -3047 -159287 109778 116111 -177912 -55822 217222 -6675
156f675k32999L16500J67206m00368o4339M43444o3480m15962J78191L18070k44487
$$ -6675 -239674 76826 244032 -156336 -220675 222769 159289 -256673 -78482 239588 -4899
167d899j82393K54728N0738k26971N8206J83829j50237j21755K33542K1312k87805
$$ -4899 -187292 67436 118174 -108797 -50591 133238 -16999 -138754 94788 116100 -171705
178a71705J18643K79736k56523k04805L40154J00375l57375p776L34717o8153
$$ -171705 -53062 226674 -29849 -234654 105500 205875 -151500 -159276 175441 107288
188A07288k95336J41652K29974k07924j25625K36316k893k05670J19700J27386
$$ 107288 -188048 -46396 183578 -24346 -149971 86345 83452 -122218 -2518 124868
198A24868j98619k9114K36577o6904k40937J52566K17632k25498j66654K80488
$$ 124868 -73751 -102865 133712 66808 -174129 -21563 196069 -29429 -196083 84405
208H4405Q6982l04202J1636K81615j04199k14119J62735J23728j79976l4660J69815
$$ 84405 171387 -132815 -121179 160436 56237 -157882 4853 128581 -51395 -86055 83760
219H3760m8633j42365J32195Q9574k05789m438K42990r5316k29031J78623J77730
$$ 83760 35127 -107238 24957 114531 -91258 -95696 147294 51978 -177053 1570 179300
230A79300k29120j12302K50986M2755k49961L0548K21969j01272j63132J54301
$$ 179300 -49820 -162122 88864 131619 -118342 -87794 134175 32903 -130229 24072
240B4072P9848j76218J3156J61585r9074j13984J63074M6201j97818K5776K06643
$$ 24072 103920 -72298 -59142 102443 3369 -110615 52459 98660 -99158 -73382 133261
251A33261r3332j93876J55339J56426k05249r1481K26415J1947k08631N8179J60879
$$ 133261 39929 -153947 1392 157818 -47431 -138912 87503 99450 -109181 -51002 109877
262A09877j05212j00002J31964L2730j42239M1546J29648j14732q8418J69361
$$ 109877 4665 -95337 36627 69357 -72882 -31336 98312 -16420 -104838 64523
272F4523K6357j93856M1208J89596j03407j62100J53864J15629j85381n6474J91464
$$ 64523 90880 -102976 -61768 127828 24421 -137679 16185 131814 -53567 -110041 81423
283H1423o042j71626O3860J28323j10529o5456J37166p911j35763P6316J08304
$$ 81423 75381 -96245 -32385 95938 -14591 -80047 57119 49208 -86555 -10239 98065
294I8065j27485o4608J60511J1944j77220M7582J73116j06517j42478J49419R0320
$$ 98065 -29420 -94028 66483 78427 -98793 -51211 121905 15388 -127090 22329 112649
305A12649j65637l0777J56747k5952j30150P5516Q7809j12173l1486J26837l0704
$$ 112649 -52988 -83765 72982 47030 -83120 -7604 80205 -31968 -63454 63383 32679
316C2679j16166Q7721Q5734j32680m1923J61788j0060j68348O2857J49219j05324
$$ 32679 -83487 4234 89968 -42712 -84635 77153 67093 -101255 -38398 110821 5497
327E497j09270J31328N8552j40780l959J32513m8986j03303R0581N4345j12222
$$ 5497 -103773 27555 86107 -54673 -58632 73881 24895 -78408 12173 66518 -45704
338d5704L528J12806n9638r7310J07608O7909j42313k5233J56691k4717j46898
$$ -45704 -42176 70630 10992 -86318 21290 89199 -53114 -78347 78344 53627 -93271
349i3271P1353J18211j06327p7965J26838L0554j28632J9917J07537o4503o6557
$$ -93271 -21918 96293 -10034 -87999 38839 69393 -59239 -39322 68215 3712 -62845
360f2845R3709J6610j06022L1962J03496p6171q5564J12494N0485j34259l933
$$ -62845 30864 47474 -58548 -26586 76910 739 -84825 27669 78154 -56105 -60038
371f0038J36450m2242j20481P8964R1237j01675n1656J08710N918r8266L8676
$$ -60038 76412 34170 -86311 -7347 83890 -17785 -69441 39269 45187 -53079 -14403
382a4403P3097p4559l8207R7627l387j04763M8427R2123q9698o1801J17313K2913
$$ -14403 58694 -15865 -54072 43555 40168 -64595 -16168 75955 -13743 -75544 41769 64682
394F4682j27658J4765J23197m8827j04527P8901O9792r8663k2207J00255k5706
$$ 64682 -62976 -48211 74986 26159 -78368 533 70325 -28338 -50545 49710 24004
405B4004q2526O2247N2852q4282j7232R4311k2492r2874O3338P7707r8602m9601
$$ 24004 -58522 3725 56577 -27705 -44937 49374 26882 -65992 -2654 75053 -23549 -73150
417g3150J19717J2561j22271K6234J05650n9357p4668Q0171L8031q7049k355Q2901
$$ -73150 46567 59128 -63143 -36909 68741 9384 -65284 14887 52918 -34131 -36486 46415
429D6415l1190o7918O4062L9099r0027K961R8839m6872q6758P9446O1223r7264
$$ 46415 15225 -52693 11369 50468 -39559 -36598 62241 15369 -71389 8057 69280 -27984
441b7984l1282J05023j439j04788L6635R1415o8616o1835Q7006K1239q6650K0268
$$ -27984 -59266 45757 44318 -60470 -23835 67580 -1036 -62871 24135 45374 -41276 -21008
453b1008P0400n4715m4525P9151J4213r2483J8475R4405n2336q2506Q4162N4979
$$ -21008 49392 -5323 -49848 29303 43516 -48967 -30492 63913 11577 -70929 13233 68212
465F8212j05990j5571J09048k4116r2999N1871O6694o6282l8837P3833Q316p6951
$$ 68212 -37778 -53349 55699 31583 -61416 -9545 57149 -9133 -47970 25863 34179 -42772
477d2772K8391O7950o5728m0401R0006M81r2868L7940P9570o5703n9847Q3394
$$ -42772 -14381 53569 -12159 -52560 37446 37927 -54941 -17001 62569 -3134 -62981 20413
489B0413L7864r3445j1364R4628k0894q2574N3160N5623p5648j8834Q0599j8409
$$ 20413 58277 -35168 -46532 48096 27202 -55372 -2212 53411 -22237 -41071 39528 21119
501B1119o8438M7585M6541o7291k1609Q1050o604q8197M0413Q1889p3924n7439
$$ 21119 -47319 266 46807 -20484 -42093 38957 32353 -55844 -15431 66458 -7466 -64905
513f4905R4621K1949r5019J1212Q0722l5317o1762N3664M0496o9864j1732P7886
$$ -64905 29716 51665 -43354 -32142 48580 13263 -48499 5165 45661 -24203 -35935 41951
525D1951k5540o8608O1374M1051q3338n531Q6882k6175p6976M9123O1597o6164
$$ 41951 16411 -52197 9177 50228 -33110 -38641 48241 22066 -54910 -5787 55810 -10354
537a0354m3428Q0635J9732q9041J1683Q2775m4456n7257O6421K0102p0505J4613
$$ -10354 -53782 26853 46585 -42456 -30773 52002 7546 -49711 16710 36812 -33693 -19080
549a9080O1243l9508m7835N8463L1498p5998o806Q6818k7097q1179N9923N7610
$$ -19080 42163 2655 -45180 13283 44781 -31217 -38023 48795 21698 -59481 442 58052
561E8052p9399k5967Q2795k987p5758K6600O2854m7357m2343O4600J1704p1996
$$ 58052 -21347 -47314 35481 32494 -43264 -16664 46190 -1167 -43510 21090 32794 -39202
573c9202K5426O3304n8578l9403P7554R164q0309J7483P3258l7864o2607N5837
$$ -39202 -13776 49528 -9050 -48453 29101 38265 -42044 -24561 48697 10833 -51774 4063
585D063M7011p2753k0761Q1057j4428p1502M6007M5169o1652j4040O1167j1628
$$ 4063 51074 -21679 -42440 38617 24189 -47313 -1306 43863 -17789 -31829 29338 17710
597A7710n3951L2205M5492n2785l1950P2179Q012q1700K3065P4759n0785n3828
$$ 17710 -36241 -4036 41456 -11329 -43279 28900 36912 -44788 -21723 53036 2251 -51577
609e1577O6536K7485o9483k365O4029k0333n3394M1956L6483o0172j1224O8440
$$ -51577 14959 42444 -27039 -29404 34625 14292 -39102 2854 39337 -20835 -32059 36381
621C6381j9794o1036M7937M0069o5186j4866P1156p527p0737K7755O5293m9065
$$ 36381 16587 -44449 3488 43557 -21629 -36495 34661 27134 -43603 -15848 49445 380
633C80m9897O7500K1981p3176J1229O1537l7648l8765N1358J5054n5804N686N5773
$$ 380 -49517 17983 39964 -33212 -21983 39554 1906 -36859 14499 29553 -26251 -20565 35208
646C5208k5980n0985M7769L7277o6967j3347P5645j5369o9383M0056N1063n4618
$$ 35208 9228 -41757 6012 43289 -23678 -37025 38620 23251 -46132 -6076 44987 -9631
658i631k8488N9575P406n8618J2368N2670l3190l7761N2164J2217o1709J7958
$$ -9631 -38119 21456 28862 -29756 -17388 35282 2092 -35669 16495 28712 -32997 -15039
670a5039N7337m2675m2702N7082K4313o3998m538O6266j7960o1757M1481M6360
$$ -15039 42298 -377 -43079 14003 38316 -25682 -30220 36046 18086 -43671 -2190 44170
682D4170n8954k1502O3727n507n5469K7545L9407m2188k0540N1128N67n5225K1037
$$ 44170 -14784 -36286 27441 21934 -33535 -5990 33417 -8771 -29311 21817 22384 -32841 -11804
695a1804N2479m3097l9635O0638J7262o7738Q443O2024k9160m7884M1305L1054
$$ -11804 40675 -2422 -42057 18581 35843 -31895 -23452 38572 9412 -38472 2833 33887
707C3887m7704j3210N1036p462m8984K9987L7057m7771j5646N4731q728n0768
$$ 33887 -13817 -27027 24009 16547 -32437 -2450 34607 -13164 -28810 25921 17193 -33575
719c3575K9859M0618m5795k7419N7004J0918o1985Q916N7866k9149m3804M4542
$$ -33575 -3716 36902 -8893 -36312 20692 31610 -30375 -21459 36407 7258 -36546 7996
731G996K2758n1683K23M9528k0476l9982L5866K5527m6601p445N2780j3941n1766
$$ 7996 30754 -20929 -20706 28822 8346 -31636 4230 29757 -16844 -24289 28491 14550 -37216
744c7216L6028M0850n2681k1676N9072L86n5729J7628M7049l1657l5281M2692
$$ -37216 -1188 39662 -13019 -34695 24377 24763 -30966 -13338 33711 2054 -33227 9465
756I465J9006m8934K175M6576k4323l4780M1418J7081n0364J901N1413j9616m5684
$$ 9465 28471 -20463 -18288 28288 3965 -30815 10603 27684 -22680 -20779 30634 11018 -34666
769c4666L5228L4106m7577j7519N4846k052n4682K1664M5425l7104k8242M4874
$$ -34666 562 34668 -12909 -30428 24418 22366 -32316 -10652 34773 -2331 -30573 14301
781A4301P323m4689J2537L8785k9538k8682M3273J3526n1857O609N1649k7390
$$ 14301 21624 -23065 -10528 28257 -1281 -29963 13310 26836 -25021 -18412 33237 5847
793E847m1980M3180K6427n1091r308N2182p583m7391K3922L6352l7520j9514M5025
$$ 5847 -36133 7047 33474 -17617 -26925 25257 17674 -29717 -5795 30557 -6963 -26477 18548
806A8548l69m4356J9425L5812l4815k1278M4565L410m7835J4339M4882k9641l6690
$$ 18548 18179 -26177 -6752 29060 -5755 -27033 17532 20942 -26893 -12554 32328 2687 -34003
819c4003M1416K3522m8536n881M8770j2985m1161K8599K7776l7861j1891M1130
$$ -34003 7413 30935 -17601 -23482 25288 12303 -28858 -259 27517 -10344 -22235 18895
831A8895m748l9132K1766L1236l7147j7127M6886n98m8736J8058M3149l2750l1891
$$ 18895 14147 -24985 -3219 28017 -9130 -26257 20629 20031 -28705 -10647 32502 -248 -32139
844c2139M3335J6454m8273J101M6215j7811l7323L1051K3179l9332n655M1724
$$ -32139 11196 27650 -20623 -19522 26693 8882 -28441 2610 25789 -13543 -19198 22526
856B2526j3116l7036K9632K5980m0792j1248M5724m645m5100K0321L9100l4304
$$ 22526 9410 -27626 2006 27986 -12806 -24054 21670 17025 -28075 -7754 31346 -2958
868b958k7420M3574J1559m5705N172M0843j9804l0900L1281J6991l8196m17L8901
$$ -2958 -30378 13196 24755 -20950 -15778 25065 5261 -25639 5642 22633 -15563 -15980 22921
881B2921j6298l2934L0215K1950l9772p969M4554p825m3522K3550L5635l5853
$$ 22921 6623 -26311 3904 25854 -13918 -21887 22667 14842 -28680 -5130 30505 -5348
893e348k2210M2093O322m2157R375L6824k3496k6368L4364J1235l9359O204L7309
$$ -5348 -27558 14535 20857 -21300 -11925 24899 1403 -24965 9399 20634 -18725 -12521 24788
906B4788k2350k9272L4915J6956m2675j797M4497j4119l9708K7771K9412l7010
$$ 24788 2438 -26834 8081 25037 -17638 -19435 25062 10943 -28765 -994 28418 -8592
918h592j5743M1169J15l9587J5753L1523k8776j7935L5785K215l6477J2557L2499
$$ -8592 -24335 16834 16949 -22638 -6885 24638 -4138 -22073 13712 15927 -20550 -7993 24506
931B4506k5627k4543L6650J2042m3207M049M2358j9745l4321L1350K1765l7505
$$ 24506 -1121 -25664 10986 23028 -20179 -16130 26228 6483 -27838 3512 25277 -12228
943a2228p341L8521p450l4282K0989K4983l1485j1587L7229m228l7216K0463L0603
$$ -12228 -19569 18952 11502 -22780 -1791 23192 -8293 -19880 17349 13121 -24095 -3632 26971
956B6971l3938j8227M1360L301m1846J0820L7134k2993k8638L3002J6304l9152
$$ 26971 -6967 -25194 16166 19467 -22379 -11559 25575 2582 -26056 6946 23250 -15902
968a5902o51L8413j5105l0041K6681J7387l3063l625L5341j0105l3799K3715K6881
$$ -15902 -16553 21860 6755 -23286 3395 20782 -12281 -15906 19435 9330 -24469 -754 26127
981B6127l5080j4335M1084j218m0169J6031L3039k7237k1629L3379Q319l4604
$$ 26127 -8953 -23288 17796 16578 -23591 -7560 25479 -1758 -23387 9992 18311 -16293
993a6293M919L1928j7420k5687K8775J4829l6794O80L7798j7203l0717K9686J8871
$$ -16293 -11374 20554 3134 -22553 6222 21051 -15743 -15063 22735 5532 -25185 4501 23372
1006B3372l6089o531L8120n163l7038J7214L1100k8297j9119L5160L089l5271
$$ 23372 -12717 -19248 18872 13709 -23329 -6115 24985 -3312 -22431 12729 15818 -19453
1018a9453J2421K9497k4291k0067L1843Q229l5160N194L4094j8953k8184L0758
$$ -19453 -7032 22465 -1826 -21893 9950 18179 -16981 -11787 22307 3354 -24830 5928
1030E928J7616l8031l684L8699j0653l2707K1801K2954k8419j2434L1626J418
$$ 5928 23544 -14487 -18171 20528 9875 -22832 -1031 21923 -6496 -18930 12696 14114
1042A4114l2331J1615K8387k5404j7632L4890K332l6265J2070L0811k2073k2541
$$ 14114 -18217 -6602 21785 -3619 -21251 13639 15971 -20294 -8224 22587 514 -22027
1054b2027K8562J3245l3159j878L4809j1503l1097K4087K1492l2231p902L3926
$$ -22027 6535 19780 -13379 -15257 19552 8049 -23048 1039 22531 -9700 -17602 16324
1066A6324o671k9337J9133K0642k7988j0199L2950r25l4266J3158L0608k5434
$$ 16324 9653 -19684 -551 20091 -7897 -18096 14854 13929 -20337 -7179 23429 -2005
1078b005k0794L3989O755l5596O838L0958j6860k3416K4198J4433l0110k696L2629
$$ -2005 -22799 11190 17945 -17651 -10813 20145 3285 -20131 4067 18500 -11610 -14306 18323
1091A8323j1393k8454K4067J7532l1090l949L1879q252k8817J7966K3345k5547
$$ 18323 6930 -21524 2543 20075 -11015 -14964 16915 8663 -20154 -2188 21157 -4390
1103d390j5581L0917M956l2643P809K9116k0409j9587K8996O325l1114O656K7452
$$ -4390 -19971 10946 15902 -16741 -8932 20184 -225 -19812 9184 15509 -15605 -8949 18503
$$ [...]
8191a06
##END NTUPLES=NMR FID
##END=
