##TITLE=1H_3d 1311
 CDCl3
 8 sc, 
 14.11.2022
##JCAMPDX= 6.0         $$ Bruker NMR JCAMP-DX V2.0
##DATA TYPE= NMR FID
##DATA CLASS= NTUPLES
##ORIGIN= UXNMR, Bruker Analytische Messtechnik GmbH
##OWNER= root
$$ XWIN-NMR		Version 3.5
$$ Mon Nov 14 14:11:27 2022 Russian Standard Time (UT+4h)  she@DPX200
##.OBSERVE FREQUENCY= 200.1313499994
##.OBSERVE NUCLEUS= ^1H
##.DELAY= (6, 6)
##.ACQUISITION MODE= SIMULTANEOUS
##.ACQUISITION SCHEME= undefined
##.AVERAGES= 8
##.DIGITISER RES= 18
##SPECTROMETER/DATA SYSTEM= spect
##.PULSE SEQUENCE= zg30
##.SOLVENT NAME= CDCl3
##.SHIFT REFERENCE= (INTERNAL, CDCl3, 0, 15.7039)
##AUDIT TRAIL= $$ (NUMBER, WHEN, WHO, WHERE, WHAT)
$$ ##TITLE= Audit trail, XWIN-NMR		Version 3.5
$$ ##JCAMPDX= 5.01
$$ ##ORIGIN= Bruker BioSpin GmbH
$$ ##OWNER= she
$$ F:/spectra/data/she/nmr/H-F/1/audita.txt
$$ ##AUDIT TRAIL=  $$ (NUMBER, WHEN, WHO, WHERE, WHAT)
(   1,<2022-11-14 14:10:19.32 +0400>,<she>,<DPX200>,
      <created by zg, POWCHK disabled, PULCHK disabled
       configuration hash MD5:
       00 E9 B6 7A A2 85 ED C7 34 08 36 98 17 FE 4E 26
       data hash MD5: 16K
       4B 2B 22 68 51 E4 A5 67 6F 64 F2 CC 92 60 56 26>)
$$ ##END=
$$ 
$$ hash MD5
$$ 6A A3 4F D2 8F 6A C1 A3 61 86 82 88 8A 4C 14 2C
##$RELAX= 
##$RELAX= 
##$RELAX= 
##$RELAX= 
##$RELAX= 
##$RELAX= 
$$ Bruker specific parameters
$$ --------------------------
##$DU= <F:/spectra>
##$EXPNO= 1
##$NAME= <H-F>
##$PROCNO= 1
##$TYPE= <nmr>
##$USER= <she>
##$AMP= (0..31)
100 100 100 100 100 100 100 100 100 100 100 100 100 100 100 100 100 100 
100 100 100 100 100 100 100 100 100 100 100 100 100 100 
##$AQSEQ= 0
##$AQ_mod= 1
##$AUNM= <au_zg>
##$AUTOPOS= <>
##$BF1= 200.13
##$BF2= 200.13
##$BF3= 200.13
##$BF4= 200.13
##$BF5= 200.13
##$BF6= 200.13
##$BF7= 200.13
##$BF8= 200.13
##$BYTORDA= 1
##$CFDGTYP= 0
##$CFRGTYP= 5
##$CHEMSTR= <none>
##$CNST= (0..31)
1 1 145 1 1 1 1 1 1 1 1 1 1 1 1 1 1 1 1 1 1 1 1 1 1 1 1 1 1 1 1 1 
##$CPDPRG= <>
##$CPDPRG1= <>
##$CPDPRG2= <>
##$CPDPRG3= <>
##$CPDPRG4= <mlev>
##$CPDPRG5= <mlev>
##$CPDPRG6= <mlev>
##$CPDPRG7= <mlev>
##$CPDPRG8= <mlev>
##$CPDPRGB= <>
##$CPDPRGT= <>
##$D= (0..31)
0 1.2 0 0 0 0 0 0 0 0.06 0 0.03 0 0 0 0 0.0002 0 0 0 0 0 0 0 0 0 0 0 0 
0 0 0 
##$DATE= 1668420618
##$DBL= (0..7)
120 120 120 120 120 120 120 120 
##$DBP= (0..7)
150 150 150 150 150 150 150 150 
##$DBP07= 0
##$DBPNAM0= <>
##$DBPNAM1= <>
##$DBPNAM2= <>
##$DBPNAM3= <>
##$DBPNAM4= <>
##$DBPNAM5= <>
##$DBPNAM6= <>
##$DBPNAM7= <>
##$DBPOAL= (0..7)
0.5 0.5 0.5 0.5 0.5 0.5 0.5 0.5 
##$DBPOFFS= (0..7)
0 0 0 0 0 0 0 0 
##$DE= 6
##$DECBNUC= <off>
##$DECIM= 32
##$DECNUC= <off>
##$DECSTAT= 4
##$DIGMOD= 1
##$DIGTYP= 9
##$DL= (0..7)
0 120 120 120 120 120 120 120 
##$DP= (0..7)
150 150 150 150 150 150 150 150 
##$DP07= 0
##$DPNAME0= <>
##$DPNAME1= <>
##$DPNAME2= <>
##$DPNAME3= <>
##$DPNAME4= <>
##$DPNAME5= <>
##$DPNAME6= <>
##$DPNAME7= <>
##$DPOAL= (0..7)
0.5 0.5 0.5 0.5 0.5 0.5 0.5 0.5 
##$DPOFFS= (0..7)
0 0 0 0 0 0 0 0 
##$DQDMODE= 0
##$DR= 18
##$DS= 0
##$DSLIST= <SSSSSSSSSSSSSSS>
$$ [...]
##$SUBNAM2= <"">
##$SUBNAM3= <"">
##$SUBNAM4= <"">
##$SUBNAM5= <"">
##$SUBNAM6= <"">
##$SUBNAM7= <"">
##$SUBNAM8= <"">
##$SUBNAM9= <"">
##$SW= 18.0517283424941
##$SWIBOX= (0..15)
0 0 2 0 0 0 0 0 0 0 0 0 0 0 0 0 
##$SW_h= 3612.71676300578
##$TD= 16384
##$TD0= 1
##$TE= 0
##$TE2= 300
##$TE3= 300
##$TEG= 300
##$TL= (0..7)
0 120 120 120 120 120 120 120 
##$TP= (0..7)
150 150 150 150 150 150 150 150 
##$TP07= 0
##$TPNAME0= <>
##$TPNAME1= <>
##$TPNAME2= <>
##$TPNAME3= <>
##$TPNAME4= <>
##$TPNAME5= <>
##$TPNAME6= <>
##$TPNAME7= <>
##$TPOAL= (0..7)
0.5 0.5 0.5 0.5 0.5 0.5 0.5 0.5 
##$TPOFFS= (0..7)
0 0 0 0 0 0 0 0 
##$TUNHIN= 0
##$TUNHOUT= 0
##$TUNXOUT= 0
##$USERA1= <user>
##$USERA2= <user>
##$USERA3= <user>
##$USERA4= <user>
##$USERA5= <user>
##$V9= 5
##$VALIST= <valist>
##$VCLIST= <CCCCCCCCCCCCCCC>
##$VD= 0
##$VDLIST= <DDDDDDDDDDDDDDD>
##$VPLIST= <PPPPPPPPPPPPPPP>
##$VTLIST= <TTTTTTTTTTTTTTT>
##$WBST= 1024
##$WBSW= 4
##$XGAIN= (0..3)
0 0 0 0 
##$XL= 0
##$YL= 0
##$YMAX_a= 345924
##$YMIN_a= -388199
##$ZGOPTNS= <>
##$ZL1= 120
##$ZL2= 120
##$ZL3= 120
##$ZL4= 120
##$ABSF1= 10
##$ABSF2= 0
##$ABSG= 5
##$ABSL= 3
##$ALPHA= 0
##$AQORDER= 0
##$ASSFAC= 0
##$ASSFACI= 0
##$ASSFACX= 0
##$ASSWID= 0
##$AUNMP= <proc_1d>
##$AZFE= 0.1
##$AZFW= 0.1
##$BCFW= 1
##$BC_mod= 2
##$BYTORDP= 1
##$COROFFS= 0
##$CY= 11.3945322036743
##$DATMOD= 1
##$DC= 2
##$DFILT= <>
##$DTYPP= 0
##$F1P= 2.36226072786647
##$F2P= -0.459571619588291
##$FCOR= 0.5
##$FTSIZE= 0
##$FT_mod= 4
##$GAMMA= 1
##$GB= 0.15
##$INTBC= 1
##$INTSCL= 1
##$ISEN= 128
##$LB= 0.24
##$LEV0= 0
##$LPBIN= 0
##$MAXI= 10000
##$MC2= 0
##$MEAN= 0
##$ME_mod= 0
##$MI= 1.114404
##$NCOEF= 0
##$NC_proc= 0
##$NLEV= 6
##$NOISF1= 3.799351
##$NOISF2= 2.8
##$NSP= 1
##$NTH_PI= 0
##$NZP= 0
##$OFFSET= 15.70392
##$PC= 1
##$PHC0= -18187.95
##$PHC1= 9.600698
##$PH_mod= 1
##$PKNL= yes
##$PPARMOD= 0
##$PSCAL= 0
##$PSIGN= 0
##$REVERSE= no
##$SF= 200.130013532006
##$SI= 16384
##$SIGF1= 3
##$SIGF2= 2
##$SINO= 400
##$SIOLD= 16384
##$SREGLST= <1H.CDCl3>
##$SSB= 0
##$STSI= 0
##$STSR= 0
##$SW_p= 3612.71676300578
##$SYMM= 0
##$S_DEV= 0
##$TDeff= 0
##$TDoff= 0
##$TI= <>
##$TILT= no
##$TM1= 0
##$TM2= 0
##$TOPLEV= 0
##$USERP1= <user>
##$USERP2= <user>
##$USERP3= <user>
##$USERP4= <user>
##$USERP5= <user>
##$WDW= 1
##$XDIM= 8192
##$YMAX_p= 0
##$YMIN_p= 0
$$ End of Bruker specific parameters
$$ ---------------------------------
##NTUPLES= NMR FID
##VAR_NAME=  TIME,          FID/REAL,        FID/IMAG
##SYMBOL=    X,             R,               I
##VAR_TYPE=  INDEPENDENT,   DEPENDENT,       DEPENDENT
##VAR_FORM=  AFFN,          ASDF,            ASDF
##VAR_DIM=   8192,          8192,            8192
##UNITS=     SECONDS,       ARBITRARY UNITS, ARBITRARY UNITS
##FACTOR=    0.0002768,     1,               1
##FIRST=     0,             0,               0
##LAST=      2.2672688,     0,               0
##MIN=       0,             -388199,         0
##MAX=       2.2672688,     345924,          0
$$ Real data points
##PAGE= N=1
##DATA TABLE= (X++(R..R)), XYDATA
$$ plain form
0 0 0 0 0 0 0 0 0 0 0 -8 8 -8 8 -16 16 -24 24 -32 40 -48 56 -72 80 -96 112 -136 154 -184 208 -240 272 -312
32 -312 354 -400 453 -509 572 -642 716 -800 889 -988 1096 -1214 1343 -1482 1637 -1805 1989
49 1989 -2190 2412 -2658 2931 -3235 3573 -3957 4394 -4894 5477 -6165 6992 -8007 9287
63 9287 -10962 13255 -16598 21956 -31954 57087 -260152 -382824 -34060 -116173 141076 311736
75 311736 165120 151019 345924 204887 56761 -8944 -224875 -388199 -275831 -201532 -99745
86 -99745 65178 107279 126213 249827 233960 170523 151511 -11555 -192706 -168571 -177134 -208942
98 -208942 -94486 -33521 -44137 101322 209925 183935 198917 125606 -65656 -91350 -74758
109 -74758 -155439 -107913 -52125 -158629 -100588 94411 106546 138093 238613 92282 -69259
$$ packed form
0@%%%%%%%%%qJ6j6J6k4L2m0M8n6P2q8J04j28J52j76K08k48K90l38L92m48N12n84
32c12O66p54Q53r62J081j214J358j516J689j877K084k310K557k825L119l442L794
49A989m179M602n070N589o166O808p530Q351r288J0371j1642J3157j4999J7294
63I287k0249K4217k9853L8554n3910Q9041l17239j22672L48764q2113K57249J70660
75C11736j46616j4101J94905j41037j48126o5705k15931j63324J12368P4299J01787
86i9745J64923M2101J8934J23614j5867o3437j9012j63066j81151K4135q563l1808
98b08942J14456O0965j0616J45459J08603k5990J4982p3311j91262k5694J6592
109g4758q0681M7526N5788j06504N8041J94999J2135L1547J00520j46331j61541
$$ plain form
120 -69259 -4425 -28864 -116649 -38439 -52810 -175357 -91670 34009 38258 119304 172450 54825
132 54825 5599 41092 -8092 -28838 -8496 -80596 -122657 -63658 -24505 20796 81391 61360
144 61360 30021 41357 24172 21010 33690 -29446 -79552 -56208 -61405 -42389 39133 33216 -11293
157 -11293 32119 41513 7414 50380 48302 -43253 -50920 -22891 -51947 -19772 32654 -10030 -23412
170 -23412 25259 19893 23842 63374 23848 -31093 -17159 -20919 -29978 9720 7546 -32576 -18440
183 -18440 1819 2253 34705 47274 9245 -7520 -6019 -13235 1453 12861 -7863 -20073 -21727
196 -21727 -23912 -599 19396 8703 5885 5590 -8654 2721 21421 6136 -2633 1577 -16667
209 -16667 -19254 3466 -1290 -10785 3753 2734 -2959 15645 18705 4435 7829 5274 -8696 -4072
$$ packed form
120f9259O4834k4439q7785P8210j4371j22547Q3687J25679M249Q1046N3146j17625
132E4825m9226L5493m9184k0746K0342p2100m2061N8999L9153M5301O0595k0031
144F1360l1339J1336j7185l162J2680o3136n0106K3344n197J9016Q1522n917m4509
157a1293M3412R394l4099M2966k078r1555p667K8029k9056L2175N2426m2684j3382
170b3412M8671n366L949L9532l9526n4941J3934l760r059L9698k174m0122J4136
183a8440K0259M34L2452J2569l8029j6765J501p216J4688J1408k0724j2210j654
196b1727k185K3313J9995j0693k818k95j4244J1375J8700j5285q769M210j8244
209a6667k587K2720m756r495J4538j019n693J8604L060j4270L394k555j3970M624
$$ plain form
223 -4072 -2767 -16742 -14509 -6654 -8531 1996 14167 9637 9734 13410 5485 2576 2886 -8281 -14695
238 -14695 -11963 -13667 -10259 -12 3677 7918 15074 14641 12613 9582 -1157 -7518 -7660 -12797 -13883
253 -13883 -9528 -11646 -7898 7041 13896 16023 19085 9332 -2711 -1164 -1625 -7326 -7409 -12365 -19622
268 -19622 -10984 3488 11645 18252 15695 3838 448 3087 1824 925 -5763 -19533 -21547 -10384
282 -10384 819 12250 17242 8246 1318 4671 8426 10985 7620 -7986 -21277 -20432 -11770 1473
296 1473 11633 6795 -2041 -1940 2878 11599 18356 7593 -10944 -18152 -16845 -8257 6595 9107
310 9107 -2431 -7652 -3790 4519 16926 18884 4007 -9976 -14020 -9787 3169 11252 3154 -7850
324 -7850 -10378 -5139 8519 19076 11662 -3706 -12878 -14133 -3435 11362 10337 -3092 -11762 -12266
$$ packed form
223d072J305j3975K233P855j877J0527J2171m530R7L676p925k909L10j1167o414
238a4695K732j704L408J0247L689M241P156m33k028l031j0739o361j42n137j086
253a3883M355k118L748J4939O855K127L062r753j2043J547m61n701q3m956p257
268a9622Q638J4472Q157O607k557j1857l390K639j263q99o688j3770k014J1163
282a0384J1203J1431M992q996o928L353L755K559l365j5606j3291Q45Q662J3243
296A473J0160m838q836J01M818Q721O757j0763j8537p208J307Q588J4852K512
310I107j1538n221L862Q309J2407J958j4877j3983m044M233J2956Q083q098j1004
324g850k528N239J3658J0557p414j5368r172j255J0698J4797j025j3429q670n04
$$ plain form
338 -12266 -2595 14357 19476 6841 -7560 -14407 -10285 5050 14879 6600 -7894 -15824 -13544 555
352 555 15427 13940 -541 -12144 -13235 -2551 13256 16991 4611 -9030 -13438 -6966 7622
365 7622 16463 7289 -8800 -15108 -10315 2634 16520 14971 -845 -10335 -8076 122 12680 15638
379 15638 -605 -16255 -16259 -8817 3099 13883 6839 -8909 -11645 -3774 6764 16975 12762 -4638
393 -4638 -14725 -12335 -2656 10031 10968 -1993 -10491 -10146 -2002 14278 18492 3029 -8011 -11392
407 -11392 -11994 3564 16826 3452 -8583 -6276 -8648 1087 22951 15443 -5327 -5819 -9584 -12406
421 -12406 8607 13437 -8505 -10983 -5342 -10285 6044 23587 6103 -6714 -1421 -7940 -4898
434 -4898 12722 3866 -13583 -9652 -8203 -5552 13215 15487 -132 -2343 -1676 -2140 10171 12173
$$ packed form
338a2266R671J6952N119j2635j4401o847M122J5335R829q279j4494p930K280J4099
352E55J4872j487j4481j1603j091J0684J5807L735j2380j3641m408O472J4588
365G622Q841r174j6089o308M793J2949J3886j549j5816r490K259Q198J2558K958
379A5638j6243j5650mP442J1916J0784p044j5748k736P871J0538J0211m213j7400
393d638j0087K390R679J2687R37j2961q498L45Q144J6280M214j5463j1040l381
407a1392o02J5558J3262j3374j2035K307k372R735K1864p508k0770m92l765k822
421a2406K1013M830k1942k478N641m943J6329J7543j7484j2817N293o519L042
434d898J7620q856j7449L931J449K651J8767K272j5619k211O67m64J2311K002
$$ plain form
448 12173 -2383 -8242 -11149 -11332 5621 13248 1598 -307 -2868 -10929 4230 17013 1432 -3936
462 -3936 -2100 -16789 -8627 15756 5864 -4537 5945 -5747 -12498 13478 13699 -6797 72 -2288
476 -2288 -18644 -530 14347 -3390 -2884 5395 -8970 -3442 16378 5507 -4553 2257 -6427
489 -6427 -9956 6054 5235 -4087 -8 -2804 -5313 6841 8803 1706 2520 -2526 -6545 3258 4077
504 4077 -2468 969 -3692 -10080 2882 6936 -2419 2833 2078 -10810 -805 9865 -2238 -1076
518 -1076 5310 -9167 -7220 10313 2794 -3044 7061 -2976 -11234 5013 6169 -3863 4101 2138
532 2138 -10412 -1316 6604 -1092 2313 5351 -5113 -3899 3239 -765 427 4446 -1599 -2810 1258
547 1258 -1714 -999 2970 -153 -200 2030 -2262 -1943 1172 -2083 477 4882 -1619 -2708 1671 -4231
$$ packed form
448A2173j4556n859k907j83J6953P627j1650j905k561q061J5159J2783j5581n368
462c936J836j4689Q162K4383r892j0401J0482j1692o751K5976K21k0496O869k360
476b288j6356J8114J4877j7737N06Q279j4365N528J9820j0871j0060O810q684
489f427l529J6010q19r322M079k796k509J2154J962p097Q14n046m019R803Q19
504D077o545L437m661o388J2962M054r355N252p55j2888J0005J0670j2103J162
518a076O386j4477J947J7533p519n838J0105j0037q258J6247J156j0032P964j963
532B138j2550R096P920p696L405L038j0464J214P138m004J192M019o045j211M068
547A258k972P15L969l123m7K230m292L19L115l255K560M405o501j089M379n902
$$ plain form
563 -4231 -3541 6059 966 -3571 3673 -1528 -6698 4956 5199 -3025 4461 3740 -8037 -1121 5011
578 5011 -4261 -174 6545 -3855 -4788 3580 -1795 -2390 6250 1784 -3071 1317 -2443 -5553 1667
593 1667 2583 -117 2461 -225 -3765 -134 1323 2678 5591 40 -4180 -1026 -3660 -3022 6360 3012
609 3012 -4326 1169 -708 -6031 4885 7022 -4316 181 2517 -9058 -2068 8465 -3022 -3435
623 -3435 7206 -2313 -5591 8090 2505 -6267 3841 2107 -6884 2297 3790 -6806 -1394 4666
637 4666 -2116 860 5960 -1913 -4149 943 -10 505 2516 -1403 -3038 -2283 -2181 3502 5817 -31
653 -31 -276 260 -4854 -15 6456 -938 -3121 1007 -5568 -4811 7040 3315 -3261 3347 -135 -6858
669 -6858 3669 6293 -3754 -674 2049 -6340 -1520 7043 -192 -2431 3501 -1465 -3373 4734 2936
$$ packed form
563d231O90R600n093m537P244n201n170J1654K43q224P486p21j1777O916O132
578E011r272M087O719j0400r33Q368n375n95Q640m466m855M388l760l110P220
593A667R16k700K578k686l540L631J457J355K913n551m220L154k634O38R382l348
609C012p338N495j877n323J0916K137j1338M497K336j1575O990J0533j1487m13
623c435J0641r519l278J3681n585q772J0108j734q991R181J493j0596N412O060
637D666o782K976N100p873k236N092r53N15K011l919j635P55J02N683K315n848
653c1k45N36n114M839O471p394k183M128o575P57J1851l725o576O608l482o723
669f858J0527K624j0047L080K723q389M820Q563p235k239N932m966j908Q107j798
$$ plain form
684 2936 -3648 -923 -168 -2902 632 3259 -59 -2118 -925 700 1846 1563 1287 -936 -4263 -1581
700 -1581 2702 685 118 1629 -2870 -3508 3713 3527 -428 1873 -872 -5845 -317 3464 -757 -68
716 -68 619 -4380 -2135 3911 2041 674 1796 -1753 -2602 1608 2237 634 397 -1589 -2156 423 1340
733 1340 1671 1141 -1976 -1808 709 191 1013 1835 -2534 -3231 1230 294 -235 3105 -812 -4466 835
750 835 1669 -1140 2582 1295 -4847 -852 2983 -718 1572 3501 -3246 -2801 2894 425 -123 3133
766 3133 -1586 -4107 938 874 -300 2572 -215 -3490 215 1014 -115 2834 778 -3227 6 863
782 863 -1124 2408 1693 -3768 -1062 1329 -1991 729 2967 -2649 -2269 2316 -396 -250 3404 -792
798 -792 -2966 1449 333 -979 2411 -83 -3180 664 1110 -718 2529 1293 -2953 -86 1421 -1228
$$ packed form
684B936o584K725P55k734L534K627l318k059J193J625J146k83k76k223l327K682
700a581M283k017n67J511m499o38P221j86l955K301k745m973N528L781m221O89
716f8O87m999K245O046j870j367J122l549q49M210O29j603k37j986n67K579R17
733A340L31n30l117J68K517n18Q22Q22m369o97M461r36n29L340l917l654N301
750H35Q34k809L722j287o142L995L835l701K290J929o747M45N695k469n48L256
766C133m719k521N045o4j174K872k787l275L705P99j129K949k056m005L233Q57
782H63j987L532p15n461K706K391l320K720K238n616L80M585k712J46L654m196
798g92k174M415j116j312L390k494l097L844M46j828L247j236m246K867J507k649
$$ plain form
814 -1228 1406 1985 -3090 -1750 1393 -981 317 2888 -1118 -2286 1008 -65 -322 2174 -233 -2194
830 -2194 264 -16 -308 2130 647 -1605 349 208 -896 1446 561 -2370 -537 243 -1413 883
846 883 1798 -1285 -574 1438 -208 354 2005 -578 -1474 382 -421 -495 1355 87 -1141 422 289
863 289 -120 1348 568 -1095 -284 -313 -945 418 333 -1189 -331 125 -508 591 1058 -429 -253 295 -491
882 -491 21 623 -343 -312 296 -131 290 926 47 -103 392 -299 -206 482 -488 -725 279 -326 -474 880
902 880 407 -561 547 524 -706 145 641 -719 -421 431 -514 -611 595 169 -310 614 443 -653 -94
921 -94 370 -273 -48 498 -307 -787 -7 169 122 900 567 -575 -496 125 10 421 816 -285 -1077 -430 -36
942 -36 79 712 480 -568 -755 -172 218 332 384 46 -565 -697 274 620 -82 251 486 -778 -145 1355
$$ packed form
814a228K634N79n075J340L143k374J298K571m006j168L294j073k57K496k407j961
830b194K458k80k92K438j483k252J954j41j104K342q85k931J833P80j656K296
846H83R15l083P11K012j646N62J651k583q96J856q03p4J850j268j228J563j33
863B89m09J468p80j663Q11k9o32J363q5j522Q58M56o33J099M67j487J76N48p86
882d91N12O02r66L1O08m27M21O36q79j50M95o91R3O88r70k37J004o05j48J354
902H80m73r68J108k3j230Q51M96j360K98Q52r45r7J206m26m79R24j71j096N59
921i4M64o43K25N46q05m80P80J76m7P78l33j142P9O21j15M11L95j101p92O47L94
942c6J15O33k32j048j87N83L90J14N2l38o11j32R71L46p02L33K35j264O33J500
$$ plain form
962 1355 -193 -937 856 -34 -1234 1297 1027 -2069 -341 1053 -1412 121 2344 -1227 -2047 1281
978 1281 -221 -998 2641 955 -2829 -119 879 -1200 1393 2464 -1633 -1614 646 -648 370 2498
994 2498 -6 -1831 -514 -631 -244 1629 800 -820 -750 -1133 -57 1614 487 46 187 -1641 -887
1011 -887 1788 83 -836 1412 -763 -2027 2119 1266 -2180 1004 1288 -2736 714 3058 -2443 -1697
1027 -1697 2292 -1529 -1371 3818 199 -3405 1072 586 -2079 2599 2684 -2853 -1487 766 -1541 578
1043 578 3453 -230 -2186 -294 -847 -153 2368 1312 -972 -1252 -1418 -338 1394 1227 606 -388 -1903
1060 -1903 -659 1383 337 476 1050 -1721 -1852 1518 403 -1047 1477 138 -2512 932 1928 -1592
1076 -1592 -100 1462 -1791 -618 2582 -367 -1886 1073 -141 -1463 2107 1836 -1763 -711 559
$$ packed form
962A355j548p44J793q90j200K531k70l096J728J394k465J533K223l571q20L328
978A281j502p77L639j686l784K710R98k079K593J071m097J9K260j294J018K128
994B498k504j825J317j17L87J873q29j620P0l83J076J671j127m41J41j828P54
1011h87K675j705r19K248k175j264M146q53l446L184K84m024L450K344n501P46
1027a697L989l821J58N189l619l604M477m86k665M678Q5n537J366K253k307K119
1043E78K875l683j956J892n53O94K521j056k284k80j66J080J732j67o21r94j515
1060a903J244K042j046J39N74k771j31L370j115j450K524j339k650L444R96l520
1076a592J492J562l253J173L200k949j519K959j214j322L570k71l599J052J270
$$ plain form
1091 559 -1027 344 2440 44 -1873 -616 -430 -456 1573 1685 -1038 -1731 -399 -319 349 2014 899
1108 899 -1754 -1276 238 -128 801 1919 -281 -1820 -210 357 63 1279 876 -1205 -856 288 -43
1125 -43 405 789 -428 -872 -75 219 229 158 -72 -285 -297 38 717 -69 -950 103 58 -386 1035 797 -1269
1146 -1269 -402 675 -596 543 1814 -1027 -1632 703 -497 -688 2173 587 -2153 123 460 -1248
1162 -1248 1276 1826 -1512 -765 589 -1246 69 2131 -550 -1070 858 -706 -738 1847 485 -1170
1178 -1170 541 -144 -1133 928 623 -872 382 228 -945 665 747 -866 268 493 -979 283 822
1195 822 -1030 -86 776 -1000 102 1421 -937 -639 1240 -668 -693 1556 -287 -1358 953 -40 -1017
1212 -1017 1345 614 -1325 644 616 -1315 643 1177 -1216 -244 902 -1048 -287 1276 -516 -606 827
$$ packed form
1091E59j586J371K096k396j917J257J86k6K029J12k723o93J332Q0O68J665j115
1108H99k653M78J514l66R29J118k200j539J610N67k94J216m03k081L49J144l31
1125d3M48L84j217m44P97K94J0p1k30k13j2L35O79p86q81J053m5m44J421k38k066
1146a269Q67J077j271J139J271k841o05K335j200j91K861j586k740K276L37j708
1162a248K524N50l338P47J354j835J315K062k681n20J928j564l2K585j362j655
1178a170J711o85r89K061l05j495J254j54j173J610Q2j613J134K25j472J262N39
1195H22j852R44Q62j776J102J319k358K98J879j908k5K249j843j071K311r93r77
1212a017K362p31j939J969k8j931J958N34k393R72J146j950P61J563j792r0J433
$$ plain form
1229 827 -449 -608 924 -89 -729 561 -139 -687 513 89 -476 505 198 -473 346 112 -475 410
1247 410 279 -571 318 191 -638 286 528 -487 208 337 -766 8 607 -441 -44 471 -702 -397 707
1266 707 -160 -242 594 -280 -539 540 88 -241 466 -122 -535 299 204 -164 480 -19 -494 235 88 -190
1286 -190 444 -55 -688 189 148 -462 403 256 -813 29 414 -458 245 482 -856 -227 670 -380 63
1305 63 875 -536 -617 857 -103 -287 862 -256 -965 489 245 -485 750 198 -1077 86 443 -518
1323 -518 493 521 -1006 -295 399 -461 296 832 -705 -519 497 -366 49 1037 -413 -733 482 -181
1341 -181 -338 978 44 -880 388 112 -580 802 471 -991 69 308 -706 391 779 -852 -272
1358 -272 542 -442 35 933 -496 -666 473 -178 -273 863 -31 -830 305 100 -273 713 354 -702 7
$$ packed form
1229H27j276j59J532j013o40J290p00n48J200m24n65R81l07o71Q19k34n87Q85
1247D10j31q50Q89j27q29R24K42j015O95J29j103P74N99j048L97N15j173L05J104
1266G07q67q2Q36q74k59J079m52l29P07n88m13Q34r5l68O44m99m75P29j47k78
1286a90O34m99o33Q77m1o10Q65j47j069Q42L85q72P03K37j338O29Q97j050M43
1305F3Q12j411q1J474r60j84J149j118p09J454k44p30J235n52j275J163L57r61
1323e18J011K8j527P11O94q60P57N36j537J86J016q63M15R88j450l20J215o63
1341a81j57J316r34r24J268k76o92J382l31j462J060K39j014J097L88j631N80
1358b72Q14r84M77Q98j429j70J139o51r5J136q94p99J135k05l73R86l59j056P09
$$ plain form
1377 7 137 -344 466 541 -518 -213 135 -325 325 601 -323 -370 98 -414 51 573 -175 -380 101 -268 -95
1398 -95 615 55 -262 212 -180 -248 591 301 -385 119 45 -384 329 461 -298 -132 138 -308 -53 435 -120
1419 -120 -360 -19 -106 -84 260 124 -207 -171 -139 71 174 75 28 -158 -305 96 308 74 128 88 -338 -39 411
1442 411 74 -46 207 -292 -429 360 216 -136 192 -9 -484 68 370 -233 -35 208 -342 -210 354 30
1462 30 -144 199 -48 -250 188 140 -93 13 33 -114 17 167 -9 -86 -28 -23 108 123 -26 -26 -182 -198 140 89
1486 89 -81 145 15 -345 23 260 -83 43 161 -305 -322 363 26 -105 251 58 -400 111 304 -183 148
1507 148 361 -352 -220 374 -100 -186 406 15 -436 230 120 -401 65 251 -310 -50 296 -301 -249 341 -27
1528 -27 -142 267 38 -310 144 194 -126 269 284 -235 -72 127 -162 82 226 -94 -47 -83 -231 51 223 -89
$$ packed form
1377GJ30m81Q10P5j059L05L48m60O50K76r24m7M68n12M65N22p48k05M81l69J73
1398i5P10n60l17M74l92o8Q39k90o86N04p4m29P13J32p59J66K70m46K55M88n55
1419a20k40L41q7K2L44j36l31L6L2K10J03r9m7j86j47M01K12k34N4m0m26K99M50
1442D11l37j20K53m99j37P89j44l52L28k01m75N52L02o03J98K43n50J32N64l24
1462C0j74L43k47k02M38m8k33J06K0j47J31J50j76p7N8NJ31J5j49%j56j6L38n1
1486H9j70K26j30l60L68K37l43J26J18m66j7O85l37j31L56j93m58N11J93m87L31
1507A48K13p13J32N94m74q6N92l91m51O66j10n21M66J86n61K60L46n97N2N90l68
1528b7j15M09k29l48M54N0l20L95J5n19J63J99k89K44J44l20M7l6j48K82J72l12
$$ plain form
1550 -89 5 70 -339 -74 279 -172 29 328 -281 -280 368 -97 -184 596 77 -456 301 186 -475 287 491 -452
1572 -452 -62 438 -516 -229 635 -165 -347 479 -116 -583 366 207 -432 252 274 -545 -41 419 -265 -11
1592 -11 439 -174 -241 247 -61 -207 258 92 -142 53 7 -103 137 84 50 97 -92 -177 124 -54 -24 262 -40
1615 -40 -233 102 -67 -239 321 240 -298 3 185 -408 -20 490 -75 -222 250 -114 -291 342 205 -224 138
1636 138 157 -331 -42 436 -49 -140 293 -6 -345 131 187 -229 -22 282 -241 -255 158 -47 -303 298 94
1657 94 -337 169 154 -357 82 487 -164 -189 294 -166 -260 294 139 -175 142 -64 -305 125 179 -133 70 64
1679 64 -380 -11 99 -126 193 104 -269 33 82 -265 207 346 -314 -6 365 -297 -107 534 -184 -246 510
1700 510 -145 -395 501 -16 -606 426 216 -612 301 365 -648 129 556 -492 -118 566 -430 -287 657
$$ packed form
1550h9R4O5m09K65L53m51K01K99o09JO48m65q7P80n19n33P57j15o61P62K04r43
1572d52L90N00r54K87Q64q00j82Q26n95m67R49j59o39O84K2q19N04M60o84K54
1592a1M50o13o7M88l08j46M65j66k34J95m6j10K40n3l4M7j89q5L01j78L0K86l02
1615d0j93L35j69j72N60q1n38L01J82n93L88N10n65j47M72l64j77O33j37m29L62
1636A38J9m88K89M78m85r1M33k99l39M76N6m16K07L04n23j4M13k05k56O01k04
1657I4m31N06j5n11M39M05o51k5M83m60r4N54j55l14L17k06k41M30N4l12K03o
1679F4m44L69J10k25L19q9l73L02M9l47M72J39o60L08L71o62J90O41p18o2P56
1700E10o55k50Q96n17n90J032k10q28R13O4j013P77M27j048L74O84r96J43R44
$$ plain form
1719 657 -159 -342 570 -139 -534 469 168 -412 436 186 -591 188 240 -443 202 337 -534 49 452 -334
1739 -334 81 439 -424 -199 416 -287 -126 607 -234 -388 445 -155 -468 534 -16 -511 384 165 -574 373
1759 373 337 -590 206 473 -488 59 535 -414 -161 542 -231 -237 520 -254 -358 442 -54 -391 376 53 -491
1780 -491 228 156 -405 171 220 -409 89 262 -313 92 388 -268 -46 286 -117 -18 316 -163 -209 291 -106
1801 -106 -125 284 -85 -371 154 -26 -294 196 116 -320 -1 150 -204 63 204 -201 -22 191 -128 -4 249
1822 249 -88 -105 188 -13 -102 134 17 -97 56 -10 -108 33 41 -139 -11 47 -70 20 19 -72 -10 -9 40 67 6 -13
1848 -13 -36 21 6 49 -54 10 50 -63 -8 114 28 -56 16 -47 -93 110 36 -44 56 27 -56 39 78 -69 27 118 -123
1875 -123 -67 105 -48 -21 30 -97 -17 0 -95 -51 97 -111 -54 147 18 -96 182 10 -64 111 35 -58 113 19
$$ packed form
1719F57q16j83R12p09l95J003l01n80Q48k50p77P79N2o83O45J35q71N83M03p86
1739c34M15L58q63K25O15p03J61P33q41j54Q33o00l13J002n50m95Q95k19p39R47
1759C73l6r27P96K67r61N47M76r49K53P03p73oP57p74j04Q00m96l37P67l23n44
1780d91P19p2n61N76M9o29M98J73n75M05K96o56K22L32m03R9L34m79m6N00l97
1801a06j9M09l69k86N25j80k68M90q0m36L19J51l54K67J41m05J79K13l19J24K53
1822B49l37j7K93k01q9K36j17j14J53o6r8J41Qj80J28N8j17R0jr1O2JM9K7o1j9
1848a3k3N7j5M3j03O4M0j13N5J22q6q4P2o3m6K03p4q0J00k9q3R5L9j47R6R1k41
1875a23N6J72j53K7N1j27Q0J7r5M4J48k08N7K01j29j14K78j72p4J75p6r3J71r4
$$ plain form
1899 19 -100 136 65 -166 -32 101 -153 -40 117 -184 -65 109 -84 -13 162 -9 -106 117 15 -127 131
1920 131 113 -75 142 130 -28 86 81 -70 -55 32 -93 -22 50 -99 -31 27 -66 -91 22 -110 -1 129 -46 -28
1944 -28 86 5 -8 78 75 12 126 -15 -37 73 46 10 38 58 -101 -10 41 -96 -19 22 -49 -52 -27 25 -31 62 -47 -41
1972 -41 23 -7 -6 43 -5 7 13 -12 66 -9 -78 44 39 -80 33 93 -54 13 64 -75 -29 107 -23 -84 135 10 -90
1999 -90 111 60 -162 15 88 -96 3 130 -102 -60 48 -91 -19 111 -50 -108 86 16 -45 127 99 -79 23
2022 23 10 13 35 46 -22 -69 -12 -125 -4 45 -75 -38 4 -127 28 15 -66 -74 39 -33 -88 72 4 -89 112 77 -81
2049 -81 148 130 -77 75 85 -101 12 137 -113 -88 166 -92 -155 141 24 -249 64 42 -160 58 111 -107
2071 -107 -21 147 -36 15 137 -43 -47 129 34 -41 74 57 -87 78 74 -103 87 76 -150 -10 97 -49 -37 90
$$ packed form
1899A9j19K36p1k31J34J33k54J13J57l01J19J74j93P1J75j71r7K23j02j42K58
1920A31j8j88K17j2j58J14nj51J5Q7j25P1P2j49O8N8r3k5J13j32J09J30j75J8
1944b8J14q1j3Q6lo3J14j41k2J10k7l6K8K0j59R1N1j37P7M1p1lK5N2n6R3j09O
1972d1O4l0JM9m8J2Ok5P8p5o9J22nj19J13O0j47O7N1j39M6J36j30o1K19j25j00
1999i0K01n1k22J77P3j84R9J27k32M2J08j39P2J30j61n8J94p0o1J72k8j78J02
2022B3j3LK2J1o8m7N7j13J21M9j20L7M2j31J55j3q1qJ13p2n5J60o8r3K01l5j58
2049h1K29j8k07J52J0j86J13J25k50K5K54k58o3K96j17k73L13k2k02K18N3k18
2071a07Q6J68j83N1J22j80mJ76r5p5J15j7j44J65mj77J90j1k26J40J07j46J2J27
$$ plain form
2095 90 -72 -7 92 -72 4 94 -115 -83 203 -32 -93 153 -46 -178 145 102 -85 182 29 -252 30 193 -143
2118 -143 -11 221 -181 -63 182 -71 -100 227 2 -244 130 82 -182 86 141 -259 63 148 -152 -48 137
2139 137 -178 -51 127 -95 -30 151 -69 -83 213 33 -100 145 11 -140 161 52 -97 124 41 -146 73
2160 73 118 -94 47 68 -224 -71 123 -114 -27 93 -153 -99 162 -12 -100 184 8 -157 175 113 -186 97
2182 97 199 -169 23 194 -131 -66 183 -138 -85 146 -82 -131 56 -46 -141 29 58 -86 40 34 -134 41 133
2205 133 35 1 102 -83 39 173 -4 -7 93 14 -54 1 -2 -40 50 -3 -72 27 86 -72 43 108 -79 -42 76 20
2231 20 5 113 -40 -112 106 5 -71 81 42 -125 -33 39 -144 29 104 -90 -4 100 -74 -106 139 13 -63 160
2255 160 -49 -159 61 77 -177 51 79 -167 -69 115 -119 -60 124 -128 -100 129 -61 -69 182 -23 -89 65 71
$$ packed form
2095I0j62O5R9j64P6R0k09L2K86k35o1K46j99j32L23m3j87K67j53k81K82J63l36
2118a43J32K32m02J18K45k53k9L27k25k46L74m8k64K68N5m00L22Q5l00J04J85
2139A37l15J27J78k22O5J81k20j4K96j80j33K45j34j51L01j09j49K21q3j87K19
2160G3M5k12J41K1k92J53J94k37Q7J20k46N4K61j74q8K84j76j65L32o2k99K83
2182I7J02l68J92J71l25O5K49l21N3K31k28m9J87j02r5J70K9j44J26oj68J75R2
2205A33r8l4J01j85J22J34j77lJ00p9o8N5ll8R0n3o9R9N9j58J15O5j87L7J18n6
2231B0j5J08j53p2K18j01p6J52l9j67R2P2j83J73P5j94Q6J04j74l2K45j26p6K23
2255A60k09j10K20J6k54K28K8k46R8J84k34N9J84k52K8K29j90qK51k05o6J54O
$$ plain form
2278 71 -102 161 105 -154 50 98 -107 29 83 -118 -48 128 -100 -60 102 -102 -102 95 -52 -126 70 -59 -84
2301 -84 150 80 -116 95 64 -97 121 167 -60 59 133 -123 9 122 -144 -67 106 -108 -209 90 -122 -124 128
2324 128 7 -137 76 61 -130 83 109 -132 4 124 -70 -31 148 -40 -8 120 -78 -78 102 -34 -100 93
2346 93 16 -82 37 40 -83 104 70 -122 2 16 -84 18 89 -17 4 58 -106 -57 68 50 -12 7 -65 -71 43 3
2372 3 -41 15 -50 -113 19 61 -44 -21 39 -51 -18 96 29 -71 43 11 -70 36 76 36 59 11 -75 -82 15 -1 -41 -18
2400 -18 -2 -38 36 51 3 0 -2 6 63 53 -1 45 8 -23 -9 120 8 -58 17 -70 -63 59 21 -53 -45 -69 -41 -5 42 0 -42
2431 -42 -24 -5 25 122 48 -13 0 -68 -21 137 46 -33 75 -50 8 -10 -7 -55 -19 -28 -85 -17 26 -50 -37 8 -58 7 63 27
2461 27 -30 3 32 -28 127 33 -33 -3 -11 -3 51 36 -105 26 17 -33 23 51 12 -70 -29 -23 22 96 -22 -33 -22 41 -9 38
$$ packed form
2278G1j73K63n6k59K04M8k05J36N4k01P0J76k28M0J62k04%J97j47p4J96j29k5
2301h4K34p0j96K11l1j61K18M6k27J19P4k56J32J13k66P7J73k14j01K99k12kK52
2324A28j21j44K13j5j91K13K6k41J36J20j94L9J79j88L2J28j98%J80j36o6J93
2346I3p7r8J19Lj23J87l4j92J24J4j00J02P1j06K1N4j64M9J25j8o2J9p2oJ14m0
2372Cm4N6o5o3J32M2j05K3O0r0L3J14o7j00J14l2q1J06M0m0K3m8q6pR7j6m0K3
2400a8J6l6P4J5m8lkQN7j0n4M6l7l1J4J29j12o6P5q7PJ22l8p4Qk4K8L6M7m2m2
2431d2J8J9L0R7p4o1J3o8M7J58r1p9J08j25N8j8Lm8L6rn7O8M3p6J3M5o6O5N6l6
2461B7n7L3K9o0J55r4o6L0qQN4j5j41J31rn0N6K8l9q2M1OM5P4j18j1J1O3n0M7
$$ plain form
2491 38 -11 49 61 -2 7 21 32 -58 -2 -88 -16 4 -15 -12 -10 17 -6 58 75 44 8 -9 -32 -38 40 -33 66 -48 4 26 -3 -13
2523 -13 25 9 -95 54 44 -15 24 45 7 62 36 -75 45 12 -78 -45 93 43 -42 -2 -12 -65 79 -19 -58 -13 -1
2550 -1 -34 -41 14 -23 17 -25 -45 15 37 -56 25 19 8 -41 109 25 1 72 6 -45 23 33 -79 11 -20 -63 -42 -46 -63 6 -10
2581 -10 -52 -33 35 -3 -15 84 11 -18 33 44 -12 116 8 -80 86 22 -84 33 29 -45 -25 96 -34 -36 32 -38 -90 70
2609 70 33 -75 38 32 -68 69 58 -93 17 51 -74 -8 114 -54 -17 76 -26 -26 62 -52 -8 43 -7 -56 34 49
2635 49 -32 109 -3 -37 85 99 -75 23 66 -72 -1 91 -60 -44 61 -67 -37 37 -13 -34 91 30 -51 71 41
2660 41 -61 -5 33 -53 -14 92 -27 -9 47 8 -69 79 -75 -28 26 -39 -46 46 -32 -74 8 -57 -71 2 108 -45 18
2687 18 29 -21 23 105 5 3 117 -17 -49 110 19 -56 44 -12 -78 63 61 -54 50 58 -91 -20 85 -150 -61 63
$$ packed form
2491C8m9O0J2o3RJ4J1r0N6q6P2K0j9LKK7k3O4J7l1l6j7k3oP8p3R9j14N2K2k9j0
2523a3L8j6j04J49j0n9L9K1l8N5k6j11J20l3r0L3J38n0q5M0j0n3J44r8l9M5J2
2550al3pN5l7M0m2k0O0K2r3Q1oj1m9J50q4k4P1o6n1O8J0j12R0l1m3K1mj7O9j6
2581a0m2J9O8l8j2R9p3k9N1J1n6J28j08q8J66o4j06J17mp4K0J21j30kO8p0n2J60
2609G0l7j08J13oj00J37j1j51J10L4j25O6J22j68L7R3j02%Q8j14M4N1n0m9R0J5
2635D9q1J41j12l4J22J4j74R8M3j38P1R2j51J6J05j28L0P4n0k1J25o1q1J22l0
2660D1j02N6L8q6L9J06j19J8N6l9p7J48j54M7N4o5pR2p8m2Q2o5j4P3J06j53O3
2687A8J1n0M4Q2j00kJ14j34l2J59r1p5J00n6o6J41kj15J04Qj49P1J05k35Q9J24
$$ plain form
2713 63 -44 -24 57 -21 4 89 5 -66 82 38 -67 91 99 -71 24 39 -115 -30 64 -54 26 108 -45 -30 61 -21 -16
2740 -16 58 17 -40 116 -27 -96 118 28 -61 2 -23 -99 32 64 -27 -18 62 -46 -51 32 -33 -6 80 -29 -104 -28 71 -35
2768 -35 76 78 -66 31 65 -86 -36 71 -21 -10 41 -79 -69 82 45 -40 18 -21 -34 -13 35 -38 58 94 -51 -22 77
2795 77 -33 -9 60 -42 -93 -4 -10 -20 109 31 -117 -25 -34 -59 55 16 -67 -22 18 -86 -8 67 -20 2 57 -45 -76 85
2823 85 55 -39 111 -16 -70 43 14 -75 62 -2 -97 18 74 -98 19 92 -66 -36 47 -48 -60 60 -17 -36 55 1
2849 1 -75 37 52 -25 71 -41 -48 -30 36 -77 -16 62 -111 -73 44 -36 -25 66 -27 -4 -5 -7 -50 -8 57 -29 39 49 -53
2878 -53 7 22 -57 -1 78 -62 -44 77 -42 22 36 -26 -26 -24 12 -17 52 15 -13 -4 -13 -101 54 21 -69 25 15 -51 -10 44
2908 44 22 -17 31 -20 -84 -33 -36 10 95 64 -73 -9 42 11 71 21 -56 38 2 -2 49 32 -36 -10 -2 1 12 -19 30 -23 -11 1
$$ packed form
2713F3j07K0Q1p8K5Q5q4p1J48m4j05J58Qj70R5J5j54Q5R4j18Q0Q2j53J5R1q2N
2740a6P4m1n7J56j43o9K14r0q9O3k5p6J31L2r1RQ0j08nQ3o5K7Q6j09p5P6R9j06
2768c5J11Kj44R7L4j51N0J07r2J1N1j20J0J51l7q5N8l9j3K1M8p3R6L6j45K9R9
2795G7j10K4O9j02n1Q9oj0J29p8j48R2rk5J14l9q3M5M0j04P8P5q7K2N5j02l1J61
2823H5l0r4J50j27n4J13k9q9J37o4r5J15N6j72J17P3j58L0Q3r5j2J20p7j9R1n4
2849Ap6J12J5p7R6j12pJ8O6j13O1P8j73L8J17q0J1R1r3K3jkm3M2O5q6O8J0j02
2878e3O0J5p9N6P9j40J8J21j19O4J4o2%KL6k9O9l7k8Rrq8J55l3r0R4j0o6M1N4
2908D4k2l9M8n1o4N1lM6Q5l1j37O4N1l1O0n0p7R4l6mN1j7o8K6QLJ1l1M9n3J2J2
$$ plain form
2940 1 -37 13 -35 -15 13 38 -35 7 -22 20 29 17 7 1 -17 -14 3 15 16 24 -27 -5 -30 -47 42 -38 -32 -12 -37 -43 49 21 8 38
2974 38 -28 10 17 76 -11 42 15 -5 -30 -23 20 -7 9 2 -25 2 -40 -62 19 -24 -20 18 22 16 27 29 -6 21 33 0 -35 -6 -6 6
3008 6 39 -66 -13 2 34 -18 66 9 -13 -15 27 -29 -1 35 22 34 -48 -27 -45 21 8 36 7 19 -55 39 67 35 -19 9 -34
3039 -34 -5 3 -24 23 0 13 -67 -24 59 -21 30 -8 -8 12 28 13 0 11 14 -25 -7 13 25 -72 -33 -20 -2 42 -8 -16 27 7
3071 7 -13 53 20 -2 28 36 -7 -14 37 26 -44 -28 -38 -22 14 -52 -57 -7 5 36 29 -21 -41 27 -25 -4 40 11 4 1 -14 -28 5 -3
3105 -3 -18 49 -5 -49 -26 33 25 -29 19 -19 -36 73 28 -52 35 -24 -24 73 -5 45 7 27 -59 8 50 37 4 -15 -55 -32 33
3136 33 3 4 -2 18 -65 7 53 -48 4 7 -20 -51 34 -47 -58 30 -22 -83 106 23 -25 -4 -30 39 1 -35 -17 6 17 -36 21
3167 21 24 -5 28 72 -3 45 53 -63 -24 14 -48 -5 95 -52 -91 37 -26 -37 29 23 -50 23 -4 -57 -32 56 -22 15 34 -22
$$ packed form
2940Al8N0m8K0K8K5p3M2k9M2Rj2j0oj8LJ7J2JQn1K2k5j7Q9q0OK0k5oR2k8j3L0
2974C8o6L8PN9q7N3k7k0k5PM3k7J6pk7K7m2k2Q1m3ML8MoJ1Kl5K7J2l3l5K9%J2
3008FL3j05N3J5L2n2Q4n7k2kM2n6K8L6j3J2q2K1j8O6j3K8k9J2p4R4K8l2n4K8m3
3039c4K9Qk7M7k3J3q0M3Q3q0N1l8%K0J6j5j3J1Ll9J8K0J2r7L9J3J8M4n0qM3k0
3071Gk0O6l3k2L0Qm3pN1j1p0J6j0J6L6o6nN0J2L1pn0k0O8n2K1M4k9plj5j4L3q
3105cj5O7n4m4K3N9qn4M8l8j7J09m5q0Q7n9%R7p8N0l8K0q6O7M2j3l3j9m0K3O5
3136C3l0JoK0q3P2M6j01N2Lk7l1Q5q1j1Q8n2o1J89q3m8K1k6O9l8l6J8K3J1n3N7
3167B1Lk9L3M4p5M8Qj16L9L8o2M3J00j47l9J28o3j1O6op3P3k7n3K5Q8p8L7J9n6
$$ plain form
3197 -22 -44 29 13 -20 35 -10 3 11 113 -16 40 37 -85 19 53 -46 33 41 11 -41 50 -9 -31 24 32 -26 14 -20 -33 22
3227 22 -39 -106 36 52 -78 8 37 -17 12 36 -2 -18 8 -45 28 65 -47 -36 93 -14 -81 67 14 -26 49 -51 -74
3254 -74 -15 18 -7 8 -13 -66 -64 54 25 -40 66 43 -17 25 59 -4 61 90 -104 -9 -15 -57 22 41 44 12 -10 -51 -16 48
3284 48 1 -51 26 -23 -12 13 7 -61 -12 -18 -34 -16 14 11 15 30 -1 9 56 -36 -6 42 -26 -58 54 -32 -40 62 -26 -49 71
3315 71 49 -83 -2 7 -51 40 -13 -27 -16 1 11 -11 77 49 -17 0 16 -55 26 49 21 -6 42 -25 79 47 6 -30 54 -15
3345 -15 -4 38 71 -11 37 2 -70 6 -3 -38 11 -6 25 29 33 -27 40 22 -50 -11 23 19 -25 47 40 -68 9 6 -24 16 24 -22 22
3378 22 18 -64 18 13 -32 33 14 -37 -42 14 7 37 84 -13 17 36 -10 -21 34 82 -10 18 41 -5 30 57 37 5 -28 -29 41 71 17
3411 17 12 48 -4 -23 -19 2 16 -1 17 -48 -1 55 6 12 31 -41 -2 17 -24 34 63 -5 24 -23 -54 3 26 -11 34 48 67 -71
$$ packed form
3197b2k2P3j6l3N5m5J3QJ02j29N6lj22J04L4r9P9Ql0n2R1n9k2N5Qn8M0l4j3N5
3227B2o1o7J42J6j30Q6K9n4K9K4l8j6K6n3P3L7j12J1J29j07o7J48n3m0P5j00k3
3254g4N9L3k5J5k1n3KJ18k9o5J06k3o0M2L4o3O5K9j94R5om2P9J9Ll2k2m1L5O4
3284D8m7n2P7m9J1K5oo8M9oj6J8L0lMJ5l1J0M7r2L0M8o8l2J12q6qJ02q8k3J20
3315G1k2j32Q1Rn8R1n3j4J1J7J0k2Q8k8o6J7J6p1Q1K3k8k7M8o7J04l2m1l6Q4o9
3345a5J1M2L3q2M8l5p2P6rl5M9j7L1MMo0O7j8p2L9L4mm4P2pj08P7ll0M0Qm6M4
3378B2mq2Q2nm5O5j9n1nN6pL0M7r7L0J9m6j1N5M8r2K8K3m6L5K7k0l2l3jP0L0n4
3411A7nL6n2j9MK1J4j7J8o5M7N6m9OJ9p2L9J9m1N8K9o8K9m7l1N7K3l7M5J4J9j38
$$ plain form
3443 -71 -36 33 21 34 -7 -5 -71 -20 -26 -12 44 5 -42 -38 6 11 23 29 -35 34 54 1 -8 -24 -31 -46 -13 -15 12 -9 11 -20 -39 44
3477 44 2 -40 60 25 14 3 1 20 23 26 3 -15 -43 3 42 3 21 1 -3 27 40 18 15 62 61 57 54 55 -6 -11 -21 -20 -20 8 -30 -81
3513 -81 -1 -14 34 -20 20 -44 36 -12 17 49 -31 -38 -33 37 -14 2 -35 4 8 20 49 -52 -35 22 52 -44 33 -47 -14 37 -30
3544 -30 -52 -36 -50 -11 1 -27 -4 -1 51 -61 -57 15 41 -1 -40 -11 33 -51 -23 -24 -12 35 -47 4 -4 -36 -4 0 54 -7 15 2
3576 2 -9 -5 -56 53 -31 -10 20 30 17 -14 28 -28 19 61 28 -39 94 27 -12 50 -21 -42 13 31 -4 23 30 14 -55 51
3606 51 25 -12 21 40 -5 -42 9 0 0 17 20 -39 -7 33 -6 -28 -42 5 -29 30 8 0 -39 24 19 -3 -25 -20 39 -18 0 -11 -23
3639 -23 28 25 -12 -20 -22 -24 -49 -29 17 -4 12 -33 1 -25 15 11 -28 60 46 -32 52 -9 -18 42 -52 -36 65 -19 -17 0 -2 34 -28 1
3673 1 -34 22 -27 -19 -79 34 31 4 49 37 1 80 -35 -33 -24 -4 10 -15 31 -31 -18 61 21 -16 -15 -58 8 -5 12 -13 69 -41
$$ packed form
3443g1L5O9j2J3m1Ko6N1oJ4N6l9m7MM4NJ2Oo4O9K0n3rj6pj5L3kK7k1K0l1j9Q3
3477D4m2m2J00l5j1j1kJ9LLk3j8k8M6L9l9J8k0mL0J3k2lM7jmlJo1nj0J%K8l8n1
3513h1Q0j3M8n4M0o4Q0m8K9L2q0pNP0n1J6l7L9MJ2K9j01J7N7L0r6P7q0L3N1o7
3544c0k2J6j4L9J2k8K3LN2j12MP2K6m2l9K9M4q4K8jJ2M7q2N1ql2L2MN4o1K2j3
3576Bj1Mn1J09q4K1L0J0j3l1M2n6M7M2l3o7J33o7l9O2p1k1N5J8l5K7Pj6o9J06
3606E1k6l7L3J9m5l7N1r%J7Ln9L2M0l9k2j4M7l4N9k2ql9O3nk2k2NN9n7J8j1j2
3639b3N1ll7qkkk5K0M6k1J6m5L4k6M0ml9Q8j4p8Q4o1rO0r4J6J01q4KJ7kL6o2K9
3673Al5N6m9Qo0J13lk7M5j2l6P9j15KRK0J4k5M6o2J3P9m0l7Jm3O6j3J7k5Q2j10
$$ plain form
3705 -41 -49 18 -16 3 -37 -7 18 -4 23 10 37 -11 37 -10 19 -24 -42 32 -3 16 -14 -54 -88 26 -14 -32 6 -44 -1 53
3735 53 22 -21 26 79 -12 -19 40 6 9 60 48 -38 -10 -33 -1 39 4 20 -20 2 -24 -40 32 -18 28 42 -2 -7 73 19 11 33
3767 33 37 -57 4 6 -5 -5 -5 -41 16 5 24 17 -37 -22 38 7 -38 25 64 0 -33 33 22 41 70 -9 5 -14 -39 -38 21 21 -19 -7
3801 -7 -29 32 -79 37 -34 23 37 2 -28 35 -58 13 55 13 -27 25 41 -12 -31 14 -79 5 26 -39 64 14 23 2 6 -5
3831 -5 -13 26 -9 28 17 -29 -3 -11 10 -20 -25 46 -29 -1 0 13 -35 -11 -16 -19 56 -13 -34 45 -25 14 19 -46 -70 3 -1 -58 88 17
3865 17 -18 -35 21 -34 32 1 -4 7 -22 18 -41 19 -14 -47 -40 23 -21 14 19 -15 -1 -21 -13 -7 61 -54 46 7 -19 -50 20 -32
3897 -32 -22 43 -4 14 -15 -13 -1 -19 25 -60 -24 52 -66 -33 -31 -19 -25 25 28 -9 90 27 -18 -5 24 -16 5 54 25 20 20 -41 12
3930 12 -28 -19 -20 -2 3 -40 20 -4 -34 46 87 32 39 19 7 46 0 -19 7 -5 -56 -29 -17 34 -60 7 -3 -16 -37 -14 -4 -22
$$ packed form
3705d1qO7l4J9m0L0K5k2K7j3K7m8M8m7K9m3j8P4l5J9l0m0l4J14m0j8L8n0M3N4
3735E3l1m3M7N3r1pN9l4LN1j2q6K8k3L2M0l5J6m0K2k6j6P2n0M6J4m4nQ0n4qK2
3767C3Mr4O1Kj1%%l6N7j1J9pn4J5O0l1m5O3L9o4l3O6j1J9K9p9J4j9k5JN9%m0J2
3801gk2O1j11J16p1N7J4l5l0O3r3P1M2m2m0N2J6n3j9M5r3Q4K1o5J03n0Rk1Mj1
3831eqL9l5L7j1m6K6qK1l0nP1p5K8JJ3m8K4nlP5o9k1P9p0L9No5k4P3mn7J46p1
3865A7l5j7N6n5O6l1nJ1k9M0n9O0l3l3PO3m4L5Nl4J4k0QOO8j15J00l9k6l1P0n2
3897c2J0O5m7J8k9KJ2j8M4q5L6P6j18L3KJ2oN0Ll7R9o3m5J3K9m0K1M9k9n%o1N3
3930A2m0RjJ8Nm3O0k4l0Q0M1n5Pk0j2L9m6j9K6j2n1K7J2N1r4O7j0j3k1K3J0j8
$$ plain form
3962 -22 -25 34 67 -6 12 -49 9 -10 33 -11 -30 -1 27 6 8 -26 16 7 -7 10 -2 45 11 -54 40 -54 25 -2 6 -9 -1 -28 5
3995 5 28 45 -15 4 20 -17 -49 49 -1 -10 18 1 -17 7 16 -56 23 6 -27 -14 25 26 56 -34 26 -3 20 -41 70 -44 33
4026 33 -23 -10 -12 14 2 -34 13 -24 8 -60 18 -4 -31 -35 -11 6 3 57 5 -37 15 -2 -13 -8 -25 -2 5 75 -15 32 23 -34 19
4059 19 33 29 23 -28 -48 -41 13 68 3 3 48 17 13 27 15 -32 -13 -3 -15 82 -13 -13 -24 -67 -54 13 -16 -6 36 0 -28 -39 16
4092 16 3 10 -35 86 56 11 66 19 -11 2 -66 18 -22 -30 -22 7 -12 10 -61 -23 36 -21 18 13 7 -3 42 24 -21 -25 13 26 -37
4125 -37 -13 -34 12 -47 -18 -43 -5 -3 -38 -3 39 45 -1 -5 9 -58 -2 16 17 21 -18 -36 24 5 37 42 -21 -31 30 17 -16 -37 -7
4158 -7 -13 -52 6 13 14 -77 7 -9 59 7 66 10 34 34 -23 10 22 37 22 49 78 22 -41 17 2 -32 29 25 3 -21 -30 -31 14 21 17
4193 17 -15 -15 41 -11 -27 8 46 -8 11 24 -20 47 -13 9 -97 25 -63 -19 2 -36 -21 35 33 5 -8 35 -2 -36 -33 -13 69
$$ packed form
3962b2lN9L3p3J8o1N8j9M3m4j9K9K8k1Kl4M2rj4J7j2M7l4o5R4r4P9k7Qj5Qk7L3
3995EK3J7o0J9J6l7l2R8n0rK8j7j8K4Rp2P9j7l3J3L9JL0r0O0k9K3o1J11j14P7
4026C3n6J3kK6j2l6M7l7L2o8P8k2k7mK4J7lN4n2m2N2j7j1Nj7K3PP0r0M7rn7N3
4059A9J4mon1k0PN4N5o5%M5l1mJ4j2m7J9J0j2R7r5%j1m3J3O7k9J0M2l6k8j1N5
4092A6j3Pm5J21l0m5N5m7l0J3o8Q4m0qQK9j9K2p1L8N9n7L9noj0M5j8m5mL8J3o3
4125c7K4k1M6n9K9k5L8Kl5L5M2Om6mJ4o7N6J8JMl9j8O0j9L2No3j0O1j3l3k1L0
4158gol9N8PJr1Q4j6O8n2N9n6K4%n7L3J2J5j5K7K9n6o3N8j5l4O1mk2k4rjM5Pm
4193A7l2%N6n2j6L5L8n4J9J3m4O7o0K2j06J22q8M4K1l8J5N6kk8j3M3l7l4LK0Q2
$$ plain form
4224 69 12 102 26 2 38 6 -51 -1 10 -24 -16 -65 -72 -16 -3 -39 10 -16 -30 29 26 25 21 -23 -5 5 34 -26 -15 23 -30 -42 -26
4257 -26 -22 43 -3 -53 -6 14 -15 -33 -2 -9 27 19 57 -7 -15 46 -70 -19 45 -19 63 85 -2 -18 9 -50 -46 50 -53 -59 -18 -59
4289 -59 -49 19 -20 -3 35 16 -3 25 48 7 3 27 35 19 68 -4 7 -13 22 25 -28 30 1 -34 -23 -34 -58 -18 -79 -17 5 -24
4321 -24 -13 13 -16 -24 44 15 21 -42 29 1 27 -30 17 26 -21 -33 -26 50 11 -3 2 -56 17 -26 28 -17 -30 -1 15 43 -44 47 0
4354 0 16 -7 -9 -11 14 -5 29 -28 -60 -4 24 -14 -9 -41 -39 33 -29 -8 -21 -3 -7 4 32 -25 61 15 26 41 43 -32 10 -21 33 15
4388 15 -44 -5 12 22 34 -40 30 31 -6 -23 -11 -20 -18 69 -3 10 2 6 -24 7 6 67 -33 -49 -12 -15 -36 -31 -38 -51 -37 -60 18 6
4422 6 13 -2 -26 8 12 -6 34 -2 -5 -12 58 52 64 -16 27 7 -9 25 -25 44 17 -56 -14 21 -29 59 -26 -67 13 -25 -24 28 -22 -37
4456 -37 -18 -33 -28 4 25 -26 -44 -5 22 -15 -30 -21 -9 -59 -15 10 -17 37 -29 -53 39 63 15 30 30 35 -23 28 -39 28 21 6 8
$$ packed form
4224F9n7R0p6k4L6l2n7N0J1l4Qm9pN6J3l6M9k6j4N9ljmm4J8J0K9o0J1L8n3j2J6
4257b6MO5m6n0M7K0k9j8L1pL6qL8o4qO1j16N1O4o4Q2K2q7j6K7n9MR6j03oM1m1
4289e9J0O8l9J7L8j9j9K8K3m1mK4Qj6M9p2J1k0L5Ln3N8k9l5J1j1k4M0o1O2K2k9
4321b4J1K6k9qO8k9Oo3P1k8K6n7M7Rm7j2PP6l9j4Nn8P3m3N4m5j3K9J6K8q7R1m7
4354@J6k3kkK5j9L4n7l2N6K8l8Nl2KP2o2K1j3J8mJ1K8n7Q6m6J1J5Kp5M2l1N4j8
4388A5n9L9J7J0J2p4P0Jl7j7J2rKQ7p2J3qMl0L1jO1j00j6L7lk1Npj3J4k3P8j2
4422FPj5k4L4Mj8M0l6lpP0oJ2q0M3k0j6L4n0O9k7p3M2L5n0Q8q5m1Q0l8JN2n0j5
4456c7J9j5NL2K1n1j8L9K7l7j5RJ2n0M4K5k7N4o6k4R2K4m8J5%Nn8N1o7O7pj5K
$$ plain form
4489 8 5 41 -13 -76 -56 -32 19 -12 -8 -80 -53 -5 14 5 -40 42 -49 -25 -13 15 2 26 46 -3 12 -21 63 -38 1 -9 -62 18
4521 18 19 -16 3 -25 -5 85 1 -5 46 17 81 42 3 -4 -10 -9 44 -46 -5 -51 -9 -20 -53 17 20 4 6 -29 -37 -18 28 -7 -55 -45
4555 -45 7 22 31 30 -11 14 42 -1 -3 75 -2 -42 17 -21 -8 -21 -2 -18 -27 -30 -67 -23 -26 -44 -1 -34 17 35 13 -6 -2 13 44 41
4589 41 7 -25 35 -7 -49 17 28 -33 -2 -44 -10 -4 -14 -7 -5 -10 -25 -21 -5 58 -54 24 38 -6 41 1 37 24 1 14 17 8 4 -60
4623 -60 2 30 -17 -35 21 56 -31 4 -15 42 50 10 69 -9 84 37 25 -53 11 40 16 41 2 -61 -12 -20 -44 13 51 20 -17
4654 -17 -4 10 29 86 38 11 -10 12 21 10 41 -3 -24 -9 -2 8 -33 13 -58 -18 -18 4 -48 -14 0 -13 4 -15 18 -17 -11 -12 13
4687 13 39 44 25 12 -9 -38 9 29 14 28 -37 -14 -8 -41 -13 -1 44 53 -62 -45 -1 -40 -5 -16 -3 6 1 55 -19 -24 44 -17 -20
4720 -20 86 -21 -69 -38 50 -40 -15 28 -10 -27 -15 -2 -3 22 16 -35 64 -34 54 41 23 1 14 30 -20 36 22 -46 18 -55
$$ packed form
4489HlL6n4o3K0K4N1l1Mp2K7M8J9rm5Q2r1K4J2K8j3K4K0m9J5l3Q4j01L9j0n3Q0
4521A8Jl5J9k8K0R0q4oN1k9O4l9l9poJN3r0M1m6M2j1l3P0Lj6Kl5qJ9M6l5m8J0
4555d5N2J5Rjm1K5K8m3kP8p7m0N9l8J3j3J9j6rll7M4lj8M3l3N1J8k2j9MJ5L1l
4589D1l4l2O0m2m2O6J1o1L1m2L4Oj0PKnj5MJ6O3j12P8J4m4M7m0L6j3k3J3Lrmo4
4623f0O2K8m7j8N6L5q7L5j9N7Qm0N9p8R3m7j2p8O4K9k4K5l9o3M9qk4N7L8l1l7
4654a7J3J4J9N7m8k7k1K2Rj1L1m4k1J5PJ0m1M6p1M0%K2n2L4J4j3J7j9L3l5OjK5
4687A3K6Nj9j3k1k9M7K0j5J4o5K3Ol3K8J2M5Rj15J7M4l9L5j1J3RnN4p4nO8o1l
4720b0J06j07m8L1Q8r0K5M3l8j7J2J3jK5on1R9r8Q8j3j8k2J3J6n0N6j4o8O4p3
$$ plain form
4750 -55 -25 46 -7 -19 -16 -26 -28 -33 9 -18 -19 -31 -12 36 15 -38 -50 -63 15 17 6 37 -102 -35 16 -19 9 12 -72 -31 24 -23 -5
4783 -5 8 46 41 -3 30 35 10 29 -44 -45 64 43 95 37 -36 -10 -53 20 -32 4 -40 -8 -45 -69 5 15 -1 25 21 -22 30 29 -37
4816 -37 -20 4 -3 21 50 -4 -17 17 -19 10 -10 -37 -20 32 5 -5 10 5 -10 28 1 -3 -30 58 -39 -38 22 -8 -28 -26 -2 -26 14
4849 14 21 -55 22 -20 33 7 -26 -11 -37 -14 -22 -5 11 38 -13 0 -24 6 4 -12 76 -14 -17 0 24 36 39 8 75 14 -34 -34 -23
4882 -23 15 -40 -14 -3 -30 -64 -36 19 24 -44 40 24 35 12 20 4 -76 -44 26 7 10 3 10 33 -16 4 9 47 -46 -59 4 -34 -21
4915 -21 16 -27 -21 -2 -12 23 7 -16 21 2 20 4 37 -65 -9 -4 20 -3 -42 -31 -27 -54 19 -10 -31 6 6 59 -9 -25 -18 28
4947 28 15 23 15 37 -86 -14 -8 8 33 15 -14 -25 22 -14 -11 -15 19 -27 44 37 -49 18 32 28 -32 3 20 23 -33 19 -13 22 -52 -18
4981 -18 30 55 -13 13 28 -20 -31 4 -72 -13 -27 -27 31 -5 4 21 15 -4 66 -2 -57 -49 9 -16 8 24 -41 -45 -52 -6 -40 21 -24
$$ packed form
4750e5L0P1n3j2Lj0knM2k7jj2J9M8k1n3j2j3P8Kj1L1j39O7N1l5K8Lq4M1N5m7J8
4783eJ3L8nm4L3Nk5J9p3jJ09k1N2n8p3K6m3P3n2L6m4L2l7k4P4J0j6K6mm3N2jo6
4816c7J7K4pK4K9n4j3L4l6K9k0k7J7N2k7j0J5nj5L8k7mk7Q8r7JO0l0k0KK4k4M0
4849A4Pp6P7m2N3k6l3J5k6K3qJ7J6K7n1J3k4L0kj6Q8r0lJ7K4J2Ll1O7o1m8%J1
4882b3L8n5K6J1k7l4K8N5No8Q4j6J1k3Qj6q0L2P0j9LpPK3m9K0NL8r3j3O3l8J3
4915b1L7m3OJ9j0L5j6k3L7j9J8j6L3j02N6NK4k3l9J1Mk7P3k9k1L7%N3o8j6PM6
4947B8j3QqK2j23P2OJ6K5j8k9j1M7l6LmL4m6P1pq6O7J4mo0L5J7Ln6N2l2L5p4L4
4981a8M8K5o8K6J5m8j1L5p6N9j4%N8l6RJ7oj9P0o8n5QN8k5K4J6o5mpM6l4O1m5
$$ plain form
5014 -24 -66 -32 -56 12 24 10 49 23 28 32 0 22 -36 -52 59 6 -53 26 47 -17 7 -7 -59 -15 -6 -25 2 -16 57 -8 31
5045 31 7 30 42 -14 11 1 4 -24 -2 -9 -45 -8 7 -53 -64 40 -9 -20 16 -2 -52 3 22 82 -12 25 -34 -20 36 20 54
5076 54 -38 -3 -12 0 49 50 8 -15 -19 15 22 38 7 34 -34 -35 -19 -32 38 -8 -12 -24 11 -7 39 -9 9 -4 -6 23 3 32 -19 -23
5110 -23 -5 -44 -13 27 -43 6 -48 30 -12 4 -25 -21 -71 12 22 15 -28 -26 -7 2 72 44 -4 7 -48 1 33 -10 8 10 -51 -63 -16
5143 -16 -34 -5 11 36 2 -27 -3 25 -19 49 2 -12 -5 -1 -22 -4 19 -11 -15 -22 14 66 -14 0 30 -6 53 50 -1 -4 34 -43 -1
5176 -1 44 -17 12 -4 8 -23 -4 27 -13 -51 -10 28 38 -28 -43 -37 -29 27 -29 18 57 2 0 -35 41 -27 -41 11 -1 47 -7 7
5208 7 -19 28 -24 32 -33 -11 29 -11 -14 -26 -34 1 -26 20 -12 -12 -46 22 7 -5 8 -24 -22 6 -37 7 -4 3 -15 -39 -18 7 11 15
5242 15 23 -17 23 -9 6 29 21 -8 -35 34 8 -43 23 -7 53 -24 -10 48 -7 -17 -20 16 -13 -14 31 9 -4 5 -14 -19 -11 -49 -50 -74
$$ packed form
5014b4m2L4k4O8J2j4L9k6NMl2K2n8j6J11n3n9P9K1o4K4j4n2M4Rj9K7j8P3o5L9
5045C1k4K3J2n6K5j0Lk8K2pl6L7J5o0j1J04m9j1L6j8n0N5J9O0r4L7n9J4N6j6L4
5076E4r2L5rJ2M9Jm2k3mL4PJ6l1K7o8jJ6j3P0m6mj2L5j8M6m8J8j3kK9k0K9n1m
5110b3J8l9L1M0p0M9n4P8m2J6k9Mn0Q3J0pm3KJ9RP0k8m8J1n5M9L2m3J8Ko1j2M7
5143a6j8K9J6K5l4k9K4K8m4O8m7j4PMk1J8K3l0mpL6N2q0J4L0l6N9ln1lL8p7M2
5176aM5o1K9j6J2l1J9L1m0l8M1L8J0o6j5OQN6n6M7L9n5kl5P6o8j4N2j2M8n4J4
5208Gk6M7n2N6o5K2M0m0lj2qL5k7M6l2%l4O8j5j2J3l2KK8m3M4j1Pj8k4K1K5MM
5242A5Qm0M0l2J5K3qk9k7O9k6n1O6l0O0p7J4N8n5j0lL6k9jM5k2j3Rj9nQl8jk4
$$ plain form
5276 -74 -18 -7 -1 -30 -12 0 13 -15 21 -52 0 7 -27 23 38 22 -1 6 -10 -5 15 8 -49 27 -6 -10 -24 -51 -10 -18 -1 -8 -3 55 16
5311 16 63 -40 16 24 -10 -2 -5 23 22 -18 23 -51 22 -36 12 -8 -12 -2 -12 2 -6 -11 12 5 -2 32 6 29 45 14 -38 2 51 -22
5345 -22 -27 50 32 51 -42 -13 -25 -66 35 52 -39 -30 28 -14 -9 -29 -30 -33 9 -61 -28 -18 5 19 -28 -28 -24 -8 -2 29 16 32 10 11
5379 11 19 42 35 70 -4 -10 14 67 27 10 -6 -29 7 -37 35 -9 44 -70 24 -39 -31 -29 -16 -12 -21 21 35 8 -30 -1 -8 19 6 -2
5413 -2 -91 21 8 23 35 -51 -25 7 50 5 24 10 6 3 41 33 12 26 -4 0 -27 -5 27 10 -42 -23 -27 3 11 29 19 48 -75
5446 -75 -15 -5 21 1 19 -41 -36 -13 19 18 -11 30 28 -2 13 -8 37 -5 -35 8 4 -12 -3 14 -25 24 -14 -6 0 -11 18 -98 -16
5479 -16 -24 2 20 6 -7 -8 2 -6 3 3 23 -12 -39 86 34 6 -24 18 13 -8 -24 7 -29 15 12 -48 44 -18 35 -31 -8 -2 42 -7
5513 -7 33 26 8 -42 -21 27 -6 16 9 12 16 -14 -3 -25 -4 -35 -13 0 22 -11 26 7 6 4 -3 -17 30 -5 44 -17 32 32 24 -3 -18
$$ packed form
5276g4N6J1Ok9J8J2J3k8L6p3N2Pl4N0J5j6k3Pj6NK0pn7P6l3mj4k7M1qJ7pNN8l9
5311A6M7j03N6Ql4QlK8jm0M1p4P3n8M8k0mJ0j0J4qnK3ppL4k6K3J6l1n2M0M9p3
5345b2nP7j8J9r3K9j2m1J01J7r1RN8m2Nk0jlM2p0L3J0K3J4m7%MJ6OL1j3J6k2J
5379A1QK3pL5p4oK4N3m0j7j6k3L6m4P2m4N3j14R4o3QKJ3MrM2J4k7l8K9pK7j3q
5413bq9J12j3J5J2q6K6L2M3m5J9j4mlL8qk1J4l0Mk7K2L2j7n2J9mL0QJ8j0K9j23
5446g5O0J0K6k0J8o0NK3L2jk9M1kl0J5k1M5m2l0M3mj6RJ7l9M9l8QOj1K9j16Q2
5479a6qK6J8j4j3jJ0qR%K0l5k7J25n2k8l0M2nk1j6L1l6M4lo0R2o2N3o6K3OM4m9
5513gM0pj8n0K1M8l3K2pLMl0J1k2K1l1K2J3K2l3L7j9jkpj4M7l5M9o1M9%qk7j5
$$ plain form
5548 -18 -48 -12 -53 24 23 16 -21 47 46 -18 3 -15 14 5 -20 0 29 -12 -28 13 66 14 -11 -61 -48 -4 -74 -32 -8 -16 -38 -24 -5
5581 -5 9 33 30 20 -35 37 50 68 -32 52 31 0 -24 8 26 9 41 -18 5 24 0 -37 -36 38 22 -32 -2 4 -41 -35 28 -1
5613 -1 3 -9 2 -36 9 -21 10 17 51 -2 7 67 -22 11 15 15 0 27 12 -36 -5 1 8 -12 -38 0 49 5 24 -36 -8 0 29 6 54
5648 54 72 -45 -1 -35 48 -19 9 -50 -10 -37 7 55 -61 1 -47 -26 -35 35 62 24 -22 16 -7 -55 54 -11 36 1 23
5677 23 -10 -3 5 28 38 -30 39 11 -10 -25 23 24 47 9 -71 0 9 8 -12 38 67 14 -46 -36 -25 12 7 34 -30 11 -26 -50 22
5710 22 -33 -14 1 -11 -22 34 61 53 -5 46 -31 35 8 -9 8 58 36 11 34 28 -24 40 15 -25 -10 14 26 -47 -65 -23 2
5741 2 -35 -62 -57 0 -7 28 -7 50 -10 32 2 -41 -15 -13 -6 -2 15 -12 44 -27 -5 -57 16 23 -57 16 1 -28 19 28 -8 19 -19 52
5775 52 49 27 29 -29 -36 -55 26 30 10 -27 -20 -29 35 -13 -77 -9 13 -18 -19 -5 5 -34 12 -30 -58 -35 -50 21 -4 17 -15 -8 18 34
$$ packed form
5548a8l0L6m1P7jpl7O8jo4K1j8K9rk5K0K9m1j6M1N3n2k5n0J3M4p0M2K4qk2J4J9
5581eJ4K4lj0n5P2J3J8j00Q4k1l1k4L2J8j7L2n9K3J9k4l7JP4j6n4L0Om5OO3k9
5613aMj2J1l8M5l0L1PL4n3RO0q9L3M%j5K7j5m8L1OPk0k6L8M9m4J9o0K8QK9k3M8
5648E4J8j17M4l4Q3o7K8n9M0k7M4M8j16O2m8K1rP0K7l8m6L8k3m8J09o5M7l5K2
5677B3l3PQK3J0o8O9k8k1j5M8JK3l8q0P1Rjk0N0K9n3o0J0J1L7nK7o4M1l7k4P2
5710B2n5J9J5j2j1N6K7qn8N1p7O6k7j7J7N0k2k5K3on2O4k5m0J5K4J2p3j8M2K5
5741Bl7k7NN7pL5l5N7o0M2l0m3K6KPMJ7k7N6p1K2n2P3Pq0P3j5k9M7Rl6K7l8P1
5775E2lk2Kn8pj9Q1Mk0l7PrO4m8o4O8K2l1jJ4J0l9M6m2k8K3j5P1k5K1l2PK6J6
$$ plain form
5809 34 25 -26 -29 51 -66 -24 -19 24 13 3 -48 -25 6 39 -64 43 -2 -18 -35 8 -26 15 0 -13 37 18 -34 35 -26 -47
5839 -47 -20 1 -22 -14 9 -38 26 -24 4 26 11 -4 13 22 0 24 -30 -11 48 15 -17 44 15 56 -6 -29 4 -28 -36 -40 5 -31
5871 -31 -22 35 -29 3 -40 -4 -8 -12 41 26 -6 -2 39 25 30 27 -26 -29 32 -10 14 -25 -3 24 31 11 34 19 37 -4 -49 -34 2 -10
5905 -10 35 3 18 -24 4 -16 -10 23 -57 22 -17 -9 22 -40 -2 -15 -32 -59 -28 31 2 -8 -17 44 24 -39 15 12 19 16 -7 24 58
5938 58 4 11 14 72 -61 60 -22 20 25 -15 24 6 -16 -51 -6 -36 -6 -36 16 -51 -3 36 -43 -10 -2 41 1 -7 3 -21 -80 -25
5970 -25 -32 7 43 42 -11 33 -22 23 0 40 20 10 16 -68 -24 22 21 71 -14 -8 37 -40 -61 4 17 -1 4 -10 -19 -4 29 -4 -29 -18
6004 -18 10 -19 2 26 20 40 10 -21 -30 17 19 5 45 0 7 7 13 -5 -26 28 -6 30 -48 -3 -4 28 -9 -23 42 49 25 50 33 50
6038 50 32 -15 -10 9 23 -15 45 23 -42 -10 -35 49 -1 -29 24 -60 2 -14 14 17 14 -56 21 -38 -6 -43 26 47 0 31 -25 -35
$$ packed form
5809C4rn1lQ0j17M2NM3j1j0n1K3L1L3j03J07m5j6j7M3l4M1j5j3N0j9n2O9o1k1
5839d7K7K1k3QK3m7O4n0K8K2j5j5J7Rk2K4n4J9N9l3l2O1k9M1o2k3L3l2qmM5l6
5871c1RN7o4L2m3L6mmN3j5l2MM1j4Nln3lO1m2K4l9K2K7Pk0K3j5J8m1m5J5L6j2
5905a0M5l2J5m2K8k0OL3q0P9l9QL1o2L8j3j7k7L1N9k9j0rO1k0o3N4lPlk3L1L4
5938E8n4PLN8j33J21q2M2Nm0L9j8k2l5M5l0L0l0N2o7M8L9p9L3QM3m0qJ0k4n9N5
5970b5pL9L6jn3M4n5M5k3M0k0j0Oq4M4M6jN0q5OM5p7k1O5J3j8Nj4rJ5L3l3k5J1
6004a8K8k9K1K4oK0l0l1rM7Kj4M0m5P%Oj8k1N4l4L6p8M5jL2l7j4O5Pk4K5j7J7
6038E0j8m7NJ9J4l8O0k2o5L2k5Q4n0k8N3q4O2j6K8Llp0P7n9L2l7O9K1m7L1n6j0
$$ plain form
6070 -35 24 92 66 -40 10 13 -12 -40 4 -13 -10 -19 42 9 -52 18 32 41 28 -8 -17 -6 17 -8 1 28 -28 -46 10 18 6 23 -44
6103 -44 -25 -13 -68 -1 -4 5 -23 22 28 35 36 -46 -7 -27 44 -23 -2 14 -18 -28 -40 12 -22 -1 -9 -44 28 -49 5 -16 15 -7 1 -27
6137 -27 33 17 7 8 -11 -57 -34 -4 -36 -33 0 -24 24 -38 1 11 21 6 -47 -22 -15 59 -36 0 -9 24 -33 26 6 -49 -13 41
6169 41 -27 -42 -44 51 -20 -22 13 -9 46 -34 -27 24 -9 36 -31 4 4 -10 26 -31 41 -18 -17 39 25 -32 12 54 9 -4 -19 -51 -58
6202 -58 23 6 -8 25 -58 1 12 11 -11 34 14 35 11 21 -44 -18 -38 -25 -47 5 -8 61 -27 10 11 27 -11 -7 3 -18 61 -3
6234 -3 3 -2 28 5 17 9 0 -1 1 8 -17 -10 26 17 -27 8 -25 -1 -4 19 -46 -6 21 -70 -28 26 -3 -11 -27 -6 44 6 21 11 14 -72 -72
6271 -72 -46 -17 -72 51 -13 33 -29 -68 38 -33 7 -17 8 -8 -35 54 -10 17 31 5 25 -12 -57 53 -52 24 -50 4
6299 4 -15 45 3 -50 10 -49 -4 -34 15 -17 -37 33 -38 -39 -18 9 27 -24 4 -23 -35 -39 -22 38 51 45 -24 -23 -22 -8 -7 7 36 14
$$ packed form
6070c5N9O8k6j06N0Lk5k8M4j7LrO1l3o1P0J4Rj3l6rJ1K3k5RK7n6j8N6Qj2J7o7
6103d4J9J2n5O7lRk8M5OPJq2L9k0P1o7K1J6l2j0j2N2l4K1ql5P2p7N4k1L1k2Qk8
6137b7O0j6j0Jj9m6K3L0l2LL3k4M8o2L9J0J0j5n3K5PP4r5L6rL3n7N9k0n5L6N4
6169D1o8j5kR5p1kL5k2N5q0PN1l3M5o7L5%j4L6n7P2n9JN6j4n7M4M2m5j3j5l2p
6202e8Q1j7j4L3q3N9J1jk2M5k0K1k4J0o5K6k0J3k2N2j3O9q8L7JJ6l8MJ0k1P9o4
6234cOnL0k3J2qrjKPk5PL6rm4L5l3K4lK3o5M0K7r1M2N4k9qj6K1N0l8J5j0Lq6%
6271g2K6K9n5J23o4M6o2l9J06p1M0k4K5j6k7Q9o4K7J4k6K0l7m5J10j05P6p4N4
6299Dj9O0m2n3O0n9M5l0M9l2k0P0p1jK1K7J8n1K8k7j2mJ7O0J3oo9JJJ4JJ4K9k2
$$ plain form
6333 14 22 -29 -18 -7 18 -3 69 73 10 9 4 8 -9 -29 45 34 -1 17 -41 13 8 -64 -8 22 -48 -5 -37 -3 -59 24 17 37 4 -16
6367 -16 10 -1 69 16 60 5 -14 -5 -5 36 -6 6 69 -57 -47 45 -14 -6 -36 -32 -59 16 14 -44 -16 6 22 -10 13 2 -11 9
6399 9 -59 8 17 6 15 -12 -29 -36 6 24 34 9 -23 -37 18 -1 62 -21 -19 36 44 -76 -50 -28 11 -28 5 -1 -19 -54 -10 9 -6
6432 -6 -4 -101 -86 -6 -24 -46 -52 -31 21 19 -14 -7 32 -7 -11 24 -45 -15 -56 -4 1 64 -19 19 -14 -2 -42 -63 11 20 -25 6 23 -33
6466 -33 19 -34 20 47 39 23 45 27 15 -10 4 -33 7 19 20 -52 -2 3 -2 -28 -21 -9 -42 27 -33 -37 -1 1 -35 -50 29 36 47 38 14
6501 14 -66 23 -27 -23 37 -58 -18 33 87 -10 29 11 -18 -34 55 13 -21 -13 3 -50 -43 15 -104 -58 -54 -64 -46 -46 5 -11 4 43
6533 43 18 37 48 2 16 4 29 40 11 -8 -48 44 -26 -80 49 41 -17 -24 -7 84 -20 -44 -5 -33 -38 4 -13 -5 20 -19 -10 -25
6565 -25 -46 -6 -24 -7 21 -5 23 -7 -3 7 2 -47 2 10 16 37 -2 20 -49 12 -2 -43 2 -46 26 74 25 23 -43 -47 15 -7 -29
$$ packed form
6333A4Qn1J1J1K5k1P2Mo3jnMj7k0P4j1l5J8n8N4np2N6L0p0M3l2L4n6Q3pK0l3k0
6367a6K6j1P0n3M4n5j9R%M1m2J2O3j26J0R2n9Ql0Mk7P5kn8K8K2J6l2K3j1j3K0
6399Io8O7Rj1Rk7j7pM2J8J0k5l2j4N5j9O3q3KN5Qj20K6K2L9l9L3oj8l5M4J9j5
6432fKr7J5Q0j8k2oK1N2kl3PL9l9mL5o9L0m1N2NO3q3L8l3J2m0k1P4Rm5L1J7n6
6466c3N2n3N4K7qj6K2j8j2k5J4l7M0J2Jp2N0Nnk6PJ2l3O9o0mL6Kl6j5P9PJ1rk4
6501A4q0Q9n0MO0r5M0N1N4r7L9j8k9j6Q9m2l4QJ6n3PN8j19M6Mj0J8%N1j6J5L9
6533D3k5J9J1m6J4j2K5J1k9j9m0R2p0n4J29qn8pJ7R1j04k4L9k8nM2j7QK5l9Rj5
6565b5k1M0j8J7K8k6K8l0MJ0nm9M9QOK1l9K2o9O1j4m1M5m8P2M8m9ko6mO2k2k2
$$ plain form
6598 -29 -52 -1 37 60 5 -79 -32 -48 18 29 84 -1 -32 -19 -31 -76 5 25 13 29 -13 -4 -1 -18 -11 41 46 7 -6 56 8 -7
6630 -7 19 -23 37 -11 -32 -19 42 17 -44 32 -22 32 -45 80 18 -9 6 1 -74 -15 -42 -17 16 -60 -57 1 -3 55 -45 -17 -24 0
6662 0 -14 -23 -30 -15 2 -47 15 -32 4 22 -11 10 61 8 -17 -12 16 -19 21 59 5 -26 3 -1 -20 16 -51 15 42 4 -45 -13 22
6695 22 -1 -5 -46 34 -21 45 0 21 -64 12 7 -20 10 2 -44 25 -2 29 55 55 54 -22 -8 -20 17 13 -40 -67 -68 -18 4 -17 -5 -4
6729 -4 58 -11 -35 23 32 -20 -24 -22 -29 -67 8 4 -16 -32 -26 18 -14 -7 -44 72 45 13 -34 4 46 -40 -30 31 22 22 -28 1 -34 19 20
6764 20 20 -7 -15 -41 -1 -19 -36 -9 -41 -36 25 -19 44 50 -74 8 23 6 -54 14 -38 19 -7 45 -24 -7 17 13 -19 -36 -10 -14 -19
6797 -19 -22 27 45 -21 -16 2 42 10 13 1 -29 -21 35 -8 -6 -27 7 -11 -22 8 -26 -18 -34 -5 -8 22 -8 -26 -8 -25 -25 -20 17 17 -25
6832 -25 -27 1 23 -3 3 6 -33 30 18 51 24 53 -2 -3 -8 11 61 19 25 -12 -31 7 -27 -33 18 7 0 -10 28 -6 -43 -14 -10 -45 -42
$$ packed form
6598b9k3N1L8K3n5q4M7j6O6J1N5q5l1J3j2m5Q1K0j2J6m2RLj7PN2Nl9j3O2m8j5
6630gK6m2O0m8k1J3O1k5o1P6n4N4p7J25o2k7J5np5N9k7K5L3p6LN8mN8j00K8pK4
6662@j4rpJ5J7m9O2m7L6J8l3K1N1n3k5NK8l5M0L8n4l1K9mj9L6o7O6K7l8m9L2L5
6695B2k3mm1Q0n5O6m5K1q5P6nk7L0qm6O9k7L1K6%jp6J4j2L7mn3k7jN0K2k1J2J
6729dO2o9k4N8Rn2mKpl8P5mk0j6OM4l2Pl7J16k7l2m7L8M2q6J0O1r%n0K9l5N3J
6764B0%k7qk6M0j8j7K7l2NO1m4O3Oj24Q2J5j7o0O8n2N7k6N2o9J7K4ml2j7K6mn
6797a9lM9J8o6NJ8M0l2Lj2l0QN6m3Kk1L4j8j1L0l4Qj6K9lL0l0j8J8j7%NL7%m2
6832b5kK8K2k6OLl9O3j2L3k7K9n5jnJ9N0m2Ol7j9L8l4oN1j1pj0L8l4l7K9Ml5L
$$ plain form
6867 -42 3 48 20 -52 5 -30 -50 -33 -16 -6 -9 3 -40 -38 18 0 26 44 51 59 9 17 7 -12 -1 -35 27 -25 22 8 -14 2 -30
6900 -30 -22 -1 -4 31 -31 -63 -26 12 -13 -5 -42 -24 -34 -10 7 28 -27 -8 13 -51 -24 15 21 35 -34 4 35 1 -15 -6 -11 23 59
6933 59 5 4 12 6 -38 -21 48 -51 12 -32 25 -8 -31 22 -41 -34 -44 -1 -4 -11 26 10 -24 -48 -49 3 -37 11 -28 19 -41 5 24 -13
6967 -13 37 12 38 14 29 41 9 33 -35 11 3 -20 43 50 35 2 4 37 -11 25 -35 -28 -30 -16 -6 -16 -53 16 -34 -20 -5 -15 -24
7000 -24 -31 2 24 -10 -44 -12 15 1 0 36 18 -8 9 44 -7 -17 1 -15 26 -35 2 -13 -21 19 -8 -18 27 -45 -11 5 2 -26
7032 -26 45 -7 -57 -13 -72 -33 -48 7 -32 -1 -32 -20 7 -25 34 -16 9 -22 -28 18 17 -58 11 21 45 -37 34 -13 11 27 39
7063 39 31 -26 37 32 -49 -25 -36 -9 -20 -8 2 1 -28 11 -42 32 22 -9 41 -21 48 26 -10 8 39 36 -46 1 -23 -38 15 40
7095 40 -14 -41 -10 -10 16 -13 -10 2 0 -17 -37 14 55 26 28 -24 21 12 -17 -12 -8 36 32 -30 27 27 -16 -66 -22 -18 -31 25 -57 -39 25
$$ packed form
6867d2M5M5k8p2N7l5k0J7J7J0lJ2m3KN6j8K6J8PQn0Qj0j9J1l4O2n2M7j4k2J6l2
6900c0QK1lL5o2l2L7L8k5Ql7J8j0K4J7K1n5J9K1o4K7L9OJ4o9L8L1l4j6RnL4L6
6933E9n4jQom4J7O9r9O3m4N7l3k3N3o3Pj0M3lpL7j6l4k4jN2m0M8l9M7o0M6J9l7
6967a3N0k5K6k4J5J2l2K4o8M6qk3O3Pj5l3KL3m8L6o0PkJ4J0j0l7O9n0J4J5j0r
7000b4pL3K2l4l4L2K7j4jL6j8k6J7L5n1j0J8j6M1o1L7j5qM0k7j0M5p2L4J6lk8
7032b6P1n2n0M4n9L9j5N5l9L1l1J2K7l2N9n0K5l1oM6jp5O9J0K4q2P1m7K4J6J2
7063C9qn7O3nq1K4j1K7j1J2J0jk9L9n3P4j0l1N0o2O9k2l6J8L1lq2M7k4j5N3K5
7095D0n4k7L1%K6k9LJ2kj7k0N1M1k9Kn2M5rk9NMM4mo2N7%m3n0M4Mj3N6q2J8O4
$$ plain form
7130 25 43 -37 -10 -26 19 4 13 -31 -27 5 -20 -25 25 19 45 10 12 4 70 1 52 20 -11 11 4 -12 -37 -51 15 15 -41 -54 -20 11
7164 11 -29 -1 -39 -33 27 4 -1 11 -40 -66 -38 -14 -21 -16 -10 -31 -33 65 -35 24 -33 -39 -3 35 70 10 34 44 44 24 -36 68 5
7197 5 -33 -31 -45 -10 -22 15 -14 15 29 -19 28 -21 -20 -55 -52 -25 50 14 -41 -12 24 13 -8 -19 -41 1 0 55 16 6 50 9 22
7230 22 88 -3 -12 37 10 -28 21 19 48 7 44 72 -4 -36 -14 -6 -14 12 -15 40 -7 54 -45 -15 -25 -37 -37 -6 -54 4 -11 37 -2
7263 -2 8 22 34 3 12 4 6 -2 49 30 -18 19 -37 -20 -31 4 61 6 42 -48 26 29 13 14 -58 -25 -5 -47 14 -50 19 -6 -13 -35
7297 -35 -33 -39 -1 -6 6 62 -5 -34 41 54 12 -2 -37 11 -21 6 17 -75 47 38 9 -40 5 14 6 -59 16 56 -23 56 2 22 -32
7330 -32 15 29 -21 -52 -12 -14 -22 13 31 18 -1 -25 83 8 2 -17 -34 36 18 -1 -17 36 -10 -15 -14 30 67 -6 16 86 7 -4
7362 -4 9 -17 53 -18 -4 14 13 -14 -15 -14 7 -39 -9 -15 23 9 -43 1 -16 -41 29 -2 30 -7 -28 -39 -17 16 -53 17 -20 10 21
$$ packed form
7130B5J8q0K7j6M5j5Rm4ML2k5nN0oK6l5KqO6o9N1l2l1K2pj6k5j4O6%n6j3L4L1
7164A1m0K8l8OO0k3nJ2n1k6K8K4pNOk1kR8j00N9n7oL6L8L5o0K4J0%k0o0J04o3
7197El8Kj4L5j2L7k9K9J4m8M7m9Jl5LK7P5l6n5K9L6j1k1j1k2M2jN5l9j0M4m1J3
7230B2O6r1rM9k7l8M9kK9m1L7K8p6l2K2QqK6k7N5m7O1r9L0j0j2%L1m8N8j5M8l9
7263bJ0J4J2l1RqKqN1j9m8L7n6J7j1L5N7n5L6r0P4Lj6Jp2L3K0m2O1o4O9k5pk2
7297c5KoL8nJ2N6o7k9P5J3m2j4l5M8l2K7J1r2J22rk9m9M5Rqo5P5M0p9P9n4K0n4
7330c2M7J4n0l1M0kqL5J8j3j9k4J08p5oj9j7P0j8j9j6N3m6nJM4L7p3K2P0p9j1
7362dJ3k6P0p1J4J8jk7jJK1m6L0oL8j4n2M4j7k5P0l1L2l7k1j1K2L3o9P0l7L0J1
$$ plain form
7395 21 -7 42 35 12 -2 -36 36 8 25 13 62 1 10 -38 -38 -19 24 -5 -11 -1 -27 1 6 -18 29 17 -19 -4 -8 16 -26 -25 -47 -28
7429 -28 -13 -2 -39 4 44 4 29 20 -3 6 34 -17 -25 2 -21 10 -22 -12 -34 -43 24 60 -36 25 50 -21 1 19 8 11 16 13 -55 -3
7463 -3 -48 -10 0 12 -19 -40 -57 17 30 -25 -37 -36 -29 -16 6 32 47 52 42 -2 -77 13 16 27 11 12 -7 16 87 -3 20 -18 3
7496 3 -2 -78 -15 -5 -2 49 -2 -12 6 26 -8 6 -29 -12 0 -21 8 -37 12 7 -19 -20 12 17 12 -26 1 -14 15 35 33 36 -15 25 -23
7531 -23 -20 5 -26 -23 38 -45 44 39 -18 11 -23 14 -36 -50 -43 5 -37 10 31 -17 0 -19 59 11 -42 -16 -26 37 41 23 0 25 29
7564 29 -19 27 7 55 65 0 -28 51 -17 3 24 10 -19 56 63 34 -13 36 9 -19 -21 -14 -19 19 44 -31 3 28 10 -17 -13 -6 9
7597 9 -39 -39 -34 -11 -28 14 -1 10 8 55 26 84 -30 13 25 -3 -6 -27 -3 -31 21 54 -7 26 55 30 -19 -20 21 35 23 35 37
7630 37 -31 -34 -43 -2 -3 12 29 -45 -56 -3 23 -53 14 -27 17 0 -30 -1 8 4 14 57 38 27 -6 26 -11 29 41 -10 3 -9 16
$$ packed form
7395B1k8M9pk3j4l4P2k8J7j2M9o1Rm8%J9M3k9oJ0k6K8Nk4M7j2l6J5mK4m2Jk2J9
7429b8J5J1l7M3M0m0K5rk3RK8n1qK7k3L1l2J0k2rO7L6r6O1K5p1K2J8j1LNlo8N2
7463cm5L8J0J2l1k1j7P4J3n5j2JPJ3K2K6J5Nj0m4p5R0LJ1j6Jj9K3P1r0K3l8K1
7496Cnp6O3J0LN1n1j0J8K0l4J4l5J7J2k1K9m5M9nk6jL2Nnl8K7j5K9K0kLn1M0m8
7531b3LK5l1LO1q3Q9nn7K9l4L7n0j4PM8m2M7K1m8J7j9P8m8n3K6j0O3Mj8k3K5M
7564B9m8M6k0M8J0o5k8P9o8K0K1j4k9P5Pk9m7M9k7k8kPnL8K5p5L4K5j8k7MPJ5
7597Im8%NK3j7M2j5J1kM7k9N8j14M3J2k8lk1K4k8N2L3o1L3K9k5m9jM1J4j2J2K
7630C7o8lrM1jJ5J7p4j1N3K6p6O7m1M4j7l0K9RmJ0M3j9j1l3L2l7M0J2n1J3j2K5
$$ plain form
7663 16 19 -13 -8 3 21 6 -25 16 64 -39 8 -9 3 18 -9 7 -6 -23 15 0 27 -7 -26 -5 -4 12 4 8 20 -10 -1 21 20
7696 20 16 43 46 23 -39 42 27 10 26 7 64 25 28 7 17 67 -9 -48 -23 -5 -57 -42 -28 -22 1 31 -42 -4 -18 -61 8 15 28
7729 28 -46 43 10 -63 -25 -23 -35 35 -13 20 16 3 -10 26 -47 -26 63 18 23 20 27 62 -35 24 -5 27 46 -40 26 13 21 -13 -22 -7
7763 -7 39 -6 -65 -44 -24 -82 -25 8 -7 -16 -46 -12 -33 58 38 7 48 17 -14 6 7 21 -23 34 17 49 43 68 45 49 56 91 16
7796 16 11 -47 -17 -11 4 2 -17 1 17 2 -22 31 -53 -7 -28 -20 49 -40 7 1 -38 25 -6 23 -14 18 -11 -6 -59 54 -89 3
7828 3 2 46 -6 -12 49 2 57 -46 47 -3 24 82 77 5 -37 46 -41 10 -9 -21 -56 -50 -24 -37 12 -24 35 25 -60 -73 -51 -1
7860 -1 -9 -47 7 25 43 17 -33 -7 5 -2 69 -29 31 -2 26 8 -8 71 -4 37 43 -32 12 16 2 17 15 20 13 -75 -11 -21 -6 18
7894 18 -11 -9 12 -6 -27 5 23 36 30 -50 29 -36 -59 -5 -20 31 19 30 -11 73 -51 65 -26 12 55 49 42 10 52 38 7
$$ packed form
7663A6Ll2NJ1J8j5l1M1M8j03M7j7J2J5k7J6j3j7L8j5K7l4j9K1JJ6qMJ2l0RK2j
7696B0mK7Lk3o2Q1j5j7J6j9N7l9Lk1J0N0p6l9K5J8n2J5J4OK3L0p3L8j4m3O9PJ3
7729B8p4Q9l3p3L8Kj2P0m8L3mj3j3L6p3K1Q9m5NlPL5r7N9k9L2J9q6O6j3Ql4rJ5
7763gM6m5n9K1K0n8N7L3j5rl0L4k1R1k0l1M1l1l1K0JJ4m4N7j7L2oK5k3MPL5p5
7796A6nn8L0OJ5kj9J8J6j5k4N3q4M6k1QO9q9M7ol9O3l1K9l7L2k9Nn3J13j43R2
7828CjM4n2oO1m7N5j03R3n0K7N8np2m2Q3q7N1j9j2l5OK6j3M9l6N9j0q5j3K2N0
7860aql8N4J8J8k6n0K6J2pP1r8O0l3K8j8j6P9p5M1Op5M4Mj4J5kNpq8O4j0J5K4
7894A8k9KK1j8k1L2J8J3oq0P9o5k3N4j5N1j2J1m1Q4j24J16r1L8M3opl2M2j4l1
$$ plain form
7925 7 67 2 -37 26 -42 57 -12 -30 -20 17 8 -7 -21 -47 -37 -12 -14 20 -49 -30 4 -27 17 17 6 -34 22 -24 9 1 -1 -8 61 35
7959 35 43 15 51 7 -8 -27 13 28 -21 -18 39 17 21 -42 0 -11 -21 19 0 19 -49 14 -14 -32 20 6 -61 -25 12 -26 -13 28
7991 28 20 -13 8 41 29 35 86 36 6 5 14 27 -37 20 -21 -1 2 27 -45 3 28 13 -18 21 8 16 27 -27 -13 6 -16 -37 -30 -46
8025 -46 -24 -45 -39 -30 -36 -53 -3 -28 3 25 19 -27 12 -15 -44 40 15 -21 12 18 -3 24 30 5 59 20 12 3 37 0 -33 -55 -27 -43
8059 -43 -23 -87 -39 60 -19 -26 -3 -25 -26 -19 44 -42 -11 25 13 19 -38 1 6 -21 32 -8 -37 16 19 46 4 37 -4 52 25 14 104
8092 104 63 10 -20 37 16 17 69 8 5 26 45 -62 4 38 23 9 29 16 13 30 3 33 -12 -8 -10 -18 -53 -7 -30 -10 0 -13
8124 -13 8 -29 -20 4 -37 18 -3 -71 39 34 -30 100 24 -24 42 12 23 59 19 25 39 -37 -55 -53 -2 -28 9 -81 -8 -9 -17 -4
8156 -4 -45 -25 -17 -6 25 -28 2 24 1 28 56 -31 15 8 6 67 21 -21 -11 -17 -5 17 -21 12 27 2 -11 -61 12 -49 29 17 -5
$$ packed form
7925GO0o5l9O3o8R9o9j8J0L7rj5j4k6J0K5kL4o9J9L4l1M4%j1m0N6m6L3qkpO9k6
7959C5Qk8L6m4j5j9M0J5m9LN7k2Mo3M2j1j0M0j9J9o8O3k8j8N2j4o7L6L7l8J3M1
7991B8ql3K1L3j2ON1n0l0jRJ3o4N7m1K0LK5p2M8K5j5l1L9j3QJ1n4J4J9k2k1Pj6
8025d6K2k1ORoj7N0k5L1K2om6L9k7k9Q4k5l6L3Ok1K7Ok5N4l9qrL4l7l3k2K8j6
8059d3K0o4M8R9p9pK3k2jPO3q6L1L6j2On7L9Nk7N3m0k9N3LK7m2L3m1N6k7j1R0
8092A04m1n3l0N7k1JN2o1lK1J9j07O6L4j5j4K0j3lJ7k7L0m5Mkql5M6k3K0J0j3
8124a3K1l7RK4m1N5k1o8J10no4J30p6m8O6l0J1L6m0OJ4p6j8KN1k6L7r0P3jqJ3
8156dm1K0QJ1L1n3L0K2k3K7K8q7M6pkO1m6m2J0oJ2K2l8L3J5k5j3n0P3o1P8j2k2
$$ plain form
8189 -5 -9 -38
$$ packed form
8189emk9
8191c8
$$ Imaginary data points
##PAGE= N=2
##DATA TABLE= (X++(I..I)), XYDATA
$$ plain form
0 0 0 0 0 0 0 0 0 0 0 0 0 0 0 0 0 0 0 0 0 0 0 0 0 3 0 4 -4 4 -4 4 -4 4 -4 5 -6 9 -8 9 -9 10 -10 10 -12 12 -12 14 -16 16 -18
49 -18 19 -23 25 -28 31 -36 40 -50 57 -69 83 -108 141 -188 258 -375 581 -978 1890 -4699 26901 80176
71 80176 -233277 -351151 -225859 -339448 -258695 146580 272682 232255 326473 243378 70284
82 70284 85240 24593 -148742 -208691 -279176 -315736 -147731 -1881 64300 203763 232842
93 232842 153144 197216 177153 33 -77377 -140707 -270666 -218239 -87989 -78153 -5328 87975
105 87975 61876 131755 239824 149652 66600 29998 -154335 -221104 -76722 -76531 -107571 19286
117 19286 7401 -58442 111174 205492 102945 104511 66553 -121441 -127432 -25920 -72814 -70679
129 -70679 603 -52653 -47382 87301 115387 87991 101302 24935 -62830 -39186 -32847 -58700
$$ packed form
0@%%%%%%%%%%%%%%%%%%%%%%%LlMqQqQqQqRj1J5j7J7j8J9k0K0k2K4k4K6l0L2l4
49a8L7m2M8n3N9o7P6r0J07j26J52j91K49l29M46o33R56j559K868o589L1600N3275
71H0176l13453j17874J25292j13589Q0753M05275J26102m0427R4218q3095j73094
82G0284J4956o0647j73335n9949p0485l6560J68005J45850O6181J39463K9079
93B32842p9698M4072k0063j77120p7410o3330j29959N2427J30250R836P2825R3303
105H7975k6099O9879J08069r0172q3052l6602j84333o6769J44382J91l1040J26857
117A9286j1885o5843J69616R4318j02547J566l7958j87994n991J01512m6894K135
129g0679P1282n3256N271J34683K8086k7396J3311p6367q7765K3644O339k5853
$$ plain form
141 -58700 -43385 -59970 -75731 -12276 38857 62082 94460 56946 -674 15351 6176 -29016
153 -29016 -5765 -30604 -97312 -53322 4536 -6100 39784 75450 8231 635 51998 20008
165 20008 -389 22008 -36111 -78620 -24208 -7253 -13613 29275 19439 -22500 11789 37970
177 37970 17951 29901 18198 -39411 -38483 -7661 -11890 2233 16408 -15165 -23412 4577 13384
190 13384 21949 29076 2292 -17912 -12940 -11503 598 13111 -5315 -16791 -7867 -9882 1533
203 1533 24616 13034 -1220 8837 1795 -4869 13637 7566 -15125 -8611 -6634 -17413 -3445
216 -3445 6111 -5741 1116 13009 6667 11304 16950 693 -6193 -2041 -11081 -13467 -6152 -11524
230 -11524 -11679 1426 5832 9903 19065 14689 6867 7210 218 -8755 -9615 -13795 -17058 -10556 -5522
$$ packed form
141e8700J5315j6585j5761O3455N1133K3225L2378l7514n7620J6025r175l5192
153b9016K3251k4839o6708M3990N7858j0636M5884L5666o7219p596N1363l1990
165B0008k0397K2397n8119m2509N4412J6955o360M2888r836m1939L4289K6181
177C7970k0019J1950j1703n7609R28L0822m229J4123J4175l1573q247K7989Q807
190A3384Q565P127k6784k0204M972J437J2101J2513j8426j1476Q924k015J1415
203A533K3083j1582j4254J0057p042o664J8506o071k2691O514J977j0779J3968
216c445R556j1852O857J1893o342M637N646j6257o886M152r040k386P315n372
230a1524j55J3105M406M071R162m376p822L43o992q973q60m180l263O502N034
$$ plain form
245 -5522 -986 7432 10250 12231 17819 13338 4065 -597 -10585 -17488 -10712 -7345 -9034 -2899 193
260 193 876 13686 22571 16263 9849 833 -12764 -13128 -6168 -7890 -9716 -9730 -11596 -2673 13714 19918
276 19918 18527 11796 -2286 -7842 -1718 -585 -4041 -7886 -16240 -16520 -1342 12566 17826 15943
290 15943 4093 -5935 -2664 3053 3778 -223 -12739 -22343 -14997 -526 11412 18137 10289 -3543
304 -3543 -3642 3809 7854 10037 1523 -16526 -21191 -9907 2490 12731 13647 1258 -6333 -502 7903
319 7903 14123 11777 -4656 -18800 -16834 -6583 5227 11358 2241 -10049 -9210 -73 11189 18743
333 18743 9376 -9558 -16152 -9658 1312 12261 10539 -5464 -15741 -11468 313 13411 16218
346 16218 1558 -13511 -13901 -3827 9664 17517 8581 -8341 -14342 -6711 6342 15841 11128 -5601
$$ packed form
245e522M536Q418K818J981N588m481r273m662r988o903O776L367j689O135L092
260A93O83J2810Q885o308o414r016j3597l64O960j722j826j4j866Q923J6387O204
276A9918j391o731j4082n556O124J133l456l845q354k80J5178J3908N260j883
290A5943j1850j0028L271N717P25m001j2516r604P346J4471J1938O725p848j3832
304c543r9P451M045K183q514j8049m665J1284J2397J0241R16j2389p591N831Q405
319G903O220k346j6433j4144J966J0251J1810O131r117j2290Q39R137J1262P554
333A8743r367j8934o594O494J0970J0949j722j6003j0277M273J1781J3098K807
346A6218j4660j5069l90J0074J3491P853q936j6922o001P631J3053R499m713j6729
$$ plain form
360 -5601 -16003 -11023 1735 13668 15288 1548 -13315 -12693 -1224 9327 13554 4199 -13320
373 -13320 -17697 -6001 6293 13691 11272 -5089 -16344 -7982 4339 10293 10689 -1556 -17010
386 -17010 -13771 1591 11846 15368 7997 -7419 -11097 -621 9029 12783 5168 -12027 -18593 -10272
400 -10272 1152 12714 13071 -2735 -10157 -2419 4027 13412 18617 -822 -18559 -12020 -6450 -996
414 -996 14143 6713 -15008 -9466 2163 2471 15730 17908 -9001 -16457 -3530 -5352 1111 14440
428 14440 -2839 -17665 -2630 3412 4190 17682 9417 -12593 -8015 222 -1471 7922 7639 -10588
442 -10588 -11084 641 4110 12536 14059 -2604 -9228 -4753 -3804 5551 8891 -7896 -13139 -6092 -6487
457 -6487 6068 19971 3787 -7258 1038 -5292 -3567 16226 4705 -16060 -5479 -4928 -12111
$$ packed form
360e601j0402M980J2758J1933J620j3740j4863O22J1469J0551M227r355j7519
373a3320m377J1696J2294P398k419j6361j1255Q362J2321N954L96j2245j5454
386a7010L239J5362J0255L522p371j5416l678J0476R650L754p615j7195o566Q321
400a0272J1424J1562L57j5806p422P738O446R385N205j9439j7737O539N570N454
414i96J5139p430k1721N542J1629L08J3259K178k6909p456J2927j822O463J3329
428A4440j7279j4826J5035O042P78J3492q265k2010M578Q237j693R393k83j8227
442a0588m96J1725L469Q426J523j6663o624M475R49R355L340j6787n243P047l95
457f487J2555J3903j6184j1045Q296o330J725J9793j1521k0765J0581N51p183
$$ plain form
470 -12111 10980 17032 -7458 -3889 5729 -7451 2910 18559 -2910 -12189 1249 -6506 -6324
483 -6324 13964 6002 -9369 944 1535 -4110 9174 9033 -6472 -4736 -1981 -5501 3754 6917
497 6917 -3246 -2955 -1185 -3760 4724 7160 -3141 -2809 -2352 -8223 1558 8078 -3724 -2627 2906
512 2906 -6223 312 13620 1204 -4951 4315 -4831 -7446 10003 4809 -8117 1372 -711 -10050
526 -10050 5196 10573 -3933 -558 3177 -8368 -2023 9264 -20 -2401 3132 -4676 -5335 4658
540 4658 1969 -1124 3270 -1294 -4206 1577 620 -1099 3159 745 -1830 1116 -1700 -2928 1529
555 1529 -396 -868 3558 -1352 -4509 1927 -244 -2097 6502 3143 -5173 1070 648 -6124 3366 6727
571 6727 -4090 -212 3933 -6431 -2038 7909 -994 -2611 5415 -3163 -7548 2922 773 -3437
$$ packed form
470a2111K3091O052k4490L569R618j3180J0361J5649k1469r279J3438p755J82
483f324K0288p962j5371J0313N91n645J3284j41j5505J736K755l520R255L163
497F917j0163K91J770k575Q484K436j0301L32M57n871R781O520j1802J097N533
512B906r129O535J3308j2416o155R266r146k615J7449n194j2926R489k083r339
526a0050J5246N377j4506L375L735j1545O345J1287r284k381N533p808o59R993
540D658k689l093M394m564k912N783r57j719M258k414k575K946k816j228M457
555A529j925m72M426m910l157O436k171j853Q599l359q316O243m22o772R490L361
571F727j0817L878M145j0364M393R947q903j617Q026q578m385J0470k149m210
$$ plain form
585 -3437 4848 2785 -4511 549 1089 -3101 3067 4653 -1612 -1178 -1635 -4882 -537 3017 2094 3459
601 3459 -343 -4878 -9 1008 -796 5348 2622 -7416 -2716 909 -4340 3528 8378 -3657 -2586
616 -2586 4798 -4140 -2031 9589 -1065 -7613 4031 -869 -7917 5429 4794 -6846 2021 5820
630 5820 -4928 560 5704 -5710 -3828 5046 -1716 -2925 3914 -1734 -4762 3083 3824 1433 2713
645 2713 -837 -3594 -1179 -515 2024 3514 -2808 -4105 85 -1910 866 7430 532 -5170 486
660 486 -2097 -4120 5927 3613 -6325 -537 1801 -4659 3472 8810 -2625 -2872 3465 -3344 -2418
675 -2418 6470 -270 -6126 1174 73 -3394 4287 4280 -3638 -1277 2185 -1090 204 2445 -1770 -4076
691 -4076 -1423 862 1606 1050 220 -588 -2064 414 4423 1563 -1751 -356 -2518 -3531 3169 3802
$$ packed form
585c437Q285k063p296N060N40m190O168J586o265M34m57l247M345L554r23J365
601C459l802m535M869J017j804O144k726j0038M700L625n249P868M850j2035J071
616b586P384q938K109J1620j0654o548J1644m900p048J3346o35j1640Q867L799
630E820j0748N488N144j1414J882Q874o762j209O839n648l028P845P41k391J280
645B713l550k757K415O64K539J490o322j297M190j995K776O564o898n702N656
660D86k583k023J0047k314r938N788K338o460Q131N338j1435k47O337o809R26
675b418Q888o740n856P300j101l467P681pp918K361L462l275J294K241m215k306
691d076K653K285P44n56q30q08j476K478M009k860l314J395k162j013O700O33
$$ plain form
707 3802 -2071 -714 64 -3698 910 5716 64 -2080 228 -3101 -2017 4255 2245 -1607 147
722 147 -1034 -1892 2565 3164 -365 -1104 -1891 -2138 603 1456 155 -469 -2119 -1559 1917 1698 598 1227
740 1227 -1822 -2966 1876 1885 -1077 1179 -696 -4289 970 3804 -592 834 1581 -3978 -1138 4411
756 4411 130 -919 1973 -3023 -3720 3269 1801 -1551 1505 -977 -4036 1523 2995 -482 1173
771 1173 95 -3371 382 2714 -57 1132 343 -3679 -767 2087 -741 709 1446 -3573 -1740 2773
787 2773 -295 -321 2650 -1951 -3014 2663 1048 -1200 2277 -138 -3182 1646 2154 -1070 1372 538
803 538 -3278 266 2283 -927 665 1121 -2990 -681 2688 -368 153 1716 -2756 -2483 2017 -14
819 -14 -993 1724 -1165 -2917 1390 1626 -97 1901 387 -2270 304 1041 -617 823 146 -2398 -272
$$ packed form
707C802n873J357P78l762M608M806n652k144K308l329J084O272k010l852J754
722A47j181q58M457N99l529p39p87k47K741Q53j301o24j650N60L476k19j100O29
740A227l049j144M842Rk962K256j875l593N259K834m396J426P47n559K840N549
756D411m281j049K892m996o97O989j468l352L056k482l059N559J472l477J655
771A173j078l466L753K332k771J189p89m022K912K854k828J450P37n019J833M513
787B773l068k6K971m601j063N677j615k248L477k415l044M828N08l224K442q34
803E38l816L544K017l210J592M56m111K309L369l056N21J563m472K73M500k031
819a4r79K717k889j752M307K36j723J998j514k657K574P37j658J440o77k544K126
$$ plain form
836 -272 1117 -438 1147 1207 -1724 -372 1554 -523 153 1414 -1642 -1579 1353 148 -404 1609 -209
853 -209 -1621 831 654 -549 690 -185 -1963 -244 499 -395 786 580 -1051 -70 773 -52 536 557
871 557 -1146 -726 349 -411 136 898 -353 -393 755 300 181 801 -260 -742 -47 -399 -495 203 -310
890 -310 -658 338 145 49 847 89 -498 430 136 -544 452 248 -956 91 677 -461 113 937 -263
909 -263 -497 577 -270 -781 260 -1 -788 39 314 -649 -175 767 210 1 522 -194 -793 62 492 40
929 40 340 252 -743 -431 634 580 405 541 -459 -1132 -203 389 161 273 -31 -887 -725 183 564 452 163
950 163 -191 -477 -419 490 754 -186 -208 259 -549 -407 1189 82 -1166 546 586 -1075 619 1196 -1858
969 -1858 -791 1637 -573 -608 1960 -854 -2561 1356 1093 -1143 1573 999 -2964 -595 2010 -523
$$ packed form
836b72J389j555J585O0k931J352J926k077O76J261l056O3K932j205n52K013j818
853b09j412K452j77j203J239q75j778J719P43q94J181k06j631R81Q43q25N88K1
871E57j703M20J075p60N47P62j251m0J148m55j19O20j061m82O95l52r6O98n13
890c10l48R96j93r6P98p58n87R28k94o80R96k04j204J047N86j138N74Q24j200
909b63k34J074q47n11J041k61p87Q27K75r63M74R42n57k09N21p16n99Q55M30m52
929D0L00q8r95L12J065n4j75J36j000o73R29N92k28J12l04q56J62R08L81j12k89
950A63l54k86N8R09K64r40k2M67q08J42J596j107j248J712M0j661J694N77l054
969a858J067K428k210l5K568k814j707L917k63k236K716n74l963K369K605k533
$$ plain form
985 -523 400 1944 -1867 -2449 1161 584 70 1883 -141 -2424 -217 722 390 1513 483 -1501 -1044
1002 -1044 -337 263 1575 420 -829 -135 -808 -629 1930 676 -1532 470 -135 -2116 1306 1786 -2430
1019 -2430 -183 2020 -1877 -174 3242 -1568 -2520 2571 145 -1911 2859 668 -4007 518 2296
1034 2296 -1456 1370 2736 -2979 -2356 1930 -59 -108 2584 -819 -3454 -277 640 281 2060 896
1050 896 -1846 -1435 -299 540 1732 924 -647 -1047 -1510 -156 1953 818 -304 404 -1187 -1613 1825
1067 1825 1291 -1406 467 491 -2284 283 2297 -1420 -1076 1616 -902 -1064 2377 105 -2468 683
1083 683 895 -1243 1269 1757 -2112 -1420 1211 -26 121 1998 -220 -2493 -428 754 145 1138 1052
1100 1052 -1517 -2019 194 842 552 1330 324 -2161 -1314 1023 709 449 1178 -666 -2206 -33 1222
$$ packed form
985e23R23J544l811n82L610n77n14J813k024k283K207R39l32J123j030j984M57
1002a044P07O00J312j155j249O94o73J79K559j254k208K002o05j981L422M80m216
1019b430K247K203l897J703L416m810r52N091k426k056M770k191m675M525J778
1034B296l752K826J366n715O23M286j989m9K692l403k635L177R17l59J779j164
1050H96k742M11J136Q39J192q08j571m00m63J354K109j135j122P08j591m26L438
1067A825n34k697J873K4k775K567K014l717L44K692k518j62L441k272k573L151
1083F83K12k138K512M88l869O92K631j237J47J877k218k273K065J182o09R93q6
1100A052k569n02K213O48k90P78j006k485Q47K337l14k60P29j844j540K173J255
$$ plain form
1117 1222 278 673 518 -1329 -927 873 562 185 517 -457 -995 141 552 68 -74 -147 -277 -113 162
1136 162 628 -120 -862 53 501 -261 395 486 -1440 -798 1054 54 46 1357 -832 -1871 944 799 -574
1155 -574 1540 659 -2433 -344 1461 -614 691 1758 -1502 -1411 1166 -275 -175 1850 -502 -1973
1171 -1973 614 51 -925 1448 686 -1652 115 513 -926 656 982 -1131 -235 543 -866 223 989
1188 989 -767 -97 917 -558 27 1034 -769 -532 997 -577 -517 1168 -623 -1180 1179 67 -926
1205 -926 1264 273 -1593 607 677 -1148 605 883 -1540 -26 1069 -980 147 1428 -935 -689
1221 -689 1152 -465 -668 1205 -219 -1125 664 46 -758 829 375 -865 363 241 -797 246 432
1238 432 -718 142 353 -565 197 426 -463 234 485 -581 -11 384 -588 65 664 -481 -177 515 -437
$$ packed form
1117A222r44L95j55j847M02J800l11l77L32r74n38J136M11m84j42p3j30J64K75
1136A62M66p48p42R15M48p62O56R1j926O42J852j000qJ311k189j039K815j45j373
1155e74K114q81l092K089J805k075J305J067l260R1K577j441J00K025k352j471
1171a973K587n63r76K373p62k338J767L98j439J582L26k113Q96P78j409J089P66
1188I89j756O70J014j475N85J007j803K37J529j574O0J685j791n57K359j112r93
1205i26K190r91j866K200P0j825J753K78k423J514J095k049J127J281k363K46
1221f89J841j617k03J873j424r06J789o18q04J587m54j240J228j22j038J043J86
1238D32j150Q60K11r18P62K29q89O97K51j066N70L95r72O53N99j145L04O92r52
$$ plain form
1257 -437 -110 844 -235 -346 560 -426 -542 774 61 -567 379 -42 -677 439 424 -465 154 15 -610
1276 -610 217 440 -313 101 94 -477 242 406 -187 317 206 -554 170 514 -313 148 425 -694 -185 742
1296 742 -275 -104 562 -625 -461 775 -123 -439 641 -448 -827 757 347 -551 564 10 -993
1313 -993 458 677 -542 373 428 -1041 -19 952 -216 86 543 -801 -488 781 -126 -92 653 -632
1331 -632 -871 671 42 -297 743 -315 -991 483 283 -468 710 166 -1078 218 578 -453 533
1348 533 635 -946 -193 763 -422 10 766 -764 -621 805 -148 -301 801 -290 -899 510 274 -453
1366 -453 491 86 -1006 66 464 -272 328 375 -721 -161 545 -79 220 509 -590 -393 435 20 133
1385 133 539 -306 -466 227 -36 -12 550 -163 -640 68 -51 -107 502 104 -578 24 32 -236 415 305 -551
$$ packed form
1257d37L27R54j079j11R06r86j16J316p13o28R46m21o35J116j5q89O19j39o25
1276f10Q27K23p53M14pn71P19J64n93N04j11p60P24L44q27M61K77j119N09R27
1296G42j017J71O66j187J64J236q98l16J080j089l79J584m10q98J115n54j003
1313i93J451K19j219R15N5j469J022R71j168L02M57j344L13J269r07L4P45j285
1331f32k39J542o29l39J040j058o76J474k00p51J178n44j244J296L60j031R86
1348E33J02j581P53R56j185M32P56j530J43J426r53j53J102j091o09J409k36p27
1366d53R44m05j092J072L98p36O00M7j096N60P06o24K99K89j099J97Q28m15J13
1385A33M06q45j60O93k63K4N62p13m77P08j19n6O09l98o82O02Qk68O51j10q56
$$ plain form
1406 -551 -141 253 -266 115 482 -315 -314 312 1 36 429 -18 -424 60 83 -20 186 69 -304 -151 77
1427 77 171 151 -29 -161 -179 -183 83 325 3 -144 -76 -272 -73 412 101 -200 56 -144 -324 357 393 -230 3
1450 3 135 -348 45 481 -133 -171 184 -208 -222 357 78 -380 41 6 -270 100 234 -234 -109 85 -98 38
1472 38 140 -92 -87 -12 -6 154 126 46 -5 -42 -47 220 220 -124 -56 -43 -304 -8 384 -111 -206 81 -200 -286 309 153
1498 153 -262 93 86 -445 153 452 -161 -27 344 -234 -210 430 96 -252 307 136 -423 63 263 -329 40
1519 40 391 -278 -165 334 -202 -334 336 97 -305 108 74 -404 58 272 -127 37 201 -315 -219 224 -15
1540 -15 8 243 -97 -174 23 -1 68 302 -26 -64 88 -252 -115 351 -33 -168 257 -172 -380 233 57 -307
1562 -307 272 117 -644 27 364 -402 54 549 -373 -321 471 -212 -306 657 61 -552 413 155 -571 367 532
$$ packed form
1406e51M10L94n19L81L67p97JO26l11L5L93m47m06M84K3j03K06j17l73J53K28
1427G7R4k0j80j32j8mK66K42l22j47O8j96J99M85l11l01K56k00j80O81L6o23K33
1450CJ32m83L93M36o14l8L55l92j4N79k79m58M21l5k76L70J34m68J25J94j83J36
1472C8J02k32NP5OJ60k8q0n1l7nK67%l44O8J3k61K96L92m95r5K87k81q6N95j56
1498A53m15L55pn31N98K99o13J34L71n78K4O40l34l48N59j71n59M86K00n92L69
1519D0L51o69J13M99n36j32O70k39m02M13l4m78M62K14l99J64J64n16R6M43k39
1540a5K3K35l40p7J97k4O9K34l28l8J52l40J37M66l84j35M25m29k08O13j76l64
1562c07N79j55p61O71L37p66M56M95r22N2P92o83r4R63n96o13R65k58p26R38J65
$$ plain form
1583 532 -416 65 430 -491 -227 484 -111 -194 341 -142 -449 209 52 -209 246 154 -250 -46 56 -95 90
1604 90 183 -71 43 -10 -156 101 35 -51 226 -14 -295 43 89 -205 137 187 -354 -125 169 -238 -123 442
1626 442 -53 -404 229 80 -302 280 318 -327 10 235 -223 -57 467 11 -278 175 61 -361 140 328
1646 328 -212 -100 190 -149 -281 244 99 -289 186 139 -322 -9 282 -296 -62 418 -129 -285 214 36
1666 36 -201 258 237 -280 12 76 -284 158 291 -105 -8 139 -343 -68 330 13 43 84 -299 -70 245 -151
1688 -151 -1 324 -284 -276 339 -150 -263 418 -85 -509 339 67 -465 362 279 -542 248 471 -570 119 634
1709 634 -472 -124 695 -267 -293 578 -184 -488 510 23 -604 388 88 -664 248 333 -530 164 338 -566
1729 -566 58 529 -305 -21 410 -498 -123 559 -138 -120 512 -276 -384 440 -54 -369 455 -69 -635 381
$$ packed form
1583E32r48M81L65r21K64P11n95q3N35m83l07O58j57k61M55r2m04K04J02j51J85
1604I0R3k54J14n3j46K57o6q6K77k40k81L38M6k94L42N0n41K29K94m07J15N65
1626D42m95l51O33j49l82N82L8o45L37K25m58J66N24m56k89M53j14m22N01J88
1646C28n40J12K90l39j32N25j45l88M75m7m61L13K91n78K34M80n47j56M99j78
1666C6k37M59k1n17K92O4l60M42J33l96R7J47m82K75L98l17L0M1l83K29L15l96
1688a51J50L25o08QO15m89j13O81n03m24Q48k72n32Q27q3q21P90K23j041O89N15
1709F34j106L48Q19r62k6Q71p62l04R98m87o27R92l00p52R12Q5q63O94J74r04
1729e66O24M71q34K84M31r08L75O82o97J8O32p88j08Q24m94l15Q24n24n66J016
$$ plain form
1749 381 148 -526 333 174 -624 186 452 -586 126 499 -533 -120 542 -344 -111 609 -234 -365 553
1768 553 23 -383 397 15 -522 364 135 -538 161 241 -503 61 337 -385 14 274 -352 -96 358 -203
1788 -203 -114 304 -218 -213 375 -71 -220 256 -49 -369 243 88 -181 155 13 -296 172 245 -251 141 241
1809 241 -254 3 188 -114 19 171 -160 -121 221 -82 -198 222 -30 -216 128 6 -112 71 13 -172 66
1830 66 128 -68 37 88 -52 46 156 1 42 74 55 14 24 48 38 4 -83 -36 -44 -38 39 17 -78 36 -39 2 62 10
1858 10 -70 67 77 -24 113 90 -27 -18 10 -51 61 95 -60 -72 27 -93 -44 102 -72 -101 16 -66 -52 14 -3 -36
1884 -36 92 61 -79 130 1 -77 106 67 -78 66 34 -33 89 83 -91 -4 96 -126 -55 147 -106 -117 98 -86
1908 -86 -128 113 -52 -156 54 12 -107 12 95 -121 59 123 -130 -61 48 -109 7 4 -5 1 18 -29 -27 64 -20 -57
$$ packed form
1749C81k33o74Q59j59p98Q10K66j038P12L73j032M13O62q86K33P20q43j31R18
1768E53n30m06P80l82n37Q86k29o73O99Q0p44N64K76p22L99K60o26K56M54n61
1788b03Q9M18n22NN88m46j49M76l05l20O12j55k69L36j42l09M68P3m96L92J00
1809B41m95K57J85l02J33J52l31L9L42l03j16M20k52j86L44j22j18J83n8j85K38
1830F6O2j96J05N1j40R8J10j55M1L2j9m1J0K4j0l4q7M7qOP7k2r5J14p5M1O0n2
1858A0q0J37J0j01J37k3j17RK8o1J12L4j55j2R9j20M9J46j74k9J17q2J4O6j7l3
1884c6J28l1j40K09j29p8J83l9j45J44l2o7J22oj74Q7J00k22P1K02k53j1K15j84
1908h6m2K41j65j04K10m2j19J19Q3k16J80O4k53O9J09j57J16lrOJ7m7KR1q4l7
$$ plain form
1934 -57 64 9 -48 65 9 67 29 2 -20 71 -40 -63 35 17 -88 -9 5 -113 99 40 -91 63 39 -112 -27 86
1960 86 -54 -4 106 -4 -42 74 35 16 28 -14 -4 -2 13 -64 -26 -22 -53 -22 -33 14 -50 -149 -31 20 -63 10 122 -30
1988 -30 -54 120 8 -93 114 3 -168 73 81 -131 119 56 -200 -48 48 -50 -27 131 -99 -193 16 23 -99 83
2012 83 -3 -137 37 118 -19 78 97 -16 -24 96 -1 38 41 -7 -38 53 -57 26 52 -33 -64 43 -25 -61 46 -74 -67
2039 -67 35 -54 -81 111 21 -119 98 52 -98 9 97 -140 -23 141 -89 -40 143 -79 -123 161 31 -128 87
2062 87 95 -202 88 158 -79 1 91 -67 -46 140 0 -121 109 -27 -199 75 28 -127 -56 14 -159 -37 84
2085 84 -74 7 50 -90 0 137 -45 1 100 -50 -7 157 -26 -70 76 12 -80 192 45 -125 90 -38 -199
2108 -199 95 74 -186 -7 56 -189 -20 251 -32 -11 206 -85 -154 257 82 -123 139 -12 -251 114 81 -200
$$ packed form
1934e7J21n5n7J13n6N8l8k7k2R1j11k3R8j8j05P9J4j18K12n9j31J54k4j51Q5J13
1960H6j40N0J10j10l8J16l9j9J2m2J0KJ5p7L8Ml1L1j1M7o4r9J18N1q3P3J12j52
1988c0k4J74j12j01K07j11j71K41Qk12K50o3k56J52R6r8K3J58k30r4K09Pj22J82
2012H3q6j34J74Q1j37R7J9j13qJ20r7L9Lm8l1R1j10Q3K6q5l1J07o8l6J07j20P
2039f7J02q9k7J92r0j40K17m6j50J07Q8k37J17J64k30M9J83k22m4K84j30j59K15
2062H7Qk97K90P0k37Q0R0j58K1J86j40j21K30j36j72K74m7j55P1P0j73J22J21
2085H4j58Q1M3j40R0J37j82M6R9j50M3J64j83m4J46o4r2K72j47j70K15j28j61
2108a99K94k1k60J79O3k45J69K71k83K1K17k91o9M11j75k05K62j51k39L65l3k81
$$ plain form
2130 -200 43 138 -229 -43 174 -140 -58 208 -129 -104 148 -52 -100 124 34 -110 198 120 -128 63 68 -188 98
2153 98 107 -83 12 74 -157 35 159 -102 -41 139 -171 -118 185 -66 -77 132 -32 -184 122 22 -194 71 80
2176 80 -204 73 148 -125 41 141 -180 -52 195 -105 -116 196 -55 -99 153 -1 -126 132 70 -70 77 168
2198 168 -135 -83 84 -81 -29 76 -59 -84 11 -111 -71 122 -44 -123 -21 -39 -91 102 80 -44 17 3 -9 21
2222 21 138 -5 2 80 -69 -72 68 0 -51 48 -9 -93 28 39 -71 25 40 -123 -17 90 -71 14 141 -13 -97
2247 -97 67 -3 -43 126 101 -74 42 46 -208 62 129 -143 -38 33 -121 -60 88 -67 -114 131 -25 -160 149
2270 149 3 -68 79 50 -79 69 180 -70 36 110 -80 20 139 -114 -1 132 -88 -85 97 -50 -162 107
2292 107 6 -115 129 15 -202 42 42 -123 50 171 -186 47 131 -114 12 221 -89 -84 97 -142 -51 176
$$ packed form
2130b00K43R5l67J86K17l14Q2K66l37K5K52k00m8K24r0j44L08p8k48J91Nk56K86
2153I8Rj90R5O2k31J92J24k61O1J80l10N3L03k51j1K09j64j52L06j00k16K65R
2176H0k84K77P5k73J66J00l21J28K47l00j1L12k51m4K52j54j25K58o2j40J47R1
2198A68l03N2J67j65N2J05j35k5R5j22M0J93j66p9J02j8n2J93k2j24O1j4j2L0
2222B1J17j43PP8j49lJ40o8n1R9n7q4J21J1j10R6J5j63J06J07j61Q5J27j54q4
2247i7J64p0m0J69k5j75J16Mk54K70O7k72J05P1j54O1J48j55m7K45j56j35L09
2270A49j46p1J47k9j29J48J11k50J06P4j90J00J19k53J13J33k20LJ82j47j12K69
2292A07j01j21K44j14k17K44%j65J73J21l57K33Q4k45J26K09l10NJ81k39R1K27
$$ plain form
2314 176 -12 -82 93 -22 -111 113 137 -61 90 60 -172 57 132 -58 53 54 -147 -26 72 -66 -74 103 -73
2337 -73 -177 93 -16 -86 34 -2 -94 17 48 -79 56 101 -50 51 83 -59 -8 39 -43 52 131 -48 -88 55
2361 55 -50 -32 76 -2 -101 19 -33 -102 25 17 -20 -19 46 -64 29 136 39 -2 73 -20 -15 31 12 -16 -8 -57 -54 31 26 -51
2391 -51 -24 -8 -93 24 40 -48 -44 8 -19 -3 42 13 3 10 13 -42 61 116 5 -56 35 14 -12 62 -34 -108 -44 -12 -45 40
2421 40 26 -76 -21 7 -4 27 71 -4 -94 -29 -12 38 73 -20 -86 36 9 -28 71 37 -88 -7 35 -53 83 80 2 13 35
2450 35 -27 74 94 -14 42 58 6 -18 39 -33 -52 -7 -7 -43 33 -6 -95 -21 34 11 -16 5 -68 -55 0 125 24 96 22
2479 22 -30 20 43 48 83 20 0 -18 3 28 50 -29 -32 -81 -42 -41 48 -32 15 -17 -44 5 66 11 17 43 -53 -43 0 25 30 27 -50
2512 -50 -11 -43 8 -5 4 -12 -97 13 -5 -52 38 17 -40 25 67 10 8 -25 -35 -3 44 8 28 76 -6 4 63 19 -36 6 4
$$ packed form
2314A76j88p0J75j15q9K24K4j98J51l0k32K29P5j90J11Jk01J21R8j38qJ77j76
2337g3j04K70j09p0J20l6r2J11L1j27J35M5j51J01L2j42N1M7q2R5P9j79m0J43
2361E5j05J8J08p8r9J20n2o9J27ql7JO5j10R3J07r7m1P5r3NM6j9k8Qm9LQ5np7
2391e1K7J6q5J17J6q8MN2k7J6M5k9j0PLn5J03N5j11o1R1k1k6P4r6p4O4L2l3Q5
2421D0j4j02N5K8j1L1M4p5r0O5J7N0L5r3o6J22k7l7R9l4j25Q1M2q8J36lp8J1K2
2450C5o2J01K0j08N6J6n2k4N7p2j9M5%l6P6l9q9P4N5k3k7K1p3J3N5J25j01P2p4
2479B2n2N0K3NL5o3k0j8K1K5K2p9lm9L9JQ9q0M7l2k7M9O1n5OK6r6J0M3K5Nlp7
2512e0L9l2N1j3Rj6q5J10j8m7R0k1n7O5M2n7kl3j0L2M7l6K0M8q2J0N9m4n5M2k
$$ plain form
2543 4 -27 -41 -45 -29 2 -30 -37 11 25 -57 -34 31 -22 -12 10 -7 13 -22 -55 -95 83 -32 -60 32 -38 -71 40 -31 -38 -9 -2
2574 -2 -46 90 18 7 57 14 -30 -33 86 41 44 68 -8 -78 108 43 -56 -14 22 -97 -17 -30 -142 -80 53 -121 -95 60
2602 60 -40 -38 86 17 20 105 15 -23 72 56 -123 30 55 -60 -51 -19 -64 2 106 -32 -67 33 -23 -102 37 -34 -99
2629 -99 35 48 -69 80 69 -5 39 39 -66 57 114 -79 20 12 -33 -81 20 -1 -71 21 -60 -55 51 -10 -44 45 59 -55
2657 -55 88 94 -69 -58 104 26 -11 73 -26 -20 115 -24 -31 59 -47 -59 79 14 -44 34 -13 -114 -38 53 -99 6 102
2684 102 -48 -41 88 -57 5 135 1 -86 57 -85 -62 69 46 -120 24 -13 -95 62 117 -72 -54 97 -38
2707 -38 -1 79 -34 -42 93 -15 -29 49 -25 -75 28 -51 -83 47 -26 -64 -28 42 -103 -48 77 -87 -61 47 -42 -15
2733 -15 79 -4 -42 44 -38 -60 110 40 -69 29 22 -5 53 99 -19 16 0 -69 -52 99 -37 14 21 -72 -61 -15 -11 -66 72
$$ packed form
2543Dl1j4mJ6L1l2pM8J4q2K3O5n3J0K2j7K0l5l3m0J78j15k8R2p0l3J11p1pK9P
2574bm4J36p2j1N0m3m4lJ19m5LK4p6p0J86o5r9M2L6j19Q0j3j12O2J33j74K6J55
2602F0j00KJ24o9LQ5r0l8R5j6j79J53K5j15RL2m5O6J04j38l5J00n6p9J39p1o5
2629i9J34J3j17J49j1p4M4%j05J23N7j93R9qm5m8J01k1p0R2q1NJ06o1l4Q9J4j14
2657e5J43Oj63J1J62p8l7Q4r9OJ35j39pR0j06j2J38o5n8P8m7j01P6R1j52J05R6
2684A02j50PJ29j45O2J30j34q7J43j42K3J31k3j66J44l7q2J57N5j89J8J51j35
2707c8L7Q0j13qJ35j08j4P8p4n0J03p9l2J30p3l8L6P0j45N5J25j64K6J08q9K7
2733a5R4q3l8Q6q2k2J70p0j09R8pk7N8M6j18L5j6o9J7J51j36N1Pr3J1M6Mn5J38
$$ plain form
2762 72 24 -28 65 29 -62 25 48 -93 32 21 -45 -2 76 -23 -77 -30 -58 25 97 29 -16 22 54 -23 38 118 -45 30 56
2791 56 -31 56 114 -19 4 17 -39 -47 -20 59 -54 66 -1 -5 29 6 -8 20 109 -49 3 11 -47 -21 63 9 -51 1 -45 -93
2821 -93 12 -17 -48 76 34 -57 44 34 -60 -24 66 -61 -53 57 -4 -2 94 -45 -29 66 -21 -61 111 76 -91 11 29
2848 29 -82 6 26 -53 18 18 -98 -35 102 -27 -49 78 -17 -84 45 43 -23 139 62 -31 -8 -11 -38 67 93 -90 29
2875 29 28 -68 -25 -5 -60 -46 33 14 -80 52 -16 8 40 48 -110 7 74 -66 43 91 -43 23 12 -97 32 50 7
2902 7 -45 -34 -42 -72 13 -24 -66 -11 -83 -94 3 23 3 -9 0 -27 -18 55 12 14 2 -3 -17 50 25 -60 31 -28 -51 -24 -34 -27 29 18
2936 18 -12 -22 -32 -13 -53 -24 -54 7 38 -41 -38 52 50 -7 14 -85 -43 -65 5 -30 22 22 -41 -24 29 -5 20 38 42 -15 33 -4
2968 -4 18 16 59 -68 -54 -18 -17 19 -16 -5 -4 -43 -86 -75 67 5 35 -12 -85 -54 8 19 10 31 12 -15 -29 34 37 -9 45 61
$$ packed form
2762G2m8n2R3l6r1Q7K3j41J25j1o6M3P8r9n4M7k8Q3P2o8m5L8L2p7O1Q0j63P5K6
2791E6q7Q7N8j33K3J3n6qK7P9j13J20o7mL4k3j4K8Q9j58N2Qn8K6Q4n4o0N2m6m8
2821i3J05k9l1J24m2r1J01j0r4L6R0j27QJ10o1KR6j39J6R5q7m0J72l5j67J02J8
2848B9j11Q8K0p9P1%j16O3J37j29k2J27r5o7J29ko6J62p7r3K3lk7J05K6j83J19
2875B9jr6M3K0n5J4P9j9r4J32o8K4L2Qj58J17O7j40J09M8j34O6j1j09J29J8m3
2902Gn2J1ql0Q5l7m2N5p2j1R7K0k0j2Rk7RP3m3Kj2nj4O7k5q5R1n9k3K7j0PN6j1
2936A8l0j0j0J9m0K9l0O1L1p9LR0kn7K1r9M2k2P0l5N2%o3J7N3l4K5J8Mn7M8l7
2968dK2kM3j27J4L6JL6l5J1Jl9m3J1J42o2L0m7p3L1O2J1rK1j9k7j4O3Lm6N4J6
$$ plain form
3000 61 -10 -5 9 48 -24 -23 37 -7 -2 -59 -2 -11 -33 49 17 9 -41 -13 0 6 116 19 -32 31 -60 -11 20 -36 0 -26 -18 0 26
3033 26 4 -17 -81 -34 -74 -45 79 5 12 -2 -13 37 26 77 16 -33 -1 34 23 27 13 3 19 -66 3 15 13 -17 -14 -46 -25 -73
3065 -73 12 -23 -17 6 48 -24 44 -44 -66 -6 0 20 -20 -10 -19 -38 -10 -24 -8 0 -7 -46 -17 13 15 36 4 -4 30 -5 -4 17 -1 -44
3099 -44 -6 10 -59 76 46 -11 -15 -28 -88 -11 31 -15 -55 -22 -53 15 13 29 -41 13 34 -41 44 14 -27 -51 73 9 27 48
3129 48 13 27 27 -39 -22 43 49 -7 4 -10 -2 -25 52 -38 -22 48 35 -8 11 52 -16 -14 -38 -35 74 20 -86 24 -7 -25 1
3160 1 15 -50 -5 -8 -59 4 59 -16 -16 19 -32 -13 68 -40 -50 17 -19 -5 69 14 -71 9 13 -18 9 53 -34 6 7 -33 19 69
3192 69 23 -27 41 -50 -37 34 -26 -58 -47 2 -6 5 27 -57 25 35 -58 -60 44 -24 -11 91 -9 -13 54 19 25 53 25 -66 30
3223 30 27 -21 60 -5 -47 -1 24 -58 -3 71 -48 -41 -13 -84 -14 13 -10 -58 20 -36 -106 -5 6 -82 13 70 -91 -30 36 -43
$$ packed form
3000F1p1NJ4L9p2JO0m4Nn7N7rk2Q2l2qn0K8J3OJ10r7n1O3r1M9L1n6L6k6QJ8K6
3033B6k2k1o4M7m0K9J24p4Pj4j1N0j1N1o1m9L2L5j1Mj4j0J6q5O9J2kl0Ll2K1m8
3065g3Q5l5OK3M2p2O8q8k2O0OK0m0J0rj9K8j4J6Qpl9K9L0KK1l2qL4l5JK1j8m3
3099d4L8J6o9J35l0n7mj3o0P7M2m6m0L3l1O8kJ6p0N4K1p5Q5l0m1k4J24o4J8K1
3129D8l5J4%o6J7O5On6J1j4Qk3P7r0J6P0j3m3J9M1o8Kk4LJ09n4j06J10l1j8K6
3160AJ4o5M5ln1O3N5p5%L5n1J9Q1j08j0O7l6J4P4n5q5Q0Ml1K7M4q7M0Jm0N2N0
3192F9m6n0O8r1J3P1o0l2J1M9qJ1K2q4Q2J0r3kJ04o8J3J02j00mO7l5OK8k8r1R6
3223C0lm8Q1o5m2M6K5q2N5P4j19PK8p1P0K7k3m8P8n6p0J01J1q8R5N7j61O1O6p9
$$ plain form
3253 -43 -30 45 -56 -28 40 -52 -50 23 34 -8 85 -4 -77 11 63 11 -26 -12 -94 -47 23 11 -28 44 -66 -13 -52 23 9 7
3283 7 -25 -77 -13 -17 -23 47 39 -36 -3 -2 -51 -35 21 44 -8 15 -21 -46 -6 2 -38 54 24 -98 -5 45 -7 43 26 -64 32 7 -74
3316 -74 -2 93 46 -10 20 -21 -72 20 -30 -9 31 0 -109 -15 35 -38 -11 61 -88 -62 28 -43 13 44 -68 -57 0 21 -10
3345 -10 28 -17 -42 32 7 -15 -15 40 -49 -31 -12 -53 8 45 -21 26 -32 -10 -21 97 -67 -3 22 9 -96 -77 -38 -49 55
3374 55 -18 -35 -32 4 -54 -33 36 -11 -57 6 -7 -76 28 0 27 49 12 -94 16 -8 9 67 100 1 -22 24 -35 8 19
3403 19 -73 -20 13 -32 -14 35 -16 -31 -8 -4 -43 51 54 -10 11 -4 -74 7 45 -3 7 -7 -67 -33 27 7 -2 61 -29 -20 35 -24
3435 -24 -47 42 36 -42 -41 -3 -40 -44 -9 43 2 -12 -38 -33 22 19 -33 13 -20 -51 -23 -23 -50 -8 -34 -19 -25 -11 -24 -12 -6 4 -34 -1
3469 -1 -32 -6 4 12 -14 12 6 -49 38 -40 -9 4 1 -14 57 2 -6 -28 33 -30 4 10 -26 -2 -9 14 -14 4 -31 0 55 -5 -13 -57
$$ packed form
3253d3J3P5j01K8O8r2KP3J1m2R3q9p3Q8N2n2l7J4q2M7P0j2l9P2j10N3l9P5j4k
3283Gl2n2O4moP0qp5L3Jm9J6N6K3n2K3l6k5M0Qm0R2l0j22R3N0n2N0j7r0R6k5q1
3316g4P2R5m7n6L0m1n1R2n0K1M0l1j09R4N0p3K7P2j49K6R0p1N6L1j12J1N7K1l1
3345a0L8m5k5P4k5k2%N5q9J8J9m1O1L7o6M7n8K2j1J18j64O4K5j3j05J9L9j1J04
3374E5p3j7LL6n8K1O9m7m6O3j3o9J04k8K7K2l7j06J10k4J7N8L3r9k3M6n9M3J1
3403A9r2N3L3m5J8M9n1j5K3Ml9R4Lo4K1j5p0Q1L8m8J0j4o0L4O0k0rO3r0RN5n9
3435b4k3Q9op8JL8l7mL5N2m1j4k6NN5ln2M6l3l1K8%k7M2k6J5oJ4j3J2OJ0l8L3
3469al1K6J0Qk6K6on5Q7p8L1J3lj5P1n5qk2O1o3L4Ol6K4pK3k8J8l5L1N5o0qm4
$$ plain form
3503 -57 -24 -54 -4 20 -23 -19 24 -14 -21 -11 12 14 25 -34 -39 -59 -28 2 18 35 23 -22 18 26 -7 34 42 -22 17 -5 -18 7 60
3536 60 -65 -29 -41 6 -15 -36 63 -37 -27 31 41 15 -30 -12 -47 -1 -5 -3 -62 7 -14 -11 10 71 -1 -40 1 10 -28 28 22 -11
3568 -11 55 15 46 20 -4 -8 23 18 -40 -28 -28 -6 -17 -29 -51 -72 -15 7 -61 -82 6 8 -17 -10 8 -75 -5 -13 -43 -69 33 47 -39
3601 -39 4 16 -41 -11 47 11 -33 50 13 -42 15 -18 -22 -20 23 -47 7 -26 8 -5 -4 -48 16 30 26 19 -58 20 4 -24 -6 -16 -63
3634 -63 25 -10 3 -54 -16 -30 9 -6 47 22 -4 -27 53 -26 34 15 11 -20 6 21 37 43 30 66 -3 25 -30 1 38 -31 -42
3665 -42 43 -48 29 18 -25 -3 -10 0 -75 -11 44 -60 -14 -16 -45 1 36 -23 -37 -30 -5 -14 25 -53 -27 -36 -34 -48 -9 -5 -9 76 19 1
3699 1 -6 -25 -20 28 13 6 28 23 -30 34 -15 -36 26 -7 -33 -58 -19 -22 -24 -10 -85 -23 14 11 -31 28 -19 1 30 -2 -30 -1 -18 -20 -46
3734 -46 41 -43 16 38 51 -73 36 15 -37 -28 -1 0 -48 39 -54 11 68 25 -45 69 -46 -4 12 11 27 -13 4 7 26 -15
$$ packed form
3503e7L3l0N0K4m3MM3l8pJ0K3KJ1n9nk0L1L0J6J7j2m5M0Ql3M1Qo4L9k2j3K5N3
3536F0j25L6j2M7k1k1R9j00J0N8J0k6m5J8l5M6mKn9O9k1LK1O1p2l9M1Rl8N6ol3
3568a1O6m0L1k6k4mL1nn8J2%K2j1j2k2k1N7K2o8k1Q8Kk5PJ8q3P0ql0k6J02J4q6
3601c9M3J2n7L0N8l6m4Q3l7n5N7l3mKM3p0N4l3L4j3Jm4O4J4mpp7P8j6k8J8j0m7
3634f3Q8l5J3n7L8j4L9j5N3k5k6k3Q0p9O0j9ml1K6J5J6Oj3L6o9K8n5L1L7o9j1
3665d2Q5r1P7j1m3K2pJ0p5O4N5j04M6kk9M6L5n9j4PK5rL9p8K6rKj4L9MmQ5n7j8
3699Apj9NM8j5pK2nn3O4m9k1O2l3k6k5L9lkJ4p5O2L7lm2N9m7K0K9l2k8K9j7kk6
3734d6Q7q4N9K2J3j24J09k1n2RK7Jm8Q7r3O5N7m3p0J14j15M2J6jJ6m0J7LJ9m1
$$ plain form
3764 -15 11 48 -21 -71 4 -35 -52 21 47 -32 -70 0 42 -15 26 15 16 19 72 -24 7 24 -4 -17 -42 -27 -28 23 -33 20 -27 -73
3796 -73 -14 -15 -86 0 28 -14 -40 102 -1 -37 75 -20 -32 -27 -16 -62 -19 8 -31 -18 -4 -9 -12 18 -39 -19 -7 9 -23 39 22
3827 22 -41 27 47 -11 3 84 -4 -10 -3 -21 30 -11 -49 -36 -13 -12 5 -31 -67 -60 -50 -5 -2 17 -17 -28 10 24 -18 2 26 -52 40
3860 40 68 -3 18 86 44 -18 -42 -32 -28 51 -35 -91 33 -26 15 20 22 -26 -2 58 -34 25 11 -13 -2 29 23 -47 18 -75 16 6
3892 6 -42 -40 -31 12 9 48 -2 -55 2 -10 -20 18 -9 42 9 -9 -3 -8 10 38 4 -28 7 -23 47 4 -31 65 24 -16 10 -6 -45
3925 -45 4 -11 -22 -31 50 -37 -37 7 -25 -97 -7 -17 -49 43 -47 -28 -26 8 38 -7 24 -14 -23 14 12 -8 21 15 41 12 53 36 -6
3958 -6 36 -22 -7 -21 -28 2 9 2 59 -9 -18 15 30 -39 -45 -63 -39 -26 15 -55 9 5 -59 -17 -19 67 45 -44 16 -26 -13 45 50 55 8
3993 8 53 19 39 -14 -5 -14 -29 -1 -12 -66 -3 -23 -30 13 41 47 -56 -12 -19 -5 -43 -11 23 51 -5 -71 -53 -51 -24 -26 -40 -16 -12 -11 -40
$$ packed form
3764a5K6L7o9n0P5l9j7P3K6p9l8P0M2n7M1j1JLN3r6L1J7k8j3k5J5jN1n6N3m7m6
3796g3N9jp1Q6K8m2k6J42j03l6J12r5j2NJ1m6M3K7l9J3J4nlL0n7K0J2J6l2O2j7
3827B2o3O8K0n8J4Q1q8oPj8N1m1l8J3K3JJ7l6l6PJ0M5LJ9l4j1L8J4m2K0K4p8R2
3860D0K8p1K1O8m2o2k4J0MP9q6n6J24n9M1NKm8K4O0r2N9j4k4J1L1op0O5r3R1j0
3892Fm8KRM3lL9n0n3N7j2j0L8k7N1l3j8OnJ8K8l4l2L5l0P0m3l5R6m1m0K6j6l9
3925d5M9j5j1rQ1q7%M4l2p2R0j0l2R2r0J9KL4L0m5L1l8rL7kk0K9oK6k9M1j7m2
3958fM2n8J5j4pL0PpN7o8rL3J5o9oj8K4J3M1p0O4mo4M2kQ6k2q9O0m2J3N8NNm7
3993HM5l4K0n3Rrj5K8j1n4O3k0pM3K8Oj03M4pJ4l8L2L4K8n6o6J8KK7kj4K4MJk9
$$ plain form
4028 -40 -18 20 -56 -64 -4 28 16 -24 -29 -1 15 7 -33 -11 -65 -39 -44 -5 1 -12 0 23 -11 -29 -57 43 12 -11 20 -6 4 -30
4060 -30 63 -15 -39 22 -13 57 -34 37 -4 42 -10 51 -5 27 -20 -53 -8 -15 -47 -8 -6 -44 9 3 76 -10 35 10 38 19 29 -82
4092 -82 -1 -19 22 -3 -18 -51 -25 -33 -59 -12 -18 -40 -36 -45 1 -11 -4 19 25 33 -16 5 -26 47 52 -21 13 -5 9 44 8 15 -37 14 48
4127 48 13 45 -39 -9 19 -9 7 34 6 15 21 51 -5 27 71 -33 -2 -4 12 9 23 9 17 9 -58 -8 -31 -10 -55 -14 -73 -7 22
4160 22 2 -63 -13 45 29 0 -21 12 5 16 2 41 -38 11 37 47 -30 -57 11 31 -6 -12 -16 -56 28 -12 -16 -19 -33 17 -14 1 15
4193 15 -6 63 36 -2 -39 -23 -39 -18 -6 -56 -28 44 12 -7 35 -24 2 4 -32 24 2 6 -48 87 42 40 -16 22 -1 20 -30
4224 -30 -2 22 -19 -11 -36 18 14 -13 -60 -79 -31 -35 9 -43 -78 -5 7 -10 64 44 18 39 -20 13 -5 12 -38 -16 19 -71 46
4255 46 -45 -38 5 8 -32 -34 -4 -39 -46 -7 -8 -36 2 34 11 54 20 -65 -5 -25 19 -26 -40 -44 -29 -16 -45 5 -80 -57 6 -11 -38
$$ packed form
4028d0K2L8p6qO0L2j2m0nK8J6qm0K2n4K6nL9Oj3J2K3l4j8k8J00l1k3L1k6J0l4
4060c0R3p8k4O1l5P0r1P1m1M6n2O1n6L2m7l3M5pl2L9Kl8N3oP3q6M5k5K8j9J0j11
4092h2Q1j8M1k5j5l3K6qk6M7ok2MrM6j2PK3OQm9K1l1P3Np3L4j8J4L5l6Pn2N1L4
4127D8l5L2q4L0K8k8J6K7k8ROL0n6L2M4j04L1kJ6lJ4j4Qqo7N0k3K1m5M1n9O6K9
4160B2k0o5N0N8j6k9k1L3pJ1j4L9p9M9K6J0p7k7O8K0l7omm0Q4m0mlj4N0l1J5J4
4193A5k1O9k7l8l7J6j6K1J2n0K8P2l2j9M2n9K6Kl6N6k2Mn4J35m5kn6L8k3K1n0
4224c0K8K4m1Qk5N4mk7m7j9M8mM4n2l5P3J2j7P4k0k6K1n9L3j8J7n0K2L5r0J17
4255D6r1PM3Lm0kL0l5pL9jk8L8L2k3M3l4q5O0k0M4m5j4mJ5J3k9N0q5K3O3j7k7
$$ plain form
4288 -38 -14 22 17 -7 55 16 -22 29 -4 12 -8 -7 -18 -5 20 10 -3 9 22 -42 -26 -19 -35 -18 86 -15 -113 10 9 -27 -17
4319 -17 38 12 -2 6 -6 -19 -2 5 45 -3 21 8 -3 -14 -14 -22 -103 16 2 55 11 74 18 8 43 -4 69 -67 -17 35 18
4350 18 -49 30 23 -41 -17 -21 -22 -17 7 -8 -92 -37 -3 10 -15 21 -25 -56 -3 -48 -31 15 46 29 -17 43 57 12 28 6 -23 56
4382 56 -3 13 10 -17 -13 -3 1 22 -4 -25 -9 -34 -7 22 60 -26 -3 -18 4 16 -12 2 -92 -35 9 2 23 2 -36 -23 -9 -38
4414 -38 -32 -6 6 -36 -10 22 22 41 -55 -31 -12 57 0 2 17 17 28 41 -10 -26 -23 -11 3 -21 13 7 -34 -29 -82 33 16 -22 -25 -8
4448 -8 18 -9 21 29 46 -49 -97 20 18 -21 7 -3 -32 -56 16 -50 5 20 17 -11 27 24 -31 -19 21 -7 31 37 7 -19 30 0 4
4481 4 12 -42 4 -8 -20 -77 6 -16 -19 -22 16 -64 34 -13 21 -42 -39 15 -1 3 34 18 8 -27 -20 -15 42 0 13 25 -56 -4 30 11
4515 11 37 -16 -54 52 11 44 -2 -12 20 -35 -7 -1 40 -5 17 -47 -59 -3 -43 -36 -23 -17 -61 -58 1 -72 -14 -35 -44 7 -7 5
$$ packed form
4288c8K4L6nk4O2l9l8N1l3J6k0Jj1J3K5j0j3J2J3o4J6Pj6J7J04j01r8J23jl6J0
4319a7N5k6j4Qj2j3J7PM0m8K4j3j1j1%qq1J19j4N3m4O3n6j0L5m7P3j36N0N2j7
4350A8o7P9po4K4mjNK4j5q4N5L4J3k5L6m6l1N3m5J7M6L1j7m6O0J4m5J6k2k9P9
4382E6n9J6lk7MJ0MK1k6k1J6k5K7K9L8q6K3j5K2J2k8J4r4N7M4pK1k1l8J3J4k9
4414c8OK6J2m2K6L2%J9r6K4J9O9n7KJ5%J1J3n1j6LJ2J4k4L4om1Nn3J15j7l8lJ7
4448hK6k7L0QJ7r5m8J17kl9K8j0k9k4P2o6N5J5lk8L8ln5J2M0k8L8Ol0k6M9l0M
4481DQn4M6j2j2n7Q3k2llL8q0R8m7L4o3LN4j6ML1j6j0l5PNN7m2J3J2q1N2L4j9
4515A1K6n3l8J06m1L3m6j0L2n5K8OM1m5K2o4j2N6m0PJ3Om4LN9p3N8k1rN1j4J2
$$ plain form
4547 5 -16 5 14 26 36 20 14 41 15 58 -19 20 21 -16 -28 19 -31 2 -47 17 9 -45 31 -21 -29 -17 -2 -26 20 -3 8 3 23 -49
4581 -49 45 -18 8 9 -13 -12 0 -22 -58 -25 -29 18 -5 4 -12 5 12 52 22 45 -2 3 22 10 37 0 -3 -57 -18 14 51 -25 -43 67
4615 67 6 -49 5 -35 -19 -12 -49 2 5 9 -45 -32 -5 -4 -4 52 -33 71 22 19 37 -15 -21 -55 -48 37 -14 8 21 -49 -19 -20 -9 17
4649 17 22 23 -11 -65 -49 35 46 -35 -36 -53 -40 -8 0 25 -61 -39 2 -18 43 -32 28 -13 -76 -19 7 12 -9 6 -12 10 35 42 50 20
4683 20 31 69 59 26 23 19 -42 10 45 -2 14 -4 -22 -23 -4 -68 -43 2 -44 -16 -32 18 -26 71 10 -8 -49 -42 32 16 22 15 28
4716 28 37 -71 -30 13 7 -39 -18 -17 -49 35 10 -46 29 -31 41 4 17 19 -29 41 5 11 -43 -9 -12 60 -17 -63 -6 -60 -26 -20 2
4749 2 4 41 -6 2 -6 -15 12 17 -6 1 -9 -1 -26 56 16 -7 -47 6 -20 -18 -13 -25 35 20 -48 -40 17 -37 -12 -41 -6 -27 5 -21 -57 -64
4785 -64 49 -17 -10 -20 -48 -50 -44 -39 -5 5 -44 -32 0 50 -4 -33 18 -33 -12 18 -4 23 27 -1 -13 -17 -35 -8 47 -5 1 -22 34
$$ packed form
4547Ek1K1RJ2J0j6oK7k6M3p7L9Jl7j2M7n0L3m9O4qn4P6n2qJ2J5k4M6k3J1nK0p2
4581d9R4o3K6Jk2JJ2k2l6L3mM7k3Rj6J7PM0l0K3m7NJ9j2K7l7ln4L9L2L7p6j8J10
4615F7o1n5N4m0J6Pl7N1LMn4J3K7J%N6q5J04m9lJ8n2ol4PQ5n1K2J3p0L0jJ1K6
4649A7NJl4n4J6Q4J1q1jj7J3L2QK5q6K2M1k0O1p5O0m1o3N7K6Nk1J5j8K2K5PQl0
4683B0J1L8j0l3lmo1N2L5m7J6j8j8jJ9o4K5M5m6K8j6N0m4R7o1j8m1PP4j6OpJ3
4716B8Rj08M1M3om6K1Jl2Q4k5n6P5o0P2l7J3Km8P0l6On4L4lP2p7m6N7n4L4OK2
4749BKL7m7QqrK7Nk3Pj0Qk5Q2m0k3m0N3k6KNj2O0j5o8QN7n4K5k9L5k1L2k6l6p
4785f4J13o6Pj0k8kONL4J0m9J2L2N0n4k9N1n1K1L0k2K7Mk8j2mj8K7N5n2Ok3N6
$$ plain form
4818 34 23 30 9 15 27 -79 -3 -16 5 0 -12 -28 -23 -5 10 -31 -46 -17 66 38 20 -34 -24 32 -32 19 -34 51 -41 -10 -10 -15 -34
4851 -34 53 -4 -25 -25 -23 -17 -29 9 -23 -6 8 2 3 -4 -17 -2 -35 -6 -38 -29 -37 -43 -22 -35 -1 -49 -26 -41 6 4 -45 -48 32 4 -64 15
4887 15 -14 24 8 -10 -109 32 14 -40 -8 -8 -45 8 10 -29 -25 15 -19 14 -5 -11 0 28 -20 -31 10 41 33 -36 -19 -15 42 -25 -5
4920 -5 5 -19 41 -16 3 -33 -51 -4 -40 -37 -32 -9 -13 53 16 34 -45 38 46 8 4 -30 18 0 54 -47 -6 23 38 35 -25 31 0
4953 0 21 4 -17 -18 -22 11 15 32 29 -59 -74 22 27 51 36 -9 1 -72 -6 -9 37 11 -1 -14 13 30 13 54 32 25 -4 -16 44 -4
4987 -4 34 -93 36 46 23 -6 -29 -6 19 -38 20 6 -19 -15 -50 -41 21 -33 -35 -55 -5 -55 51 5 40 36 26 -8 -34 70 12
5018 12 22 -11 8 -10 -23 41 27 -32 -2 -47 21 -31 20 22 -25 15 30 -15 25 -2 5 34 9 6 8 17 -18 -1 -1 28 -1 -5 26 -30
5052 -30 -23 -17 -95 1 -29 -45 23 -8 -7 13 -4 41 33 -4 69 56 -9 -28 13 19 -21 49 48 -1 -28 -12 -7 20 38 -25 -69 -32 -17 -10
$$ packed form
4818C4j1Pk1OJ2j06P6j3K1nj2j6NJ8J5m1j5K9Q3k8j8n4J0N6o4N1n3Q5r2L1%nj9
4851c4Q7n7k1%KOj2L8l2J7J4oJpj3J5l3K9l2RqoK1j3L4m8K3j5M7km9lQ0k8o8P9
4887A5k9L8j6j8r9J41j8n4L2%l7N3Kl9MM0l4L3j9oJ1K8m8j1M1L1qo9J7MN7o7K0
4920eJ0k4O0n7J9l6j8M7l6LNK3mO6l7J8p9Q3Ql8ml4M8j8N4j01M1K9J5lo0N6l1
4953@K1j7k1jmL3MJ7lq8j5R6NK4j5m5J0p3O6lM6k6j2j3K7J7j7M1k2pk9j2O0m8
4987dL8j27J29J0k3k9k3K3K5n7N8j4k5Ml5RO2n4kk0N0n0J06m6L5mj0l4k6J04n8
5018A2J0l3J9j8j3O4j4n9L0m5O8n2N1Km7M0J5m5M0k7PK9k5lKRl5J7%K9k9mL1n6
5052c0POp8R6l0j6O8l1JK0j7M5ql7P3j3o5j9M1Om0P0jm9k7J6NK7J8o3m4L7J5P
$$ plain form
5086 -10 -9 -17 -48 1 6 1 35 -9 21 -16 -30 40 -3 -12 9 25 12 -49 -22 17 -65 28 26 25 -58 29 -36 15 23 8 23 23 41 -6 40
5121 40 -3 37 20 -17 24 -5 3 -3 27 -11 -29 -22 -37 -40 -46 6 0 25 -25 5 -17 25 10 12 -4 -27 -11 3 3 38 3 -4 66 -13 25
5156 25 56 54 5 21 24 4 -15 12 -39 -6 -2 18 -7 -16 -25 40 -34 21 -2 21 -13 -25 46 32 -44 8 -45 29 -28 -73 8 1 41
5189 41 -38 10 -33 35 42 -23 26 -17 -22 58 10 8 -5 -31 -56 -5 -32 26 -45 -6 -22 -56 -12 16 2 -24 -16 -41 -4 26 -27 30
5221 30 12 -10 -21 27 -4 21 28 26 -34 0 -9 15 25 -11 -12 -9 -32 8 24 -10 -16 -31 -1 -22 18 45 3 32 19 24 30 12 48 -21
5255 -21 -30 68 -20 18 20 31 18 -30 4 6 2 7 -14 -28 36 26 52 -21 -17 12 -23 6 54 15 -11 7 37 31 -6 37 -12 -23 -19 -22 -31
5290 -31 5 -29 -6 46 -80 1 3 19 -58 -35 -35 -32 6 -33 29 -41 -16 8 -57 -47 -17 2 5 -10 27 18 3 -8 23 -92 -17 -76
5322 -76 -4 -29 5 9 -40 50 19 81 -14 -57 9 3 31 -55 8 -52 -18 -33 -4 7 -40 -12 35 -40 -22 10 -45 -11 4 -58 -30
$$ packed form
5086a0Jql1M9NnL4m4L0l7j4P0m3rK1J6j3o1K7L9q2R3kjq3Q7o5N1Qj5J5%J8m7M6
5121D0m3M0j7l7M1k9QoL0l8j8Pj5loN2oK5n0L0k2M2j5Kj6k3J6J4%L5l5pP0p9L8
5156B5L1km9J6Lk0j9K7n1L3MK0k5rrO5p4N5k3K3l4j2P1j4p6N2n3P4n7m5Q1pM0
5189D1p9M8m3O8Po5M9m3nQ0m8kj3k6k5N1k7N8p1L9j6l4M4K8j4k6Qk5L7L0n3N7
5221C0j8k2j1M8l1K5Pko0L4rK4J0l6jLk3M0J6l4oj5L0k1M0K7m2K9j3NOj8L6o9
5255b1rR8q8L8KJ1j3m8L4KmNk1j4O4j0K6p3MK9l5K9M8l9k6J8L0ol7M3m9j1Mlr
5290c1L6l4K3N2j26Q1KJ6p7K3%LL8l9O2p0K5K4o5J0L0J9Lj5L7rj5j1L1j15P5n9
5322g6P2k5L4Mm9R0l1O2r5m3O6oK8q6O3o0L4j5K9J1m7K8M7p5J8L2n5L4J5o2K8
$$ plain form
5353 -30 8 -15 -12 -53 5 -12 -30 32 -11 16 -7 -21 -20 2 -19 18 26 45 78 -7 18 1 11 -9 -2 10 -7 1 -16 1 -5 -16 1
5386 1 28 -23 -33 -4 -38 -6 -14 1 5 -20 2 48 7 24 6 -13 11 6 48 3 24 -70 39 -23 -3 37 29 47 -14 36 2 1 5
5419 5 29 60 49 -26 13 -2 42 3 56 23 14 17 -55 -12 -22 -29 -19 2 -16 -7 7 41 -1 -27 -48 6 -40 -12 8 -12 7 6 -39
5452 -39 -48 -6 47 23 -12 63 -37 -61 -20 26 31 0 -23 -16 -42 43 -11 28 -43 26 -24 9 -28 6 65 10 -37 -46 12 -31 -7 -9
5484 -9 16 -6 82 18 -50 7 16 23 -37 38 9 -20 1 45 33 36 6 -68 5 15 40 2 -23 -22 22 21 -43 -26 -4 -37 -23 -10 -27
5517 -27 41 32 13 -6 -32 23 14 -38 4 -44 -10 9 25 30 -41 25 -6 39 8 -41 -37 59 -31 39 19 -27 9 18 0 5 14 42 -19 13
5551 13 -4 -63 -6 21 -3 -20 -60 15 -21 36 33 6 24 -17 -21 -2 -50 -29 -26 -29 -15 -28 -10 -41 -14 -8 -45 9 5 39 -47 -13 11
5584 11 23 15 -4 4 26 71 -17 0 -1 -67 5 17 25 -19 -4 7 -19 2 32 10 1 15 -13 -13 -28 -32 -23 -7 -53 -37 -25 36 -34 -5
$$ packed form
5353c0L8k3Lm1N8j7j8O2m3K7k3j4JK2k1L7QJ9L3q5K5j7J0k0PJ2j7Qj7J7oj1J7
5386AK7n1j0K9l4L2qJ5Mk5K2M6m1J7j8j9K4nM2m5K1r4J09o2K0M0qJ8o1N0l4jM
5419EK4L1j1p5L9j5M4l9N3l3rLp2M3j0pJ0K1j8RJ4L4m2k6k1N4m6K8K0k0J9jm5
5452c9rM2N3k4l5P5j00k4M1M6Nl1k3Pk6Q5n4L9p1O9n0L3l7L4N9n5m7rN8m3K4k
5484iK5k2Q8o4o8N7RPo0P5k9k9K1M4j2Ll0p4P3J0K5l8k5JM4jo4J7K2l3J4J3j7
5517b7O8rj9j9k6N5rn2M2m8L4J9J6Np1O6l1M5l1m9MR6r0P0k0m6L6Rj8NRK8o1L2
5551A3j7n9N7K7k4j7m0P5l6N7lk7J8m1mJ9m8K1LlJ4j3J8l1K7Ol7N4mL4q6L4K4
5584A1J2qj9QK2M5q8J7jo6P2J2Qm4J5J1k6K1L0k2rJ4k8%j5mRJ6m6J6J2O1p0K9
$$ plain form
5618 -5 -18 -29 -43 -8 20 3 -2 -33 10 57 20 27 60 10 31 -32 2 -29 17 22 29 -10 -45 -12 29 12 -26 34 22 40 -10 -16 14
$$ packed form
5618ej3j1j4L5K8j7nl1M3M7l7PL3n0K1o3L4l1M6NPl9l5L3M1j7l8O0j2J8n0oL0
$$ [...]
8191A
##END NTUPLES=NMR FID
##END=
