##TITLE=1H_3PhBBC1410
 CDCl3
 8 sc, 
 17.10.2022
##JCAMPDX= 6.0         $$ Bruker NMR JCAMP-DX V2.0
##DATA TYPE= NMR FID
##DATA CLASS= NTUPLES
##ORIGIN= UXNMR, Bruker Analytische Messtechnik GmbH
##OWNER= root
$$ XWIN-NMR		Version 3.5
$$ Mon Oct 17 14:04:45 2022 Russian Standard Time (UT+4h)  she@DPX200
##.OBSERVE FREQUENCY= 200.1313499994
##.OBSERVE NUCLEUS= ^1H
##.DELAY= (6, 6)
##.ACQUISITION MODE= SIMULTANEOUS
##.ACQUISITION SCHEME= undefined
##.AVERAGES= 8
##.DIGITISER RES= 18
##SPECTROMETER/DATA SYSTEM= spect
##.PULSE SEQUENCE= zg30
##.SOLVENT NAME= CDCl3
##.SHIFT REFERENCE= (INTERNAL, CDCl3, 0, 15.7039)
##AUDIT TRAIL= $$ (NUMBER, WHEN, WHO, WHERE, WHAT)
$$ ##TITLE= Audit trail, XWIN-NMR		Version 3.5
$$ ##JCAMPDX= 5.01
$$ ##ORIGIN= Bruker BioSpin GmbH
$$ ##OWNER= she
$$ F:/spectra/data/she/nmr/H-F/1/audita.txt
$$ ##AUDIT TRAIL=  $$ (NUMBER, WHEN, WHO, WHERE, WHAT)
(   1,<2022-10-17 14:03:40.95 +0400>,<she>,<DPX200>,
      <created by zg, POWCHK disabled, PULCHK disabled
       configuration hash MD5:
       00 E9 B6 7A A2 85 ED C7 34 08 36 98 17 FE 4E 26
       data hash MD5: 16K
       D7 AC 02 EF CB 08 46 EB 6B FC 93 1D 66 6C 43 75>)
$$ ##END=
$$ 
$$ hash MD5
$$ 9B B4 56 CA 9A 02 08 EB 19 CD 27 78 99 B2 78 4B
##$RELAX= 
##$RELAX= 
##$RELAX= 
##$RELAX= 
##$RELAX= 
##$RELAX= 
$$ Bruker specific parameters
$$ --------------------------
##$DU= <F:/spectra>
##$EXPNO= 1
##$NAME= <H-F>
##$PROCNO= 1
##$TYPE= <nmr>
##$USER= <she>
##$AMP= (0..31)
100 100 100 100 100 100 100 100 100 100 100 100 100 100 100 100 100 100 
100 100 100 100 100 100 100 100 100 100 100 100 100 100 
##$AQSEQ= 0
##$AQ_mod= 1
##$AUNM= <au_zg>
##$AUTOPOS= <>
##$BF1= 200.13
##$BF2= 200.13
##$BF3= 200.13
##$BF4= 200.13
##$BF5= 200.13
##$BF6= 200.13
##$BF7= 200.13
##$BF8= 200.13
##$BYTORDA= 1
##$CFDGTYP= 0
##$CFRGTYP= 5
##$CHEMSTR= <none>
##$CNST= (0..31)
1 1 145 1 1 1 1 1 1 1 1 1 1 1 1 1 1 1 1 1 1 1 1 1 1 1 1 1 1 1 1 1 
##$CPDPRG= <>
##$CPDPRG1= <>
##$CPDPRG2= <>
##$CPDPRG3= <>
##$CPDPRG4= <mlev>
##$CPDPRG5= <mlev>
##$CPDPRG6= <mlev>
##$CPDPRG7= <mlev>
##$CPDPRG8= <mlev>
##$CPDPRGB= <>
##$CPDPRGT= <>
##$D= (0..31)
0 1.2 0 0 0 0 0 0 0 0.06 0 0.03 0 0 0 0 0.0002 0 0 0 0 0 0 0 0 0 0 0 0 
0 0 0 
##$DATE= 1666001020
##$DBL= (0..7)
120 120 120 120 120 120 120 120 
##$DBP= (0..7)
150 150 150 150 150 150 150 150 
##$DBP07= 0
##$DBPNAM0= <>
##$DBPNAM1= <>
##$DBPNAM2= <>
##$DBPNAM3= <>
##$DBPNAM4= <>
##$DBPNAM5= <>
##$DBPNAM6= <>
##$DBPNAM7= <>
##$DBPOAL= (0..7)
0.5 0.5 0.5 0.5 0.5 0.5 0.5 0.5 
##$DBPOFFS= (0..7)
0 0 0 0 0 0 0 0 
##$DE= 6
##$DECBNUC= <off>
##$DECIM= 32
##$DECNUC= <off>
##$DECSTAT= 4
##$DIGMOD= 1
##$DIGTYP= 9
##$DL= (0..7)
0 120 120 120 120 120 120 120 
##$DP= (0..7)
150 150 150 150 150 150 150 150 
##$DP07= 0
##$DPNAME0= <>
##$DPNAME1= <>
##$DPNAME2= <>
##$DPNAME3= <>
##$DPNAME4= <>
##$DPNAME5= <>
##$DPNAME6= <>
##$DPNAME7= <>
##$DPOAL= (0..7)
0.5 0.5 0.5 0.5 0.5 0.5 0.5 0.5 
##$DPOFFS= (0..7)
0 0 0 0 0 0 0 0 
##$DQDMODE= 0
##$DR= 18
##$DS= 0
##$DSLIST= <SSSSSSSSSSSSSSS>
$$ [...]
##$SUBNAM2= <"">
##$SUBNAM3= <"">
##$SUBNAM4= <"">
##$SUBNAM5= <"">
##$SUBNAM6= <"">
##$SUBNAM7= <"">
##$SUBNAM8= <"">
##$SUBNAM9= <"">
##$SW= 18.0517283424941
##$SWIBOX= (0..15)
0 0 2 0 0 0 0 0 0 0 0 0 0 0 0 0 
##$SW_h= 3612.71676300578
##$TD= 16384
##$TD0= 1
##$TE= 0
##$TE2= 300
##$TE3= 300
##$TEG= 300
##$TL= (0..7)
0 120 120 120 120 120 120 120 
##$TP= (0..7)
150 150 150 150 150 150 150 150 
##$TP07= 0
##$TPNAME0= <>
##$TPNAME1= <>
##$TPNAME2= <>
##$TPNAME3= <>
##$TPNAME4= <>
##$TPNAME5= <>
##$TPNAME6= <>
##$TPNAME7= <>
##$TPOAL= (0..7)
0.5 0.5 0.5 0.5 0.5 0.5 0.5 0.5 
##$TPOFFS= (0..7)
0 0 0 0 0 0 0 0 
##$TUNHIN= 0
##$TUNHOUT= 0
##$TUNXOUT= 0
##$USERA1= <user>
##$USERA2= <user>
##$USERA3= <user>
##$USERA4= <user>
##$USERA5= <user>
##$V9= 5
##$VALIST= <valist>
##$VCLIST= <CCCCCCCCCCCCCCC>
##$VD= 0
##$VDLIST= <DDDDDDDDDDDDDDD>
##$VPLIST= <PPPPPPPPPPPPPPP>
##$VTLIST= <TTTTTTTTTTTTTTT>
##$WBST= 1024
##$WBSW= 4
##$XGAIN= (0..3)
0 0 0 0 
##$XL= 0
##$YL= 0
##$YMAX_a= 95029
##$YMIN_a= -170075
##$ZGOPTNS= <>
##$ZL1= 120
##$ZL2= 120
##$ZL3= 120
##$ZL4= 120
##$ABSF1= 10
##$ABSF2= 0
##$ABSG= 5
##$ABSL= 3
##$ALPHA= 0
##$AQORDER= 0
##$ASSFAC= 0
##$ASSFACI= 0
##$ASSFACX= 0
##$ASSWID= 0
##$AUNMP= <proc_1d>
##$AZFE= 0.1
##$AZFW= 0.1
##$BCFW= 1
##$BC_mod= 2
##$BYTORDP= 1
##$COROFFS= 0
##$CY= 11.3945322036743
##$DATMOD= 1
##$DC= 2
##$DFILT= <>
##$DTYPP= 0
##$F1P= 2.36226072786647
##$F2P= -0.459571619588291
##$FCOR= 0.5
##$FTSIZE= 0
##$FT_mod= 4
##$GAMMA= 1
##$GB= 0.15
##$INTBC= 1
##$INTSCL= 1
##$ISEN= 128
##$LB= 0.24
##$LEV0= 0
##$LPBIN= 0
##$MAXI= 10000
##$MC2= 0
##$MEAN= 0
##$ME_mod= 0
##$MI= 1.114404
##$NCOEF= 0
##$NC_proc= 0
##$NLEV= 6
##$NOISF1= 3.799351
##$NOISF2= 2.8
##$NSP= 1
##$NTH_PI= 0
##$NZP= 0
##$OFFSET= 15.70392
##$PC= 1
##$PHC0= -18037.49
##$PHC1= 16.60069
##$PH_mod= 1
##$PKNL= yes
##$PPARMOD= 0
##$PSCAL= 0
##$PSIGN= 0
##$REVERSE= no
##$SF= 200.130013532006
##$SI= 16384
##$SIGF1= 3
##$SIGF2= 2
##$SINO= 400
##$SIOLD= 16384
##$SREGLST= <1H.CDCl3>
##$SSB= 0
##$STSI= 0
##$STSR= 0
##$SW_p= 3612.71676300578
##$SYMM= 0
##$S_DEV= 0
##$TDeff= 0
##$TDoff= 0
##$TI= <>
##$TILT= no
##$TM1= 0
##$TM2= 0
##$TOPLEV= 0
##$USERP1= <user>
##$USERP2= <user>
##$USERP3= <user>
##$USERP4= <user>
##$USERP5= <user>
##$WDW= 1
##$XDIM= 8192
##$YMAX_p= 0
##$YMIN_p= 0
$$ End of Bruker specific parameters
$$ ---------------------------------
##NTUPLES= NMR FID
##VAR_NAME=  TIME,          FID/REAL,        FID/IMAG
##SYMBOL=    X,             R,               I
##VAR_TYPE=  INDEPENDENT,   DEPENDENT,       DEPENDENT
##VAR_FORM=  AFFN,          ASDF,            ASDF
##VAR_DIM=   8192,          8192,            8192
##UNITS=     SECONDS,       ARBITRARY UNITS, ARBITRARY UNITS
##FACTOR=    0.0002768,     1,               1
##FIRST=     0,             0,               0
##LAST=      2.2672688,     0,               0
##MIN=       0,             -170075,         0
##MAX=       2.2672688,     95029,           0
$$ Real data points
##PAGE= N=1
##DATA TABLE= (X++(R..R)), XYDATA
0 0 0 0 0 0 0 0 0 0 0 0 0 0 -8 8 -8 8 -8 16 -16 16 -24 31 -32 40 -48 56 -64 72 -82 96 -111 127 -143 160
34 160 -183 207 -231 258 -287 322 -359 399 -442 490 -542 600 -661 729 -804 885 -975 1074
52 1074 -1183 1307 -1445 1597 -1771 1972 -2205 2478 -2806 3206 -3708 4360 -5240 6507 -8492
67 -8492 12071 -20575 87272 4853 -92016 95029 24438 -50515 59745 66123 -79741 -34552
79 -34552 26455 -41698 -35609 53321 -3955 -80529 -30743 31202 3103 -19803 -2031 5764 -16311
92 -16311 -2506 23866 -286 -18704 23037 12326 -28844 28279 68546 -22485 -47902 38208
104 38208 34817 -22198 5779 10015 -43154 -24077 20920 -2892 -9711 19694 -7105 -52483 -21090
117 -21090 39415 32172 -20729 -24318 12516 6453 -8605 24928 25015 -21750 -7954 15297 -23272
130 -23272 -3965 58150 1009 -63474 12496 48660 -23992 -14837 36526 -13955 -37015 25887
142 25887 14005 -35203 8586 26227 -39223 -23805 50485 13831 -49467 -6701 28365 -11011
154 -11011 -7818 30197 159 -27949 10428 14411 -21288 9382 40399 -18251 -44851 21492
166 21492 39088 -13283 -13142 14492 -9287 -21214 10305 7235 -16830 1796 10656 -23480 -17317
179 -17317 32384 21919 -25941 -10594 25416 4855 -13692 10704 9728 -14408 -1075 11333
191 11333 -12581 -8290 19013 -5153 -31319 7930 31136 -10461 -23719 13073 13036 -14491 -1315
204 -1315 14471 -7115 -9854 11223 -2923 -15438 20453 24322 -25654 -19136 32006 13461 -24848
217 -24848 3132 18253 -15007 -9475 12869 -11931 -14749 20762 45 -35342 4479 31119
229 31119 -12779 -22375 18474 13455 -13590 1411 12121 -4879 890 14595 -5402 -13149 15117
242 15117 14806 -17539 -9978 21384 5249 -22257 -2528 14991 -5095 -11134 3035 -6144 -10391
255 -10391 10979 3433 -21600 -627 23088 -6384 -20613 14477 21182 -9977 -9748 11068 5404
268 5404 -122 8730 -1295 -12681 8935 17394 -11972 -15064 15142 7655 -22507 -6859 18914
281 18914 -521 -16323 -548 -1464 -10350 8499 10975 -17426 -9717 20317 1556 -19028 12405
294 12405 23784 -13072 -15349 16571 11480 -5603 4929 2070 -13752 3586 17896 -8365 -15719
307 -15719 12422 6468 -22976 -5961 20792 659 -18699 -3314 2911 -2978 7919 6988 -16198
320 -16198 -9569 17225 5592 -14147 7560 19469 -10334 -16498 12834 15653 -3720 -1573 1186
333 1186 -10103 858 17560 -2068 -17335 4316 8146 -15823 -6242 20422 2635 -22278 -5093
346 -5093 10722 -208 2322 8253 -10366 -11923 14022 9043 -13867 2118 17293 -11152 -19228
359 -19228 15030 19496 -8597 -8432 3039 -4997 1074 17931 -1023 -19313 4344 12695 -14018
372 -14018 -7898 21017 2443 -24872 -3836 14777 -694 -1010 7393 -10314 -12953 16125 12565
385 12565 -14644 -2143 15308 -9748 -18005 15381 17921 -12163 -11330 5816 -492 -404 13133 149
399 149 -16150 2031 12747 -7949 -6854 16323 2908 -22994 -5404 17904 4230 -6855 453
412 453 -4927 -7490 11813 11393 -12002 -6195 12433 -4216 -16677 9752 17828 -11362 -16481 4965
426 4965 4837 -1183 9107 3020 -14486 250 17178 -3393 -10530 14218 7649 -21124 -4844
439 -4844 21632 1500 -14363 2657 514 -10685 8968 12626 -16177 -9978 15201 -2644 -18044
452 -18044 11746 17328 -16915 -15909 11439 7305 -1976 8708 1391 -13656 4482 18388 -4125
465 -4125 -9327 13920 5777 -20668 -5710 18092 1200 -13549 -423 263 -8080 6042 9383
478 9383 -12252 -8224 14419 1323 -15816 5523 15349 -9828 -13014 10364 8639 -5483 238
491 238 3418 -5417 2544 13919 -1457 -11215 5888 8312 -12344 -6759 16858 4523 -19011 -5752
505 -5752 8732 -2214 -1025 9618 -6616 -13107 11118 8170 -16817 538 21487 -8106 -22242
518 -22242 10280 13682 -10677 -579 10708 -8025 -3910 16260 -826 -14271 11806 14226 -15213
531 -15213 -8016 15833 684 -15186 2301 8173 -6103 -2838 4350 -6859 -6040 11318 3905
544 3905 -13850 -866 12619 -6176 -14064 9462 12464 -8984 -6112 6816 -1118 -901 11346
557 11346 818 -9936 7492 10675 -11928 -7079 14451 4481 -13887 -4032 5521 -2832 -3337 2325
571 2325 -2128 -3937 4079 2227 -9463 -2955 13212 3038 -14013 -38 13778 -5083 -10389
584 -10389 11401 7231 -9699 3184 7655 -10858 719 18000 -7260 -16648 13546 8546 -20397
597 -20397 -3114 16871 -4244 -11010 6841 488 -8074 7504 6295 -11052 -666 14799 -2380
610 -2380 -15397 3505 12777 -4706 -9341 4385 2658 -7002 1286 5590 -4759 611 10816 -5426
624 -5426 -12737 11681 13306 -10999 -5918 11054 -1394 -9043 5405 4916 -5293 1403 2232 -9011
638 -9011 -2228 10419 -164 -12079 -143 8829 -2771 -9372 2877 7703 -3659 -4262 5234 2158
652 2158 -1244 6639 1554 -8766 5798 14488 -8855 -13337 11208 7449 -12424 -1663 8440
665 8440 -7031 -6218 6476 -2850 -6087 10935 3721 -16699 -2179 15675 -889 -10534 5821
678 5821 5967 -8023 -2009 7411 -946 -2088 6146 -1782 -8565 6437 11048 -7676 -8912 9306
692 9306 5350 -9952 -1542 8645 -2288 -5727 3507 190 -4330 5533 3128 -11326 -2891 13463
706 13463 178 -13805 501 8726 -4002 -5120 5606 1893 -4051 1823 1005 -4433 4727 10485
720 10485 -4599 -9990 5801 9240 -5741 -4627 6758 559 -7587 768 4522 -3771 -748 4078
734 4078 -7429 -6525 10843 4483 -13549 -1682 12126 -3791 -9598 7389 5227 -7082 947
747 947 5198 -4774 1374 9909 -4839 -10810 8517 10477 -8560 -5922 8032 1660 -7199 965
761 965 4028 -3218 -547 3052 -5848 -5026 8762 3724 -12337 -3072 10974 -195 -9161 3842
775 3842 6017 -5841 -1841 5688 -1984 -1709 7493 -935 -8866 5647 10885 -6324 -7319 8080 4243
790 4243 -7537 -358 5875 -2626 -3945 2412 -2166 -3945 5999 2996 -11567 -4166 11142 1065
804 1065 -10669 1709 8377 -4342 -4304 6147 984 -2899 5562 1200 -8695 3750 11857 -4925
818 -4925 -9187 7698 6377 -7771 -1920 6720 -2250 -4263 3314 -979 -5766 4269 4002 -9473
832 -9473 -3977 9914 828 -10542 1465 8304 -3903 -5030 5730 2025 -3770 3114 1910 -5927
846 -5927 2679 9477 -4483 -8705 7295 7770 -7385 -3984 6911 252 -5062 1884 687 -4274
860 -4274 2477 3547 -7909 -4619 9650 2230 -10769 -653 9094 -2464 -5983 4829 2874 -4413
874 -4413 2347 3616 -5405 274 8912 -2480 -8926 6371 8031 -7253 -4776 7629 1162 -6193
888 -6193 1626 2989 -4140 183 3824 -5802 -4826 8053 2360 -10829 -1186 10656 -1720 -8527
902 -8527 4470 4884 -4480 880 4264 -4552 -769 8812 -2603 -9405 6346 8662 -7624 -5543
916 -5543 7673 2161 -5490 1202 2692 -3285 423 3867 -3947 -4068 5935 2643 -8374 -1794 8139
931 8139 -554 -7643 2071 5186 -3869 -2280 3379 -1679 -1919 5240 -688 -7497 3843 7635 -5444
946 -5444 -5582 7911 4532 -5743 -834 4624 -348 -750 2484 -2631 -4274 4449 3468 -7894 -3907
961 -3907 8123 315 -9920 403 7151 -2949 -3543 4466 -1485 -3792 5856 2001 -7716 2910
975 2910 9784 -5429 -6726 8610 4701 -7146 -36 5953 -2442 -2503 3581 -2499 -4258 4879 2749
990 2749 -8107 -2672 7640 -476 -8465 2244 6782 -3360 -4468 2766 515 -1588 4278 353
1004 353 -6797 1814 7313 -3538 -5145 6854 4830 -5988 -2376 4499 1078 -684 1455 -576
1018 -576 -3194 1795 2665 -4329 -3429 4976 1916 -7854 -2443 6694 -793 -6487 2537 3697 -3813 -441
1034 -441 3469 -3607 -566 8306 -412 -7583 4574 6901 -6449 -3343 8632 2054 -5911 305
1048 305 991 -3232 2117 4592 -5323 -5287 5342 1345 -8247 -146 8250 -2019 -7295 1960 3327
1063 3327 -2425 2049 3288 -4588 -623 6609 -1497 -5888 5343 5774 -5814 -3246 5711 1060 -3675
1078 -3675 949 1827 -1569 835 1316 -3829 -2226 4458 1678 -5027 -1279 4614 -927 -5917 1184
1093 1184 5365 -528 -2980 490 -873 -728 4339 1252 -5182 796 5844 -3188 -5434 5842 5695
1108 5695 -5283 -3116 3457 182 -1797 3038 -60 -4842 1801 4485 -5589 -3485 7539 1148
1122 1148 -8084 527 5791 -3003 -3650 3669 -213 -2687 3866 1015 -6504 1343 7122 -3175 -4900
1137 -4900 5702 3764 -5978 -1890 5356 1265 -1753 1476 -1126 -3754 3061 3894 -4587 -2632 5500
1152 5500 556 -7891 -109 6892 -964 -4749 963 -83 -2428 2431 1557 -3871 157 5190 -1749
1167 -1749 -4804 3425 5381 -3229 -3078 3799 2184 -2764 -67 1862 -1638 11 3460 -2421 -4521
1182 -4521 4134 3295 -6396 -2053 7395 -825 -7442 1422 3914 -3167 -277 2937 -4030 -2133 6084
1197 6084 -375 -6122 3453 6542 -4836 -4585 6056 3060 -3322 499 2354 -2527 458 3888 -2427
1212 -2427 -4147 4388 3007 -6653 -2513 6447 -172 -6589 1040 3432 -2933 -1546 2867 -1938 -1980
1227 -1980 4436 693 -5383 2230 6130 -3246 -4160 5161 3560 -4200 -913 3303 -846 -1008 2389
1242 2389 -1389 -3367 3119 2717 -5408 -3009 5687 963 -6468 -148 4792 -1628 -3299 2144 -120
1257 -120 -2475 2811 1707 -5192 348 6738 -1675 -5761 4255 4998 -4223 -1314 4662 -363 -2432
1272 -2432 2668 3 -3821 2523 3823 -4929 -3246 5467 1061 -6417 -103 4981 -2135 -3996 2325
1287 2325 946 -2273 1391 1361 -3916 167 6464 -1238 -5577 3602 5594 -3785 -2805 4502 915 -3017
1303 -3017 1649 917 -3236 1654 3687 -4661 -3860 5478 2290 -6419 -909 5121 -1416 -4022 2254
1318 2254 1789 -2392 476 1949 -3079 -923 4976 -690 -5756 2396 5572 -3372 -3314 4669 1640 -3839
1334 -3839 642 2964 -1408 538 3484 -3034 -3811 5045 2944 -6058 -1568 5588 -430 -4960 1045
1349 1045 2060 -2523 -888 1689 -2672 -905 4578 -343 -5657 1595 5479 -2487 -3631 3762 2452
1364 2452 -2923 184 3162 -1429 -292 2774 -1758 -3567 3912 2828 -5293 -2291 4327 -568 -4716
1379 -4716 824 3048 -2067 -1921 1562 -1054 -1111 3197 -15 -4873 1191 5199 -2098 -4596 3425 3103
1395 3103 -3473 -859 3237 -43 -1059 1964 -1031 -3100 3314 3304 -4389 -2926 4482 868 -4810
1410 -4810 342 3653 -1748 -2719 1712 -299 -1645 2213 1112 -4501 -162 4871 -1211 -4576 3032
1425 3032 3923 -3542 -1595 4195 683 -2501 2128 494 -2457 2462 3181 -4486 -2959 4937 1145
1440 1145 -5110 128 3974 -2095 -3022 1368 524 -1197 1119 222 -3947 -39 4496 -552 -4443 1792
1456 1792 3612 -2396 -2196 3491 1456 -2009 810 929 -1725 1214 3119 -2555 -2979 3440 1747 -4185
1472 -4185 -809 3607 -897 -3682 698 1585 -1283 -589 845 -1629 -227 3340 -1 -4215 1206
1487 1206 4536 -1921 -3111 3548 2439 -3063 -557 2013 -1084 202 3134 -2563 -3775 3300 2707
1502 2707 -4419 -1412 4236 -340 -4197 1128 2259 -1498 66 1651 -2531 -1164 3436 104 -3821
1517 -3821 1024 3716 -2479 -2918 2927 1897 -2612 -151 2243 -762 -139 2166 -1256 -1703 3494 2309
1533 2309 -3842 -1432 3860 250 -3484 299 2668 -1036 -1531 247 -813 -461 2150 262 -3457
1548 -3457 -121 3761 -962 -3560 2148 3456 -2186 -2118 2526 938 -809 1978 475 -2497 1170
1563 1170 3180 -2925 -2704 4100 1489 -4828 -729 3256 -1162 -2600 1694 560 -2037 1320 857
1578 857 -3237 -325 4491 -1172 -4516 2194 3803 -2957 -1956 3279 651 -1748 1539 327 -2036
1593 -2036 2473 3158 -3068 -2002 4068 892 -4179 -268 3216 -513 -2398 649 166 -1362 716
1608 716 698 -2283 -802 2693 -646 -3618 1326 3386 -1669 -2370 1815 1000 -1837 871 1941 -766
1624 -766 397 2129 -1616 -1885 3287 2116 -3438 -1599 2988 173 -3180 5 1797 -1330 -1020 951
1640 951 -1398 -953 2885 652 -4217 632 4470 -1535 -3765 2700 2379 -2537 57 2421 -1455 -619
1656 -619 3095 -841 -2467 3191 2722 -4168 -1842 3917 202 -2986 602 1423 -2092 -1169 1734 -515
1672 -515 -936 1943 -29 -3808 678 4152 -954 -3361 1976 2155 -2394 -537 2343 18 -712 1262
1688 1262 -831 -1727 2846 2532 -3247 -1817 3631 1119 -3197 -575 2002 -834 -1565 1121 -16 -1399
1704 -1399 1000 646 -2493 -303 3600 -185 -3804 1029 2860 -1760 -1184 2475 91 -2336 1157
1719 1157 1228 -1773 1318 2583 -2497 -2740 3830 2237 -3413 -256 2892 -1270 -2078 1440 506 -1651
1735 -1651 395 353 -2709 -429 3879 -676 -4341 857 3031 -1392 -2004 2400 604 -1777 755 1391
1751 1391 -1207 932 2814 -2178 -2439 3699 2447 -3333 -1257 2508 -617 -2346 1116 675 -1974
1766 -1974 -689 675 -1791 -490 2819 -226 -3712 492 3044 -1090 -2155 2164 1201 -2179 -203
1781 -203 1828 -381 141 1434 -1337 -2272 2782 2909 -3105 -2206 2760 463 -2601 695 1504 -1556
1797 -1556 -874 1101 -1161 -655 2613 53 -3929 335 3524 -706 -2333 1320 910 -2129 -252 2320
1813 2320 -642 -776 1368 -690 -1618 2553 2822 -2523 -1798 2756 972 -2576 385 2120 -1803 -1439
1829 -1439 785 -207 -1010 1845 -62 -3605 -17 3414 -574 -3257 1205 2012 -1969 -818 2077 -48
1845 -48 -994 1306 -57 -1715 1853 2843 -2275 -1976 3082 1665 -2308 -229 2112 -1127 -1748 997
1861 997 -123 -1366 777 253 -2449 -640 3099 -258 -3004 895 2208 -1752 -1318 2200 317 -1465
1877 -1465 467 743 -1164 1305 2242 -1805 -1802 2903 1829 -2463 -421 2448 -125 -2106 406 623
1893 623 -1165 268 396 -2036 -348 2637 250 -3003 642 2591 -942 -1500 1618 648 -1503 580
1909 580 869 -928 146 1952 -964 -1555 2114 2023 -2054 -922 2495 303 -1868 -78 1236 -774
1925 -774 -413 501 -1290 -749 2019 15 -2946 226 2689 -885 -2523 1472 1638 -1269 -142 944
1941 944 -553 125 1628 -670 -1822 1865 2335 -1935 -1471 2694 719 -2361 -37 1410 -994 -643
1957 -643 1004 -1081 -1188 1527 598 -2386 -27 2518 -872 -2665 1380 1822 -1452 -608 1198 -199
1973 -199 -661 1663 -340 -1351 1701 1804 -2039 -1215 2783 1089 -2392 -757 1620 -311 -882 509
1989 509 -521 -1082 849 640 -1664 -264 2092 -541 -2254 599 2343 -940 -1303 863 160 -864
2005 -864 1124 590 -1366 241 1642 -685 -1319 2505 1670 -2222 -1383 1969 445 -1207 635 471
2021 471 -1600 -53 1113 -1593 -619 1973 -462 -3116 695 3132 -1117 -2350 982 498 -1082 806
2037 806 1012 -1440 378 2048 -894 -1565 2365 1634 -2268 -1096 2136 773 -1127 358 94 -1176
2053 -1176 483 1299 -1137 -1234 1195 -523 -2205 975 2415 -765 -2061 765 971 -310 646 840
2069 840 -832 -210 1139 -89 -804 1562 1180 -2245 -1579 2135 905 -1496 -468 871 -621 -289
2085 -289 1094 -479 -1286 829 441 -2164 -199 2640 -456 -2668 489 1909 -799 -94 902 -826
2101 -826 -1115 1736 537 -1434 946 1366 -2088 -1204 2833 1296 -2066 -628 1240 -589 -263 1557
2117 1557 -309 -1790 614 119 -2163 297 2348 -1078 -2814 466 1632 -747 -611 814 -436
2132 -436 -400 1385 353 -1094 1019 1633 -1336 -1240 2307 1355 -1620 -704 1234 53 -372 589 -155 -1253
2150 -1253 428 601 -1297 -432 1534 -214 -2622 97 2258 -181 -1492 520 144 -924 525 1247
2166 1247 -966 -147 1295 -941 -1520 1867 1720 -1896 -1335 1951 449 -1091 671 605 -964 67
2182 67 975 -1309 -650 2126 -95 -2613 306 2198 -654 -1978 598 585 -529 778 959 -1151 -82
2199 -82 1475 -457 -1247 1652 1511 -1898 -879 1996 632 -1111 351 375 -954 59 744 -557 -756
2216 -756 1246 -324 -2202 378 1961 -484 -1627 447 835 -552 4 549 -162 -23 1072 -106
2232 -106 -1333 792 1836 -1517 -1423 1471 1189 -1342 -407 1136 -377 -79 1059 -541 -912 1320 484
2249 484 -2160 -404 1818 -679 -2125 449 1418 -897 -285 885 -419 -506 1084 195 -1379 704
2265 704 1436 -1163 -1322 1708 1380 -1688 -291 1253 -404 -553 229 -432 -632 898 578 -1744 -722
2282 -722 1619 -138 -2044 281 1557 -682 -802 571 -61 -318 644 163 -1084 454 1624 -786
2298 -786 -1328 1145 1161 -1369 -710 1343 69 -864 369 306 -384 682 930 -1192 -516 1318 443 -1915
2316 -1915 213 1165 -628 -1349 562 534 -811 169 351 -994 199 1430 -764 -1423 994 1330 -1154
2333 -1154 -519 1512 581 -762 216 627 -360 523 712 -1173 -804 1180 425 -1797 45 1344 -666
2350 -666 -1380 666 891 -802 114 455 -725 32 1116 -118 -1290 801 1593 -1303 -967 1935 508
2367 508 -1355 29 837 60 -37 642 -553 -981 1169 692 -1396 -422 1201 -412 -1405 404 1168 -837
2385 -837 -435 370 -497 34 1042 317 -1623 331 1517 -404 -1032 1546 1078 -1336 -31 1043 -32
2402 -32 -413 784 -115 -854 1051 599 -1267 -416 1147 -431 -1654 522 1087 -701 -862 395 11
2419 11 -297 588 93 -1048 463 1249 -566 -929 1186 999 -1220 -584 1312 405 -382 283 -12 -478
2437 -478 639 985 -1307 -508 1162 128 -1499 101 1197 -535 -868 594 230 -643 637 311 -1045
2454 -1045 59 1020 -407 -1108 608 965 -1041 -553 1308 129 -870 144 346 -434 234 639 -1175
2471 -1175 -534 1229 179 -1308 -110 1247 -351 -1403 420 620 -566 170 153 -775 -158 1299 58
2488 58 -1188 661 1230 -900 -594 1350 410 -887 12 741 -375 229 971 -710 -635 938 283 -1448
2506 -1448 -139 1076 -395 -1203 453 686 -688 -226 254 -481 -116 967 51 -1143 558 1236 -551
2523 -551 -974 1156 740 -830 99 603 -97 -71 305 -191 -519 809 611 -913 -328 1262 -32 -1086
2541 -1086 126 869 -432 -588 353 36 -282 562 332 -1072 179 1284 -373 -1056 1083 640 -1036
2558 -1036 -525 1175 101 -442 462 -87 -597 596 430 -1203 -273 1371 114 -1333 3 1149 -515
2575 -515 -666 -19 -125 -242 174 -76 -927 410 1010 -534 -1211 817 974 -855 -151 885 393 -653
2593 -653 291 59 -460 384 657 -595 -545 905 390 -1225 -90 1027 -492 -745 605 601 -538 -80
2611 -80 55 -582 -300 801 -155 -997 787 1120 -637 -717 1056 544 -829 81 578 -415 10 476 -566
2630 -566 -552 1002 522 -1253 -368 884 -424 -1032 323 222 -512 -61 74 -330 -310 1206 -144 -954
2648 -954 605 1207 -711 -420 1039 474 -710 1 434 -566 -155 405 -542 -758 914 249 -900 -210
2666 -210 1057 -247 -804 116 563 -103 -105 62 -411 -235 590 1 -803 261 1169 -429 -899 765 748
2685 748 -441 -373 895 -31 -318 635 141 -671 642 774 -787 -595 1026 100 -1016 -21 691 -459
2703 -459 -702 463 -77 -577 496 213 -703 121 809 -578 -597 700 779 -827 -369 597 0 -224 567
2722 567 178 -380 181 605 -614 -483 1162 51 -1020 74 770 -225 -358 289 99 -344 406 68
2740 68 -567 -124 707 -91 -910 551 721 -387 -328 637 492 -389 12 115 -524 225 271 -488 -347 614
2760 614 333 -810 113 1017 -148 -690 -63 220 -222 -100 68 -725 -265 519 -126 -834 295 868 -658
2779 -658 -284 834 557 -448 346 390 -273 173 492 -172 -207 662 159 -842 -267 922 -373 -594 152
2798 152 345 -485 -331 97 -344 -328 524 -187 -835 91 796 -693 -378 683 625 -580 -178 490 -208 -155
2818 -155 410 -200 -463 820 423 -917 -170 948 -141 -687 -9 550 -192 -355 -10 -209 -424 311 43
2837 43 -682 272 817 -533 -567 566 593 -762 -288 487 74 72 373 -103 -212 275 456 -479 -202 784 -47
2858 -47 -783 -143 772 -130 -479 183 -268 -198 145 -158 -685 47 606 -370 -714 256 970 -629 -527 484
2878 484 100 -304 48 230 -515 182 628 -199 -147 586 96 -1028 -319 491 -345 -616 157 191 -149 172
2898 172 33 -558 -13 237 -414 -692 328 849 -484 -433 596 498 -227 11 430 -298 212 582 -39 -87
2918 -87 711 176 -823 -196 819 -2 -862 148 434 -23 -247 141 -527 155 403 -27 -690 271 693 -451
2938 -451 -560 568 210 -200 98 277 -283 -201 425 132 -310 297 335 -653 -161 764 211 -507 62 510
2958 510 -170 61 520 26 -363 344 -65 -555 93 501 -459 -577 604 129 -358 -358 184 -101 102 334
2978 334 -215 -306 231 474 -441 -341 906 429 -405 -62 543 -25 -498 126 -6 -350 349 9 -581 87
2998 87 392 -74 -693 631 513 -323 -260 469 295 48 5 -36 -163 101 277 -552 -178 796 164 -719 54
3019 54 456 -347 -404 283 117 -453 -198 41 -334 -166 765 -62 -790 542 473 98 -242 523 -38 -250 251
3040 251 130 -171 212 275 -301 -460 411 423 -464 31 403 232 -480 84 244 -340 -18 -181 -398 -2 519
3061 519 -328 -174 270 547 -292 -516 166 480 -428 21 219 -16 109 48 -246 -154 640 492 -436 -61 641
3082 641 16 -827 291 323 -80 80 101 -246 -161 468 -313 -619 -103 575 -198 -645 288 33 -540 -30 538
3103 538 80 -172 195 -314 -301 612 396 -403 -423 775 133 -232 136 270 -198 -122 192 -61 -87 237 -15
3124 -15 -672 239 553 -227 -422 89 164 -198 -470 266 32 -113 -28 138 -230 396 752 -520 -165 529 284
3145 284 -403 16 229 -209 -480 -99 227 -62 156 133 -474 -336 649 -29 -730 523 501 -316 -305 343 261
3166 261 -281 -24 -100 -5 178 426 -417 -299 649 412 -694 99 316 -290 -215 283 -38 -125 211 175 -698
3187 -698 -318 483 -191 -534 19 170 -447 -145 405 -7 -144 -275 266 -37 91 353 -289 26 451 185
3207 185 -301 124 518 -115 -486 203 183 -152 83 1 -175 -49 356 -183 -520 20 647 47 -375 293 101
3228 101 -594 -355 306 62 75 287 25 -645 664 240 -629 -186 121 4 -404 113 342 -185 -251 105
3248 105 -281 48 178 -47 -526 40 356 -143 -514 370 512 -379 289 218 193 -195 225 -321 -438 296 561
3269 561 -299 -188 423 252 -471 150 202 -174 100 115 151 -75 301 33 -425 1 670 -458 -693 389
3289 389 207 -498 -45 530 21 -52 184 176 -281 186 266 -411 -232 609 6 -565 56 492 -133 -45 17 102
3311 102 -423 52 0 -222 85 189 -421 -572 198 308 -308 -266 84 -80 -83 119 252 -416 263 181 -377 -164
3333 -164 245 11 -581 -161 323 -181 -233 -91 68 -260 131 211 -257 -9 200 -388 -317 -122 353 -311 -194
3354 -194 43 220 -229 -61 0 -236 56 238 -5 -238 487 132 -481 -80 519 21 -158 120 95 -173 11
3375 11 188 -231 52 262 -105 -458 253 229 -223 -642 234 187 -134 -168 103 -153 154 176 -6 -280 436 164
3397 164 -518 -18 595 -30 -321 29 272 -215 63 176 2 -289 -32 -26 -532 180 264 -399 -540 466 436
3418 436 -387 -18 39 -200 -114 -10 106 20 244 219 -266 -4 452 64 -361 150 206 -76 64 334 30 -90
3440 -90 86 206 -353 33 449 -344 -432 387 334 -312 -435 389 74 -239 268 180 -176 109 265 -335 100
3461 100 492 40 -493 -139 526 -267 -245 393 24 -101 228 13 -374 96 374 -133 -409 32 329 -114
3481 -114 -276 365 179 -474 -28 232 -347 211 140 -82 -214 58 62 -313 -239 228 22 -296 85 -83 15 -25
3503 -25 358 -45 73 593 -204 -472 351 342 -212 -249 -57 -13 -50 163 23 -45 -29 103 -48 -240 382 537 -236
3526 -236 -135 597 -37 -289 -36 173 -129 357 -12 -302 -142 293 107 -266 143 423 -215 -220 180 381 -521
3547 -521 -68 186 15 -7 474 -50 -354 325 -141 -596 -267 537 96 -213 115 190 42 -123 286 52 31
3568 31 331 20 -320 279 313 -104 -235 -1 60 -150 -154 219 -243 -209 101 66 -376 0 164 -143 -51 358 -169
3591 -169 -433 139 177 87 -54 272 -13 -56 193 36 -213 30 263 -302 -549 221 334 -442 -331 133 148
3612 148 -128 80 61 -301 371 439 -418 -325 413 284 -401 32 225 -318 -334 176 226 -197 -111 222 -265 -161
3634 -161 295 -271 -435 104 625 -88 -281 267 -140 -178 97 164 -265 2 67 -502 -155 244 69 -563 93
3655 93 414 107 -256 42 146 94 124 72 20 -75 399 -121 -343 87 419 -106 -293 172 -8 -426 -137 244
3677 244 -233 46 239 -8 -171 189 536 -220 -4 310 146 -122 185 76 -115 -51 166 -24 20 445 -11
3698 -11 -247 6 308 -63 -455 299 40 -258 -107 104 201 70 200 -297 -173 -83 -9 -327 -28 124 -82
3719 -82 -95 105 288 20 255 94 -87 32 303 56 -174 2 557 154 -162 166 75 -282 -93 134 -56
3740 -56 -109 50 -114 -225 387 -12 -38 -279 337 19 -85 -106 130 -9 -154 185 296 -51 -14 189 -370 -32
3762 -32 233 -94 -317 262 225 -65 -16 12 -242 -274 115 -7 -132 198 195 -182 119 322 436 -224 -136 315 73
3785 73 -27 147 91 -44 327 -1 -174 21 263 -32 -285 185 152 -138 -37 582 -22 -240 -125 -55 -244
3806 -244 -57 169 -278 -526 516 273 -386 243 252 97 -374 178 188 -60 117 -90 -89 -18 29 122 -103 105
3828 105 345 -186 -144 185 62 -82 -245 130 39 -147 28 -157 -199 77 259 -235 210 277 204 -316 135 72
3850 72 0 -270 -31 48 -151 104 135 -568 -128 432 -203 -210 44 218 -126 62 245 -56 52 65 -107 -141 26
3873 26 45 -47 -222 156 173 -328 74 203 -169 -218 102 -47 -149 62 95 -184 130 361 240 -132 94 82
3895 82 121 -90 70 191 -263 83 -52 -279 28 -160 -279 -189 173 415 -231 -139 213 46 -314 -73 -93 18
3917 18 42 170 -219 -79 369 83 -292 261 62 -109 -101 177 178 -38 -105 103 -278 30 43 -267 -277 167 134
3940 134 -382 16 303 -62 -188 -135 8 -508 128 125 -28 -92 428 -160 -424 225 35 -176 -348 306 155
3961 155 -456 139 77 -135 -399 16 -227 -166 197 183 -429 -127 169 -130 -189 -35 205 116 -110 334 -243 -8
3983 -8 216 -167 98 163 390 -86 -102 6 -122 -244 -78 360 -128 32 60 -55 -126 5 138 -333 27 142
4005 142 86 -408 -97 251 152 -218 50 -41 -60 66 227 -289 122 455 -262 -374 122 371 -214 -133 74 95
4027 95 -451 159 -11 -129 135 59 -290 -218 454 -315 -448 113 190 -49 -192 -14 74 -269 192 -14 -220 117
4049 117 135 103 -277 387 304 -274 -264 237 -79 126 145 -47 -453 -27 56 -29 -276 442 213 -450 48 479
4071 479 197 -389 154 7 -36 41 185 -353 -12 243 27 -87 91 162 -93 7 113 159 77 -35 -34 55 215
4094 215 195 -238 -162 74 -218 -213 -148 333 386 -53 151 22 -96 22 310 -61 -160 145 71 -101 169 192 -127
4117 -127 -496 218 86 -164 -40 108 -235 -308 190 -68 -5 113 154 -85 -393 154 219 -319 -214 -14 -112 9
4139 9 229 175 17 227 101 -330 27 123 -204 -204 150 310 33 61 215 -226 -313 -33 35 -44 89 268 -12
4162 -12 -113 450 134 -124 -239 -17 157 -218 260 12 -60 93 304 -178 221 223 10 -169 23 128 230
4183 230 -209 56 -16 -3 99 -39 25 0 144 -192 -348 234 -23 -411 -301 -6 4 -145 78 62 -205 89
4205 89 161 4 28 122 109 -430 -177 128 -224 -70 126 143 -9 59 -142 -262 13 258 -44 -152 299 74
4227 74 -276 -81 397 20 -93 -49 -82 -63 -35 116 -187 57 152 153 26 89 166 120 -103 123 304 15 -43 54
4251 54 12 49 -73 -81 -48 147 232 -337 -274 324 11 -144 -63 72 -16 30 136 -73 20 -19 -153 -221 136 254 25
4276 25 -272 121 -35 -88 180 148 -9 -155 357 -15 -70 -20 -145 -199 -391 226 45 -177 103 168 -107 -263
4298 -263 338 221 100 234 -10 -77 -19 542 -87 -150 -18 -19 -68 -148 76 118 -88 -130 234 -216 51 342 -84
4321 -84 -207 -100 -3 -226 -65 385 -113 -94 38 103 -9 372 122 -249 118 189 -139 -311 134 512 -152 -287
4343 -287 119 235 -207 175 199 -338 -126 -50 -36 -126 74 296 60 -163 60 -170 -212 110 -138 -57 123 205
4365 205 -38 -121 77 68 102 113 231 17 -339 77 -170 -2 -45 -106 54 -25 140 49 -196 164 157 -489 -250 51
4389 51 -122 -96 44 100 -129 107 142 -145 -16 243 238 -82 -242 173 25 -98 156 229 -376 -96 187 -222
4411 -222 -77 263 59 -278 333 107 -27 -2 162 78 -285 10 29 -82 -37 -212 -56 -6 49 -82 -283 102
4433 102 371 70 -25 249 -73 50 -553 -88 33 33 -1 -179 -117 1 16 69 -248 196 61 -305 -190 429
4455 429 134 -167 35 -192 11 356 4 -152 128 203 24 34 217 163 -96 -94 75 -23 -9 322 -170 -254 177
4478 177 115 -249 31 193 -76 -232 -338 161 125 -132 33 44 52 167 366 -326 -34 307 9 -443 -147 230
4500 230 -30 -123 62 -112 -70 -76 -49 -35 34 211 -46 -216 70 68 -218 -40 3 108 -506 161 -83 28 114 112
4524 112 -152 -380 45 14 -168 146 186 -245 -200 306 274 -252 57 -212 -140 -89 298 96 169 149 -35 -248 15
4547 15 52 -62 -158 -38 -187 112 99 195 15 -260 274 151 -391 10 -34 112 47 170 134 25 -145 -233 -200
4570 -200 121 161 -219 -96 252 13 1 7 192 30 -337 -78 91 51 -103 225 35 327 88 77 -111 97
4592 97 283 -237 18 247 177 77 53 -9 8 -10 -374 99 30 422 94 -403 -124 12 231 -215 -300 130 -39
4615 -39 -92 126 -163 -23 87 10 -258 -106 235 -82 -145 -47 444 114 203 171 275 130 98 -11 -247 189 59
4638 59 -31 -220 210 17 -191 -37 84 -75 -216 -195 -351 121 -43 -73 -169 -147 261 72 -123 104 139 -89
4660 -89 -216 -21 134 -229 226 50 -101 -294 166 -116 -299 131 128 -125 -76 400 108 -355 -159 59 -18 56
4682 56 148 -23 -212 266 61 -356 25 58 -363 -465 -67 44 103 -43 195 -10 72 26 -108 -18 67 237 17
4705 17 -70 69 -50 60 -153 161 -64 11 110 -218 74 -32 -66 -164 1 210 -124 -285 -6 -2 10 -85 346
4728 346 -101 -29 175 141 41 228 -91 -85 151 -93 -42 -330 -34 307 -69 -47 228 -178 -9 127 -56 -247
4750 -247 110 452 54 -238 85 484 113 -149 234 258 -77 -130 -124 -244 78 133 -185 -55 -59 137 -229 -92
4772 -92 -63 -48 -74 -209 -33 -53 -44 11 -159 -82 255 184 -202 -32 261 -139 -220 145 119 -90 -36 -23 -304 106 62
4797 62 -161 -185 188 170 -149 65 -114 -78 -196 264 -131 63 -91 149 56 -34 -115 -16 13 -3 47 -37 -49 127
4821 127 133 119 -291 115 101 14 52 -118 -132 87 141 -172 7 -3 80 -256 162 -231 12 -131 -16 -92 -143 406
4845 406 35 -78 -66 -20 -37 -19 161 114 328 -80 210 62 109 278 110 -210 223 172 -481 8 71 -317 -104
4868 -104 -18 95 55 161 149 59 -31 -19 55 -225 190 -47 -252 -525 223 98 -163 -106 181 37 385 215 -208
4891 -208 40 41 264 -258 -162 255 -10 -66 -29 212 66 -285 -13 -170 -189 203 37 -85 -100 321 61 -551
4913 -551 -29 243 -23 -97 269 91 56 107 147 -204 -266 203 -39 -360 123 -325 -103 -276 162 -64 -29 -42
4935 -42 -90 -204 332 199 -142 -150 132 15 -212 -154 -63 -161 -12 412 103 -246 -130 -72 83 26 310 -94 -143
4958 -143 114 48 -79 -65 73 -21 -147 91 -11 -48 -133 217 32 -127 300 43 -179 -115 23 -20 -335 183
4980 183 173 -351 -22 -28 -70 -51 14 2 -435 139 32 -195 -134 -37 -108 -352 -183 237 -113 -98 224 -281 -163 217
5004 217 155 -285 -217 254 -123 -121 115 158 329 -110 225 27 71 271 381 -15 246 144 -57 -263 189 189 -124
5027 -124 -362 230 -109 -56 -75 -18 -217 179 193 -190 -5 201 118 71 329 33 -80 -43 24 49 -3 72 114 -141
5051 -141 236 192 -326 104 294 -37 -233 -146 281 52 -174 -283 301 53 -314 55 -49 -8 191 -33 -208
5072 -208 24 121 65 47 144 -203 -2 3 -18 -199 4 378 154 -392 218 123 56 -263 309 61 -88 413 -35
5095 -35 -165 155 119 -118 16 150 -37 -429 -99 91 -115 -105 161 75 21 -10 20 63 -76 323 -340 -325 -22
5118 -22 -63 -13 12 221 145 38 214 409 -278 -106 87 -151 9 258 124 -281 104 121 -34 -323 43 -230
5140 -230 25 203 219 124 72 365 76 106 307 291 -160 -265 55 273 -290 68 113 -221 -236 101 -180 -59
5162 -59 345 191 -345 143 457 -32 -263 -294 248 58 -167 73 195 157 110 -88 -182 114 287 15 -181 -92
5184 -92 -156 -48 -307 397 256 -218 -88 -87 -418 45 88 -198 -18 179 -5 -308 -31 -75 235 -231 158 29
5206 29 66 89 -73 -119 -3 92 -26 -133 -15 -52 -163 -202 177 1 -47 132 -13 -303 134 -86 -212 -241 285
5229 285 87 -413 -52 107 104 -308 116 120 37 -139 -46 19 -77 69 -63 -174 -51 177 -136 -108 -15 -4 -169 -6
5253 -6 102 -132 -25 42 78 -61 65 271 -306 -128 267 61 -206 -26 153 -93 61 -87 -160 -94 253 -133
5275 -133 -158 -120 225 -236 -105 79 -27 81 -126 8 -175 -127 182 -112 -177 109 117 -156 -110 11 140 -278
5297 -278 53 237 10 -97 130 89 -13 194 -262 -119 48 306 -75 -61 286 -33 19 91 127 156 18 -116
5319 -116 -80 -192 3 225 -157 -27 87 413 -263 -52 345 -85 -229 102 -122 65 -40 202 42 7 399
5340 399 -340 -197 177 -95 -140 -3 -88 -57 -11 -150 -218 -371 69 131 -156 -304 413 -38 -272 -38 224 -71
5362 -71 58 -80 84 -115 -116 -63 -98 133 149 -224 -350 94 175 -44 14 136 -67 48 -121 -23 88 -16 104
5385 104 -158 210 227 36 -296 -286 -21 -234 -318 -174 284 89 -14 -9 -81 -14 144 -77 -306 25 134 -228
5407 -228 -217 11 -52 -378 255 78 -182 56 70 -126 -283 48 0 -222 -93 400 -105 -370 -170 58 101 -5
5429 -5 34 12 38 222 -103 -114 138 44 -145 -261 217 -102 122 -11 194 110 -97 237 -27 -144 500 149 -131
5452 -131 -88 325 -11 -148 40 126 -165 -74 -56 -35 -155 8 -156 -218 128 -21 54 -9 28 -40 -125 -117 128 -282
5476 -282 0 20 53 -155 3 285 0 -174 12 303 -55 -20 -67 37 -228 -151 40 -110 -19 111 -252 97
5498 97 -14 -156 124 -234 232 -128 -56 153 35 -36 35 -189 -9 -44 166 38 -369 101 -70 -180 -125 -320
5520 -320 202 -231 171 -5 30 -103 180 -36 120 327 23 -152 341 207 26 -61 422 139 -197 -148 -64
5541 -64 -63 14 226 -172 -64 184 -65 -263 -289 182 75 -174 1 78 -223 -263 166 -182 -144 83 26 -158 118
5564 118 120 111 -15 6 212 -135 -194 137 -316 -41 -155 151 16 -167 48 -213 233 205 8 -76 12 208 95
5587 95 184 44 267 -117 44 16 -294 210 -89 -82 1 218 276 -134 -85 151 -242 86 -165 -177 61 195 12
5610 12 -188 -332 254 129 -318 20 50 28 -33 -10 -138 152 23 -86 -338 157 200 7 -179 158 243 -74
5632 -74 -202 71 24 142 31 -143 -18 -39 60 -345 -293 243 41 74 -64 213 -334 -119 -136 -63 174 -16 -31
5655 -31 -83 73 41 -55 -215 54 191 -167 50 17 36 -240 -90 -47 72 124 -174 -199 -73 -27 96 -295 -166
5678 -166 -81 -49 -361 -172 -298 -81 -84 57 -71 144 -101 111 144 0 41 -87 -186 -21 25 -386 99 -2 -177
5701 -177 75 278 28 -223 69 100 116 51 48 -52 -171 130 -11 -150 81 124 -218 50 215 -80 53 82
5723 82 347 -93 298 315 131 -99 -124 10 -138 3 -28 -75 -98 -16 102 -221 -145 172 12 -85 -99 -268 -102
5746 -102 -176 50 -35 -107 -140 75 -173 206 20 -188 -215 216 -32 -12 -115 199 68 -281 259 18 99 3 85
5769 85 -242 -131 220 248 64 -132 155 -50 139 81 -303 297 20 26 54 71 189 -124 -87 -63 380 196 -200
5792 -200 168 -56 142 62 -53 63 255 74 -89 45 265 220 -269 -168 56 -39 -27 -53 237 -5 74 186
5814 186 68 -207 -76 -40 -227 113 224 -103 -40 58 -67 41 315 91 -116 -16 105 29 -138 182 98 -53
5836 -53 -167 243 -9 -123 -5 7 -84 -77 -113 -49 122 249 -36 -196 -125 -102 -91 -13 -4 103 -127 -4 157 -231
5860 -231 111 146 -42 -53 240 10 15 -37 96 91 -269 -35 322 -192 -117 -51 -322 181 28 -76 145 -111 130
5883 130 -168 -149 59 42 -118 -121 51 -18 -274 176 -16 -56 9 199 -524 42 274 -38 -79 -109 -21 -131 -26
5906 -26 204 -10 -97 10 -90 -314 -58 265 17 -203 171 454 -229 -23 120 -78 -7 -21 238 7 -26 156
5928 156 -374 1 264 -44 -83 -109 47 12 -164 79 199 118 -171 156 -180 -1 184 -148 -92 -69 149 -64
5950 -64 9 178 58 286 -46 -112 -239 195 18 -21 -150 77 161 -241 -102 -188 -186 59 -82 150 -159 -292 47
5973 47 -306 -87 80 143 -362 140 71 -93 -66 137 -26 -272 131 143 -30 56 -4 20 -191 122 199 -29 -274
5996 -274 246 132 -142 25 108 25 10 60 -124 122 210 -150 2 -63 142 -115 -57 141 195 28 -133 -84 13
6019 13 303 70 -30 105 -146 297 108 -25 209 310 -133 -102 96 -96 -129 184 -405 -136 72 -41 -165
6040 -165 -34 212 -271 31 179 75 -83 168 17 60 82 -75 -61 -41 91 -29 -78 -97 78 -10 -267 -122
6062 -122 349 21 4 -223 96 224 134 -171 -68 -120 89 -216 179 26 158 -235 -177 41 52 -217 108 91
6084 91 -87 118 -48 -37 -237 158 135 102 171 11 -236 -108 -78 -34 -237 84 -23 224 27 -20 -80 -287 -135
6107 -135 274 -3 -278 47 143 -30 -234 -66 -91 168 270 50 -238 102 -46 -255 -43 203 48 -78 147
6128 147 -137 -186 47 225 257 -170 299 200 -129 63 303 -24 162 127 187 -95 103 -14 -268 122 -112 64
6150 64 102 -30 84 -132 -47 -109 74 14 -306 36 -86 51 170 -203 -268 -95 -74 60 -75 -88 -191 1 89
6173 89 412 -62 -179 174 -87 18 -116 -4 -10 -86 191 169 -76 109 -91 -129 -171 49 -85 -30 -222 14 -42
6196 -42 237 -7 -266 262 18 -20 -142 155 101 2 -286 -188 184 -38 170 326 -119 103 176 -73 -78 131 28
6219 28 74 -68 109 89 -141 -92 -183 277 -219 65 -139 -100 195 171 -196 260 -1 -62 -7 -104 -125 54 -10 198
6243 198 -84 74 71 -41 103 113 91 -118 31 -7 6 -112 242 -32 -216 123 7 80 -106 40 -132 -143 17
6266 17 255 257 -108 -174 181 26 120 87 -147 354 21 64 -155 -230 120 -45 240 357 146 80 1 173 -57
6289 -57 165 -28 -241 -232 173 -127 50 67 52 -180 38 145 -29 -44 222 69 -100 368 72 40 -73 -44 130
6312 130 -88 -116 331 121 137 220 53 103 -58 197 225 -407 -62 -267 3 -36 209 -309 -133 245 -98 -15
6334 -15 -194 26 40 -78 187 69 -51 -99 127 25 -145 123 -48 3 182 -117 26 -39 44 -36 -123 96 -11
6357 -11 -58 19 96 32 -185 12 198 -190 -72 68 159 -184 201 88 47 66 -12 -194 179 134 292 -254 77
6380 77 111 -31 -186 84 16 -186 95 17 78 -31 185 50 29 -48 101 -6 -323 356 152 76 -191 64 325
6403 325 26 -22 -127 -82 133 185 -106 -362 -34 212 -137 -11 121 3 253 -27 -136 -88 16 133 -249
6424 -249 38 -19 -101 -309 -64 -72 219 -33 -126 203 23 -107 38 -120 99 -199 110 64 -61 -102 16 18 -78
6447 -78 -134 -126 -72 -111 -270 -102 425 -106 -48 216 -139 -256 -3 -130 -207 278 -14 87 15 -139 46 93 -87
6470 -87 317 -230 -34 69 -56 -155 -7 160 87 59 12 -265 -129 159 -28 -125 -82 -1 -261 -61 -99 219 9
6493 9 66 -30 -110 -266 -152 -227 -117 -45 370 -303 -149 274 -120 -67 -230 221 -199 -189 -25 -44 -180 -61 92
6516 92 -104 -293 155 -176 -306 23 168 141 -99 -481 -17 -135 -21 -98 -220 48 88 196 -103 -6 -256 -87
6538 -87 -17 17 -145 -95 160 59 48 -116 -370 -237 -26 251 -94 408 -26 250 -60 -117 -82 131 58 -190 87
6561 87 -45 51 257 -17 -252 83 38 -123 -207 113 150 -183 -183 89 8 -88 47 -252 -75 164 173 123 -13 -39
6585 -39 48 114 -32 54 -187 -70 33 -72 65 119 53 80 232 -16 50 -80 247 60 -168 -39 -42 -169 -105 -94
6609 -94 -80 -73 -73 133 189 -74 184 -143 -4 93 -15 -72 67 -92 -133 223 18 2 -144 1 212 59 142 11
6633 11 83 -134 159 32 -344 -4 92 -13 75 28 39 49 -176 136 84 -178 69 239 -332 -210 130 134 45 -44
6657 -44 110 -58 30 -219 -283 -343 260 155 121 -53 1 -54 -54 212 159 -184 -221 54 -283 239 190 -29 -188 21
6681 21 80 -2 -37 -2 15 41 -228 122 -152 144 -4 -2 -153 318 244 215 -29 -57 9 43 229 -36 -221 18 151
6706 151 -32 196 391 107 -346 -237 208 80 -59 -81 167 -342 86 215 -325 -37 19 88 74 130 108 41
6728 41 3 33 28 -35 -3 42 -128 -7 -70 23 24 10 92 -99 74 16 -89 -262 -135 208 -13 -92 -116 -191 -112 317
6754 317 166 -60 138 79 -123 -36 42 160 -264 130 70 -206 -12 -58 26 126 20 86 -83 87 19 -316 -123
6777 -123 70 227 -197 23 -68 111 -144 -299 26 265 -54 125 4 42 325 49 -35 57 39 1 -63 -215
6799 -215 -107 -67 143 12 -131 -178 -7 -121 -31 62 194 -31 168 40 -49 -40 62 -97 -78 333 -29 -51 13
6822 13 -66 101 -10 -53 67 125 198 -113 -199 137 -40 219 151 133 31 -34 -202 -251 7 126 -3 142 189 -123
6846 -123 69 20 -40 -85 -144 -38 -281 66 -2 -141 -10 180 -12 124 -214 135 -129 71 63 -19 -24 173 -27
6869 -27 11 -133 136 -8 -208 1 129 -164 78 -182 -199 -80 184 -41 -93 -43 233 93 160 10 -50 -70 107
6892 107 292 150 -287 -139 -162 -8 120 -300 81 -185 -50 112 -161 -178 434 -45 -49 -39 -95 -204 287 66
6914 66 -185 -110 -33 -76 -33 -3 -105 -168 -175 59 24 17 38 374 -196 2 266 -47 -19 62 60 -13 -106 237 33 -10 147
6941 147 30 -38 80 115 -57 50 338 96 -174 35 -67 -147 141 -26 -252 -67 14 -103 -108 23 191 -89
6963 -89 -54 -109 4 45 -193 242 -154 50 93 65 58 -119 -14 -149 -168 7 59 -92 149 33 -208 117 100 118
6987 118 75 134 -27 -123 83 133 -392 22 305 -75 -290 -200 342 -173 -206 -89 224 -163 -121 -147 227 -2 115
7010 115 -220 -176 -51 152 -206 -33 58 -124 -118 -46 -170 -119 -73 232 87 -98 73 -241 -297 -26 -191 69 -103
7033 -103 38 304 12 92 -60 -134 -233 1 -118 -235 74 215 -70 -121 58 77 107 -99 -195 286 -123 -198 150
7056 150 122 -93 -71 -157 12 212 199 -39 -104 173 -125 82 -72 74 89 -15 -71 16 -11 -152 167 -307 63
7079 63 128 -142 161 81 -44 92 188 328 15 40 -48 39 11 -19 107 -88 -120 -94 53 27 -42 -296 -120 -140 63
7104 63 -165 14 -210 -155 -128 176 356 -261 -46 197 -145 -74 306 165 -82 -99 -149 21 31 66 -7 -50 135
7127 135 -14 139 -315 74 8 98 107 -116 185 158 97 -214 31 -182 224 -193 -232 -152 14 -292 -34 112 229
7150 229 -183 -138 -122 -33 230 109 27 47 -103 -48 90 -135 143 204 72 41 51 55 -9 -214 -77 -9 138 96 -29
7175 -29 -158 -61 -66 -155 -110 27 -36 67 -226 34 95 -57 8 247 -29 110 88 104 -4 90 -165 97 105 122 198
7200 198 8 -97 -56 158 46 82 52 -88 90 7 -64 -83 -14 -116 265 -27 -198 14 15 228 -122 -19 -138
7223 -138 -152 -38 -11 -132 160 109 -299 -75 100 -121 68 -81 -49 -13 -106 33 -142 -194 41 77 12 -59 -62 -98
7247 -98 -55 36 98 -52 23 -36 -26 73 1 -236 60 126 -76 -302 14 -25 -39 202 -37 -70 -174 -44 -134 -2 -7
7272 -7 5 82 -118 -41 -69 -17 -35 104 -143 97 17 41 -76 -193 -22 -76 -119 25 45 -177 -145 94 -135 180 -84
7297 -84 214 -84 79 23 156 -43 46 -59 -87 48 -20 62 33 187 -49 -413 102 -59 17 99 90 18 59 -100
7321 -100 -14 55 -337 -99 -133 -26 -67 96 248 217 276 161 115 -161 266 -113 -155 77 52 -179 260 -1 -339
7344 -339 170 -129 117 32 114 -177 -100 -25 -14 -60 -121 152 62 246 -176 -207 138 209 -125 186 -148 62 83 -10
7368 -10 -32 1 -69 95 -202 41 66 -110 47 -9 -288 -112 150 -45 -109 -191 -22 -124 -29 -113 -285 -84 -98 -150
7392 -150 20 -23 -210 -162 226 227 -5 -82 -74 239 -247 -56 -14 -162 250 224 16 144 81 195 -105 104 -98
7415 -98 78 -225 -18 71 -67 107 -281 28 12 43 -156 -198 -34 58 -72 66 87 -107 29 -169 122 118 80
7438 80 -75 334 -33 214 57 35 -24 79 -112 -81 361 -76 -230 -143 -23 -173 -168 93 -28 -149 -256 -40
7460 -40 -29 -132 128 94 142 -21 249 -242 15 -118 -152 49 -48 129 -9 308 41 83 107 -47 -22 27 -94
7483 -94 280 -11 -294 105 -18 80 -100 127 136 108 -60 135 -56 -55 212 -47 -56 159 45 -204 184 -14 -127
7506 -127 145 -94 171 33 226 -81 -36 3 -118 188 -389 -304 22 230 -167 -41 -101 -85 -84 -49 8 72 6 -24
7530 -24 182 25 -34 53 104 65 179 -161 -47 5 153 65 -234 60 92 -133 323 24 -28 -135 -56 108 43 -97
7554 -97 -96 44 122 -96 -33 165 3 91 84 -168 53 -93 -60 -86 -91 67 -34 -358 38 230 -246 -101 -46 -116 22
7579 22 63 -54 90 -126 51 -185 1 -39 119 -107 -14 25 -85 88 36 21 -77 212 168 -136 101 159 -220
7602 -220 -61 75 85 157 -145 -172 -72 70 169 168 -82 -115 -137 166 -54 -50 326 40 -172 -121 92 28 28 -29 -49
7627 -49 -61 164 45 -2 153 76 171 18 -5 70 -98 57 -2 -155 280 -135 158 -368 -228 241 -225 -129 -81
7650 -81 76 -72 -149 -178 -17 -246 180 76 120 4 78 47 107 74 -42 54 -12 -87 69 63 55 106 10 -85 32 -119
7676 -119 28 -120 87 32 -18 -170 -305 -65 -140 -177 17 204 101 -148 344 -87 -106 121 -170 -31 -90 -117
7698 -117 109 -22 139 95 -79 92 187 -46 -60 237 -97 -231 160 54 -25 179 41 150 6 -99 37
7719 37 -21 56 -13 190 41 -176 109 -35 126 -68 20 9 -269 224 121 85 186 351 -68 -46 41 -127 -240
7742 -240 -39 176 -194 98 91 64 4 122 -81 53 -127 44 110 28 33 -104 -26 -157 -224 15 -49 183 98 287
7766 287 48 27 68 -266 -40 197 120 -4 -115 35 115 40 49 -136 192 73 5 -80 228 113 -24 12 -20 -154
7790 -154 26 1 -83 -97 97 28 -5 10 -48 93 -36 -184 81 -172 114 301 -304 110 78 2 -136 95 119
7813 119 94 -24 176 80 -186 -153 119 -49 231 -5 -163 5 -8 107 -82 82 106 -7 183 -59 212 19
7835 19 86 33 -118 -78 112 -120 464 -64 50 106 16 -17 -99 -64 50 62 17 -99 18 65 -33 -95 -97 83 44 95
7861 95 -274 176 74 -42 -88 -9 -142 101 40 36 176 -15 400 192 -89 -180 70 -193 103 -17 -98 240 35
7884 35 211 -126 97 164 -84 146 149 50 -11 -6 -74 199 93 -20 57 39 40 -123 -90 -138 -97 62 110 -32 220 -9
7910 -9 -59 222 -85 27 -30 -43 -229 -56 123 -23 228 126 -87 -68 152 157 205 158 -123 141 62 154 -39 -121
7934 -121 223 -145 202 80 49 250 -89 -178 -14 60 128 3 34 149 -279 -91 206 88 -241 42 -122 -211
7956 -211 -224 91 -93 -11 56 -157 -47 -127 -146 -5 114 -137 -37 -15 25 144 77 -21 -50 -39 98 304 -166 -257
7980 -257 18 67 -67 -53 117 -54 -196 14 188 -81 68 270 296 46 70 -64 110 -199 -133 -41 -35 -234 -318
8003 -318 46 -61 -164 179 107 -165 60 -190 -43 -61 -60 68 118 46 -237 -80 97 195 164 320 2 127 -79
8026 -79 68 69 -127 -30 -95 -305 101 39 26 -129 54 349 -10 -141 -137 137 -17 204 -32 21 -149 189 16
8049 16 162 223 -101 -4 99 -79 -197 146 -63 -167 86 190 36 -90 22 173 101 -181 -122 226 99 -278
8071 -278 52 -81 -63 81 326 -68 234 -184 -139 81 -104 157 108 371 -140 66 -5 -4 -108 265 -204 201
8093 201 80 3 -129 -37 -48 -251 72 -55 -68 -48 -55 74 -368 -208 97 -52 95 -76 -171 -73 53 -48 -261
8116 -261 -147 -168 114 -92 -131 26 -170 106 27 -99 185 274 -114 -30 -72 91 40 30 -99 -117 107 46 -163
8139 -163 73 -206 122 -106 213 147 -86 345 123 -173 30 155 43 9 -14 206 125 382 -107 -112 -137 -103 5
8162 5 109 204 -6 -197 20 164 -2 -101 149 -30 33 89 -103 -27 21 96 98 26 -41 307 64 66 141 179 15 309
8188 309 -61 -165 -63
8191f3
$$ Imaginary data points
##PAGE= N=2
##DATA TABLE= (X++(I..I)), XYDATA
0 0 0 0 0 0 0 0 0 0 0 0 0 0 0 0 0 -8 8 -8 8 -8 8 -16 16 -16 24 -24 32 -32 40 -46 49 -56 64 -73 84 -96 105
37 105 -118 132 -146 163 -180 200 -220 244 -269 297 -327 361 -397 438 -483 533 -588 651 -721
56 -721 802 -898 1008 -1140 1301 -1503 1762 -2110 2597 -3336 4577 -7030 13651 -67390 -170075
71 -170075 53777 62385 -50540 46851 93640 -47172 -22248 80022 17971 -16957 58388
82 58388 11642 -77991 -25261 43918 2727 -37941 -17756 -1726 -20116 -14828 10881 -6179
94 -6179 -30973 4051 10754 -29633 5288 49832 -24700 -56083 40002 55017 -18203 -816 29561
107 29561 -14145 -5064 45817 19282 -13031 7586 -8767 -47542 -14811 39895 20025 -37790
119 -37790 -36547 11542 15421 -8367 11812 18181 -26043 -21251 17763 -7797 -10963 41104 1705
132 1705 -64238 6462 61311 -14587 -28078 36451 4340 -33959 25549 29854 -30171 -3579
144 -3579 29683 -27549 -28375 42549 14611 -55768 -13417 39012 -1441 -16488 22530 3110 -31690
157 -31690 3767 20918 -17014 -4180 29272 -16444 -44402 22237 46064 -14372 -23215 17695
169 17695 4697 -14544 14258 17564 -13252 -4294 11083 -16676 -17891 24637 15891 -34114 -20515
182 -20515 24012 7591 -18327 5849 14534 -10084 -2306 16463 -3235 -8586 16768 1764 -25802
195 -25802 6173 31297 -10239 -29787 10957 17711 -14790 -7352 14072 -4633 -14448 8253 3155
208 3155 -14538 10841 19643 -24386 -22420 31160 19200 -26445 -2093 25823 -6409 -11050 18058
221 18058 977 -13575 16599 6103 -31140 -316 30959 -12480 -31128 12710 15108 -18638
233 -18638 -7392 12189 -4032 -5677 10441 -2630 -13259 11750 15583 -14484 -10262 22676 10835
246 10835 -19108 -1069 22122 1098 -11374 5998 3105 -7357 7535 4631 -20191 -6332
258 -6332 18763 -6764 -26263 7219 18629 -14808 -16902 10938 8493 -4706 3329 1441 -8719
271 -8719 8020 18316 -7859 -14411 15786 13602 -17188 -5040 23352 4695 -17797 -260 7113
284 7113 -6112 3726 8730 -16571 -14078 16028 2612 -23057 2861 19421 -15251 -21017 15392
297 15392 14600 -9807 -1527 5872 -7362 3919 20040 -2598 -14926 12410 12825 -16640 -4686
310 -4686 23398 3070 -21319 -3161 9941 -1464 1000 2683 -14994 -11328 15009 6502 -17450
323 -17450 -256 15515 -10451 -18856 12727 17561 -7825 -8253 3711 -2620 2107 16738 754
336 754 -16540 4363 14563 -8810 -6102 18955 3815 -23344 -4907 15866 1752 -5555 2544
349 2544 -8623 -12062 11803 10463 -14598 -4405 15156 -7395 -18824 13840 20607 -12421 -15140
362 -15140 6029 2403 32 13291 -106 -18653 3251 17968 -7741 -9039 18622 5013 -24358
375 -24358 -3457 20292 1203 -9233 2472 -6320 -11384 13723 13156 -15907 -8049 15024 -4283
388 -4283 -16347 13565 18368 -15058 -16283 8545 5414 -2513 7546 415 -15103 1283 16097
401 16097 -3701 -8828 12920 4775 -20746 -4232 21172 4802 -13684 -3309 159 -4376 9476
414 9476 10619 -12075 -9144 13180 1918 -13612 8465 17940 -12071 -18900 6908 9780 -4196
427 -4196 915 377 -13883 -2430 16560 -568 -13114 9921 10299 -16860 -4604 23927 4504
440 4504 -17706 971 7933 -6306 5074 12344 -13089 -12077 16139 4050 -17044 7175 16460
453 16460 -17041 -19291 12501 10292 -9041 -1530 -485 -13275 1402 17836 -2414 -12338 11171
466 11171 10359 -15114 -2580 22820 5704 -15456 -612 6810 -4615 2041 8200 -10461 -10540 12526
480 12526 4389 -16003 1724 15029 -9127 -15305 9693 10159 -9606 -5556 3223 -3709 241 10518
494 10518 -1056 -11673 5004 11978 -6906 -5023 16783 6495 -17923 -5301 14756 1697
506 1697 -5914 5089 -4113 -12945 8401 11175 -13989 -3868 19504 -4841 -23005 8845 17602
519 17602 -12018 -8792 9311 -5396 -8626 12093 1644 -15268 7806 16123 -12223 -9505 17735
532 17735 6022 -14385 2407 12821 -4090 -5834 4989 -2847 -5615 9061 4815 -13462 -2870
545 -2870 12913 -3267 -14207 7255 12414 -11253 -11604 6356 1365 -4983 6007 815 -11200
558 -11200 4047 12238 -7843 -6654 16214 7799 -13122 -2625 10885 747 -4066 2484 -141
571 -141 -4545 1685 2137 -7606 -3255 10587 2497 -14694 -2949 13135 -3093 -12959 7964 8560
585 8560 -11452 -2744 9416 -6494 -2565 16623 -2605 -16627 11745 14092 -16335 -5357 19366
598 19366 -1007 -15448 4928 4495 -8799 3113 6975 -10070 -3121 13558 -485 -14929 3948
611 3948 15145 -3673 -11005 4413 5450 -6715 -1546 5739 -3972 -3765 7101 -3837 -12200 9000
625 9000 14069 -10908 -9586 11948 2912 -9349 4719 8469 -4875 -1304 4235 -4813 -1512 11026
639 11026 1005 -11392 -280 9948 -2270 -10336 1244 7195 -5003 -8160 3090 1948 -4494
652 -4494 1605 2069 -7029 3321 13439 -5893 -12611 12391 12744 -10626 -3596 11664 -2857 -7990
666 -7990 6836 1379 -7171 6054 3944 -15152 -3889 16302 460 -13713 2975 7646 -7625
679 -7625 -4261 7902 357 -5022 3476 391 -7469 4275 10562 -6765 -9919 9061 7934 -8888
693 -8888 -2840 10039 -484 -7034 2979 3276 -3772 2614 4082 -8343 -2736 12927 1430 -14098
707 -14098 -225 11372 -2972 -7622 3994 2120 -6279 -951 1500 -3756 1699 7282 -4641 -9912
721 -9912 6075 10950 -4434 -6108 7347 3637 -6593 1417 7058 -2004 -2451 4142 -3504 -5371
735 -5371 9175 5490 -13062 -4146 12510 -2103 -11741 4861 6613 -8537 -2750 6219 -3171 -2290
749 -2290 7529 -3003 -10469 7604 11398 -7901 -7887 8877 4289 -7088 619 6337 -1615 -2300 3590
764 3590 -2345 -3488 7616 4520 -10849 -4157 11277 1422 -10792 1412 6895 -6184 -4915 5690
778 5690 -493 -4806 4551 78 -8723 3005 10321 -5882 -8791 7998 6692 -6766 -1422 7838
792 7838 -617 -4454 3602 1586 -2613 4579 3564 -9235 -4080 11049 2100 -12098 -480 8884
806 8884 -4417 -7375 4858 2028 -4967 2066 1736 -7366 1582 10890 -3855 -10510 7133 8860
820 8860 -7044 -3245 8264 590 -4924 3532 2379 -4291 2900 4734 -6989 -4374 9570 1684
834 1684 -11481 -508 8857 -3707 -7333 4346 2928 -5732 488 2899 -4805 45 7783 -3286
848 -3286 -9144 6356 8931 -6811 -5338 7740 2650 -5445 1370 3761 -2375 1091 4225 -5166
862 -5166 -4569 8733 3148 -11072 -2465 9801 -1558 -8522 3340 3704 -5376 -674 4042 -4249
876 -4249 -1862 7441 -1514 -8897 4791 8958 -6835 -5821 8283 3747 -6406 892 5160 -2246
890 -2246 -1046 4397 -2544 -4480 6840 3776 -10245 -2514 10176 -1345 -10505 2719 6497 -5016
904 -5016 -2387 4257 -3097 -2455 7232 -552 -9134 4335 9164 -6856 -7134 7965 4077 -6418 -251
919 -251 4356 -2355 -779 3927 -1996 -3921 5351 3441 -7238 -2046 8363 650 -8315 1311 6487
934 6487 -3475 -3843 3577 118 -3105 3257 221 -7007 1916 7198 -5241 -7352 6653 5064 -6894
949 -6894 -2297 5862 513 -2027 2635 48 -2556 4416 4924 -5750 -3404 8017 1806 -9419 -396
964 -396 8277 -2546 -6330 3098 285 -5213 2762 2639 -7662 -35 8657 -4430 -8556 7218 5963
979 5963 -7548 -1563 7516 -793 -3624 3919 797 -3010 4239 3847 -6493 -2455 7814 670 -8318
994 -8318 948 7070 -3485 -6332 2935 2213 -2446 1692 573 -6269 2 6871 -2807 -6785 5120
1009 5120 5172 -6918 -3450 6065 2320 -2010 1102 678 -1764 2001 3439 -1794 -2501 4840 2414 -6585
1025 -6585 -2553 7000 661 -7292 857 4351 -4256 -3041 2958 -2590 -2588 5784 -479 -8824 2431
1040 2431 7623 -5259 -4599 8303 3018 -6674 -34 4439 -856 1430 4880 -3432 -5089 5164
1054 5164 3550 -6703 -785 8089 -1852 -8674 1642 5116 -2707 -958 2306 -3981 -2336 5746
1068 5746 -5 -6807 3536 6167 -5668 -4431 6459 2564 -4101 662 3329 -1160 22 1999
1082 1999 -2194 -1605 4745 2103 -4939 -1785 4729 141 -5734 688 5408 -1178 -4881 69 618
1097 618 -626 2960 920 -5173 -577 5247 -2019 -5423 4896 5825 -5527 -4774 4627 1931 -2415
1112 -2415 1849 1277 -4183 1183 4787 -3674 -3994 6680 2645 -8160 -333 7425 -1766 -5143 3140
1127 3140 1557 -3837 1781 1558 -5558 -226 6419 -2499 -6283 4330 4302 -6098 -2616 6181 1702
1142 1702 -3217 571 598 -2181 2907 4738 -3410 -3148 5326 1710 -6835 -8 7209 -787 -5929 694
1158 694 1981 -1917 1126 1362 -3903 -1503 4095 -1284 -5297 2508 5053 -3528 -4336 3508 2665 -2905
1174 -2905 -490 2772 -306 -652 2933 -998 -3688 3370 4219 -4766 -2508 7177 784 -7423 1155
1189 1155 6019 -2625 -2621 2743 -2092 -3248 4782 507 -6889 1505 6137 -4521 -5907 5567 4036
1204 4036 -4635 -1111 3379 -1170 -372 3871 -864 -3723 3894 4050 -4936 -2468 6709 1224 -6789
1219 -6789 512 4833 -2229 -2835 2491 -923 -3145 2640 824 -5510 229 5373 -2829 -5368 4353
1234 4353 4067 -4474 -1966 4790 546 -1707 2100 347 -2424 2781 3486 -3787 -2698 5733 1972
1249 1972 -6519 -1006 5629 -806 -4214 1754 1082 -2723 1100 1896 -4585 -1209 5610 -1583 -6755
1264 -6755 2982 5451 -4460 -3167 4769 583 -3414 2024 1760 -2810 2179 4422 -3248 -3447 5926
1279 5926 2309 -6080 28 5613 -1232 -4624 1920 2097 -2757 -258 1231 -3483 -1134 4961 -1297
1294 -1297 -6461 2045 5717 -3967 -3783 4576 2424 -3500 631 2319 -2033 886 4060 -2739 -3532
1309 -3532 5278 3014 -5860 -1182 5753 -511 -4897 1705 2428 -2698 -583 2164 -2161 -1461 4219
1324 4219 -4 -5704 1472 5404 -3256 -4540 4118 2438 -4400 -863 3483 -1167 -1004 3044 -1338
1339 -1338 -3325 4296 3879 -5282 -2120 6264 848 -5109 1048 4026 -2000 -1663 1928 -1074 -1301 3353
1355 3353 -98 -5991 537 5235 -2340 -5147 2891 2972 -3817 -905 3130 -618 -1479 2544 -104 -2785
1371 -2785 3240 3986 -4091 -2302 5258 1223 -4669 570 4108 -2001 -2732 1830 62 -1801 1724
1386 1724 294 -4314 257 4820 -1908 -5330 2734 3560 -3496 -2200 3486 447 -1993 1098 112
1401 112 -2147 2808 3714 -3680 -2875 5235 2096 -4581 -314 4184 -1044 -3256 1835 878 -1859 1138
1417 1138 927 -3693 -826 4563 -818 -5409 1959 3342 -3540 -3055 3583 893 -3534 1112 1851 -1766
1433 -1766 1429 3419 -3189 -2745 5381 2835 -4759 -248 4625 -1059 -3538 1807 1593 -1593 181
1448 181 483 -3083 -626 3986 -481 -4912 877 3680 -2682 -3292 2694 1455 -2886 -412 1596 -1084
1464 -1084 770 3191 -1307 -2650 3535 2844 -3616 -596 4513 -16 -3639 765 2337 -1654 -1573 691
1480 691 -732 -720 2053 -284 -3877 178 4430 -1868 -4101 2407 2832 -3087 -1632 2758 174 -812
1496 -812 2080 -1001 -3311 3289 3749 -3565 -2038 4865 123 -4444 765 3460 -1409 -944 1239 -1056
1512 -1056 -1099 3068 553 -3771 454 3729 -2034 -3600 2554 2458 -3152 -1159 2128 -522 -1517 1381
1528 1381 -552 -2145 2713 2434 -3269 -1643 4169 982 -3471 655 3476 -900 -2037 633 323
1543 323 -285 1304 52 -2982 -603 3365 -404 -3836 1373 3153 -2679 -3297 2012 1468 -1690 460
1559 460 747 -2184 890 3418 -1472 -2515 3857 2264 -4103 -1078 4327 -180 -3134 1497 1381 -2040
1575 -2040 136 1426 -2699 -687 3898 -571 -4738 1295 3902 -3044 -3101 3046 1069 -2879 326
1590 326 1059 -1796 1136 2943 -2491 -2701 3996 2111 -3775 -443 4113 298 -2536 537 1214 -868
1606 -868 580 1139 -1875 -991 2305 -208 -3504 811 3229 -1785 -3285 1378 1455 -2223 -363 1609
1622 1609 -835 -550 1497 -805 -1593 2877 2290 -3066 -1234 3786 1107 -2857 158 2683 -743 -1789
1638 -1789 803 -287 -1311 1752 737 -3612 -190 4157 -1310 -4523 2098 3207 -2780 -1380 2493
1653 2493 -1039 -1637 2511 39 -2940 2431 2885 -3592 -1786 4341 1276 -3479 387 2578 -1349
1668 -1349 -1281 1830 18 -1652 1135 -8 -3011 188 3792 -1055 -4023 1097 2637 -2518 -1333
1683 -1333 2243 126 -1945 685 268 -1601 1831 2263 -2783 -2008 3992 1700 -3272 -433 2742 -84
1699 -84 -1695 890 1026 -1249 328 884 -2155 -456 3237 -129 -3846 580 3738 -1524 -2461 2141
1715 2141 428 -3094 414 1819 -1636 120 2429 -2325 -2868 3838 2550 -3595 -1045 3639 305
1730 305 -2244 1874 1630 -1708 -339 930 -1911 -244 3195 -448 -4095 503 3610 -1369 -2752
1745 -2752 1719 910 -2342 -37 1502 -1332 -85 1647 -1564 -2395 3360 3083 -3012 -1464 3574 977
1761 977 -1995 1421 1826 -1636 -418 1039 -1024 -521 2184 -100 -3613 -55 3387 -1051 -2986 1460
1777 1460 1406 -2347 -739 2140 -300 -1097 1119 -455 -1914 2412 2832 -2951 -2106 3219 1481 -2513
1793 -2513 406 2274 -992 -1155 1407 -102 -1078 1450 125 -3339 -89 3861 -419 -3206 959
1808 959 1722 -1870 -874 1839 -212 -1525 1018 -69 -1666 1693 2172 -2726 -2152 2906 1768 -2281
1824 -2281 256 2579 -541 -1649 1606 962 -891 1196 367 -2676 -41 3402 -547 -3699 933
1839 933 2353 -1652 -1608 1542 125 -1849 373 399 -1694 1110 2170 -2141 -2438 2775 2375 -2103 -545
1856 -545 2707 -94 -1475 1586 1265 -1104 127 677 -1969 -730 3018 172 -3406 225 2839 -1614
1872 -1614 -2163 1891 801 -2361 32 1072 -792 270 1583 -1449 -2090 2785 2066 -2405 -1241 2712
1888 2712 510 -1995 768 1782 -739 -9 856 -1237 -555 2455 193 -3214 193 2683 -936 -2195
1904 -2195 1364 1107 -1792 -457 1016 -718 -220 1632 -884 -2058 1606 1854 -2096 -1073 2614 706
1920 706 -1944 562 1706 -294 -816 926 -338 -690 1420 162 -2406 79 2825 -601 -2978 1162
1936 1162 2034 -1568 -1233 1180 -532 -846 1121 -509 -2160 1237 2221 -1782 -1866 2365 1495 -2280 -132
1953 -132 1981 -236 -734 996 -173 -1326 1312 1311 -2069 -337 2529 -708 -2876 1098 2407 -1525
1969 -1525 -1487 1428 -172 -1170 889 219 -1756 630 1733 -1751 -1543 2768 1390 -2177 -669 2240
1985 2240 327 -790 738 175 -550 853 853 -1343 -572 1933 -210 -2592 605 2138 -1055 -2175
2001 -2175 692 623 -713 363 761 -1493 -496 1398 -627 -1565 1661 1505 -2402 -1380 2589 960
2017 960 -1577 374 1084 -1024 30 1625 -649 -682 1921 95 -2867 440 3033 -914 -2692 637
2033 637 957 -1156 -151 599 -1609 -559 1617 -703 -1687 1650 1509 -2223 -1025 2675 1051 -1332
2049 -1332 118 598 -824 349 1480 -705 -1234 983 73 -1989 481 2138 -1158 -2784 652 1262
2065 1262 -616 -232 643 -1041 -652 926 59 -1007 818 1188 -2312 -1130 2173 1449 -1942 -633
2081 -633 1508 286 -211 1053 339 -1237 686 988 -1410 -244 2369 -301 -2815 378 2479 -677
2097 -677 -1156 558 -437 -1567 987 1117 -1692 77 1321 -1542 -1450 2391 1441 -2382 -768 1789 293
2114 293 -664 1417 354 -1110 817 1121 -1058 211 2292 -900 -2896 263 2314 -1045 -1564 554
2130 554 -59 -880 442 327 -1265 18 1312 -1061 -1546 1788 1214 -2005 -1230 1876 646 -522 264
2147 264 88 -972 217 1265 -640 -215 1499 34 -2263 153 2155 -478 -2165 274 629 -1013
2163 -1013 272 1053 -847 -772 979 -389 -1326 1559 1647 -2201 -1586 1848 661 -1590 512 932 -580
2180 -580 194 1217 -741 -787 1747 599 -2047 232 2199 -636 -2218 338 767 -840 -281 687 -839
2197 -839 -793 1255 237 -1489 1005 1319 -1725 -1186 2046 1125 -1410 175 635 -345 -160 1244 -31
2214 -31 -838 1335 327 -1713 63 2226 -484 -2302 350 1108 -774 -726 583 -227 -496 653 -76
2231 -76 -1178 828 1406 -1245 -1616 1904 1163 -1572 -622 1342 95 -604 1037 -45 -837 1170 917
2248 917 -1410 -587 1860 70 -2176 274 1536 -803 -989 809 40 -524 431 290 -1010 358 1219
2265 1219 -1001 -1507 1540 1319 -1524 -605 1627 111 -962 402 694 -611 507 1065 -1181 -543
2281 -543 1918 135 -1984 423 1588 -674 -1500 472 327 -957 298 96 -1082 280 1363 -453
2297 -453 -1383 1051 1187 -1138 -789 1479 348 -959 97 643 -472 365 785 -365 -740 1328 498
2314 498 -1646 102 1912 -327 -1590 387 899 -657 -539 518 -443 -126 962 -560 -1702 814
2330 814 1220 -1488 -1012 1402 532 -1114 -137 783 4 65 779 -833 -411 1490 940 -1442 -279 1694
2348 1694 -179 -1322 488 1035 -757 -694 429 -327 -472 907 161 -1745 599 1228 -896 -1143 1484
2365 1484 507 -1569 -397 1133 154 -260 885 -291 -579 1258 837 -1165 19 1567 159 -1426
2381 -1426 429 1116 -738 -839 212 143 -301 539 -176 -1548 133 1427 -698 -1182 925 684 -1261
2398 -1261 -746 1172 343 -661 309 205 -515 838 1144 -656 -614 1199 254 -1329 376 1471 -675
2415 -675 -1151 425 329 -350 440 -82 -1026 123 1214 -714 -1299 855 872 -1227 -463 1209 476 -801
2433 -801 189 350 -265 507 650 -729 -365 1224 425 -1309 203 1198 -362 -1017 216 529 -481 -50
2451 -50 159 -770 -382 1031 -265 -1286 363 1010 -915 -983 1109 816 -931 -205 628 130 -61 640
2469 640 -411 -464 1257 545 -1282 -82 1333 -28 -1441 283 1029 -500 -280 284 -376 -259 1076
2486 1076 -359 -1390 361 1223 -820 -1203 1038 585 -1268 -200 907 -193 -336 593 -350 -666 763
2503 763 705 -1028 -5 1079 -267 -1231 503 857 -588 -678 97 -273 -355 452 -383 -1051 141 952 -837
2522 -837 -1133 926 1042 -814 -539 714 108 -407 299 156 -388 569 738 -911 -447 1169 427 -1356
2540 -1356 66 991 -532 -589 413 118 -512 112 202 -913 -240 1065 -293 -1226 709 840 -1214 -758
2558 -758 1079 335 -894 134 287 -501 417 539 -854 -341 1596 374 -1379 227 1167 -349 -793
2575 -793 430 496 -271 205 -215 -809 182 858 -607 -1129 467 1173 -563 -642 861 215 -509 165 461
2594 461 -27 197 356 -633 -317 748 457 -728 182 1119 61 -886 175 783 -337 -79 202 -532
2612 -532 -292 682 -25 -1221 364 1126 -963 -1292 628 584 -903 -367 751 -284 -116 599 -122 -376
2630 -376 787 807 -1299 -383 1343 -85 -1019 159 738 -594 -115 515 -102 -351 708 63 -1396 262
2648 262 1020 -767 -1290 1012 680 -920 64 763 -142 -21 327 -289 -550 668 651 -914 -146 1048
2666 1048 -37 -1066 111 727 -314 -299 533 -194 -293 199 -77 -980 104 956 -585 -1213 578 732
2684 732 -579 -614 689 98 -401 423 191 -613 179 606 -629 -541 938 613 -1158 89 1063 -219
2702 -219 -651 523 110 -267 225 113 -968 -20 578 -571 -1025 327 724 -712 -694 804 266 -521
2720 -521 294 277 -402 368 676 -384 -480 994 422 -949 -179 1138 -204 -663 191 230 -209 160 266
2739 266 -391 -133 715 -414 -784 256 407 -824 -611 894 242 -694 106 388 -414 -87 626 -216 -426
2758 -426 723 172 -695 -274 806 -6 -829 90 735 -227 -324 13 -482 -333 897 -170 -831 162 626
2777 626 -727 -864 621 582 -534 -180 18 98 -82 436 -359 -585 550 419 -750 -206 1147 89
2795 89 -661 61 746 -156 -365 362 -168 -358 532 7 -717 96 686 -843 -904 663 874 -592 -230 233
2815 233 -159 -338 302 -149 -476 170 677 -507 -164 909 298 -827 -51 750 -220 -320 404 -155 -161 451
2835 451 534 -579 -426 491 -299 -786 234 439 -615 -481 362 375 -227 275 40 -423 200 817 -317
2854 -317 -77 580 228 -707 96 694 143 -520 146 32 -271 330 -126 -271 -389 463 -197 -487 354 661
2874 661 -436 -586 301 434 -489 -216 28 -441 242 416 -227 -202 578 139 -858 -62 834 37 -735 94
2894 94 333 -54 160 194 -280 -106 482 -128 -692 295 622 -348 -579 532 465 -600 -243 -18 -232 -279 320
2915 320 -419 -406 475 476 -741 -254 1008 129 -715 158 486 -239 -161 119 -385 -116 624 -161 -649 -69 782
2936 782 -542 -579 450 418 -426 -250 333 -135 -216 379 -268 -437 399 278 -658 -177 778 15 -661 -108
2956 -108 513 32 -393 196 -167 -140 253 175 -582 26 601 -356 -745 383 331 -362 -123 184 141 -126 -127 25
2978 25 -567 127 226 -488 -317 593 318 -670 -28 662 -146 -288 332 201 -197 61 261 -158 -289 805
2998 805 -262 -761 433 399 -378 -278 226 123 -589 124 342 -337 191 384 -187 -196 586 312 -750 -60
3018 -60 827 45 -613 257 314 -133 123 260 -198 77 605 -122 -775 127 334 -322 -185 228 20 -494 -138
3039 -138 119 -235 -9 475 31 -401 390 422 -402 -8 798 -181 -580 177 316 -545 5 138 -310 -129
3059 -129 303 105 -632 154 449 -286 -500 144 154 -163 -255 416 -55 82 160 -187 -516 456 523 -720 -532
3080 -532 606 51 -334 103 727 -269 -322 430 11 10 289 -110 -502 -144 701 -369 -521 128 364 -171
3100 -171 -189 384 -109 -386 36 -384 -631 295 107 -777 -167 476 59 -337 304 484 -27 -208 87 58 35
3121 35 341 -218 -498 220 541 -184 -442 280 418 -223 -292 232 -46 -174 198 225 -313 35 308 -533 -342
3142 -342 255 267 -378 88 525 -101 -405 340 318 -118 -91 258 -269 29 401 -137 -337 147 354 -663 -492
3163 -492 525 159 -561 234 184 -134 192 310 -327 -299 392 348 -568 -2 489 -22 -431 379 269 -188 160
3184 160 160 -378 -43 634 -3 -413 176 356 -354 -598 340 232 -593 -173 356 -167 -12 172 -349 -382 442
3205 442 333 -291 -29 210 -131 -301 204 418 3 -305 26 -146 -90 573 -135 -544 63 695 -221 -372
3225 -372 184 101 -416 -310 517 -151 25 139 -250 -374 470 384 -286 -188 556 22 -583 243 299 -133 -104 378
3247 378 -153 3 195 155 -222 259 232 -363 -504 415 243 -449 -300 88 -31 11 149 -105 -186 318 242 -369
3269 -369 -227 158 35 -527 -83 681 181 -305 9 156 -166 295 352 -392 205 619 -33 -432 403 204
3289 204 -481 129 409 134 -144 40 218 -14 244 242 -404 -426 527 145 -526 -37 176 309 -259 -20 59
3310 59 -305 153 -3 39 -109 348 65 -532 263 625 -465 -456 156 202 39 156 88 -166 -57 269 -216 -453
3332 -453 510 259 -528 95 464 118 -301 -104 260 -312 322 111 -116 -99 278 -99 -222 49 531 -550
3352 -550 -494 311 52 -376 -56 210 -255 -234 -22 -127 -214 268 206 -411 -211 387 335 -240 -112 291 -241 -222
3374 -222 259 31 -226 689 309 -425 102 563 -425 -295 344 408 -382 -184 -47 -36 -389 183 88 -215 288
3395 288 154 -675 -75 594 467 -490 150 149 47 -59 446 278 -175 338 -139 -69 269 480 -92 -219 96
3416 96 259 -16 -199 115 -54 -289 146 -11 -49 32 243 -345 -401 409 284 -484 6 508 -214 -154 84 128
3438 128 -76 181 119 -293 -277 610 -163 -452 96 320 -439 -579 175 -37 -359 -29 110 -176 104 235 -179
3459 -179 -135 586 50 -854 -85 440 198 -451 -40 87 167 188 455 -167 -127 470 -79 -473 90 371 -391
3480 -391 -306 222 29 -111 -80 -58 -117 152 46 -66 -242 263 296 -632 -160 413 84 -47 -58 352 -130 -59
3502 -59 245 -11 -161 464 -33 -403 166 564 -396 -138 339 98 -391 75 88 -118 65 350 -174 -268 -75
3523 -75 280 -276 -365 533 11 -348 -135 246 -231 -99 578 -69 -221 198 -327 -286 -81 206 -186 -545 419
3544 419 324 -132 -162 -39 -123 -191 479 -38 -240 -77 161 -261 -171 479 137 -351 32 39 51 -74 127 109 -60
3567 -60 146 -139 -56 21 186 -40 -77 165 229 -130 -122 250 -20 -241 -49 9 -201 221 333 77 -207 423 194
3590 194 -418 132 272 -231 93 114 140 -104 122 -6 -2 -205 234 0 -498 338 324 -293 -326 426 139 -42
3612 -42 92 -92 -136 -255 432 -270 -323 220 425 -465 -49 94 124 -253 165 28 -400 83 237 -141 -257
3633 -257 268 56 -186 184 307 -253 -3 381 108 -545 -61 254 -41 20 66 -414 -276 305 48 -178 -240
3654 -240 269 -106 -63 90 124 -133 104 198 243 -12 449 120 -191 -2 506 70 -305 106 146 -220 -112 226
3676 226 -30 91 28 40 -267 373 297 -528 -291 490 196 -461 -8 184 -60 -173 335 -180 -246 203 14
3697 14 -77 -143 447 -102 -147 77 158 -349 -125 80 -173 -228 -22 -248 -181 140 521 -222 -222 439 226 -142 -195
3720 -195 290 -23 127 248 -97 -5 358 -51 -399 132 442 102 -206 14 200 -283 6 42 -9 -278 260
3741 260 165 -6 -108 -50 -470 -62 -37 277 -265 3 311 99 -150 50 97 -110 -84 80 -165 171 533 69
3763 69 -544 -13 398 -194 -149 185 261 18 119 17 -488 -146 264 -30 17 401 26 -538 221 154 -39 -164
3785 -164 283 36 -300 -2 206 -32 38 339 5 -201 159 199 -29 -270 276 387 -173 4 198 -50 84
3806 84 -13 201 -67 65 332 -271 -127 266 8 -132 90 -91 -4 -204 62 -74 -76 -7 75 -215 -191 435 22
3829 22 -366 311 384 -243 -134 -35 -79 114 -13 198 -131 140 220 -387 -151 413 168 -313 51 318 -39 -113
3851 -113 81 30 -371 116 102 -262 182 289 -93 -159 94 148 -221 -92 161 141 -203 -145 -18 103 188 224 -198
3874 -198 -279 232 95 -130 21 -15 -237 -275 320 259 3 333 216 -247 -233 405 94 -170 99 114 -189 -81
3896 -81 38 -18 -104 18 -13 47 -31 154 110 -362 184 151 -214 20 277 -68 -465 -138 -53 -68 -88 164 -193 33
3920 33 435 66 -450 301 268 -88 -305 316 -86 -300 -18 -32 -110 -65 214 -199 -42 338 5 -452 -100 100
3942 100 8 -217 128 129 -3 -199 -101 47 -2 105 -68 -259 -33 227 -189 -535 156 6 -49 -12 92 213
3964 213 -87 150 19 -57 283 269 -67 -195 312 90 -273 -122 180 -15 -127 -21 7 -292 164 177 -323
3985 -323 53 224 -17 -186 227 287 -166 -162 38 -333 -53 -47 -52 13 163 4 -180 -64 289 29 -274 -156 103
4008 103 -193 -205 0 -312 342 129 325 119 3 149 -64 -112 403 217 -269 -59 236 -40 15 272 152
4029 152 -206 -26 176 -112 -178 159 -54 -106 -113 48 -36 -78 -78 40 -138 24 12 -487 -198 338 -52 -430 270
4052 270 357 -150 -203 139 26 -155 88 -67 -234 133 87 -36 -38 359 39 -413 -217 269 85 -376 -265 229
4074 229 178 -191 8 -81 46 317 225 -307 195 203 -482 -95 -157 380 -114 -232 30 -6 -34 124 -72 -223 238
4097 238 -320 -344 22 489 207 -458 -105 128 -170 -29 187 -102 -212 202 -4 -114 309 304 -32 -137 218
4118 218 252 -58 -48 -44 56 213 138 -12 -344 -30 75 -457 -239 162 241 -230 33 62 -73 -102 134 -8 125
4141 125 -148 -61 -18 -98 519 -35 -384 45 494 -17 5 -53 -249 24 27 205 27 -131 -6 -125 -38 554 13
4164 13 -95 -276 -120 -21 -84 -10 20 -149 -143 120 -5 -11 331 -219 -211 112 159 -328 -138 142 119 -2 428 -117
4188 -117 -55 397 183 -246 -288 335 61 -451 -134 162 80 -208 -92 39 -125 -49 -3 -237 146 333 32 -25
4210 -25 230 559 96 -259 -41 273 -113 -264 188 -404 20 77 32 -190 70 164 -153 -256 147 -105 -36 37
4232 37 81 -112 -125 227 32 65 376 -161 -258 157 281 -154 8 232 167 -116 -22 270 -29 -76 70 -234 -78
4255 -78 -32 -30 -244 -412 168 -39 80 -82 20 -36 63 31 88 -161 -5 217 -337 -46 240 -203 -297 121 401
4278 401 -34 -168 -16 80 51 123 69 -199 298 91 4 -37 134 103 -369 71 61 -65 -143 51 -129 -21 16
4301 16 85 -348 31 195 77 -190 195 98 108 -8 -99 295 -131 204 -32 39 96 224 -109 -281 272 205 -272
4324 -272 -311 316 53 -253 143 26 -358 163 127 -284 -43 129 -121 -622 99 247 -171 -181 250 11 -122
4345 -122 8 -159 -178 183 177 -178 -198 173 263 -202 -216 381 231 -91 76 -57 -98 43 -92 -201 -42 293
4367 293 97 -302 246 307 -25 -304 306 263 -63 49 200 -69 28 4 -99 15 105 162 -337 -330 126 120 -209
4390 -209 -35 225 95 -110 -201 -129 -43 246 161 -243 -49 104 -24 -29 408 112 89 -23 19 135 -10 249 -10
4413 -10 -76 69 357 91 13 161 27 -168 81 260 -11 -184 -202 -5 -135 156 286 -268 -51 295 -58
4434 -58 -175 -67 143 -63 -55 -11 19 133 20 108 -316 -50 191 -162 27 212 1 -274 -160 0 -50 -195
4456 -195 18 163 -139 -119 125 -160 -184 -62 54 -254 154 260 -59 -164 65 134 -156 -92 89 -30 310
4477 310 353 39 -97 217 87 23 -56 -150 -3 -58 -135 -46 191 -62 101 27 22 -10 31 -253 190 181 -237 -259 275
4502 275 70 54 -50 272 -114 101 85 29 -16 -268 42 -313 91 163 -49 -129 -199 40 -85 125 -256 -57
4524 -57 -187 234 99 -279 -82 107 -256 -127 255 339 -91 54 348 -162 26 54 -7 -213 312 -45 -51 -241
4546 -241 207 -201 -343 351 161 92 -78 103 77 -263 143 191 -352 -85 203 29 -232 143 -2 -43 31 164
4568 164 -69 -83 161 204 -114 4 56 -290 -43 123 -76 -382 67 170 73 178 86 -103 49 46 -21 -166 -97
4591 -97 154 128 -180 276 167 -259 -18 11 25 188 41 233 -75 1 369 -156 -68 180 288 -323 -280 208
4613 208 0 -100 -95 -249 15 135 -152 -79 -207 244 -55 -316 93 38 -37 -124 424 101 11 41 -147 50 -143
4636 -143 165 -227 -155 243 -27 -115 99 227 89 -110 58 202 -244 355 -56 -208 59 114 -131 -329 -84
4657 -84 231 11 -352 53 147 -58 -330 87 -105 -116 10 -55 -99 33 98 -205 -289 376 164 -206 52 387
4679 387 94 -330 -100 -65 -163 3 -155 -433 -102 486 -102 -45 -165 76 91 -79 -36 -125 -154 -28 -242 -333 21
4702 21 49 13 -248 -100 170 -30 51 39 -8 -183 372 73 0 39 182 -103 -164 97 -110 -156 -302 79 131 -179
4726 -179 136 372 -47 82 -223 160 -237 113 -44 -240 298 339 -97 -134 274 -63 49 -15 -12 41 175 135
4748 135 -257 -180 236 250 -357 -35 -1 -90 75 353 278 -114 37 75 -211 1 160 -246 -146 124 192 -108
4770 -108 53 164 -171 -39 -3 -179 329 168 105 -104 20 280 -130 -352 -12 185 -413 -362 64 368 -242
4791 -242 -86 65 3 -13 121 -82 -37 -45 411 -218 -204 81 91 -170 -75 28 -121 258 163 -27 -298 228 46
4814 46 -209 -79 352 -174 -265 73 117 -34 -51 225 -65 224 229 -218 -229 97 36 -216 -210 2 173 -284 121
4837 121 151 -203 -29 -26 -181 -16 253 13 -277 -269 173 -98 -271 -1 145 -53 -213 -105 133 -55 -105 169
4859 169 -61 95 28 52 -30 58 328 -285 70 35 99 -63 83 15 -5 -74 43 73 -231 150 52 -445 159 7
4883 7 -233 -42 19 10 -42 -103 -133 -6 -21 349 -425 -101 203 49 -229 79 26 -156 -61 263 -70 62 45 -13
4907 -13 0 -76 262 -99 -222 -185 18 0 -71 279 188 11 1 246 -122 199 -41 -210 -283 143 103 -233 -68
4930 -68 349 -18 -58 -46 209 -16 63 124 35 103 -49 -46 -191 242 147 -154 260 50 116 -71 -150 115 -64 160
4954 160 -40 206 -112 -42 64 -174 -265 428 170 -140 167 328 129 -17 -35 -55 -127 382 -43 -137 -88 54
4976 54 -300 -33 3 -41 -157 -223 120 -98 -253 96 -13 -240 -23 14 -152 137 52 -102 -63 -154 244 -137 -69
4999 -69 -61 -29 -131 332 23 -85 103 316 -60 -75 -130 151 -86 159 190 -108 -85 -44 40 -137 41 255 -117
5022 -117 -216 327 217 -264 -175 181 14 49 -371 14 50 222 -161 96 -317 -23 -337 -70 83 31 -111 -129
5044 -129 -50 -71 -141 281 -2 -200 36 -104 113 26 -85 44 -295 -182 399 79 -101 84 -276 -82 -20 120
5066 120 168 26 149 43 -85 -42 -25 -121 -124 21 -164 -216 -225 232 -41 76 218 -149 107 28 89 -46 -143 311
5090 311 15 -4 -61 247 -83 404 86 1 -35 253 19 -229 -128 184 -78 -175 212 161 -121 -223 274 -123
5112 -123 175 215 -144 -113 136 -17 -78 53 379 89 62 36 35 59 165 55 -226 -41 -17 195 -568 -4 242
5135 242 133 -160 -91 51 -70 50 114 244 -222 -123 -102 25 17 104 -176 -287 52 63 -124 262 185 -84 -41
5158 -41 6 59 -95 185 186 -103 -89 109 -20 -204 62 119 -207 -79 79 -74 74 -48 103 10 253 449 -174
5181 -174 -33 160 99 13 -37 -298 -67 -83 38 184 -50 -142 -16 -218 -87 144 -64 -24 -69 431 -16 -26 66
5204 66 -93 -129 136 142 198 167 -180 206 64 99 130 -208 161 213 -37 -242 230 25 -159 111 70 -221 82
5227 82 184 75 -357 -187 -79 158 -117 45 155 -153 -30 110 -150 95 408 -231 -258 -2 111 -222 66
5248 66 32 181 67 -108 114 -15 -13 -56 -44 10 163 -4 -310 417 95 -107 -187 229 156 -321 -400 239 -149
5271 -149 177 44 57 -16 238 422 96 -214 75 95 -254 -80 272 211 6 178 -179 102 326 276 -124 -163
5293 -163 16 -41 -30 -235 81 -45 -40 -272 -44 -168 -13 -86 -184 267 351 -230 -175 19 138 -11 -278 248 151
5316 151 38 -22 -274 -39 157 -187 -302 -38 313 -101 -491 -91 470 -73 16 62 51 154 105 -159 -199 123
5338 123 133 -138 -455 217 343 -194 -75 -103 167 163 220 -95 93 -258 177 -112 -271 236 -118 84 -163 39
5360 39 -190 81 77 84 -186 150 -37 -3 -35 141 -186 -101 -244 252 -168 -182 68 68 98 137 231 -211 -261 -59 -85
5385 -85 -95 89 2 -117 98 155 -236 -142 -27 53 -23 151 165 -35 118 188 -48 -406 335 96 -32 -28 10 -211
5409 -211 86 -80 190 -100 -89 151 196 -219 254 4 -191 -43 -136 94 -105 -162 -68 52 -167 -187 -84 -131
5431 -131 84 -325 -101 108 227 68 -282 84 14 -279 86 -49 107 -202 -52 -64 -69 84 213 -165 -38
5452 -38 340 120 -116 -32 256 -387 -121 67 138 22 -38 -160 -40 257 -10 -138 -83 153 300 -11 -231 92
5474 92 106 42 9 27 198 298 -174 -135 89 236 2 -232 -160 -34 -143 -66 -31 -58 -68 230 206 102 -212 61
5498 61 80 43 13 95 122 -144 214 -57 -96 17 -99 -148 201 73 -304 -84 280 102 -335 -13 90 -77 158
5521 158 180 -71 -114 195 -110 47 76 240 -58 12 218 262 14 17 118 -50 -169 127 -97 -142 -63 175 -277
5544 -277 -90 228 1 -178 19 1 -123 -331 -171 -71 81 -162 -135 61 -194 255 -175 -164 87 359 -35
5565 -35 21 132 64 -110 -60 140 -13 -173 49 38 5 -73 273 -59 -25 143 -76 -228 94 97 -248 -175 157 15
5589 15 -119 33 -18 -62 -181 128 -164 -235 67 54 -132 -257 -10 281 117 376 -9 36 61 104 -67 85 332
5612 332 37 -134 -42 96 -68 -17 176 -109 -173 155 -45 -171 24 -17 27 -87 74 148 19 -200 230 93
5634 93 -2 8 278 -200 125 -99 -233 -100 92 212 -300 -85 -65 -161 61 -62 108 105 34 -27 -69 -57 238 -65
5658 -65 -243 -56 112 204 -199 74 146 -70 -150 -81 -41 -61 67 -51 -238 170 77 -327 -113 213 -226 -137 216
5681 216 -176 -47 -179 148 42 140 -24 -27 -13 -28 17 154 -290 -36 224 -17 18 50 86 -218 178 -144 106
5704 106 -70 269 -164 -39 164 -113 -269 -97 202 -167 -185 -17 186 -53 200 -204 -70 76 268 -157
5724 -157 -224 -42 147 -147 -155 51 119 -315 61 61 -230 117 40 -53 5 340 201 -144 -190 276 57 -66 67
5747 67 32 -75 29 148 -62 33 109 -16 -148 226 221 90 -321 17 -2 -93 100 -120 133 -42 39 -162 -91
5770 -91 172 227 139 66 4 156 -129 -93 -14 -108 -35 329 -176 -106 28 122 -239 -66 149 -241 -123 42 249 -73
5794 -73 82 123 -150 85 0 -50 3 197 5 -280 -26 176 -232 -15 135 80 76 316 101 -219 117 -17 -121
5817 -121 -224 -154 8 -177 -381 62 147 143 -4 150 -168 -125 80 116 -36 188 433 55 -281 275 117 -420
5839 -420 31 236 -176 -89 73 -33 -156 -44 92 -329 1 -39 -73 -491 146 35 -56 -126 206 -127 -90 148
5861 148 -86 51 173 180 -57 -81 -62 237 -216 311 112 258 57 189 -73 3 -224 50 -22 -143 239 -109
5883 -109 -357 -154 389 -7 -62 222 -146 -152 264 92 31 136 386 -330 -65 355 12 -213 -213 227 -122 -68
5905 -68 99 178 -172 2 -20 -212 48 76 -46 -338 -30 111 -34 -197 -146 423 -97 -10 -11 -106 -151 -6 -189
5928 -189 -11 196 230 -170 127 107 -82 98 75 126 -244 -226 60 -330 30 63 -87 -286 47 69 -6 -247 178
5951 178 214 -272 -188 -77 -126 -108 -5 -44 -172 328 130 -7 56 108 -26 -119 91 -57 -232 -13 96 109 -266
5974 -266 328 243 -130 -57 19 -159 -294 175 134 -59 -157 161 -136 128 -2 223 -193 39 146 10 -175 -78
5996 -78 149 -304 -214 318 -119 -239 -11 -42 140 -88 -26 -140 97 140 -163 -130 32 44 162 -239 4 98 -4
6019 -4 -241 -170 222 24 352 -168 -256 270 -208 -13 172 -66 100 -13 100 -136 37 191 14 -245 -193 -9
6041 -9 1 -67 117 59 5 8 148 25 -234 88 114 -174 -55 76 -17 -75 -31 -8 -308 219 22 48 -79 -89 -89 10
6067 10 227 -5 -33 220 242 173 -85 134 277 18 -80 81 -185 -74 70 -55 -12 99 258 -43 -159 143
6089 143 -19 -177 32 330 132 -145 85 84 -15 -3 -27 -66 -36 -112 0 -66 -208 306 33 -353 -99 153 102
6112 102 -42 62 41 -144 -69 24 -155 92 211 128 72 256 37 0 -109 -74 -68 174 -97 41 -78 161 78
6135 78 -10 76 104 -40 -154 57 155 -209 -88 51 132 93 -77 123 -106 -176 444 -233 -204 287 -70 93 -163
6158 -163 190 74 348 -129 -27 -3 -66 136 -210 -29 87 116 -123 293 420 165 -68 -31 -61 130 111 19
6180 19 180 246 -19 -18 61 193 171 -178 93 30 320 113 -75 150 80 9 -24 -37 -203 113 -49 67 -65 22
6204 22 -58 -106 148 -177 11 132 -198 -97 220 13 68 -117 120 109 -196 20 181 -78 -108 156 118 -65
6226 -65 -111 -71 -94 77 153 131 -203 -82 335 -77 -38 -79 -62 -79 -55 93 15 18 87 -77 -143 63 71 -442 158 346
6252 346 -26 24 15 -1 -151 92 -178 -39 -274 -82 101 -30 62 71 -149 -288 -121 313 -50 -158 -110 -52 -207
6275 -207 -20 -50 -157 -289 -2 -12 35 -61 64 -93 129 -34 100 -79 -239 -6 -247 255 359 -237 -118
6296 -118 97 -122 56 -170 196 -12 -48 -26 -176 -22 -132 -202 -200 70 234 20 -354 150 95 133 62 162 83
6319 83 176 25 37 -223 -199 177 -290 91 118 184 -102 44 -61 -232 245 -115 -44 72 -47 15 -197 16 36
6342 36 -93 70 247 286 137 -30 -88 -44 37 114 -3 -370 88 64 -93 -23 23 -36 -214 -23 20 169 -213 71
6366 71 118 79 326 -128 -99 223 252 -11 -309 111 253 -194 -166 286 26 101 46 -80 -104 -113 115 -7 -172 98
6390 98 54 -60 79 -183 35 -60 -210 9 -37 -165 -26 -101 220 36 -114 -70 98 152 8 -71 116 -25 -157
6413 -157 216 41 88 -233 86 -81 9 171 -58 -252 54 -90 -180 -166 -226 98 -40 -150 13 183 -58 300
6435 300 28 -119 56 125 -136 -39 150 118 57 74 -29 -9 -339 82 -40 -157 138 -73 -155 -178 12 31 -103
6458 -103 -63 4 32 -244 24 196 -19 191 52 -119 87 -264 202 8 208 42 163 -152 214 -89 291
6479 291 -90 -55 54 149 248 67 34 154 -11 -86 105 125 -61 -174 -84 114 -115 36 54 -100 -119 35 -178
6502 -178 -245 149 -22 -155 45 340 258 -38 -161 34 43 23 125 -29 -167 263 73 -253 -97 201 -81 69
6524 69 27 -37 -77 -43 210 -5 46 -134 -55 -15 -36 183 -79 -178 386 429 -174 324 90 14 -116 12 219 -167
6548 -167 204 -84 -296 -125 102 -129 -228 -67 157 -81 -124 371 -1 52 234 -45 -80 17 92 -219 -209 -12
6570 -12 32 19 130 -75 24 -10 -80 26 17 -75 104 -28 69 267 -122 -106 -51 124 -52 -33 249 140 -116 -150 164
6595 164 -59 -88 153 -169 -157 199 14 54 254 137 145 -12 161 111 -56 136 139 24 138 52 234 -364 5
6618 5 89 -104 -140 -202 49 -26 -32 0 -34 21 -142 -163 -117 15 -85 -53 98 94 7 -85 35 159 178 108 185 -76 -170
6645 -170 154 157 -176 47 -51 -104 -252 52 -3 -37 127 -131 -137 8 149 -108 48 -38 280 -110 -102 248 136 2
6669 2 14 356 -6 24 -63 -33 -226 64 -124 -184 -21 26 200 -345 -19 -122 -109 -68 147 45 26 191 147 105
6693 105 -69 224 -144 1 127 -93 -4 140 -108 -5 -83 -81 28 30 -332 154 -47 -95 214 -10 -497 -20
6715 -20 -148 37 78 -80 -63 57 40 33 -92 59 76 -169 -218 5 0 28 -193 84 -72 83 176 82 53 11 30
6740 30 -274 20 -20 146 -207 107 -348 42 -193 -66 14 54 -90 -238 -90 34 137 -162 -159 -7 -53 56
6762 56 109 117 146 64 -178 -100 3 175 -4 138 -214 184 264 -150 108 93 33 272 72 -181 27 85 173 -7
6786 -7 29 65 -82 39 135 -11 -210 -28 91 28 78 -102 160 141 -160 11 -98 -109 181 -22 -321 -139 -414
6809 -414 -56 -166 -24 -188 185 204 -282 -178 -391 -152 1 -88 93 -118 -144 -10 -18 -119 58 158 -64 143
6831 143 -35 189 -15 157 202 -59 19 -105 442 -84 -27 -30 29 -158 -4 -108 4 95 -73 -204 -56 137
6853 137 54 -114 -120 16 -32 147 -59 -35 0 -120 -3 -198 102 -34 86 93 49 262 -64 20 -138 -183 -147 -7
6877 -7 181 -190 14 -133 -84 -198 -13 200 42 127 66 325 -346 -169 44 -59 18 141 53 -164 19 117 -66
6900 -66 -113 -25 43 -147 -193 164 -66 -295 88 331 -129 -112 -187 -179 -121 -124 -244 68 -15 -26 -24 -158 -42 54 -68 86
6926 86 -34 105 45 103 42 -96 81 40 -78 47 177 -114 100 -63 -159 -262 35 180 -239 -94 191 -16
6948 -16 -138 31 -56 -139 -330 145 117 13 -45 -86 -56 167 78 116 345 295 -54 -144 197 155 130 363 183 129 -3
6973 -3 72 -103 -10 -111 76 44 164 207 -64 -7 -372 16 137 -97 175 26 91 30 5 59 -261 -98 -28 7
6997 7 126 127 -207 -278 163 165 -4 -192 141 -87 -2 227 28 -133 -192 1 16 86 186 8 69 -70 138 -187
7021 -187 -376 -33 135 -129 95 -132 -6 -112 166 26 77 68 -4 -179 -289 7 228 33 40 -27 -132 -216 4
7044 4 59 -126 156 27 93 -60 104 70 -170 112 -97 115 246 126 -84 75 -90 -341 4 -15 49 -228
7066 -228 -161 -8 -132 39 -129 131 137 -50 15 -153 -319 -114 -82 -95 -253 -43 25 -151 -263 -164 -36 115 154
7089 154 -182 8 175 -103 -156 -53 42 -92 98 193 22 59 193 -8 36 123 -13 96 -71 424 220 -142
7111 -142 -212 -70 -70 -86 23 -65 10 24 92 17 68 -272 51 -77 -6 76 52 -153 64 -159 -22 -82 39 54 48 -31
7137 -31 46 -87 48 116 -392 -133 65 70 -25 -265 130 -80 175 -49 46 -187 -64 24 -153 -11 142 -95 132
7160 132 90 42 46 -32 140 -163 -108 109 -214 -84 138 130 -201 0 40 -113 55 -251 -66 8 -213 -113 -21 -149
7184 -149 155 -6 -123 68 95 208 13 21 -99 -203 -126 82 22 135 -66 90 -176 -8 -50 -183 125 269
7206 269 -28 -29 -161 -212 -95 -120 161 -327 -46 -50 -13 39 -84 325 -61 -134 34 123 -63 1 21 18 348 207 158
7231 158 -112 -50 -122 144 -236 0 185 -140 -74 85 95 -80 38 179 96 10 -162 99 23 107 264 69 -35
7254 -35 277 7 174 -75 -72 -61 -119 99 -177 69 86 -318 -58 57 -56 -149 -160 164 20 109 83 86 -38 63
7278 63 -40 -10 -146 103 12 -122 -107 73 -70 32 197 -21 -7 -29 30 93 -106 120 90 -144 -201 -18 -139
7301 -139 -63 129 176 -184 116 143 -97 46 74 24 174 199 -108 206 103 105 -82 -148 195 -18 71 148 -106 -193
7325 -193 240 126 127 -398 58 47 -84 24 -119 215 -249 7 179 -51 -120 -159 -33 -103 209 128 82 -123 61
7348 61 -2 -13 137 -68 58 -101 -11 -87 -41 141 72 -248 -148 114 191 -172 25 -353 -358 -345 159 14 -178 16
7372 16 -259 -323 58 -151 145 -63 1 108 82 68 77 23 23 180 26 10 -248 84 -15 43 56 39 -209 17 217
7397 217 -107 -178 173 196 -106 229 55 127 -372 -39 91 -152 -166 195 -215 65 129 -161 -160 188 -194 -120 147
7420 147 14 -82 49 68 -107 124 139 8 149 28 135 -88 -122 -230 -197 125 148 96 236 176 -16 -193 76
7443 76 -64 -48 -25 -113 25 159 -6 25 -58 89 133 -90 84 -130 102 -79 -241 -211 289 3 146 -85 -165
7466 -165 -101 17 181 -83 -41 39 102 -260 228 93 39 -187 102 31 53 61 -47 112 84 168 111 -21 70 -143
7490 -143 20 54 -117 68 -45 -187 -88 199 -78 -150 14 -64 -105 -156 -153 -144 37 -52 66 165 165 25 274 205 -40
7515 -40 5 11 -11 -4 -26 -124 2 -25 130 -42 133 -214 204 -333 -99 68 285 -72 -137 71 -45 -193 -3 415
7539 415 61 -170 -53 -161 18 115 -180 -95 172 8 107 -107 140 198 -103 -2 -16 -183 -98 50 198 218
7561 218 -115 -141 93 -50 -206 -91 58 84 -130 215 227 229 150 -166 -109 -107 252 -143 -92 62 304 125 -241
7584 -241 25 -119 70 -24 -138 -108 49 264 -170 144 -144 64 27 2 73 -132 -117 -287 0 -114 36 97
7606 97 -10 -133 76 302 10 34 -257 58 -151 -333 163 -164 65 -65 -2 119 -33 79 -7 -166 -18
7627 -18 -152 -97 -98 -127 -151 -180 -119 122 154 -187 -35 342 24 -25 151 -288 -76 156 -188 169 165 -137 159 -15
7651 -15 -19 253 20 -62 6 -280 10 -121 -42 -353 -23 166 -203 -186 21 -55 -215 -49 -34 194 -90 0 -9 -193
7675 -193 131 35 58 151 -1 71 -92 30 34 -38 -60 87 232 -171 61 13 22 210 -61 -214 -26 -5 -206 -101
7699 -101 -128 -319 -15 68 153 17 -58 185 17 -105 152 -97 -103 -53 -120 35 -33 97 76 47 59 142 199 -50 -107
7724 -107 -150 -114 48 -232 -233 29 51 -33 112 73 289 221 141 -141 -193 288 55 61 -213 53 -116 145 -239 -115
7748 -115 -31 -74 -94 -22 -126 144 -78 -167 56 -52 -103 -8 -92 -122 -214 -96 -44 55 -85 -312 -100 45 130 -285
7772 -285 -164 114 -14 -150 153 -48 29 80 24 23 -17 -199 -52 -17 -400 -185 -166 31 -59 -85 -27 191 109 -196
7796 -196 -251 98 77 37 -312 78 198 -96 188 -232 100 38 -42 -153 -118 -83 189 -299 164 41 48 40 -140 7
7820 7 -56 48 27 145 -48 0 130 -91 76 -100 -118 55 203 80 48 137 -62 -43 18 388 -206 -29 354
7843 354 -76 7 -279 156 -6 114 -223 140 52 174 -41 -30 -16 -19 -366 87 39 9 24 -33 26 -5 11 29 160
7868 160 -16 76 2 -326 -47 252 36 0 21 210 32 188 -11 -190 135 -42 -29 112 -87 68 102 -3
7890 -3 -124 49 38 -67 254 -17 126 -39 142 233 -75 28 -74 103 95 -317 -296 107 326 161 -141 -55 27
7913 27 -169 -84 88 -63 -131 -99 -197 -11 -153 -69 -385 45 -85 56 -341 50 24 -97 339 -78 -23 52 298
7936 298 47 116 119 18 -37 13 -50 -47 45 -98 -92 182 98 19 -171 3 156 70 146 -60 -182 169 -203 76 -58
7961 -58 -83 150 -118 -64 -160 159 -133 -93 -263 -183 9 79 247 -19 91 -222 -72 112 27 -20 -148 -200 348
7984 348 122 -99 -158 -200 86 16 187 -19 313 -61 111 -257 -115 69 20 -386 301 -64 93 -119 -7
8005 -7 -95 44 146 -71 -108 -48 182 -58 -36 -5 -171 -144 194 54 -7 -69 -109 -102 -82 32 179 91 -1 85 -61 -89
8031 -89 -58 -16 87 -112 346 -85 4 5 55 -11 0 159 -33 78 193 27 -144 -146 286 -47 111 -86 -129 -99
8055 -99 -225 129 122 -87 -36 163 0 90 -54 59 57 188 124 105 -80 -35 -77 154 40 -216 231 -15 -33 -114
8079 -114 170 -76 -177 42 157 -273 56 -260 68 -73 110 -52 -69 -99 16 167 -64 215 180 143 256
8100 256 -197 -143 -131 -145 130 98 71 -206 -169 293 -216 146 62 51 -40 102 41 -92 -225 164 135 179 202 38
8124 38 74 -93 76 78 162 -100 -50 -28 -41 -75 -157 6 213 222 -220 74 350 -130 440 100 149 -466 -114 55
8148 55 -266 -6 -128 -35 84 -143 -276 10 0 -29 -65 158 -228 -13 188 -95 -13 8 -23 93 148 157 230 248
8172 248 -106 65 -159 -86 -100 -271 -156 36 -68 117 13 152 59 152 -64 222 -114 79 38
8191C8
##END NTUPLES=NMR FID
##END=
