##TITLE=1H_3PEPPA0607-3
 CD3CN+D2O, 8 sc, 
 7.07.2021
##JCAMPDX= 6.0         $$ Bruker NMR JCAMP-DX V2.0
##DATA TYPE= NMR FID
##DATA CLASS= NTUPLES
##ORIGIN= UXNMR, Bruker Analytische Messtechnik GmbH
##OWNER= root
$$ XWIN-NMR		Version 3.5
$$ Wed Jul  7 10:06:23 2021 Russian Standard Time (UT+4h)  she@DPX200
##.OBSERVE FREQUENCY= 200.131506
##.OBSERVE NUCLEUS= ^1H
##.DELAY= (6, 6)
##.ACQUISITION MODE= SIMULTANEOUS
##.ACQUISITION SCHEME= undefined
##.AVERAGES= 8
##.DIGITISER RES= 18
##SPECTROMETER/DATA SYSTEM= spect
##.PULSE SEQUENCE= zg30
##.SOLVENT NAME= D2O
##.SHIFT REFERENCE= (INTERNAL, D2O, 0, 15.7039)
##AUDIT TRAIL= $$ (NUMBER, WHEN, WHO, WHERE, WHAT)
$$ ##TITLE= Audit trail, XWIN-NMR		Version 3.5
$$ ##JCAMPDX= 5.01
$$ ##ORIGIN= Bruker BioSpin GmbH
$$ ##OWNER= she
$$ F:/spectra/data/she/nmr/H-F/1/audita.txt
$$ ##AUDIT TRAIL=  $$ (NUMBER, WHEN, WHO, WHERE, WHAT)
(   1,<2021-07-07 10:05:03.81 +0400>,<she>,<DPX200>,
      <created by zg, POWCHK disabled, PULCHK disabled
       configuration hash MD5:
       00 E9 B6 7A A2 85 ED C7 34 08 36 98 17 FE 4E 26
       data hash MD5: 16K
       F7 1D 49 04 D5 19 AD C1 6A 65 2D 80 72 09 41 05>)
$$ ##END=
$$ 
$$ hash MD5
$$ E6 04 80 E1 04 95 DD B5 6E 45 40 0E 39 80 74 F9
##$RELAX= 
##$RELAX= 
##$RELAX= 
##$RELAX= 
##$RELAX= 
##$RELAX= 
$$ Bruker specific parameters
$$ --------------------------
##$DU= <F:/spectra>
##$EXPNO= 1
##$NAME= <H-F>
##$PROCNO= 1
##$TYPE= <nmr>
##$USER= <she>
##$AMP= (0..31)
100 100 100 100 100 100 100 100 100 100 100 100 100 100 100 100 100 100 
100 100 100 100 100 100 100 100 100 100 100 100 100 100 
##$AQSEQ= 0
##$AQ_mod= 1
##$AUNM= <au_zg>
##$AUTOPOS= <>
##$BF1= 200.13
##$BF2= 200.13
##$BF3= 200.13
##$BF4= 200.13
##$BF5= 200.13
##$BF6= 200.13
##$BF7= 200.13
##$BF8= 200.13
##$BYTORDA= 1
##$CFDGTYP= 0
##$CFRGTYP= 5
##$CHEMSTR= <none>
##$CNST= (0..31)
1 1 145 1 1 1 1 1 1 1 1 1 1 1 1 1 1 1 1 1 1 1 1 1 1 1 1 1 1 1 1 1 
##$CPDPRG= <>
##$CPDPRG1= <>
##$CPDPRG2= <>
##$CPDPRG3= <>
##$CPDPRG4= <mlev>
##$CPDPRG5= <mlev>
##$CPDPRG6= <mlev>
##$CPDPRG7= <mlev>
##$CPDPRG8= <mlev>
##$CPDPRGB= <>
##$CPDPRGT= <>
##$D= (0..31)
0 1.2 0 0 0 0 0 0 0 0.06 0 0.03 0 0 0 0 0.0002 0 0 0 0 0 0 0 0 0 0 0 0 
0 0 0 
##$DATE= 1625637903
##$DBL= (0..7)
120 120 120 120 120 120 120 120 
##$DBP= (0..7)
150 150 150 150 150 150 150 150 
##$DBP07= 0
##$DBPNAM0= <>
##$DBPNAM1= <>
##$DBPNAM2= <>
##$DBPNAM3= <>
##$DBPNAM4= <>
##$DBPNAM5= <>
##$DBPNAM6= <>
##$DBPNAM7= <>
##$DBPOAL= (0..7)
0.5 0.5 0.5 0.5 0.5 0.5 0.5 0.5 
##$DBPOFFS= (0..7)
0 0 0 0 0 0 0 0 
##$DE= 6
##$DECBNUC= <off>
##$DECIM= 32
##$DECNUC= <off>
##$DECSTAT= 4
##$DIGMOD= 1
##$DIGTYP= 9
##$DL= (0..7)
0 120 120 120 120 120 120 120 
##$DP= (0..7)
150 150 150 150 150 150 150 150 
##$DP07= 0
##$DPNAME0= <>
##$DPNAME1= <>
##$DPNAME2= <>
##$DPNAME3= <>
##$DPNAME4= <>
##$DPNAME5= <>
##$DPNAME6= <>
##$DPNAME7= <>
##$DPOAL= (0..7)
0.5 0.5 0.5 0.5 0.5 0.5 0.5 0.5 
##$DPOFFS= (0..7)
0 0 0 0 0 0 0 0 
##$DQDMODE= 0
##$DR= 18
##$DS= 0
##$DSLIST= <SSSSSSSSSSSSSSS>
$$ [...]
##$SUBNAM2= <"">
##$SUBNAM3= <"">
##$SUBNAM4= <"">
##$SUBNAM5= <"">
##$SUBNAM6= <"">
##$SUBNAM7= <"">
##$SUBNAM8= <"">
##$SUBNAM9= <"">
##$SW= 20.0188882624521
##$SWIBOX= (0..15)
0 0 2 0 0 0 0 0 0 0 0 0 0 0 0 0 
##$SW_h= 4006.41025641026
##$TD= 16384
##$TD0= 1
##$TE= 0
##$TE2= 300
##$TE3= 300
##$TEG= 300
##$TL= (0..7)
0 120 120 120 120 120 120 120 
##$TP= (0..7)
150 150 150 150 150 150 150 150 
##$TP07= 0
##$TPNAME0= <>
##$TPNAME1= <>
##$TPNAME2= <>
##$TPNAME3= <>
##$TPNAME4= <>
##$TPNAME5= <>
##$TPNAME6= <>
##$TPNAME7= <>
##$TPOAL= (0..7)
0.5 0.5 0.5 0.5 0.5 0.5 0.5 0.5 
##$TPOFFS= (0..7)
0 0 0 0 0 0 0 0 
##$TUNHIN= 0
##$TUNHOUT= 0
##$TUNXOUT= 0
##$USERA1= <user>
##$USERA2= <user>
##$USERA3= <user>
##$USERA4= <user>
##$USERA5= <user>
##$V9= 5
##$VALIST= <valist>
##$VCLIST= <CCCCCCCCCCCCCCC>
##$VD= 0
##$VDLIST= <DDDDDDDDDDDDDDD>
##$VPLIST= <PPPPPPPPPPPPPPP>
##$VTLIST= <TTTTTTTTTTTTTTT>
##$WBST= 1024
##$WBSW= 4
##$XGAIN= (0..3)
0 0 0 0 
##$XL= 0
##$YL= 0
##$YMAX_a= 114293
##$YMIN_a= -172772
##$ZGOPTNS= <>
##$ZL1= 120
##$ZL2= 120
##$ZL3= 120
##$ZL4= 120
##$ABSF1= 10
##$ABSF2= 0
##$ABSG= 5
##$ABSL= 3
##$ALPHA= 0
##$AQORDER= 0
##$ASSFAC= 0
##$ASSFACI= 0
##$ASSFACX= 0
##$ASSWID= 0
##$AUNMP= <proc_1d>
##$AZFE= 0.1
##$AZFW= 0.1
##$BCFW= 1
##$BC_mod= 2
##$BYTORDP= 1
##$COROFFS= 0
##$CY= 11.3945322036743
##$DATMOD= 1
##$DC= 2
##$DFILT= <>
##$DTYPP= 0
##$F1P= 15.9154993809931
##$F2P= -4.1035820241983
##$FCOR= 0.5
##$FTSIZE= 0
##$FT_mod= 4
##$GAMMA= 1
##$GB= 0.15
##$INTBC= 1
##$INTSCL= 1
##$ISEN= 128
##$LB= 0.24
##$LEV0= 0
##$LPBIN= 0
##$MAXI= 10000
##$MC2= 0
##$MEAN= 0
##$ME_mod= 0
##$MI= 1.114404
##$NCOEF= 0
##$NC_proc= 0
##$NLEV= 6
##$NOISF1= 3.799351
##$NOISF2= 2.8
##$NSP= 1
##$NTH_PI= 0
##$NZP= 0
##$OFFSET= 15.70392
##$PC= 1
##$PHC0= -11919.16
##$PHC1= 14.80099
##$PH_mod= 1
##$PKNL= yes
##$PPARMOD= 0
##$PSCAL= 0
##$PSIGN= 0
##$REVERSE= no
##$SF= 200.130013532006
##$SI= 16384
##$SIGF1= 3
##$SIGF2= 2
##$SINO= 400
##$SIOLD= 16384
##$SREGLST= <1H.CDCl3>
##$SSB= 0
##$STSI= 0
##$STSR= 0
##$SW_p= 3612.71676300578
##$SYMM= 0
##$S_DEV= 0
##$TDeff= 0
##$TDoff= 0
##$TI= <>
##$TILT= no
##$TM1= 0
##$TM2= 0
##$TOPLEV= 0
##$USERP1= <user>
##$USERP2= <user>
##$USERP3= <user>
##$USERP4= <user>
##$USERP5= <user>
##$WDW= 1
##$XDIM= 8192
##$YMAX_p= 0
##$YMIN_p= 0
$$ End of Bruker specific parameters
$$ ---------------------------------
##NTUPLES= NMR FID
##VAR_NAME=  TIME,          FID/REAL,        FID/IMAG
##SYMBOL=    X,             R,               I
##VAR_TYPE=  INDEPENDENT,   DEPENDENT,       DEPENDENT
##VAR_FORM=  AFFN,          ASDF,            ASDF
##VAR_DIM=   8192,          8192,            8192
##UNITS=     SECONDS,       ARBITRARY UNITS, ARBITRARY UNITS
##FACTOR=    0.0002496,     1,               1
##FIRST=     0,             0,               0
##LAST=      2.0444736,     0,               0
##MIN=       0,             -172772,         0
##MAX=       2.0444736,     114293,          0
$$ Real data points
##PAGE= N=1
##DATA TABLE= (X++(R..R)), XYDATA
0 0 0 0 0 0 0 0 0 0 0 0 0 0 0 8 -8 8 -8 8 -16 16 -17 24 -25 32 -40 46 -54 62 -71 81 -90 105 -120 135 -153
35 -153 172 -192 215 -241 269 -299 333 -369 409 -453 500 -553 611 -672 740 -813 899 -988
53 -988 1093 -1208 1336 -1481 1648 -1841 2071 -2342 2676 -3095 3635 -4366 5413 -7052 9983
68 9983 -16869 69914 -23850 -132383 11346 -28488 -50850 81749 114293 -26805 -54016 -41143
80 -41143 -57305 7300 90508 41302 -5410 -14419 -57632 -57691 23136 47875 39674 39929 -22894 -85216
94 -85216 -30498 23679 19748 45193 48581 -28534 -62293 -31663 -9712 33473 71739 16391 -40455
107 -40455 -25957 -26808 -28637 31461 57107 17223 -5252 -31685 -56497 -2873 41624 8352 18493
120 18493 46430 -31859 -81178 -4442 32470 11193 41704 32863 -45320 -48415 -11216 -14960 32994
133 32994 82730 3983 -61171 -18987 -20064 -33904 53254 81565 -14321 -41282 -9526 -43765
145 -43765 -30402 64681 65603 -10503 -24245 -23580 -45889 -12126 44998 47939 22941 -13256 -55416
158 -55416 -43869 9747 33525 36126 32188 -9367 -53444 -43644 -2655 35748 51721 20160 -23251
171 -23251 -32132 -32664 -21894 30885 59065 15608 -21373 -24019 -35391 -21110 31104 43932 15882
184 15882 -1010 -25986 -46087 -12290 27820 27120 26141 14202 -35767 -48261 -2939 17408 17942
197 17942 36657 17830 -37336 -42028 -8380 7032 26274 39355 6571 -27845 -27310 -23664 -5816
210 -5816 38127 43083 -932 -22212 -20261 -28972 -11610 34845 43382 8224 -18914 -28565 -28068 -6004
224 -6004 26010 37976 19981 -13826 -36429 -29316 -2505 22751 34522 22985 -8677 -34309
236 -34309 -33081 -6592 24465 35012 18903 -5328 -26331 -35628 -14277 24972 37841 17634
248 17634 -4898 -22463 -33697 -17635 18693 36580 23732 -2717 -25676 -31252 -14136 11716
260 11716 30460 29693 3614 -27856 -32961 -12588 10042 25671 29210 9350 -23097 -35368 -16943
273 -16943 9847 25677 26719 11087 -16450 -33613 -22539 5809 27132 27948 10238 -14657 -29259
286 -29259 -23675 -1506 25096 33035 11714 -15985 -26363 -22154 -6543 20938 34887 15560 -13792
299 -13792 -26736 -23448 -6447 18837 30866 18313 -6466 -27580 -28732 -5347 19370 26398 19113
312 19113 -211 -26000 -31412 -7863 17579 26625 20414 297 -23326 -28691 -12017 11931 28826
325 28826 23842 -945 -21902 -25112 -15052 6963 28858 26154 1191 -20107 -26007 -16360 5918
338 5918 25525 25127 7010 -16812 -29324 -17347 7021 22072 23204 11615 -13027 -30570 -20007
351 -20007 5014 21366 23941 12466 -11133 -27007 -21477 -909 20264 27177 12257 -10792 -23326
364 -23326 -21222 -5593 17947 28751 14335 -8963 -22749 -22188 -6837 15572 26819 17151 -4670
377 -4670 -23004 -24134 -7253 13565 24216 18941 -567 -21785 -25655 -8776 12547 22953 19318
390 19318 2060 -19261 -26256 -11838 10435 23401 19882 3489 -16890 -25429 -14437 7128 22691
403 22691 21729 4848 -15645 -23876 -14955 3567 20984 23552 6976 -14595 -23342 -15786 1411
416 1411 19074 23552 9040 -11228 -22700 -18493 -315 18979 22532 10338 -7784 -21683 -20583
429 -20583 -2414 16877 22634 12684 -6274 -21671 -20308 -4378 13446 23291 15817 -5635 -21110
442 -21110 -19251 -7170 10873 24875 17074 -4869 -18181 -19261 -10793 9273 24761 17105 -1723
455 -1723 -15678 -22366 -12391 10481 21563 15716 4417 -13739 -26719 -12588 11837 19203 16048
468 16048 7580 -13855 -26465 -11601 7806 16752 20346 8331 -15858 -23466 -10344 3000 15331
481 15331 22196 7753 -13934 -19741 -13605 -633 17581 21915 5832 -9643 -16915 -17279 -2954
494 -2954 17004 20573 8834 -6202 -18710 -17916 -1716 13375 18122 12662 -3707 -19564 -17373
507 -17373 -3552 10085 19800 14341 -5056 -16343 -14415 -8953 6490 22798 15455 -4531 -12717
520 -12717 -15920 -13228 7145 22272 13145 685 -8396 -21688 -16245 10144 20694 12109 5423
533 5423 -8786 -24958 -14151 9243 16272 16012 9994 -12885 -25537 -9924 6387 12294 18898
546 18898 11174 -13617 -22675 -10655 1624 13482 21556 8662 -12830 -18400 -12615 -2316 14413
559 14413 22167 8681 -10430 -18301 -14423 -1445 13731 19531 10016 -7537 -18595 -14535 -1369
572 -1369 11426 18355 11739 -6951 -17314 -12010 -3733 7358 18773 13006 -6081 -14053 -11837 -7782
586 -7782 6259 19368 11299 -3214 -8923 -14654 -12394 7393 19415 9566 598 -5804 -17916 -13813
600 -13813 8095 16531 10020 5559 -5603 -20446 -13126 7166 13309 11899 9010 -6442 -20904
613 -20904 -12489 3881 11496 15302 10828 -7671 -19834 -12499 649 10658 18064 11509 -8040
626 -8040 -18991 -13030 -1489 10539 19269 11443 -8285 -17976 -12583 -3211 9924 20181 11829 -8475
640 -8475 -16551 -12006 -4759 8406 20148 11851 -7612 -14672 -11956 -6210 7331 19545 11584 -5677
654 -5677 -12640 -12395 -7251 6967 17857 10667 -2950 -10429 -13243 -8725 6357 16516 10271 -901
668 -901 -7827 -13504 -10332 5060 15386 9888 1809 -5611 -14373 -12025 4337 13722 9939 5092 -3798
683 -3798 -16193 -12503 3902 10775 10360 8860 -3435 -17842 -11663 2474 7815 12162 12298 -4418
697 -4418 -17814 -10394 -422 5611 15248 13153 -5840 -15604 -10339 -4341 5639 17801 11993 -5904
711 -5904 -13246 -11397 -6673 6696 18102 11165 -3770 -11861 -13417 -6860 7354 15877 11092 -1056
725 -1056 -12154 -14413 -6292 6017 14245 12223 154 -11462 -13315 -6836 3736 14522 12840 -498
739 -498 -9556 -11404 -9630 2456 15618 11827 -287 -5962 -11577 -11996 3048 14760 9411 2632
753 2632 -3053 -14236 -12505 4228 11266 8376 7141 -2572 -15971 -10507 3461 7071 10124 10439
767 10439 -4205 -15411 -8486 -231 4816 13138 10510 -5033 -12312 -8940 -4549 5781 14997 8765
781 8765 -3596 -9197 -11090 -6659 6779 14311 8427 -561 -9290 -13254 -5422 6176 11417 10379
795 10379 2064 -10653 -13767 -4586 4428 10369 12186 2149 -10537 -11629 -6290 1353 11973 13265
809 13265 763 -8363 -9922 -9169 451 13506 11564 1006 -5041 -10757 -11715 1507 12882 9652
823 9652 3189 -3164 -12639 -11383 2191 9689 9370 6979 -3525 -14077 -8946 1407 6452 10487
837 10487 9071 -3964 -12900 -8513 -1637 5844 12446 8013 -3673 -9647 -9639 -4989 6330 13295 6862
852 6862 -2328 -8255 -11417 -5331 6819 11432 7297 855 -8354 -12535 -4555 5668 9481 9155 1914
867 1914 -9245 -11424 -4206 2790 8868 11344 2276 -8908 -10469 -5638 1202 9538 11032 2295 -6680
882 -6680 -10040 -8348 827 10919 10006 2338 -4324 -10238 -9798 755 9871 9802 4460 -3770 -11034 -8910
898 -8910 577 7386 9616 6504 -3099 -11218 -8613 -925 5920 10536 7234 -3223 -10175 -8718 -2772
913 -2772 5593 11263 7289 -2309 -8886 -9920 -3948 5929 10652 6930 -403 -7944 -10687 -4528 5463
928 5463 9977 7386 436 -7607 -10296 -4692 3730 9359 8968 1349 -7864 -9907 -4805 2130 8643
943 8643 9694 2284 -7050 -10060 -6054 1501 9021 9375 2696 -5630 -9882 -7369 1145 8582 9071 3669
959 3669 -4274 -9672 -7981 655 8098 8806 4353 -3196 -9392 -8222 -574 7158 9403 5171 -2964
974 -2964 -8929 -8223 -1609 6084 9646 6234 -1956 -9025 -8641 -2045 5464 9140 6559 -787 -8039 -9164
990 -9164 -3166 4889 9025 7018 -148 -7383 -8902 -4096 3556 8941 7899 324 -7141 -8758 -4603
1005 -4603 2549 8696 8331 1069 -6422 -8798 -5568 1706 8470 8839 1861 -5820 -8649 -6165 1037
1020 1037 8041 8869 2758 -4967 -8986 -6811 846 7581 8513 3469 -3744 -8776 -7462 153 7348
1035 7348 8466 3937 -2984 -8500 -7726 -561 6684 8390 4579 -2145 -8397 -8108 -1048 5972 7891
1050 7891 5323 -1308 -7869 -8291 -1785 5172 7673 5774 -540 -7523 -8155 -2384 3944 7448 6681 143
1066 143 -6953 -8105 -3168 2887 7371 7233 758 -6351 -7626 -4108 1601 7471 7908 1091 -5657 -7229
1082 -7229 -5057 448 7470 8583 1680 -4820 -7282 -6066 9 7613 8179 2240 -3808 -7320 -7139
1097 -7139 -352 7418 7996 3033 -2755 -7913 -7670 -348 7002 7914 4076 -2071 -7955 -7954 -771 6032
1113 6032 7890 4726 -1829 -8031 -7791 -1083 5571 7932 5274 -1507 -7499 -7756 -1705 5004 7403
1128 7403 5357 -515 -6948 -7980 -1929 4292 6656 5768 551 -6649 -7735 -2089 2870 6097 6602
1143 6602 787 -6503 -6548 -2519 1250 6023 7502 757 -5720 -5643 -3839 -233 6545 7629 792 -4293
1159 -4293 -5354 -5470 -584 6828 6979 1514 -2246 -5692 -6865 -675 6504 6639 2960 -1261 -6582 -7512
1175 -7512 -757 5530 6541 4393 -1096 -6931 -7206 -1423 4722 7011 5004 -1124 -6906 -7534 -2247
1190 -2247 4473 7597 5229 -617 -6296 -8092 -2734 4752 7152 5314 586 -6599 -8605 -2297 4334
1205 4334 6157 5926 1316 -6864 -8076 -1714 2994 5562 6969 1161 -7234 -6758 -2231 1005 5936
1220 5936 7696 369 -5985 -5306 -3460 16 6849 7193 -78 -4223 -4829 -4959 -382 6800 6202 726
1236 726 -2520 -5503 -5806 270 5927 5487 2345 -1520 -5964 -5866 -379 4534 5756 3596 -1181 -5801
1252 -5801 -5519 -1565 3762 6558 4145 -929 -5094 -6171 -2535 3895 6480 4146 -22 -4678 -7170
1267 -7170 -2902 4054 6029 4594 1397 -5286 -7672 -2487 2935 4925 5858 2032 -5942 -7362 -2074
1282 -2074 2001 4786 6991 1618 -6073 -6320 -2811 414 5551 7428 1063 -5064 -5485 -4063 -124
1297 -124 6264 6684 646 -3431 -5212 -5339 89 6410 5916 1497 -2527 -5431 -5399 -103 5223 5933 2836
1314 2836 -2228 -5764 -4889 -651 4111 6222 3571 -2045 -5310 -4952 -1536 3880 6052 3542 -1027
1329 -1027 -4599 -5726 -2109 3707 5697 3204 49 -4223 -6432 -2332 3511 5174 3931 1122 -4491
1344 -4491 -6372 -2438 2434 4711 5072 1375 -4950 -5917 -2368 1293 4759 6275 1362 -4802 -5708 -2929
1360 -2929 526 5035 6018 1617 -3599 -5512 -4050 440 5005 5403 1947 -2502 -5633 -4737 282 4933
1376 4933 5418 2291 -1976 -5272 -4784 -429 4394 5874 2738 -2197 -4954 -4744 -1236 3742 6175 3136
1392 3136 -1886 -4862 -4786 -1397 3406 5634 3726 -805 -4733 -5243 -1492 3417 5073 3859 27 -4429
1408 -4429 -5822 -1959 3032 4928 3953 502 -3996 -5654 -2866 2102 5162 4571 399 -3807 -5149
1423 -5149 -3105 1395 5216 5252 785 -3641 -5046 -3182 689 4399 5347 1842 -3109 -5723 -3404 931
1439 931 3927 4943 2632 -2461 -5519 -4054 396 4241 4848 2441 -1703 -4803 -4607 -503 4345 5418
1455 5418 2119 -1641 -4138 -4687 -1608 3824 5555 2737 -1621 -4372 -4508 -1636 2621 5152 3862
1470 3862 -648 -4956 -4780 -1115 2202 4203 4262 324 -4554 -5234 -1665 2343 4561 3996 744 -3316
1486 -3316 -5280 -2992 2036 5108 3658 260 -2554 -4777 -3663 1146 5083 4258 952 -2935 -4699
1501 -4699 -3132 399 4094 5158 1968 -3392 -5008 -2768 301 3163 4855 2774 -2676 -5238 -3402
1516 -3402 272 3438 4307 2428 -1482 -4636 -4566 -482 4237 4455 1822 -980 -3571 -4962 -1349 3743
1532 3743 5069 2246 -1044 -3452 -4226 -1763 2487 5153 3530 -842 -4337 -3942 -1434 1547 4302
1547 4302 4355 -31 -4378 -4534 -1447 1804 3886 3564 899 -3317 -5079 -2574 2256 4315 3178 1055
1563 1055 -2084 -5118 -3630 1531 4543 3604 857 -2346 -4243 -3242 102 3707 4834 1420 -2964
1578 -2964 -3980 -2547 -407 2701 5247 2495 -2938 -4709 -2713 -307 2479 4480 3078 -1275 -4708
1593 -4708 -4002 -147 3264 3909 2289 -530 -3722 -5008 -1239 3560 4522 1883 -860 -2903 -4325 -2260
1609 -2260 2789 5145 2752 -1146 -3100 -3611 -1987 1489 4525 3808 -354 -3649 -3813 -1275 1527 3392
1625 3392 3675 1123 -3124 -4792 -1814 2280 3120 2891 1635 -2092 -4955 -2790 1687 3516 2987 1191
1641 1191 -1573 -4024 -3441 287 3557 4191 1162 -2271 -3423 -2798 -844 2689 4981 2148 -2673 -3890
1657 -3890 -2292 -728 1770 4489 3132 -1624 -4285 -3253 -377 2248 3928 2805 -456 -3727 -4197
1672 -4197 -1163 2980 4041 2119 -311 -2592 -4567 -2507 2997 4722 1995 -790 -2197 -3639 -2752
1687 -2752 1939 4808 3051 -498 -2851 -3533 -1905 1542 3526 3523 720 -3208 -4405 -1176 1731 2304
1703 2304 3020 1786 -2442 -4904 -2070 1972 3009 2504 1406 -1237 -4063 -2895 767 3366 3082 1051
1719 1051 -1543 -3102 -2870 -706 2674 4082 1576 -2148 -3025 -2151 -1039 1572 4374 2857 -1931 -3715
1735 -3715 -2227 -882 1287 3651 3126 -589 -3564 -3468 -971 2223 3601 2397 116 -2561 -4173 -2227
1751 -2227 2522 4233 1875 -41 -1761 -3741 -2917 1804 4501 2667 -433 -2263 -3437 -2280 823
1766 823 3645 3498 523 -2888 -3879 -1599 1043 2898 3310 1683 -2534 -4513 -1877 1421 2340 2787
1782 2787 1881 -1556 -4400 -2661 1208 2899 2614 1215 -1028 -3454 -2860 -52 2866 3531 1419 -1669
1798 -1669 -2742 -2174 -1162 1709 4013 2192 -1743 -2875 -1888 -986 1130 3604 2978 -839 -3054 -2746
1814 -2746 -1148 1301 3059 2594 278 -2448 -3583 -1542 1793 3272 2098 608 -1674 -3647 -2489
1829 -2489 1494 3868 2381 115 -1284 -3138 -2818 686 3545 2895 503 -2127 -3214 -2168 382
1844 382 2714 3354 1367 -2263 -3840 -1768 797 2188 3098 2120 -1522 -4236 -2563 826 2281 2757
1860 2757 1619 -1001 -3307 -2772 -142 2537 3260 1450 -1107 -2899 -2683 -1204 2219 3726 1676 -1373
1876 -1373 -2616 -2334 -1016 1434 3465 2468 -640 -2936 -2373 -824 1217 2992 2700 -138 -2584 -2997
1892 -2997 -1346 1124 2740 2261 286 -1816 -3360 -1861 1219 3150 1959 309 -1354 -2923 -2333
1907 -2333 741 3142 2492 686 -1481 -2778 -2171 308 2543 2972 1339 -1668 -3221 -1946 209 1787
1923 1787 3130 1827 -1600 -3229 -1998 39 1783 2732 1858 -877 -3074 -2716 -298 2183 2860 1500
1939 1500 -644 -2671 -2967 -910 2032 3066 1666 -420 -2259 -2787 -1010 1584 3000 2319 -353 -2570
1955 -2570 -2446 -1089 836 2849 2681 -45 -2532 -2447 -1063 733 2805 2500 336 -2032 -2759 -1846 1048
1972 1048 2742 2129 490 -1198 -2843 -2157 920 2614 2138 645 -1172 -2811 -2145 342 2258 2523
1988 2523 1109 -1417 -2764 -1831 -182 1811 2836 1618 -1299 -2574 -1879 -290 1648 2711 1576
2003 1576 -899 -2565 -2527 -426 1777 2571 1649 -320 -2397 -2648 -654 1888 2664 1663 -100 -2218
2019 -2218 -2557 -792 1314 2545 2107 -140 -2217 -2273 -863 842 2666 2342 -221 -1908 -2185 -1333 572
2036 572 2528 2356 329 -1642 -2571 -1740 714 2350 2100 621 -1190 -2676 -1683 529 2114 2268 941
2053 941 -1129 -2574 -1989 172 2088 2451 1026 -1253 -2582 -1885 -190 1740 2617 1201 -1040 -2309
2069 -2309 -1881 -426 1697 2398 1182 -735 -2289 -2201 -384 1633 2167 1478 -251 -2011 -2327 -595 1415
2086 1415 2096 1629 -315 -2181 -2192 -967 1061 2459 1922 -89 -2041 -2068 -1148 818 2291 1958 133
2103 133 -1909 -2188 -1481 693 2320 1999 543 -1227 -2544 -1489 521 2205 1989 702 -1354 -2372
2119 -2372 -1663 289 1942 2065 797 -1110 -2293 -1725 211 1873 2153 1120 -793 -2262 -1966 37
2135 37 1575 2199 1179 -719 -2293 -2035 -348 1419 2029 1425 -458 -2186 -2090 -476 1152 2098 1693
2152 1693 -74 -2134 -2067 -802 1098 2225 1804 -111 -1894 -1975 -816 905 2072 1999 17 -1600 -2009
2169 -2009 -1071 412 2242 1928 106 -1595 -1975 -1239 633 2025 1813 360 -1310 -2038 -1396 303 2161
2186 2161 1854 420 -856 -2101 -1541 151 1796 1856 841 -823 -1938 -1791 -244 1773 1937 1021 -539
2203 -539 -2012 -1831 -197 1419 1853 1203 -519 -2250 -1879 -168 1257 1939 1546 -295 -2154 -1925 -334
2220 -334 835 1947 1695 -161 -1849 -1915 -601 887 1967 1746 -162 -1696 -2031 -910 659 1984
2236 1984 1905 -158 -1610 -1938 -1169 536 1985 1720 206 -1350 -2003 -1275 468 2135 1845 217 -1405
2253 -1405 -1973 -1495 231 2016 1985 460 -1079 -1773 -1550 33 1692 1885 578 -793 -1879 -1408 -124
2270 -124 1600 1505 668 -539 -1635 -1588 51 1285 1485 1095 -323 -1694 -1856 -107 1176 1612 1125 -112
2288 -112 -1827 -1595 -376 946 1600 1337 25 -1578 -1899 -690 524 1521 1746 170 -1519 -1770 -832
2305 -832 365 1713 1722 258 -1306 -1577 -989 439 1738 1836 298 -1402 -1554 -1392 332 1668 1906 310
2323 310 -1035 -1718 -1381 -123 1746 1705 439 -741 -1663 -1441 27 1788 1925 537 -771 -1769 -1642
2340 -1642 9 1609 1701 908 -406 -1667 -1617 -146 1272 1605 831 -337 -1492 -1712 -311 1133 1537
2357 1537 1018 -191 -1361 -1694 -376 970 1436 1327 -119 -1405 -1464 -482 701 1307 1404 222 -1418
2374 -1418 -1366 -582 112 1471 1685 195 -1365 -1371 -877 125 1489 1541 319 -979 -1638 -1139 157 1449
2392 1449 1732 596 -893 -1552 -1323 99 1532 1688 601 -861 -1391 -1346 -198 1321 1827 766 -754
2409 -754 -1536 -1524 -165 1208 1534 800 -441 -1484 -1476 -244 1025 1536 900 -182 -1514 -1551 -364 1081
2427 1081 1441 1092 175 -1399 -1681 -375 978 1289 1162 2 -1341 -1451 -672 652 1487 1369 134
2444 134 -1354 -1326 -732 296 1489 1631 220 -1178 -1530 -776 182 1111 1416 416 -1034 -1354 -975 91
2462 91 1306 1367 537 -581 -1556 -1265 151 1301 1351 656 -728 -1153 -1119 -308 1061 1442 654 -416 -1207
2481 -1207 -1212 -271 865 1579 951 -342 -1389 -1321 -389 887 1229 864 -164 -1292 -1384 -331 690 1207
2499 1207 894 -17 -1058 -1600 -574 663 1446 1061 183 -1194 -1493 -598 517 1408 1318 225 -949 -1317
2517 -1317 -768 321 1418 1303 118 -911 -1371 -1004 277 1254 1337 450 -793 -1348 -1101 206 1018 1275
2535 1275 585 -627 -1280 -858 -139 1181 1342 693 -489 -1266 -1196 -152 975 1291 758 -328 -949 -1227
2553 -1227 -344 808 1388 836 -308 -1333 -1235 -148 726 1309 980 -210 -1059 -1163 -535 621 1248 1149
2571 1149 75 -1036 -1288 -578 722 1235 1123 191 -1122 -1422 -701 449 1227 1180 274 -894 -1448 -769
2589 -769 321 1140 1230 357 -782 -1213 -787 212 1030 1313 466 -779 -1195 -1033 114 914 1187 529 -739
2608 -739 -1269 -977 -33 887 1372 688 -420 -1191 -1192 -278 812 1274 710 -188 -1188 -1231 -399 853 1169 855
2628 855 -192 -1107 -971 -438 523 1269 774 -165 -971 -1246 -487 586 1399 862 -102 -863 -1249 -651 571
2647 571 1054 1037 99 -807 -1321 -812 427 1169 966 209 -859 -1218 -664 207 1134 1015 361 -848 -1043
2666 -1043 -803 11 1099 1171 280 -650 -1134 -924 -216 1022 1426 655 -525 -1257 -1079 -225 994 1021 486
2685 486 -399 -975 -925 -162 704 1008 794 -372 -1111 -1028 -140 798 995 792 -223 -971 -1109 -593 649 1038
2705 1038 653 -188 -813 -1138 -530 585 1181 890 113 -907 -1154 -559 554 1071 1000 102 -805 -1156 -755
2724 -755 243 899 1084 541 -856 -1179 -630 41 792 1244 564 -700 -1103 -775 -72 942 1166 303 -485
2743 -485 -974 -896 -201 880 1151 494 -450 -966 -822 -255 562 1036 555 -391 -874 -892 -226 786 1296 735
2763 735 -37 -927 -993 -331 568 968 703 -159 -758 -1188 -542 405 1069 862 -98 -777 -1135 -498 507 802
2783 802 782 289 -661 -1057 -497 446 829 930 280 -571 -1145 -610 164 882 1080 413 -562 -905 -702 -65
2803 -65 787 963 538 -667 -1101 -577 -175 905 1226 593 -379 -1136 -923 -319 717 1101 638 -441 -807
2822 -807 -1007 -341 690 1127 616 -414 -927 -876 -96 672 1160 641 -75 -746 -1098 -435 514 1116 541 35
2842 35 -793 -1059 -546 455 1072 745 158 -705 -1223 -532 442 945 746 67 -685 -1028 -722 294 782 852
2862 852 377 -382 -1068 -521 85 811 845 499 -471 -1134 -732 79 720 986 602 -533 -894 -813 -146 651
2882 651 919 695 -544 -882 -788 -195 615 1182 683 -215 -887 -889 -188 475 1055 695 -357 -903 -938 -286 561
2903 561 966 639 -25 -686 -825 -479 526 1138 579 -40 -744 -1004 -456 549 950 611 -63 -601 -1022
2922 -1022 -687 318 804 562 53 -447 -1020 -549 351 704 1038 525 -440 -1074 -481 100 600 768 342
2941 342 -300 -950 -577 171 482 845 613 -283 -784 -728 96 496 904 523 -268 -925 -790 -207 418 981
2961 981 716 -236 -661 -749 -308 449 1007 715 -291 -832 -742 -491 306 1009 739 -193 -578 -803 -443 239
2981 239 867 770 53 -689 -894 -518 371 782 532 326 -505 -1066 -482 401 713 677 258 -406 -1013 -578 288
3002 288 958 646 384 -531 -781 -758 -69 618 890 315 -425 -739 -583 53 514 648 605 -182 -1003 -636 -129
3023 -129 430 773 473 -225 -892 -761 -80 664 723 526 -34 -691 -777 -424 406 924 482 -57 -672 -864 -302
3044 -302 387 953 684 -129 -544 -706 -265 22 805 784 12 -654 -733 -487 66 488 702 298 -576 -860 -253
3065 -253 245 747 611 273 -367 -761 -714 70 718 683 300 -309 -818 -745 7 659 778 396 -398 -783 -563
3086 -563 -133 442 775 498 -340 -740 -560 -89 416 756 606 -93 -667 -712 -118 441 610 418 -76 -611
3106 -611 -931 -367 460 810 417 -120 -681 -914 -322 340 897 474 111 -634 -614 -477 145 909 792 -32
3126 -32 -360 -477 -341 85 595 704 228 -475 -772 -359 158 671 684 375 -218 -878 -546 197 558 539 156
3147 156 -134 -539 -689 -26 628 627 380 -258 -489 -642 -302 592 799 322 -193 -728 -360 -259 282 781 647
3168 647 -110 -818 -595 -128 402 603 569 46 -671 -866 -399 218 696 588 303 -435 -757 -395 315 907
3188 907 465 -3 -382 -639 -552 77 821 565 -140 -474 -443 -519 -128 667 766 281 -394 -777 -475 -162 401
3209 401 570 576 -218 -890 -360 135 391 559 386 -123 -582 -602 -89 734 462 388 -41 -517 -532 -155 524 855
3231 855 431 -71 -445 -467 -272 91 703 623 -202 -720 -468 -89 274 577 552 42 -593 -582 -319 321 488
3252 488 561 212 -477 -730 -342 247 644 412 58 -242 -658 -567 144 762 575 101 -304 -485 -560 -121 570
3273 570 805 261 -487 -609 -293 -36 525 712 337 -463 -664 -428 89 104 586 620 19 -798 -590 -2 440
3294 440 361 358 3 -606 -689 -253 548 667 303 -147 -309 -636 -319 413 628 506 -186 -548 -482 -366 80 662
3316 662 627 -8 -529 -617 -224 190 470 693 -3 -525 -637 -100 302 510 459 248 -274 -650 -524 253 467
3337 467 552 32 -315 -310 -680 -308 812 711 60 -558 -511 -481 -195 461 600 210 -313 -639 -547 -81 306 522
3359 522 468 -61 -689 -735 -25 401 419 371 64 -517 -718 -76 578 525 211 -20 -353 -652 -317 164 486 431
3381 431 -170 -495 -384 -387 -17 614 411 -17 -493 -408 -252 100 334 678 171 -588 -608 -295 138 340 320 433
3403 433 -283 -490 -504 130 410 269 199 -108 -605 -371 73 445 453 31 -110 -282 -477 14 551 662 243
3424 243 -218 -346 -481 -85 166 424 377 -126 -477 -353 -37 190 385 391 105 -470 -589 -164 349 413 558
3445 558 -86 -453 -618 -357 357 452 422 -68 -227 -568 -231 271 455 413 -5 -438 -273 -479 -67 410 594
3466 594 88 -469 -582 -312 39 198 596 263 -257 -790 -382 54 324 540 124 -25 -406 -533 -30 542
3486 542 457 177 -98 -381 -580 -59 507 387 134 -183 -292 -395 -119 365 601 388 -273 -215 -458 -238 -33
3507 -33 365 461 -36 -491 -403 -87 181 362 420 104 -439 -652 -258 249 464 207 -34 -537 -531 -382 185 645
3529 645 458 217 -327 -372 -394 95 546 481 103 -395 -439 -371 -85 415 670 220 -135 -470 -244 16 337 345
3551 345 260 -108 -468 -461 64 462 523 256 -4 -441 -608 51 342 354 256 -127 -413 -579 -299 341 356 190
3573 190 -110 -371 -305 -125 177 509 225 -48 -485 -348 -206 123 303 241 88 -231 -578 -279 379 396 576
3594 576 292 -216 -592 -308 244 387 232 49 -404 -363 -448 -158 459 490 152 -374 -474 -359 -42 386 464
3615 464 266 -261 -557 -169 62 275 702 340 -40 -588 -628 -19 128 450 138 139 -432 -485 -62 245 563
3636 563 330 -6 -322 -500 -243 239 501 231 -19 -349 -368 -159 285 454 392 -101 -387 -275 -217 265 292
3657 292 301 115 -401 -461 -89 110 370 447 216 -436 -515 -483 11 268 370 247 -146 -584 -400 -58 372 304
3679 304 178 -388 -385 -364 13 371 578 203 -222 -350 -299 -252 292 542 338 -129 -314 -407 -27 329 583 364
3701 364 39 -397 -406 -8 164 391 382 -9 -320 -438 -257 224 440 278 -66 -155 -451 -284 127 402 446 99
3723 99 -423 -394 -199 107 399 377 169 -333 -668 -275 -6 476 534 110 -176 -300 -405 89 376 406 158 -261
3745 -261 -275 -120 37 292 450 171 -70 -203 -325 -12 378 498 198 -97 -329 -366 -244 240 375 412 3
3766 3 -369 -426 -215 464 406 375 -136 -434 -365 -152 181 500 254 -48 -235 -411 -123 118 485 222 12 -312
3788 -312 -446 -227 174 286 435 13 -339 -306 -293 190 354 406 96 -366 -374 -265 92 449 228 84 -148 -353
3810 -353 -351 112 181 382 28 11 -389 -381 -44 269 396 388 -241 -399 -140 -166 228 479 455 8 -467 -349 -179
3833 -179 194 524 224 26 -289 -310 -208 165 424 350 -80 -394 -410 -238 92 314 474 66 -344 -234 -309
3854 -309 34 491 234 -70 -150 -502 -306 159 234 307 -2 -459 -382 -242 82 404 417 93 -185 -307 -194 21
3876 21 289 275 159 -40 -417 -403 58 136 353 182 -109 -306 -344 -187 259 342 273 31 -369 -355 -191 174 331
3899 331 341 -127 -236 -227 -190 189 528 501 -153 -395 -427 -207 147 452 387 42 -288 -305 -107 173 375 373 59
3922 59 -224 -245 -166 209 366 279 -18 -144 -391 -259 138 370 303 -10 -479 -476 -209 -92 372 250 215 -148 -352
3945 -352 -502 -164 374 383 298 -122 -447 -285 -68 262 547 349 70 -301 -263 9 289 297 134 -204 -374 -292
3967 -292 -249 209 468 139 -1 -357 -314 -88 217 351 204 94 -341 -299 -251 175 236 301 -154 -212 -430 -359 126
3990 126 448 267 50 -181 -261 -221 15 578 242 122 -166 -344 -235 128 403 360 62 -203 -374 -287 -67
4011 -67 304 402 94 -238 -353 -319 152 269 115 116 -70 -339 -340 103 276 344 259 128 -290 -309 -176 167 423
4034 423 216 -135 -423 -398 -116 196 305 323 -32 -370 -497 -74 2 404 379 74 -297 -353 -325 156 375 216
4056 216 146 -333 -290 -60 208 268 382 112 -242 -305 -56 25 420 451 -6 -129 -507 -363 -21 350 235 144
4078 144 -38 -367 -139 148 228 332 344 -110 -515 -331 -127 243 461 171 34 -371 -289 -30 195 217 189 -120
4100 -120 -439 -321 -170 239 372 359 32 -286 -300 -108 258 384 250 34 -366 -540 -193 125 233 411 39
4121 39 -266 -331 -202 72 408 332 -61 -313 -278 -118 -122 199 255 -100 -257 -111 -182 43 347 356 89 -329 -378 -306
4145 -306 -42 315 332 200 -57 -381 -259 84 256 435 174 -100 -389 -354 -111 137 360 207 42 -375 -301
4166 -301 -200 197 267 299 -134 -220 -345 -287 229 283 266 -1 -195 -458 32 89 348 234 -64 -346 -200 -136 -39
4189 -39 399 492 182 -273 -192 -328 -4 338 392 33 -105 -237 -143 155 388 299 97 -39 -439 -242 -32 303
4211 303 437 104 -255 -235 -230 -161 244 449 -23 -253 -258 -175 -1 171 334 222 -83 -210 -290 -107 59 366 259
4234 259 -21 -425 -167 -60 131 136 164 58 -163 -241 -133 108 384 289 -7 -185 -341 -30 15 321 437 166
4256 166 -133 -294 -119 205 427 253 -2 -185 -336 -230 204 278 335 145 -119 -341 -334 -24 431 273 217 -144
4278 -144 -283 -152 25 286 464 49 -136 -297 -321 -112 160 284 129 134 -298 -410 -162 191 343 484 104
4299 104 -252 -213 -38 75 363 300 -65 -320 -338 -101 300 366 238 87 -147 -336 -178 80 410 256 38
4320 38 -237 -287 -76 9 475 248 32 -47 -380 -87 -53 270 364 -47 -213 -219 -141 171 449 381 -61 -231 -349
4343 -349 -108 -28 339 147 193 -198 -459 -217 15 250 277 229 -191 -507 -366 -44 133 275 272 -118 -392 -288
4365 -288 -228 196 278 224 -91 -154 -230 -157 -13 196 293 -51 -175 -287 -106 61 309 107 81 -162 -325 -143 -110
4388 -110 284 243 41 -237 -402 -389 40 509 357 72 -166 -270 -281 -51 124 256 236 -115 -331 -270 -130 149
4410 149 196 139 9 -285 -257 -9 259 383 -58 -203 -227 -236 -14 402 280 207 -67 -396 -138 -93 190 371 199
4433 199 -174 -293 -274 -142 222 320 187 -45 -276 -277 -180 129 298 246 -58 -166 -249 -150 148 175 34 -25 35 -245
4457 -245 -125 -125 387 249 168 -261 -354 -219 132 243 197 14 -282 -333 -146 -10 193 350 -51 -139 -383 -244
4479 -244 81 411 314 237 -292 -187 -242 48 199 317 -65 74 -272 -157 -239 292 313 179 -113 -250 -256 -109
4501 -109 292 43 103 64 -244 -201 -287 191 184 199 -98 -223 -192 -259 174 349 403 -10 -52 -250 -210 93 392 213
4525 213 125 -276 -293 -248 93 94 295 74 -205 -214 -249 78 238 242 121 -57 -298 -191 -136 67 271 121 -117 -105
4549 -105 -285 -26 305 200 114 -144 -208 -162 -142 84 411 190 -85 -54 -190 -84 88 337 195 -113 -399 -338
4571 -338 -48 172 436 242 34 -187 -267 -319 191 292 356 126 -171 -312 -32 -6 120 199 -7 -263 -276 -177
4593 -177 15 194 243 -24 -164 -185 -342 65 328 321 -169 -222 -205 -73 85 221 301 126 -266 -264 -126 57 14
4616 14 169 331 50 -206 -378 -88 99 129 100 -93 -64 -110 -155 135 306 54 -58 -246 -49 -135 170 219 72
4639 72 -31 -252 -217 -21 198 399 235 47 -170 -217 -76 126 276 141 70 -161 -253 -236 158 232 260 87 -171
4662 -171 -292 -235 24 431 43 66 -122 -285 -210 -39 197 160 83 -321 -212 -171 94 97 252 134 -150 -362 -110
4685 -110 84 140 319 245 -245 -229 -268 -100 61 206 150 101 -77 -203 -34 505 335 147 6 -131 -209 -44
4707 -44 285 305 295 -231 -308 -292 47 -63 268 161 -41 -159 -228 -9 -2 118 350 205 -291 -397 -214 5 166
4730 166 321 86 -46 -170 -40 -192 221 141 205 -111 -203 -161 39 277 300 -152 -232 -263 -187 71 120 326 106
4753 106 -192 -146 -187 66 124 292 325 -105 -226 -193 30 149 211 92 36 -216 -262 81 218 207 166 -149 -150 -214
4777 -214 -251 183 358 333 -246 -339 -286 -55 132 399 198 -127 -293 -137 -236 -99 70 13 99 -175 -251 -107 178
4800 178 185 121 155 -251 -132 -337 108 177 86 138 88 -166 -317 -136 331 281 65 -95 -255 -223 10 193 300
4823 300 149 -154 -161 -180 66 97 357 204 -88 -260 -45 -52 79 226 307 1 -285 -309 -132 114 349 201 3
4846 3 -122 -305 -121 346 356 49 8 -199 -295 -212 78 76 120 4 -161 -236 -113 50 288 146 65 -142 -154 -199
4870 -199 -176 85 261 119 -161 -287 -161 127 24 126 60 -14 -401 -173 -63 299 43 180 7 -196 -324
4891 -324 -52 223 429 109 -229 -159 -93 -289 288 210 261 -326 -275 -39 -134 40 317 222 21 -303 -353 -32 110
4914 110 90 142 -4 -239 -212 -175 239 206 142 1 -206 -163 -242 29 165 109 -10 -195 -220 -156 -78 337 298 -104
4938 -104 -143 -87 -93 -22 199 131 201 -257 -358 -60 134 6 118 268 -127 -577 -209 119 187 295 44 85 -210
4961 -210 -221 -1 340 105 145 -48 -121 -397 -83 252 438 115 -98 -179 -134 -126 -109 424 126 -95 -186 -181 15 73
4985 73 243 155 -57 -250 -210 -121 50 182 121 131 -52 -185 -382 154 222 285 -118 -91 -434 -123 60 338 294
5008 294 -117 -287 -279 -177 40 309 313 -24 -130 -248 1 5 127 343 287 -245 -355 -159 108 -1 174 -3
5030 -3 58 -307 -292 43 188 120 73 -17 -370 -116 -172 154 242 -11 -103 -29 -158 18 14 237 150 26 -285 -269 -123
5055 -123 76 133 105 -131 -317 -248 -1 -86 180 112 99 -321 -139 -75 147 209 60 73 -172 -187 -153 47 329 142
5079 142 -111 -156 -129 -226 16 445 96 -13 -108 -200 -94 41 152 240 50 -28 -210 -67 14 190 139 211 11
5102 11 -303 -397 35 194 1 136 16 -319 -234 77 352 224 -48 11 -295 -202 -123 77 212 102 -171 -329
5124 -329 -102 -109 129 198 153 -168 -357 -149 35 257 185 200 -74 -248 -289 -39 -67 209 95 -50 -168 -194 -242
5147 -242 -86 178 238 92 40 -243 108 -31 125 197 -5 -98 -134 -177 -190 274 249 -95 -11 -100 -148 72 64 227
5171 227 168 7 -199 -81 124 154 129 134 -82 -163 -338 29 268 16 77 31 -108 -214 -117 90 151 15 2 -156
5195 -156 -338 -100 64 204 184 43 -78 -179 -39 38 100 208 -50 -261 -247 -207 15 94 83 29 -239 -317 -101
5218 -101 109 274 93 198 -81 -241 -97 114 124 123 23 -126 2 -167 -49 147 238 162 -216 -218 -130 -19 342
5241 342 281 349 58 -324 -118 -27 276 37 273 -23 -284 -182 -43 125 168 130 46 -221 -254 -346 180 160 118
5264 118 -5 -203 -220 28 185 225 61 -155 -74 -195 -57 113 369 192 103 -60 -156 -15 -84 301 238 88
5286 88 -126 -204 -32 -21 204 417 68 -182 -135 -250 -243 251 198 -10 -24 -213 -186 105 208 187 -28 -231 -224 -163
5310 -163 -61 168 169 64 -13 -227 -341 -12 200 7 27 -13 -123 -259 -85 107 243 164 -117 -149 -248 -167 3
5333 3 78 59 -36 -137 -175 -50 -14 236 199 -108 -223 -232 -282 110 345 282 51 -181 -254 -45 10 134 165 -8 -71
5358 -71 -240 -214 141 272 390 323 -120 -131 16 -53 232 149 -186 17 -65 -32 -96 117 147 102 -199 -335 -260 -263 118
5383 118 224 47 139 -245 -265 9 149 202 291 187 -152 -155 -177 21 287 201 108 -184 -11 25 -8 95 15 70
5407 70 -108 -306 -141 87 135 313 -166 -270 -179 -139 67 70 241 -73 -87 -412 -47 -36 76 96 88 64 -259 -243
5431 -243 -1 242 220 78 -186 -185 -369 46 270 91 202 -19 -150 -104 -102 134 38 35 -320 -206 -314 -84 -85 44
5455 44 153 -182 -325 -73 55 139 218 260 216 -67 -144 169 44 337 201 -61 -144 -195 -51 133 205 273 77
5478 77 -96 -47 -63 191 226 240 -37 69 -85 -209 46 289 217 57 -175 -23 -93 240 110 147 -50 -50 -266
5501 -266 12 21 205 20 -71 55 -207 94 -82 196 215 26 -119 -205 -224 -11 266 -39 175 -99 -134 -219 -208
5524 -208 45 183 147 84 -119 -149 -105 -64 137 -63 -13 -176 -185 -108 232 192 224 -211 -189 -104 59 121 8 117 37
5549 37 -127 -40 -81 15 217 19 -134 55 -171 -144 -4 242 38 -128 -40 -275 22 17 185 172 102 -160 -286
5572 -286 -80 -69 201 130 113 -170 -268 0 -107 -146 85 28 -260 -129 -146 -70 119 430 139 22 -224 -181 -104
5595 -104 98 427 235 5 -177 -122 -1 318 132 164 -5 -84 -165 -69 67 326 32 116 -113 -169 22 170
5617 170 86 65 -67 -385 -62 4 -77 153 104 -9 -238 -309 -32 -6 90 44 22 -78 -282 -153 108 279 178
5640 178 -101 -328 -104 -227 16 136 93 185 11 -258 -108 -157 205 348 52 97 -143 -189 -31 166 193 54
5662 54 -156 -198 -197 -6 190 112 11 11 -73 -129 -12 108 180 92 -1 -162 -41 -17 173 157 29 -64 -263 -157 -195
5687 -195 25 73 207 52 -232 -414 -113 4 105 133 2 15 -280 -123 -103 -18 137 62 -120 -150 -72 72 72
5710 72 229 -9 -107 -257 -164 210 36 180 -101 -126 -290 -242 -20 7 105 211 0 -29 -353 126 154 173 -17
5733 -17 -131 -153 -150 -56 34 228 202 -48 -192 -254 -148 95 129 170 -127 -254 -271 -29 -58 227 86 68 -161 -212 -66
5758 -66 116 244 207 130 -74 -263 -172 117 66 221 55 -40 -368 -135 54 170 187 32 -78 -203 -184 56 174
5781 174 123 -26 -67 -35 -61 -80 204 190 111 -42 2 -8 -44 57 117 173 -132 34 -221 -29 73 163 100 -206 1
5806 1 -96 45 -31 150 131 43 -174 -126 -52 19 142 177 -33 -202 -135 -83 181 202 38 27 -191 -134 -128 118 89 61
5832 61 -101 -49 -249 -120 -10 214 149 -74 -59 -175 -121 -110 77 167 21 -31 -242 -100 -60 357 222 95 -194
5855 -194 -216 -35 1 107 45 94 -145 -177 -123 -12 67 400 207 42 -28 -44 -179 161 262 -72 -132 -92 -372 35
5879 35 -88 212 -5 4 -233 -130 13 75 339 -143 83 -203 -212 -103 23 262 -25 148 -120 -167 -112 106 178
5902 178 107 10 14 -167 -178 107 124 169 -10 -84 -174 -133 105 64 242 -22 -162 -187 -81 52 36 26 6 13 -156 -92
5928 -92 -2 207 159 -125 -151 -127 84 -136 153 114 146 -65 -25 -248 -82 132 37 215 -63 -218 -219 -87 1 195
5952 195 62 57 -184 -166 -139 8 250 106 -71 -178 30 50 39 -50 345 85 -167 -55 -125 226 -5 81 54
5975 54 -113 -223 -196 -13 107 160 -53 -153 -137 -135 -72 107 2 36 -75 -236 -61 49 187 -98 -44 0 -84 -104
5999 -104 95 112 131 -70 -77 -57 -343 -94 -44 128 -103 -108 -117 -188 -77 155 229 108 -78 -189 -12 -102 44 39 173
6024 173 -59 -174 -49 -41 251 8 80 176 -84 -117 -177 -69 132 126 -28 -154 -100 -66 10 82 89 -4 -77 -60 46 206
6050 206 342 28 51 -33 -126 -73 -101 217 -60 64 -79 -210 38 4 35 -11 -15 73 -203 -130 32 115 184 -24 -120
6075 -120 -170 -33 -90 90 106 -24 -95 -85 -235 -21 -56 61 -69 -173 -153 -63 -226 146 62 27 92 -85 -31 -11
6099 -11 88 48 124 -155 -143 -161 7 12 63 170 -26 -245 -148 -113 -65 73 46 -2 -88 -52 11 74 104 129 26 -116 -108
6126 -108 -233 64 152 210 -7 -54 -177 -55 -41 2 -72 132 -114 -57 63 -28 -10 20 4 -198 -134 -110 -102 38 -24
6151 -24 95 -117 -112 -86 178 74 48 222 -78 -190 -214 16 77 22 100 184 -120 84 -103 168 164 85 50 -45 -203
6176 -203 84 -53 -20 111 -46 -162 -201 -12 -105 41 139 -2 -94 -234 -54 -18 55 101 33 -78 -59 -137 -93 265
6200 265 123 -63 -219 -97 37 -97 193 166 -6 -155 -113 -199 47 231 72 -5 15 -65 -172 -12 94 58
6222 58 -24 86 -43 -119 -51 -175 153 173 -87 -70 -178 -192 103 205 -101 -66 -106 -147 -163 73 59 49 79 -231 -213
6247 -213 -39 -15 129 118 76 -271 -289 -86 14 160 9 85 -203 146 -9 -89 78 33 -29 48 -197 -143 122
6270 122 105 119 5 -263 -260 -131 60 141 107 -50 -189 -143 -187 11 254 203 -152 -20 -248 46 76 80 49 -92
6294 -92 -124 -136 -264 -35 178 75 172 73 -66 -293 -133 41 292 139 118 -124 -147 -55 279 63 154 -105 -175
6317 -175 -247 -160 84 -27 251 86 -93 -123 59 -77 220 219 -77 -30 -212 -189 -63 32 153 -18 -191 -184 -113 -70
6341 -70 184 192 230 -40 -176 -58 193 143 169 8 50 147 -66 -4 51 114 29 -97 -36 -14 23 164 164 52 -8 0 -198
6368 -198 -127 -130 109 49 -20 -198 -63 -33 47 113 73 18 -112 -153 84 92 14 84 -54 -24 -169 94 201 137 44 -26
6394 -26 -92 35 -88 27 159 -61 46 -168 -205 -73 165 57 198 -7 -169 -71 145 -139 168 104 93 -122
6416 -122 64 -179 154 155 110 165 -237 -215 -64 68 88 -58 -30 -67 -140 -150 23 162 210 153 -90 -90 -162 -105 17
6441 17 124 -149 -115 -159 -149 5 -105 212 6 -19 -100 -112 93 194 48 31 -71 -170 -189 42 182 229 206 -22
6465 -22 7 126 -92 4 99 183 -9 -114 -34 -62 79 93 71 19 -221 -80 -63 90 29 147 154 -25 -131 -57 -5
6490 -5 101 84 56 48 -60 -52 185 -37 167 172 12 -155 -29 10 62 2 38 -45 94 -147 18 76 101 176 -126 -80
6516 -80 -62 -23 23 11 -30 64 -124 -95 -173 17 -4 137 44 -114 -178 99 -1 304 78 12 -59 -143 112 -22 166
6541 166 45 -7 76 -48 -117 173 193 92 19 -27 -288 27 -71 126 150 2 -112 -132 10 126 167 90 121 -262
6565 -262 -18 102 144 102 148 197 50 -165 -206 138 349 144 2 -97 -56 -99 61 90 122 -179 -49 -159 -122 -139
6589 -139 153 139 86 -5 -107 -27 14 99 68 150 34 -88 67 -146 196 48 -109 54 -231 -116 -287 146 121
6612 121 45 -104 -3 -36 -217 144 0 40 144 -33 -5 -185 -83 170 221 119 54 -49 17 -22 -126 35 -100
6635 -100 1 -193 -104 -42 208 78 98 -135 -137 -270 -96 87 153 -25 -61 4 -94 -100 311 31 4 42 -85 -120 -32
6660 -32 98 -54 -33 -19 -50 -63 142 -4 -21 283 -99 -184 -96 13 -82 6 262 -131 -14 -223 38 26 263 16
6684 16 154 -25 -203 16 -13 95 180 -114 43 -165 -123 -48 85 137 19 -56 -142 -106 -90 47 -31 -33 -205 -69
6708 -69 -30 -25 138 22 -72 9 -143 -98 65 197 22 185 95 -172 -278 169 99 101 66 55 -32 43 -115 201 44
6733 44 62 -109 -121 -28 -33 84 229 -17 -104 128 -120 -4 0 196 130 -67 -12 -124 56 62 156 -23 -19 -237 -56
6758 -56 74 91 -75 12 205 -139 -257 -210 24 143 216 65 17 -159 -94 206 -98 72 34 16 -59 -193 -156 -83
6782 -83 71 -124 -100 -117 -50 -50 -37 125 72 26 -21 -3 87 22 134 4 -100 -66 -100 -142 53 113 52 -106 79 -112
6808 -112 28 183 56 -20 4 -18 -33 -19 -192 103 23 -146 32 73 -236 22 -111 35 88 52 -77 -108 135
6831 135 -89 72 121 16 -61 -185 101 260 83 -81 -3 -7 -43 157 -75 95 140 -82 -54 -102 10 83 170 -85
6855 -85 -34 -103 68 -101 64 -74 79 106 -32 9 -85 -84 54 -54 69 -21 -150 2 -22 171 55 -24 -61 -183
6879 -183 -99 -43 127 69 -43 -45 -90 40 35 224 -7 -76 -99 -143 -20 -58 208 69 151 -127 -148 11 59 -93 54
6904 54 -30 -71 -115 -183 102 43 144 -2 -107 -230 -94 42 146 138 -21 -51 -12 -29 -150 58 182 178 44 -158
6928 -158 -19 -66 172 43 102 -208 -8 -130 -37 -176 51 52 -132 -131 -84 -190 10 42 5 78 -123 -197 -135 108
6952 108 148 -9 -3 -107 -61 50 -69 -107 49 117 -79 78 110 -42 -68 198 173 -122 39 58 178 17 191
6975 191 130 11 -220 -91 -30 93 34 -151 260 -296 -21 124 -32 129 13 -4 -189 -57 -14 115 159 -91
6997 -91 9 -115 -174 49 164 187 49 -71 -64 131 5 101 116 47 20 -149 -80 145 48 236 -12 44 0 -98 46
7022 46 -26 -55 -9 33 -29 -176 -104 -73 145 -11 -39 90 -29 55 -51 -10 56 4 -178 -146 -124 144 122 121 -3 -107
7048 -107 -34 -76 82 1 97 160 42 -89 -182 -24 205 -38 -58 51 20 -37 8 -17 94 -144 -6 18 -5 102
7072 102 0 149 -53 -28 -300 -34 -132 -41 88 -7 134 -136 43 56 -152 -20 28 -53 -72 -62 -19 -93 162 -17
7096 -17 117 52 -77 193 11 141 -111 22 -56 131 -162 112 45 92 16 -75 -38 -134 50 -9 103 -5 -15 -318
7120 -318 -55 90 76 46 -30 -148 -101 -155 9 181 105 -69 -108 -180 -185 72 -124 72 200 1 -53 -81 -66 -34 191
7145 191 -3 -220 -47 -42 -23 134 67 43 22 -33 115 -30 36 36 197 35 -36 -269 -94 93 256 182 148 -116
7169 -116 -175 -20 -65 334 -103 5 57 -17 -222 -52 -120 -3 -88 -95 -103 -15 76 206 106 39 41 7 32 113 45 118 226
7196 226 -35 -63 35 176 122 32 -17 -224 -12 66 -76 0 181 37 -75 17 -182 30 0 8 -9 -101 -183 -167 74
7221 74 125 155 74 -158 -20 -96 38 -108 -94 3 -148 -144 -100 -84 184 -62 26 48 -25 -120 -43 30 6 240 24 25 -64
7248 -64 -113 40 86 62 97 -66 -118 -99 -58 144 79 148 -231 -129 -168 164 88 -16 -57 -154 -139 -201 133 19 133
7273 133 -36 22 54 71 59 136 8 131 103 -158 -110 -133 54 -67 96 144 -26 -13 0 -45 84 -3 132 -10
7297 -10 -3 -154 25 177 98 2 -251 -46 -89 -10 129 -15 -34 67 -145 -32 -40 -73 63 -92 31 -103 -53 -105
7321 -105 103 21 119 -137 -79 -14 80 214 -51 27 -96 -118 -32 19 -30 124 119 38 -96 -98 -144 99 77 -36 18 98
7347 98 -98 166 98 21 114 -10 -125 146 1 -17 26 -122 -29 22 -59 -194 -2 134 -8 179 -291 16 -125
7370 -125 57 -21 -10 -51 -126 -140 -84 8 133 92 -9 35 -57 5 -44 1 173 -20 75 80 -76 203 30 46 0 -60
7396 -60 -95 35 58 34 -22 -104 26 -94 -31 147 13 55 64 122 -135 -154 -59 -32 44 81 10 -24 -124 91 288 32
7422 32 -126 -12 -126 114 27 90 24 -63 49 -87 -147 71 -60 98 0 -16 -2 -160 -247 117 181 -20 88 -97
7446 -97 -53 3 32 88 147 -154 -190 -196 -77 95 216 18 -78 -2 -81 44 -25 123 68 -89 -88 -108 -87 -111 8 163
7472 163 16 2 -24 -104 -97 184 -42 -46 -8 25 -148 8 -24 67 133 -91 -55 34 -11 61 -19 135 -185 128 -102 -253
7498 -253 157 119 35 43 12 -217 -224 -89 149 44 -92 98 137 -14 31 122 62 -6 -26 -39 -95 109 168 109 64 26
7524 26 -6 -123 75 12 191 -41 21 -15 -118 -212 -69 153 86 -30 -288 35 -60 -45 14 -52 58 -113 -156 77
7548 77 176 -29 -8 71 5 -19 12 -55 37 138 -53 -84 60 -82 -63 184 -26 -64 -45 -143 -67 -127 153 -92 -138 -100
7574 -100 26 116 56 253 -27 -39 41 -97 -83 115 -109 13 75 -3 -52 -86 76 65 -159 -146 -33 -14 69 -29 73
7599 73 -103 31 -262 -154 16 17 31 -155 42 -155 -68 -110 55 158 216 -64 -30 -123 -84 -39 242 62 10 14 -177
7624 -177 -142 -10 60 54 -61 -48 -67 -64 -255 -16 -56 61 44 -192 -175 -94 170 3 194 -204 -69 88 135 103 151
7649 151 46 131 17 42 -57 9 113 -2 -16 104 4 66 27 -6 44 65 -58 11 63 -38 73 65 76 92 -7 -45
7675 -45 -74 -27 108 82 -16 30 93 -33 73 38 59 12 -26 -85 -45 114 -6 221 -16 -183 -272 -2 -97 -90 76 -273
7701 -273 -192 -100 46 305 171 130 54 -31 72 -35 -21 73 53 -60 -9 -66 -66 -90 65 119 -42 -4 124 -15 49
7726 49 84 -71 93 -81 63 114 -66 136 46 -32 -100 59 -91 115 -30 115 44 -152 -68 -5 233 136 -113
7749 -113 113 -56 -22 52 22 116 -27 2 82 -29 -38 45 -109 -72 -109 15 -55 -34 -64 -87 176 57 -116 -130 -141 -42
7775 -42 -109 33 65 -5 -59 -14 -93 -53 118 -64 64 -155 -155 -5 -68 -54 129 94 -191 46 11 138 53 79 215
7800 215 90 162 3 30 57 29 -3 -69 -106 -89 65 134 66 108 -181 -81 -97 47 32 9 5 -80 40 95 11 -7 89
7827 89 -46 8 -76 -76 -24 -7 27 36 3 77 42 9 6 144 -45 15 -7 -9 14 56 211 32 36 13 6 49 -46 99 69 95
7857 95 39 53 -8 -60 95 -24 -90 -106 73 -23 50 10 -12 64 71 -58 95 37 -48 -12 185 -192 101 -95 -105 205
7883 205 -28 119 2 -203 -136 -90 64 126 44 -132 -69 -40 12 118 -71 56 -48 34 -45 -46 101 -27 -15 82
7907 82 -63 29 -30 -52 70 143 -89 -11 -95 -102 84 95 -17 42 52 97 -27 -149 11 -178 155 -73 -44 -88 65
7932 65 47 202 -17 -125 -97 -149 106 94 -113 33 108 -200 118 -100 65 51 90 -35 -133 -181 -2 52 235 -112
7956 -112 -29 -11 -92 246 148 27 -43 89 -4 -17 94 101 -58 189 -105 -143 -223 9 22 123 166 112 -137 -79 222
7981 222 117 146 -73 -140 258 3 -85 176 194 85 101 -26 30 4 -85 -32 237 8 -173 -25 98 -5 67
8004 67 18 -74 -96 -110 74 84 -52 110 -30 -86 -63 -49 -62 212 19 31 -13 77 -178 96 15 156 57 -10 -47 -26
8030 -26 87 21 -117 29 -124 -102 38 -48 4 -2 108 22 47 199 -55 6 4 -109 31 -24 -150 -30 54 137 -14
8055 -14 -3 -91 40 -60 187 83 -8 -112 -53 109 -29 -78 125 -138 23 8 -154 77 51 21 45 79 -273 -103
8079 -103 -121 -2 7 21 136 60 -32 -145 114 -55 94 58 -123 -7 -44 9 127 -36 -14 -45 -4 112 59 12 48
8104 48 29 -37 -248 -146 84 68 99 107 17 77 55 -89 25 -24 -47 -167 -21 -106 -8 56 4 -15 -121 -21 -195 -166
8130 -166 168 22 47 175 -108 34 -42 115 119 33 -28 -47 -84 -85 57 -93 -23 26 154 37 26 65 89 -99 118
8155 118 -57 -102 -73 -70 -120 48 114 47 -44 -138 40 148 16 94 108 -166 -9 15 92 143 71 -14 -115 166 33
8180 33 69 223 108 -13 -64 142 22 150 107 -193 21
8191B1
$$ Imaginary data points
##PAGE= N=2
##DATA TABLE= (X++(I..I)), XYDATA
0 0 0 0 0 0 0 0 0 0 0 0 0 0 0 0 0 -7 8 -8 8 -8 8 -16 16 -16 24 -24 29 -32 40 -41 48 -56 64 -72 80 -89 101
37 101 -113 125 -140 156 -172 191 -211 235 -260 284 -315 346 -382 419 -464 510 -565 623 -693 770
57 770 -860 966 -1092 1245 -1438 1685 -2011 2477 -3175 4349 -6665 12936 -64654 -172772
71 -172772 17274 46707 -18002 70069 93702 -66413 -97844 -17582 -2509 34037 92158 21998
83 21998 -55053 -40184 -36607 -25090 52107 66556 13981 -7965 -42124 -76078 -6187 63794
95 63794 36955 17808 13983 -48503 -67721 -3621 33204 42910 50163 -9658 -67604 -31075 4120
108 4120 2205 39694 52300 -8059 -39145 -32614 -31292 16570 59838 14206 -10797 14818 -34378
121 -34378 -72770 15284 66264 15796 8658 8088 -55164 -50007 18757 24487 31328 55989 -18075
134 -18075 -84682 -19972 21206 -1077 47429 65566 -38641 -72975 -5402 -3039 -4555 66580
146 66580 55258 -42202 -54605 -15230 -14284 12158 57751 36508 -13865 -39199 -49401 -19080
158 -19080 39597 49814 19910 -1765 -31557 -53679 -20328 31496 49783 34914 -8306 -46598
170 -46598 -36021 -7924 9559 41316 48653 -7968 -48350 -28351 -11016 4371 42416 40520
182 40520 -7973 -28888 -28948 -27824 9167 45987 27274 194 -11233 -39549 -37766 18388 40976
195 40976 17386 12329 -3691 -45986 -36179 15948 31207 24919 19953 -13322 -42362 -22864 2301
208 2301 16206 39014 29293 -22691 -40588 -16176 -4640 9181 40308 32437 -15796 -38385 -25660
221 -25660 -6840 16069 35251 27536 -4235 -32849 -35973 -10375 21420 34196 24441 -323 -28520
234 -28520 -36544 -15174 17497 36623 27092 -2698 -26424 -30464 -18760 9080 37950 32554 -2996
247 -2996 -26831 -27809 -18764 4684 33559 33798 3953 -24303 -32220 -19229 7278 28359 28969 10982
261 10982 -17505 -36177 -23435 8623 27717 25857 12402 -11820 -33502 -27805 3248 28260
273 28260 28329 11703 -9968 -28475 -28108 -3617 24877 31556 14783 -10612 -27819 -25992 -5663
286 -5663 18315 31311 21465 -8304 -30909 -25434 -4800 13907 28359 25588 -3360 -30242 -27686
299 -27686 -7219 13617 27739 23659 -728 -24098 -29347 -14095 13887 30877 21386 95 -18079
312 -18079 -29051 -19326 11294 30808 22806 2466 -17351 -28648 -18375 7370 26081 26223 7642
325 7642 -18706 -29606 -16300 4508 21438 28278 11821 -17361 -29534 -18134 2103 20796
337 20796 27136 12353 -11992 -27219 -23151 -657 22925 26174 10736 -7407 -23945 -26335 -4423
350 -4423 22216 26854 13008 -5944 -23104 -25145 -6682 16822 27002 18285 -4911 -24444 -23665
363 -23665 -7220 11873 25582 21689 -2520 -23977 -24243 -8973 10536 24796 21664 1004 -20343
376 -20343 -25934 -12693 9874 24530 20729 3287 -16072 -26101 -15858 7962 24566 21020 4737
389 4737 -14057 -24864 -17803 4839 23371 22819 6390 -13037 -24148 -18522 1513 20797 23883
402 23883 9375 -11362 -24021 -18677 211 17994 23221 12602 -8869 -24336 -19526 -1132 16052
415 16052 22899 14222 -6648 -22252 -20716 -4720 14334 23873 14950 -5217 -19770 -20785 -8078
428 -8078 12391 24180 16324 -2676 -18650 -22100 -8886 10913 21865 17770 1303 -18529 -23647
441 -23647 -9310 8662 19863 20510 3867 -18605 -22909 -9963 4876 18845 22666 4973 -16510
454 -16510 -21522 -13570 2451 20942 21836 3869 -11547 -19597 -19257 806 23817 20871 3765 -8287
468 -8287 -19910 -21212 1222 21520 18950 8370 -5966 -23050 -20037 2840 16712 17701 11974
481 11974 -5354 -22785 -17657 -141 12673 20193 14261 -6992 -19983 -15493 -4974 9583 21844
494 21844 14924 -4934 -17269 -18069 -7621 10843 20266 13350 -451 -14513 -20647 -8645 10056
507 10056 17928 14944 2484 -15671 -19859 -6898 5155 14209 19813 5432 -16895 -18422 -8100
520 -8100 326 15408 22253 4100 -13458 -14834 -14038 -3931 19910 23045 2552 -9857 -14719 -18807
534 -18807 -2807 21076 19469 4949 -4897 -18721 -21809 1154 19642 15427 8511 -1828 -20942
547 -20942 -21003 1053 15280 16337 12633 -3587 -21514 -17381 -730 10812 18086 15305 -3598 -20394
561 -20394 -17488 -3040 10691 18388 13462 -2555 -17098 -18217 -4903 10833 17075 12797 65
574 65 -16079 -18413 -4010 8529 13189 14471 3287 -15494 -17436 -4717 4119 12437 17100 3381
588 3381 -13943 -13878 -7985 -1310 14471 19460 1833 -11415 -11149 -11933 -3937 16297 19086 2115 -7145
603 -7145 -11232 -16126 -4019 16883 16979 4317 -3277 -12602 -18457 -3701 15132 15845 7895 -1162 -14960
618 -14960 -19082 -3175 12618 15492 11323 25 -16585 -19182 -3475 11041 15701 13263 198
631 198 -17488 -18823 -3360 9437 15092 14737 838 -17503 -18119 -3400 7903 13902 15753 1568
645 1568 -16933 -17004 -3729 5581 13051 16012 2409 -15455 -15880 -5030 3968 13190 15822 2401
659 2401 -13033 -13973 -7152 1427 12855 15815 2851 -10635 -12297 -8401 -1165 11930 16056 3787
673 3787 -8280 -10853 -10510 -3222 11693 15988 4382 -5372 -9653 -13286 -5078 12096 14893 4973
687 4973 -1660 -9497 -16444 -5285 12241 12954 6857 1959 -11068 -18328 -4035 10528 11157 10306 3925
702 3925 -13535 -17981 -3261 7033 10925 13958 3599 -14339 -15939 -4272 4344 12185 15312 2560
716 2560 -13343 -14872 -6717 3307 13645 14470 2457 -10636 -14998 -8940 3805 13250 13247 3834 -8934
731 -8934 -15574 -8910 2977 11278 13788 5525 -9364 -14321 -7573 210 9490 15912 5934 -9665
745 -9665 -11721 -7842 -3181 9586 16559 4573 -7265 -8950 -10879 -5168 11468 14962 3583 -2606
759 -2606 -7982 -14357 -4627 11712 11580 5006 1362 -9578 -15940 -3047 9123 9163 8901 2946 -11490
774 -11490 -14252 -2981 5020 10107 12211 1817 -11361 -11685 -5276 1969 11928 12964 1189 -9243
788 -9243 -11558 -8117 2479 12584 11130 2605 -6213 -13337 -10069 3624 11519 10017 4839 -5774
802 -5774 -14514 -9162 2559 8559 11730 7187 -6958 -13613 -7379 -420 7071 14220 6943 -7608
816 -7608 -11097 -8099 -3880 8146 15428 5443 -5932 -8775 -10467 -4841 9179 13464 5317 -1785
830 -1785 -8655 -13360 -3544 9549 10335 6255 1203 -9310 -13571 -3174 7032 9750 9149 1212 -10178
845 -10178 -11298 -3941 3311 10694 11449 404 -9744 -10112 -6024 2288 11527 10523 532 -7035 -10423
860 -10423 -8195 2556 11383 9274 2368 -5288 -11737 -8502 2872 9179 9000 5230 -4597 -12736 -8289
875 -8289 1958 7634 10095 6223 -4821 -11452 -8186 -996 7176 12224 5928 -5125 -9516 -8436
889 -8436 -3199 6991 12301 5940 -3354 -8762 -10033 -3411 7251 10804 6195 -725 -8508 -11304 -3410
904 -3410 6415 9551 7579 507 -8889 -10947 -3691 4548 9373 8942 910 -8613 -10567 -5009 3395
919 3395 9970 9400 760 -7152 -9756 -6384 2307 10404 9348 1502 -5999 -9918 -6869 1848 8928
934 8928 9048 3581 -4957 -10773 -7240 1729 8062 8771 4925 -3992 -10849 -7857 473 7441 9556 5054
950 5054 -3885 -9705 -8214 -1239 7224 10369 5084 -3261 -8711 -8731 -2271 6852 10100 5418 -2209 -7959
966 -7959 -9095 -3067 5822 9676 6427 -1295 -7990 -9276 -3555 4616 9086 7165 190 -7555 -9584
981 -9584 -4161 4162 9066 7238 668 -6579 -9577 -5397 3270 8930 8032 1405 -5957 -9551 -5693
996 -5693 2111 8254 8448 2822 -5499 -9620 -5930 1636 7485 8613 3965 -4773 -9722 -6506 843
1011 843 6814 9019 4430 -4214 -9381 -6986 -77 6505 8971 5010 -3446 -8771 -7528 -1095 6251
1026 6251 9244 4931 -2616 -7909 -7962 -2402 5768 9513 5426 -2162 -7578 -8009 -3002 4945 9318 5850
1042 5850 -1222 -6790 -8473 -3728 4635 8837 6266 -337 -6169 -8498 -4209 3953 8480 6355 632
1057 632 -5747 -8852 -4781 3131 7944 6480 1598 -4836 -8716 -5483 2303 7159 6984 2611 -4406
1072 -4406 -8722 -5571 1235 6216 7665 4025 -3874 -8798 -5666 527 5365 8042 4697 -3504 -8400
1087 -8400 -5962 -711 4887 8617 5172 -3236 -7786 -6599 -1989 5023 9374 5173 -2724 -7132 -7182
1102 -7182 -3158 4832 9286 5390 -1754 -6672 -7927 -3652 4571 9138 5799 -774 -6484 -8296 -3843
1117 -3843 4393 8438 5966 50 -6082 -8053 -3947 3791 8220 5989 195 -5179 -7735 -4709 3030
1132 3030 7860 5933 877 -4170 -7877 -5210 2823 6879 5748 2366 -3622 -8394 -4926 2047 5186
1147 5186 5845 3892 -3554 -8322 -4486 1091 3823 6738 4849 -3499 -7377 -4430 -960 3380 7748
1162 7748 4975 -3051 -6104 -5038 -2903 3451 8562 4662 -2112 -5376 -6280 -3630 3739 8170 4860
1177 4860 -760 -5060 -7528 -3888 3468 7790 5738 199 -5563 -7585 -3989 2920 7547 6458 570
1192 570 -5455 -7375 -4583 2452 7802 6183 666 -4238 -7498 -5768 2312 7900 5752 1064 -3340
1207 -3340 -8108 -5867 2936 6993 5040 2510 -3283 -8583 -5044 2576 5427 5509 3959 -3714 -8468
1222 -8468 -3867 1367 3811 6863 4542 -4216 -7414 -3487 -481 3348 7470 3952 -3548 -5682 -4191
1237 -4191 -1879 3617 7322 3472 -2061 -4666 -5537 -2681 3701 6580 3898 -484 -4746 -6133 -2801
1252 -2801 2724 6035 5067 116 -4904 -6064 -3284 1575 6383 5706 320 -4252 -5843 -4582 1147
1267 1147 6835 5852 695 -3162 -6241 -5631 1824 6855 4922 1712 -2250 -7397 -5929 2018 5810
1282 5810 4792 3228 -2182 -8163 -5206 1602 4646 5652 4186 -2927 -7753 -4313 566 3784 6795
1297 6795 4125 -3438 -6348 -4160 -1081 3592 7296 3721 -2619 -5308 -4696 -1865 3827 6709 3678
1312 3678 -1607 -5287 -5521 -1732 3293 5822 4296 -527 -5147 -5656 -1977 2504 5715 4787 -37 -4706
1328 -4706 -5376 -2981 1635 6069 5098 -91 -3779 -4922 -4097 1146 6209 5043 474 -2895 -5596 -4541
1344 -4541 1245 5757 4945 1946 -2459 -6303 -4567 1566 4833 4824 3094 -2303 -6795 -4736 825 3906
1360 3906 5054 3485 -2034 -6015 -4729 -265 4056 5759 3037 -2029 -5167 -4918 -1375 3719 6253
1375 6253 3392 -1684 -4891 -4906 -1688 3332 5968 4254 -1012 -4964 -5089 -1514 2610 5433 4755 -381
1391 -381 -5143 -5266 -1882 2463 5344 4694 272 -4175 -5337 -2990 2074 5494 4240 483 -3151 -5312
1407 -5312 -3585 1449 5645 4693 830 -3005 -5142 -3998 855 5028 5283 1563 -3109 -5400 -3529
1422 -3529 418 4048 5320 2579 -2744 -5652 -3798 170 3840 4814 2886 -1686 -5373 -4621 -207
1437 -207 3953 4661 2667 -1097 -4718 -5191 -1122 3552 5283 2993 -1109 -4484 -4751 -1878 2767 5784
1453 5784 3789 -1120 -4416 -4042 -2135 1991 5233 4673 -412 -4496 -4670 -1961 1934 4785 4258 853
1469 853 -3641 -5381 -2493 2339 4778 3731 1197 -2676 -5597 -3443 1663 4675 4216 1113 -2701
1484 -2701 -4636 -3832 571 4616 5209 1271 -3177 -4350 -3500 -541 4050 5514 2123 -2725 -4791 -3537
1500 -3537 -444 3434 4718 2661 -1611 -5191 -4417 294 3440 4019 3003 -428 -4924 -5092 -519 3521
1516 3521 4353 2808 -791 -4010 -4421 -1856 2674 5472 3352 -1155 -3656 -3788 -2462 1483 5446 4153
1532 4153 -785 -3821 -3930 -2166 1360 4441 4036 697 -3778 -4869 -1976 1934 3488 3810 1758 -2636
1548 -2636 -5471 -3177 1790 3943 3601 1282 -1931 -4648 -3943 557 4751 4297 877 -2062 -3549 -3986
1564 -3986 -653 4078 5096 1516 -2174 -3860 -3585 -414 3045 4566 2927 -1552 -5114 -3732 177
1579 177 2470 3594 3598 -254 -4955 -4505 -10 2771 3581 3019 -158 -3830 -4736 -1498 2657 4671 2767
1596 2767 -665 -2982 -3908 -2651 1662 5277 3776 -1011 -3487 -3392 -2193 813 4293 4528 -51 -3848
1612 -3848 -3813 -1707 993 3534 4226 1384 -2957 -4639 -2328 1478 3617 3114 1361 -1722 -4320 -3631
1628 -3631 792 4395 3241 785 -1276 -3340 -3997 -311 4136 4212 1105 -1281 -3096 -3486 -1027 3004
1644 3004 4293 2551 -1421 -3986 -3141 -328 2001 3552 3504 -427 -4685 -3895 -177 2133 2944 3447
1660 3447 698 -3958 -4648 -1130 2450 3444 2909 316 -2773 -4168 -2291 1602 4566 3301 -566 -2850
1676 -2850 -3431 -2521 456 4357 4492 -363 -3621 -3090 -2011 92 3711 4767 609 -3347 -3849 -2098
1692 -2098 854 3257 3412 1389 -1822 -4421 -3281 1133 3876 2735 955 -795 -3535 -3924 119
1707 119 4264 3326 755 -890 -2703 -3718 -828 3014 4029 1771 -1352 -3087 -2909 -823 1785 3558
1723 3558 2901 -613 -3917 -3147 -164 1596 2558 3292 463 -3732 -4056 -581 1729 2537 2965 1049 -2784
1740 -2784 -4096 -1808 1627 3552 3069 233 -2337 -3326 -2673 388 4138 3862 -267 -2721 -2479 -2635
1756 -2635 -433 3701 4561 648 -2821 -3189 -2301 145 3021 3644 1445 -1872 -4073 -3029 561 2940
1772 2940 3074 1548 -1041 -3738 -3581 328 3541 3050 996 -692 -2849 -3750 -535 3163 3768 1312
1788 1312 -1089 -2654 -2995 -1075 1978 3507 2487 -855 -3376 -2694 -689 1168 2700 3212 241 -3627
1804 -3627 -3216 -437 1378 2193 2905 987 -2615 -3686 -1431 1110 2708 2735 842 -1874 -3225 -2391
1820 -2391 587 3413 3034 399 -1839 -2494 -2585 -349 3236 3868 533 -2095 -2433 -2310 -725 2637 4065
1837 4065 1444 -2062 -3273 -2303 -151 2442 3214 1779 -832 -3480 -3263 121 2840 2745 1576 -49
1853 -49 -2912 -3718 -584 3100 3041 1469 -365 -2505 -3192 -938 1999 3495 2152 -594 -2922 -2743 -903
1870 -903 1121 3176 2855 -343 -2932 -2757 -953 1040 2732 2896 498 -2692 -3315 -1044 1202 2502
1886 2502 2357 976 -1901 -3351 -1889 945 2607 2625 567 -1615 -2779 -2397 -99 2854 3210 672
1902 672 -1672 -2388 -2221 -610 2375 3526 1186 -1696 -2532 -2336 -421 2043 3096 1623 -889 -2978
1918 -2978 -2973 -306 2046 2494 1816 -160 -2974 -3140 -499 2288 2594 1784 -74 -2555 -2970 -893 1626
1935 1626 2977 2029 -284 -2202 -2688 -1490 935 3188 2541 -177 -2174 -2594 -1348 869 2732 2498
1951 2498 403 -2388 -3102 -1294 1019 2322 2414 967 -2124 -3304 -1704 640 2180 2593 1190 -1630
1967 -1630 -2751 -1918 78 2455 2837 828 -1347 -2392 -2149 -417 2349 3103 856 -1138 -2281 -2255
1983 -2255 -587 2097 2888 1588 -762 -2514 -2519 -285 1693 2397 2039 -185 -2652 -2659 -398 1555 2311
2000 2311 2113 -179 -2394 -2490 -944 1350 2824 2051 -10 -1976 -2511 -1570 957 2874 2141 97 -1747
2017 -1747 -2564 -1437 815 2453 2339 544 -1743 -2796 -1423 584 1974 2286 914 -1794 -2881 -1587
2033 -1587 419 1998 2513 994 -1431 -2597 -1819 41 2243 2448 1044 -1054 -2215 -2086 -315 1972
2049 1972 2638 1203 -1031 -2253 -2346 -359 1765 2649 1377 -610 -2495 -2238 -567 1532 2287 1768 -315
2066 -315 -2421 -2325 -640 1307 2619 1857 -134 -2110 -2243 -904 1145 2392 1731 -13 -1754 -2428 -1301
2083 -1301 927 2634 1956 183 -1653 -2493 -1330 836 2161 1997 511 -1673 -2330 -1414 577 2058
2099 2058 2225 769 -1564 -2401 -1339 286 1826 2406 752 -1201 -2345 -1605 -110 1943 2424 1006
2115 1006 -968 -2140 -2001 -256 1929 2314 1027 -787 -2150 -2046 -471 1444 2281 1288 -598 -1848
2131 -1848 -2243 -603 1363 2282 1488 -316 -2045 -2291 -844 1020 2368 1744 -46 -1762 -2170 -997
2147 -997 1002 2263 1635 261 -1495 -2207 -1136 777 2158 1930 407 -1538 -2402 -1168 672 1809
2163 1809 2103 728 -1604 -2265 -1242 327 1688 2138 827 -1377 -2131 -1427 161 1548 1985 836
2179 836 -994 -2104 -1554 -276 1490 2227 1160 -1124 -1945 -1588 -472 1345 2172 1237 -701 -1714 -1815
2196 -1815 -366 1321 1993 1229 -254 -1613 -2094 -700 1158 2075 1474 -70 -1396 -1920 -875 1031
2212 1031 2070 1502 198 -1386 -2306 -853 875 1801 1555 310 -1284 -2291 -1243 792 1678 1814
2228 1814 653 -1329 -2241 -1230 547 1714 1730 741 -1127 -2167 -1240 324 1554 1894 963 -1209 -2034
2245 -2034 -1227 230 1529 2072 823 -1087 -1864 -1442 -185 1379 2058 1068 -869 -1669 -1460 -462 1105
2262 1105 1933 1328 -787 -1535 -1632 -532 1056 2108 1145 -437 -1423 -1621 -599 987 2012 939 -235
2279 -235 -1276 -1757 -859 979 1971 1147 21 -1140 -1855 -1005 753 1734 1347 186 -1147 -1851 -1051 651
2297 651 1452 1414 700 -1053 -2139 -1220 422 1472 1699 1020 -1074 -2009 -1104 346 1225 1685 927 -1017
2315 -1017 -1953 -1485 -46 1266 1959 1122 -945 -1857 -1415 -325 1062 1960 1156 -696 -1663 -1563 -358
2332 -358 885 1893 1064 -636 -1672 -1441 -475 1094 2106 1227 -299 -1275 -1598 -685 972 1960 1224
2349 1224 -315 -1025 -1782 -818 922 1867 1117 -108 -1087 -1782 -931 733 1797 1085 291 -1069 -1753 -1081
2367 -1081 662 1509 1249 671 -922 -1843 -977 278 1337 1259 795 -779 -1765 -1176 45 1100 1503 850
2385 850 -602 -1489 -1137 16 1298 1602 905 -614 -1518 -1274 -369 1023 1894 1135 -541 -1386 -1509 -527
2403 -527 889 1897 1163 -272 -1442 -1501 -627 698 1588 1373 -196 -1368 -1496 -787 811 1918 1283
2420 1283 -91 -1161 -1539 -977 585 1589 1156 54 -1009 -1656 -1221 672 1714 1134 395 -851 -1645
2437 -1645 -1019 460 1359 1408 343 -771 -1711 -1164 427 1285 1389 760 -647 -1710 -1055 74 1238
2454 1238 1563 703 -649 -1528 -1117 -143 1028 1572 805 -595 -1538 -1143 -238 1043 1530 982 -466 -1336
2472 -1336 -1239 -502 758 1435 1329 -251 -1325 -1030 -501 555 1389 1370 -134 -1254 -1467 -501 601 1376
2490 1376 1168 -38 -1079 -1417 -778 542 1290 1086 266 -728 -1446 -865 509 1369 1232 7 -794 -1478
2508 -1478 -967 284 1251 1506 417 -713 -1648 -907 117 1004 1505 709 -680 -1467 -1150 176 1174 1343
2526 1343 693 -577 -1199 -1269 -262 1049 1389 810 -496 -1355 -1216 -224 980 1436 899 -456 -1344 -1276
2544 -1276 -375 771 1392 869 -192 -1202 -1029 -535 579 1384 1034 -108 -997 -1165 -507 561 1270 1062
2562 1062 26 -1103 -1462 -869 536 1246 969 281 -809 -1384 -940 321 1230 1180 296 -555 -1093 -870
2580 -870 204 1212 1132 419 -721 -1298 -842 -89 1084 1181 581 -580 -1379 -1132 -65 913 1447 648 -346
2599 -346 -1291 -1225 -126 1013 1228 664 -260 -1155 -1466 -341 758 1350 810 -234 -1137 -1071 -384 741 1324
2618 1324 863 -142 -1077 -1211 -492 638 1228 1134 -20 -989 -1083 -622 475 1167 1059 191 -1001 -1201 -577
2637 -577 438 1024 1044 300 -627 -1261 -691 77 988 1079 323 -551 -1257 -784 149 1112 1048 355 -724 -1031
2657 -1031 -891 49 1084 1221 623 -432 -1138 -1044 127 911 999 840 -344 -1287 -1038 -216 777 1238 665
2676 665 -332 -1211 -891 -241 567 1376 701 -33 -1004 -1001 -610 592 1080 884 -19 -983 -1250 -586 313 1161
2696 1161 961 144 -911 -1111 -591 298 1039 1070 198 -882 -1093 -725 116 1091 1154 217 -558 -1169 -833 84
2716 84 1063 1172 375 -629 -1114 -892 40 1038 1020 457 -478 -1210 -1031 -3 957 1146 755 -296 -1156 -1115
2736 -1115 -149 659 784 636 -238 -1068 -1000 -269 618 1054 841 -206 -938 -1026 -217 748 954 974 -145 -810
2756 -810 -1098 -459 552 1022 929 -88 -932 -928 -563 454 1148 912 163 -861 -933 -771 225 1066 945 233
2776 233 -660 -887 -646 48 924 1127 108 -605 -854 -914 175 796 1006 319 -272 -840 -1067 -217 860
2795 860 1025 621 -276 -1211 -956 93 793 905 610 -76 -1197 -1036 -99 634 1070 709 -385 -1178 -1025
2814 -1025 -280 536 1041 908 -22 -864 -1129 -348 485 1138 798 -141 -825 -1022 -511 402 895 876 9 -792
2834 -792 -939 -609 213 913 945 -5 -819 -884 -674 219 983 918 213 -590 -884 -618 58 985 926 354 -395
2855 -395 -896 -946 18 869 913 330 -350 -887 -1003 -4 829 1034 502 -117 -950 -873 -140 774 910 631 -64
2876 -64 -938 -1127 -326 488 882 665 80 -855 -976 -247 571 998 622 -166 -800 -809 -381 418 1004 1015 176
2897 176 -773 -855 -322 324 979 909 49 -749 -838 -696 302 925 877 273 -480 -844 -743 249 926 884 151 -617
2919 -617 -849 -545 -64 781 890 265 -671 -842 -623 -166 831 795 336 -151 -737 -763 -148 905 905 279 -331
2940 -331 -825 -905 -181 750 818 571 50 -684 -1017 -192 644 806 608 -35 -827 -1051 -301 466 882 688 84
2961 84 -663 -837 -349 310 768 769 259 -823 -795 -485 283 826 732 153 -668 -912 -434 288 656 941 275
2982 275 -370 -998 -603 24 808 901 281 -356 -856 -665 -69 914 832 182 -382 -716 -654 -133 662 969 406
3003 406 -354 -692 -727 -151 441 908 454 -184 -777 -718 -226 681 683 638 29 -775 -872 -284 490 909 434 -35
3025 -35 -698 -941 -219 565 730 584 103 -706 -901 -396 363 897 776 45 -665 -679 -414 -15 705 766 245
3046 245 -656 -758 -570 -76 582 803 338 -573 -941 -735 129 704 634 264 -252 -631 -767 -2 805 914
3066 914 339 -181 -671 -805 -48 550 925 202 -311 -726 -574 -88 456 971 623 -294 -715 -379 -98 458
3086 458 615 735 -116 -816 -813 -186 589 739 606 130 -591 -917 -461 349 657 458 42 -439 -958 -452 213
3107 213 969 831 -119 -618 -703 -587 -37 638 718 211 -454 -583 -444 101 304 847 373 -514 -812 -521 43
3128 43 552 656 491 -247 -824 -784 9 831 581 353 -198 -605 -612 -232 662 657 235 -178 -616 -758 -246 464
3150 464 861 427 -187 -685 -594 -360 122 746 676 9 -739 -710 -199 90 574 585 62 -664 -755 -253 400 651
3172 651 402 116 -391 -777 -377 367 834 557 208 -226 -672 -427 85 676 846 211 -377 -656 -403 -209
3192 -209 486 814 402 -386 -742 -501 -59 402 746 478 -379 -847 -446 114 470 693 387 -55 -746 -819
3212 -819 -110 564 697 298 -21 -361 -897 -490 298 728 219 -127 -480 -436 -294 195 753 560 -83 -655
3232 -655 -460 -258 -38 328 541 214 -641 -845 -167 374 423 494 241 -278 -716 -396 363 609 323 102 -368
3253 -368 -714 -671 36 786 622 55 -317 -530 -409 -62 495 835 175 -392 -489 -421 -9 316 715 682 -258
3274 -258 -839 -452 -68 353 436 487 134 -589 -682 -9 556 528 289 -47 -463 -629 -432 573 712 309 -87
3295 -87 -359 -660 -543 445 709 482 -218 -536 -406 -590 -12 507 607 73 -429 -724 -327 -17 404 574
3315 574 95 -513 -692 -399 192 474 381 342 -117 -772 -627 204 353 429 257 -179 -326 -528 -101 535 483
3336 483 112 -379 -485 -375 -190 335 750 361 -347 -374 -437 -215 411 629 497 17 -616 -648 -186 327 455
3357 455 516 388 -526 -707 -324 475 719 190 59 -96 -504 -284 297 889 450 -116 -469 -502 -439 58 704
3378 704 632 26 -442 -590 -310 133 402 661 428 -486 -580 -390 94 338 446 499 -351 -646 -372 231 491
3399 491 391 328 -204 -485 -457 -21 530 584 205 -214 -486 -444 -414 418 793 385 -161 -424 -328 -328 128 591 343
3422 343 61 -554 -483 -109 401 503 408 83 -402 -573 -83 169 475 335 69 -222 -624 -303 337 499 488
3443 488 33 -401 -532 -491 122 554 521 76 -186 -605 -243 179 508 602 170 -438 -716 -386 142 198 581
3464 581 325 -309 -708 -416 106 317 436 400 -92 -327 -592 -84 471 634 362 -162 -339 -423 -219 315 619
3485 619 358 -271 -420 -414 -238 274 474 316 -183 -449 -441 -174 115 514 481 26 -423 -555 -257 84 467 309
3507 309 159 -434 -624 -393 153 452 317 132 -249 -400 -395 138 625 412 151 -5 -520 -381 -12 584 573
3528 573 236 -241 -510 -362 80 281 498 269 -243 -526 -480 47 339 341 299 -217 -388 -446 -26 337 444 299
3550 299 -196 -229 -531 -151 532 512 340 -13 -452 -450 -166 292 767 318 -245 -307 -340 -280 186 575 552 59 -115
3573 -115 -403 -257 126 596 274 58 -249 -587 -329 278 385 337 269 -305 -477 -223 149 380 523 155 -9
3594 -9 -432 -405 -124 362 317 103 -20 -336 -428 -20 174 541 329 -171 -426 -435 -52 401 609 311 -15 -397
3616 -397 -470 29 199 388 327 111 -457 -428 -185 145 543 195 24 -239 -474 -192 142 514 324 31 -526
3637 -526 -378 -175 -21 546 413 84 -374 -384 -507 30 470 524 228 -256 -457 -307 -54 334 476 201 -210
3658 -210 -547 -284 -22 354 423 335 -150 -348 -295 -108 280 396 115 -258 -293 -289 -100 182 482 272 -76 -361
3680 -361 -413 -70 273 512 250 10 -336 -474 -89 394 349 339 -198 -324 -288 -262 131 381 468 127 -213 -475
3702 -475 -190 137 563 464 -86 -193 -519 -131 135 416 365 136 -236 -524 -335 72 337 366 168 -345 -398
3723 -398 -345 71 332 543 298 -152 -444 -297 -43 432 306 83 -140 -449 -479 -92 237 480 274 -85 -247
3744 -247 -548 46 463 368 233 -57 -222 -512 20 394 350 177 -190 -313 -355 -5 122 300 318 -76 -364
3765 -364 -456 -222 110 398 258 82 -416 -403 -226 195 400 495 139 -370 -473 -394 79 425 469 165 -298 -340
3787 -340 -318 -43 502 448 175 -333 -318 -378 47 336 529 173 -83 -458 -503 -96 135 353 177 -260 -361 -155
3809 -155 -62 409 343 241 -132 -341 -427 -105 375 347 358 22 -451 -223 9 94 176 185 -60 -372 -377 -274 53 400
3833 400 222 -39 -364 -417 -105 212 396 384 247 -352 -394 -329 -26 362 299 193 -128 -526 -322 36 278 355
3855 355 148 -313 -362 -223 11 393 332 112 -165 -390 -387 22 323 642 269 -178 -237 -267 37 290 357 103
3877 103 -105 -427 -502 5 316 438 335 -235 -456 -350 -241 288 402 214 -27 -238 -344 -81 428 505 341
3898 341 216 -289 -165 -247 112 350 444 84 -299 -568 -166 30 389 464 22 -107 -406 -377 97 288 381 292
3920 292 -518 -282 -94 8 333 476 234 -256 -464 -176 -145 338 424 102 -152 -423 -330 -113 286 394 272
3941 272 -111 -224 -453 -148 276 388 293 -120 -328 -572 -172 242 352 518 60 -303 -247 -9 263 250 366
3962 366 -14 -133 -326 -198 119 449 316 -17 -259 -511 -143 136 217 380 48 -299 -351 -239 95 493 430
3983 430 -12 -232 -487 -184 20 282 428 256 -191 -339 -311 34 -8 552 109 -358 -220 -484 -13 270 467
4004 467 215 -110 -374 -346 48 404 219 211 -220 -366 -282 -9 317 282 262 -80 -256 -370 -198 301 473 229
4026 229 -18 -324 -586 60 22 313 384 6 -232 -414 11 1 317 178 -75 -81 -365 -101 115 359 441 117
4048 117 -194 -303 -357 164 341 272 108 -296 -438 -236 -6 260 320 196 -355 -346 -111 -59 148 475 179 53
4070 53 -214 -311 -87 296 383 90 -211 -261 -338 -100 490 289 331 -77 -93 -248 -157 308 329 288 -51 -160 -441
4093 -441 -269 67 466 201 -122 -216 -444 -236 176 320 319 222 -201 -330 -256 224 507 421 119 -309 -323 -283 166
4116 166 168 433 -51 -156 -421 -165 19 365 276 203 -300 -415 -274 -134 293 457 179 -50 -377 -285 -251 292
4138 292 332 68 -89 -217 -339 -137 227 222 308 -160 -464 -494 37 47 448 193 2 -160 -505 -245 378 519
4160 519 222 -70 -98 -419 -101 173 337 226 35 -207 -203 -139 159 230 150 148 -346 -427 -249 -76 351 245 97
4183 97 -211 -355 -306 111 356 201 87 -81 -306 -312 114 151 337 68 -211 -356 -385 112 328 309 65 -48
4205 -48 -246 -261 -197 23 260 -185 -114 -220 -289 -160 141 453 275 -13 -313 -242 -70 190 329 207 161 -430
4227 -430 -453 -68 80 288 258 -59 -212 -277 -301 86 519 146 122 -352 -496 -107 253 178 227 216 -152 -416 -165
4250 -165 141 335 492 120 -267 -480 -189 46 176 194 90 -146 -340 -182 91 270 367 164 -44 -319 -398
4271 -398 -196 146 422 81 -93 -149 -188 -185 234 338 216 -273 -176 -290 -92 27 359 388 129 -143 -199 -74
4293 -74 245 208 142 -130 -243 -329 -188 148 391 366 -57 -331 -152 -132 136 164 147 -3 -257 -323 -74 187 222
4316 222 360 -15 -281 -251 -69 55 314 464 234 -82 -198 -261 43 323 442 182 -113 -325 -318 -40 200
4337 200 442 62 91 -276 -134 63 118 263 249 -51 -278 -92 -147 -9 391 161 -87 -175 -251 -125 252 375
4359 375 270 42 -262 -129 -127 120 324 271 63 -198 -430 -138 137 356 95 41 -257 -359 -87 202 257 278
4381 278 -78 -145 -247 -202 41 231 237 74 -63 -279 -410 -56 327 433 181 -170 -266 -231 -119 397 266 44
4403 44 -110 -308 -73 80 147 208 75 13 -280 -416 130 35 291 127 -18 -401 -202 -71 87 226 353 -74
4425 -74 -293 -216 -196 350 342 270 -49 -255 -179 -32 159 453 197 121 -238 -329 -271 -66 335 191 -18 -259 -266 -67
4449 -67 30 97 194 193 -197 -396 -90 34 202 363 285 -110 -86 -292 -70 247 96 43 -14 -290 -65 85 115 240
4473 240 153 -157 -241 -148 9 275 428 145 -34 -322 -354 -120 346 262 84 -16 -357 -331 -276 148 180 277 -64
4496 -64 -150 -382 -189 -24 334 219 17 -205 -240 -211 44 363 333 -56 -89 -286 -298 77 422 303 27 -119
4518 -119 -332 -248 126 147 229 144 -201 -122 -293 12 289 190 68 -16 -238 -170 -19 291 367 163 -142 -209 -353
4541 -353 41 208 308 144 -28 -297 -92 43 276 88 72 -127 -450 -192 -165 95 231 157 30 -290 -58
4562 -58 -125 201 154 389 41 -151 -140 -179 148 383 436 -105 -195 -381 -158 132 276 383 86 -257 -329 -288 63
4585 63 292 351 235 -216 -200 -138 -60 391 352 238 -238 -356 -273 -80 151 102 180 6 -325 -338 -116 300 394 49
4609 49 29 -347 -292 -15 246 291 47 -43 -292 -218 -101 86 249 -14 55 -124 -222 -94 122 249 185 46 -500
4632 -500 -394 -5 -168 278 311 96 -322 -215 -102 -45 181 117 115 -139 -242 -227 72 312 93 -52 -3 -235
4654 -235 -366 50 336 483 185 -85 -431 -191 -23 201 266 48 -28 -277 -136 38 -25 230 118 -74 -191
4675 -191 -246 25 97 352 49 -174 -282 -462 -99 273 271 196 -198 -143 -287 -63 285 102 286 135 -355 -247
4697 -247 -90 223 291 301 -140 -364 -231 -111 -104 194 107 -177 -301 -412 -73 136 196 234 22 -234 -301 -179 150
4720 150 335 95 17 -47 -363 -199 107 236 299 181 -90 -78 -229 54 85 301 17 -292 -290 -255 -85 221 390
4743 390 4 -90 -314 -206 112 115 224 199 -46 -294 -393 -7 213 151 273 25 -221 -178 -111 184 160 143 -124
4766 -124 -199 -241 -151 182 305 362 -266 -246 -265 -297 -128 143 328 100 -255 -185 -291 -20 249 65 45 -358 -317
4789 -317 -203 -18 122 149 -68 -63 -411 -262 180 166 269 150 -155 -274 -214 30 251 267 -21 -132 -103 -326
4811 -326 -207 171 168 37 31 -80 -177 -13 66 299 292 -9 -204 -33 -127 121 160 203 51 -108 -243 -38 210 209
4835 209 13 -5 -53 -350 -9 179 217 151 148 -89 -257 -207 52 270 199 24 -141 76 -101 100 263 280 -23
4858 -23 -191 -256 -151 57 228 324 182 -67 -345 -34 22 155 110 155 11 -94 -383 104 251 280 96 -67
4880 -67 -74 -395 -61 175 322 159 -133 -315 -105 -31 123 197 204 -65 -117 -157 -58 92 181 43 174 -250 -197 -76
4904 -76 176 243 250 154 -171 -244 -358 177 189 25 214 -36 -156 -290 207 272 126 54 -183 -198 -17 150 293
4927 293 250 34 -73 -215 -219 -88 60 216 120 -181 -315 -152 -11 124 151 250 34 -208 -202 -56 235 35 71
4950 71 -42 -297 -257 69 281 372 89 -95 -183 -191 -56 204 229 200 -48 -153 -142 2 128 74 504 -56 -318
4973 -318 -241 -127 98 132 229 -1 -106 -310 -102 106 195 84 109 -32 -214 -80 267 294 168 -130 -127 -240 -121
4996 -121 47 272 294 -110 -199 -195 -193 -27 175 297 5 -302 -240 -291 -87 259 95 -7 -224 -164 -186 218 196 195
5020 195 82 -28 -213 -452 -99 240 65 -57 -148 -205 -529 -156 204 168 147 -62 -151 -98 -104 -79 282 158 -130
5043 -130 -333 -318 -98 144 160 290 50 -165 -60 -87 75 190 68 80 -37 -329 -201 192 379 152 252
5064 252 -115 -296 -124 -52 184 176 97 -101 -210 -128 27 132 286 147 -86 -83 -23 36 222 299 244 -20 -354 -123
5088 -123 60 168 258 320 24 -241 -278 -8 233 237 149 136 -51 -215 6 135 285 102 -59 -104 -151 -59 81
5111 81 317 -23 2 -114 -477 -261 3 173 222 -78 -240 -248 -112 35 175 153 205 -290 -278 -56 100 284 233
5134 233 40 -137 -349 -127 -14 358 368 76 -147 -204 -308 83 275 285 -107 -34 -255 7 -9 126 246 93
5156 93 -127 -211 -71 47 188 225 94 -90 -157 -62 74 183 130 115 112 -185 -289 -83 44 307 184 -63 -216
5179 -216 -286 -147 122 174 13 53 -69 -85 -22 123 292 88 86 -281 -99 -40 8 201 333 -24 -64 -182 21
5202 21 95 84 46 -38 -161 -256 -195 86 247 150 119 -93 -304 -127 41 117 176 166 -83 -149 -178 -41 0 137 182
5227 182 -75 -328 -108 -135 213 123 221 158 -171 -225 24 177 171 190 -122 -98 -245 -4 185 208 132 -165 -212 -261
5251 -261 -77 113 295 148 -63 -95 -237 -49 -48 75 105 85 -219 -106 -94 -80 163 230 -35 -154 -345 -180 75
5274 75 86 56 77 34 -308 -276 207 209 323 92 -88 -268 -84 33 -71 107 23 -29 -161 -172 14 169 94 117
5298 117 -189 8 -267 33 83 288 55 -30 -53 -364 36 246 326 27 -74 -105 -68 -69 8 161 98 -66 -246
5321 -246 -139 45 124 387 129 36 -97 -151 -145 73 106 135 97 -139 -64 -272 72 398 66 127 -27 14 -175 -40
5345 -40 91 324 144 -62 -236 -428 145 274 194 -15 78 -250 -229 -44 94 303 132 -146 -290 -57 -112 136
5367 136 294 26 34 -119 -227 13 31 135 227 20 -223 -272 113 243 117 145 75 -231 -131 -30 97 102 274
5390 274 -69 -141 -225 -179 141 341 42 -83 -178 -206 -2 73 98 83 -51 -31 -200 -82 -144 93 100 122 -136 -1
5414 -1 -54 142 -21 65 342 -85 -216 -210 -37 205 252 -164 -93 -85 -103 -62 240 147 40 -63 -42 -201 15 77 82 -16
5440 -16 -57 -62 -269 42 323 135 184 -48 -170 -279 -256 192 140 214 52 -196 -149 -45 235 185 211 -26 1 -71
5464 -71 -75 41 270 306 -70 -203 -307 -164 -115 128 46 116 -72 -188 -170 50 187 113 129 29 -205 -147 14 65
5488 65 128 108 -163 16 6 -127 135 209 194 13 -203 -254 26 -7 178 217 -33 -119 -147 -106 -47 331 103 -85
5512 -85 -209 -93 78 119 245 185 -155 -98 -173 -86 124 370 16 24 -348 -122 -59 -38 223 76 -56 -8 -157 30
5536 30 67 183 219 9 -180 -75 -183 -56 93 145 -36 1 -413 -52 -40 157 97 50 -23 -335 -28 78 249
5559 249 187 241 -126 -183 -79 -38 27 36 6 -184 -116 -283 -7 14 72 80 -116 -355 -225 -95 89 92 150 29 -90
5584 -90 -113 23 196 162 31 21 -172 -103 9 189 437 185 186 -48 -19 -84 70 253 169 -31 37 -141 -69 134
5608 134 249 -21 -108 -69 -255 -82 91 -37 232 89 -41 -251 -60 187 125 267 137 -101 -268 88 -17
5629 -17 169 184 114 -119 -196 -225 -10 102 188 -64 -77 -58 -85 -175 -57 207 104 -57 -216 -139 26 276 235 219
5653 219 27 -289 -43 -82 253 302 15 -4 -240 -246 30 161 221 107 -23 -28 -164 -117 112 78 -56 207 69
5676 69 -155 -111 -8 41 139 40 -194 -96 -215 255 218 64 20 94 -189 -87 -94 432 366 319 -157 -129 -79 69 110
5701 110 234 85 -139 -58 -68 -87 242 225 83 -193 -44 -67 -20 37 212 209 -7 -59 -265 -73 102 170 78 -42
5725 -42 -248 -169 37 44 227 167 -50 -117 -68 -94 103 175 121 -81 -164 -140 -182 -96 42 238 0 60 -145 -123 22
5750 22 94 32 96 -56 -140 40 26 61 91 64 -159 -194 -143 26 432 136 3 -27 -48 -204 -36 214 54 61 -154
5775 -154 -119 -142 -15 120 95 27 -29 -9 -182 -18 167 136 141 -150 -64 -259 130 132 78 133 -118 -200 -240 -124 261
5800 261 302 -17 -73 -168 -220 -25 33 209 41 147 -161 -164 -99 84 27 47 71 21 -322 -193 58 158 57 57 -8
5825 -8 -199 -62 31 202 101 125 -366 -341 -125 213 123 -34 23 -17 -90 -152 76 317 224 159 69 -248 -177 -62 185
5850 185 -19 138 107 -80 -170 131 69 99 170 -6 -189 -84 -62 125 262 -33 113 -234 -311 -96 -12 225 4
5873 4 -118 -65 -227 -36 181 269 178 25 -176 46 -72 -98 168 169 132 -117 -249 -46 33 52 144 -159 -198 -73
5897 -73 -131 128 207 -57 -127 -1 -20 -201 187 94 221 113 -36 -232 -123 52 129 217 44 119 15 71 16 15
5921 15 359 -152 -97 -96 -63 -35 44 250 57 19 -60 -144 -169 184 7 -45 -24 -187 71 57 -30 34 132 -21 -137 -32
5947 -32 -149 146 118 96 88 -275 -166 -142 61 76 117 38 -158 -170 -45 30 290 218 113 11 -167 -95 55 76 153
5972 153 79 50 -101 68 113 81 169 246 -89 -35 -169 -68 180 92 66 -180 -37 -239 -12 69 120 83 -73 -148
5996 -148 -303 -86 212 191 70 1 -321 -214 25 122 72 98 -100 -59 -299 114 -52 190 55 -226 -155 -201 6
6019 6 1 319 42 190 28 -145 -23 -11 162 103 78 -18 -159 -70 83 105 133 12 -198 -261 -120 -95 117 -123
6043 -123 -14 -4 -5 5 9 77 -55 173 -205 -64 -164 48 103 3 2 -50 -189 -198 144 53 65 13 15 -155 44 25
6069 25 53 17 91 67 -80 -129 66 3 179 77 102 -69 37 -28 17 142 144 113 -179 -9 -68 -48 29 69 102 -226
6095 -226 -133 -189 322 26 149 -8 -90 -217 -110 69 168 228 -62 -20 -70 -91 21 360 -19 244 -20 -95 -46
6118 -46 63 61 119 123 -148 -82 -95 -21 52 189 14 255 -70 -4 -15 30 58 243 50 -22 -158 -22 28 218 190 24
6144 24 -117 -139 9 -108 137 149 55 -83 70 -159 -21 108 83 123 21 -138 -147 51 3 295 92 -168 -106
6167 -106 -21 87 83 44 -50 43 -70 -214 -61 214 202 121 -33 -213 5 215 199 34 -34 -274 -172 -137 38 91
6191 91 -56 97 3 -200 -94 -30 183 298 -40 -64 -185 -7 -53 41 5 -3 38 -106 -252 44 92 261 50 7
6215 7 -142 -155 -72 -11 45 9 5 -226 -104 -89 -6 30 183 46 -146 -258 93 178 123 222 13 -4 -159 -80 154 94
6241 94 360 49 173 57 -23 45 67 149 41 -232 -251 2 -50 86 13 -2 -67 -198 -65 155 21 179 3
6264 3 -116 -112 -149 -66 33 87 143 -55 -136 112 -186 -9 153 232 -134 -78 -212 -82 72 106 -75 -10 -56 -149 -3
6289 -3 -43 98 149 111 -180 -179 -102 -2 142 7 -78 -199 -125 -59 76 73 217 81 27 -72 -191 -20 108 37 56 11
6315 11 -64 -86 -90 243 134 -80 4 -120 -30 59 47 256 45 -110 -101 -106 122 190 159 -30 102 -107 -88 46 -37 33
6341 33 96 106 -105 -161 -107 146 128 45 94 74 -291 -100 152 91 215 3 -90 -109 -121 49 179 116 23 -187 -187 -168
6367 -168 155 4 312 -40 52 69 -160 206 315 91 51 -52 -134 -66 47 171 42 -240 -42 -183 -55 -69
6389 -69 91 165 -21 -103 -75 -58 -62 136 161 66 56 -68 -55 30 94 128 -38 -243 113 -72 86 87 47 64 8 -143
6415 -143 -55 95 37 225 17 -88 130 -163 -89 20 76 129 148 94 -99 -84 178 197 41 4 48 -169 -94 116
6439 116 27 181 211 21 -105 17 -1 214 198 53 -92 -231 -68 -22 209 168 120 -101 -183 -162 -39 89 11
6462 11 -51 -116 -46 -50 21 85 149 104 10 21 -1 -61 56 108 145 -53 -106 -150 12 354 67 160 -120 -271 -188 48 37
6489 37 22 1 32 -143 -58 -20 39 184 -67 203 -63 -232 -171 171 26 4 -9 -168 -149 -32 -58 80 -92 56
6513 56 -172 -89 -127 162 221 235 169 -111 -137 -58 -110 116 -39 -34 -62 -95 -54 -19 -157 39 9 -112 -124 -130 26 249
6539 249 81 29 -48 -107 -41 -55 168 97 140 -148 -126 0 -35 -13 123 97 -26 -48 -28 72 113 155 -45 -89 -235
6564 -235 -249 -57 13 118 100 171 -79 -244 -84 230 156 94 8 90 -17 -116 30 130 246 -4 -64 -67 5 -29 181
6589 181 169 38 -11 -161 89 101 31 -28 -10 -171 -147 -37 -5 5 -15 -22 -74 -275 -135 88 117 -173 51 -190 -129
6614 -129 129 -111 102 164 36 1 -31 42 -74 109 97 109 42 58 -190 97 91 -134 98 -40 -180 -110 306 94
6638 94 18 118 -53 -152 90 -183 60 71 -46 -106 -24 8 -9 78 33 28 -114 -72 40 -91 47 135 27 52 -23
6663 -23 -227 -3 96 20 59 140 -100 -88 72 -21 158 111 9 -50 -45 92 252 104 155 45 -45 -77 -69 51 89 44
6689 44 -33 -137 -142 -84 19 87 -5 20 -122 59 59 -44 55 128 -7 -95 -160 62 120 77 164 185 27 -59 -74 -55 228
6716 228 77 182 84 104 -38 -181 83 124 44 -51 -120 69 -57 57 59 167 -96 -62 -110 -19 -138 82 301 -55
6740 -55 -56 -167 -31 121 25 152 -22 -127 -171 -139 36 48 -42 50 66 -180 -100 152 18 142 -36 72 -154 -52
6764 -52 -121 197 125 20 -51 -146 -129 -64 86 59 48 -138 -117 14 -57 86 150 24 -122 -92 -179 -241 36 74 -31
6789 -31 150 -160 -155 -108 77 25 24 49 2 -202 -84 -85 72 157 -27 -56 -4 71 -147 191 81 -48 -163 -102 -57 -108
6815 -108 -53 72 -43 -63 -201 -82 -11 231 186 139 31 -72 -45 70 166 195 -185 66 13 51 -150 106 210
6838 210 165 -86 -157 -228 -75 -37 36 58 -11 45 -144 -52 134 96 67 -111 -112 -44 48 75 10 218 -84 47 -87 49
6864 49 205 -49 182 -70 17 -110 42 125 39 -63 -29 -120 -114 -23 55 24 166 -77 -203 -107 -68 68 52 188 -57
6889 -57 -102 -116 -135 -7 110 217 -27 -163 -127 -207 -51 107 168 129 26 -65 -92 18 20 -36 129 -3 112 7
6913 7 -76 215 75 141 48 -162 -50 -28 95 -61 -21 -107 51 -45 111 162 -25 52 -27 -55 -89 -140 -28 136 102
6938 102 81 -35 -98 8 -2 149 25 58 -21 -159 22 -24 118 173 31 -34 -37 -56 -133 164 182 -8 -106 -88 59
6963 59 -99 -94 55 -26 -223 -95 -90 4 85 146 -35 -160 -117 -152 73 -22 72 -43 6 39 -81 9 260 -63 11 -1
6989 -1 -119 127 140 12 156 170 -121 -77 15 56 10 -63 51 -40 -8 -218 -223 73 -71 115 -34 -123 72 -181 11
7014 11 40 53 -197 -136 -12 188 45 81 253 111 -111 85 -186 180 215 92 -70 -68 10 -190 106 80 109 145
7038 145 114 -142 10 -73 156 89 25 -291 -105 -51 58 85 160 136 130 -177 -20 -12 50 -72 -12 -11 -34 105 -81 -57
7064 -57 116 185 -46 -226 -110 -65 -133 112 15 102 -48 -221 8 33 56 42 -47 -62 35 -70 -16 -122 132 17
7088 17 -134 -11 -133 -29 74 -14 -57 -174 -89 124 95 120 46 142 -171 -47 -26 62 11 55 28 -107 -28 -150 -70
7113 -70 52 59 260 -81 -43 13 61 83 74 -11 58 -160 -28 -147 162 168 -4 42 -33 -94 85 142 134 61 -105 -122 -4
7140 -4 106 8 48 118 40 79 -131 83 160 198 318 104 -10 2 -43 -177 -32 -30 -142 -15 -49 34 40 198 106 137
7166 137 61 -236 -266 24 117 169 99 62 -22 -7 28 27 57 -83 -167 -146 87 -185 292 -107 34 -157 -54 -148 117
7191 117 107 161 216 -190 -105 -69 23 115 51 80 126 -119 -51 29 155 125 164 70 55 2 115 -37 186 152 -4 113
7217 113 43 -80 88 -171 44 -55 -59 -7 -91 -6 53 116 20 4 -74 92 -65 182 173 -10 -164 -86 33 62 198
7242 198 116 73 -158 16 -12 28 155 1 66 132 -95 -160 21 155 141 -107 -98 -96 -111 -116 73 -24 -1 -3 -65 -50 -122
7269 -122 121 120 142 -50 18 -60 118 28 281 -111 -85 -61 -190 143 231 174 -1 -34 -99 -78 -117 -11 158 21 -40
7294 -40 -99 -62 30 37 16 -42 20 120 -136 104 107 234 28 -75 -80 -96 9 147 28 126 102 -51 93 -50 27 115
7320 115 61 58 14 -98 -70 130 162 129 123 -118 -55 129 48 109 233 -78 139 -25 94 124 122 104 107 70 72 -129 19
7347 19 -49 41 -60 -34 -58 -183 -111 3 172 123 113 -73 -32 140 -26 267 -103 -101 -96 -67 -20 -29 102 172 129 -151
7373 -151 -25 -50 -39 108 -23 40 20 -119 18 -8 -35 -88 121 -6 -36 21 -101 67 115 43 -62 -49 -232 13
7397 13 -59 63 17 -87 60 -122 -34 12 106 0 -126 -158 -126 67 18 205 -30 88 -42 -103 -53 144 141 56 -5
7422 -5 -95 -161 230 -9 -33 79 184 36 -20 -19 -34 -50 101 7 -213 -99 -126 19 115 -3 -167 -225 -155 97 15
7447 15 81 87 123 -44 -227 36 129 90 -18 -141 50 -114 -24 -198 -81 -4 42 109 140 -49 51 265 -6 12
7471 12 -70 -107 -131 -112 -54 -5 -30 -124 1 -139 50 8 160 4 32 -223 57 115 -60 -7 -122 29 -101 -19 20
7496 20 61 80 18 -208 -77 41 135 -59 210 127 -128 20 -193 -56 78 -37 215 -167 -42 13 51 76 -4
7519 -4 32 234 -174 60 -218 139 218 89 84 32 29 -122 104 66 -6 74 -67 -76 -77 140 75 198 48 -81 -22 -126
7545 -126 131 70 63 80 90 -118 24 59 -54 172 61 38 -75 -15 -74 96 86 -54 -177 67 -21 -47 -72 41
7569 41 87 80 -31 -226 104 -58 4 59 36 -55 115 71 18 25 -2 130 -145 118 -116 45 50 -33 -55 -159 -160 -105 136
7596 136 61 -1 90 32 -96 60 1 -4 176 247 -146 -64 19 -37 -37 160 12 -37 -115 55 -36 86 19 -23 45 -91
7622 -91 -44 122 194 99 -50 94 -125 -190 18 155 118 205 -152 -122 -103 -310 193 115 -32 -40 0 -16 -109 98 95 37
7648 37 92 47 -200 -102 73 135 205 -108 -118 -137 30 15 109 -34 -87 -69 -244 -38 18 -4 210 116 -47 32 -40 -12
7674 -12 -9 146 107 22 -8 20 46 -68 111 153 -52 -115 -127 -16 7 131 -5 -55 -91 -80 106 -19 326 159 20
7699 20 -10 -105 -102 43 -23 17 -40 19 79 -4 -10 187 86 -37 -148 -27 62 143 160 -129 52 132 74 32 65 -32 62
7726 62 142 -22 -58 -61 38 153 -88 -81 -127 -125 -172 46 299 -39 152 19 -60 82 -95 64 127 -24 -46 -133 -33
7751 -33 -130 139 47 -98 -19 -8 -180 -77 257 134 -50 -41 -164 -61 74 -11 -32 152 63 -22 120 116 95 -135 28
7776 28 -106 -97 -14 141 98 33 -8 59 72 39 -59 -53 22 96 58 -246 79 81 20 -77 125 -145 35 246 -44 29 -125
7803 -125 364 -64 51 111 -32 68 -23 -5 134 95 21 -12 73 -38 179 -10 -155 -141 -29 -13 154 133 -199
7826 -199 -128 -184 7 5 4 -18 75 36 -187 11 30 1 115 115 87 -171 -97 -24 44 -43 -104 -177 -13 9 -96 294 -56
7853 -56 83 1 -18 107 -199 -112 1 216 -42 34 -272 -35 84 69 105 5 17 -15 -53 -77 -44 225 138 162 -15
7878 -15 -3 -35 58 -115 130 -4 -17 -38 -105 200 -37 -82 -72 26 37 -40 -54 122 67 -125 -368 -92 -28 62 49 -115
7904 -115 -122 -61 -36 5 150 59 -9 -31 -103 -134 15 -105 -129 -57 -43 -58 -67 16 52 157 60 96 43 11 171 290 14
7931 14 14 17 -22 24 66 -45 100 2 -45 -15 -30 56 -169 -43 142 -50 -28 -143 -45 134 177 86 36 -55 -205 -33
7957 -33 118 84 49 183 -45 6 -69 163 -54 28 -8 13 -71 -83 -102 -7 83 -43 -92 -8 -39 132 -17 -168 87
7982 87 116 -9 -97 -115 48 17 147 32 -112 46 -26 233 -76 59 -206 60 -272 -41 -78 164 205 -71 -4
8005 -4 109 -357 -124 -26 38 -38 -53 -2 -123 -70 214 142 -131 -5 -78 0 -27 -33 -105 100 -18 -187 5 64 111 34
8031 34 111 145 45 -162 63 71 130 3 -52 -213 -72 -1 141 -12 93 10 -128 94 29 -3 -86 202 20 6
8055 6 -209 -5 80 225 50 -14 -150 -173 40 -50 73 45 -5 -104 -120 58 -11 -2 30 -9 4 80 -142 5 -13 47
8081 47 21 -70 38 -42 128 157 191 24 28 -120 -49 -129 -203 -69 34 94 -238 1 72 200 -44 23 5 -202 -52
8106 -52 16 20 37 13 -12 72 -101 -34 10 -21 44 -5 30 -122 -64 40 240 141 -41 129 10 -117 -51 106 194 -51
8132 -51 -58 28 68 51 -34 29 22 -51 -77 4 160 97 -10 175 -16 -36 107 3 -18 85 -17 183 -20 -68 24 165
8158 165 32 -40 191 -1 -41 -96 -65 157 17 9 14 -185 -181 77 29 144 -129 8 -26 -47 54 8 69 97 -96
8183 -96 -161 83 -59 -65 78 76 126 -55
8191e5
##END NTUPLES=NMR FID
##END=
