##TITLE=1H_3PEPPA0607-2
 D2O, 8 sc, 
 7.07.2021
##JCAMPDX= 6.0         $$ Bruker NMR JCAMP-DX V2.0
##DATA TYPE= NMR FID
##DATA CLASS= NTUPLES
##ORIGIN= UXNMR, Bruker Analytische Messtechnik GmbH
##OWNER= root
$$ XWIN-NMR		Version 3.5
$$ Wed Jul  7 10:16:02 2021 Russian Standard Time (UT+4h)  she@DPX200
##.OBSERVE FREQUENCY= 200.131506
##.OBSERVE NUCLEUS= ^1H
##.DELAY= (6, 6)
##.ACQUISITION MODE= SIMULTANEOUS
##.ACQUISITION SCHEME= undefined
##.AVERAGES= 8
##.DIGITISER RES= 18
##SPECTROMETER/DATA SYSTEM= spect
##.PULSE SEQUENCE= zg30
##.SOLVENT NAME= D2O
##.SHIFT REFERENCE= (INTERNAL, D2O, 0, 15.7039)
##AUDIT TRAIL= $$ (NUMBER, WHEN, WHO, WHERE, WHAT)
$$ ##TITLE= Audit trail, XWIN-NMR		Version 3.5
$$ ##JCAMPDX= 5.01
$$ ##ORIGIN= Bruker BioSpin GmbH
$$ ##OWNER= she
$$ F:/spectra/data/she/nmr/H-F/1/audita.txt
$$ ##AUDIT TRAIL=  $$ (NUMBER, WHEN, WHO, WHERE, WHAT)
(   1,<2021-07-07 10:14:41.23 +0400>,<she>,<DPX200>,
      <created by zg, POWCHK disabled, PULCHK disabled
       configuration hash MD5:
       00 E9 B6 7A A2 85 ED C7 34 08 36 98 17 FE 4E 26
       data hash MD5: 16K
       A9 D5 81 20 C2 B6 2A AE F4 F6 64 BD F4 35 D7 29>)
$$ ##END=
$$ 
$$ hash MD5
$$ 0D 8B 72 70 51 C2 2D 2C 57 AD 9B 1A F4 07 B1 A9
##$RELAX= 
##$RELAX= 
##$RELAX= 
##$RELAX= 
##$RELAX= 
##$RELAX= 
$$ Bruker specific parameters
$$ --------------------------
##$DU= <F:/spectra>
##$EXPNO= 1
##$NAME= <H-F>
##$PROCNO= 1
##$TYPE= <nmr>
##$USER= <she>
##$AMP= (0..31)
100 100 100 100 100 100 100 100 100 100 100 100 100 100 100 100 100 100 
100 100 100 100 100 100 100 100 100 100 100 100 100 100 
##$AQSEQ= 0
##$AQ_mod= 1
##$AUNM= <au_zg>
##$AUTOPOS= <>
##$BF1= 200.13
##$BF2= 200.13
##$BF3= 200.13
##$BF4= 200.13
##$BF5= 200.13
##$BF6= 200.13
##$BF7= 200.13
##$BF8= 200.13
##$BYTORDA= 1
##$CFDGTYP= 0
##$CFRGTYP= 5
##$CHEMSTR= <none>
##$CNST= (0..31)
1 1 145 1 1 1 1 1 1 1 1 1 1 1 1 1 1 1 1 1 1 1 1 1 1 1 1 1 1 1 1 1 
##$CPDPRG= <>
##$CPDPRG1= <>
##$CPDPRG2= <>
##$CPDPRG3= <>
##$CPDPRG4= <mlev>
##$CPDPRG5= <mlev>
##$CPDPRG6= <mlev>
##$CPDPRG7= <mlev>
##$CPDPRG8= <mlev>
##$CPDPRGB= <>
##$CPDPRGT= <>
##$D= (0..31)
0 1.2 0 0 0 0 0 0 0 0.06 0 0.03 0 0 0 0 0.0002 0 0 0 0 0 0 0 0 0 0 0 0 
0 0 0 
##$DATE= 1625638480
##$DBL= (0..7)
120 120 120 120 120 120 120 120 
##$DBP= (0..7)
150 150 150 150 150 150 150 150 
##$DBP07= 0
##$DBPNAM0= <>
##$DBPNAM1= <>
##$DBPNAM2= <>
##$DBPNAM3= <>
##$DBPNAM4= <>
##$DBPNAM5= <>
##$DBPNAM6= <>
##$DBPNAM7= <>
##$DBPOAL= (0..7)
0.5 0.5 0.5 0.5 0.5 0.5 0.5 0.5 
##$DBPOFFS= (0..7)
0 0 0 0 0 0 0 0 
##$DE= 6
##$DECBNUC= <off>
##$DECIM= 32
##$DECNUC= <off>
##$DECSTAT= 4
##$DIGMOD= 1
##$DIGTYP= 9
##$DL= (0..7)
0 120 120 120 120 120 120 120 
##$DP= (0..7)
150 150 150 150 150 150 150 150 
##$DP07= 0
##$DPNAME0= <>
##$DPNAME1= <>
##$DPNAME2= <>
##$DPNAME3= <>
##$DPNAME4= <>
##$DPNAME5= <>
##$DPNAME6= <>
##$DPNAME7= <>
##$DPOAL= (0..7)
0.5 0.5 0.5 0.5 0.5 0.5 0.5 0.5 
##$DPOFFS= (0..7)
0 0 0 0 0 0 0 0 
##$DQDMODE= 0
##$DR= 18
##$DS= 0
##$DSLIST= <SSSSSSSSSSSSSSS>
$$ [...]
##$SUBNAM2= <"">
##$SUBNAM3= <"">
##$SUBNAM4= <"">
##$SUBNAM5= <"">
##$SUBNAM6= <"">
##$SUBNAM7= <"">
##$SUBNAM8= <"">
##$SUBNAM9= <"">
##$SW= 20.0188882624521
##$SWIBOX= (0..15)
0 0 2 0 0 0 0 0 0 0 0 0 0 0 0 0 
##$SW_h= 4006.41025641026
##$TD= 16384
##$TD0= 1
##$TE= 0
##$TE2= 300
##$TE3= 300
##$TEG= 300
##$TL= (0..7)
0 120 120 120 120 120 120 120 
##$TP= (0..7)
150 150 150 150 150 150 150 150 
##$TP07= 0
##$TPNAME0= <>
##$TPNAME1= <>
##$TPNAME2= <>
##$TPNAME3= <>
##$TPNAME4= <>
##$TPNAME5= <>
##$TPNAME6= <>
##$TPNAME7= <>
##$TPOAL= (0..7)
0.5 0.5 0.5 0.5 0.5 0.5 0.5 0.5 
##$TPOFFS= (0..7)
0 0 0 0 0 0 0 0 
##$TUNHIN= 0
##$TUNHOUT= 0
##$TUNXOUT= 0
##$USERA1= <user>
##$USERA2= <user>
##$USERA3= <user>
##$USERA4= <user>
##$USERA5= <user>
##$V9= 5
##$VALIST= <valist>
##$VCLIST= <CCCCCCCCCCCCCCC>
##$VD= 0
##$VDLIST= <DDDDDDDDDDDDDDD>
##$VPLIST= <PPPPPPPPPPPPPPP>
##$VTLIST= <TTTTTTTTTTTTTTT>
##$WBST= 1024
##$WBSW= 4
##$XGAIN= (0..3)
0 0 0 0 
##$XL= 0
##$YL= 0
##$YMAX_a= 67157
##$YMIN_a= -91748
##$ZGOPTNS= <>
##$ZL1= 120
##$ZL2= 120
##$ZL3= 120
##$ZL4= 120
##$ABSF1= 10
##$ABSF2= 0
##$ABSG= 5
##$ABSL= 3
##$ALPHA= 0
##$AQORDER= 0
##$ASSFAC= 0
##$ASSFACI= 0
##$ASSFACX= 0
##$ASSWID= 0
##$AUNMP= <proc_1d>
##$AZFE= 0.1
##$AZFW= 0.1
##$BCFW= 1
##$BC_mod= 2
##$BYTORDP= 1
##$COROFFS= 0
##$CY= 11.3945322036743
##$DATMOD= 1
##$DC= 2
##$DFILT= <>
##$DTYPP= 0
##$F1P= 15.9154993809931
##$F2P= -4.1035820241983
##$FCOR= 0.5
##$FTSIZE= 0
##$FT_mod= 4
##$GAMMA= 1
##$GB= 0.15
##$INTBC= 1
##$INTSCL= 1
##$ISEN= 128
##$LB= 0.24
##$LEV0= 0
##$LPBIN= 0
##$MAXI= 10000
##$MC2= 0
##$MEAN= 0
##$ME_mod= 0
##$MI= 1.114404
##$NCOEF= 0
##$NC_proc= 0
##$NLEV= 6
##$NOISF1= 3.799351
##$NOISF2= 2.8
##$NSP= 1
##$NTH_PI= 0
##$NZP= 0
##$OFFSET= 15.70392
##$PC= 1
##$PHC0= -11918.09
##$PHC1= 12.60099
##$PH_mod= 1
##$PKNL= yes
##$PPARMOD= 0
##$PSCAL= 0
##$PSIGN= 0
##$REVERSE= no
##$SF= 200.130013532006
##$SI= 16384
##$SIGF1= 3
##$SIGF2= 2
##$SINO= 400
##$SIOLD= 16384
##$SREGLST= <1H.CDCl3>
##$SSB= 0
##$STSI= 0
##$STSR= 0
##$SW_p= 3612.71676300578
##$SYMM= 0
##$S_DEV= 0
##$TDeff= 0
##$TDoff= 0
##$TI= <>
##$TILT= no
##$TM1= 0
##$TM2= 0
##$TOPLEV= 0
##$USERP1= <user>
##$USERP2= <user>
##$USERP3= <user>
##$USERP4= <user>
##$USERP5= <user>
##$WDW= 1
##$XDIM= 8192
##$YMAX_p= 0
##$YMIN_p= 0
$$ End of Bruker specific parameters
$$ ---------------------------------
##NTUPLES= NMR FID
##VAR_NAME=  TIME,          FID/REAL,        FID/IMAG
##SYMBOL=    X,             R,               I
##VAR_TYPE=  INDEPENDENT,   DEPENDENT,       DEPENDENT
##VAR_FORM=  AFFN,          ASDF,            ASDF
##VAR_DIM=   8192,          8192,            8192
##UNITS=     SECONDS,       ARBITRARY UNITS, ARBITRARY UNITS
##FACTOR=    0.0002496,     1,               1
##FIRST=     0,             0,               0
##LAST=      2.0444736,     0,               0
##MIN=       0,             -91748,          0
##MAX=       2.0444736,     67157,           0
$$ Real data points
##PAGE= N=1
##DATA TABLE= (X++(R..R)), XYDATA
$$ [...]
1842C05N45l24l74o64n2r2Q22Q12k83n03o14m84K37R48N95k32k87r06l01L75N61
1863H4M28J39l82o04l99J43M83O29K94m71n87l65l5M49Q77Q3k85m21p05j37O31
1884a51O42K34k83l97q22n3O05P01K17n4m37o53j20K83M54N75k23m27n15k69J50
1905e43O72M75J03n20n21m53J32R08K30M27o65p01l24M11M27M20K65m12q44j2
1925e25o8N19O12J6l83k88m35k66O94N33J31q8o52l21m1N19M76K04k71m69l56
1946d59l72O41M11L94k29m40n34L6K82O44K45p8p98k08j03L17M27M43j46l69l41
1967b37m43J67M97M74J80l20q11r7L0L93O27K92p76l77j06J5M38P45k66r9l69
1988d3n59J69N57L81J45j47p34n66J46L94Q18L37m97l13n43j88M47N03K43m5n08
$$ plain form
1842 305 850 526 152 -512 -564 -656 166 978 695 192 -422 -906 -669 279 874 642 355 -551 -852 -477 84
1863 84 512 651 269 -335 -734 -591 -108 521 815 344 -243 -608 -643 -194 683 766 481 60 -645 -782 -151
1884 -151 491 725 442 45 -777 -830 -225 476 693 639 202 -451 -571 -288 166 741 518 91 -424 -693 -543
1905 -543 129 604 707 187 -334 -787 -655 253 483 910 245 -456 -780 -369 58 478 743 331 -513 -525
1925 -525 -593 -74 538 554 171 -117 -552 -818 -124 409 540 452 -200 -521 -562 -43 433 637 366 -103 -459
1946 -459 -831 -190 221 615 386 -54 -588 -552 -270 374 619 541 -257 -465 -568 -251 176 619 473 104 -237
1967 -237 -680 -513 -16 458 638 318 -493 -590 -560 -167 460 752 -24 -401 -507 -492 -54 691 425 326 -43
1988 -43 -602 -433 124 505 650 503 -231 -797 -651 -257 561 898 401 88 -455 -643 -196 307 550 505 -3
2009cl91j81K82N86L12j5n95m60j09J62P93J67M3m32o92j28K17N60M79L0k51p71
2031c97l57L55N17M86J08n30l94k47q2O28M95P3l15n05m40J62M99L53M11m27o39
2052b46l39J90J67O00K31k87l91l86k49O11O24J8p4n71n29r1O43K80L19po48m30
2074e65K04o6P38K38k17k51m62j73M08L26J05L58o17q1l78L14J72N03j63j78n93
2095c78j89K04M33M18mj29o23j85Q4M00L49K47m12n23l31J88L03N32K49l79m08
2116a54l90j15N83M61J68j95l97o11J0M35M49L98k95m18l41J76l2M52M79l03l15
2137D5m75m2K73N59K00j96k40o58J07K2N40K79m0j54l23n32K04N35L08J12l37
2158A87m67m25L60K23O54Nl91l60l84L49J62M92K22l60j82o24Q3M88M08L5j44
$$ plain form
2009 -3 -394 -575 -293 293 605 590 -5 -465 -574 -412 381 548 591 159 -533 -661 -444 116 595 625 374 -397
2031 -397 -754 -399 118 604 712 182 -212 -459 -541 87 582 655 340 -165 -605 -443 56 409 820 393 -246
2052 -246 -585 -395 -228 372 603 316 -75 -461 -710 -99 525 543 469 -102 -631 -722 -79 201 520 513 -135 -565
2074 -565 -361 -427 311 549 332 81 -381 -554 -146 180 285 643 26 -55 -433 -119 53 556 393 215 -378
2095 -378 -567 -363 70 488 484 355 -268 -453 -369 31 380 627 215 -308 -639 -451 -148 384 633 254 -154
2116 -154 -544 -659 -76 385 553 358 -39 -650 -640 -205 244 642 347 -71 -412 -236 -268 184 663 360 45
2137 45 -430 -472 -199 360 560 364 124 -534 -427 -405 135 414 374 220 -103 -635 -431 104 412 524 187
2158 187 -280 -705 -345 -122 532 537 146 -214 -598 -249 -87 405 627 267 85 -539 -456 32 440 475 331
2179C31l54n27M7L49L91K98l9n07l38j63K02O00K92j71m90k01k89M45M74Q7j02
2200C35j86m66k23J35O96K42j70m29k75j42K92M62J92R1m60m49j18J13L65O05
2220F10j3m47m34l05N3M97M45N3l30k36l46L5M21L01K36j96m72k88J2K80N11K33
2242F20j52n74l93J15K29M42L55k58l32m68j1K01N93N6k59j18m80k19O27J89K35
2263C98L6n26l38M8Q7L44L69M7l94l67j68JN25M47ql58m52j63M0O37K72l1j38
2286C08n48l34L17L90J76K71l83k82m16R6J28O95J95m13l51j88j73M49M02j1p5
2307B53k65m98o8M37M02J95N1n97l10k44L85M27M20Jn07o06J10N2M55M42j26k89
2329A20m76k18K19N51J97M3k55m06n20N48M35L11O5k93o53j86K30L64L34R2k85
$$ plain form
2179 331 -23 -550 -503 -154 237 535 496 -11 -349 -512 -310 290 582 411 -79 -280 -569 -124 350 437 335
2200 335 149 -317 -540 -405 291 533 363 -66 -341 -483 -191 271 463 554 94 -355 -473 -360 5 610
2220 610 597 150 -284 -589 -536 -39 406 459 129 -107 -453 -418 3 304 540 344 -128 -416 -404 -124 387 620
2242 620 468 -106 -499 -384 -155 287 642 384 52 -416 -427 -226 367 423 164 46 -434 -653 -26 163 398
2263 398 434 -92 -430 -382 -295 49 418 465 71 -296 -464 -463 62 509 501 143 -309 -472 -432 205 477 446 308
2286 308 -240 -574 -257 133 309 580 197 -85 -501 -405 -277 418 613 200 -151 -339 -512 -63 339 328 253
2307 253 -12 -510 -578 -141 261 456 507 -90 -400 -644 -259 168 588 589 82 -524 -414 -362 93 535 409 120
2329 120 -356 -574 -355 196 393 436 181 -225 -745 -197 238 549 614 321 -332 -518 -288 76 410 502 217
2350B17o19j7n2K93O31O3l00j73m84j43M45N29J01j81l25o58R6N80J80L82j41
2371D24n00m73J43K36K85M33k65k50k58l55K50N22L69r6k17n16j33J08N30Q5J64
2392D86l62m21j91K52K61M41J94n81m32l10K45M22N38k8n47j78k76J97K13N45
2412D68O6k50l87k91q6M27K62K11K6p67j10K62J54L65J55q3n60m13L3L08M60K63
2434E13k11j67m09j58K79N48J38l0k71o41j25L75J03M99K8k44m65k95K64L16M32
2455D79l2l22m56k46J84N85J76J33l73l15l14J84K02N41J5j54k75p33L30L93K52
2476B54K23pn65m20K28K55L76L19m06m23j50r8J38O99O4K1n34m15l3M16M87J23
2498E52%m44l63k67L03L57K85l9k14o01L1L7K21O03K8m82k96j84K10L73K88o6
$$ plain form
2350 217 -402 -419 -471 -178 453 516 216 43 -441 -584 -139 390 491 310 -15 -673 -577 3 183 565 424
2371 424 -76 -549 -406 -170 115 548 283 33 -225 -580 -330 192 561 465 248 -268 -401 -293 237 322 486
2392 486 124 -297 -488 -236 25 466 660 79 -353 -663 -418 4 542 514 -33 -211 -487 -290 -77 468
2412 468 534 284 -103 -394 -480 -53 209 420 446 -321 -431 -169 -15 350 505 422 -138 -551 -518 -210 250 513
2434 513 302 135 -274 -432 -153 395 533 503 232 -409 -534 -159 -56 443 471 227 -238 -533 -269 47 479
2455 479 447 125 -331 -577 -393 192 368 501 128 -187 -501 -317 -115 426 441 287 12 -721 -391 2 254
2476 254 477 470 -95 -515 -287 -32 344 663 257 -166 -316 -414 -276 423 487 508 -26 -441 -474 -58 429 552
2498 552 552 108 -255 -522 -219 138 423 384 170 -431 -400 -363 -142 461 489 7 -289 -473 -263 110 398 332
2520C32k05l48j37N0K81N39J9k78m64l13K6M59K55L31j98p44j19K3L46O19R4k14
2542C54n99q5k25L10N66J24k40l08l33qK38M33L25o8l00o38oM3N53L34j29k88
2564E3k92k54L2O21L32j19k22n28p4K40L85J85J11m03k06l36J7K97N23J84k85
2585B61n32k55J31L27L66L04l78l77k11N4K72J60L54j81l48j52k61K24L90K32
2605C80P2n10l23j4K68L66K16q8l27m32k12K92N55K84j51l89k62l56K70K90N20
2626D49O0m54k21k73J17K75L53J65m14l59k26J39M86N10L3m49k84n74L63K94K46
2647B36L17l78j92m44k9M34L12K88j50n14l29J28J95K93N04k57l45m93j48M32
2667a40L40K26J04n97l00j40J60M94M40k51k47l05j76J22M23L56Pl13n27k95M29
$$ plain form
2520 332 127 -221 -358 -308 -27 512 531 253 -211 -524 -498 -39 216 547 349 -395 -514 -491 -145 474 568 354
2542 354 -245 -330 -555 -245 321 445 205 -103 -436 -444 -206 227 552 484 184 -454 -460 -417 136 470 341 53
2564 53 -239 -493 -461 160 492 373 151 -377 -451 -211 174 359 470 67 -139 -475 -458 -161 362 546 261
2585 261 -271 -526 -395 -68 298 602 224 -153 -364 -310 -38 122 476 295 -53 -205 -466 -242 148 380
2605 380 452 -58 -381 -395 -127 239 455 367 40 -392 -604 -312 243 527 376 -13 -275 -631 -361 -71 449
2626 449 509 55 -166 -439 -322 -47 306 471 57 -302 -528 -389 97 607 640 191 -93 -667 -304 -10 236
2647 236 553 175 -17 -461 -490 -56 256 544 394 -120 -449 -321 -126 167 671 414 69 -424 -572 -140
2667 -140 200 426 530 -67 -367 -507 -347 147 587 336 89 -216 -392 -270 153 509 516 203 -324 -619 -190
2688a90L61L76k13k71k75k50o4N04L59K13r3n84l18o6O06L35l2l89k80k35j11
2709f17N46L48K29j59m01m42L20J63J63K85j60j50n23j54M07M60J57j67k34l19
2729b48m02L82N17K93p3l63m06k06O5O21M39j90l01m54j00l6N53M50k00l19j51
2750a29m89K30L61L72K42l25n11l38J64L98N25j17Mm73l59P9L03L14L76l26m39
2771a38k40J04P1N07L44n17j22n51J9L83L98L00k63q7p04J5L76K67L53Jl82n33
2793c99J9J86J06O64r9k85l11l32k3M18L20J80l19k98l25J04M19M60J7l13k89
2814a00k52m9K77M49J26j35m78k23K1J88L98K86l28l13j35k18L37L19K96j63k60
2835D3n97P3M74Q1N19l13j14n93k13M28L69L29p8n14k70k6P5L86N83j76n46k35
$$ plain form
2688 -190 171 547 334 63 -212 -462 -526 -22 337 550 457 -127 -445 -511 95 430 398 9 -271 -506 -617
2709 -617 -71 277 506 347 -54 -496 -176 -13 150 435 275 125 -398 -552 -145 315 472 305 71 -248
2729 -248 -650 -268 249 542 469 106 -300 -506 -441 180 619 429 128 -326 -426 -462 91 541 341 22 -129
2750 -129 -618 -388 -27 345 587 262 -249 -587 -423 -25 500 383 387 -86 -445 -366 -63 251 627 301 -138
2771 -138 -378 -274 -203 304 648 131 9 -542 -523 -140 258 558 295 208 -496 -481 -105 162 515 516 134 -399
2793 -399 -380 -194 -88 576 477 192 -119 -451 -474 -56 264 444 125 -173 -498 -394 25 485 502 189 -100
2814 -100 -352 -401 -124 325 451 316 -162 -385 -364 -176 222 508 180 -133 -268 -486 -149 170 466 303 43
2835 43 -554 -481 -7 74 593 280 166 -427 -640 -212 157 486 408 -106 -376 -402 -327 59 642 466 -80 -315
2857c15j85L07L82R4M5j00l94j24n7M99K28r1k1n39j24J75K49L23J97l03n25k92
2879e71K09L36L54J07k13l18k44j57M41L67K7N3j66o35j11K81M91K42l8m78k64
2900b87k3R9N18K66j74k81l40k14J06L59N92j59m98j98j89J91L16L81n8k54l49
2921a96l19J45L99J90K36k45m83j77J42K40M60N5k30l71k45oJ54M47K08j52k97
2942d5k13j73L57M14J92j65l59m07L0L07K48K45P7o06k63J62o0M71L50j00n65
2963a03%m14J44M68K66J05m02k08l21j2O85L00k01m6k54l73J7L52L54R8k73m50
2985b68k37O9K82M27J83k97l68l36K91L05K30P0j30l37k77qK62L52K29p1l45m52
3007d26N3K81L01J29N3l88k02k35K85L51K86j28k67l42k76K82N88J27o7l39k29
$$ plain form
2857 -315 -500 -193 189 283 328 228 -166 -290 -347 152 380 289 268 -271 -395 -220 29 352 549 246 -279 -571
2879 -571 -362 -26 328 435 222 -96 -340 -497 -56 311 338 391 225 -410 -521 -240 251 493 455 -23 -287
2900 -287 -310 -211 307 573 399 118 -222 -436 -330 29 621 462 -36 -234 -423 -232 84 465 407 153 -196
2921 -196 -515 -370 29 219 455 210 -273 -450 -308 -68 392 447 217 -154 -399 -405 -251 196 404 252 -45
2942 -45 -258 -431 -74 340 532 367 8 -399 -369 -62 186 431 508 -98 -361 -199 -259 212 562 462 -103
2963 -103 -103 -517 -373 95 361 466 64 -144 -465 -477 208 508 307 261 7 -366 -349 3 357 455 182 -268
2985 -268 -505 -436 -154 273 456 159 -209 -545 -254 51 281 351 221 -116 -393 -401 -139 213 442 371 26 -426
3007 -426 -373 -92 209 338 391 3 -199 -434 -149 202 488 360 93 -249 -525 -243 345 472 405 66 -163
3028a63k52J80L63L21P1l81k26k92M7K84L03J76k65k48k56j05M48L19K14k13l95
3049g0m74J08L66M17o9%m77j88J04K55L09J77j30m30j13k78L32K78K79J9l66l77
3071c28j45K37M26K39k1l88l49j55J31N12Q6M7q6l93r5mM15J84K9l5n04k83K90
3094a90L26J16O7k4m03j49j86L00N82P4l00l02k83Q2K97L37M9j60l37j63j55L57
3116f5K64J70l1m51j72q9L24K44K13rl33n39L3K61K76L30k9j70m41j33O2M24J89
3139C28n2j84l14k35K10K71L38O3k49m24j86K27J74N09j01j76k47m03j50N41L02
3160B42J15j72k26k29j02K10L67K72k17k28l92j27M15K52K01j09k65m27q4L91
3180a13J77L95j87k46m17L0K79M22J15n5l19l74q3K66K78J05oj52m61j77K72J39
$$ plain form
3028 -163 -415 -235 128 449 520 139 -87 -379 -332 -48 255 431 166 -82 -338 -443 5 324 538 325 -70
3049 -70 -544 -436 -70 347 278 278 -199 -387 -283 -28 281 458 328 -102 -215 -493 -161 117 396 415 49 -328
3071 -328 -473 -236 190 429 408 20 -329 -484 -353 159 245 292 206 -187 -282 -286 129 313 342 307 -197 -480 -190
3094 -190 136 252 319 295 -108 -257 -443 -143 439 513 213 -89 -372 -290 7 344 393 233 -104 -267 -422 -65
3116 -65 199 369 338 -113 -285 -374 -50 194 407 398 65 -474 -441 -180 96 426 397 227 -214 -347 -285 139 328
3139 328 276 92 -222 -457 -247 24 362 425 176 -248 -434 -207 -33 476 375 199 -48 -451 -601 -60 242
3160 242 357 185 -41 -270 -372 -162 205 477 260 32 -360 -487 -72 180 381 272 7 -420 -504 -113
3180 -113 64 459 272 26 -391 -361 -82 340 455 400 81 -293 -376 -110 168 273 267 115 -346 -523 -251 -112
3202a12M00Q7k74k63l57K32K91K65j17p1j92l22K91J22K90L13n25k90p2l7L29
3223a2L13Q7k9n89j71K19K27K32J23N7m45l00k8J59K79J95O8n29j47l8K03N25
3245C99P6j31l10k56j24R4L94K40m5l19j45j78J0M67R2Q6k53l10j06Q5K41J94
3267B01K28k21k83l65K83l2M82K23j15l76n68K58K6M77K02l1n10j35j97K78M94
3288C19p5j9l43k7l18L92K05K38L8l60m64q2L05J90K36J53k12l47j9nJ12M81j48
3311B50j23l77j15K07K12K35O6j51l33j78p7L74J92K72k69m83q0J47J38J48L88
3332D43k73l52j07%K41K60K21k16j96m64p2M01L73p5O9m36r2j07M2N34J87N5l74
3355F2j96k11K06K50K03J0k53k75j42R1L05K93q6j00l22l91L19L20K75M6j91m70
$$ plain form
3202 -112 288 375 101 -162 -519 -287 4 269 152 81 -111 -433 -142 -20 270 583 58 -232 -304 -341 -12
3223 -12 301 388 359 -230 -401 -182 45 277 400 457 12 -288 -316 -157 122 317 385 -144 -291 -329 -126 399
3245 399 475 344 34 -222 -346 -252 142 382 337 18 -127 -305 -295 172 264 350 97 -213 -319 -234 7 201
3267 201 429 208 -75 -440 -157 -189 293 516 401 25 -543 -285 -259 218 420 389 -121 -256 -453 -175 319
3288 319 244 225 -118 -145 -463 -71 134 372 410 50 -414 -496 -191 -1 235 388 176 -171 -190 -195 -83 398 250
3311 250 127 -250 -365 -158 54 289 355 204 -129 -307 -384 -10 182 454 185 -298 -378 -231 -93 55 443
3332 443 170 -182 -289 -289 -48 212 433 217 21 -443 -515 -114 259 184 253 -183 -275 -382 -340 194 381 436 62
3355 62 -134 -345 -139 111 314 324 71 -204 -346 -255 50 343 257 157 -165 -556 -237 83 358 404 213 -257
3377b57j99N1K94M25N4j31n22L6J01K6M42O0j19m27M3q1J68J57K32j30k71l07
3399c55J35K82O8K06L8m07k63j13J27M07K08J0l11k57q6L6N22m3l7j29j66l62
3421d90K32L99K34M0k34m63q4P8K61K96J73j73o13Pq0K60K79K14j92k15l43J55
3443b59J30L05K41k18j38l76K0K59J76K49j64j94m17k4M75j03L20j49k51j2k61
3464c91N2M81J48r6jk59k94L93Q6J19nl29p3k46K55K04M03Rk90l95j2Q2K83J55
3488B79l3j83j52k00r0L48J98J94p1n46m3q2M60J92O3j84k52m04J98Q2L94M7p5
3511A40k19l28R5J62L97N8J0l07j11k97K78J27K78J40l22k78k46J94L58K04L5
3532C68l30l70O1J09K14J67Q5k41k35j87O5K47L97k40K27l47n88K78K94K67J13
$$ plain form
3377 -257 -456 -405 -111 314 368 237 -285 -249 -148 -122 320 380 261 -166 -123 -204 -36 121 353 223 -48 -355
3399 -355 -220 62 130 336 374 -33 -296 -409 -282 125 333 343 32 -225 -311 -275 247 204 167 38 -128 -490
3421 -490 -258 141 375 415 181 -282 -366 -288 -27 269 442 269 -344 -337 -417 -157 122 336 144 -71 -414 -259
3443 -259 -129 176 417 199 61 -315 -295 -36 140 389 225 31 -386 -410 65 -38 282 133 -118 -130 -391
3464 -391 -339 142 290 194 193 -66 -360 33 119 238 233 -96 -169 -415 -160 44 447 456 166 -229 -241 -159 124 279
3488 279 246 63 -89 -289 -379 -31 167 361 290 -256 -299 -381 79 271 334 150 -102 -506 -308 -226 168 215 140
3511 140 -79 -407 -312 -150 247 305 315 8 -103 -400 -122 5 283 423 101 -177 -423 -229 129 333 368
3532 368 38 -332 -271 -162 52 219 304 63 -172 -359 -294 -47 350 110 337 -10 -598 -320 -26 241 354
3553C54k10j78j65q0L66K20l4j04k63k56O8J93L78L8J1k01l80J7O0L41Q3jk07
3576E0m5l08L27K09r2J84j93m86LJ74L75P9J51n35j83K0M0J81L11K9n5m72j75
3599d11J76K82J69n3r1l09J5O3J91K92N7j80j98m15R3J07N13J53l13j41o9r5j31
3622b95M56J11o5l17k06JK36L39J16j94k01r3k78K68K11N3K69m73l05N2O8M41
3644A94J42Kk86l18j39K68K33P2K91m05k29k29J27K46L71J20k41m90J71j02J11
3665i1Q0L25k03k33j97J30J24K22J87Jn11j25l2J82L78M8p3k02k90J65J04K24
3687B13J52k18n0m32O0J30J93L02j38j58l61j1J95K73J83J47k91m22r8Q9L39J89
3709B86p2q0k90k70R0K42N02j74o7l44k8L4K02K74J00j15m03r3p3K32J80J61j31
$$ plain form
3553 354 144 -34 -199 -279 87 307 273 169 -94 -350 -282 -89 289 327 338 137 -243 -226 -166 175 258 257 50
3576 50 5 -303 24 233 141 325 132 -354 -351 -177 198 277 428 -107 -290 -270 -230 -49 262 291 236 -236 -411
3599 -411 -235 47 216 163 72 -237 -222 -159 32 324 381 201 3 -412 -319 -212 301 454 141 0 -69 -164 -295
3622 -295 161 272 207 -110 -316 -315 -79 260 376 182 -19 -112 -390 -122 89 142 411 -62 -367 -315 -247 194
3644 194 336 338 52 -266 -405 -137 96 168 459 54 -175 -404 -277 -31 340 460 219 -271 -100 -202 -91
3665 -91 -11 314 111 -122 -319 -189 -65 157 344 345 -166 -291 -323 -141 237 285 212 10 -280 -115 -11 213
3687 213 365 147 97 -335 -275 -145 48 350 212 54 -307 -318 -123 150 333 480 189 -233 -331 -242 97 286
3709 286 214 134 -156 -426 -336 -94 408 234 167 -177 -205 -171 31 305 405 290 -113 -206 -279 -47 133 294 163
3732A63k44j62L6P1L38K02J22m94l78R0J19L32J97J32m25m40R3P0K91J93n3k44
3754Ik24j65N3K14L64Q0j80l01j94K14J11K28J43j83l93N5o4J99L75M4k44k39
3776i8j63O6K19M67r8k27m58M5J5O0K81K61j67l35k25n9L60J81K43l84j7j35j68
3799c36J35K71K87j48n2m68m3J06N28O5j16k10m04K9K64L26lN7l37l52L5K72J26
3822C2K97m7m7j63k84q0K93L18N1k52k11m7k59K99L56P2j78j64n36K74L14Q8J48
3845B74k4k36k86p8K50K47J86P5o10j61J17LL82J27l7k87j08l05K66K54M00j42
3867C07k07m21PrN15P6R8j89m31q7K6L52J82Q9k35o3l84J93J39K59l4j32l80P9
3891b50lJ68K15M0M3k03l06r7M86J12N7l2k37j63j2J88O7K61l3l13p1j86J00L36
$$ plain form
3732 163 -81 -243 -207 -136 202 404 526 32 -346 -256 -137 195 392 524 99 -341 -248 -178 113 306 253 9
3754 9 -215 -380 -327 -113 251 331 151 -150 -344 -130 -19 209 352 169 -224 -169 -233 -34 341 385 141 -98
3776 -98 -261 -195 24 491 393 166 -292 -247 -232 -172 109 370 203 -132 -357 -416 -56 125 368 -16 -33 -168 -336
3799 -336 -201 70 357 209 157 -311 -354 -248 280 345 229 19 -385 -356 -92 234 231 288 -49 -401 -366 -94 32
3822 32 329 282 235 72 -212 -292 1 319 370 118 -93 -140 -399 -100 256 328 150 -14 -550 -276 38 126 274
3845 274 250 14 -272 -350 -100 147 333 408 -202 -363 -246 -243 139 266 229 -58 -166 -471 -205 49 449 307
3867 307 100 -321 -314 -323 192 268 366 177 -254 -341 -315 37 219 308 73 10 -374 -181 -42 217 183 51 -329 -250
3891 -250 -253 -85 130 170 213 10 -296 -393 93 205 262 230 -7 -170 -182 6 73 334 301 -12 -83 -269 -169 167
3915A67J68o1j47l93j12L9L55L77l1l85k35M7P7L57l7J58k87l06l7l5L25J68M7
3938B19J0n61m0j9M23L44j16j56k49j23l4K15L12J04k57j61k13n9K01L33K20k12
3960A81m05o9LJ35J91J73P6j94k12j98Q8K25K31k49K4j66m8J4L07J12Q9k46j89
3983a27k56K75K39J90r4q9q8l44R9K14J77O2k98k07J5j56J74L73ojm3m16N1M8
4007b08L23J07M2m87J9r2K20K26m1pk52j9p1J67J39J68o5q8j85j41J46K89K73
4030D63k79r9m50K30p5L73J52m1k44j51p7J41J3K98Q2k41j52k28J95J17K60j4
4052B73j57k29j59J0K31L03M1j57k72l53L22RL63O7r3j92j61k01K12M47J84m25
4074F3j15k84O2K12J11J90j09l5m35l8L28J73O0k3o4l22p9ML76O3J19j79j75m8
$$ plain form
3915 167 335 274 127 -266 -378 -339 16 393 362 -23 -258 -211 -134 223 186 344 57 -249 -286 -321 4 172 219
3938 219 229 -332 -372 -391 32 376 260 104 -145 -268 -302 -87 225 329 72 -89 -302 -361 -160 173 393 181
3960 181 -224 -293 -290 -155 36 209 285 91 -121 -319 -231 -6 225 -24 0 -166 -214 -200 107 219 308 62 -127
3983 -127 -383 -108 131 321 227 138 50 -294 -195 19 196 258 -40 -247 -232 -388 -214 159 153 152 109 -307 -256 -208
4007 -208 115 222 264 -223 -204 -296 -76 150 109 102 -150 -169 -240 -73 66 234 169 81 -104 -245 -99 190 463
4030 463 184 85 -365 -135 -210 163 315 274 30 -121 -198 -57 -44 254 336 95 -57 -285 -90 27 287 273
4052 273 116 -113 -272 -262 -31 272 313 156 -116 -469 -147 -138 225 292 199 7 -154 -355 -143 304 488 63
4074 63 -52 -336 -274 -62 49 239 130 95 -340 -378 -50 123 183 160 96 -226 -305 -301 75 138 257 78 -97 -145
4098a45j2L57j16L35l59j46j11J50j7L62k8j24j24l78J1K25K61Q6k18k13%q3J74
4121a13J93J61M2k79j87k5P7K80K61j13k35l41p6L08K8K32m3j18j22j04J79N2
4143E7J29R3k22k79O9m0K13L66j37l20k03j08J47L32p7J59p5j85n2m5M4L85K7
4166B78k29j8j64M7J95R7J42j30j59k63rK96J14M0m2j34l99P5J82L13J29Q2l79
4189F4k97m5J77J45K22j31j22j27l20K65L13J8Q8k28l00j0L26LK7K89k80j17j67
4212b07n6L84O9j10J7k40j60J19O5L94n2j01k17j07m0J52J64J52m3j90j88k4J38
4235h1L94j36j6k22r6Q6R5J89Q6q6j49k56q4K22L28j3k03J16k95l09J49L25K50
4258B94K1k03k65j7L3J77J22J78k02j89K6k20K76J53R9j09l81k8L3J59O5L88l04
$$ plain form
4098 -145 -157 200 84 419 60 -86 -197 -47 -64 298 270 146 22 -356 -345 -120 141 227 9 -204 -204 -287 -113
4121 -113 80 241 283 4 -183 -208 -131 149 410 297 62 -279 -355 -47 -19 213 170 52 -70 -174 5 57
4143 57 186 279 57 -222 -153 -193 20 386 249 -71 -274 -382 -235 97 20 179 104 -81 -133 -178 -134 251 278
4166 278 49 31 -133 -86 109 206 348 218 59 -204 -213 83 197 237 195 61 -338 -263 -81 232 361 443 64
4189 64 -233 -278 -101 44 266 135 13 -114 -434 -169 144 162 250 22 -278 -288 38 41 68 357 77 -40 -207
4212 -207 -263 121 190 80 97 -143 -303 -184 -119 275 223 122 -95 -202 -242 -90 74 226 183 -7 -195 -219 -81
4235 -81 313 177 161 -61 -157 -71 24 213 299 213 64 -192 -276 -54 274 261 58 174 -121 -430 -281 44 294
4258 294 315 112 -153 -170 -137 40 162 340 138 -51 -25 -245 31 184 283 174 -207 -235 -202 -43 22 410 106
4281A06k37j27P5J99J66J16m9k88k07J4J90J66J31j05k07n7j7J16J43O3o6l2l41
4304b48N4J10K3R6J69k77M0j30k0K51Q4m1P1m25J1J47J05K07j07j28r5rq5R6L22
4329B21Q0j61k75j47K09J19K31J07k50p9l04Q8J39K73L4m8l36k72L51o0J46J44
4351B10r4j36k06n2N9K71L11k07j66k20j10J65K96N2J95k88k69j38J81J94K09
4372B57j58j99J25k53J37J33J49o5k6j33Qj89K98J47J92l39j07l68J93K22J28
4393A52K60m55m1j59J04J20K30nm8m9l68OK45J09R1k1k99M1n3k7N8M17n3j49k71
4418a65m5Q6L06j53k8l8j33J34r0J69J14O6n2l49k7M6J72M8M5j29k06J40l04M56
4442F3J9J26j61N1j81j36N2K59J12O2l60o8KJ51Q6K49k50p3l40K87QJ6K69n1j12
$$ plain form
4281 106 -131 -258 -183 16 182 298 249 -39 -246 -232 -42 124 255 150 -57 -114 -131 -15 128 191 125 93 -248
4304 -248 -194 -84 -61 35 204 -73 -33 -163 -183 68 152 111 182 -243 -232 -85 20 227 120 -8 -103 -112 -197 -101 221
4329 221 301 140 -135 -282 -73 46 277 384 134 55 -249 -161 -22 251 285 237 -99 -371 -20 -80 66 210
4351 210 116 -20 -226 -278 -219 52 363 156 -10 -230 -340 -175 121 173 368 80 -189 -327 -146 48 257
4372 257 99 -100 25 -228 -91 42 191 126 100 -33 -25 -214 84 231 423 84 -23 -391 -198 24 152
4393 152 412 -43 -84 -243 -139 -19 211 206 158 109 -259 -253 -8 101 192 171 -128 -87 -140 -167 -109 308 255 106 -165
4418 -165 -210 -124 182 29 1 -37 -170 -36 -126 43 157 223 171 -178 -205 -159 13 61 106 -23 -229 -89 -393 63
4442 63 82 208 47 98 -83 -219 -167 92 204 266 -94 -162 -160 -9 77 326 76 3 -337 -50 -42 -26 243 192 80
4467H0l18N9N6K39m4J33o2m6l93P9L00k4K28j25m27L0%L76j02K49l71m2J01j47
4491a71K13O8r9P6k95m8Q0K30o9M15l40l40J85n6J41R3K39l09p6l07Q9R7L02L31
4515D49m63o2m1j34L31J40j6Q7l60j40k2M7K98K5K95n32pr8J76L9J7J31j12k22
4539a74p9J42J38J22J7j07j96j0p5J97k1J63k4j70j51M7J63K35p0k7k07n8l1L16
4563A40j14K18p3q8k03L2p8L00J32j27m1k20R4M6K39j52oq3j60j5N2Q8K99k05
4587G5J3j38j74J4K32R2J42k24k63Q6P7Q0K05o7K7j76k15QP0L15J40l4l36k2q3
4612a56J54J78J10j07j60k9k05J28L52j33L5j40k66K2K27K40j72p3J5k60M2J04
4634i4J95kL5n3j67j18R8J07J47l1j00k36J03j72K58L52j79o7j00k22mJ56L05
$$ plain form
4467 80 -238 -179 -123 116 72 205 143 97 -296 -217 83 59 287 162 -265 -235 -235 141 39 288 -83 -125 -24 -171
4491 -171 42 110 11 87 -208 -256 -176 54 -15 400 60 -280 -95 -151 -10 83 322 13 -63 -370 -281 -184 118 449
4515 449 -14 -76 -117 -251 80 220 204 291 -69 -209 -231 -184 114 139 434 -98 -105 -203 -27 12 29 160 48 -174
4539 -174 -253 -111 27 149 166 59 -137 -147 -222 -25 -46 117 93 -77 -228 -181 -18 217 147 120 -87 -145 -176 140
4563 140 26 244 171 83 -120 -88 -166 134 266 139 98 -122 -28 18 257 105 99 16 -144 -159 -107 -19 280 75
4587 75 88 -50 -224 -210 22 114 256 32 -231 -145 -68 12 217 150 177 1 -214 -206 -136 179 319 285 -51 -73 -156
4612 -156 -2 176 286 179 19 -10 -215 -87 265 132 167 27 -239 -217 10 250 78 5 20 -240 -198 -94
4634 -94 101 99 134 81 -86 -204 -106 1 148 117 17 -219 -116 -288 -30 322 143 76 -24 -246 -250 -94 211
4657B11lk7k14r8Q4MJ95o2Lk08l4P2J12K20k4k1l28J11j14P8J31J04j14j60n0
4682a32j00J83J46J59%l57j49N7J87J78pP7k83k63J10P5J56j3K89n28J52k14K66
4705a1J0J23K02j47j94k14p8J89J90K67k90j47n8N4J28Q3J25P5l67r1J22%K25
4728A96J39O4m43j94J0L33rK17j30j47j89K1m4K02O8P1j48r9J1j64J18K52m0j44
4752d9j33r7J84N6J99Mj32j34o5O6L29k04K48j48j67l06L00J25J83j64J8k18P
4775i8j94K28J05R8q5k00L3kJK66j66J50q5l71N3nL56J4Q7k5m12J5N6M57k42Q3
4801A17k2m18m4L33J32n2J21o6j65k09J30K24N4R1j34l20Q6K8J21J09Q5l8j84
4824b1j12l0R9J42J51j4j88j75j72K00J28J78j16j43p4Q2j9P6J94j28r7j88L3
$$ plain form
4657 211 208 181 -33 -131 -47 -43 152 90 93 -115 -149 -77 35 255 231 210 -118 -7 -121 -43 88 192 78 -82 -132
4682 -132 -232 -49 97 256 256 -101 -250 -193 -6 172 165 242 -41 -304 -194 -119 37 24 313 -215 -63 -277 -11
4705 -11 -1 122 324 177 -17 -231 -309 -120 70 337 47 -100 -158 -104 24 107 232 307 -60 -151 -29 -29 196
4728 196 335 399 -44 -238 -228 105 96 313 183 36 -153 -132 -176 26 94 165 17 -82 -71 -235 -117 135 95 -49
4752 -49 -182 -279 -95 -39 160 164 32 -102 -167 -101 228 24 272 124 -43 -349 -49 76 259 95 113 -105 -98
4775 -98 -292 -64 41 139 54 -146 -113 -115 -114 152 -14 136 51 -320 -267 -272 84 98 185 160 -252 -237 -181 276 34 117
4801 117 95 -323 -367 -34 98 46 167 101 -64 -273 -143 81 135 226 92 -228 -142 -114 7 116 201 163 -21
4824 -21 -133 -163 -64 78 229 215 27 -148 -320 -120 8 186 70 -73 -147 -65 -84 -8 186 58 -39 -227 -194
4847a94K57J36k54J90o5k52J37r1J86K10j39j85p4J07M7J34P7j03r9J2k94J98
4869e9L0J64O6q3q4k13n5M19N1k5q1l47pqK89Q4m0kP8l55J69o4J28K91r6l12n2
4896a14k9K28J48K3j8l33k28N1J47J72J83r2j07j64j7M7R2K16L2k86k22p6k0L18
4920d9L55k24N7l09j1J8K02k1K31k20k60K11n3M5K01J70l23j74n9J46R5J6J43
4943A87k22q9Kj48K72K42j33P4k38j29p0J75K79m4J5k35M0j28J53N6J80O5k89
4966A5j91J47%P4K52r0l04p8j69L75Q0l0Lq4j51P6J10R9J07K1l37j12N7j12J12
4991a30J51J70l58J3l9j6L69l2J24j19k21j43L8J34J30j9j50O6k8J74QO4J12k54
5015D4m4j22j80K18J61M7k8k01R5k66K77R4M1O2j51L2j76O3M1K01j10j40q1q0
$$ plain form
4847 -194 63 199 -55 135 70 -182 -45 -136 50 260 121 -64 -138 -31 16 150 227 124 25 37 -257 -59
4869 -59 -29 135 201 118 34 -179 -234 185 236 211 130 -217 -224 -232 57 141 101 99 177 -178 -9 -73 55 346 250 -62 -114
4896 -114 -143 85 233 256 238 -95 -323 -272 -125 47 230 138 31 -133 -150 -103 -11 205 237 -49 -271 -347 -367 -49
4920 -49 306 82 139 -170 -181 -163 39 18 249 29 -231 -20 -73 -28 173 343 20 -154 -213 -67 28 44 187
4943 187 -35 -124 -122 -270 2 244 111 185 -53 -182 -252 -77 202 158 173 -62 -22 -150 3 59 239 304 15
4966 15 -176 -29 -29 45 297 207 -97 -175 -344 31 111 81 84 0 -151 -75 35 134 241 262 -75 -187 -130 -242 -130
4991 -130 21 191 -167 -154 -193 -209 160 128 252 133 -88 -231 -193 -59 71 52 -98 -32 -60 114 122 186 298 44
5015 44 0 -122 -302 -84 77 124 96 -105 -10 -276 1 95 136 198 47 79 -97 -34 7 208 98 -42 -123 -203
5039b03J37J52K72k32m5r4k13K9J65K04l3j15k83m1K4K53J43p5N9k13j11J22K89
5062A91j13J02j03j07l9l7L8K39m2ok86O9N0j30L15k7n2Mj52j45R1J70K14j87
5086E7K8j96j27K06K8j9K46o1j68q2j50J16K83L6j83k63J69j14J36L73k34P8j68
5109il33L56j28J35Nq1q9M3J08KN7O5P2k96j42J08k2J01N1Kn3j59K14J4R3kqJ7
5137A21j01j90K05nK22l80J40j83j09J09R5K57j11M2l38N8N8K31J38K5r3p8l25
5160b12J19P4R3J21M7k51k50K2L51m1j01J99k00l37K28K16J47K1j7k02j40j34
5182b47K82O7N8q5j14N7r9N2J77R7ll00l3k5n2K37J46k6j1j78o0q0K13L6R6j75
5208C0p9P6j63J72J08N4J11k62j22j26J43L03j22k24O1q6j37L25J17n8l3j57o9
$$ plain form
5039 -203 -66 86 358 126 81 -13 -226 -197 -32 172 139 24 -259 -300 -276 -23 120 45 104 -109 -220 -98 191
5062 191 78 180 77 -30 -69 -106 -68 171 129 123 -163 -94 -44 -174 141 114 62 66 -86 -231 -140 30 244 57
5086 57 85 -111 -238 -32 -4 -23 223 162 -6 -88 -238 -122 161 197 14 -249 -80 -194 -58 315 81 159 -9
5109 -9 -342 14 -114 21 26 -55 -144 -101 7 9 66 131 203 -93 -235 -127 -149 -48 3 5 -48 -207 7 21 114 112 104 121
5137 121 20 -170 35 30 252 -128 12 -171 -280 -171 -76 181 70 112 -226 -168 -110 121 259 284 191 113 -212
5160 -212 -93 -19 74 195 242 -9 -259 -237 114 73 -28 171 -29 -366 -138 78 225 246 229 27 -113 -247
5182 -247 35 102 160 75 -39 18 -81 -29 148 245 242 -58 -91 -116 -168 69 215 189 178 0 -60 -140 73 109 205 30
5208 30 -49 27 -136 36 144 198 309 47 -75 -201 -58 245 123 -101 -40 -126 -263 62 179 121 88 -69 -138
5231a38r8K14J46O3j10k00KL6R6p3K28n7l1l27p3J93J04J61L2r8k59n5J33P7K45
5256B11n9j10k03o4L08j35J18J29j03j75j07P6L5K76j4n1j11j5o9N2J52M1k21
5279c9J1k75L35L9KO6j97P0jk26Q7K70p2L6j09j25l7Q5m5K51o5j93L4j26J30L95
5305C01k21M0j06j11r4N6J35J78R1k39L3r5j14J64R4j9J30k84N4K2k4K02L8j27
5329A04l0k64P3LK81j03l7r3J62k9j85P1L38Pl76q0J33J79J85k58J79j99j67R2
5353a4l9J12P5J74l77jo2J34K99k27O8k19j16o8K27J74ok5oj94p1K03N8m3KJ35
5379A93n32K10n6J01K95k3j79n7P5j07K9J55J8j11r6O0j19J83K5K52j66j77lj92
5403b22K80k6J88q6k49Q0j13J44j7J94j88j22J05j54J13m8K67o5L6k80p4J59N5
$$ plain form
5231 -138 -236 -22 124 187 77 -123 -121 -85 11 -62 166 109 78 -249 -322 -129 -25 136 168 70 -189 -244 -111 -34 211
5256 211 152 42 -161 -225 83 -52 66 195 92 -83 -190 -114 -79 197 183 132 21 6 -63 -11 141 182 -39
5279 -39 -28 -303 32 71 73 139 -58 12 11 -215 -128 142 70 106 -3 -128 -165 -80 -125 126 61 -132 -98 -224 -94 301
5305 301 80 120 14 -97 -191 -135 0 178 269 30 63 -32 -146 18 112 93 223 -61 -7 15 -9 193 231 104
5329 104 74 -190 -117 -114 167 64 27 -66 96 67 -118 -47 291 298 -78 -158 -25 154 339 81 260 61 -106 -14
5353 -14 -53 59 134 308 -69 -70 -132 2 301 74 142 -77 -193 -261 -34 140 134 109 103 -91 -162 41 99 56 58 193
5379 193 -339 -129 -185 -84 211 188 9 -48 27 -80 -51 104 122 11 -85 -25 -144 39 64 316 150 -27 -30 -222
5403 -222 58 32 220 134 -115 -35 -148 -4 -21 173 -15 -137 -32 -186 -73 -121 146 81 117 -163 -237 -78 -23
5426b3J07J41j64j49P0j6M0J96l05J29j28q3O5K24J2l7p6J5n8n1J24J05J11j41
5450A08j60k12J99K2K88k00M4O7l23M8P0J09R3p6j47j88K27q7Q4j8PQ9j50m8l8
5475a92K86k6J47n3k81J58j7q0J36O3k00L6j64N4L4J33r5L6j21n2K29M4LL8n8
5500E8O0j90L5m3J29P4P5k18j07k4L4K21M7j16k6J6L1k13J84J05j16N4j67pJ39
5525C5J6J41k6j87j10kK21L1j08J76k04j66n0L38o4j4J5r7O5j29%l0K03KQ6k69
5551a27N9q0J50N3N8o5l9j26J62J49n2q3JQ9k27n8J08K17j04m8P0k60J01J05L4
5576H7N7n6K04k65j67J7J04J26j14J03j25j86L64j88J26m2k14J11o0M8K84k34
5598b0J75j78K8j11Q1K6K24j37J05p5k11lQ4k1J24q1n2l6K3o4J88M7P7k34k13
$$ plain form
5426 -23 84 225 61 -88 -18 -34 6 202 -103 26 -102 -185 -120 104 116 79 3 18 -40 -91 33 138 249 108
5450 108 -52 -264 -65 -43 245 45 89 156 -167 -119 -49 60 153 77 -70 -258 -31 -118 -34 -52 -45 44 -106 -154 -192
5475 -192 94 68 215 162 -119 39 22 -58 78 141 -59 -23 -187 -133 -99 34 -61 -25 -146 -198 31 75 78 116 58
5500 58 118 -72 -37 -80 49 123 198 -20 -127 -151 -117 104 151 35 9 25 56 -157 27 132 16 70 -97 -104 35
5525 35 51 192 166 -21 -131 -133 88 119 11 187 -17 -183 -233 105 41 27 42 -55 10 -119 -119 -149 54 56 142 -127
5551 -127 -68 -148 2 55 113 48 9 -117 45 194 142 59 60 149 -78 -136 -28 189 85 37 107 -153 -52 53 87
5576 87 144 88 292 27 -140 -123 -19 107 -7 96 -29 -215 149 -39 87 45 -169 -58 -118 -70 214 -20
5598 -20 155 -23 5 -106 -25 1 225 88 193 118 -93 -96 -12 -33 91 10 -42 -78 -55 -119 69 116 193 -41 -254
5623b54J71J97J39q7j65j05L8j19L49j66J70K0k15q6j2J81q8K31n7j99J03p3J5
5646a2l9J03J29j71j94L9Q3J47Q9j24p0PJ1Kj04O1J88k05l8M3r4J18k4J25j5r7
5672d2Q3j15k7J73K98l80P0j48l4K10mJ4J9k62O0K43k15K43n9pj54J0J07N5n0
5697H8m5j94J45p1K7j77K56L7jk27K51k80QK7J41KJ06l25J79L3J0N4p3P2j05r6
5723a58J79NQ0J28j81p7n8j0J04O8n8kn5J6j24J49p4L29j34p5j4n9O9Q3j07L49
5749C73k68j89ln7R0L41k44r5J63j22J52j3j2p3P7k35o5J17k3J94pp5K3r0q9O5
5775f5J67m1k2n4j25L2J01R9p2j38J22j92J44j67J30J11J12l18O5j58K03J72j42
5798c6J3Oj33O6J04L1J8J46k31o7J32l2J21q9R9o1m42L97j12J99K1m3K4j57j03
$$ plain form
5623 -254 -83 114 253 166 1 -104 -66 -185 164 -2 168 188 -27 -113 -125 56 -32 199 142 -57 46 -27 -12
5646 -12 -51 52 181 10 -184 -145 -62 85 174 50 -20 -13 -2 0 -104 -43 145 -60 -98 -55 -149 -31 -55 70 55 -42
5672 -42 41 -74 -101 72 370 -10 60 -88 -122 88 84 98 117 -145 -85 158 -57 186 127 120 -34 -24 83 138 88
5697 88 43 -151 -6 -77 -50 -227 29 66 65 -162 89 -191 -183 -156 -15 -13 93 -232 -53 -20 -10 44 -29 43 -62 -158
5723 -158 21 26 106 234 53 -24 -82 -92 12 80 22 20 -35 -19 -143 6 -68 261 127 52 38 -21 48 131 24 373
5749 373 105 -84 -87 -144 -54 287 43 -52 111 -11 141 128 116 43 120 -115 -180 -63 -86 108 101 26 49 -41 -130 -65
5775 -65 102 61 39 -15 -140 -108 -7 92 20 -118 4 -188 -44 -211 -81 30 142 -176 -111 -269 -66 106 -36
5798 -36 -23 -17 -150 -84 20 51 69 215 -16 -83 49 17 138 49 148 87 -355 42 -70 129 150 107 131 -26 -129
5823a29J59k7P6L1k03J22k6Pk2J69p3O2j41r7N2K7J78l1j18J11J26k62n8L2L6
5848AK0P9k65M1q0K79K3m1r4%J19r2j10K00p9j29J66j84K16k55K38N9j57N0n4
5873d9J00q2p8K58k71O7j60K71R1n8O2l9j31R3k59K56j05J57j70O2k16J34J0K05
5897A48j03j82J16p9J95k7lm0K1j71J55j97J4K19l9jj38PJ23n7J41q9J07j23m5
5922d8n1J09J67K4k56J78j32p7q5K77j50K2K78l66R4p3K47j07J02j90j65p7Q6
5945a93K64j44K79k76L6R3j58J17m8J07N9K3pk76j2K03J20j17o4lr4J71O0n0J42
5970B32k66N4j28K79r7N5J1k34J45J2j83J54j5J04jj63k1M3J53r9k2J8J34j68
5994co5J43r0O5Q7j3j05jk06J65Rj6o3R4j45J95Rr7j2J61k01n5K83j03L8k4Nj47
$$ plain form
5823 -129 30 3 79 110 -93 29 3 10 -12 157 84 146 5 -92 -40 -13 165 134 16 127 253 -9 -67 -35 1
5848 1 21 100 -165 -124 -204 75 98 57 -37 -37 82 -10 -120 80 1 -128 38 -146 70 -185 53 112 -45 5 -49
5873 -49 51 -31 -109 149 -122 -55 -215 56 147 89 151 112 -19 74 -185 71 -34 123 -47 15 -201 -67 -57 148
5897 148 45 -137 -21 -100 95 68 65 25 46 -125 30 -167 -153 66 27 26 -112 -105 18 -39 102 13 120 -3 -48
5922 -48 -99 10 177 201 -55 123 -9 -86 -171 106 -44 -22 256 -110 -16 -89 158 51 153 -37 -202 -279 -193
5945 -193 71 -73 206 -70 -34 59 -99 18 -30 77 136 159 152 -124 -136 67 187 70 6 3 -91 80 140 90 232
5970 232 -34 20 -108 171 74 129 140 -94 51 63 -120 34 19 123 122 -41 -62 -19 134 35 13 31 165 -3
5994 -3 -68 75 -15 50 137 124 19 18 -188 -23 -14 -30 -93 1 -144 51 60 -37 -49 112 -89 -144 139 36 74 50 55 -92
6022i2k8N6J33J17N3k31j55J31n2M4R1J3m7k07J68q0R5M8J49j82Nk03K65l3O7
6047A25P7k64l6N0k4J63J05j02j95J75j30n1J10rj06J73j34J04p9n5K26L8k35
6070g4N0r1J93k6J71j32K6j06o1J29j09K0Q1k2j51J91k86K41j65K57m8j16Nj90
6094b13L65K9k3m5k4j04N1k5q3kL5J23mp7j95J33RK58k72J27k47K04P5r4l9J46
6120A08j8j95K24k79K63pj23P1roN6j55J57L8j61J09p2o9k1J04M2n1L0q5k4M2
6146c1L7L6j19K68k92J35Mm6P4j7M6k88J30J85K0k27O0J79k10n8j6J18J07q6J3
6171B2l5M6j6J34k31N4j2J55n1p1l9J78O3j85r9K5L6o9L43k63P9j96Q9N3k11K96
6197I5j07l1R1j23O8J07j7j07M0j09N1J04J45j31j0j06K41j85j59J13N9J27m3
$$ plain form
6022 -92 -120 -64 69 186 239 8 -147 -16 -68 -24 67 80 33 -174 -6 -86 9 57 206 24 29 -174 91 58 125
6047 125 202 -62 -98 -48 -72 91 196 94 -101 74 -56 -107 3 -6 -112 61 -73 31 -48 -103 123 161 -74
6070 -74 -24 -115 78 52 223 91 117 11 -50 79 -30 -10 71 49 -102 89 -197 44 -121 136 88 -28 -23 -213
6094 -213 152 181 158 113 89 -15 36 11 -72 -74 -39 84 80 3 -192 -59 -50 208 -64 63 -184 20 95 1 -38 108
6120 108 90 -105 119 -160 103 96 -27 44 35 29 85 -70 87 125 -36 73 1 -68 -89 15 57 6 36 -49 -73 -31
6146 -31 6 42 -77 191 -101 34 38 -8 66 49 95 -193 -63 122 142 -85 -25 154 -56 -114 -130 -12 95 9 22
6171 22 -13 33 17 151 -80 -26 -38 117 66 -5 -44 134 197 12 -87 -62 -26 -95 248 -15 64 -132 -43 10 -201 95
6197 95 -12 -43 48 -75 -7 100 83 -24 16 -93 -42 62 207 76 66 -40 201 16 -143 -30 29 156 113
6220A13n0o7J23j26M8J21k51O9o0J67k21K39k8j95J32n6K08j04j17P4R1j73Nn3
6244a11J49M1o3q7l2R8j41J75M3n9N3j04L2o9L7N5N7n5M1j0n4J5kJ17o1j50J37
6271E2p5lJ11m7j9J40k07q7Q8M0J50j33j50K59j85J5K8m4J35O3j74l8m5K31Jj15
6297ij11P9m0K44j35P5r6J13j95o8J64j78J17J52j07J11K7k4M5k61J25%K3J01
6321A52n8j3J14j97L8j78L8J82r3q3Q0N7q7M2m4K08j94O6MR6j87p7J22RL9L6R4
6348A66k16J5r0J71J6rj6j07J65k34L2R0Q5L6l45R0O2O1J63k18M6Q8P6p0R1j55
6374gn5J13K5m9P5M5k57J91O9m8j52J59j03L3r1J15j30j40K15n0o4oJ47j20P7
6399hM0m8M5n2J53k72K43LL0l35J68J85j95J3K8r4M3MK25l1j00R1qj12l4K0m2
$$ plain form
6220 113 63 -4 119 -7 41 162 -89 -20 -80 87 -134 105 77 -118 14 -42 166 62 -55 19 110 -63 -58 -111
6244 -111 38 79 16 -71 -103 -5 -146 29 72 13 66 -38 -6 -75 -38 17 74 19 60 50 -4 11 9 126 65 -85 52
6271 52 -23 -26 85 38 19 159 -48 -135 -47 -7 143 10 -140 119 -66 -51 -23 -67 68 131 -43 -81 -126 105 106 -9
6297 -9 -120 -41 -81 163 28 103 7 120 -75 -143 21 -157 -40 112 5 116 143 119 164 -97 28 28 51 152
6321 152 94 81 195 -2 36 -142 -104 78 -15 -98 -18 39 -48 -6 -50 158 -36 30 34 130 -57 -134 -12 -3 36 72 166
6348 166 -50 -35 -125 46 62 53 37 -70 95 -139 -107 -17 68 104 -241 -151 -89 -28 135 -83 -37 51 127 57 148 -7
6374 -7 -62 51 76 27 102 147 -110 81 150 102 -50 109 6 39 -52 63 -67 -207 8 -42 -106 -112 35 -85 -8
6399 -8 32 -16 29 -23 130 -142 101 104 134 -201 -33 152 -43 -30 -2 -96 -53 -49 176 145 45 136 128 16 -18 2 -40
6426d0j22J40J8j58K28m4J52k03km6M3L3j36J87L2j36J6n7R6K8J3JJ23j88Q2J3
6452G3j07qM3j23J06j28Q2N3j6N9k0j52L2o0K64l15K20L8l0K7n9J14Jl14J76K14
6478A70j74q0J61P6J5m4j16r7L0m3K29q5R4Pj17k8R6L7k66J83L1j55L9K25k84
6503i6J31O6l2%L9p3j25l1J79N7Pl20L00n0P2q6R1r9K6k10J60n1l4J11r4N3j70
6530a79K98j46M8j34pP0j1J40j54J45j58K19r4k15J90n5R9q8O2p3N9mJ27l40J71
6555c0Q1m9o8R2O2j34K6J7j06L23k83J7l6R1Kp1J08j47L59j17j77J22l1j35K29
6580A45j85nJ16j79J74j55J90n7q1K05j70qj01K36k03K71l46J00J67K1j08K3q6
6603c6j1K4P6j9p8n5J03l0K1K14k59M5l1J09J37j55L1j32mn0L10k54K8J02j72
$$ plain form
6426 -40 -162 -22 -4 -162 66 22 174 -29 -31 -77 -34 -1 -137 50 82 -54 -38 -95 1 29 42 43 166 -22 60 73
6452 73 -34 -42 1 -122 -16 -144 -62 -9 -25 34 14 -138 -106 -166 98 -217 3 41 11 38 -21 93 94 -220 -44 170
6478 170 -4 -84 77 153 168 124 8 -89 -59 -102 127 42 136 143 26 -2 94 131 -135 48 79 -76 -37 188 -96
6503 -96 35 101 69 69 108 35 -90 -121 58 115 122 -198 102 52 124 38 129 30 56 -154 6 -45 -79 32 -62 -9 -179
6530 -179 119 -27 21 -113 -120 -50 -61 79 -75 70 -88 131 37 -178 12 -43 56 -32 30 -43 16 12 139 -201 -30
6555 -30 51 2 -66 26 88 -46 -20 -3 -109 214 -69 -52 -88 3 5 -66 42 -105 254 137 -40 82 51 -84 145
6580 145 -40 -45 71 -108 66 -89 101 44 -37 168 -2 -10 -111 125 -78 193 -153 -53 114 135 27 50 -36
6603 -36 -47 -23 53 34 -44 -99 4 -26 -5 209 -50 -5 -36 73 210 55 86 -46 -50 -100 210 -44 -16 86 -86
6628h6M7o3J9Q6rO7l8j82K15o6J03PN5l06N0J36J23j01j8q7R1j52m6L10k14R5
6654C6j70K56k47J66j6K8j37J02o1j42K57n6o8J05j01K1N5J09j50LrJ09J17j44
6678F3r1R1l7j19J48pj19J11J62j60K3r9K4J67j52j45J56j30K40j3p3j9P7j23
6702b5j32K34Q0j12j21J38j00K4j8J51j58M7R4j35J47N0j91j35K03J7m3O7l2Q7
6726A37j35j8j4m5J03j61J08j5J34j09l9N9j64K43k09K51j11j21k7J69p6J88k7
6749A21q7M2j27J33J03l65O7K59j07J40k36J01J08j49K4k8j25O6O3J7p2n4K30
6772A24k82J97k11K62P9k31LR9O3K5o1J9o4j4r6J23Pn1n3J44L8r4l5J05o3n7j9
6799d3j76L01p9J29n3k12L2L09j00M9j74n7J61j09qk8J2J34j1Q9j94J13m9K3p2
$$ plain form
6628 -86 -39 -102 -83 3 -6 61 23 -159 56 -10 93 100 155 -151 -101 35 158 57 39 -48 43 -109 -155 155 -59 36
6654 36 -134 122 -125 41 25 53 -84 18 -43 -185 72 16 -52 53 -48 -27 28 137 -13 -10 -19 90 207 63
6678 63 -28 63 26 -93 55 48 -71 40 202 42 65 -34 -10 157 5 -140 16 -114 126 113 40 21 98 -25
6702 -25 -157 77 157 45 -76 62 -38 -14 -32 119 -39 8 102 -33 114 164 -27 -162 41 58 15 82 50 137
6726 137 2 -16 -30 -75 28 -133 -25 -40 94 -15 -54 5 -159 84 -125 126 15 -106 -133 36 -40 148 121
6749 121 34 76 -51 82 185 -180 -113 146 39 179 -57 44 152 3 27 -1 -126 -60 3 20 -52 -106 124
6772 124 -158 39 -172 90 169 -62 -59 40 103 128 67 86 22 8 -88 35 42 -9 -62 82 120 26 -9 96 33 -24 -43
6799 -43 -219 82 3 132 79 -133 -101 208 108 157 -17 -74 87 -22 -30 -58 -46 88 77 166 -28 85 36 59 -13
6824a3J07j76J18j08N4J13mJ24k20P3j16K9K68k38M0O0pj2r5Rk9j53J06K68k27
6849b9j40K54j81K9R9p4J12m9Jj08p2K07l8Pl8Q0n0q2K2m2J3j47M07k60o1J81
6875D1m7P0k22K36l8p7j21J82J1j41K15k16J16p8J38j16K35j29j32j36R4K33m6
6898G2mj04RJK6%K7m9J0l1N9Q1pKJ08j88l2jJ96k63Q4M5p0P7l0K2j27K3J13Q3
6928A32j04r9J57k9j77N1L0KP7k6N8k3j65K84k01j10L15p8j01m3J2j35J91k1K76
6953B73m17K34o5p5p4J00J14j14KK2M5K1o3P2m5J8j4j14R9Kk20J75p1K42k24J02
6979B5q3J04J9l8j3J30k16q0J65j84K31mn5J23l09K03L4J01j08p4j11K67r9j10
7003h2N9j7J03L7P3j95N0o9J4J50j49L3O2n3p2P8j18OQ8j2p4j00L58j16r1J1q6
$$ plain form
6824 -13 94 -82 36 -72 -18 95 91 215 -5 68 -48 -19 249 11 51 111 104 92 -3 6 -23 -176 -70 198 -29
6849 -29 -169 85 -96 -67 32 -42 70 21 22 -86 -158 49 11 18 -20 60 10 -72 -50 -92 -79 -226 181 -79 -140 41
6875 41 -6 64 -158 78 40 -37 -158 24 35 -106 109 -107 9 -69 69 -47 188 59 -73 -209 -115 118 72
6898 72 68 -36 -27 -26 0 0 27 -22 -12 -43 16 97 90 92 200 12 -20 -21 175 -88 -4 41 -29 48 18 40 -87 -64 49 132
6928 132 28 -71 86 57 -120 -69 -39 -37 40 14 72 49 -116 168 -33 -143 172 94 -7 -50 -38 -173 18 -3 273
6953 273 -144 90 25 -50 -124 -24 90 -24 -22 0 45 66 3 75 30 48 34 -80 19 21 -199 -24 -95 147 -77 25
6979 25 -58 46 65 27 14 144 -72 -152 13 -171 60 56 1 124 -185 18 52 153 45 -29 -140 127 28 -82
7003 -82 -23 -40 63 100 173 -22 28 -41 -27 123 -26 7 69 16 -56 22 -96 -90 -2 -14 -88 -188 170 54 -37 -26 -112
7030a12J28j29L59k78M1j0O7k5J15j87J30j4n4K9o7K33L9m68l4L96j16J58j73
7053B8O1k08Q6oJ8J22J2j72J75k04R6j11n7K24m6P1j15q7K7K49q0q8J66l71J77
7078c3k2P4l9JJ23j11l1J5m4Q6J23k55K86K2j14j5R2j90J87k18o0L6J92l7k3j9
7104B6j28K06q4m5Q2n7Q5j26ooJ53j07J18j4j01O8K1j75K1J17o0M3j75J39n8M0
7130b3J12j04j4j73K86j73N4j01J09r9q8K32M8j61J13P9j61J12L5p4l2J00j19
7153d2J10j33J19q2Q6p5mj1Q8p3R5n1q3J32r5J65o7k27J93p9J90k36J66j36l3
7178h3R7J0n5l7M%J80o2K1p5J48j77P5j03O3j02O4J72l22J62K31j94N6j50J34
7203E7j01N9J09r9K0k7j30N2j1J15n4o3J49o2P1r6j94K62Kk3j16J23J9j58J55
$$ plain form
7030 -112 16 -113 246 -32 9 -1 66 41 156 -31 99 85 31 60 -7 226 265 -203 -237 159 43 201 28
7053 28 89 -119 -33 -39 -21 101 113 -59 116 -88 8 -103 -160 64 18 89 -26 -113 -86 163 83 -5 161 -210 -33
7078 -33 -55 19 -20 -19 104 -7 -38 -23 -67 19 142 -113 173 195 81 66 158 -32 155 -63 -123 -87 105 68 45 26
7104 26 -102 104 20 -25 57 0 85 -41 -47 -53 100 -7 111 97 -4 64 85 -90 -69 48 -12 31 -144 -5 -63 -23
7130 -23 89 -15 -29 -202 84 -89 -35 -136 -27 -126 -214 18 66 -95 18 97 -64 48 83 9 -23 77 -42
7153 -42 68 -65 54 -28 58 -17 -21 -32 56 -17 78 27 -56 76 -19 146 79 -148 45 -34 156 -80 86 -50 -83
7178 -83 14 24 -31 -68 -64 -64 116 54 75 0 148 -29 46 -57 6 -96 -32 140 -182 -20 211 17 73 -77 57
7203 57 -44 15 124 25 45 18 -112 -60 -71 44 -10 -73 76 14 85 -11 -205 57 59 36 -80 43 62 -96 59
7228E9N9j79J05R5k47n4J75K0n0qR2K9o8m8j13L4K31k03J3M1J4l6k2j9R5n6L9
7255bK15k01j02PJ34n0j19O9O5n9L2l3R7j45J50l5o2K11j03M4k51kK00kK2R0k37
7282f7J92o6n1j02J02P1k13nJ20l1P7j75J2J74On4Pk3K3L1r7L3p5K13k99K94q6
7309A1j42K8Q3n5N3L7L0j53O8L11m93P1R0R6k07L04j61N0K5j7Q5o0r7j2l7J47
7335E5j7r7ML6m2o5L3l1OJ36J06r6M1j48L9K3N9j25M7l7Q7J40j98M9m7J9K1j3
7363a5L5PJ2l6L2j82K63j15L8n7J36nj84J23j2J06n2lj79J25kj0P3j12J37o8r
7390D6k1j63J00L4n0J20q5J39j29k7M4p5L2l5k1J22j86K13p5kRR3J26j98K5q5
7416d9J60M2k70J19O9j68J17q4PJ8J25l3O0j6j94P1J09j66J0r4lK40J06k44K8
$$ plain form
7228 59 118 -61 44 139 -108 -162 13 33 -17 -25 67 96 28 -20 -133 -99 132 -71 -58 -17 -3 -39 -61 -80 15 -41 -2
7255 -2 213 12 -90 -83 51 1 -118 -49 16 -43 -11 -44 53 -92 58 23 -39 172 69 113 -138 -140 60 58 80 170 -67
7282 -67 125 59 8 -94 8 79 -134 -139 -19 -50 27 -148 -136 38 44 -10 -3 -26 -3 28 -69 -36 -111 102 -197 97 11
7309 11 -131 -103 -20 -75 -22 15 45 -108 -40 271 -222 -151 -61 35 -172 132 -29 21 46 29 114 54 -43 -55 -92 55
7335 55 38 -59 -55 -19 -61 -126 -93 -124 -118 18 124 28 69 -79 -40 -17 42 -83 -36 -73 14 154 -44 5 -42 -23 -2 -15
7363 -15 20 27 39 3 35 -147 116 1 39 -18 118 113 -71 52 40 146 94 91 -88 37 35 25 98 -14 123 55 46
7390 46 25 -138 -38 -4 -54 66 -19 120 -9 -36 8 -67 -35 -70 -91 31 -155 58 -17 -19 -10 83 209 11 36 -49
7416 -49 111 153 -117 2 71 -97 20 -64 -57 -39 86 53 113 97 -97 -26 83 -83 -73 -167 -170 70 176 -68 -40
7441d0k1J54j57O1Q0j62J19o7O7K2J7Ko4j92J43L3l5J20L0r5j19Q7l5qJ09K9j22
7468d4N2n0J57j57R9l0p6q8J9j06J73o1K5J14k09P4R5O3L8M6l7M9j77J03K6j74
7494g6J47L6j64p7M6O7M8l1R8n1N6j78k1Ol2R4J3n4M0l3oO8O2k2j9K0m1J54p6
7523G4P0k13j17K91k6l1j42J41j71L4R2J69l37K37r7j24J36j88J89p5j15L74j57
7546A4NoJQ2o9j9q7N4N7j12Nn0O1k2J34n9M5n2P7j86J78q5J33J66l25K67k59L6
7574a6L3j03l1Q9J50q8l6K71k40k08L28j94J5j9M3O0K6k05O1j04K46j16R3j60
7598a05P7M7m7K2o7M3J4K8NKq5j1K02j7j06J42q4nl5j0M4j8l5J1j2j1p6J40K1
7627G4r5r2J17n9j8R7L0l9J32j77j14J10j28J38M7n3m6K02j83L04j21j59N0k6
$$ plain form
7441 -40 -61 93 -64 -3 77 -85 34 -33 34 56 73 75 11 -181 -38 -5 -40 80 110 15 -104 -17 -52 -60 49 78 -44
7468 -44 8 -42 115 -42 57 27 -49 -137 -118 -224 -51 -112 -87 27 -182 -108 -13 50 88 134 97 146 -31 72 98 -76
7494 -76 71 107 -57 -134 -88 -21 27 -4 94 43 99 -79 -100 -94 -126 -32 -19 -73 -33 -66 -72 -4 58 36 17 37 -4 150 74
7523 74 144 -69 -186 105 79 48 -94 47 -124 -90 2 171 -166 71 -26 -150 -14 -202 -13 -88 -203 171 14
7546 14 19 13 14 96 27 8 -79 -25 32 -80 -75 -125 -64 -86 48 -11 34 -18 59 -127 51 -34 99 265 -60 207 -52 -16
7574 -16 17 -86 -117 -28 122 34 -2 269 29 -179 149 -45 -30 -49 -6 54 80 -125 -64 -168 78 -38 55 -105
7598 -105 -28 19 -28 -6 -73 -30 -16 12 17 19 -66 -77 125 108 2 144 60 55 20 10 54 36 1 12 0 -11 -87 53 74
7627 74 -21 -113 4 -55 -73 24 54 15 147 -30 -144 -34 -162 -24 23 -30 -76 126 -57 247 126 -33 17 -9
7651iL3m5o8J92k35R5K83j78l2L4j12N9K20m61L04j07K7j07p0K27r5Q2n4J79j38
7676B4J90j99k4j40L72l48K01n9RK4r1j37J4j0P4K81j58K09l27J03M5k6k13L71
7700A85r6j72P3P1m9p3J13l7N3o1Jr4R9K2k05K39j97L10m3P5j64L8n2m2J15j24
7726a5pn3J76J9j40j1j55J04J9J28r2J25j75J12k4J07j86R3j12J25Oq6j97L25
7750H6j9Ro4j00k4R6P3M3j17P5j12O9J8j13J31N3j53j04J77o0O5P8l21J77J0p6
7776a03J50J6k7q4k9p5J49J0k5n0j6R1r9m4M0J17o0P4j65P7J39q5j3O9k0k70L02
7803F9l3r6J65j74J09J2q6O6J08o3J9j52p5J21J19rQ8j55j70J39P0j43K00L9k48
7828h0J35p8K17lj88j68K75k76J46K4r9J3K66j39n3j20j4K07n6n1J48ok00J28
$$ plain form
7651 -9 24 -21 -89 103 -132 -37 246 68 36 70 -42 17 237 -224 80 -27 0 -107 -177 50 -45 37 -17 162 24
7676 24 214 15 -9 -149 223 -125 76 17 26 50 -41 -178 -164 -174 -100 181 23 232 -95 8 53 27 -186 185
7700 185 89 -83 -10 61 12 -61 52 15 68 7 8 -86 13 35 -170 69 -128 182 139 214 50 88 36 -6 109 -15
7726 -15 -22 -75 101 120 -20 -31 -186 -82 -63 65 -27 98 -77 35 11 118 -68 25 -87 38 44 -42 -239 86
7750 86 67 76 12 -88 -112 -16 57 100 -17 58 -54 15 33 -80 51 104 -49 -153 24 -36 29 107 -214 -37 -27 -103
7776 -103 47 63 36 -48 -77 -152 -3 7 -18 -68 -84 7 -92 -136 -96 21 -39 35 -130 -53 86 1 -12 57 37 -233 69
7803 69 36 -60 105 -69 40 52 -34 32 140 77 96 -56 -131 -10 109 100 188 33 -137 2 72 -71 129 168 -80
7828 -80 55 -23 194 191 3 -165 110 -166 -20 4 -95 -82 184 45 -8 -128 -142 65 9 -42 106 100 -100 28
7852B8no3K13o8k55K6NJ37j71J60k9J9k8O6j30q3J44j33J78k8r5m1K11q7N9q6
7878e6n0J48J1l2J0O2m5o4K4o2J07m6R0j36J05L7k79J71Q4n4N1K1j10K3n4J01
7904E7jP9NK8j33r2P0M0m8M7L0p5p5J47l1k9N7Mj47l9J00%l8lK89k62J11n4j12
7933g5K27r0lM8j40L0K14l11K29j05k38J50N2O9j12N4J33k11p3J87kJ2r0K19k17
7958d3l7J61j96R4Rj7J02p7J8m7R5L7O9j08O6j25J0q9J38N4j41N6k2j12J75M9
7984A19n6m8j39J39J25k83Q8K14j84j00O3NJ34j34M7k0Q3j47k7R4r5N2n0K48k07
8009g9L6J41r5M6o3L4m3N5k33J97j01P0k9J17m3r3Q7P1j43J19Rk13J64k7l2K15
8035A67j80q3K18l11K81J00j84n7K07j04r0QP7q3N8o8J3o6RMK58l09J40K4j66
$$ plain form
7852 28 23 -40 173 105 -150 -124 -119 18 -153 7 -22 -3 -31 35 -95 -178 -34 -167 11 -17 -112 -153 58 -29 30 -56
7878 -56 -106 42 53 21 31 93 48 -16 8 -54 53 7 97 -39 66 103 -176 -5 79 25 76 97 -13 10 -44 57
7904 57 56 135 140 168 35 -57 13 53 5 52 82 7 -68 79 48 19 76 80 -67 -106 -6 -6 -44 -47 242 -20 91 37 -75
7933 -75 152 62 59 107 -33 -3 211 -100 129 24 -214 -64 -12 57 -55 -1 132 -79 -152 35 33 45 -45 174 -43
7958 -43 -80 81 -115 -21 -12 -29 73 -4 14 -33 62 99 168 60 126 1 11 -78 60 114 -27 29 7 -105 70 119
7984 119 63 15 -124 15 140 -143 -55 159 -25 -125 -62 -57 77 -57 -10 -30 53 -94 -121 -27 -122 -70 -120 128 -79
8009 -79 -43 98 3 49 -14 20 -23 32 -201 -4 -105 -35 -64 53 10 -83 4 75 -68 51 60 -153 11 -16 -48 167
8035 167 -13 -96 122 -189 92 192 8 -49 158 54 -36 -28 49 -34 24 -44 -31 -97 -88 -84 174 -135 5 29 -137
8060a37K7O1J70m0k3m7j23J86j18J42q0j0L8j4o8j4j22J54J71k92K43j61j9K43
8084A67j50j8Pn6m5O5N9j9O1j02J08q7P3j04n3N9N4R2j72J47n8P5k08J00Rj74
8110a70J78q0J38k31J02o6K02o6l5P3R3N1q7n8q5m6J74m5m0MJ71k44M7m3J91J32
8136B60k61J91k90J14J48k29n0J87j66J09J02o8R3j95K0l7M0m2j2J13N8j15qo9
8160a07M9R2M9j04Q1J8k27J44M9J46j80J84j59j48L6N4l1J22j3r7l3J50n8n9J7
8185b5N1j6p8N7r7j0
$$ plain form
8060 -137 -110 -49 121 81 58 11 -112 74 -44 98 18 8 46 32 -36 -50 -172 -18 153 -139 104 -57 -76 167
8084 167 17 -1 6 -50 -95 -30 29 10 71 -31 77 -10 63 -41 -94 -35 19 111 -61 86 28 103 -105 -5 4 -170
8110 -170 8 -72 66 -165 -63 -129 73 7 -28 45 138 189 102 44 -41 -87 87 42 2 6 177 -67 -20 -63 128 260
8136 260 -1 190 -100 14 162 -67 -117 70 -96 13 115 47 140 -55 -35 -72 -32 -74 -86 27 85 -30 -38 -107
8160 -107 -58 34 83 -21 60 78 -149 -5 44 190 10 194 35 -113 -77 -23 -54 68 55 -42 -75 75 17 -42 -25
8185 -25 26 10 -68 -11 -108 -118
8191a18
$$ Imaginary data points
##PAGE= N=2
##DATA TABLE= (X++(I..I)), XYDATA
0@%%%%%%%%%%%%%%%%%qJ6j6J6j6J6j9K7l2L2m0M8n3O1p1Q1r0J02j13J26j42J58
39H3j76J98k20K43k71L00l30L63m01M43m88N37n90O49p17P94q80R78j091J222
59F46j377J566j799K092k478L014l796N044p363J2980m8984n1293J27298k7770
73G780k6336Q0276m3023p4452N1445K23j4540N0340j1723l1216K5764k5308k5423
86c6193L4387J1793Q277J2332m0138j2881J5186k0787K7663N3176l6579l3316
98a7080J1057k0593M208M1550N174j100j6594m4602J4248L3300j0810J9114J2708
111C0580m3225m532J3103j6569K6020J9292k7587J7375J258n6898J6007M2160
123A6984j3818J9435Q265n5956k036K0334j0669M4715J8238o4800L453K4403m3819
$$ plain form
0 0 0 0 0 0 0 0 0 0 0 0 0 0 0 0 0 0 0 -8 8 -8 8 -8 8 -11 16 -16 16 -24 24 -29 32 -39 42 -48 54 -59 67 -75 83
39 83 -93 105 -115 128 -143 157 -173 190 -211 232 -256 281 -309 340 -377 417 -463 515 -576 646
59 646 -731 835 -964 1128 -1350 1664 -2132 2912 -4451 8529 -40455 -91748 35550 7780
73 7780 -18556 61720 18697 -55755 -4310 -4087 -18627 31713 19990 -11226 14538 -10770 -36193
86 -36193 -1806 9987 18264 30596 -9542 -22423 -7237 -28024 -361 52815 16236 -17080
98 -17080 -6023 -26616 -22408 19142 24316 23216 6622 -37980 -23732 9568 -1242 17872 30580
111 30580 -12645 -17177 -4074 -20643 5377 24669 -2918 14457 15715 -41183 -25176 16984
123 16984 3166 22601 30866 -25090 -27126 -6792 -17461 27254 45492 -19308 -15855 8548 -35271
136c5271K5514N4115m0418j0772K5514m2444n635M5392j2539k55K8708l4487k7158
149b9736K3427K8L598K7843o322k0674j0546j2898J3966K6458J357r36r085k6899
163b0419j867J7506J1616J3783o642k0441R52o674p512K8274J1327j6739O319
176I483q280k7459J3416J8857j120J6634n103l4232Q21R792k573K5291J0911k6347
190I1p278l107j1401K2275J8244j1476K910p176k6522R747J8879l589J2384M669
204A8650k6443o446O644m784J6941J8690j4792j1293k406j3794O180K4838M692
217A6677p137o470j4226o606J0243J3681Q588k203j1177j0426n469M700J3555
230C730Q367M63o232j4357p711O714Q895J0246P184j1084j5460k951O25Q033J6961
$$ plain form
136 -35271 -9757 44358 3940 -6832 18682 -23762 -29397 15995 3456 3201 31909 -2578 -29736
149 -29736 -6309 -6281 -2683 25160 18838 -1836 -12382 -25280 -11314 15144 16501 15565 6480 -20419
163 -20419 -22286 -4780 6836 20619 13977 -6464 -5512 -12186 -19698 8576 19903 3164 9483
176 9483 1203 -26256 -12840 6017 4897 21531 16428 -17804 -16983 -7191 -9764 15527 26438 91
190 91 -7187 -10294 -21695 580 18824 7348 10258 3082 -23440 -13693 5186 1597 13981 18650
204 18650 -7793 -14239 -7595 -12379 4562 23252 8460 -2833 -5239 -19033 -12853 11985 16677
217 16677 9540 3070 -11156 -17762 -7519 6162 14750 12547 1370 -9056 -14525 -9825 3730
230 3730 12097 12560 6328 -8029 -15740 -9026 -131 10115 17299 6215 -9245 -12196 -11571 -3538 13423
245A3423K348j1236q554q664j778J3681J1946J316l711j1676j1004K163Q837R660
259F751P728m539j3015p878j266N818J2919Q113m604j0454r274l867O568J2806
273E806P780k850r775j0529m180O289J1752P538J05q896j2193m074O057Q475R391
288A0696L332j0721j1549k850J631Q592J2578J346q819r057p525J117J1422R346
302I539K663m674j2386p829L329O805J0009O707p080j1142n612j805O785J2869
316H178M286m891q341r438k160Q427R691N608j007j0995r179j036M647J0300Q547
331A2637l265q680p938n310N144J1912O030n44o354j1481m476N613Q129Q167K464
346A2048q968r923l494J423Q979J0108N71o330q353p686J923J0183P329K706l559
$$ plain form
245 13423 15771 4535 -4019 -12683 -14461 -780 11166 12482 8771 -2905 -13909 -11746 -2909 6751
259 6751 14479 9940 -3075 -10953 -12219 -6401 6518 14631 10027 -427 -9701 -13568 -7000 5806
273 5806 13586 10736 961 -9568 -13748 -7459 4293 11831 11936 3040 -9153 -13227 -7170 1305 10696
288 10696 14028 3307 -8242 -11092 -9461 -869 11709 13055 4236 -4821 -12346 -11229 193 9539
302 9539 12202 7528 -4858 -12687 -9358 -2553 7456 14163 7083 -4059 -9671 -11476 -4691 8178
316 8178 12464 7573 -768 -10206 -12366 -3939 5752 11360 10353 -642 -9821 -10857 -6210 4090 12637
331 12637 9372 692 -7246 -12556 -7412 4500 10530 9986 3632 -7849 -12325 -6712 1417 9584 12048
346 12048 3080 -6843 -10337 -8914 65 10173 10744 4414 -3939 -11625 -9702 481 7810 10516 6957
361F957j0866p395K514O983Q579M777m717r421o965q91P350R818L854k926q161
376e10r170j268P657Q306M934r23q730r273j368N667Q193O518o54q409q525k742
392a0297M192Q513P294k34o969q652m480L390R116O752R54n249r709n695L811
407g263P979O790K736n422r536n127J840P126Q317K482m368q073p158P31P613
422a333O823L961k081r347o959N33M811Q331O233m070q255n976l190N944J0413
437E838L016j800n610j0015j304P031M996N995J883j0153p072N73m09P237J0678
452A0884k951p135l333p383J130J2217M103n22j047j0815o844O657N097N312N951
467A1321p251j0121r15k43M740J1123M53o852l247o465k067R211N885J407j77
$$ plain form
361 6957 -3909 -11304 -8790 -1807 6772 11549 6832 -2589 -9554 -10445 -3095 6723 10577 7651 -510
376 -510 -9680 -10948 -3291 5015 9949 9026 296 -8977 -10345 -4678 3515 10033 9379 970 -7555 -10297
392 -10297 -6105 2408 9702 9468 2499 -6153 -10633 -7243 1873 8625 9579 4330 -5379 -11074 -7263
407 -7263 716 7506 10242 4820 -4716 -9843 -8003 -877 7440 9922 5554 -2519 -9677 -8946 -1333
422 -1333 5490 9451 7370 -1977 -8936 -8403 -3592 4739 10972 6902 -1353 -7329 -10519 -4575 5838
437 5838 8854 7054 1444 -8571 -9875 -2844 2152 8147 10030 -123 -7195 -6622 -7031 206 10884
452 10884 7933 798 -2535 -9918 -8788 3429 7532 7010 5963 -4852 -11696 -5039 58 5370 11321
467 11321 4070 -6051 -6966 -7209 -2469 8654 9107 2255 -992 -7457 -9524 -313 5572 6979 6802
482F802p233p673L81L769P724O579l879p250n699m070O724J0031J354q84n309
497A367j0217L38P061K495O432J640j0516m112N47k529Q594R479o082k674k163
512c40j0935L530J2489m29K113J789j4287m988Q157J002O462Q487j0482r442K135
527d739k652M551J2746k729o621j22p250k011J0229K939l0L031o839q655J556
542f596L402N011P395j467q320o198k150M854Q681L695j603p091p046P33L835
557b865M359O618j669p959j740k477j077R487M805m208Q07n589r497O794O874
572B663j218P221j007j4872j058N519j188R725P007j1999n695J172n020P180J1941
587A0371n368m561Q26q046r90R521J354N24L491p344p049K507J108L954Q778j826
$$ plain form
482 6802 -431 -8104 -7723 -3954 3770 10349 6470 -780 -6479 -10549 -3825 6206 7560 6676 1367
497 1367 -8850 -8512 -1451 1044 7476 9116 -1400 -5512 -4965 -7494 1100 10579 4497 1823 -340
512 -340 -11275 -7745 4744 4315 6428 8217 -6070 -11058 -2901 -1899 4563 13050 2568 -6874 -4739
527 -4739 -7391 -2840 9906 7177 556 434 -6816 -8827 1402 4341 4311 7342 503 -8152 -6596
542 -6596 -3194 1817 9212 7745 -575 -6773 -8923 -4069 4612 8307 6704 -387 -7433 -6700 -2865
557 -2865 1494 8112 6443 -1516 -3256 -5733 -6810 2677 7482 3274 4081 -1508 -11005 -4211 2663
572 2663 1445 8666 7659 -7213 -8271 -2752 -3940 5785 12792 793 -4902 -3730 -8750 -1570 10371
587 10371 5003 442 1268 -6778 -7768 1753 3107 3631 7122 -222 -7271 -4764 -3656 298 9076 7250
603G250r002l561j286J611Q442N544l367o246m773j862L771P095L186k495l223
618A084m627l864L961O193J204O79m63p611m051M054K433M387N694n637q206j65
634d935j180K731J1873K54q934j559l221l751R224P341m218j135k163p825J606
649e892P583j46K057L324p610n930K666J196K974P643j402p611l368j617R07Q633
665C407M900m314l834l791m530M562Q420J92j354j705o344k218M969K621K123
680C104L368m424o168K99m00J826P796K016n846l412l261k095O828O938j215k316
696C038m160o448J890P151K642M01m37n678m516K027L726K575K683l37n369l748
712d560J20J688M298M828j211n733l163j868Q77P599M209l554k779m101m146M902
$$ plain form
603 7250 -1752 -5313 -6599 -4988 3454 8998 5631 -615 -5388 -7250 -3479 3616 6802 4307 1084
618 1084 -3543 -7407 -3446 2747 3951 4630 4167 -3444 -7495 -3441 -1008 3379 9073 3436 -4770 -4935
634 -4935 -6115 -3384 8489 8743 -191 -1750 -4971 -8722 502 7843 3625 2490 327 -7498 -5892
649 -5892 1691 1545 3602 6926 -684 -6614 -3948 -2752 222 7865 6463 -1148 -4516 -6133 -5226 3407
665 3407 8307 3993 159 -3632 -8162 -3600 4820 5012 3658 1953 -4391 -6609 -1640 981 3104
680 3104 6472 2048 -4120 -3821 -4221 -2395 5401 7417 1571 -1841 -5102 -7197 -369 6569 5354 3038
696 3038 -1122 -7570 -5680 1471 4113 4514 4077 -1601 -6117 -4090 -364 2211 4894 4557 -812 -4560
712 -4560 -4440 -2752 1546 6374 5163 -570 -3733 -5601 -4724 2875 7084 3530 751 -3350 -7496 -2594
728b594O264OJ053k308q108L86M768r7L797L876o716m304J432k360L143P994j422
745D810l550j386n691k65P208K978J56R7o630m383L146K704L773L500m156m813
761b502j066r34K575N791Q24k112k372m229r09L376L432K916j50n183l179q54
777d576R52N780L684k684k455l572l558M184N138M57J008k323o756J3L276Q47
793e85M706J515n864k125m20k330N420N195k615j016j983o043J718N972Q31J887
809D263P7p099k207K361P91M644L241m424l414r59k369L653N158j55p93k118n281
826d631P8L827K297K563L80n308k889p5R73M550L148k148j931l155l308L266M460
843B097P78J325k659n368l46K193J800M038J002m633k240j250j084M774L978j488
$$ plain form
728 -2594 3670 3676 4729 2421 -5687 -5301 -533 -630 3167 7043 327 -3977 -2545 -4905 -1762 6232 4810
745 4810 1260 -126 -5817 -6082 1126 4104 4260 4357 -2273 -6656 -3510 -806 2967 6467 2311 -2502
761 -2502 -3568 -4502 -1927 3864 4688 2576 204 -4025 -4934 -1558 1874 4790 4640 -543 -3722 -4576
777 -4576 -3624 2156 5840 3156 701 -2871 -6429 -2245 2893 3350 4358 2035 -4721 -4708 -1432 -585
793 -585 4121 5636 -228 -2353 -2773 -5103 317 5512 2897 1881 -102 -6145 -4427 1545 2376 4263
809 4263 4340 -2759 -4966 -2605 -1814 2830 6071 1647 -1767 -2726 -5095 -1442 3716 3561 2768 650 -4631
826 -4631 -4553 -726 1571 4134 4514 -794 -3683 -3758 -2785 1765 4913 2765 834 -2321 -5629 -2363 2097
843 2097 2875 4200 1541 -3827 -4173 -1980 -180 3858 4860 227 -2013 -3263 -4347 427 4405 2917
859B917o78l122m205J830L954J545J864j204n368j140P92J177M658J825l159k401
875g15k294j633L780L924P8j59k932m486P80K810J987K817k94m624k065j41M69
892b698M269K762j712k147k906k087K368L583J776N05k733m040n16J348K218L806
908C796N2l327k111j900L0M093K934n08j122l213l054J633K989J909J929j891
924B239m140j346M59J620L621J614k249k479k556n06K802L057J212n04k935l447
940c538J21K082L145J926j025l207j951j066J184M011J776q47k199k604j601J806
956a987L125J891J39k213l371r07J179K619K477K39k140l055j554R91K996J995
972B424J035j714l501j556P81K253K611J362k091k894j776O5K397L174M78j226
$$ plain form
859 2917 2239 -883 -5088 -3258 696 2241 4105 2901 -2467 -3607 -2815 -1638 3020 4845 1686 -715
875 -715 -3009 -4642 -862 3062 3140 2981 49 -4437 -3657 -847 1140 3957 3663 -961 -3026 -3167 -2698
892 -2698 1571 4333 2621 474 -2432 -4519 -2151 1432 3208 3713 980 -3060 -3576 -2228 -10 3796
908 3796 3848 521 -1590 -3490 -3460 633 3567 3059 1937 -1276 -4330 -2697 292 2201 4130 2239
924 2239 -1901 -3247 -2788 -1168 2453 4067 1818 -661 -3217 -3723 -921 2136 3348 2844 -91 -3538
940 -3538 -3417 -1335 1810 3736 2711 -496 -2447 -3513 -2329 1682 3458 2611 412 -2192 -3793 -1987
956 -1987 1138 3029 3168 955 -2416 -3323 -2144 475 2952 3191 1051 -2004 -3558 -2567 429 2424
972 2424 3459 1745 -1756 -3312 -2531 -278 2333 3695 1604 -1290 -3066 -3001 -604 2570 3048 1822
988A822k311k462m46K766K638J252p64l042k242m42K098K522J998q02l011k159
1004b585l24J396K748J969m35k734k349q59J601K600J831k8j979k761j302J384
1020a827K513J763O47j972k821j575J173K176K715L64k202k425j451K92K478K870
1036B718J47j801j770k030j26K852J985O38p31k377k481M99J894J900J737m92
1052B562l127k112K19J342K484J948j150k560j972p79J859K905J269j016j490
1067C82k261j145J682K429J094J48j535k912n33J146J707J966Q01k097k566p80
1083b474J04K317K949M0k213j792j497J9K700K295j1j470j726k125P71K436J166
1100A489O61r5k876j994J056R97J473K469r46l028j372l66Q33L428J630j885j605
$$ plain form
988 1822 -489 -2951 -3397 -631 2007 3259 2495 -547 -2789 -3231 -1133 1389 3387 2585 -426 -2585
1004 -2585 -2909 -1513 1235 3204 2769 35 -2314 -3173 -1572 1028 2859 2831 852 -1909 -3211 -1827
1020 -1827 686 2449 3096 1124 -1697 -3272 -2099 77 2792 3156 954 -1471 -2922 -2630 -152 2718
1036 2718 2865 1064 -706 -2736 -2862 -10 1975 2613 1882 -495 -2976 -2477 -583 1317 3054 2562
1052 2562 -565 -2677 -2458 -1116 1368 3316 2166 -394 -2366 -3145 -1286 1619 2888 1872 382
1067 382 -1879 -3024 -1342 1087 2181 2329 794 -2118 -2651 -1505 202 2168 2969 872 -1694 -2474
1083 -2474 -2370 -53 2896 2936 723 -1069 -2566 -2547 153 2448 2437 967 -759 -2884 -2113 323 1489
1100 1489 2150 2055 -821 -2815 -1759 -762 711 3180 2234 -794 -2166 -2532 -1699 1729 3359 1474 -131
1117a31j647j440K004L397Qn77r67l007m81K644R09R19R77k225k460L34J58J295
1135b90K815J06k191j483j416j67L011K215k84j207k257j804J002K639J284J92
1151B165r76k545j366J097J840J062R90q25k281j157L77Q06J666J932j040k070
1167c25j184j115Q81L487J162j757q43k138j664L050K506k72J27j562l094N11
1183b230K268J71J652O44k971j099N03o75J823K489q23j296r36k140M70K928R55
1200A733K24l77l017j704K000J401J360R79j539k601m56O58J198J703M31j020
1216I73j592j076N2R20J802J036r23j436j127r73J145K663P76q56j035k359o44
1233b654K384J498L00P77k517k498J235R41O09K253l18k782q2n20o37K638J611
$$ plain form
1117 -131 -1778 -3218 -1214 2183 2191 1614 647 -2360 -2841 -197 712 1631 2608 383 -2077 -1743 -1585 -290
1135 -290 2525 2631 440 -1043 -2459 -2626 385 2600 2316 1109 -1148 -2952 -1950 689 1973 2165
1151 2165 1189 -1356 -2722 -1625 215 1277 2267 1442 -839 -1996 -1619 -813 853 2785 1745 -325
1167 -325 -1509 -2624 -1743 1744 2906 1149 306 -1832 -3496 -446 2060 1788 1915 353 -2741 -2230
1183 -2230 38 209 1861 2505 -466 -1565 -1062 -1737 86 2575 1752 456 -480 -2620 -2150 778 1733
1200 1733 1957 1580 -1437 -3141 -1141 260 1620 2599 1060 -1541 -1997 -1339 -141 1562 1993 973
1216 973 -619 -1695 -1643 -723 1079 2115 1192 -244 -1371 -2344 -1199 1464 2240 1384 349 -2010 -2654
1233 -2654 -270 1228 1528 2305 -212 -2710 -1475 -534 75 2328 2010 -772 -854 -1374 -2011 627 2238
1250B238j338l1j381k152J167K332L49R15o17l025o73J077R20K001R46k354j542
1267a168l86k71J723K107l54j012r30j603J78J517J296O95n40j400j441k70J046
1284h13K135O24o06j285j731l60J515J410R84J20k229j761N19N27J454J772r31
1301A344j631n20j001K58K606N44o32J64j966j781J941R84O36J143j103k590O4
1318a540N62O41K073N07j950j057p15k70J682J652j97n09j281j489N68J219P90
1335F86J232n04j982j027J53P62J531J061o31j530j359k62J317J394P45j73j491
1352g8j446NP05J508J087l84j347r29q18P06J729O60r3q35j560p33R93J009R35
1371A114Q83j356j825k41K6J361J873j10j423o96j228J06J672J057K23m95j493
$$ plain form
1250 2238 900 869 -512 -2664 -1497 835 1184 2099 1482 -1543 -2216 -1139 -219 1782 2728 374 -1168
1267 -1168 -1554 -1825 -102 2005 1651 639 -291 -1894 -1716 -199 1097 1792 1252 -148 -1589 -1859 -813
1284 -813 1322 1946 1340 55 -1676 -2036 -521 889 1873 1993 -236 -1997 -1478 -951 503 2275 1344
1301 1344 -287 -807 -1808 -1550 1056 1600 968 1132 -834 -2615 -674 310 946 2089 986 -1604 -1540
1318 -1540 -978 -337 1736 2243 293 -764 -1479 -1749 -67 1585 1388 879 -402 -1891 -1323 -104 686
1335 686 1918 1414 -568 -1595 -1442 -680 851 1912 1281 -249 -1608 -1870 -553 841 1586 1413 -78
1352 -78 -1524 -1519 -814 694 1781 1397 50 -879 -1697 -991 738 1398 1305 470 -1090 -1823 -830 179 1114
1371 1114 1997 641 -1184 -1425 -1399 -38 1835 1725 302 -394 -1622 -1516 156 1213 1436 941 -552
1388e52j221L80J401R12P36o13j587q60k2R49J478O26p11j197j090j71J002J288
1406G48P63j94j440j195k47R39J267Q39m44p57j414m59Q66J320R10j63j013j394
1424a068l28M98J040J259J11j215j078p87M22J269J155J05o89j371q89M09J225
1441F8J212P6p09j302r53M02R06J136O16p24j075j108J23R71J215O88n84j049
1459i1j149k64J024J323N96n18r37j092m77Q73J469O24q9j126j439j47O36J377
1477E93O84m5j058j325k17L94J301R67n9r56r16q27N60J109P05M96r19j204n76
1496a293J52J174J133Q3n59r98r84J00J223P99L43m96p47j224n1R13J347L96l78
1515I33j116j017k6P27J332M31n36q49r67j14N56J245M40j5r05j222r8M58J203
$$ plain form
1388 -552 -1773 -1393 8 920 1656 1043 -544 -1404 -1426 -477 1001 1627 916 -281 -1371 -1542 -540 748
1406 748 1511 1317 -123 -1318 -1565 -626 641 1480 1036 279 -1135 -1594 -728 592 1502 1339 326 -1068
1424 -1068 -1396 -898 142 1401 1512 297 -781 -1568 -1146 123 1278 1383 694 -677 -1566 -1157 68
1441 68 1280 1356 647 -655 -1608 -1206 -300 836 1452 728 -347 -1455 -1332 -361 854 1542 958 -91
1459 -91 -1240 -1504 -480 843 1439 921 -16 -1108 -1585 -712 757 1381 1292 166 -1273 -1420 -784 593
1477 593 1277 1232 174 -1151 -1368 -974 327 1294 1235 279 -637 -1464 -904 205 910 1406 487 -717 -1293
1496 -1293 -1141 33 1166 1249 690 -308 -1292 -1192 31 830 1173 677 -70 -1294 -1345 -432 915 1311 933
1515 933 -183 -1200 -1226 -499 833 1264 728 -121 -1088 -1202 -646 599 1039 1024 119 -1103 -1201 -743 460
1534D60Q33j18j168q59k15K8J362R17j98q34p95p51N29J011P91J82o05j249m87
1553a166L38P15J335M0r23p90o08j23Q66J290L71n84j232o74O8Q45J022M29l92
1572H27j096p28r7P82J098L75m79p87q65j84O73Q70Q54j91r96j056r3K10J267
1591C84Q59k27j019n88n96J95J525N19n9o31j268m27P40Q92N76K78p85j183n0
1610h65J97N23J013M27j048o85m73j64P83J213K85o01o62q76k12J011R87K09m68
1629E94j112n99L51N11P53N44l39j050n74n5M32R71P99m54q61n72k73J01J190
1648C57O51j48p83r90n10Q63J000M93J13j003r33l63P39O30P00L40j109p94j59
1667i06K12P16R65K0q68l53o15j33Q71J067l7k37r94p53J80R89M30N76l68j306
$$ plain form
1534 460 1293 1175 7 -852 -1067 -1039 323 1240 1042 208 -587 -1338 -809 202 993 1175 570 -679 -1166
1553 -1166 -828 -113 1222 1262 339 -451 -1059 -1182 -316 974 1345 761 -471 -1145 -1077 -232 790 1219 827
1572 827 -269 -997 -1094 -312 786 1161 682 -105 -970 -1154 -481 389 1243 1052 56 -1000 -1093 -883 384
1591 384 1243 1016 -3 -591 -1187 -992 533 1052 993 362 -906 -1333 -593 299 875 1153 368 -815 -865
1610 -865 -668 -145 868 1295 247 -438 -911 -1075 -292 921 1206 605 -57 -933 -1145 -134 853 1062 594
1629 594 -518 -1117 -766 -255 498 1042 703 -347 -921 -976 -544 427 1226 772 -89 -661 -934 -833 357
1648 357 1008 860 77 -913 -1423 -560 440 933 1046 43 -890 -1253 -514 116 816 1156 47 -747 -906
1667 -906 -694 22 987 1007 139 -214 -829 -962 -91 976 939 702 -292 -1045 -865 124 554 1130 762 -544
1687e44n35L37N62L74R05l40j162m29K9N03R93M61n35m57p23m60N54R28J61K06
1707H28m02j294m37R04N64M95L65q43j099N2L11P19Q80k07p75n72l18J06Q52N06
1727F35O0l54o12n88LP56P18K25j66j103p97N57P63N31L65l69j051n58M10L43
1747b32Q16M95p80n33j43n16N12J111P6k98k61p86n42P12P29K99K23o16j188M3
1767h79M28N10P77J04j057o27j43K70R24P23l68n07m40m60K06R24K80j63Ko57
1787a53q22M21O05N18K13j79q76n09rN86Q69L50o83o70m70mO54P46J77n86j51
1808B7o27l71Q49P82j41j28l01q95P7N25M45M65J54p83p75j57L85N56Q57k83o31
1829C0m01m98L57Q79M91m48k52o32j36M8P36L95J70m65p50k77L37K52P67M26o86
$$ plain form
1687 -544 -1079 -742 -180 194 1099 759 -403 -832 -803 -300 693 1154 619 162 -561 -1021 -467 461 622 828
1707 828 426 -868 -1305 -401 163 658 1023 180 -919 -867 -556 163 1043 836 61 -511 -829 -723 129 635
1727 635 695 341 -271 -859 -856 -100 618 843 677 -426 -1223 -666 97 628 993 624 -427 -985 -575 -232
1747 -232 584 1079 299 -234 -377 -893 -381 730 806 508 247 -539 -1081 -369 360 659 882 266 -922 -879
1767 -879 -451 59 836 940 -117 -744 -887 -617 307 1030 662 155 -285 -745 -539 385 665 502 504 -153
1787 -153 -975 -554 51 569 782 603 -273 -782 -791 -205 664 1014 331 -339 -809 -813 -159 587 764 178 27
1808 27 -600 -971 -122 660 519 391 90 -805 -728 -203 242 707 861 78 -697 -854 -469 87 944 661 30
1829 30 -371 -869 -512 367 858 410 158 -474 -610 -562 174 569 739 274 -476 -753 -416 -164 603 1029 343
1850C43p14l98J23N07P47K46m92n20m52j51O18Q24K02m10n85p58L18N25M31L15
1870G19k48o75l42k3K48O29N22k70m25n32k91L26O90N26r8o34o59k85L56N85N48
1891F67q7m64o79l66O43L07N92j7l70p77J06O0L86P17n6l22m59n20J3M33R55l2
1913G30m07l36p69J61M83O25J62j69n60p31L76N40J59M91p7q54m77%K18P08L39
1934F12j57m77n88j86N16O61K39l8n45o73j59M29O44K36L8n04n46k19K68N10M66
1955E27M3m01o26j65K73L89M60N9m01m62l55J42N62O71j42j38o28n22K17M43M31
1976C77L96k98p31k98j19O06M28L88k71q37Kj28L17O89J81l17k91p11l4N17N36
1997D02J47J4o29l50j71J71N92N45k18l18o24l28L43P40K06n4k44m92l09L36L21
$$ plain form
1850 343 -371 -769 -646 -139 608 854 362 -158 -610 -761 -143 681 883 473 -112 -870 -552 -27 404 719
1870 719 471 -204 -546 -569 -321 308 830 560 135 -397 -688 -362 328 854 756 122 -537 -822 -466 119 667
1891 667 580 116 -563 -929 -286 21 613 596 226 -551 -445 -385 1 718 662 340 -119 -639 -626 -193 762 730
1913 730 323 -13 -782 -621 -138 487 649 480 -80 -811 -435 105 264 755 678 -176 -653 -653 -435 273 612
1934 612 455 -22 -610 -796 -280 381 620 582 37 -636 -795 -366 278 514 552 48 -498 -717 -449 61 527
1955 527 570 169 -457 -622 -349 40 500 559 158 -304 -659 -517 45 716 574 436 -192 -714 -497 -54 377
1976 377 773 475 -256 -554 -673 -67 361 749 478 -359 -357 -485 -168 521 702 385 94 -617 -651 -134 402
1997 402 549 563 -66 -416 -587 -416 176 721 503 185 -439 -767 -424 316 522 468 224 -268 -577 -241 80
2018H0L10L22o04n91kj71O89M49J17j46p92m56K25N72L63L18m08n49k79J57K46
2039a50N11M00m14o03k16j67L76O71K8M2m07m44j60M04J96M21l5o15l68N1L20
2060a59L75N15o8p20k44l69N76L53M02k84l81n44k97N03M71L29J41m79m63k44
2080e87J47N47M63O8l65m89l28M5L75O22P8m21m95m4l1L05M95L36n66m01l18k03
2102g67P79K83LJ71o63n90L24L05M32M52k73n40k48j54M04M13L03k45k81o03q5
2123e80L08L51K89N6k77m07l45J21O55K88J0m78l15l97M24L82M25K8l15n69l67
2144g13J83L76N15Ok09m89j45j31O08L07J82j58m20m63m9O80J87K44j51l33n00
2165d73J9J89M90L84k23o10l29O9M24L43K77j43n33l88o6M69M93P7n7k11n87j29
$$ plain form
2018 80 390 712 108 -483 -485 -656 33 482 599 453 -339 -795 -570 2 365 683 275 -274 -553 -396 -150
2039 -150 361 761 347 -256 -472 -639 -263 408 436 478 71 -373 -533 -129 67 488 453 -162 -530 -479 -159
2060 -159 216 731 663 -57 -301 -670 -94 259 661 377 -4 -548 -845 -342 129 458 599 120 -343 -587
2080 -587 -440 107 570 638 273 -216 -544 -499 -124 498 576 155 -340 -384 -415 -110 385 721 155 -246 -564 -767
2102 -767 12 295 298 469 -194 -784 -460 -155 277 729 456 -84 -332 -486 -82 331 634 389 108 -495 -580
2123 -580 -272 79 368 424 147 -260 -605 -484 171 459 469 -9 -324 -721 -297 85 510 538 223 -346 -713
2144 -713 -530 -154 361 367 158 -331 -476 -607 1 308 490 332 -88 -551 -600 80 267 511 360 27 -473
2165 -473 -454 -265 225 609 386 -224 -553 -484 -60 283 560 417 -116 -504 -570 -101 392 469 412 201 -386 -515
2187e15J73M47M11J9m04n13m0J30N37R5J00m47k83j92l2O27L18n3j62m33k96L8
2209d75N14K99K76l88k82n26L07K61L19K32o1o18m04L1L67N04O4k36k95l34q3
2230e28L90L92J89j15l01n47q9N66K37K90o8m92k93j43L11K75N43l0p53l00q0
2251e46L00L67M68j20l67l76k77J71O48K35p4j45m03l42J21M03K65K94k24n63
2271a65l31L0M25N17J78l83n05k11n1K25R16j2n44j87l86l2L87M00K30j14k74
2292A13o73L2L05J69M01O7l73n12J66q7M95N45j69m75k10m23J67P77J90j00k54
2313A51l86l85L48M32K65K9l35n34k16K54L70L16K29l48o09qnM00N30N7m83k08
2335a36l41l1O04L14M5k11l58l56j9N15J78L00k39k71l95jK92L02K85M6o15m66
$$ plain form
2187 -515 -342 105 516 535 131 -382 -422 -292 245 340 440 -7 -290 -482 -514 113 431 378 216 -217 -513 -475
2209 -475 39 338 614 226 -56 -582 -275 -14 305 537 476 -142 -546 -515 -148 356 420 184 -111 -445 -528
2230 -528 -138 254 443 328 27 -520 -609 -43 194 484 416 -76 -369 -512 -201 74 617 587 -166 -466 -546
2251 -546 -246 121 589 469 102 -274 -551 -380 268 503 429 284 -119 -461 -340 63 328 622 398 -165
2271 -165 -496 -466 -41 476 654 271 -234 -445 -496 -271 645 633 89 -98 -484 -516 -129 271 501 387 113
2292 113 -560 -528 -223 -54 347 414 41 -471 -305 -392 103 648 479 4 -206 -629 -462 315 505 405 151
2313 151 -235 -620 -272 160 425 454 119 -415 -631 -377 -7 309 538 190 -419 -427 -432 -32 498 555 72 -136
2335 -136 -477 -508 96 410 455 244 -114 -470 -489 26 204 504 265 -6 -401 -402 -110 192 477 523 -92 -558
2357e58J77Q3M03M30k16m83l35j9O8Q20j7J39l70m94k41N04N37J4K3l73m20p8
2379d06J21L32M64k0l90l20k41M7K35O41j66j55k28l59J38K85L71Q1j72l36l80
2400d58L6L62M64O7j74n42k72K06RN70K31l93l00j06l29M01M35M59l91j76m58
2421c59j8K67O18j0k50j07o65J9K96K79M43Mn58k24l12J99M85L62j38k78j52l47
2443d46Q0P20K6J20k38n73k65L16M52K60R5j49n84l89K13L53K87J15k1o15k09
2464d52J32K50M83J36l66k33l97j07L10M95J81m6j54o01k74N55L29J89M1m93j73
2485a95j98P2L92L63j31l48k75r4J23M53M28j77l04l21l46L13L64J07J93k18m65
2506b64j04N1R5N24K37k71l99l67m7M95L89R9l31m09j18m3L46K99J31l7m42j25
$$ plain form
2357 -558 -381 -298 105 535 319 -164 -499 -518 -450 370 353 492 122 -372 -613 -109 428 442 465 92 -328 -406
2379 -406 -285 47 511 491 101 -219 -460 -413 -178 463 297 142 -86 -445 -307 -22 349 430 258 -78 -458
2400 -458 -422 -60 404 471 297 -245 -517 -311 -302 268 499 106 -194 -300 -629 -228 207 666 275 99 -359
2421 -359 -377 -110 508 498 248 141 -524 -505 -209 70 513 517 -41 -265 -577 -378 107 469 331 53 -99 -446
2443 -446 -366 354 380 500 262 -311 -576 -260 192 452 547 398 -186 -575 -362 -9 278 393 372 -243 -452
2464 -452 -320 -70 413 549 183 -50 -447 -554 -244 251 432 386 232 -369 -643 -88 241 430 471 -22 -195
2485 -195 -393 -321 71 434 303 -45 -320 -414 -291 162 590 413 109 -212 -558 -245 119 226 419 201 -264
2506 -264 -368 -317 -222 302 539 268 -131 -498 -545 -50 339 438 107 -302 -420 -463 -117 182 313 276 -166 -291
2528b91k05K07O78Op2k52m58K8MO75J79k70k25l93j01K95K39M43q3k17n02l21
2550f36M31K87L43J30m45m79j84J65L66L78L7k38l47l73K31J99N65l2l17l19l01
2571e39J65L03L35kp5k17l72J02L19L68K16l26m49k40k08N42K38M01l5o91k65
2592d30M1K96J26M77o4m26l76L8J47M20K28q9m89k42j65K64L53L26N8l20n09j37
2614d73R1M09L70J62m63l58k67J82M86K01J14j76o02j8q5K57L93K83l61l22k61
2635d38N7J86N79K17r9o36n53K41L14N85nj58m54l04pJ20M80M08p7l99m89j34
2657e66J16N50L32O4m74l85j90K71N83J96J05m42o10L7n1N51L49J18l93n33j10
2678d82R9L67L61K07l77l43j75J10J42K93J41j05m92l2j95L73L85J76q9o22k02
$$ plain form
2528 -291 -496 -289 389 395 323 71 -387 -359 -355 320 499 229 4 -389 -490 -195 44 487 404 187 -315 -636
2550 -636 -205 82 425 555 110 -369 -553 -388 -22 356 393 155 -192 -565 -334 -135 430 398 81 -238 -539
2571 -539 -374 -71 264 262 187 -30 -402 -300 19 387 603 277 -172 -412 -620 -78 160 561 526 -165 -430
2592 -430 -389 -93 33 510 446 20 -356 -318 -171 249 477 388 -101 -343 -508 -244 109 435 493 173 -336 -473
2614 -473 -382 27 397 559 96 -262 -529 -347 139 340 454 278 -324 -342 -427 -170 223 506 145 -177 -438
2635 -438 -381 -195 384 601 502 -134 -687 -446 -132 453 448 290 -164 -468 -475 -355 125 533 456 57 -432 -566
2657 -566 -450 100 432 496 22 -363 -553 -282 301 497 602 160 -450 -413 -464 87 436 554 161 -372 -482
2678 -482 -383 -16 345 552 175 -168 -343 -233 -91 202 343 238 -254 -286 -481 -108 277 453 364 -258 -460
2699d60j6N13K01K31k52k00k94k18K60N21J97k22k94m07n6N44Q0J11L10m38l92
2720b81j87J16M02L43J58m99m06k26L08M64L54l3l15l78l30J9O81N8J48j65m17
2741a86k56J23K33M87k4j74l44k17L4K45M62J58k60m76j14j88K85N93J24j91m03
2762h9k63M4J95J74L89Nn43k20j63J55L96M00j00l78l98o9K08K32M62J01m68k98
2784b28l50M49L40R6J50m49j42m73K85L40L07M8j05n21k62J22N59L19k7j66l69
2805g7k31j16M20K74L76l69m28k58kM03L89R7l36j6n40k46M40M72or6j34o49J53
2828d80K55L40N83l12k39l42j77J91J56N08j91k25j41l44p3M84M80k12j16l33
2848a88l05J01L81K97K30l60l40k42j9K47N18K27q8n57k33P9J80L14K06j82j79
$$ plain form
2699 -460 -476 37 238 469 217 17 -277 -495 -235 286 483 261 -33 -440 -496 48 128 239 549 111 -281
2720 -281 -468 -352 50 393 551 52 -354 -580 -272 192 546 513 198 -180 -510 -491 190 248 396 231 -186
2741 -186 -442 -319 -86 401 377 203 -141 -358 -324 -79 383 541 281 -195 -309 -497 -212 381 505 314 -89
2762 -89 -352 -308 -113 61 450 455 -88 -308 -471 -316 80 480 380 2 -396 -465 -257 -25 437 538 70 -228
2784 -228 -578 -129 211 307 457 8 -134 -607 -322 18 325 373 268 -253 -515 -393 166 485 458 292 -77
2805 -77 -308 -424 -4 270 646 277 -151 -409 -411 -8 381 478 142 126 -414 -660 -220 252 246 150 16 -633 -480
2828 -480 -225 115 698 386 147 -195 -372 -181 -25 483 292 67 -74 -418 -491 -7 473 261 145 -188
2848 -188 -493 -392 -11 286 516 156 -184 -426 -445 -198 320 547 459 -98 -331 -252 -72 242 448 266 87
2869H7o55M1N42J31K11k43j39k11j23L00K57J87M2m72l49j26L47M75J13p7k59
2890G9m59j19K17M98K24o8p9m19l18J14M71K18J21k89m75k60Q9N69J59K62m15
2911A20m82n8N2K49M56rj23l58l32K13J24M12jOk36l69j5K24L43L62j89m16l76
2934d03n9L08L69M37l39m98m9q9J92K44L51k6l36l94j97J66L92J80jj30l69m71
2956g22M76K91K45K80l67m90q7O8K57M93J07l09l77k36N5L57L18J36l70l23j05
2977c03j00L41M09k9r7l38k74R7K84L19QQ1n82k01J6K85K30L43j36l15l13q2K86
3000g1J51L35M2l30l83l41L72L11J38J82k58m85p5K08K52M65p7k60m40k52J53
3021c63M09M35m2j96n21j15N5L09K21J82o1m82j93j30N36L29K4n2m08m54K29K66
$$ plain form
2869 87 -568 -527 15 146 357 114 -25 -236 -359 -59 198 385 427 -45 -394 -520 -173 302 415 338 79
2890 79 -380 -499 -282 216 440 372 293 -126 -444 -330 141 359 480 191 -284 -544 -455 114 273 535 120
2911 120 -362 -420 -368 -119 337 328 205 -153 -485 -272 -148 264 263 269 33 -336 -351 -127 216 578 389 -27 -403
2934 -403 -462 -154 215 652 313 -185 -234 -323 -131 113 464 438 102 -292 -489 -323 69 249 248 118 -251 -722
2956 -722 -246 45 290 570 203 -287 -374 -306 -49 444 551 242 -135 -371 -316 41 359 495 125 -198 -303
2977 -303 -403 -62 347 318 221 -117 -391 -294 -10 309 317 398 -184 -385 -369 -84 146 489 353 38 -275 -357 -71
3000 -71 80 415 457 127 -256 -597 -225 86 224 406 148 -337 -412 -204 48 513 436 176 -264 -516 -363
3021 -363 46 481 439 243 -278 -393 -338 -29 192 374 313 -169 -362 -492 44 373 397 345 -63 -517 -288 -22
3043b2R3M46j4o10k81J49J26M42P1J94m58n37m5K26L90J15J42l58l89k09L45J73
3065a1K32J99m08l71J5q8M55K66K44l93k42l86L02K52L60k8l41j16m20P6L76L65
3087C38j61J38m49k91K6J28O47m6o7m93k22l1L29K95L75k44k90j59l96M65M11
3108C03K1O7m05l39l1J92K38K19R3l54k28l89L60L28J80R1j87m72j68L05O9L88
3130B81M0l7n08n35M10K24M10L5k6l65l89Q8M05L25m4k22k61j45P3J16K69J75
3152C19l4l65k97rK79L76L3j05k48j65m20M68L84R2R1l59l67J18K8K94K05L9l17
3175D0m09QL52Q8K17k0M2m65m13K99L96J69Q6l12m23m5p7L61K73K47l83k95KL9
3199b23K13K22L39l83l74j64l4L89K63K86l85k93j14j70K92M96J08k19l85l42
$$ plain form
3043 -22 71 517 503 -107 -388 -239 -113 329 400 594 136 -401 -446 -220 170 285 427 69 -320 -529 -184 -11
3065 -11 221 420 12 -359 -344 -432 23 289 533 140 -102 -488 -186 66 426 398 57 -59 -479 -403 -27 338
3087 338 177 315 -134 -425 -399 -271 376 330 263 -230 -452 -483 -154 141 516 272 -18 -177 -573 -108 303
3108 303 324 391 -14 -353 -384 -192 46 265 358 4 -224 -613 -253 75 255 346 159 -313 -481 -176 -107 281
3130 281 321 284 -224 -759 -349 -125 285 320 294 -71 -460 -372 33 358 314 92 -169 -314 -241 -125 144 319
3152 319 285 -80 -377 -386 -107 269 302 197 -51 -216 -636 -168 216 308 399 40 -327 -209 -181 113 318 357 40
3175 40 -369 -361 -9 79 296 276 318 -147 -560 -261 135 304 390 78 -345 -390 -467 -106 167 414 31 -264 -262 -223
3199 -223 -10 212 551 168 -206 -370 -404 -15 248 534 149 -144 -258 -428 -136 360 468 249 -136 -478
3219d78J21J13M33J77m5l37l11j7R6K09N83j68l51j58j82J50J57M78k98M1l91
3240a78j65rM77J76K8k41l87j35K01L81J64J71l04k62k37PK73K61O8q7k65j39
3262b02j1J15L07K45j77l97k58n7M48M21k4K6m97n19K53K35L47K76k77l69l43
3283d58J99J36K39L11q3l31k25l10L43L19K74l6l63k41m6J1M07J73O1k30n50M1
3305c59K49J81J75K43j83n81O6p4K21K61J98j87k11l01o9K69L39J56j67l00l24
3326c98J40K76K16K02k36k57l09J52Q3L26J79r3r3o96J17L38K00L06j63k87l18
3347c15k19L98J62K91L6k15l73j45m4N66j19M45l67m92p9O2N41L02r9k98j00k82
3369c44k8K41M17J44l46m41m9K8N49l5K33j84k54l67J50K69j5M12k62k51j56L4
$$ plain form
3219 -478 -357 -244 189 366 321 -16 -327 -344 -248 -39 544 376 25 -133 -315 -165 -8 470 172 213 -178
3240 -178 -343 -352 125 301 329 88 -299 -434 -233 148 312 483 179 -83 -320 -313 -40 221 289 202 -63 -202
3262 -202 -213 -98 209 454 277 -120 -378 -435 13 434 410 436 -61 -580 -327 -92 255 531 254 -115 -458
3283 -458 -259 -123 116 427 344 13 -212 -522 -179 140 414 378 15 -226 -272 -261 146 319 380 150 -400 -359
3305 -359 -110 71 246 489 306 -275 -209 -283 -62 199 397 210 -1 -302 -371 -102 237 393 226 -74 -398
3326 -398 -258 18 234 436 200 -57 -366 -214 -131 195 374 281 188 -508 -391 -53 147 453 290 3 -315
3347 -315 -534 -136 26 317 353 138 -235 -380 -424 142 23 468 101 -391 -470 -408 133 435 336 38 -62 -344
3369 -344 -372 -131 286 430 84 -357 -406 -378 171 136 369 185 -69 -436 -286 -17 -32 380 118 -133 -289 -255
3391b55r4O30K20j32l87m35N9LN06J73l7k83k09k30J33N84P3k3j41l37k52K03
3413b31L59R1M0j66l65p1l5L65M52j02k08k79M8k87M45K21L9j37k04m72N0L16
3435a31L75P7j37k41m13K1L74J23L17j66m54j6p1j9N99J91l16n0k79k07L53J19
3457D9J57K14m93k52R8P3N5K60P3m2m62P9k3K13M25j45j76k86l75K72K49L20J05
3480C88j25k16m63J58J49L66K04k52j75n29J66Q8M33K15l30l30j04K7J6O00Q3
3501C69L6m18k46j24K56K95L12k92j36n39J01K20K07K08L5j30l52j10J82R8L30
3522C02mj69l75j51L4M32J47j48L4l34k07J04L76J30Qr3l44j85J46J87L82J5j66
3545A21k81k20oL98L40pk7m77j28j7J95M74j5mm78l26K61J58K46O2L6n29j48n2
$$ plain form
3391 -255 -349 281 501 369 -18 -453 -394 -391 115 288 251 -32 -241 -471 -338 246 319 296 155 -182 -434 -231
3413 -231 128 219 259 93 -272 -343 -378 -13 439 337 129 -150 -102 -389 56 277 316 179 -25 -497 -447 -131
3435 -131 244 321 184 -57 -470 -449 -75 48 365 199 -255 -271 -342 -361 238 429 113 63 -216 -423 -70 49
3457 49 206 420 -73 -325 -227 -154 -99 161 234 192 -270 -191 -214 -1 424 279 103 -183 -558 -286 -37 283 388
3480 388 263 47 -416 -258 -109 257 461 209 34 -495 -329 -241 192 407 77 -253 -357 -330 -314 286 369
3501 369 405 -13 -259 -383 -127 168 480 188 52 -487 -386 -166 41 249 284 154 -198 -308 -126 -28 302
3522 302 298 129 -246 -397 -363 69 216 68 102 -232 -439 -335 41 171 179 86 -258 -443 -297 -110 272 287 121
3545 121 -160 -380 -386 12 352 345 318 -159 -287 -304 -109 365 350 346 -132 -458 -197 -39 207 269 305 -224 -372 -424
3569d24K43K70L99l31j60k38p2O3L65K45j44k30j29k47K21J33L26k6j63k69k67
3590d35K91J74K04k41J23j49j23r8K97K31J4L6l96k18m9L34L45n9j09j83k14r9
3612c24J67L11K37l6l18k39p6Q0L04L02j53l56j26j08J10M09J9J03l49l59N4K28
3634a20J24L12O9l73k52q3M8J78L35N7j43l11l56R7L06K48K69j85k37k08j59M05
3656B1K25J18j67k83l40k4L13K58K14j4l95k24o8L13J16K98r4l73j07j24L63k6
3678@K95j48k88j75J15MK49K35j43r5l17J26q2J31L77J10m24j19k63J73J95M03
3700C59o9j52o8m19R0J82M82o9k02k83j36pJ35L57J4qm78qk9L09L24J8o1k22k12
3725a53q5K18K03K44j09j83l94qK33J42J99j4k25l48k2L8O28J06j03l04k76j51
$$ plain form
3569 -424 -181 89 488 157 -3 -241 -313 -250 115 360 216 -14 -143 -390 -169 -36 290 264 101 -168 -435
3590 -435 -144 30 234 -7 116 -33 -156 -254 43 274 288 324 -72 -290 -339 -5 340 281 172 -11 -225 -324
3612 -324 -157 154 391 355 37 -202 -278 -198 106 408 255 -101 -227 -335 -225 184 203 306 -43 -402 -348 -120
3634 -120 4 316 385 12 -240 -323 -275 -97 238 295 152 -159 -515 -418 -112 136 405 220 -17 -225 -384 21
3656 21 246 364 197 -86 -426 -450 -137 121 335 321 -74 -298 -366 -53 63 361 267 -106 -213 -337 26 0
3678 0 295 147 -141 -316 -201 -197 52 287 144 49 -268 -142 -224 -93 284 394 -30 -149 -412 -239 -44 359
3700 359 290 138 70 -349 -259 -77 405 336 134 -149 -285 -292 -157 200 214 206 -272 -280 -309 0 324 342 281 59 -153
3725 -153 -238 -20 183 427 318 135 -259 -267 -34 108 307 293 68 -280 -302 -264 364 470 367 63 -213 -364
3747c64K90OK02J62m71N2j86O0L64J04J88k06j78l66J36J81K80J03k56k60m7J0
3769a96l2M38J89k53k39j93L2J92J77J46j36j92k37rP6K58K76j23k66j07j27K38
3791h8K74J29Ml16k02j20P2K80K58n8j37k76r7K74MK21Q4j29l68l34M31J20L35
3814C61J2m07k7k75OM37M7P1j2l25j36nM04j62K49N0l20j58k53L68K68L72m39
3837A26k88j33QJ88J81K00K02n09l38J60m5L87j4P9q3l09K7J60Q2J13p4J31m96
3860b45q1J76R6K84k4k8l15j62J97L10O7J06k55j77j76j55L76K93N1j05k85k36
3882b88o9L90R3K83j75k15j63p9O7K11L65l46r6k96Q0K2M22J96j29j95k69N2j62
3905c01M57K68j63k59j37j67J75L10K20k09p3m60L1Q0J13K12K61k23k84k14P6
$$ plain form
3747 -364 -74 -68 134 296 -175 -123 -309 -249 115 219 407 201 23 -343 -207 -26 254 357 101 -159 -206 -196
3769 -196 -228 210 399 146 -93 -286 -254 -62 115 261 125 -67 -304 -313 -237 21 297 174 -92 -199 -326 -88
3791 -88 186 315 319 3 -199 -319 -247 33 291 233 96 -180 -277 -3 1 222 306 177 -191 -525 -94 26 361
3814 361 373 -34 -61 -336 -330 107 154 225 213 -112 -248 -253 151 -11 238 288 -32 -190 -443 -75 193 565 126
3837 126 -162 -295 -287 -99 82 282 484 -25 -363 -203 -248 139 125 204 121 -188 -161 -1 81 194 120 251 -245
3860 -245 -326 -150 -54 230 206 178 -137 -299 -102 208 275 381 126 -51 -227 -382 -6 287 338 233 -52 -288
3882 -288 -357 33 126 409 234 19 -144 -223 -156 55 420 74 -22 -318 -238 -216 206 402 273 78 -191 -139 -301
3905 -301 156 424 261 2 -135 -302 -127 183 403 194 121 -339 -308 -228 -115 97 358 135 -149 -363 -287
3926b87J30L59N6j59k98p7K56J51K7n1j47k09n8JL06K40n0R2l91K7j71K01K06
3949A54J00m6j44k50k37K75J97K55r5k34k14lJ4L00L7K20k88l37q7J07K67L65
3971C56k0l27j03j01L8L98p9P4l3m32m5Q1J26J56J70l03J3l07m3M08J14J71j20
3994A92j89k17q4J36M34j7j32j79k43J9N0M92J3K9m18p6o2K47J56J71l3k56q0
4017d7j78J88P8J93L8k39k27j00Q6J83K59q2j9m29l9J04J46K53K45l19j46k15
4039b67N5N8L57Q0k45m5l15J81J24J47J54j26j82j49j07K53P8L62k77j45k47j18
4061c74L44K00J23p9j62l31k04L87J95K53l5j30m25k3K05R4J22pn7m46R5m8L32
4084B9J3Q2J0l07q5q1L52K94j09p4j86r8K5J23K77k0j16k08k00r2K71K31L65l44
$$ plain form
3926 -287 -157 202 258 99 -199 -276 -20 131 158 107 -40 -249 -307 -306 0 240 190 282 -109 -82 -253 -52 154
3949 154 254 208 64 -186 -423 -148 49 304 209 -25 -239 -242 -228 72 109 329 41 -296 -383 -276 -9 356
3971 356 336 9 -94 -195 -157 241 162 236 203 -229 -274 -193 -67 89 259 -44 -31 -338 -381 27 141 312 192
3994 192 3 -214 -298 -162 272 255 123 -56 -299 -280 -230 262 275 304 -114 -190 -252 -5 151 322 289 33 -47
4017 -47 -225 -37 41 234 272 33 -194 -294 -208 -25 234 152 133 -296 -335 -231 -85 168 413 94 -52 -267
4039 -267 -212 -154 203 283 38 -7 -322 -141 -17 130 284 158 -24 -173 -280 -27 51 413 136 -9 -256 -374
4061 -374 -30 170 293 214 52 -279 -483 -96 99 352 317 187 -238 -261 -56 38 160 153 96 -350 -255 -303 29
4084 29 42 124 134 -173 -258 -339 13 307 198 124 -62 -160 -135 -12 265 245 129 -79 -279 -371 -100 131 496 152
4108A52k54j83k5K22K44J0J55m14j10q2K86kK64n4l58m7j25K13J26K67j67j08
4130A0j54j28K04K40R4o0k01j02k07J81J51J94k23J06l12J04m9J9L47R3k55j21
4152f9j58L0Q5K35K96l95j63r3K0J38K09N3k45mj40J8J95L03L5k14j52k62K3K15
4176d0J49J93k2l13j03r8J28K26p9K86l50j01rj51M58J44l02K81l61k54K24J37
4198D3J90lj89rk61K2K62m1J76j30l1k84J10J13L4L32k61k82K2K6J33P4J52K4
4222B22k22l13J76K71l4P7J00l51k26QJ67K47P9q4j63j94m9nK80O3N3j00j75j96
4246c69J45K77J55K4k08j97r9PK65K76j58k4l10n5K28n3M66ol47l19J13j08N7
4269b40M03K1k2j26j62n3K63p1K85k05m0k19J8J49J66j37J9k8j75k60K83L51n7
$$ plain form
4108 152 -102 -285 -310 -88 156 166 321 -93 -203 -285 1 -1 263 209 -149 -196 -321 -108 18 285 118 10
4130 10 -144 -272 -68 172 266 206 5 -97 -304 -123 28 222 -1 105 -207 -103 -152 -133 214 307 52 -69
4152 -69 -227 -197 -112 123 419 24 -139 -232 -212 -74 135 188 -57 -61 -201 -183 12 315 350 136 -16 -278 -255 -40
4176 -40 109 302 280 -33 -136 -234 -106 120 41 327 -23 -124 -133 -284 174 318 16 297 -64 -318 -94 43
4198 43 233 230 41 32 -229 -207 55 14 190 60 29 -255 -145 -32 2 334 73 -209 -187 -161 -28 46 198 222
4222 222 0 -313 -137 134 100 177 277 -74 -300 -292 -125 122 201 117 -46 -240 -289 -294 -14 49 102 2 -173 -369
4246 -369 -224 53 208 232 24 -173 -272 -265 0 276 118 94 -216 -271 -43 -96 370 364 17 -302 -189 -297 -240
4269 -240 163 184 162 36 -126 -179 84 13 298 93 53 -166 -148 1 167 30 49 21 -154 -414 -131 220 163
4292A63l4j12l39l7L04j1K63L9jl24j86J10J96J19R5m02L7Q6n2J49J45%q0l55
4316b27R2J61m1O5K14j63o2k77oK22N5M74m96m4k06l7J37L89j27J06l77j19J19
4339a48K24J73k51L77m99k2j91K41J34J26k3j22k48j6K09O5J69Q7j53k82j80J42
4361a88K18J76p5n3k47r2m3L43J92K5j20k71p1o6K86J18N9p3r1m11O8L04K6K17
4385B31r4q0j98j86L17J64N3n2j11k64j96K19M16R6p6m05M4J9l5K52P0o9p9j36
4409a00k12K57L0K65k19J57k46k04Q3K78R5J83n3m02n3m8L62oj24jj14o1k32L32
4433c3J38K49j87l85J4LL01J14l0M7k12k25K6P0M22Jj09j83j74j20L13R5J24j52
4457A07q6k62J1J77Q6J01n3ok23j05J49J58K16j34j35k9l09J31K48l0K17k4k22
$$ plain form
4292 163 129 17 -322 -359 -55 -66 197 236 235 -89 -275 -165 31 150 245 -157 -120 -34 -86 63 208 208 128 -227
4316 -227 -135 26 -15 50 264 101 39 -238 -244 -22 33 507 11 -33 -239 -276 -139 250 123 229 -148 -267 -148
4339 -148 76 249 -2 375 -124 -146 -337 -96 38 164 141 19 -229 -245 -36 29 198 285 132 -150 -330 -188
4361 -188 30 206 131 78 -169 -261 -304 39 231 256 136 -135 -206 -272 14 132 191 118 27 -384 -316 -12 14 231
4385 231 137 57 -141 -327 -10 154 207 155 44 -220 -416 -197 219 315 239 -166 -122 -103 -138 114 184 115 36 -100
4409 -100 -312 -55 -25 240 21 178 -68 -272 -189 89 184 367 314 -88 -141 -189 173 167 43 42 -72 -133 -365 -33
4433 -33 105 354 167 -218 -204 -201 100 214 184 231 19 -206 -180 -110 312 313 204 21 -153 -273 40 135 259 107
4457 107 21 -241 -230 -53 33 134 81 75 -148 -253 -104 54 270 136 1 -28 -337 -206 42 12 229 205 -17
4480a7k15j34L79M7J27k7k86O5j75J49L14r2J3l23Q3j12J43L29o1l6l13P7m0O4
4504d1J18K74k89j73m9j34K37PK18J2j24j89j33O6J98K52l4j47k30J22j56L95
4526B00j4J33m18m9J9Q3Q0j28K94k1l37j50J78J31K89K6l28L6l71J63K48J36J0
4549B10o1k97q1j6J71M26j54O4k02k25j58J76L19L0j01j19k95R3J53p8K23N5j20
4572A3l03K23n3K48J24J1k66j80j58K02J26L5Q2R0l45j82J58R8M60j49q4k72K2
4595a00J0N5J84J34j98j82j9K02j89L10k9J4k24j55j10J91J54K55j12j55k42p3
4617b79K60J69J25p6j11k71J05j2J31JL38l17k14j09J69pM01j20j65l16J84Q2
4639c2L8J54p9k6k46j86O2K57J09J69j12j92k9p1N9J94L26k69k86j30K95J7J28
$$ plain form
4480 -17 -232 -366 13 60 187 160 -126 -61 -236 -87 227 135 148 -175 -92 -204 -61 268 207 171 -142 -65 -105 -41
4504 -41 77 351 62 -111 -160 -294 -57 -50 168 180 56 -133 -266 -200 -2 250 216 69 -161 -39 -195 200
4526 200 186 319 -99 -148 -129 -46 34 -94 200 179 -158 -308 -130 1 290 316 -12 24 -347 -184 64 200 210
4549 210 149 -148 -229 -245 -74 352 198 262 60 -165 -323 -147 172 202 101 -18 -313 -220 -67 -145 78 133 13
4572 13 -290 -67 -120 128 252 263 -3 -183 -341 -139 -13 22 104 194 -151 -333 -175 -77 383 234 150 -122 -100
4595 -100 -90 -35 149 283 85 -97 -116 86 -103 207 178 192 -32 -187 -297 -106 48 303 191 36 -206 -279
4617 -279 -19 150 275 199 88 -183 -78 -90 41 42 380 63 -151 -260 -91 -98 303 183 18 -298 -114 -32
4639 -32 6 160 81 55 -191 -377 -315 -58 51 220 108 -84 -113 -184 -125 69 395 126 -160 -290 5 22 150
4662A50J68j54l53r7J09K7M8J97J26k69q8p4J22K09l9R6m4j86o9k1K27O8j1j10
4686C2r9j97J46J75Q9K1o6o4m86L43J94P5R2p1j92j85Q3L18j44Om3J1l29J30R6
4711f5J93n7j35J05k74Q2j7K75N3j6Pl99K0K4K48K09j54p3j34r4J00J82J69j00
4735A49r2j57J04m3M4Q2%j01j06k11L16J82Q1q1r4j30r5O5L7L60j06jl19j17M
4760b29J43L00k11P4j21l0j96K69J22k1K4j69j46l2J33L35j04rp1j29k89M69O6
4783A78j04mj52J18k24J27J96J69q1j95j75j72J36J29J89Km9l02p6J71J50K6J3
4806G0k1k5k99K00J40O8J05j21q3j75n2J31K67r0q2j66j4JK04l5J42r5j35k3n1
4831a39J36J30M9J26j73l02q1K93J07L02k91j54j11L3j32K34J54L6l60J33l77
$$ plain form
4662 150 318 164 -189 -286 -177 -150 -102 95 221 -48 -136 -210 -88 121 82 178 134 -52 -121 -142 85 153 142 32
4686 32 -67 -264 -118 57 146 167 101 37 -449 -106 88 163 255 184 -8 -193 -110 208 64 70 27 38 -291 -161 -65
4711 -65 128 71 -64 41 -233 -151 -168 107 160 144 151 -248 -228 -204 44 253 99 26 -108 -202 -102 80 249 149
4735 149 57 -100 4 -39 5 87 87 -14 -120 -331 -15 167 248 167 73 -57 -152 -87 -50 310 204 203 -116 -233 -229
4760 -229 -86 214 3 77 -44 -74 -270 -1 121 100 124 -45 -191 -223 -90 245 141 132 61 -68 -357 112 178
4783 178 74 70 -82 36 -188 -61 135 304 223 28 -147 -319 -183 -54 135 137 88 -214 -290 -119 31 57 70
4806 70 49 24 -275 -75 65 133 238 117 34 -141 -193 -62 205 115 33 -133 -147 -146 58 23 165 70 -65 -88 -139
4831 -139 -3 127 176 302 129 -173 -254 39 146 448 157 3 -108 -75 -207 27 181 217 -143 -10 -387
4852c87J96L30o4J14k68M1L1m4j06K63J6j10k2k2j18J17K64o1m7j72r4j22K78
4875A3K48j02m2k31ql6J6J38L36j66k64Q3k32K80J49J85j90k97m7P9P3J01J24
4898B10k2j92jK9k60K41J54r5j21P6j32n0K12m6J02k80Q0j34Q1N5J82K0n8j66
4922a15r5J06J18N0J21k3k40j24J03K16M0J66r5k66j47MJ07J75r5K62m53N0j56
4945b91L44QJ82m3l23j90R9R4L86k11P6k05n5p9Q8J01K29o0j89R0k00J63R2P4
4969A80Mj67k86P3RL54J14l5k00n6r0k6K03J26M1j19k23M9m7k7L82m2j29j96j02
4994b10r6L23j5K57j24j17k24r1K00J77K82k47k2k84j4J24M6J49O4j65j02k95
5016c84L96o8K69j3k15p1J3J74k3K2J47j98j43j73L0K31Q2P5k59n3LmJ16J78M7
$$ plain form
4852 -387 -191 139 75 189 -79 -38 -7 -51 -157 106 122 12 -10 -32 -150 -33 231 170 123 -49 -143 -265 13
4875 13 261 159 117 -114 -122 -158 -142 -4 332 166 -98 -15 -247 33 182 367 177 -120 -167 -88 -15 86 210
4898 210 188 -4 -5 24 -236 5 159 64 -57 19 -113 -163 49 3 105 -175 -95 -229 -148 -93 89 109 51 -115
4922 -115 -210 -104 14 64 185 162 -78 -202 -99 117 157 323 228 -38 -185 -181 -74 101 6 268 -185 -135 -291
4945 -291 53 61 243 200 -123 -313 -214 -120 266 55 131 -74 -129 -208 -120 -19 210 150 -39 51 -149 14 106 180
4969 180 184 17 -269 -196 -187 167 281 246 46 -10 -100 -126 77 203 244 125 -98 -49 -96 -123 259 217 88 -108 -210
4994 -210 -306 17 2 259 135 18 -206 -297 -97 80 362 115 93 -191 -205 -81 -35 114 178 13 -89 -384
5016 -384 12 -56 213 200 -15 -86 -73 101 78 100 247 49 -94 -267 -237 -6 76 151 -108 -161 -158 -162 -46 132 179
5041A79n4k12%n7J56R4N6k2j46k37Q4M9K12K02j54j85j12R3m5J48J79r2j22j58
5065a44J7QK69oK2j28j73J0P9J38J23j75j03k36K62o4J85J14P2j85k38M4k00L88
5089G9K01k28P2j94j17J0L2K22j15J00Lj83k05K95K5L48j07k68k08J13O6K42j32
5112E1P5j31j76J1M4M12m4J2l93j4J6J90j99L48L1k89lq2R4L2J61p9m7l7Q0k60
5138a97K99jJ70n4k03j20n1J84P9o0K0p7l28J45K89L3k0K4j56k7Rj11L82j86J83
5163B26k76q3L2nJ63J01j56k09mJ04O2J00J87r5j73j5o5L9J4L52p5k15l46J54
5187a83J36k3K04j07p7l8j07K14OO6q2K07k65j20L8J33K94j24j04k17L2K0m4L41
5211B00j81R5k84j81L28N8P2l7K32l32k25J29K10j2K16j92k33J2Rj01L24qj05
$$ plain form
5041 179 125 -87 -87 -144 12 106 162 140 -6 -243 -159 -110 102 304 150 -35 -147 -54 -99 49 228 136 14 -144
5065 -144 -127 -119 150 144 166 38 -135 -125 -46 92 215 40 -63 -299 -37 -101 84 198 270 85 -153 -109 -309 79
5089 79 280 52 124 -70 -187 -177 -145 77 -38 62 65 -118 -323 -28 -3 345 238 -30 -238 -125 -59 183 51
5112 51 126 -5 -181 -170 -126 286 242 254 -139 -153 -137 53 -146 202 233 -56 -59 -141 -47 -15 146 67 20 -17 63 -197
5138 -197 102 101 271 217 14 -106 -157 27 106 46 66 -11 -339 -194 95 128 108 132 -24 -51 -42 -153 229 43 226
5163 226 -50 -133 -101 -106 57 158 2 -207 -211 -107 -45 55 242 147 -26 -41 -106 -67 -53 299 224 9 -337 -183
5187 -183 -47 -70 134 27 -50 -88 -195 19 25 91 9 216 -49 -169 -131 2 296 172 68 -149 -117 -97 -141 200
5211 200 19 114 -170 -351 -23 35 107 70 302 -30 -255 -126 84 72 288 96 -137 -125 -116 -217 107 99 -6
5234fj10k4r6K04J38J66n2j31k00j1j24L22Lm7O6k90J13j3J41j6J13j09j04J2
5258e5m8J51R3n8j1j26p7J03j58K82K0l7J6k82J12Pm8M14l6l72o2J4N1J36J75
5283B04o8j11l24J63M0K16n0pJ07j78j01J1L24o5j25j2m8M4j50K88R1j56j03r3
5307a03j36J6K19O2P8k56K7k2m9R4J54j24J39j36j85L4K60K4j42J37k09N5m2m8
5331a53J79J30P1k91q8k2P5r3L81np5l32k7Q7J78K44k18J8o4j79J72o7K09K6k67
5356a11K0j51R4O4rJ61q6K0l3r9m4K82P3j45k24M0R6r8L86j58M2l96J93j32K45
5381C0J14o2j4j46q0j2k7K77k1L3j42J07j08J18J65O6m21K68j05r5J6J94N6j47
5405F4j28j15K35o3M3P1M1J9m3l65M9J14J67j14j0l1o3K6j3L08P0j59j29k9m4
$$ plain form
5234 -6 -116 -140 -236 -32 106 272 220 89 -111 -122 -246 76 79 32 98 -192 -79 -92 49 33 146 37 -67 -55
5258 -55 -103 48 141 83 72 -54 -131 -28 -186 96 116 79 95 -187 -75 -68 -116 298 262 -110 -172 -158 -107 29 204
5283 204 136 25 -299 -136 -96 120 70 63 170 -8 -109 -98 226 161 36 24 -24 20 -130 158 249 93 -10 -103
5307 -103 -239 -223 -4 58 136 -120 -93 -115 -164 -70 84 -40 99 -37 -222 -188 72 96 -46 91 -118 -63 -105 -153
5331 -153 26 156 227 -64 -152 -174 -99 -192 189 184 109 -223 -250 -163 15 259 41 59 -5 -184 -12 -79 130 156 -111
5356 -111 -91 -242 -148 -84 -93 68 -18 2 -31 -130 -174 108 181 36 -188 -148 -52 -150 236 78 120 -276 -83 -215 30
5381 30 144 82 68 -78 -158 -170 -197 80 59 92 -50 57 -51 67 232 298 -123 145 40 -55 -39 155 211 64
5405 64 -64 -179 56 -7 36 107 148 167 124 -241 -192 -78 89 -25 -35 -66 -129 -103 -116 192 262 103 -26 -55 -99
5430i9j10K78J95q9k56Pn6K57j24l2J41l1k77M6K05N5O8k30K06j37nmj42L47j12
5455A01j30n8j75J52L4J93O8j89q4j08MJ78n9J80O1l58o6K12j3J76J80l61j7j41
5479b20J58nM7J54j78j01j00K44p0J51l9J18k08j67lL34q1J20P5j71j72j03J58
5502e9L5J93p9J8n3j12o6J50J53j83r8N1k62K53J02L6l8n2q7k7K7L38k23J58j31
5527D4Mr3j1M8Q7K6r6j69m0J46K4P7K3J02k61j08L6J16K36k4n4k48L5l0K17KP8
5554A67n4k74K37j50J54j02J75j24j76n6p6Q4L89k47J35P0k76Q1L5j82K02J41
5576A53j01k39K18J14j30M0J38r4p0l78K40P9o1J41j38P9j5j32R1j4L00j60k62
5599b01J38r2K77m4K5j62P5j88K14j87J65Q2M6j00j21J33r6K72j15o8j18O5j38
$$ plain form
5430 -99 -209 69 264 175 -81 -74 -130 127 3 -29 112 81 -196 -150 55 110 178 -52 154 17 12 8 -134 213 101
5455 101 -29 -87 -262 -110 -76 117 185 -4 -88 -196 -192 -14 -73 107 168 -190 -256 -44 -57 119 299 -62 -79 -220
5479 -220 -62 -67 -20 134 -44 -145 -245 -1 -71 80 41 159 -49 -216 -219 115 34 154 229 58 -114 -217 -59
5502 -59 -24 169 90 108 55 -57 -123 27 180 -3 -101 -50 -312 -59 43 79 41 -11 -98 -125 -98 240 17 175 44
5527 44 48 -45 -56 -8 79 105 9 -160 -200 -54 -30 47 70 172 -89 -197 -161 -45 191 167 113 -135 -100 -130 87 89 167
5554 167 113 -161 76 -74 80 -22 153 29 -147 -203 -279 -195 194 -53 82 152 -124 -43 -8 -190 12 153
5576 153 52 -187 31 145 15 55 193 99 29 -349 -109 -30 -91 50 -88 -9 -24 -156 -65 -79 221 61 -201
5599 -201 -63 -155 122 78 103 -59 16 -172 42 -145 20 102 148 48 -73 60 -36 236 121 53 -65 0 -138
5622a38k0L86m3n9p3o3q9O1J33Q8j15m0R1k64J22n1L47k23j2k41J97j37Q0P1Q3
5647I1j4k28L5J25pl1K88j76r0o0m3Q7J06O3q8rk13J19K00j18L4N7M0k09j6QK31
5674A82k5J4K8j83J4r9O3L02j08k83L2P2J8m3K39r4Om27K54k7n1P6O7J05j24j12
$$ plain form
5622 -138 -158 228 185 126 53 -10 -99 -38 95 183 68 28 119 -145 -23 -74 273 50 38 -203 -6 -143 -63 8 91
5647 91 77 -151 -116 9 2 -29 259 83 -7 -67 -110 -23 83 146 58 49 -164 -45 155 37 71 128 168 -41 -57 -49 182
5674 182 157 171 199 16 30 -69 -6 296 188 -95 -63 9 27 -16 223 129 135 -292 -38 -65 -116 -40 27 132 8 -104
$$ [...]
8191A89
##END NTUPLES=NMR FID
##END=
