##TITLE=1H_3PEPPA0607-1
 CD3CN, 8 sc, 
 7.07.2021
##JCAMPDX= 6.0         $$ Bruker NMR JCAMP-DX V2.0
##DATA TYPE= NMR FID
##DATA CLASS= NTUPLES
##ORIGIN= UXNMR, Bruker Analytische Messtechnik GmbH
##OWNER= root
$$ XWIN-NMR		Version 3.5
$$ Wed Jul  7 09:52:19 2021 Russian Standard Time (UT+4h)  she@DPX200
##.OBSERVE FREQUENCY= 200.131506
##.OBSERVE NUCLEUS= ^1H
##.DELAY= (6, 6)
##.ACQUISITION MODE= SIMULTANEOUS
##.ACQUISITION SCHEME= undefined
##.AVERAGES= 8
##.DIGITISER RES= 18
##SPECTROMETER/DATA SYSTEM= spect
##.PULSE SEQUENCE= zg30
##.SOLVENT NAME= CDCl3
##.SHIFT REFERENCE= (INTERNAL, CDCl3, 0, 15.7039)
##AUDIT TRAIL= $$ (NUMBER, WHEN, WHO, WHERE, WHAT)
$$ ##TITLE= Audit trail, XWIN-NMR		Version 3.5
$$ ##JCAMPDX= 5.01
$$ ##ORIGIN= Bruker BioSpin GmbH
$$ ##OWNER= she
$$ F:/spectra/data/she/nmr/H-F/1/audita.txt
$$ ##AUDIT TRAIL=  $$ (NUMBER, WHEN, WHO, WHERE, WHAT)
(   1,<2021-07-07 09:51:18.10 +0400>,<she>,<DPX200>,
      <created by zg, POWCHK disabled, PULCHK disabled
       configuration hash MD5:
       00 E9 B6 7A A2 85 ED C7 34 08 36 98 17 FE 4E 26
       data hash MD5: 16K
       24 B5 83 45 6F 60 CF 0B 2A 3E D5 E1 B6 83 EB 21>)
$$ ##END=
$$ 
$$ hash MD5
$$ 0A 2E CA C3 84 56 D5 55 58 68 A7 E8 A1 92 00 28
##$RELAX= 
##$RELAX= 
##$RELAX= 
##$RELAX= 
##$RELAX= 
##$RELAX= 
$$ Bruker specific parameters
$$ --------------------------
##$DU= <F:/spectra>
##$EXPNO= 1
##$NAME= <H-F>
##$PROCNO= 1
##$TYPE= <nmr>
##$USER= <she>
##$AMP= (0..31)
100 100 100 100 100 100 100 100 100 100 100 100 100 100 100 100 100 100 
100 100 100 100 100 100 100 100 100 100 100 100 100 100 
##$AQSEQ= 0
##$AQ_mod= 1
##$AUNM= <au_zg>
##$AUTOPOS= <>
##$BF1= 200.13
##$BF2= 200.13
##$BF3= 200.13
##$BF4= 200.13
##$BF5= 200.13
##$BF6= 200.13
##$BF7= 200.13
##$BF8= 200.13
##$BYTORDA= 1
##$CFDGTYP= 0
##$CFRGTYP= 5
##$CHEMSTR= <none>
##$CNST= (0..31)
1 1 145 1 1 1 1 1 1 1 1 1 1 1 1 1 1 1 1 1 1 1 1 1 1 1 1 1 1 1 1 1 
##$CPDPRG= <>
##$CPDPRG1= <>
##$CPDPRG2= <>
##$CPDPRG3= <>
##$CPDPRG4= <mlev>
##$CPDPRG5= <mlev>
##$CPDPRG6= <mlev>
##$CPDPRG7= <mlev>
##$CPDPRG8= <mlev>
##$CPDPRGB= <>
##$CPDPRGT= <>
##$D= (0..31)
0 1.2 0 0 0 0 0 0 0 0.06 0 0.03 0 0 0 0 0.0002 0 0 0 0 0 0 0 0 0 0 0 0 
0 0 0 
##$DATE= 1625637077
##$DBL= (0..7)
120 120 120 120 120 120 120 120 
##$DBP= (0..7)
150 150 150 150 150 150 150 150 
##$DBP07= 0
##$DBPNAM0= <>
##$DBPNAM1= <>
##$DBPNAM2= <>
##$DBPNAM3= <>
##$DBPNAM4= <>
##$DBPNAM5= <>
##$DBPNAM6= <>
##$DBPNAM7= <>
##$DBPOAL= (0..7)
0.5 0.5 0.5 0.5 0.5 0.5 0.5 0.5 
##$DBPOFFS= (0..7)
0 0 0 0 0 0 0 0 
##$DE= 6
##$DECBNUC= <off>
##$DECIM= 32
##$DECNUC= <off>
##$DECSTAT= 4
##$DIGMOD= 1
##$DIGTYP= 9
##$DL= (0..7)
0 120 120 120 120 120 120 120 
##$DP= (0..7)
150 150 150 150 150 150 150 150 
##$DP07= 0
##$DPNAME0= <>
##$DPNAME1= <>
##$DPNAME2= <>
##$DPNAME3= <>
##$DPNAME4= <>
##$DPNAME5= <>
##$DPNAME6= <>
##$DPNAME7= <>
##$DPOAL= (0..7)
0.5 0.5 0.5 0.5 0.5 0.5 0.5 0.5 
##$DPOFFS= (0..7)
0 0 0 0 0 0 0 0 
##$DQDMODE= 0
##$DR= 18
##$DS= 0
##$DSLIST= <SSSSSSSSSSSSSSS>
$$ [...]
##$SUBNAM2= <"">
##$SUBNAM3= <"">
##$SUBNAM4= <"">
##$SUBNAM5= <"">
##$SUBNAM6= <"">
##$SUBNAM7= <"">
##$SUBNAM8= <"">
##$SUBNAM9= <"">
##$SW= 20.0188882624521
##$SWIBOX= (0..15)
0 0 2 0 0 0 0 0 0 0 0 0 0 0 0 0 
##$SW_h= 4006.41025641026
##$TD= 16384
##$TD0= 1
##$TE= 0
##$TE2= 300
##$TE3= 300
##$TEG= 300
##$TL= (0..7)
0 120 120 120 120 120 120 120 
##$TP= (0..7)
150 150 150 150 150 150 150 150 
##$TP07= 0
##$TPNAME0= <>
##$TPNAME1= <>
##$TPNAME2= <>
##$TPNAME3= <>
##$TPNAME4= <>
##$TPNAME5= <>
##$TPNAME6= <>
##$TPNAME7= <>
##$TPOAL= (0..7)
0.5 0.5 0.5 0.5 0.5 0.5 0.5 0.5 
##$TPOFFS= (0..7)
0 0 0 0 0 0 0 0 
##$TUNHIN= 0
##$TUNHOUT= 0
##$TUNXOUT= 0
##$USERA1= <user>
##$USERA2= <user>
##$USERA3= <user>
##$USERA4= <user>
##$USERA5= <user>
##$V9= 5
##$VALIST= <valist>
##$VCLIST= <CCCCCCCCCCCCCCC>
##$VD= 0
##$VDLIST= <DDDDDDDDDDDDDDD>
##$VPLIST= <PPPPPPPPPPPPPPP>
##$VTLIST= <TTTTTTTTTTTTTTT>
##$WBST= 1024
##$WBSW= 4
##$XGAIN= (0..3)
0 0 0 0 
##$XL= 0
##$YL= 0
##$YMAX_a= 45596
##$YMIN_a= -60435
##$ZGOPTNS= <>
##$ZL1= 120
##$ZL2= 120
##$ZL3= 120
##$ZL4= 120
##$ABSF1= 10
##$ABSF2= 0
##$ABSG= 5
##$ABSL= 3
##$ALPHA= 0
##$AQORDER= 0
##$ASSFAC= 0
##$ASSFACI= 0
##$ASSFACX= 0
##$ASSWID= 0
##$AUNMP= <proc_1d>
##$AZFE= 0.1
##$AZFW= 0.1
##$BCFW= 1
##$BC_mod= 2
##$BYTORDP= 1
##$COROFFS= 0
##$CY= 11.3945322036743
##$DATMOD= 1
##$DC= 2
##$DFILT= <>
##$DTYPP= 0
##$F1P= 15.9154993809931
##$F2P= -4.1035820241983
##$FCOR= 0.5
##$FTSIZE= 0
##$FT_mod= 4
##$GAMMA= 1
##$GB= 0.15
##$INTBC= 1
##$INTSCL= 1
##$ISEN= 128
##$LB= 0.24
##$LEV0= 0
##$LPBIN= 0
##$MAXI= 10000
##$MC2= 0
##$MEAN= 0
##$ME_mod= 0
##$MI= 1.114404
##$NCOEF= 0
##$NC_proc= 0
##$NLEV= 6
##$NOISF1= 3.799351
##$NOISF2= 2.8
##$NSP= 1
##$NTH_PI= 0
##$NZP= 0
##$OFFSET= 15.70392
##$PC= 1
##$PHC0= -11928.3
##$PHC1= 29.00099
##$PH_mod= 1
##$PKNL= yes
##$PPARMOD= 0
##$PSCAL= 0
##$PSIGN= 0
##$REVERSE= no
##$SF= 200.130013532006
##$SI= 16384
##$SIGF1= 3
##$SIGF2= 2
##$SINO= 400
##$SIOLD= 16384
##$SREGLST= <1H.CDCl3>
##$SSB= 0
##$STSI= 0
##$STSR= 0
##$SW_p= 3612.71676300578
##$SYMM= 0
##$S_DEV= 0
##$TDeff= 0
##$TDoff= 0
##$TI= <>
##$TILT= no
##$TM1= 0
##$TM2= 0
##$TOPLEV= 0
##$USERP1= <user>
##$USERP2= <user>
##$USERP3= <user>
##$USERP4= <user>
##$USERP5= <user>
##$WDW= 1
##$XDIM= 8192
##$YMAX_p= 0
##$YMIN_p= 0
$$ End of Bruker specific parameters
$$ ---------------------------------
##NTUPLES= NMR FID
##VAR_NAME=  TIME,          FID/REAL,        FID/IMAG
##SYMBOL=    X,             R,               I
##VAR_TYPE=  INDEPENDENT,   DEPENDENT,       DEPENDENT
##VAR_FORM=  AFFN,          ASDF,            ASDF
##VAR_DIM=   8192,          8192,            8192
##UNITS=     SECONDS,       ARBITRARY UNITS, ARBITRARY UNITS
##FACTOR=    0.0002496,     1,               1
##FIRST=     0,             0,               0
##LAST=      2.0444736,     0,               0
##MIN=       0,             -60435,          0
##MAX=       2.0444736,     45596,           0
$$ Real data points
##PAGE= N=1
##DATA TABLE= (X++(R..R)), XYDATA
0@%%%%%%%%%%%%%%%%jRj6J6j6J6j7K5l2L2l9M7n0N8o9P8r0J03j14J27j44J63j83
39i7K04k26K51k79L11l45L81m22M64n08N64o22O82p53Q30r17J014j122J246j392
59g36J561j760K002k301K682l186L892m952O750j0598L5709m9724l4888R4517
73C8968n740p3434J6206O9596l5479n2601L9641M5844m7572l3629M5584K6363
85C3747m5988j2851M0551K458l6807P521K7626j0478j8848J1663J1025p370o956
98d707J62M639P595p271j2424J1336J6764j7357j5876K1712J2285k6667n770L1337
112A5758o20l5932O104L8985j1744l9563J8461L7307k6288l1538L5854K2030m4456
125a5642j1557M9436L55m8821R389M3654j7050l5488K3150K6904k7572j9425L0630
$$ y = [0, 0, 0, 0, 0, 0, 0, 0, 0, 0, 0, 0, 0, 0, 0, 0, 0, -1, 8, -8, 8, -8, 8, -9, 16, -16, 16, -23, 24, -26, 32, -37, 41, -49, 54, -60, 67, -77, 86, -97, 107, -119, 132, -147, 164, -181, 200, -222, 242, -266, 298, -324, 358, -395, 435, -482, 532, -590, 656, -736, 825, -935, 1067, -1234, 1448, -1738, 2154, -2798, 3952, -6646, 29063, -20661, -55549, 38968, 33228, -40206, -24000, 45596, 10117, -42484, -2843, 43001, -4571, -38200, 7384, 33747, -12241, -25092, 15459, 17917, -18890, -11369, 16257, 5779, -13069, -1406, 9619, 2249, -4707, -4545, 94, 7689, 418, -12006, -670, 16094, -1263, -17139, 4573, 16858, -9809, -15579, 15758, 15138, -20794, -14690, 24295, 12551, -27012, -8551, 28756, 2468, -29070, 6784, 28814, -15642, -27199, 22237, 22592, -26229, -16840, 26814, 9764, -25724, -2574, 24330, -3242, -22667, 7963]
138G963J2899l2779o689L2852J75l0106O698K4831j2588j7800J6170J0012j6267
151d629l025J3526j588j0038L888N288l307m34J677l383K38O040k353q475N221
166a354Q579p827p027J2102L354j6898J023K0996o160k2579J1676K1565j7713
179b63j6535K2462R088k6220n42K7912o405k7296J1539K4178j6144j8886J9636
192B524J3066k2367o713K4257J22k4682O479K2111j1802j7307J5765J0791j7371
205e127l878J6256j939j3283O356R484r023n342R491J473q279J720O160m794l129
220c854P382k60r029L742R155p086o899R990K440j2473K968J3786p896j2975J1591
235E82J0146j4245n902J5625N23j5180M010J5136q215j3785J1049J1220j3487
$$ y = [7963, 20862, -11917, -18606, 14246, 14421, -15685, -8987, 15844, 3256, -14544, 1626, 11638, -4629, -7654, 5872, 4284, -5754, -1866, 3422, 115, -319, 1358, -2025, -1787, 4253, 1900, -6575, -1354, 7225, -602, -7629, 4473, 7827, -9071, -8048, 12948, 6788, -15791, -4115, 17450, -263, -16798, 5664, 14752, -11468, -12010, 15902, 9497, -17799, -6260, 17918, 1774, -17112, 2524, 15590, -6777, -13490, 10767, 10889, -13793, -7314, 14797, 2995, -14312, 1453, 12244, -5127, -9005, 7251, 5312, -7971, -1615, 7869, -1154, -6496, 2995, 4468, -3811, -2091, 4069, -725, -3854, 3528, 3268, -5761, -2019, 7136, 50, -6849, 3141, 5581, -6892, -3924, 9862, 1966, -11009, 582, 10728, -3517, -9419, 6206, 6729, -8451, -4441, 10695, 2480, -11305, -256, 10964, -2523]
248b523p381J4993L129j5440J535J4711o036j2835R389R653j1339n441J1881J406
262E702j1290J768R268l991o543N641M143o768j809O968m89o182K300M548l783
277e17j957N017p58n829L101N388m991l561O663M84p049K575O285n165n596P391
293A481M208q022k231Q506o05q684L167Q225n512p135P944N386r544k942R988
308D230m02r663L513Q603n751o517P255L983q145j205P785n18o979K199O014m110
324B92m503M838K571n166l73N664j610m858K755L246l832j087M321j113l836K728
340C7K801l967j307M072j00l900K031L407l728k582M482J547n026o8N265j389
356A575m977L092M067m744k873N756J525o061L82N681k411m810L633L889m487
$$ y = [-2523, -9904, 5089, 8218, -7222, -5687, 9024, 2988, -9847, -458, 9195, -2144, -7585, 4296, 5702, -5588, -3820, 5448, 1457, -5086, 555, 4698, -2070, -3879, 3089, 2600, -3582, -1282, 3266, -517, -2474, 2543, 1785, -4044, -943, 4445, -546, -4107, 2556, 3040, -4009, -1434, 4851, -314, -5910, 1481, 5689, -2333, -4564, 3942, 3337, -5347, -2180, 6045, 533, -6602, 1342, 6728, -2816, -5758, 4230, 3828, -5835, -2322, 6281, 530, -5987, 1268, 5251, -2894, -4099, 3686, 3168, -3811, -1612, 4402, 292, -4211, 627, 3198, -1968, -2341, 3323, 1713, -3145, -390, 2856, -976, -2063, 2258, 1145, -2691, 37, 2838, -1129, -2436, 1636, 1536, -2364, -333, 3074, -654, -3236, 1246, 2793, -2233, -2301, 2964, 1575, -3402, -310, 3757, -987, -3860, 1896, 3421, -2640, -2258, 3423, 1012, -3798, -165, 3724, -763]
371g63k233M620Q91m799O71M394j825l728K628K733k958j995L462O68l493J025
387g02K662j501k441K191J167k160N5J698o46j450J441P26j653l87J808p5j546
404h13Q23J117j631p96K082K77k272P48K069j303j881J906J081k332l13K610l27
421A045k539R73J931j272j809J941J353k190n81K219j56k248N75K080j141j500
437a319J465J094j702n26J430J5j105M30J058p19p17M15P91p63j47O71m7p92N48
456H0K50o69j40Q11J14p96K68L16m34j34P33j38q20N40N59m76n43N58J67n57N1
477b60O65k19n83K97N72m23o16N71N50m83l40N87l49n46M89N79m80k04K44Q0j59
498b8Mk9J44J51l9j20J9k35J4J66l0n9J36J31j30j59j53L8J48K00l05J06K11k82
$$ y = [-763, -2996, 1624, 2515, -2284, -1613, 2781, 956, -2772, -144, 2589, -369, -2364, 1098, 1766, -1727, -702, 1960, 459, -1982, 209, 1376, -784, -729, 969, 323, -1127, 314, 1040, -613, -1000, 808, 733, -813, 10, 1127, -504, -1300, 782, 1059, -1213, -465, 1604, 301, -1580, 326, 1407, -925, -1238, 1372, 1045, -1494, -521, 1410, 138, -1671, 270, 1623, -567, -1148, 1071, 915, -1333, -758, 1322, 181, -1319, 146, 1240, -462, -988, 442, 457, -648, -218, 840, 121, -596, -181, 610, -153, -300, 371, 324, -468, 80, 330, -339, -479, 332, 446, -350, -82, 234, -200, -334, 399, 261, -559, -19, 540, 64, -479, 79, 246, -311, -260, 405, 186, -397, -100, 472, 49, -567, 4, 554, 71, -269, 318, -31, -577, -88, 491, 11, -193, 51, 131, -28, -24, -53, 91, 242, 203, 83, 102, -133, -119, 47, 17, -42, 94, 225, 95, -64, -217, -179, -31, 169, -136, -30, 181, -101]
522a01K72K9k59l19K75L85j46k10m3p0N4L34L5k85m0K85J1l47J55j96j10K71L82
545C62k81l96J48N30m28k22L78J06m17J37N88m82m92N78L14o75k31R23j77n19
565b56J43M45m25l10Q02J64r75jQ10O2q00J80M68n32j14O49J56q39J5O71q2m33
587b02K05L28m29k4M35kn46O6M36j79l11K19K53l23M1L42k93l04M14K30m96j18
609b58K57l1j22K39j71L5q9L99j17k60q1K33k4k82J17K63k15lN02j97n29J29N74
632C69j76n07J55L07l62O5K42Pm54P9N07L62r10o2O24l9n35M75K17p31k01J031
654D63q2q84O9Q65j50k50J15J00n04J47M50n9m59j66N11K7m09Q7L72l58j94O48
676C39l39m48O77J62n61j54N72j48j66J32J25m38J67L34N7m85j13M64j2k19P3
$$ y = [-101, 171, 200, -59, -378, -103, 282, 136, -74, -117, -187, -133, 201, 236, -49, -89, 196, 207, -140, 15, -181, -291, -20, 362, 81, -315, -167, 363, -65, -287, 91, 197, -220, -83, 505, 23, -469, 109, 423, -252, -483, 440, 263, -256, -113, 332, -93, -403, 399, 563, -412, -413, 397, 459, -341, -161, 307, -225, -339, 310, 466, -373, -358, 313, 231, -202, 3, 331, -98, -122, 313, 311, -235, -169, 267, 88, -223, -4, 249, -74, -33, 309, 16, -288, 126, 356, -140, -258, -1, -32, -154, 85, -86, -51, -140, 259, 142, -118, -199, 34, 10, -272, -155, 108, -107, -110, 392, 195, -334, -205, 369, 193, -314, -159, 148, -214, -149, 93, 100, -354, -275, 232, 594, -316, -378, 246, 207, -328, 147, 364, -367, -568, 463, 381, -503, -434, 431, 281, 31, 146, 246, -258, -111, 339, 280, -179, -345, 166, 193, -216, -129, 243, -115, -309, 339, 0, -448, 229, 391, -170, -324, 248, 100, -66, 66, 191, -247, -80, 254, 311, -174, -287, 177, 165, -54, 19]
697A9J83m57J0N93J12j031%J169m85n79O84p7n42K63O16m66m30L62L98l48j20
718a26J64J94o4k46K19Rj86K6N06m09o33N82M13l75l27N13o7n94M34M86n41n63
740e85O95J32k22j57lK79k46mN63l66n02M43P01p49m40N82%m96L72M88o94k76
762d85Q91L7p96J20N71k01l57K45L81n87j06M05L67q70J73Q52n81n94P38J09o88
783c76L3R54n26p64P32P58q88m31P89J1q13M58N01o38n38J018N23j178k00J017
803D42k24p03N06M59p76m54Q90M96j024l2J027k63n55L07N40q52m38J096j75p07
823d40M14N39m54o26Q12K88q43j31Q45j53q87L77O69m98n64R36K37q41O0O70l71
844C9p26Q40N00r28m08R04M9n62J84N14m42m47O74J95o34p6P29k62o11M92M81
$$ y = [19, 202, -255, -245, 348, 460, -571, -571, 598, 113, -466, 218, 141, -401, -138, 478, 12, -418, -56, 342, -6, -126, 38, 232, 168, -78, 141, 150, -36, -10, 496, 87, -546, 36, 449, 74, -253, 260, 193, -401, 33, 519, -22, -585, 110, 242, 20, -137, -140, 139, -107, -111, 452, 86, -416, 27, 728, -21, -461, 121, 121, -375, -3, 485, -209, -485, 406, 443, -353, -233, 338, 137, -220, 25, 406, -181, -287, 118, 485, -385, -212, 640, 59, -535, 203, 312, -376, -343, 611, 85, -679, 53, 811, -77, -508, 281, 292, -521, -63, 438, -200, -738, 280, 803, -375, -575, 442, 218, -485, 21, 480, -296, -750, 140, 636, -388, -420, 607, 344, -211, 96, 636, -216, -654, 442, 267, -440, -26, 513, 59, -567, 245, 533, -310, -441, 404, 251, -636, -259, 410, -88, -652, 284, 521, -320, -260, 410, 39, -687, 153, 653, -275, -683, 221, 270, -292, -108, 406, -36, -483, 191, 386, -248, -324, 405, 143, -468, 24, 505]
865E05n75m85R89J28j225J59J195n74m89M99M88r44l00J179j11r29M61N07n59
884h1n64Q11L72o51k67Q72j40q76N64N76p23n71R99M6q28J96R00n23q12O29N99
905E28q48k17R39o8p92K89O71m86o50R44P5o86l2P05j40p07L14O68o37k62O04
926B12K66p82N1P42k82p58M91M79p15r1R03m25n18N25M13o21m4M77O4o70M4P26
948D87l48n34O51K51q49j15P61k9o43J51O08l47n41O38J87n81J6P03l93o69O76
969H0M18o93k30O33K42p85J35O73m18l59K64M89m41l54O09o9o60L17L24j36n01
990d62N07L85n98J81L07k42l11K52P5j39o1L38pn19L06J44J5m62M84l8l93L0L41
1013A33m5k87J07L98j23m29M15P9m97K30K51l84j37M59L20k38n51L86M9l74LM37
$$ y = [505, -70, -555, 434, 562, -663, -504, 691, 117, -372, 127, 615, -329, -629, 550, 439, -490, -29, 478, -81, -645, 166, 538, -113, -380, 492, 352, -524, 40, 616, -107, -678, 321, 367, -461, -265, 635, 112, -700, -71, 528, -320, -537, 402, 334, -458, -169, 502, 16, -634, 310, 385, -301, -333, 372, 232, -475, -161, 507, -130, -392, 212, 478, -304, -253, 489, 207, -551, -60, 419, -296, -387, 516, 91, -427, 98, 511, -110, -154, 323, 387, -283, -239, 487, 139, -395, 256, 507, -342, -457, 304, 275, -368, -217, 391, 44, -497, 141, 328, -253, -237, 466, 73, -596, 80, 498, -195, -425, 208, 450, -335, -200, 473, 55, -304, -40, 449, 8, -346, 263, 194, -466, -149, 175, 39, -462, 45, 430, -168, 13, 320, 78, -233, 19, 94, -45, -106, 232, 225, -294, 12, 156, 171, -291, 193, 155, -238, -208, 133, 88, -199, -92, 306, 183, -246, 169, 248, -249, -19, 232, -152, -289, 170, 490, 252, -299, 87, 136, -238, -235, 202]
1035B02K0l80J56K08k63n1L51k33l70M04K78k90l71M21J49m77J68J87k8k60J6
1056a63M60j79m28M21J7m25k2M63r4m17L79J39j78j13L44k24j43J24K77j28k47
1077a37J51J66l06R5J01lk10l0K65l4p3j09L9J3J79J03j59j00J10m8k81L69J11
1100B12k24LOM0j01j27K10j35J35K2J2Lj5j23J9p3J27L2J83m73K82J2J59j73O9
1125H2j12n9J3J88n5Mk92K76J29j48k00L26l2l22K27o8k4j96L99N3n13J24N42
1148C42j07l02Q2J66k49J41J09j55k56J36K13kl14L9M03l12j66M50k60k54L07
1169A1J10m68J74K13N9l44Q7K84k54PM02j94j83N6O7j4k30J27J72j52NL26q1l41
1193a61L72q2j4m7m7J32l50L88J4k35k07L94q0m96O26j70o4j65L92j49r1l9Q3
$$ y = [202, 222, -158, -2, 206, -57, -108, 243, 10, -360, 44, 322, 32, -339, 82, 231, -246, -78, 109, 81, -179, -163, 297, 118, -310, 111, 128, -297, -319, 144, 50, -367, 12, 151, -27, -140, 204, -20, -163, -39, 238, 110, -137, 14, 180, -126, -31, 70, 67, -143, -173, 92, 58, -15, -124, -85, -72, 107, 210, 51, -49, 61, 13, -268, 101, 212, -12, -9, -3, 37, -64, -191, 19, -116, 19, 41, 53, 56, 41, -82, -63, -136, -9, 23, 206, -267, 15, 27, 186, 13, 82, -30, -89, -76, 112, 57, 61, -231, 45, 174, 26, -174, 152, 120, -202, 25, -43, -67, -263, 136, 189, -324, -200, 342, 235, -67, 15, 181, -68, 73, 182, 27, -229, -93, 120, 118, -196, -157, 246, -66, -232, 218, -42, -296, 11, 121, -347, -173, 40, 99, -245, -158, 126, -128, -121, 281, 87, -96, -40, 27, 13, -217, -90, 82, -70, -65, 261, 180, -161, 211, 129, 115, 68, 21, 153, -197, 191, 205, -30, -237, 157, 77, -419, 207, 37, -27, -192, 200, 51, -40, -79, 4]
1216DQ0n7j13R3N0kN0l67K00J82j14P8m8j8rp4J03j7LJ7o2J77j19k2J13j25Q3
1243H6J41j70k21L18O8n16K95J46j86j69J60J86j46j35K26P3k61J61j39J81j73
1264g5L9j15J56j40K04k9l51K05K14j56P4m5Q1p0L7M9J24r9k72K56L6J2l31K93
1288I7k75J00J72pj56J0J24j62N0l4R2oL3J03l23J85J61m4j55o7J2K40j52j38
1312a40L06k22j14J43L36m69k06N14Jl54K38J81k70l11L79L64n33j11O65j07q02
1333e12M88L01k88k84N73n4p30M22N71m59m10M58J90l84k51O88o1q28N99N19o96
1354a48l82Q68o1o47L58N07n74m32O65M49j060J29O60k94m36M37L54o85k00Q70
1374C78k13p33M36O65m36p55P80K48q18K12P26k44q81O42O47p65l58R63j87p71
$$ y = [4, 84, 27, -86, 7, 57, 55, 105, -262, -62, 120, 6, 84, 36, 18, 9, -65, 38, 21, 24, 41, -21, 156, 37, 15, 128, 3, 86, 227, 57, -164, 154, 222, -294, 1, 147, -39, -208, -48, 138, -8, -143, 83, 156, -105, 56, -83, 98, -75, -36, -151, 5, -135, 69, 40, -311, -106, 108, -48, 26, -19, 62, -8, 29, 78, 202, 103, -169, 87, 123, 135, -196, 97, -178, -78, 94, 87, -69, -59, 65, -97, -47, -81, 11, 5, 38, 141, -182, 3, 164, 120, -35, -102, -90, 150, -2, -140, 166, -56, -170, -27, 309, -160, -366, 148, 149, -205, 33, 214, -56, -367, 12, 376, -157, -268, 397, 290, -512, -24, 277, -11, -295, 278, 224, -506, -84, 487, 28, -382, 76, 266, -118, -369, 319, 258, -570, 29, 548, -148, -530, 338, 277, -370, -12, 495, -79, -511, 154, 603, -457, -328, 332, 38, -398, 39, 393, -292, -492, 378, 165, -568, -132, 533, 97, -658, 122, 370, -448, -236, 490, 246, -635, 7, 654, -111, -469, 494, 307, -464]
1394d64K67R41o02p46P65N60r25m33J035j85q60M49Q16m80p74J030K81j250P5
1413e00J098m62q67P90O29r77j99R85l5j036J54J162o56o16P44L45j111L41O28
1432D17K7j144N77Q02q71m56J048K24j266L05J050m90j071Q75O64j004l29J176
1450E34j5j264N06P67p37m72R93M52j331K0J320m45j133Q88Q32j244m82J376J28
1469F93j415O01J007p52j029J136N06j295q9J429l19j500J048J068j142r83J415
1486C79M74j589K16J506p81j343J285P99j468l33J605j50j582P26J374j278r83
1503a143J752L98j673OJ613o43j505J356J204j842o52J977r2j880P38J566r89
1520A91j341J416Q17j859j53J843l52j844J052J395j432p60J786J38j848J95K052
$$ y = [-464, -197, 744, 142, -604, 161, 721, -204, -637, 398, 213, -647, -198, 618, 138, -636, 394, 675, -575, -500, 598, 136, -731, 59, 688, -289, -488, 497, 462, -574, -420, 742, 86, -530, 214, 559, -552, -211, 417, 444, -700, -123, 679, -192, -648, 400, 624, -642, -337, 713, 223, -848, 27, 691, -313, -642, 534, 519, -745, -239, 528, -209, -681, 312, 764, -567, -547, 773, 328, -805, 83, 915, -329, -811, 565, 693, -722, -121, 886, 134, -895, 241, 747, -548, -637, 792, 473, -1027, 21, 1089, -53, -1036, 379, 853, -736, -520, 986, 205, -1138, 147, 946, -522, -855, 750, 600, -982, -256, 1118, -160, -1143, 609, 1007, -666, -660, 953, 310, -1195, 161, 1365, -477, -1129, 848, 756, -1124, -386, 1180, 191, -1150, 266, 1083, -776, -929, 914, 562, -1282, -230, 1165, -267, -1027, 759, 897, -951, -756, 1296]
1537A296j164j406J576P13j624k99J907l00j941R89J430j472r58J822L71j830
1553h90K12J854r36j676J571J057j739n73K099j11k167R24J655j298j292J867
1569E57O10j922j50J917n29j772J106J517j646q51J886K19j816K19J943j044j364
1586a120J273J197j953m10J953j15k108R60J654j613j039K030M05k285L38K076
1602A243q78j708J476J152j651p80K030J4k187Q20J689j181j443J615J011k040
1618h18k09K207p06j869J334J694j946r30J901M24k130M15J946r90j769J686J026
1635A266j819l83J848k41j990R54J761j494j280K128L45k211M21J941r36j682
1651a372J425J247j981n92K213R1k314Q32K045j520j437J844P63k077j62K135
$$ y = [1296, 132, -1274, 302, 1015, -609, -908, 999, 699, -1242, -253, 1177, -295, -1253, 569, 940, -890, -678, 1176, 240, -1436, 135, 1192, -547, -1120, 979, 868, -1299, -375, 1280, -18, -1310, 557, 1167, -755, -905, 1012, 483, -1289, -183, 1334, -312, -1163, 723, 942, -874, -655, 1288, 244, -1120, 153, 1350, -603, -1013, 940, 825, -1283, -323, 1331, -282, -1321, 709, 1114, -1171, -833, 1243, 365, -1343, 133, 1285, -366, -1146, 884, 898, -1289, -469, 1220, 39, -1404, 211, 1222, -818, -1027, 1180, 474, -1395, -61, 1633, -313, -1243, 658, 1082, -1048, -633, 1313, 323, -1446, 240, 1266, -553, -936, 912, 671, -1319, -365, 1396, -98, -1378, 750, 1095, -1116, -695, 1246, 310, -1372, 53, 1300, -681, -1273, 940, 1031, -1283, -451, 1594, 74, -1363, 481, 1244, -833, -995, 1140]
1667A140n47k007J324J544j743q88K058N9j994L77J903j040j414J496R35j727
1683e24l92K033l89j896P83J685j503j123J969L94j949K99J912r09j629J179J452
1700A392k059l57J962k51j992Q42J856j471j043J701L96j830K4K053p62j685J191
1717c3J304j652q85K112J35k039O83J548j120j265J491Q42j868l11J877l51j723
1734a255R97J319j118j084J644L96j953M61J627o98j547J311R32j326n48J656
1750H14o2j845Q62J321j141r83J340O11j666J30J710n82j740J091J323j634n41
1767i92J500K31j820O14J634r73j377J415R09j709l31J745l54j349O12J375j258
1784a28q35J368M01j649K64J456n79j287J141R60j623k87J738k78j564N98J379
$$ y = [1140, 593, -1414, -90, 1454, -289, -1177, 881, 940, -1054, -677, 1226, 186, -1228, 268, 1203, -524, -916, 1117, 728, -1168, -385, 1300, -203, -1326, 643, 1037, -912, -613, 1299, 390, -1239, -60, 1392, -667, -1024, 938, 687, -1305, -463, 1393, -78, -1121, 580, 976, -854, -830, 1223, 461, -1224, -33, 1271, -381, -1266, 846, 981, -1058, -375, 1173, 53, -1212, 279, 1121, -747, -1058, 819, 468, -1255, -258, 1061, -57, -1141, 503, 899, -1054, -593, 1034, 336, -1211, 100, 1032, -294, -842, 814, 752, -1093, -231, 1090, -51, -1034, 306, 917, -749, -619, 1091, 509, -1231, -140, 1183, -451, -992, 508, 739, -1081, -467, 1167, 194, -1183, 232, 1141, -568, -899, 846, 492, -857, -245, 1130, -128, -963, 405, 806, -843, -579, 877, 298, -989, 152, 1112, -511, -798, 940, 662, -902, -304, 1075]
1801A075j197r31J343P03j639p4J738o22j532R21J070j337m05J496kj388M19J344
1819I82q57j112J035Q18j359o6J203k51j258O55J217j189o49J336K52j413K51
1836d05J270p30j015R61N00q75m58J332j19j211M70J086q12p11R06L08j017L5
1854d85J081l16j129Q38P39q52m36P72L37j259L28R11m36r11J016N35j057k70
1872e94J197k73p83K38Q46o67p38J129J94q22j26J025n76o73N97N90q07j46P58
1891C69M9q28J34Q83m67p05O87M68r49k22R97k04p64N37P11q06o42R47L42j105
1911e68M56O96m85n60O11L29q65l5R35k20q44M47N84n78m17N80M17q80m5Q47l98
1932Gl95L66L74o51j01P32p8p71K96O15m62m14N58M51q77%O55k82n70M86M32o00
$$ y = [1075, -122, -1053, 290, 993, -646, -720, 1018, 396, -1136, -215, 855, -482, -887, 609, 607, -781, -362, 982, 125, -987, 48, 866, -493, -559, 644, 393, -865, -210, 1007, -182, -831, 505, 757, -656, -405, 865, 135, -880, 81, 581, -294, -752, 580, 461, -750, -280, 806, -6, -717, 189, 497, -520, -485, 596, 280, -849, -11, 728, -124, -560, 212, 549, -710, -382, 529, 93, -818, 198, 733, -324, -594, 603, 330, -453, -215, 631, -36, -774, 355, 549, -273, -399, 626, 50, -623, -26, 564, -243, -389, 369, 418, -410, -276, 607, 140, -565, 122, 590, -359, -581, 416, 212, -552, -15, 696, -110, -752, 195, 537, -568, -112, 584, 99, -461, 150, 479, -386, -421, 514, 294, -550, -103, 481, -97, -514, 66, 483, -397, -442, 405, 7, -388, -22, 352, -299, -400, 332, 254, -517, -221, 394, -68, -482, 76, 527, -350, -350, 305, 23, -547, -61, 371, -229]
1954b29k4N40l4n41K20L98l43l11M08K21l83k14N06M8n38K37L23k42k40N76k10
1975A68m35J03M07l33k59L21K90l66k43N83J2m87J30M07k78o4Q2K31l65j11L88
1996A81k40j64L38J13k57k48L36R7k98K34J04j39j79J81K51m55j80M12L4k55n6
2017a90K59P4k89J36J94m33J74J42J72k92P0J22k27o7J35K52l48j0K10K2j10L7
2039C3N0L3k17L26m9k69J00J42j09k07R4J33r1Q0J05K1j12j19J55j49j8J62j27
2062c3R2j44L13j02j50oM2m4n6J04J17K1q8J5n3r3K94k95j28K13J97m96J76K78
2086A74j15l5J36n1j30j40J60K08l15J37j90L7J27J10j0K6k62K30j62M0n6J03
2108B2j5L8J6N2n1j6j2r9l6K14j12o9K2K61k72P4M5j67Q3J47r8J27L7j45p5m9
$$ y = [-229, -253, 287, 253, -288, -68, 330, -13, -324, 84, 305, -78, -292, 214, 262, -276, -39, 284, 42, -198, 378, 168, -267, -164, 243, -90, -349, -28, 262, -104, -347, 236, 248, -239, -109, 298, 20, -44, 38, 269, -96, -207, 181, -59, -223, 115, 228, -29, -277, 59, 156, -142, 92, 196, 57, -122, 59, 310, -145, -325, 87, 121, -134, -190, 69, 143, -146, -10, 184, -249, -75, 67, 239, -53, 17, 139, -88, -155, -20, 232, -116, -126, 84, 106, -4, 33, 83, 116, -101, 225, 176, -93, 7, 149, 40, -167, -73, 60, -31, 49, 154, 175, 63, -56, 99, -50, -68, 94, -33, 59, -85, 228, 126, -24, -30, 12, -32, -88, 16, 133, 154, 66, 81, 28, -65, 229, -66, -194, 19, 216, -280, -104, 174, 59, 24, 160, 109, -21, -161, -1, 207, -108, 29, -161, -124, 3, 113, 103, 129, -133, 97, -65, -25, -81, 22, 7, 45, 61, 113, 62, 46, 34, -65, -101, 113, 1, -68, -46, 215, -57, 17, 62, -105, -22, 125, 27, 154, 191, 46, -29, -78]
2134g8K33J9l23J59O6k15K9%KL6oO2J69k38K04k11j48K34J99q7kL0j02Km3o7K28
2161A52j79j38J45K07j81j06K87k15P1L8P3j44o5J33j66OK02l0k9J1n3n8j91K07
2185b3J26k56N8M2J65o0M8K6j98o8K45K3r9Rp6Q9K6Lj59P7j83K78p9o6O2P5j41
2212e6J3L7J2J90k53N9J12k1k88L13j95R4J15R6l06j2K6J56q1Q8j7J8p6J2Q5j64
2238d3J01q2J3Q9l8o4M4j41J68k6k2o0J70j08N8j44K34j17k0j15K35n0%l9J51
2263A94l4j37R3j94j61K17R7k66J61K06j92j23O1J66j02K5M5Qp6K2J4n4k5J06
2287E1k7L5p6rK05k74L07k8j21Oj01rJ16j39j1J18j7K0j07j02K48j00l1k6J34
2312F2R9k77M4K31j17n4j61L68j44m9j12R3n9J0J08Q9k9k9m3j68J76l9O5P6k17
$$ y = [-78, 155, 174, -149, 10, 76, -139, -110, -110, -108, -72, -78, -16, 153, -85, 119, -92, -240, -6, 193, 106, 104, 134, 32, 34, -9, -76, 152, -27, -165, -20, 187, 6, -100, 187, -28, 43, 81, 154, 10, -55, 78, -88, -82, 120, 90, 61, 72, 19, -39, -230, -23, 103, -153, -95, -53, 112, 52, 100, 126, -72, -140, 105, 128, 29, 38, -38, 51, 77, 80, -79, -2, -185, 93, 14, -52, 10, 85, -56, -43, -6, 6, 196, -57, 2, 114, 93, -195, 118, -77, 17, 132, 228, -78, -90, -64, 92, 11, 99, 82, 100, 24, 36, 121, -43, 58, -24, -11, 78, 40, -24, 20, -121, 47, 21, -1, -61, 109, 1, 59, -85, 149, 32, 12, -103, 132, 82, 82, 43, 194, 160, 23, 116, -78, -239, -22, 75, -191, -30, 176, -16, -139, -78, 88, -14, 11, 56, 64, -12, 10, 24, -30, -55, 51, 24, 59, -17, -26, 179, -95, 212, 184, 63, 69, -32, -41, 75, -64, -75, 43, 26, 46, -61, -163, 85, -15, -46, -72, 62, 161, -116, -72, 159, 42, -12, -173, 195, 51, 2, -110, -17, -76, -66, 42, 131, 102, 73, 30, -138, 38, -1, 64, 140, -77]
2337g7N4RJ74j81K50k56Mlo5J32p0j13K21J66k94R1j21J9l1J67j35kJ68k4OJ6
2363A05O0q8k65K74L2p1q4J51l3J4j01J55j02j72j5K73j65j40L82m9k20j60L12
2386I3n6K2q0R7Or6J8L5j7j8P4j01n7J14J35l94J85J73k9k59K26J5Oj90K96p5
2412A23j28pmJ43j89J26j05J70j81J20P2k42J95O0j43k6J34J24l94R5K56j83p5
2435e9n6J75K5k16J89N0j42r0K25j63n7R4j3P4j48K95m3o7K1L8p5k31K57J60k37
2460Fk01K98kj57l9L43l52p7O1M12l91j54L42l8jJJ11k17P5K27l79j7K09Nj39
2485g4m0q4K19k13K25J82l38N6P5J63j02j25L9n3n1K09q6J88k84J18K23l87l9
2508a79L73l08M6J47k08N3J02n9jj08J4K88l12NN7J59j65L8M0J83j86j8J09j71
$$ y = [-77, -23, -14, 160, -21, 229, -27, -23, -26, -91, 41, -29, -142, 79, 245, -49, 42, -79, -60, -91, 76, -59, -61, 107, 83, 89, 105, 165, 77, -188, 86, 118, 47, -37, 114, 81, 95, -6, 149, 47, -125, -140, 133, -32, -172, 210, 161, -59, -219, 93, 37, 59, -21, 76, 82, -14, 4, 39, 22, 4, 78, -23, -80, 34, 169, -225, -40, 133, 104, -155, 71, 86, 92, -98, 198, 123, -5, -12, -16, 127, -62, 64, -41, 129, -52, 68, 140, -102, 93, 153, 10, -16, 118, 242, -152, -57, 199, 16, -59, -115, 60, 85, -131, 58, 108, -34, -124, 101, -62, -119, -25, -38, 36, -112, 183, 140, 73, 94, 132, 57, -174, 83, 243, 6, -195, 103, 101, -56, -95, 248, -104, -181, -120, 292, -99, -253, 89, 51, 50, 51, 162, -55, 20, 247, -132, -149, 60, 65, -74, -114, -198, 21, -192, 33, 215, -123, -67, 8, 171, 69, -56, -17, -70, -121, 88, 2, 190, -94, 24, 247, -140, -179, 194, -114, -68, 79, -129, -76, 26, -33, -34, -142, -128, 160, -152, -147, -90, 69, -96, -58, -18, 165, -21, -39, 70, -101]
2532a01K8N2J88k16m3K20j36K28k43Om5r8O6J58O4j01J28k91J37n8J73j7j60K04
2556A43j10J9m3R4j50O3J11o6j25O2J60p4r9M5j7l7O6q2K4M1k15K92j94J21O3
2581I2J5q5L3p5K54k22K2J32j57q1K53j69j53P8M3Kn8J74l8j64k7J36M8p2J83
2606A64l9j24l3O6J91j50j20M3r4J19J49k6j35k9o2P2j50J7K87n1l87K13J29%
2630E0j56J02L8o6J31n6J70l25J74j2J04k91J76p9K3J10Mk41J95K0p7m4O0m1j72
2655b03J51r1K87k05%j29J42Nl1J69j6j03J08r1j6r3J72n3KRk7p9Q0J49j76l4
2681g3J20J18k5j12J0K7q3j2m1K05j59K41j84r6J06N9J3k78Q2l3K55o4L5lk2j51
2707f5J46K3j48k00M45j33k25J23L2R0q8l5J53L6p7M0q6J5JJ31k46J22j35J37
$$ y = [-101, -73, -21, 167, -49, -92, 128, -8, 220, -23, -17, -62, -160, -94, 64, 128, 27, 155, -136, 1, -57, 116, 99, -61, 143, 33, 52, 9, 103, -47, 16, 127, 61, -64, -2, 158, 84, -15, 30, 13, -24, 42, -40, -16, 25, -190, 102, -92, 29, 92, 107, 22, 55, -20, 234, 12, 34, 166, 9, -72, 181, 12, -141, -63, -20, -18, -76, 98, 60, -104, -131, 5, 53, -19, 164, 125, 1, -32, 34, 225, 75, -45, -2, -96, 23, 172, 146, 11, -18, -80, -8, -158, -141, 146, 95, -292, -79, 50, 50, -106, -4, 34, -32, 99, 43, 213, -112, 62, 50, 154, -137, 39, -40, -17, 93, 97, -144, 51, 71, -6, -50, 10, -31, -203, -52, -143, 144, -61, -61, -190, -48, -43, -74, 95, 79, -24, 84, -7, -23, -116, 56, 3, 5, 14, -13, -92, -12, 137, -39, -73, 47, 165, 140, 28, 38, 65, -18, -30, -71, 134, -25, 216, 32, -64, 42, 101, 114, -164, -82, -115, 140, 76, 111, 108, 86, -65, 81, 104, -44, -244, 201, 68, -157, -34, -2, 88, 0, -35, 118, 154, 77, 117, 31, 46, 47, 178, -68, 54, -81, 56]
2731E6q6N6lJ12j94K71j98j28J18O7q5N7J93j71L3j49L1J07j41Q6Qj31L7j5J93
2756A24j28M7K0j12K24l79K00Rm5J27r1PK3j67J51j55J97rj72l0K49oj29P8k29
2781a96K24N5k70K50n8j9P8j05m3Q5oL7M0j49n0j0K71j23M2J05j33kL5j70LJ82
2807G3j30Q8N7j57k1J51j04k7O5o9N6L2k5J58j44q1K6Q8j42lon8Q9J43Ro3M7j77
2835a25Q8J08j90J79%R4j46n7P1p6JJ32k69J53Q2m5N0j11J11l9jj01O3k8K8R6
2861F8j66P5J3J39k40L7o0J80RnJ0j41J64J90l33nn8K24k08O3O6R4j28M0n2J2
2887a2Q5k38K55Mo2R5m7%n5j05J64j11n5L9J47k81K04p1r9O1J13k95M38k99J14
2912a1L5j79J83j15P6J12k72K21l5M2Q6j11L5m9j25J38n9N1j66K00M7j52J83j95
$$ y = [56, -30, 26, 23, 135, -59, 212, 14, -114, 4, 71, -14, 43, 236, 65, 98, -51, -20, 87, -54, 32, 40, -91, -54, -69, 124, -4, 43, 63, -49, 175, -204, -4, 5, -40, 87, -4, 3, 26, -141, 10, -145, 52, 43, -129, -159, 90, 84, -45, 33, -196, 28, 83, -187, 63, 5, -14, 64, -41, -84, 1, -5, 32, 72, -77, -127, -137, 134, 11, 53, 158, 25, 23, 58, -112, -109, 73, -57, 31, 88, -69, -90, 61, -43, -70, -5, -74, -18, 14, -11, 147, 3, -78, -52, 36, -106, -109, -115, -173, -84, 59, 68, 5, 52, -125, -37, 71, -119, 60, 60, 154, 8, -49, 22, -54, -53, 79, -190, -37, 45, 0, 50, -61, 50, 11, 10, -91, -28, -56, -28, 68, -98, -23, -10, 129, -111, -74, -134, 46, 55, 50, 60, -81, 83, 273, -60, -65, -123, 101, -107, -44, 22, 116, -12, 28, -24, -12, 73, -165, 90, 94, 32, 127, 80, 80, 25, -80, 84, -27, -82, -43, 104, -177, 27, -44, -143, -82, 31, -264, 174, -125, -11, 24, -155, 28, -87, -11, 101, -171, 50, 15, 57, 143, 32, 67, 18, -107, 31, -28, 23, -143, 57, 104, -48, 135, -60]
2936f0%m2J85n6j69J32o5k8n6J84j16nJ75n2r8M3m3J54n0m1J7p7M7J6P3j58K12
2963A22k5j4J02j85m0L4k80K28J54j34qJ47L6j07j36L73j65j71Q5j07J68o1m7
2986c1J83k77J1J00P6j46J76j51J2J02j5P3j9j72K28q1r5j41L05k53K64N6j79
3009B6l5k5J16k6j0J2N6j92J09o6lR2M4R6j89k3N6q9J2K55j57j42J78k7M6k60
3035a46J04L84l53j20J64j9O9k76J98Q2k95P4N27n15J5K68Q7k27n4K32k52J0M6
3058CJ4n7j3J57r2k10L75lk03j02L00l8l7j94K61k21J2PJ13j39J63j0Nl55J79
3083h5J67k33p9K89N9l01J58J86j20k97M57k33l6N9M5N1k41M3L48j70k07J11J22
3106I3k65K50J21k23j34L41j0l94J08M02j16m94K46K98l29r4J59J20j80O5J79
$$ y = [-60, -60, -102, 83, 27, -142, -10, -75, -103, -159, 25, -91, -96, 79, 27, -71, -28, -71, 83, 33, -8, 9, -68, -21, -5, 68, -90, 122, 97, 83, 185, 0, -40, -6, -286, -58, 96, -38, -46, 101, 137, 30, -106, 267, 102, -69, 16, -91, 77, 16, -31, 152, -125, -114, -14, 62, -84, 92, -59, -47, 55, 40, 113, 94, -78, 150, 69, -26, -167, 138, -115, 149, 205, 26, -9, -34, 82, 56, 46, 58, 114, -78, 31, -35, -38, 54, 98, 194, 5, -18, 38, -51, -39, 216, 59, -83, 95, 68, 114, -146, -42, 342, -11, -131, 33, 14, 83, -193, 5, 87, -208, -134, 393, -122, -107, 161, 248, 21, -33, 199, -53, -43, 3, 17, -40, -53, 104, 12, -198, 177, 174, -29, -131, 169, 131, 94, -100, 161, -60, -48, -41, 72, -67, 96, 86, 91, -264, -85, 82, -151, -230, 59, 118, -183, -25, 161, 41, -256, 201, -32, -68, -9, 36, 87, -154, -111, 237, 67, -140, -29, 93, -172, 78, 199, -24, -158, 183, 173, -221, -113, 289, 173, -321, -75, 223, -106, -200, -41, 79, -101, -36, 143]
3127A43j85k5O3J88r7l28M38l7l78J22K89o4k51J09M10o04j06M86k46j29J84J16
3149I8j70JJ35k9j30j06M00j46l90L51K75j74l15L81j71k36J00M13l16k56L73
3170H8P5l74K17K16j38j91K53J16k59j29L26j83j78o0K88K1k82K84K11n00Q2J83
3192F6Q8l55J70K76l16k83M09J0k01J17L25l13l30L54J03j52m7L7L18m42q6O42
3214C90m25k73L83J15k24k42N51l40k53K73L43l22j95K11J58k57J00M59n25j87
3234b60L05J47j99j50L20O7m36J01L00j93k18M64j67k03L9M22l72k14K84J69k85
3255g9r6M36p2l18O7K50k94j24J51L87o00M8L40K8k98Q7L49k82j19M90j44m33
3277b26L6M27l22j22L62J07m67J76K4P6l23L09J89l24j13K39J33l86K35L03j56
$$ y = [143, -42, -67, -4, 184, 87, -241, 197, 160, -218, -96, 193, 129, -122, -13, 397, -207, -313, 173, -73, -202, -18, 98, -72, -71, 64, 35, -95, -201, 199, 53, -337, 14, 289, 115, -200, 181, 10, -226, -126, 287, -29, -285, 88, 163, -211, 6, 222, 84, -107, 146, 262, 3, -126, 200, 17, -161, -221, 67, 88, -194, 90, 301, -199, -117, 66, 154, -201, -31, 245, -71, -354, 55, 65, -136, -19, 306, -7, -337, 17, 120, -32, -79, -42, 276, -166, -252, 390, -35, -308, 75, 190, -34, -276, 275, -65, -318, -45, 298, -24, -219, -8, 150, -107, -7, 452, -73, -260, 45, 192, -7, -157, 163, 230, -206, -105, 195, 2, -216, 248, 81, -122, -83, 339, -33, -247, 37, 206, -79, -175, 261, 189, -129, -62, 188, -106, -230, -79, 308, -292, -244, 96, 124, -174, -87, 262, -20, -139, 351, 207, -226, -190, 237, -85, -207, 155, 262, -205, -29, -5, 71, -252, 57, 246, -78, -191, 48, 181, -205, 30, 333, 177]
3298A77n27K29J79k15k8M46k56k13J64K07k69N7j3K38m16J78M91l37j77J25K02
3319B42m80j45N30J43n57K87J32j18j41N5K89l78n3L96j96k23K04J01j02m43O37
3340A80j49j03m2L48l19p4K21J91k39m11O23r5l38J31L89n07j02M04K50n61K0
3361a83K87J50m49L16pl69P4L02K06n09J23L21j70l88N00r8k65n6L69j11l23J19
3383a61J50m9j42M18k34r5Q6J56j04k33L53J01k08l28N68k83k77L35J90l59l7
3404a53J24J87k59N1J83J4k22J51P9r2q9J73j71j16J33J86q3k03J31P5j58j82
3426b41L15p8k81J87L04k35n1J17Q4j73o7K35j42j90J99L6o2k46L62j67j78J35
3448a37L45l44OK00J49l31J36R6k50R2QL34l67L9J04j2j03Q6J43j31k89K31J61
$$ y = [177, -350, -121, 58, -157, -185, 261, 5, -208, -44, 163, -106, -49, -62, 176, -240, -62, 429, 92, -85, 40, 242, -238, -383, 147, 290, -267, 20, 152, 34, -107, -52, 237, -141, -194, 202, 6, -217, -13, 88, -14, -457, 180, 31, -72, -114, 234, -85, -159, 62, 253, 14, -397, 226, 131, -207, -76, 313, -194, -296, 108, 358, -203, -183, 104, 254, -195, 121, 114, -255, -181, 121, 327, -182, -59, 262, 92, -296, 204, 106, -159, -215, 154, 43, -280, -161, -11, -60, -202, 216, -18, -113, -27, 129, 25, -208, 145, 246, 38, -290, 278, -5, -282, 53, 243, -116, -153, -29, 158, -101, -50, 133, 147, -75, 76, 155, 63, -26, 147, -24, -140, -7, 179, 96, -107, 24, 99, -59, -241, 74, -4, -285, -98, 206, -29, -80, 37, 121, -52, -119, 116, -26, -216, -17, 19, -43, -289, 73, -94, -272, -137, 208, -136, -130, 70, 219, -112, 24, 120, -130, -38, -30, 304, -63, -24, 80, 68, -35, 51, 194, 63, -226, 5, 166]
3471A66j99j62L40J40n16J28K50k34o6L30rl23q7M78j15j66K37j14k52O8L24k61
3493d3j09J51K05k24p1n0K55j75mJ46j0j81J11K44l39O9J95k66o9J15K84k79J1
3516c4Q4J08k06n6L69j95j53K68o3k58Q9J69k8r9j10L23j95Q7j7l2k54J09J85
3539I1qk47J69J68k25j12N7J74k65J2K85j82J52l1M6o3OoK6p1J9k7m2j11K46r4
3565c3j06o2K71pl04J97L4L3N5K8J43k47M0m0j42K52n7Mj84L5J81n7j22n9L22
3590A75k59N6j30K15k53J97J7Ll2J8Q8o5j88L19k03j29N3K15j06K4K19l33J96
3613I7k77N00m51J52m7J53j07k4N2K2M7l99J87K19o1m0K6O5j94J17m5r2K0J91
3637A11j2o1K4j22R3j40J18J18k02K28j67q6K5M9j1J06J7L2j41o6J15l0o7Qm6
$$ y = [166, -33, -195, 145, 285, -231, -103, 147, -87, -153, 177, 168, -155, -242, 236, 121, -45, 192, 78, -174, -106, 218, -43, -152, -1, 204, -20, -91, -141, 114, -61, -65, 81, 71, -110, 1, 245, -94, -25, 170, -96, -165, -50, 234, -45, -34, 50, 158, -48, -104, 265, 70, -83, 185, 122, -136, -47, 122, 94, -5, -115, 208, 13, 100, 83, 51, -203, -94, 91, 83, -164, 5, 173, -52, -164, -107, 67, -198, -186, 99, -83, 69, 38, 84, 21, 27, 21, 47, -24, -5, -32, -74, -185, 61, -33, -139, -201, 70, 63, -241, -44, -10, 23, 78, 106, 249, 2, 42, 2, -140, 112, 55, 59, -125, -90, 91, 34, -88, -147, 175, -84, -28, -158, 57, -196, 1, 18, 21, -11, 7, 95, 30, -158, 161, -42, -171, -118, 97, -9, 15, 234, -99, 97, -180, 320, -131, 21, -26, 127, 20, -4, 48, 70, 117, -282, -95, 124, 63, 23, 49, 114, -80, 37, -8, -100, -80, 111, 99, 38, 62, -60, 33, -107, 11, 129, -73, 155, -12, -98, -73, -24, -35, 71, 88, 120, -21, -87, 28, -2, -69, -61, -107]
3662a07J59j88j22J35J30j07M4J3Q7l7O6n9m0o1K21j4j62R7K6j90K4K23j30K8
3686C6l6K4j13J35M8M2k34K37j77j5j02J42n8K21o9m2n1RL8q0k7K54k20R3n5P3
3712G3p7r3J8k2Q9K2K90m18jP7J20j43J58r8M7P4r1K0k27J95Kj18Q8L5nL3j20
3739g2K11k71J92Q6k5N2n6p1J1L0o8o1j2J65j09J94l01k9K81k09j4J66j4O4k27
3764h7J40j03K14l11J17L7J5J49k83l2J12J7mn6q9K57j58K18j1j08O4q6j0RL4
3789D5l3L6O8k50J89p7p3R0j09o9K39j49K0J08q4L7l4j9J09r2M9nJ9o9J19p8L9
3816B6J33j8l8N3l37K92j05j3RK8k35K17M7R2J1j76p3N9K4j31J85r3J4K31l63
3841a61J09K1J64j44R1r1N8O1j19m9M2J02q9J21j80Q5j13R0N7R2q6M8j50l9l0
$$ y = [-107, 52, -136, -258, -123, 7, -100, -56, -43, 44, 7, 73, 14, -26, -87, 134, 120, -42, 55, 81, -109, -85, 138, 8, 36, 0, 24, -89, 46, 94, 136, -98, 139, -38, -53, -155, -13, -71, 150, 81, 39, -12, -3, 35, -45, -72, 182, -38, 55, 0, 73, -4, -97, -79, -101, -12, 10, 300, -118, -119, -42, 78, -65, 93, -5, 42, 116, 25, 45, -182, 13, 15, -103, -15, 20, 15, 48, -72, 139, -132, 60, 146, 121, 173, 117, 46, 57, 87, 19, -42, -54, 111, 2, 196, -105, -134, 147, -62, -76, 90, 76, 140, -87, 53, -50, 164, -147, -30, 7, 22, 171, -112, -144, -32, -15, -19, -75, -164, 93, -65, 153, 142, 34, 98, 12, 2, 11, 45, 12, 48, 116, -134, 55, -22, -95, -5, -114, -183, 56, -93, -73, 35, -49, -12, -46, -65, 44, -48, 1, -4, 15, -54, 65, -13, 26, 159, 141, 103, 156, -181, 111, 6, -7, 2, 30, -205, 12, 59, 151, 162, -14, -87, -28, -4, -135, 50, -43, -29, 202, -161, -52, -31, 133, -11, 80, -11, 47, 108, -11, -60, -18, 84, -5, 116, -64, 21, -92, -2, 55, 147, 61, 109, -41, -80, -110]
3866a10O3K4o8J29j42J84j69J55k42J54K8j48K41M5k34K4K00j95J22J1K0j0q4
3889br3q4M43l95K05j6o5L4N4O4k92K08j14L5N8p6j49J93J14r6k1J00k43L04o8
3914I8j42j53J57J95k26N7n5J34k5l6M7j60J52J00j64Q3J39k62J38k34J77k5O9
3937F4l2j54J91j10J34j28M5k05J8J79J04j73J55k06R3J8M1LM1N9j58k8J19j31
3961f1J97L0k48J29n9J26j78J17j08J4J06P6j24j00R4k10K65o5j19K14j20N0k42
3984b16L40l07N5K30k38J06N4q2O6N8O1j57J79L4k62q4J51J71k17J54l3m0K27
4007B50p4l5j06j82J17J14N7j72J70n5M2lj0oj78N6K5J1p3J84J32m02J28Pj17
4032a20M5K02j44J26l42J94J12k3o8m0J20p5Q2o2j35P5J36jm9r3m0R8q2K46j00
$$ y = [-110, -47, -23, -91, 38, -104, 80, -89, 66, -176, -22, 6, -142, 99, 144, -90, -66, 134, -61, 61, 72, 92, 82, -2, -95, -179, 264, -131, 74, 58, -7, 27, 81, 145, -147, 61, -53, -18, 40, -36, -185, 8, 122, 26, 5, 105, -138, 166, 98, -44, -197, -40, 155, -71, -14, -69, 65, 40, 4, 51, -109, 43, 143, -21, 62, 201, -61, 77, -157, 20, -5, 64, 32, -122, 69, -41, 93, -35, 10, -195, -177, 2, 106, -67, 88, -118, -25, -7, 34, 37, 78, 137, -21, -49, 70, -61, 136, 166, -82, 47, -12, 114, -64, 53, -55, -41, 65, 141, 17, -83, 11, -199, 66, 1, -118, 96, -24, 26, -216, 124, -183, -128, 102, -136, -30, 24, -58, 8, 66, 127, -30, 149, 183, -79, -163, -12, 159, -58, 96, 63, 23, 250, 176, 141, 35, -147, -30, 84, 141, -31, 139, 84, 126, 123, 113, 107, -71, -15, 10, 21, -52, 132, 264, -138, -10, -3, -120, -75, 127, -17, 109, -233, -39, 73, 50, -18, -58, 62, -13, 69, 7, -128, -53, 83, 82, 33, -60, -100, -2, -84, 162, 62]
4057F2j42q4O8M1j30K60j59j6J05j17K06o9q6K07l34K47J14j56J6j27j65J47J00
4080a2j33J38p2k3O8J93j38r2p4R1P1J16m5l34K43J65j00l4r3K46l6k45K55Kj42
4105A5M1J64l35Q8NJ24k56R8p1J39q1j62K58nj11P3N3m1J17j39Q6j14K6k1k4J7
4131e6J39O8k08J82n1O4nj1k21l4J68L6K9o1j19J98j21m8K3M0r6O3J50p5j82q
4157a36M26l36n8k5j8R1R2j18J42L4k6k2r2J35k14O0j13J35M5O0K9n1j00O6%J9
4183B5Q9r7P8j65M8p5J31O1j43j61J12P4k5k6J55j71P5n3J43j41%J01j15Q2LR7
4209A02j10n7j1J27j1j47J99k7N1j64m5J66J23j67j53K5K12j82N7k0L6J7l2m0
4233e1p7r3K17J95k98m2O9J52r9rJ8p6J66M0j15Kj07k9O9n1j0R1N4O7j4j21P7
$$ y = [62, -80, -164, -96, -55, -185, 75, -84, -100, 5, -112, 94, 25, -61, 146, -188, 59, 173, 17, 33, -94, -259, -112, -12, -145, -7, -79, -102, -34, 159, 21, -71, -145, -54, 17, 133, 88, -246, -3, 162, 62, 28, -65, 181, 145, -100, 155, 157, 15, 56, 220, -115, -27, -22, 102, -154, -56, -127, 12, -69, -231, 27, 22, -89, -16, 37, -4, 113, -26, 60, -54, -28, -49, -73, -56, 83, 151, -57, 125, 74, 138, 133, 122, -99, -133, 35, 71, 100, 39, -80, 118, -3, -51, -28, 12, -84, -21, 129, 54, -128, -136, 290, -46, -104, -129, -147, -56, 36, -82, 60, 94, 68, 46, -46, 89, -125, -65, -178, -43, 2, 62, 91, 40, -60, 6, 6, 25, 114, 17, 95, -70, -22, -97, 34, 95, -48, -209, -97, -23, -48, -74, 81, -90, -15, -68, 75, -66, -66, 35, -80, 2, 5, 102, -8, -65, -76, 51, 40, -107, 92, 65, 116, -48, -93, 73, 196, 29, -124, -99, 113, -69, -12, -32, 4, 21, -11, -51, -128, -221, -4, 191, -107, -149, -80, 72, -27, -36, -18, -94, 72, 112, -3, -1, -108, -137, -68, -119, -129, -38, 16, 83, 69, -52, 25]
4260B5q6R1j8Mj5o2Mj24J36L2l3o8J66Q8j34P3j02J12r3j8kJ72j00o1q8J36j42
4287a07J7l1M24k44Q6j37J01j43R7Kr2J53M4j97K3Q2j85J91k19K70k08J51j18
4310d0J7J09J37j84N0j65R6k2K5L3q7p0N2j9P7N7K8p2m0J27j47J35%k11j00K22
4336Hq1N1p9K0j19K24j93J76j12O8N7K6r4R5k2n9Q4n0j15J16J34n7q9J23k40j2
4362a40K13Q9j88qR8N9j08m2j8J58j55R3m4N8mj85R1l7Q4j6N6k5K0l0O5R6k2k0
4390A38N2k04J38r6K4PJ01k43j8R8qj28J32Qo9J23r6Q7L9j6P4j53J02k14J50M6
4416G4j53J92k51K21l6j29m2J68j53K2N0N7P7r7j26K56j20J36o3p8r1M7K9o4M6
4441b8O9k0J7p5J08n1j29J72j7j61L0K12q1J5K6k03J51J00j32J9K9j59K1J17o8
$$ y = [25, -61, 30, 12, 16, 1, -61, -57, -181, -45, -13, -46, -114, 52, 140, 6, 79, -23, 89, -4, -22, -24, 148, 48, -13, -101, 35, -107, -90, -121, 303, 59, 145, 8, 109, -34, 63, 65, -27, 126, 170, -27, -4, 78, -107, 84, -135, 135, -73, 78, -40, -23, 86, 223, 39, 89, -76, 20, -2, 23, 56, -31, -101, -49, -68, 9, 66, 94, 22, -18, 109, -38, 97, 97, -114, -214, 8, -73, -22, -101, -81, -200, 24, -169, 7, -105, -37, 20, 46, -48, 47, 25, -34, 50, 0, -115, 1, 135, 78, -11, 112, -128, -140, 73, 162, -26, -34, 64, 123, 15, -27, -45, 113, -42, 51, 7, 65, 61, -124, -33, -70, 14, -2, 54, 29, 49, 19, 84, 180, 158, 138, 190, -14, 124, 28, 52, 59, 160, -83, -101, -3, -11, -139, -7, 1, -68, 55, -41, 46, 85, 69, 143, -10, 92, -122, 28, 74, -79, 113, -138, 83, 47, -82, -124, 44, -109, -87, -37, 20, 97, 0, -126, 130, 10, 146, 83, 5, -86, -39, -10, -74, -28, 41, 21, 38, -37, 71, 20, -109, 63, 46, -115, -85, 127, 46, 61, 87, -116, 35, 135, 3, 22, 51, -108, -87, 30, -38]
4466c8J12k73K13pj09Pk0L4J5P7LK2l6q8J31k05J91j7L5R7J3k35R9M8l0j28K6
4493f3J69j21J50j11Q2j9j50M8p8J22M2%pk53L54k96Q8r4J38j99K39K63l60j1
4517f7J86n1j2l0j69K08j00n5J04n0J83J1M6k36l1O4M7q7o3J94k09K46j29J7J7
4542C4L0K9r9L26j78j74J9K5m2O0l4J04oo8P3M2N2k99J15K6K5o3o6KmM8j06K32
4570A03M6j1q9k07K34J3l2j60mJ51K89j77l46K50r8m5M0J17n3j17N7j69NK09N6
4595F2r8p4kM7oJ09l8o2M6K15k52M4j7jL1j7N5O9j00kop0O3J24R2k80p9J94j25
4624g8j37J55K06p3j84J55J5O8r4o8J51j43mK00r0j27O8J6o3j22J55Po7N1N2j18
4650f9P2N5N1q0k02J71J52q8j57R2r9K1J21K7j87L00J2j45N9k04Q5l1k9J12n1
$$ y = [-38, 74, -199, 14, 7, -102, -95, -115, -81, -66, 11, 14, 36, 0, -88, 43, -162, 29, 12, 47, 144, 157, -78, 21, 69, 39, -89, -63, 106, -15, 135, 24, 106, 87, -63, -15, -93, 29, 71, 71, 64, -189, 165, -131, -43, -137, 1, -198, 41, 304, -56, -67, 119, 68, 56, 26, -143, 65, -35, -90, 14, -36, 147, 158, 204, -32, -63, 1, 48, -39, -102, 92, -117, 129, 0, 17, 34, 64, 93, -6, 320, 142, -32, -13, 12, -30, 30, -4, 100, 94, 26, 99, 141, 193, -106, 9, 35, 60, -3, -69, -67, -71, -23, -129, 103, 149, 138, 49, -158, 76, 89, 57, -103, -107, 44, 333, 156, -190, 60, -38, -83, -43, 74, 21, -96, -39, -208, -203, 6, 62, -36, -110, -112, -65, -71, 38, 0, -62, -16, 199, -53, -9, -26, -27, 4, -13, 42, 111, 11, 9, 3, -67, -4, 120, 212, -68, -147, 47, -78, -215, -60, 146, 73, -111, 44, 59, 127, 33, -35, 116, -27, -31, 169, 79, -48, 20, 36, -27, -149, 6, 13, -54, -3, 49, -69, 3, 58, 109, 29, -173, -2, 150, 62, -95, -3, -102, -81, 40, 67, -120, 180, 192, 47, 106, -98, -13, -44, -73, 39, -12]
4675a2J6K9J86k01n6M5J74k63N3P1n0r0J71o2k1m3J23j50j83K53K3q0J70N2K0
4700A75k25J31j48K1qP3J25j80j28J81k7j65K04K8N8j94O7P4j24L7J02j16J64
4723A25k42L56k24k27K32P9j29O4J04k8k21K61j1l03K40n4J07k47K78j40j45j33
4745b58K25j3n7P5K88k05k35P3K57j07r8K9k1m5Q0n7R7j19J17J31l01J80J24q5
4769G5j21R8k11J80j14J63K5j61KJ19k1k3J69j15k68K18J28k2l88L05L7j02j27
4792a54L44k6l20K28J49j08j78J87l3j20q6L49n2l79L8J03M7p0J10mp1j36N07
4815C25l39j35J31J65j67Q4R5k02j59J79M45m77j5J08K9k71J83K51j81l04L91
4836A36J4o1j14J54J82m98J77N5j93P8J03Q5m6j06K59j81q2p1K78m21K28J73m6
$$ y = [-12, 4, 33, 219, 18, -38, 7, 181, -82, -29, 42, -8, -98, 73, 11, -10, -53, 70, -80, -263, -10, 13, -67, 103, 155, 175, -50, 81, -67, -46, -54, 19, 144, -36, -164, 17, -10, -175, 29, 57, 115, -79, -12, 62, -62, -25, 77, -39, 125, -117, 239, 15, -212, 20, 99, -30, 34, 138, 110, -111, 150, 139, -164, 76, 22, 129, -118, 160, 20, -125, -258, -33, -46, -103, -28, 260, 55, -180, -107, 150, 43, -55, -26, -47, -92, -12, -69, 28, -91, 26, 157, -144, 36, 160, 75, -46, 52, -159, 21, -93, 70, 95, -66, -64, 55, 34, 11, 180, 65, -203, 15, 143, 121, -267, 38, 75, -27, -154, 190, 164, -156, 72, 221, 113, -65, 122, 89, -31, -117, 232, 180, -199, -161, -58, -11, -81, 29, 25, -46, -182, 325, -14, -149, -18, 147, -20, 64, 159, -43, -202, -23, 422, -55, -70, 38, 67, -204, -21, 230, 49, -255, 136, 150, 89, -25, 129, 311, -187, -10, 45, -148, -70, 33, 118, 72, -34, 225, 44, -38, -109, 169, -252, -24, 149, 103]
4859A03k53OO1K5l43K96K24j11j53K91j11l11K82o2O1j74K78q1j98J8J39R0j49
4882g2N5O0j30j14K38Mp5lJ44rk54K93K19l55k7R7K8k48J24L42m52k4M34j93k06
4907a24J23J55j47k15K28J22l16l7L29l5j91k5L13k75j47J87R5j13l1K65k30k60
4929c29M11j32p6j0J76R6j06p5K35k78p6K58J51k31j57L50j19k59J31K43j81j87
4951a65K55J94l12j48K34M6l00M76j77j22n1J81q1q8qK72j07l18L03J46l30J37
4973C7K06j22l20J79J93j54k46L61n6k57J74J25o5m71M52n1n7kL26k45j41J18
4995a6K73l67J2K73N9m27J24L34j55j71J85J01k80J9J57j18j88K78J01k01j10
5016a17K08J14m67J59K32k80KL8L95l27j92K22Oj55K46J35k21k82K56R6j14kK19
$$ y = [103, -150, -144, -83, -58, -401, -105, 119, 8, -145, 146, 35, -276, 6, -56, 5, -169, 109, 28, -170, -152, -13, 77, -72, -17, 43, -87, -201, 37, 41, -34, -37, 107, 98, -156, 137, 356, 1, -26, 71, 99, -149, -25, 317, -135, -159, 275, 82, -124, -1, 154, 7, -208, 20, 142, -174, -211, 118, 83, -108, -133, 180, -95, -242, -55, 40, -73, -104, 161, -69, -329, 82, -50, -126, -136, 40, 136, 30, -45, 190, -88, -164, 94, 245, 14, -143, 207, 88, -171, -40, 203, 22, -165, 90, 284, -28, -176, 58, 104, -196, 280, 103, -19, -70, 111, 30, -58, -66, 206, 99, -219, 84, 230, -100, 37, 243, 121, -199, -20, 173, 19, -227, 134, 78, -179, -5, 120, 55, -416, 36, -15, -72, -74, 252, 7, -134, -16, 257, -110, -98, 175, 234, -193, -69, 265, 110, -61, 124, 225, -55, -36, 121, 3, -185, 93, 194, -7, -117, 91, 205, -262, -103, 129, -151, -149, -111, 284, -43, -235, -13, -7, -162, 84, 219, -2, -284, -28, 68, -46, -48, 171]
5039A71n8k37J13J72k19K8Q5j6k20N0L57k31j12K88o2k04K9L12l13k21L26K18
5061B56l72R8J46j58m6k6K19p8l08M94L9l16m0J85r4k17J89K06l53m1L04J90k82
5084ek1J57ok19M7J26k46N7J54K29l86Q6J87j77j45J37J15k26j55L53J26k38J35
5107H5r9j06p2K33Q4k86J62k2K7j86M29q0j76k03K01l0j25J04K80l00l1K48O0
5130A97k01r8K65j68j50L6R1O9j59K00P3j64j9J95J3k66P1Mj04K4k1K50j42q8
5154i2N2j44K67j66J68k08r3L48q0j76L3L20k70j72L99j17n7o2P6q1k52L42K0
5177E5j77J41m3k7m0K91p0m1j10J27j08j13O4J78j70O1j22J72k31O5K99j97j7
5200a3NJ33J27j93l1K0j10rJ60j7k39J84J7j66K47m6Jk13J23R2L8j09L3Q1j16
$$ y = [171, 113, -124, -11, 161, -58, -30, 55, 39, -181, -131, 226, -5, -117, 171, 109, -95, -66, 246, -67, -288, 38, 256, -116, -18, 128, -30, -76, -102, 117, 39, -269, 225, 264, -52, -92, 93, -1, -218, -29, 177, -176, -217, 87, 277, -5, -26, 131, 125, -94, -47, 79, -167, -110, 44, 273, -113, -27, 160, -17, -162, -25, 90, -136, -291, 62, 188, -50, 85, -14, -120, -192, 41, 125, -161, 1, -21, 6, -180, 249, 169, -7, -210, -9, -39, -164, -60, 220, -80, -111, 137, 197, -4, -102, 163, -5, -155, -119, -28, 41, -118, 82, 155, -9, -28, 167, 180, -86, -15, -11, -115, -91, -112, 138, -4, -92, -40, -184, 83, -83, 85, -123, -216, 132, 52, -124, -91, 229, -41, -213, 186, 69, 12, -50, 26, -55, -307, 35, 55, -122, 19, -24, -51, -91, 200, 130, 89, -21, 106, -2, -115, -51, 127, -43, 18, -104, 68, -163, -98, 201, 4, -13, -8, 125, 252, 59, 28, 48, -62, -71, 89, 72, -167, 17, 34, -132, 115, 69, 70, -143, -20, 72, 110, 1, 34, 115, -1]
5225aj13R2K3j46K17K4r1o9k4K02j69kR6O6k66L20j51m3q6K48m5r6N1j07l1Q5
5251a6Q0j03K19k19j0K11p8J0n0o9K3lJ30k07O3K23l86K97o8L3k11J20m3M7J2
5276EJ23j0j74Q8j14Q9J69k15M6J07j02K4P8k05J19m3J02q4J79p6j62J6m4L88
5300C04l22l1K43l15M5J12q6J75l3J49m39L19q1r1J07k2n6M4N8k44K06l2k5M4
5324B9j49K46J23l02J88j61L3N2j28K17j79J75j85j72K25Q4j41j30J84J59k41
5345g3R8j03N1R3p5L5j62K8N6J35k43K46k51J95M2r1l8J96k06L6Kj01J6j8L5n
5371a02M8K4n9J54m7p6o4K92M7k87J06j66P4J12j17o9J64Q0k39J46j16R8P4r1
5395a4O1l6nL1j95K02j6p2K4j65Q0K77j27N8M6m2j62J50j49l7R6r4J44N3j36J9
$$ y = [-1, -114, -22, 1, -145, 72, 96, 5, -64, -88, 114, -55, -57, 39, 105, -161, 159, 8, -35, -121, 127, 82, -14, 37, -70, -101, -16, 64, -39, 180, -39, -49, 162, 84, 94, 44, -25, -2, -5, 125, -82, -19, 204, -182, 115, 47, 80, -131, -11, -54, -7, 5, 128, 118, -56, 32, -82, 7, 176, -39, 7, 114, 12, 36, 114, -91, 28, -15, 87, 3, 182, 106, -56, -40, -84, 304, -18, -49, 194, -121, -76, 36, -50, 125, 92, 241, -198, 121, 40, -51, 56, 34, -22, 22, 80, -164, 42, 10, -15, 29, -120, 126, 249, -53, 135, -26, 7, 59, -69, 148, -31, 144, -41, -213, 12, 96, -45, -175, 9, 168, -73, 25, -78, -27, 66, -9, 26, -136, -108, -52, 83, -160, 86, -165, 30, 72, -19, -57, 139, -67, -31, -29, -130, -114, -132, -97, -102, -54, -30, -89, 65, 18, -58, -122, 170, 217, -70, 36, -130, -56, 56, -61, -130, 34, 114, -125, 21, -95, 3, 77, -14, 47, 11, 6, 37, -158, 44, 28, -44, -20, -185, -105, 172, 45, 103, 149, 107, -55, 95, -54, -91, 5, -89, 55, 108, -28, -9]
5421iJ38j47j87K00lJ6l8O0o6o8J8K74q8j89m8K51j90J62L1j37L2J1j15K94k83
5446h1P1M6J15k9j14oJ55o8k89L56Rl04j34N15k60O0N3n8j28J64p3J5r1N2J51
5471A27o4M4j18j12m2K6K99l8j09M8J7q5Q2J19k62Q3K6j40K09j37j63L80j51o2
5495b3Q0k2k48J98N3k5K2j39J25rj30Q8J68k33M43m27j5O7M8RJ29j96Q9K6m7j
5521C0pp0j0P3j01J19j14M8J39M0k69Q0J4n5J83k44j03J98k2J55j54K3J04j38
5545h1O6L2k9O8R3r2J00n6J1Mk3j53Q1P2l8r2kL4kk9n0nJ95q8j2J15r9M0L3j05
5575a2J48j40N9j70K22k64J28jj93K03l8Q1j28J31p0Q5J48k08j25K31j14J06j7
5598F2r7J06pL8q5j90K25Rn4J8J23J1k99L18l35K17M9p4j02J25l9P8p0N4o4k13
$$ y = [-9, 129, -18, -205, -5, -8, 8, -30, 30, -36, -104, -86, 188, 100, -89, -137, 114, -76, 86, 117, -20, 12, 23, -92, 202, -81, -10, 36, 151, 122, 8, 2, 157, 89, -200, 156, 165, -139, -273, 242, -18, 42, 95, 37, -91, 73, 0, 15, -76, -24, 127, 63, 107, -11, -123, -165, -139, 160, 122, 13, 61, 78, -7, 75, 194, -68, 15, 41, -99, 110, -27, -190, 190, 39, -23, 57, 35, -213, -15, 38, 13, 35, -104, 21, 12, -118, -30, 138, -95, 348, -79, -94, -27, 21, 30, 159, -37, 52, 78, 31, 30, 23, -47, -57, 16, -85, 34, -80, -32, 107, 147, -122, -42, -28, -83, 100, -144, -247, -49, -71, 84, -70, -47, 57, -81, -15, 17, -12, 56, 149, 57, 157, 101, 112, 116, 93, -60, 21, 93, 55, -37, -39, -5, -7, -36, -86, -91, 104, 16, 4, 119, 20, 60, 93, -12, 136, -4, 55, -115, 107, -157, -29, -30, -223, -20, -58, 23, -105, 26, -44, 41, 189, -19, -144, 87, -27, 79, 62, -35, 71, 64, 102, 17, -173, 52, 61, 7, 25, 148, 159, -140, 178, -157, 60, 109, 35, -67, 58, 19, 97, 27, 81, 17, -196]
5624a96K23k2m3J3qO9pn0N2r5J40l7k8M7j28o0J43m7R1j06O9J52k69K0J15M5j08
5651b5k9L3J03k06K2K08k46R8J88j36j2J1j7J26lm3k38K38j36P5J26j20N3J19
5675A89j42o8K61k61j01J36l0MQ9n4J18k04L4k6j9l6K50j31J13j77J7J2R6l9L6
5700F7k4o6p7K55j15L2n6N7j20rQ3j02j50J91K04k54p8J43p8M4j40K43j47K60
5724A63p1k03J67k0M6Kj29j8O8m3R9R6N7k26J25k19R1m2n3P1o3J22Q5mj31r5J8
5751a07L20j89MJ0O3j92J71o2l9R0j19Q1k9Q2j14m3J09R4j83nRJ15j73L9n2J45
5777B5r3R7j59J77n6J44J01l93J97%P1j51M5j29J95M6P9j13j1j25m7J01j26J00
5801b5Q3q3n9P8N9j39j15J58Q9J6Q7k40N8p0J19qr7J12J30k92O8K27J2j96j39
$$ y = [-196, 27, 5, -38, -25, -33, 36, 29, -21, 31, -64, 76, 39, 11, 58, -70, -130, 13, -34, 57, -49, 20, 172, -97, -77, 38, 83, -25, -54, -21, 82, -124, -102, 106, -140, -42, 146, 10, -2, 9, -8, 118, 115, 72, -166, 72, -64, 11, 137, 17, 70, 189, 47, -21, 240, -21, -122, 14, -16, -12, 77, 23, 141, -63, -29, -55, -74, -110, 140, 9, 122, -55, -38, -26, 70, 31, 67, 43, -23, -100, 155, 40, 72, 16, 73, -47, -56, 27, -75, -225, -34, 170, -84, -162, -19, -97, -53, -193, 50, -97, 163, 92, -111, 56, 36, 82, 84, -45, -63, 5, -38, 61, 157, 214, -12, 113, -106, -15, -57, -110, -39, -102, 20, 105, 101, -30, -125, -107, 213, 24, 28, 38, 101, -91, 80, 18, -21, 69, -50, 31, 2, 84, -30, -73, 36, 130, -53, -58, -49, 66, -107, -68, -120, 25, -68, 29, -130, 47, -9, 135, 236, -157, 40, 40, 111, -40, 5, -124, 71, 117, 196, 83, 72, -53, -100, 1, -125, -25, 58, -25, -84, -6, 53, -86, -201, -43, 46, 62, 149, -91, -33, -103, 16, 8, -89, 23, 153, -139, -71, 156, 168, -28, -167]
5826a67J80%p3L0K22j75R1R2j59p6J6J05j49J24n9N5j3j67K71j09J88l13J45j02
5850d3j27J64r3Q4J6j74J39l4N7N0j67RQK70j59K80k63j16j16K07Lm7j24J38J02
5875F4l2R6K3o1nP9M4k73Q5K6J1oq5n1j72K15J05J9p9k2k4k2J26j47J07mO4o5
5903A6j59%P1j4N9P7J40l42J72j09j3N8L4K14j38j57NJ2K40q4k81K57Nj93J66
5928C6m5N9j5R3j43Jk8R2L1l12K77l5J83k68P4m5K2J09l8p2l2J06j36j2J50O4
5954A16k11j38K17K1k08K20j09n1M5J86q7R5k08J15J2r6J95jj00l5j28J38k6K4
5978a4n4L9j2n0O9n0n3QO9M3q5K15k36j8J29n9P4j7Q9n2m0P7l9q4o1J31j46P9
6006d8Rj5J82j29o1P5m9K1J67j84j6P8l4P9p9J28n3k0R1k52J46j3k01K92n3j32
$$ y = [-167, 13, 13, -60, -30, 192, 17, 108, 200, 41, -35, -19, 86, -63, 61, 2, 57, 44, -123, 148, 39, 227, -86, 59, -43, -170, -6, -99, -15, 1, -173, -34, -68, -11, 39, -128, -119, -111, 159, 0, 280, 17, -99, -215, -8, -5, -52, -176, -38, 64, 32, 128, 151, 90, 85, 164, 208, -65, 20, 46, 57, 51, -34, -85, -257, -42, 63, 82, 3, -19, -43, -65, 61, -86, 21, 17, 81, 16, -143, -143, -72, -86, -27, 50, 190, -152, 20, -89, -102, -44, -10, 204, 66, -91, -86, -74, 166, 82, -199, 58, 63, -130, 36, -9, 50, 35, 128, -15, -14, -42, 50, 81, -231, 46, 11, 194, -74, 0, -45, -23, 86, 48, -24, -56, 50, -86, -98, 52, 116, -95, -233, -16, 5, -203, 17, -92, -143, -98, 88, 1, 96, -112, 3, 15, -81, 114, 113, 13, -22, -150, -12, -38, -14, -68, -29, -41, -91, -22, -72, -125, -117, -48, -5, -90, 125, -111, -129, 0, -59, 15, -2, 87, 35, -5, 72, 33, -51, -112, 19, -127, -48, -39, -54, 128, -1, -62, 13, -36, -15, 152, -32, -48, 30, -4, 75, -4, 124, 71, 51, 142, -110, 36, 23, -178, 114, 61, -71]
6032g1K02rj86J12n4j87L20j16%p2K2K5K2J18j87M8j65J04K52j33oqo0J48M2j33
6058B8o6J8j0nR6j72K23j65J28j11J4j0%J77j57k6J26q1L7r5j08J64P1p9J5R8
6084A10J6k68J59J15k9j12n5n6J16J01j3n3m9k0O6k2m7J89j05r4J16L0p3o0p3
6109a11J74kr4J43l9j1M0k6j44J8k8p6J57j40J47j12P3K2l0K0nl8K23j68P2j45
6135h0J21j1j29R8k48K50n3J35o5n7P1Q8r1k4J04k19R8J7Lq1L4J1%J05q3l25L23
6162hOpM1J33j56m4l9k5J22j73J25K35j41N6j53m0O6KJ1q3j3J68KR6j23k02K24
6189H0m5l9Ro3P8K3P3j49R5m2q1N3q5N4J43K3k16J58j85N1J04q6k6L8P6K27l37
6216f9J17J80m00L56j17k1j25L65j70j30n5J23N4j57K7N2j70K76j7j00j27N7J24
$$ y = [-71, 131, 122, -64, 48, -6, -193, 127, 11, 11, -61, -39, -14, 8, 126, -61, -13, -178, -74, 178, 45, 39, 31, -29, 119, 161, 28, -38, -20, -30, -35, 61, -111, 112, -53, 75, -36, -22, -32, -32, 145, -12, -38, 88, 7, 44, -51, -159, 5, 76, -3, 12, 110, 126, -142, 17, 132, 103, -9, -64, -120, -4, 97, 84, 31, -18, -38, 28, 6, -41, 148, 43, -51, 65, 95, 22, -38, -111, 63, 61, -33, 110, 71, 60, 100, 74, -70, -52, -80, -156, 1, -139, 8, -104, -31, -9, -39, -19, -24, -62, 161, -7, 65, -80, 41, 30, -99, -1, -249, 1, -52, 83, 18, -39, 32, 120, 29, 5, 109, -110, -12, 5, 8, -73, -39, -28, -28, 77, -6, -331, -8, -2, -9, 32, 165, 9, -35, -74, -99, 23, -150, -25, 210, 69, 125, -28, -68, -2, 0, 11, -72, -85, 83, 85, 181, 58, -144, 80, 35, -4, 5, -58, 20, 43, 116, -33, 62, 20, -61, -8, -93, -39, 104, 127, -89, 69, -116, -65, 39, -47, -73, -35, 41, 268, -69, 48, 228, -172, 184, 67, 46, -79, 286, 116, -14, -69, 54, 108, -49, -22, 30, -140, 136, 119, 19, -108, -51, 73]
6239G3k55J05Nr0J44K9J11k03qJ48J0nj44K45j15mJR1k33m3K28p7r0M3K29j45
6265E0j05J01O6j85j30K18J19nl32K57J4q6R7K8N3j72J5J2p8k8K71j94np2J48
6290E7j65J9K92l06nJ35K88j97k07J29q9j06J29J51j79O2M5K0k1r2jM7k21L89
6314A74p7k13J00J77L9l11R5J52k58k3J75j01o9K23j7N5j21J03j21K6j94J91P1
6337G6j44n6K55l5l5O0l2j55NL02p4j35j26J72j1l50L64M2j33q7J65K7K7j10J83
6362A95k07j00K99p0j37p9J20R5k49K85k31n5O1RJ36j24M6P2J25l54K43o2j65
6385a47J62P3j14k60L37J68j32j33J71n4j48o5K01m8j17J67M1k71K23P0j03k15
6407a94J57R3o7j67K35n6j47J54J30r5k55J25J89k73Q5K70j16k33J63K91j73k16
$$ y = [73, -182, -77, -72, -162, -18, 11, 122, -81, -89, 59, 69, 64, -80, 165, 50, 46, 47, 138, -95, -138, 90, 13, -77, -34, 195, 50, -55, 46, 112, -73, -203, 15, 134, 129, -203, 54, 68, -18, 79, 107, 160, -12, 3, 15, -63, -91, 180, -14, -19, -91, 57, -108, -89, 203, -103, -108, 27, 315, 118, -89, 40, -49, -155, -26, 125, -54, 8, 53, 73, 52, -40, -41, 6, -215, 174, 97, -116, -16, 161, 200, -111, -16, 136, -122, -145, 30, -71, -140, 83, 66, 121, 0, 103, -18, 8, -186, 5, 76, -68, -124, 131, 96, 61, 121, 89, -66, -61, 241, 167, 32, -94, 78, 67, -283, 81, 123, -10, -97, 68, 95, 122, 12, 195, -12, -112, 187, 117, -20, -99, 21, 116, -133, 152, -79, -134, -73, -64, 72, -52, -6, 66, 191, -163, 80, 18, -147, 15, 88, -26, -286, 51, 219, 87, -46, 125, 71, -77, -142, 59, 11, -106, 61, 102, -169, 54, 124, 21, -194, -37, 56, -11, -178, 57, 1, -146, 8, 138, 43, -212, -87, 102, -171, -86, 184, 68, -165, -2, 289, 116, -100]
6429a00J82%k83J56J32M0l37J41K20j98m6K2J39j65K0L98l19q1J63R2l61J96R3
6452A04q7j33K08M9k03K0J63j26r9M2K53r0k88L16l4J4l18K71J23l49J40M1j31
6475a14j10K34K80n60K59K54j96k64L13K95m83j35L53j49n1l5K17r5j13J45M2
6496H7j22p2K40r0k72K38K29j91j78K07n0k14J61J86p3l60J42K10j76j3P6J93
6518A58k39J08K66l94n4L18j1l27J17K64j81j54O7K29j48j89K41j3m5r2K65j61
6540B5j55J4L31k10m0K46l1l00J52J56l46M1L36j99j48K41m3j6j45J17N9k76M1
6563a50K31P7l01K27J83l47j44L05j9k36p3L49J02m21K45K33l28o5K76q4j87j6
6585a43K85j19j36K18R2k51n9L96j56k39J12J3j42M4K31j25l2RJ72j44k15J42
$$ y = [-100, 82, 82, -201, -45, 87, 127, -210, -69, 151, -47, -93, -71, 68, -97, -77, 321, 2, -79, 84, 176, -185, 11, 104, 17, -116, 92, 141, -62, -42, 121, -5, -104, -62, 191, 101, -187, 129, 95, 109, -209, 62, 185, -164, -24, 17, -114, -224, 10, 290, -270, -11, 243, 47, -217, 96, 391, -92, -227, 126, -23, -74, -109, 108, 13, -100, 45, 87, -35, -107, 133, 43, -229, 9, 238, 47, -131, 76, 26, -188, -27, 159, 86, -274, -132, 78, -98, -111, -35, 158, -81, 27, 293, -101, -155, 163, 152, -175, -58, 206, 25, -129, -62, 167, 19, -170, 71, 58, 13, -79, 186, 25, -130, -116, 215, 5, -35, 211, 180, -120, 32, 188, -158, -117, 219, 20, -128, 113, 70, 54, -91, 26, 85, -191, -150, 81, 158, -143, 84, 267, -80, -224, 81, 62, -174, -247, 102, 204, -217, 28, 261, -67, -132, 144, 60, -127, -143, 142, 23, -113, 105, 197, -54, -113, 283, 127, -112, 0, 13, -129, -85, 146, 21, -11, -2, 170, 26, -189, -47]
6607d7K71j90j36K19n5l31K05M7Qj27J78J40m16J28K49j25j66J92K03l11j09L28
6629A55O6m56K88N1k28o1rO50l58l92L61P9j98k04M76k93LJ23J49l50j5L64j05
6652I6l36K57J34j51j70L13Om17L24R4j58k47M00k8k38K9K81l6l68K63n8m2p8
6675a30K26p0m3o0K08L5l41K62J26m24J77K72r7k10k1J44j9j27O3ok0O3J28j21
6699A5k04M00j9k68l9K74n6j59NJ65j89M6K07j61n3L3J17n8j23K04j48j00k3L37
6723B03j34k27K36Q8k04r9J32k1k5lR7Rj55R1J73k39j02L35O7l86l1K65l2j90
6747a52P0L21l07j22K42L7l58J93K25j91n2J87L7k54O5J17Qj81P0m8J60j47K50
6770A70p5k28OK51j76k06K55l7m0K7K80l0l26K07j60m4J25m1J30j53p4K44o7J5
$$ y = [-47, 224, 34, -102, 117, 62, -269, -64, -17, -9, -136, 42, 182, -234, -106, 143, 18, -148, 44, 247, -64, -173, 155, 221, -235, 53, 104, -124, -185, -194, 456, 98, -294, 67, 146, -52, -256, 220, -73, -70, 53, 202, -148, -163, 201, 96, -240, 17, 151, 0, -170, 143, 149, -268, 56, 150, -8, -255, 145, 117, -121, -92, 189, 153, -215, 48, -10, -52, -130, 96, 26, -17, -77, 131, 166, -175, 87, 213, -211, -34, 238, 141, -69, -90, 54, 35, -92, -29, -35, -55, 8, 136, 15, -189, 211, 192, -76, -115, 159, 103, -56, -51, 114, -75, -29, 178, 17, -36, -3, 114, 56, -67, 137, -11, -111, -134, 203, 69, -158, 78, 166, -38, -137, -5, -26, -51, -54, 43, 52, -103, -12, 161, -78, -180, 155, 222, -164, -195, 70, 38, -152, -82, 239, -68, -190, 52, 89, -269, -76, 149, -42, -94, 93, 130, -124, -59, 58, 66, -115, -45, -93, 67, -80, 170, 95, -133, -127, 124, -52, -258, -3, -40, -80, -53, 227, 197, -129, 78, -82, -126, -1, -42, 88, -65, -139, 105, 38, 53]
6794E3M1q1j38k5K35P7l21J84p5l4j05M3L40k39J50j03R1j89R2J13l8j12k5L6
6818c0L1l0K77j87j16Q2k6k3J6J83k47m1J32K9J30j82P5p3k2L6P5o1m3L5kk0j8
6845b0n3j13J40M3J86r7j50N0p5K59j43M6K0J6j58j3N1nJ29ll20J08K15j41j89
6870b17L66l6j30J24N9j90J03j94N3J36p7P7N7j49r5J02j77M9J03J51j95R8N6
6893G4m2j52L7J04K4j70J29j96L08r6MJ74k80Q8Oj06J0K38l78K26k7kP8k84K74
6918D1J02j30j14J83k7P2k45J03R5l5O4j20P1M0o1NK9j27R1r8P0%Q4r4q1L2j79
6945b29K61j0k3o7j09J92P0m4P6j63n2J82r5J82j50p9K22r8J03k25K11m9j55R3
6969D4J92k06j01K08j41po3kpj3J81mJ0P1j42l0o8J11j04J48j54L0J41J5o6J18
$$ y = [53, 94, 13, -125, -150, 85, 162, -159, 25, -50, -84, -189, -146, 194, -45, 105, 2, 93, -96, -4, 109, 71, -41, -66, -30, 1, -29, 248, 61, -55, 27, 1, -22, -6, 177, -70, -111, 21, 50, 180, -2, 73, 0, -22, 14, 89, 28, -15, 20, 18, -2, -20, -73, -186, -46, -3, 183, 86, -64, -14, -89, 170, 27, 73, 93, 109, -49, -62, -11, -16, 113, 110, -210, -102, 113, -28, -217, 149, 113, -17, 107, 166, -24, 79, -115, -62, 74, -3, 74, 131, -18, -113, -11, -188, -139, -36, 115, -80, 18, 74, 32, -120, -83, 21, 45, -125, 4, -192, 116, 20, 24, 198, -82, 6, 12, -94, -84, 154, -224, 2, -25, -27, 51, -233, 41, 143, 13, -101, 82, 55, 127, -118, -15, 80, 45, 109, -11, 60, 100, 39, 44, 73, -54, 37, -61, 9, 9, 93, -1, -82, -50, -229, 32, 22, -1, -68, -177, 15, 85, 41, 117, -46, -98, 84, -11, 171, 21, -58, 164, 66, 169, -56, 155, 106, -49, 44, 236, 30, -71, 137, -4, -11, -74, -76, -83, -96, 85, 81, 91, 162, 20, -10, -78, 33, -71, 77, -77, -47, 94, 109, 43, 161]
6995A61r5o6J51j05n8j0P7K1R2r4n4M4j0n2J31o3j17q1J96MM4o1K7q5n4K56j80
7022A9j71R1R1j92Q9K4J56l5o6J63m2o0Ro9j33J54l1P1m5j5o4n7K18r2P2j94K01
7049I2or9j77J08J20q8O3j03R7J16j24LR9p1P4p4J30k34J48k8N2j82J20j24O4
7074b4o5J01M6m8K9J92l20l1jK7K34o5j57J63j37J12J11j98J27j64J05q4K49m12
7098b10J65R7M5r9K13j70q1K09k19M5K9n0m4K9J11j25L9K64p5k02m8Q8N2J33j74
7123B2K7j18Rp6K12j26O0L4j14J01P8j99M7J13j36K06j61L9N5j01j11Q3r7J15
7147c8J45j20J9j73J24J9N0j7l0K7o7K37k75J44O4j80Kl4O3N3p8J35J42j93pj48
7173a36K63k63P2P4o5J8L8j9k4n5K0l2K76j40j97K80k32o0J49R0j0P2J16k27j29
$$ y = [161, 66, 0, 151, 46, -12, -22, 55, 76, 168, 74, 20, 64, 54, 2, 133, 70, -47, -128, 68, 72, 116, 55, 82, -3, -57, 199, 19, -152, -61, 30, -162, -73, -49, 107, 72, 6, 169, 127, 67, 76, 7, -126, 28, -3, 68, 23, 8, -56, -113, 105, 13, 85, -109, 92, 86, -13, -190, -82, 38, -50, 13, -90, 7, 123, -1, 2, 101, 30, 104, 30, 160, -74, 74, 46, 98, -84, 36, -88, -24, -89, 12, 58, 10, 39, 231, -89, -120, -121, -94, 140, 75, -82, 81, -56, 56, 167, -31, 96, -68, 37, -47, 202, -210, -45, 52, 97, -2, 211, 41, -40, 169, -50, -5, 24, -26, -70, -41, 70, -55, -16, 248, 173, -29, -77, 11, 63, 196, 22, 49, -69, -60, -136, 76, -50, 10, 44, -70, 31, 109, -90, -43, 70, -66, 140, -21, 18, 73, -28, -139, -56, -153, -38, 107, -13, 6, -167, -43, -24, 26, 9, -21, 6, -61, 176, -99, 45, 109, -71, -69, -103, -40, 13, -65, 70, 212, 19, 12, -136, 127, -136, -64, 10, -55, -37, 1, -18, -42, -97, -77, -109, 167, 27, -170, 110, -122, -182, -33, 57, 47, 119, 235, 8, -121]
7198a21K05p8j00O1M7o3mK08q1Q7l18J03K30j44J0l22L30p7Q1j21J05j3J2k02
7222a65J58jJ2J10m5j87L80k98j2K6L9N2j7j6o3j15K48j20j24P3J07p0J24j44
7246d8m0K33k02p6K21k2oo8Pr7J66M9k02j07J62R7j11K05k08j25J38j1J46o3o6
7271b8j73K06m1J48q1L4J42j31o2R2o1P5j83J22P7m1j80Q0j2q9QR0L3m3J2P7j6
7298E5j8r8M7K6R0R6k38J28J29j86J42q3m3n9j07Q0J12k41J35j22M5O6m7L3L71
7323C13m43K52R2j72j07Q7M5m3j35N8P8j3j02M2m3M3n7J29k0J11k01J71M2j33
7347fM6J04k11k9J1n0J99J66l04PJ22m4K3j79K02j45J19j49K6N0p0M0L3q6J76
7372E1j00N2J11k87J70o3K5L4j43K34Ok05Q3J62k14R4m6p2J46J25l14J73j8o9
$$ y = [-121, 84, 6, -94, -33, 14, -49, -53, 155, 74, 161, -157, -54, 176, 32, 42, -280, 50, -27, 54, -67, 38, 25, 37, -165, -7, -8, 4, 114, 69, -118, 262, -36, -48, -22, 17, 69, 52, 36, -27, -142, 106, -14, -138, -65, 42, -28, 96, -48, -88, 145, -57, -133, 88, 66, 60, -8, -1, -98, 68, 117, -85, -192, -30, 67, -44, 161, -47, -172, -34, -45, 101, 38, -28, -201, 5, -36, 112, 31, 65, 207, 76, 14, 106, 45, 120, -63, 59, 136, 95, -85, -5, -17, -106, -98, -8, 25, -18, -6, 71, 55, 37, -61, -14, 12, 102, 198, -40, 88, 217, 31, 173, 90, 47, -12, -119, -39, 73, -168, -33, -155, -110, -44, -91, -58, 313, -130, 122, 214, 42, -65, 22, 67, 24, -111, -53, 25, 12, -90, -48, -91, -48, -105, 24, 4, 115, -86, 85, 127, -6, 40, 144, -67, -96, -85, -135, 64, 230, -74, -67, 55, 11, 34, -145, 57, -88, 31, -118, -92, -42, -112, -72, -39, -125, 51, -49, 3, 114, -173, -3, -66, -41, -7, -150, 84, 90, -115, -32, 130, -84, 10, -36, -108, 38, 163, -151, 22, 4, -65]
7396f5J46m1j47J37L7j5Q3j93K0N1M4j19k5N6M4l3M2Nj79l3K83j6k9q0j63J52
7422c8J7N9j52J66P3j4k3j77N8M9N3Qj66J68m7j1rj09rK45m1j66jO9L34l79J03
7449F0l5l9%l6L4j1j3r8J50k7M3l5Q3O1j48P9q7M8p4K70n1o1k02J83qp4n7P5J6
7478D6M2o0Q9r7J41j01K7p9J66k0k22M2N1j16J80o1R0j63R0r6J17l9j17J86Lk09
7504a10J09j24j9J83p3J28P9j83j8J01n2Nr7J02m4Q4j41N5L2R4q1J6J06k25K19
7529A46j24K1n8J44j15K6l4q9P1l4J15j57O8j9nq1K17j03N4J0j40K12m9j71R2
7554cp0O1N9p3O7r6O1Kr5k5J23L2M5j40%Q8j27J70p1q8K75k19NM6o9Q5M8k10J53
7583C4J0j29Q6J34K0j11L7j5J9j86N7R8j46J01k39R4R8M2j5j05o7K58n7o5L04
$$ y = [-65, 81, 40, -107, 30, 67, 52, 135, -58, -38, 13, 57, -62, -87, -31, 13, -20, 22, 27, -152, -185, 98, 82, 53, -27, -190, -38, -21, 38, -114, 52, 125, 111, 88, -89, -31, 18, 71, 79, -87, 81, 34, 23, 14, -95, -104, 141, 100, -66, -67, 2, 336, -43, 60, 25, -14, -14, -50, -16, -27, -40, -138, 12, -15, 28, -7, 76, 137, -11, 68, -19, 29, -45, 225, 174, 113, -89, 94, 86, 12, -45, 30, 46, 88, 28, 117, 20, 161, 60, 87, 8, 174, 154, -68, -26, 25, -91, 89, 28, 118, -45, 45, -51, 66, 27, -90, 96, 99, -110, -1, -125, -144, 39, -34, 94, 173, -10, -28, 73, 21, 26, -71, 31, -13, 71, -70, -15, 17, 111, 30, 46, 152, -73, 146, 22, 43, -15, 129, 14, 40, 6, -83, -12, -46, 69, -88, -20, -39, -44, -125, 92, -11, 43, 53, -87, 125, 76, -95, -3, -73, -12, 47, -26, 41, -55, 6, 8, -87, -112, 11, 43, 88, -52, -52, 36, -91, 79, 8, -80, 195, -24, -19, 27, -42, 43, 91, -119, 34, 44, -85, 1, 135, 155, 44, 81, 66, 85, -101, -44, 54, -92, 9, -230, -136, -38, 4, -11, -116, -183, 75, 18, -47, 257]
7608B57k54l0K7P7r8m9J58K6j74O2J74k9n5j54K21L8k26Q8j26N0k0J47j29j28
7632a47l6J79j10L11k7j12M2k0n7J04r0q1M9N2o7M9j04o8K45j71J08j76J88J64
7656B25l24j41M84k02k00J44j94K32j98J88N9K37k30n4ml5k9n0J89j64J15j02
7678e4oJ09o0Q6o6P1j20j6M9K47k99Q7J3j17o5K05k93J52J17j1j28N0K46k66R1
7703B2j7j50P5N9n1J01J45j53n9n9J27q9P8l7m0j7JJ41r6J7R2r7K57k74o9J07
7729A4j66L08j86j79K23O0k35K19P2M0j47m5J11L0p5m0L9N2M8k72J35R3j86J19
7753C2K36k59j62J84J5j18r8J67j1N7n4q3J34j25P3J15r4j50J32j78J66J22Oj12
7777eN0o8j15L1K39j84N8j10Q6p3N4K96m96J78J29j55k8n7K33O4q3k28K65j62
$$ y = [257, 3, -27, 0, 77, -21, -70, 88, 114, -60, 2, 176, 147, 92, -62, 159, 197, -29, 59, -67, -17, -37, 110, -19, -147, -183, -4, -114, 197, 170, 58, 100, 80, 23, 127, 37, -44, 5, 57, -10, 39, -65, -133, 112, -59, 49, -127, 61, 225, -99, -240, 244, 42, -158, -14, -208, 24, -174, 14, 73, 310, 80, 26, 22, -13, -42, -92, 97, -67, 48, -54, -60, 49, -11, 75, 9, 80, -40, -56, -7, 240, -59, 28, 41, -76, -141, 64, -229, -77, 40, 29, -99, -49, 197, -69, 22, 5, -145, -70, -11, -62, 39, 184, 31, -28, -87, 40, -49, 29, -8, -48, -65, -64, 77, -19, -2, 90, -7, 250, -24, -93, 14, -152, 156, -30, -209, 14, 74, -161, 58, 130, 170, 23, -22, 89, 119, 44, 4, 43, 95, 143, -129, 6, 99, -87, 32, 268, 9, -153, 31, 46, -72, -170, -3, -14, 43, -11, -94, 40, -85, -12, 103, 9, -141, -9, -187, -21, 101, 107, -5, 45, -23, -138, -107, 132, -52, 6, -104, -18, -91, -37, 259, -237, -59, 70, -85, -113, -170, 63, 127, 44, -184, 81, -81]
7801h1L7K3J39M1m3k09O9mP0j2L4j38n5K69o5Lk15J40R7k00O3J23j64N6n6K64
7827A86k82j22J88L8k5j20Kp7J89J28k70R0k8J05j20L3J70j19M0J63q9j77J25
7850B8M2q2k1J89q0k39N3O8N5j9K01l94K56l1k25K18j04J15M1j17m%qK27k60J20
7876B9j18J20o6J02qj76J43n9KK3j5K14k93J23j8%KJ30j44j70K52k9J0j22K71
7901B03j77J2m8Q8j14J75q8mj48J31kom2m3J91k1Jj68J36j47kR3n3J25j02R8P8
7928A66k21%J21j71J88L8k23J21k4J20J23k00M9L9j99J20m6l3N6K3M1k37J48J30
7952A29j56N9lk5r1L4K57l06J06JJ76p1j32N8P3j96L6R4K2l35L41Q8ql04K34j20
7978c9j54J17K9K05k11J5J2m9Q6M1j67Q6R6k9N8r0J5Q1k29L1J55K3k63P2J58K2
$$ y = [-81, -44, -21, 118, 159, 116, -93, -24, -28, 42, 30, 64, -74, -129, 140, 75, 78, -137, 3, 100, -100, -37, 86, -78, -22, -78, 186, -96, -218, -30, 8, -17, -137, -135, -212, -23, 105, -165, -75, -103, 2, -118, -85, 85, -34, 6, 169, 80, -97, 28, 70, -12, -33, 156, 76, -163, -110, -42, 13, -6, 195, -199, 57, 26, -199, 19, -85, 30, 71, -46, -50, -50, -58, 169, -91, 29, -89, 31, -35, 67, 59, -117, 26, -33, -31, -8, -23, 191, -102, 21, 3, 3, 5, 135, -9, -179, 73, 44, 54, -68, 203, 26, 38, -10, 78, -36, 139, 51, 47, -101, 30, 28, 22, -20, -63, 128, 107, 108, -60, 76, -71, -73, 20, -33, 92, -10, 88, 166, -55, -55, 66, -105, 83, 121, -102, 19, -5, 115, 238, 38, 87, 126, -73, 47, 1, -32, 24, 47, 88, -149, -1, 129, -27, 32, 29, 4, -87, -53, 204, -102, 4, 5, 181, 110, -22, 36, 109, -87, -51, 43, 65, -270, 71, 159, 151, -153, 81, -39, -193, -76, -47, 158, -53, -38, -26, -75, 11, 52, -115, -29, 67, 38, 96, 6, 21, 102, -127, -96, 59, 82, -181, -109, 49, 71]
8004G1j02J68j5k09qK04q8k55K88L0m6j14Q0Om0JM4J22j48J76j9q9j89K91j53
8029Fn0J7%k28J87K63j56N8j66J97o6j85K81O5k12r9J77j14O6JR2l40P1N1M7M1
8055Dq7J93l9l8L4R7k88J12J38j20k41K06J53j80l6J42J06k44M9J1J5j70K02M8
8079F7j41M4K9Q0l00P8K80n9k53K13K9M3n0J36r6k99K91k3j8j00J74j7k74Q7R1
8104A2J68k50J43j11j79K37J71o0k64J48J24j33k72K40J65k79N6J65j02j56J32
8125d5M9L5j78J73N0j18L3J80k43m4J98l6m5k49M30j79o4K4j1M4m2j5O9j82L38
8150A72m4j27j66J84J83k28j75J62J07j30P1J70k16n6K67l05R0P0N5p3j11J87
8172H7o2n2L2P6k2J9q3J24p6o0N9J09l48R5K72j08j05O5j
$$ y = [71, -31, 137, 122, -87, -95, 109, 21, -234, 54, 84, 38, -76, 4, 10, -30, -29, 15, 137, -11, 165, 146, 57, -132, 159, 6, -44, -27, -27, -255, -68, 195, 39, 97, -69, 128, 62, -123, 158, 223, 11, -88, 89, -25, 41, 42, 134, -206, -135, -84, -37, 4, -83, 110, 71, 33, 67, 164, -124, -12, 126, 6, -235, -29, 124, -56, -92, 50, 156, -88, -39, -28, -13, -183, 19, 67, -74, -30, -1, 79, -221, -143, 137, 78, -175, 38, 67, 110, 60, 196, 100, -199, 92, 69, 51, -49, 125, 108, -166, -79, 12, 180, -70, 73, -38, -217, 20, 191, 131, -133, 15, 139, 6, -266, -26, 139, -140, -84, 81, -21, -177, -45, 4, 39, -139, 34, 84, -34, -1, 179, -64, -108, 90, 54, 9, -240, 190, 11, -53, -29, -40, 4, -38, -53, 16, -166, 172, 128, 1, -165, 19, 202, -26, -201, -39, 68, -62, 9, 179, -37, -93, 174, -131, -41, 29, 84, 11, -100, 87, 25, -27, 5, 81, 59, 78, -5, 119, 43, -17, 42, 151, -197, -102, 170, 62, -43, 22, 21]
8191B1
$$ Imaginary data points
##PAGE= N=2
##DATA TABLE= (X++(I..I)), XYDATA
0@%%%%%%%%%%%%%%%%%%%jQj5J6j6J6j6J7k4L1l2L4m2M8n1N9o7P5q4R4j03J13j28
42f8J43j58J75j93K12k33K57k83L11l44L80m19M64n14N69o35P11q01R11j046J219
63F58j445J755k212K946m314P676k9477l6022R3864Q533q0472R080P3708k7935
77A6343n9983L7122M9852m4910l8980M6188L0915m6712j9383M3131P642l9155
89a7930L316L2554q961k3677J1823J4256r926q796M148N189M150n586j0182R010
103f12J5161j4496j6793J9361J4569k4058r367K9018K489l3876L541L7817q797
116A3957l9540J4907L8824k2127l4931L1030K6913m0783j6624M7599N737m9830
128b4868M938M7014j3704l9688K0362L1134k5611k3040K9208J5827l1687r741
$$ y = [0, 0, 0, 0, 0, 0, 0, 0, 0, 0, 0, 0, 0, 0, 0, 0, 0, 0, 0, 0, -1, 7, -8, 8, -8, 8, -8, 9, -15, 16, -16, 18, -24, 24, -27, 32, -35, 40, -44, 50, -53, 60, -68, 75, -83, 92, -101, 111, -122, 135, -148, 163, -181, 199, -220, 244, -270, 299, -336, 375, -426, 485, -561, 658, -787, 968, -1244, 1702, -2612, 5064, -24413, -60435, 33429, 41962, -38510, -29430, 44278, 16343, -43640, -6518, 43334, -1576, -40556, 5632, 36547, -10165, -29548, 13583, 21225, -17930, -14614, 17940, 8979, -14698, -2875, 11381, 1455, -7341, -3193, 1996, 6146, 560, -9622, -612, 14549, 53, -16740, 2621, 17190, -6868, -16235, 12783, 15272, -18604, -15063, 22754, 13957, -25583, -10676, 28148, 6021, -28910, 2120, 29033, -11750, -28374, 19225, 24962, -24868, -19930, 27084, 13380, -26308, -5946, 25188, -423, -23463, 5745, 21572, -10115, -19856]
140a9856L3126L536l1805L307K7816j0056k1494J4790J3835j6747o221J5406N6
153E693j1955L345P651l565k858K660j785q64M841j534p201M018Q441o406p898
168g417R854N180j4369j285J9064l445k2349R293K2355j5048j9316K0285J2964
181A5766k4435m923K7590l089k8168R157K6157j3765k1981J7968J6080k0945j0028
194a4616K3676L064k4708L405K3572r128j9996J3892J4494j6911p534J7251R21
207G382j5250M483J1405q023p089R100L495q990L96P186l515m471O205J343q652
222d995J912R697n539q185Q556M906j1318R6J3310n440j3601R638J2176j3275
236b062q280J5061L487j5655J832J5326o407j4567J0092J2426j2259r444J4172
$$ y = [-19856, 13270, 16806, -14999, -11692, 16124, 6068, -15426, -636, 13199, -3548, -9769, 5637, 5693, -6262, -2917, 4734, 1169, -1689, 971, -814, -1678, 3163, 1629, -5572, -1554, 6887, 481, -7417, 2437, 7617, -6752, -8037, 11027, 7582, -14767, -5474, 16881, 1833, -17483, 2802, 15766, -8669, -13592, 13998, 10909, -17259, -8102, 18055, 4290, -17691, 277, 16357, -4588, -14616, 9060, 12124, -12584, -9179, 14393, 5265, -14731, -839, 13655, -3256, -10790, 6461, 7382, -7868, -3385, 8020, -3, -7092, 2008, 5503, -3487, -3091, 4095, 580, -3891, 2314, 3657, -4995, -3083, 6614, 1075, -7110, 1446, 6352, -4966, -4870, 8440, 3000, -10601, -963, 11213, -2062, -10342, 4719, 8206, -7449, -5617, 9709, 3302, -11265, -1173, 11253, -1006, -10450, 3722]
249C722N404j5372q73J5342l674j4143Q057J1311j0604p570J1523L644j1901K58
263d876J0387k749p851M690N448o429k960O812P53o491J349N366l073l374M562
278A564N25n586K126N822m312m349N966J904o998J046O747l720o404O653N109
293F093q087l240Q318P63q568K050Q337m245p806O834O386q888m093R588J471
308D913r986K074R226m886p711O578N256p572k696Q216L21p653J535O569l055
323A129n363M224L722n004j416N467q50n378K475L879l166k040M052m3m092J880
339e24L405l684k028M256Q73m066J034L454k873l336M147K462n038o87N289o38
355B046n323K385M692m111l617N534K180o008o60O012j491n441L319M215l993
$$ y = [3722, 9126, -6246, -7119, 8223, 4549, -9594, -1537, 9774, -830, -8400, 3123, 6767, -5134, -4876, 5511, 2762, -5089, -399, 5049, -1380, -4340, 2472, 3225, -3266, -1917, 3449, 376, -2998, 1564, 2089, -3497, -1371, 4451, 139, -4210, 1756, 3660, -3338, -2292, 4455, 735, -5669, 984, 6093, -1994, -5234, 3084, 3847, -4721, -2671, 5666, 1421, -6385, 449, 6835, -2053, -6146, 3442, 4913, -5073, -2999, 6227, 1341, -6370, 208, 5464, -2108, -4804, 3412, 3733, -3920, -2385, 4184, 1129, -4234, -10, 3712, -1292, -2708, 2759, 1909, -3469, -994, 2885, -281, -2321, 1731, 1688, -2404, -524, 2881, -803, -2831, 1425, 2298, -1768, -734, 2720, -153, -3489, 658, 3120, -1918, -2605, 2684, 2046, -3277, -892, 3800, -311, -3928, 1606, 3786, -2222, -2882, 3130, 1639, -3802, -483, 3732, -261]
370b61l053M709J467m984p1M682j070m070K173L056k654k373L258J329l464J59
386a167K918j192k664J912J796j878o77J797l47j581R57J115j430o22J761j8j505
403h25O33J305j519o09J736O45k272J29K081r35k007J607J500k111m77K342r4
420A129k336M03K166j144j668J589J419j991r94K118K23k010L07J939o94j721
436a265J200J277j564p13J540K36j225Q6J056l40j007N67R03q23m10P08P0n43
454b47P4O90n87k70N00M00r36K32L88l96k70P20m7p09K94N77o15k13O87J64n72
475a36n3M97j29n99K19P52m16o37N08N79n65n84O76m9l13K30N20n24n47N18K62
496B09k53j14J14Q9M2q0R5j21k55J09J85L06l86K7L35m41J46j72R4K43j79j65
$$ y = [-261, -3314, 1395, 2862, -2122, -2193, 2489, 1419, -2651, -478, 2578, -76, -2449, 809, 2138, -1326, -1167, 1751, 559, -2105, -193, 1603, -275, -952, 845, 498, -1083, -126, 989, -441, -1063, 698, 680, -825, -192, 1113, -406, -1015, 721, 1366, -906, -777, 1304, 369, -1638, -31, 1469, -642, -1119, 1223, 1129, -1207, -804, 1362, 218, -1450, 139, 1558, -433, -1427, 691, 914, -1096, -789, 1150, 456, -1265, -65, 1212, -352, -1065, 475, 711, -514, -428, 628, 288, -719, -152, 751, -72, -482, 226, 296, -247, -173, 517, -70, -340, 160, 560, -376, -144, 244, -152, -422, 298, 251, -458, -164, 413, -202, -415, 272, 436, -136, -189, 308, 179, -420, -201, 551, 135, -502, 6, 585, 20, -564, 112, 63, -250, -20, 500, -24, -571, -53, 209, -44, -158, -44, 45, 87, 7, 102, -19, -274, -165, 20, 326, -60, -33, 302, -139, 7, -165, -71, 172, -7, -172]
518a72J74O4l59J58J87j02j26L38K03j74l91J16P2j9K38O9l23j09K44k1k6j91
540a50m6J23N6K86j12l76J64J77m1n15M44O0l06R9L84k54n42O70O36r10k60O86
562B73j23m70O5M91k30m94P54K98q37k48Q57K03p60r8P55o45j32O83J51j082K88
583c01O67j07n86K23K83k18p5L76M8o88K77N29j86m96M4M06n9k35J83p1k30K08
605hL73n90Q1K72M9k22Q8o4j42K28K95j65k32lJ13k4j69LK60j23k09M12L7o24
629c64Q1N97j62m32p8O22k50j85J59j6k83J41M42J62p44j95Q07J58o31k1O00m92
651h4k46Q16M3r55M0P57j09n47J78K54k56j23M95R9o37p9O14J75p10j24Q75m07
673F9m39Q03k72n64M55N67p59m40Q73J6m61J79J56o42M22L67j12m80P0M54J22
$$ y = [-172, 2, 66, -293, -135, 52, -50, -176, 162, 365, 191, -200, -84, -12, -31, 207, 276, -47, -156, 88, 67, 41, -150, -196, -73, -17, 269, 157, -219, -55, 122, 81, -434, 10, 70, -236, -137, 247, -7, -549, 121, 757, -153, -413, 273, 150, -320, -255, 236, 6, -488, 266, 564, -273, -521, 336, 539, -221, -319, 436, -209, -341, 342, 493, -589, -301, 366, 259, -327, -104, 179, -39, -114, 262, 310, -378, -101, 428, 242, -254, -210, 196, 137, -98, 85, 14, -216, -8, 365, -225, -144, 128, 177, -45, 43, -21, -163, 65, 360, 195, -37, -40, 73, 49, -120, -117, 143, 20, -189, 223, 260, -364, -283, 314, 152, -280, -358, 264, 14, -171, -12, -28, -311, -170, 272, 434, -310, -505, 302, 460, -171, -192, 408, -84, -330, 486, 529, -426, -386, 371, 262, -285, -107, 147, -109, -232, 263, 362, -275, -354, 260, 435, -275, -399, 476, 69, -370, 433, 161, -403, 52, 619, -140, -580, 293, 309, -152, 27, 183, -459, -37, 330, 218, -262, -192, 262, 384]
694C84m33p3J63l59N1M96K29r57p1R22k1q40N12K26m50o4O89j07p18L62M14l36
716A9j21J52J52q9m87L55K76m23j3M41j12p07N30N16m86k82L93J29o10P03m1m33
738a38k79M12L04k97l81K59L06k5l80M83k11p78P27N27o33m89O88K22o69J68P24
759E40p81j88Q82J02q58j13P40k48l64L73J69k92q5K51K89q54n1R46m02o11L43
780b12P41q15q8R00l26p78N18O86p44m50Q98Q9p43K25M87l78l82Q91J04p62m58
801e97O15M43p51Q8P37p38n87J008M85j133j54R95M5q82M31M93q50k28Q00L53
821E73j153M44P00l11p55O05L51p65k97Q27K35r20L09P92p08m03N94M80q93j75
841d70R03k49o77M58N50p27n42J132%p49J57P74n47n55N07O67r61k56Q18K59r63
$$ y = [384, -49, -122, 41, -318, -267, 229, 458, -499, -570, 352, 331, -509, 3, 229, -221, -285, 404, 297, -421, -59, 355, 19, -102, 50, 202, 113, -374, -19, 257, -166, -179, 262, 150, -557, -27, 489, 3, -279, 114, 243, -367, 336, 295, -138, -417, -5, 299, 2, -379, -120, 186, 161, -219, 264, 53, -725, 2, 529, -104, -593, 95, 317, -352, -184, 540, -241, -429, 453, 555, -303, -416, 324, 76, -288, 85, 254, -38, -123, 128, 417, -437, -488, 458, 56, -555, -212, 529, -286, -374, 526, 200, -578, -60, 626, -118, -568, 330, 419, -324, -99, 388, 10, -372, 519, 623, -139, -597, 18, 461, -290, -202, 535, -203, -790, 218, 703, -430, -584, 411, 456, -426, 5, 498, -352, -580, 220, 573, -580, -136, 564, 253, -502, 103, 454, -311, -608, 219, 454, -466, -157, 635, -73, -476, 118, 598, -295, -470, 433, 184, -493, -35, 515, -212, -754, 378, 378, -371, -214, 560, 13, -542, -35, 632, -329, -585, 233, 492, -471]
862d71L14N74n35k95O66K39p79J51O28k82p78O23M82o19l92J012j55r73J96Q26
882D32j60q28O92M61r47n1P51j59n50J46Q40o34m54N39M15r39QR95m12n36L53
903c8P31r66l00R33Q7q86K11O43j37q22O19L46o75J2O60p9p46J57P09l40n17O99
925C01J46q22Q5Q34o25l36M87M53p20k74Q72o7p05K84M89p00p5N75R1m74j08Q18
947E29m49m57L72O17p59l00P54J20r31L58N29k84p06Q48K39p20L8N57k51o04M29
968g1N11m22m33O40om73j62R31k89m39J66K62k96q8L39K75r28K08N27k70k72K62
990b8L68o94J06M17N1m71K13L62j42l86L05Q5l08k6M58k64k16R4N14n58n3K40
1012F7J10m23J88L35k75l80N21J23n17RN15j07m36J70K60q9l94L76J65m58j0N70
$$ y = [-471, -157, 417, -118, -413, 253, 492, -287, -136, 492, 210, -568, 55, 537, -82, -474, 538, 383, -590, -394, 432, 272, -556, 136, 597, -350, -401, 350, 191, -359, -213, 627, -7, -461, 78, 493, -446, -438, 557, 145, -391, -38, 693, -273, -573, 360, 447, -439, -228, 415, 278, -544, 75, 421, -254, -242, 418, 339, -407, -250, 459, 119, -398, 301, 447, -375, -290, 544, -81, -417, 70, 523, -197, -471, 401, 334, -371, -87, 402, -298, -373, 202, 293, -181, -289, 529, 80, -377, -5, 612, -147, -447, 307, 427, -504, -146, 383, 99, -607, 241, 480, -240, -202, 355, 104, -500, -71, 440, 18, -415, 225, 219, -254, -416, 515, 226, -213, -47, 215, -81, -169, 170, 445, -483, -275, 252, -18, -290, -28, 340, -354, -248, 169, 220, -251, -38, 324, 182, -204, 101, 186, -122, -148, 310, 46, -170, -76, 438, -120, -173, 67, 177, -246, -58, 277, 2, -378, 143, 266, -251, -242, 273, 166, -270, -100, 160, 71, -323, 53, 218, -240, -250, 320]
1034C20l43l93L02L32k92n9K49J23m88J05M82j98m34K59K22j96l38M92J50n35
1054b40K11J89n8l64L18L07n95j01O97j64m74K26J44j38k00L86ok95O9K88r5m42
1076c37M81L4k00r0J84o7j13K50P7jm40L34m7k29RK62n3k16J89K51l45R7P6o9
1100C7o5J63q7n1R1m3j68l6R5Q3O8o9m4O0o7r7J34O9j80q6L28j9j31O1o0j10P5
1127d9J05M7oo7j32L36j94l09M75q4l15j59M70r2j70K2L25k08j26L07j70j39L9
1150i4J39p0k9J23N5j24j99L95J0l41o4N65l47k00K10J70j96J30J42k30l4J22
1172A33j57k27K16R6k25j6K76o4k43J23J04P5l5q6J9o0l9L08n1l69M9L88l04n9
1196a48J84j50R0Q7J34l48j03M22j04m7j38L38k39k53L69P4k46j06K36r4o6Q8
$$ y = [320, -23, -416, -114, 218, -74, -133, 116, 239, -249, -144, 338, 140, -294, -35, 187, -9, -347, 145, 295, -240, -29, 160, 102, -262, 56, 363, -232, -333, 364, 200, -274, -48, 96, -42, -242, 144, 138, -157, -88, 200, 105, -337, 144, 178, -22, -112, 72, 5, -108, 142, 219, 218, -222, 112, 65, -164, -155, 107, 54, -162, 27, 278, -67, 30, 106, 37, -28, 135, 48, -3, 88, 45, -123, -159, -64, 19, 87, 18, -26, 34, -33, -130, 4, 73, -107, -193, 135, 116, -15, 46, -14, -124, -49, 56, 103, 97, 30, -102, 234, 40, -269, 206, 122, -193, -352, 118, 26, -144, -122, 203, -5, -131, 176, 6, -133, -94, 45, -25, -54, 69, 124, 0, -199, 196, 206, -135, -199, 366, 19, -181, 29, 199, 3, 133, 275, 45, 11, 133, -24, -251, -35, 61, -164, -180, 96, 32, -211, -88, 16, 91, 56, -30, -11, -71, -110, 198, 147, -222, -173, 215, -89, -148, 36, -114, -24, 63, 197, -151, -254, 168, 64, 17, -121, 217, -22, -275, 94, 168, -78, -184, 52, -42, -108, -20]
1218b0q1M9L0rp5L00n0o6kjr8l1K1J2Pj93P1J89n9j18Q6j02J97J23N3k06l71L74
1246C0Jk14R5J23j6Q9P8k7j94r3J54omj42j0O4L5R7j72k3P7J44l6m13M20N7j14
1273@qJ54j86j1J54j08q7o4J11J81r8P7k55N4Q7p5N9l3j00J85J10o4q6q7K00Q9
1299A99j61Q8l0J07k45J05j00j62J44J96k39j2J93J3k20M3L93m81j66M70J50l60
1321g5J7K58o4m04M44L85r18J09O65k24m17J91L98n61j58O59j01m89P4N27j87
1342A29p29L35N81n23j17P50l40n30M90L94m39n11P82L07j038K33P70m21n70M89
1362D2M21p28k79Q96k22n53L21O62p05l23P20N1p51J90Q05l00p52O32N48r40k6
1383b91P65j06j071M94R89q16l80M71L05q19P2R16l61p73O73M50p38l46J074o4
$$ y = [-20, -101, -52, -22, -31, -106, 194, 144, 78, 76, 75, -23, -54, -33, -21, -14, -207, -136, 53, -6, -124, -38, -140, 57, 180, 233, 27, -344, 30, 31, -183, -88, 35, 19, 108, 186, 159, -35, -128, 26, 20, 16, -126, -136, -72, -37, 60, -112, -135, -58, 86, 50, -363, 57, 114, 0, -8, 146, -40, -51, 103, -5, -92, -156, -45, 136, 38, 115, -140, -86, 1, -74, -15, -48, -148, 37, 147, 83, -3, -90, 110, 199, 38, 126, 96, 203, -42, 63, -37, -199, -55, 141, -98, -110, 83, 96, -124, -81, 312, -169, -335, 135, 285, -75, -58, 200, 136, -268, 176, 561, -357, -248, 417, 193, -224, -33, 365, -196, -354, 305, 204, -285, -211, 316, 129, -600, -265, 316, -207, -324, 426, 86, -444, 46, 440, 1, -510, 272, 579, -459, -226, 544, 123, -447, 42, 463, -265, -544, 352, 130, -423, -102, 560, -145, -468, 252, 303, -448, -258, 547, 247, -505, 127, 675, -265, -291, 474, 368, -703, -209, 780, -36, -416, 55, 360, -459, -387, 529, 168, -605, 68, 518, -220, -566, 508, 444]
1403D44q83K78Q14n88p13P38L46p60k81J227l43r88O68N38o44m39R94P1j139L60
1423c00J013l76j077R26L79q76k68J036J9j222M89J049p41q22R68K96p30r7Q01
1442D67j06j165Q70O50j092k32R17K40j144J83J201o30r04P26Q11j322o6J206
1460F10j98j166N82J159j205o59J155M38j213j09J568p09j184O93J172j253l31
1477f50J580k56j539O43J401j133r96J216N04j350p4J497m71j440R34J286j441
1494b89p12J726P0j724L88J526r84r96J201R72j803l8J480k13j670R48J246j236
1512a08r98J775K84j811J75J804p11j511J186R82j624m37J823k94j649P62J678
1529A326j561r62J697L64j760M2J906p23j549J284R21j491o29J916J22k029P05
$$ y = [444, -439, -161, 653, 65, -648, 90, 436, -324, -605, 622, 279, -709, -41, 497, -147, -586, 408, 479, -660, -300, 713, 337, -740, 186, 565, -311, -579, 457, 476, -746, -257, 792, 51, -771, 197, 493, -237, -334, 467, 361, -804, 66, 716, -376, -608, 309, 549, -595, -412, 789, 159, -745, -19, 792, -530, -596, 610, 412, -754, -172, 987, -218, -877, 278, 716, -497, -606, 962, 253, -931, -238, 934, -319, -650, 930, 674, -865, -222, 1179, 46, -950, 266, 770, -580, -654, 843, 372, -1068, -134, 1152, -289, -1001, 725, 795, -929, -541, 985, 1, -995, 206, 1178, -625, -663, 817, 604, -1066, -118, 1128, -108, -1106, 669, 953, -858, -683, 1121, 410, -1101, 85, 1067, -557, -994, 829, 535, -1114, -352, 1326, -235, -1197, 500, 864, -896, -854, 1052, 329, -1220, 64, 985, -506, -1135, 781, 903, -1126, -421]
1546d21J603j270j029J480Q11j938j37J972m82j981J301J492j796o82J710M01
1562A034k078M97J599j022j270J332J255j941o44K300l54j997J025J542j515j098
1578a335K054K79j863Q6J820p45j585J324J190j668p22J995J15k148N02K051j482
1595a32j387K072N36j855j61K012n05j818J208J347j631q69J845M93k227M98J837
1612A263j041j698J698R88j707n05K075l91j810P53J754j381j115J573O46j957
1628h55j4K045p03j802J415J362j823o94J789K16k238R47J623j086j659J899Q42
1645A264k133j1J912n10j885J031J910k029o83J834L72k038J68K128j042j878
1661a590J936Q55j899m25K333m76k023R71J654j445j200J993J55j737J60J949
$$ y = [-421, 1182, -88, -1117, 363, 1174, -764, -901, 1071, 589, -1392, -91, 1401, -395, -1077, 633, 1034, -1044, -547, 1052, 30, -1240, 92, 1347, -594, -1238, 1062, 708, -1289, -264, 1278, -237, -1335, 719, 998, -865, -779, 1041, 296, -1289, 35, 1225, -443, -1165, 830, 945, -1203, -701, 1350, -132, -1519, 553, 1089, -766, -927, 1085, 580, -1238, -30, 1317, -314, -1183, 662, 1155, -1072, -574, 1263, 222, -1476, 222, 1210, -497, -1002, 1073, 682, -1128, -375, 1379, -2, -1117, 456, 1102, -855, -869, 1176, 473, -1329, 86, 1448, -375, -1069, 720, 936, -1302, -355, 1268, 182, -1477, 422, 1264, -869, -880, 1032, 522, -1363, -332, 1578, -451, -1134, 700, 1072, -966, -798, 1330, 288, -1590, 346, 1201, -698, -1123, 1210, 734, -1289, -318, 1336, -109, -1309, 684, 839, -898, -738, 1211]
1677A211o61j841J264J188j567o95K013P3k196M95K020j386j067J669N58j895
1693h17k18K292r03j575J074J467j527j126K120L98k298N14J884r30j734J691
1709C12Q79j885l79K040l82j744Q59J512j220j185J668N40j782m8J902q18j508
1726a239J426Q65j613n12J864m6j856O73J594j057j328J416Q42j803R3J581m90
1743D10j625J011J303j321r51J826J20j667L81J690j033j358J454Q06j493n95
1759a042J955l04j532Q47J233j331j113J687M99j695M0J737p36j335J009J129
1775A048j379p39J787M6j657N97J451j066j170J481N25j673K01J365k81j579J032
1792a1R79j279o41J437L97j805N54J421o54j458J352P13j559k75J590l61j408
$$ y = [1211, 550, -1291, -27, 1161, -406, -1101, 912, 985, -1211, -716, 1304, -82, -1149, 520, 1078, -817, -1035, 1257, 354, -1221, -147, 1320, -207, -1333, 787, 1185, -1113, -599, 1285, 355, -1379, 312, 1191, -694, -1073, 967, 585, -1159, -300, 1212, -8, -1193, 475, 1015, -767, -815, 1087, 269, -1239, 187, 1052, -561, -1073, 791, 745, -1111, -438, 1156, 99, -1229, 187, 1029, -774, -681, 900, 410, -1215, -204, 1099, -222, -1173, 653, 773, -894, -513, 1177, 144, -1214, 240, 1046, -447, -1042, 913, 609, -923, -76, 1157, -174, -1287, 400, 899, -796, -756, 981, 245, -1090, -81, 1048, -331, -1070, 717, 763, -894, -297, 1154, 88, -1082, 399, 924, -749, -548, 817, 536, -1043, -11, 968, -311, -952, 485, 882, -923, -369, 1052, 398, -1060, 292, 1005, -554, -829, 761, 400, -1008]
1809a008Q05J115j149o97J277L32j269J15J439p34j071J107P11j241n56J465M1
1826F82j454M75J197r95q86J249L25j191M8J254m53j086R25P65j198m51J308J29
1844F43j323L70J166p72r15P86O95r81l81J291r6j079N60P27o86q65J199K63r69
1863c67Q0R69m00r81O30Q44j167k48J109J93j156J84Q91o05o01P77M56r76j20
1882d88R02j33r16O56N88p08m36R44Q6r85L22Q71l93q11M82N24p80j4M78K6q75
1903f60N53O37l80q66Q05M03q26K08O65m20q90Q10M92o03m59R54j9p86R9Q58n72
1924Cn75P56L82q80m9Q61k76o00K39N45m91m41O94K24r23K74Q01k14p65L77M19
1945C61n80j5M66n9o04L44N14n31l81O85J86n08NL11J9n99M83R9l90j03N09on07
$$ y = [-1008, -203, 912, -237, -934, 343, 675, -594, -479, 960, 226, -845, 262, 973, -268, -824, 641, 682, -772, -297, 900, -95, -981, 268, 593, -598, -550, 704, 251, -835, 90, 855, -343, -794, 514, 643, -680, -310, 856, 84, -831, -45, 650, -331, -712, 579, 483, -596, -36, 691, 5, -860, 339, 602, -367, -287, 682, 282, -699, -69, 775, -392, -640, 469, 662, -494, -310, 581, -24, -625, 152, 608, -368, -488, 414, 281, -635, 21, 609, -99, -535, 409, 495, -490, -168, 703, 310, -501, -19, 505, -275, -289, 189, 215, -660, -107, 530, 150, -716, 89, 492, -334, -126, 539, 119, -771, 39, 531, -72, -531, 423, 404, -382, -283, 575, 3, -572, 184, 566, -314, -363, 498, 222, -378, -139, 406, -85, -526, 168, 392, -531, -257, 544, 330, -435, -58, 361, -219, -234, 232, 173, -431, -87, 427, -104, -485, 200, 386, -122, -117, 194, 213, -386, 97, 196, -194, -297, 212, 206, -301]
1968c01L51K39l35m51O13K20n04K8N47j28k58o3K65k37j63L12jl98K36L22j85
1989A09m02L10K04m08L9M29k91j85J87K52k53k1R8pk95P7J75m5j7J17J27l13p8
2012a91L32M1l31M3K71j42k75M04J00l46l8K63J1l87J06L78m53j31M10L3m5j63
2034a10L09k13n8J7Q3j49J01J59K2j50K2J04j61j39J32J17J5o2kR2l87J88J09
2057C9j50P6K66k9l00K2K59k98r7J18J87P0r1O3j67j14J76j1m6M1l0Q1k73K81
2081G3n9m6P7Pj48L0K17j9kl18J90K4p4o5K34M7j55J40j82J34m1j04K03k00K0
2106a7r3N9oj4J16Qrj24J19k6p5j3J84o1M2p5J85j27j59L3J19q0o1L31l11N4Q7
2133H6p3j22L1R4O7n9j17J75n2N2j41l1K16p4Kj82K52M9j88k3Ko5L0J4P2j09k4
$$ y = [-301, 50, 289, -46, -497, 116, 336, -168, -140, 407, 279, 21, -42, 223, -14, -177, 135, 134, -264, -28, 294, 109, -293, 17, 221, -187, -148, 281, -10, -195, -8, 244, -9, -30, 68, 61, -234, -157, 18, -27, -44, 73, 200, -113, -191, 141, 182, -149, -106, 165, 23, -252, 152, 252, -94, -132, 131, 142, -245, -139, 239, -214, -345, 65, 98, 53, -110, 199, -14, -72, -55, 28, -121, -20, 139, 161, 11, 33, 137, -24, -163, -31, 86, 101, 39, 37, 129, -258, -70, 39, -111, -35, 231, 202, -98, -76, 183, -115, -212, -94, 93, 163, 72, 135, -32, -146, 30, 19, -27, 14, -16, 65, -208, 73, 14, -32, 45, 52, -96, -66, 151, 132, 130, -188, 2, 26, -48, -113, 121, 168, 13, 153, -29, 105, 64, -40, 163, -37, -17, -110, -51, -57, -71, 45, 53, 44, -80, 39, 13, -62, -75, 109, 48, 90, 15, 200, 73, -86, -53, 66, -14, -75, 256, -55, -1, 86, 13, -109, -78, 16, 83, 24, -93, 82, 30, 82, -59, -90, 126, 52, 54, -128, 124, 173, -15, -38, -36, -101, -71, -57, 15, -94, -118]
2160a18K01j44p4J99r7J65j37j21M2k2qN6J26O7q2j75J72j37Q9M2lOk61M32j88
2185C0p6M2L1J56j45r0J35j07R3o9%Nk1p8J43r9R2J24j0j20j26R7j1m6m1%R8M5
2213E2J63q7l54K49K0k4m3oK8Q0MK6j78Q8n8j01J58q2J88l1m4n9J56j21K9j1l
2240C9K24k98j0J80K1j62Qj10N2Q4N5j91J13L5O5j27K77j38j49j43J39J19j22
2263c9k7K40j07M3p7l0R0k69J07m1p3K52N2j71j7o6K95j94K41j13k41K46j28J90
2287A63k72O3j6R1M4o6J0j39R1Q1n4J4J0o1K9q4J29R2j60j36K68j36J53j17l0
2312c3J74q3lK0k09%J11l0Q7J46j36L5j61J56L3j1l02K38Q8j90J42Oj24L6R1L5
2338A16j37k12K18M1j0j01J62j8j22J7qJJ69m4M8k51J90p3J07k05L3K12k71K92
$$ y = [-118, 83, -61, -135, 64, -33, 132, -5, -126, -84, -106, -114, -58, 68, 135, 53, -122, 50, -87, 2, 44, 41, 47, -214, 218, 30, -46, -4, 27, 183, 38, -52, 83, -24, 69, 0, 0, 5, -16, -94, 49, -50, 42, 166, 156, 36, -90, 7, -4, -50, -91, -91, 7, 52, 215, 128, -226, 23, 43, 19, -24, -30, -2, 78, 82, 108, -70, 18, -40, -141, 17, -65, 123, 92, 48, -11, 145, 24, 53, 42, 39, 263, -35, -45, 135, 156, -6, 2, -108, -56, 28, 83, -108, 5, 40, 105, -22, 255, 117, -32, -175, -36, 83, -39, -66, 174, 67, 110, 33, 3, 93, -176, -69, -110, -183, 69, 121, -50, -67, -133, 162, -32, 209, 96, -145, 101, -27, 163, -109, -46, -62, 29, 73, 7, 17, -122, -31, 50, -4, 10, 20, -41, -12, -96, 33, 125, -35, -171, 97, -39, 114, -3, -33, 141, 58, 55, 75, -134, -134, -23, -53, 34, 180, 44, 79, -82, 74, 107, 96, -206, 32, 120, -70, 72, 78, -46, -10, 81, 116, -21, -233, -15, 26, 16, -85, 77, 59, -63, -46, -54, -53, 116, 72, 120, -131, 59, -14, 93, -112, -79, 133, -138, 154]
2362A54p3j98R8PQ3l4j54J04Q6j04j53K99p5l5K1K08l31r5K07J00k02M4J30n5
2386C2j80K88k3o2k44L10j38m4M5J38o7k36J92M4j40O4N0J69l10O8R0J38m39M39
2410A84j84j64L67j32k2k1p3O4o8r2K29l0n5l0K90l07J06q9J40j00R7k0o4j52
2434a26J20k8r5R3K5J03j65J16O0j93p7J59J36j13j18K34q5k83J04L64k89N6R3
2457I1R6j50J40k16K0m0O6O3p0j47J60l7o4J52Q9j32j62K60M2k2k34P7p1o7L7
2482a19J86k2j39J06N1M8q6O6q1j47J07J19p6k12J19J91l5K4m0l9j19N8J00k12
2506a52R0J42p2K4K5p2K5k26K65Mq6JP3k8q0J45j80O2j1L85l81qJ32M6j86p0J92
2533E9o4Qn4M1J08m16K69K12j24j41J67R7j89J8J80k37kK97k31m0k5K08j31P1
$$ y = [154, 81, -117, -19, -12, 71, 37, -117, -13, 73, -31, -184, 115, 40, 5, 26, 234, -97, -192, 15, 115, -87, -43, 87, 32, -148, 140, 117, 55, -189, 121, -17, -61, -16, 122, 55, -181, 11, 55, -85, -21, 29, 198, -112, -44, 46, 184, -255, 184, 0, -164, 203, 71, 49, 28, -45, 19, -49, -141, 88, 58, 3, -27, 263, -44, 62, -27, 113, 13, 110, 90, 26, -126, -6, -34, -129, -36, -11, 92, -73, 43, 103, -90, -167, -8, 128, 15, -103, 131, 46, -237, -133, 231, -58, -2, 91, 187, 37, 177, -39, -19, -59, 7, 70, 0, -147, 13, -24, -88, 64, 153, 21, -141, 119, 161, 139, -95, -18, -89, -156, -119, 67, 45, -94, 12, 63, 111, 25, 91, 10, -137, -30, 89, 13, -199, -80, 111, 76, 100, 60, 21, -98, -40, 60, -152, -62, 80, 8, 32, 57, -15, 10, -216, 49, 53, -33, -32, 41, 13, -67, 78, -102, -40, -51, 334, -47, -55, 77, 123, -63, -133, 59, -5, 3, -51, -10, 98, -318, -49, 163, 39, -102, 65, 162, -27, -9, 171, -66, -68, 229, -2, -42, -67, 141, 10, 81]
2557H1j71K33k12N2q3P7nk9N3j84J78N6M2N8l19K25j24RJ81P9l23l2K15j0j84
2582a37j36J84J65r4J7J32j33P0j6k7k8l7J46k3j43J32l1j53k3R6R5j6m5J1j05
2607i9j4K53j21l1pJ74j71j21J83J8p5Q1m1n3j33J11J79j91k9J44P1j99J50j09
2631c0P9k3p4J5j33J25J00l3j55J46P1k54J27J16k00M0K1N3o0J12j14O8K95k45
2655D7j54L1J02j00J89j85L1P9O4k15L7J63m0k5n8Jk6r4j1J74Q3k18K56l6p6J6
2681C5M5o3k65L19J27j82j56J76J6j56R5J10r4L3j37J51j11J16o5Q6n4j58J47
2704A5q7L8J33K9j18j29K57k37k8K50j29L5p1J15R8j59J20p9j28M6OJ13j05j13
2728a28K08K2k14K08K3p1j95J74Q9j43n3J06j56Q9l7p0K2J78k09J89l0N5k8J32
$$ y = [81, -90, 143, -69, -17, -100, -23, -28, -57, -4, -188, -10, 46, 88, 146, -173, 52, -72, -63, 118, 197, -126, -158, 57, 47, -137, -273, -89, 76, -18, -1, 131, -2, 68, 52, 25, -3, -40, 106, 83, -60, 72, 41, -112, -135, -39, 56, 40, -5, 6, -99, -113, 140, 19, -12, -19, 155, -16, -137, 46, 64, -11, 70, 29, -24, -157, -46, 133, -58, -87, 57, 128, -71, 79, -30, 49, 26, -48, -33, -166, -41, 59, 26, -129, 17, 88, -166, -39, 77, -123, -83, -62, -9, -69, 43, -71, -3, 292, 47, -107, -76, 26, -74, 115, -70, -39, 40, 104, -111, -74, 89, 49, 24, -34, -33, -59, -153, -164, 10, 93, -125, 131, 95, 19, 35, 80, 17, -248, 71, 198, 16, -140, 36, 52, -104, -9, 101, 7, 40, -97, 54, -57, 59, -6, 80, 26, -132, 15, -72, -34, 99, 128, 10, -119, 138, -99, -127, 123, -6, 29, -42, 73, 171, 12, 132, 53, -75, -29, -23, 90, -15, -128, 80, 102, -112, 96, 119, 48, -147, 27, 116, -27, -80, 26, -130, -41, -78, -148, -126, 52, -157, 32, 2, 57, 29, 161]
2752A61j35L4J7J5j73J03j72o6J22J16J02j28O9J23j74j32J24M4l8J26r3J52k17
2775b0J22j70N4l5J66j13o4K43j59J54j69L4j1j8k6P1pl3J2Q8l15Q3R8R9j78K50
2801A56r0j22J49k21K16j9r0n6N3lM1j54K3J79j24j34J62J25m7K7oj74K40j23
2825Hj34J92q1l2N6J04j15r4K35l08J70K7j0M2j76J47l1l2p8J76k02J77j78K90
2849A53k24M7J13q4n8o8n5J87L4l9j08Q0J87j71r7J86K8k18L04k62P3J9o4J03
2873F6o6M9q8R5L9j38p7J12j2q9L8J62j46J4J44l5j43R7l8O4j65N8J28j54mN4
2899c5J08P5o9Qj43J58j29N1l2R0nr8j00J22J05k38L73k45m5M6M7lj2l7l3K6j37
2926a52J08M6k0j21K0m8J27lq0K01o2J92k51L6q1M1O6n8J03j6j60j0J44j42L70
$$ y = [161, 26, 60, 77, 92, -81, 22, -150, -216, -94, 22, 124, -4, 65, 188, 14, -118, 6, 50, 12, 138, 45, 197, -20, 102, -68, -14, -49, 117, 4, -60, 183, 24, 178, 9, 43, 32, 14, -12, 59, 52, 19, 31, 119, -196, -113, -15, 84, -94, 156, 66, -56, 93, -128, 88, 69, -21, -77, -24, -27, 14, -140, -117, 62, -62, -196, -34, 91, 44, 71, 65, -109, 131, 8, -126, 66, -15, -47, 9, 113, -2, -96, 139, -169, 1, 28, 18, 60, -116, 31, 0, -32, -110, 66, -136, 41, -137, 153, -71, -24, 89, 5, -53, -121, -176, 11, 45, 6, -102, -22, 165, -6, -103, 83, 111, -107, 197, -65, 8, 27, -37, 66, 0, 49, -39, 56, 95, -43, -120, -8, -20, -109, -71, 91, -55, -41, 103, 68, -75, 22, -16, 48, -117, -59, 69, -85, -89, -35, 73, 148, 79, 87, -56, 102, -27, 24, -8, 82, 77, -21, -121, 1, 106, -132, 241, -4, -49, -3, 44, 41, 29, -8, -41, -15, -152, -44, 2, -18, -139, -119, -167, -40, -43, -123, 78, 16, 208, -43, -7, -88, -47, 19, -39, 64, 48, -112, -122, 22, -120, 250]
2951B50l64J32Q3j53J72j10j19lj4J29OJ53k37N0Q7o6j53J35j0R8k05J60J03j0
2975A14j74j31K35j77J24P9J5k5j87Q6l5m8K03j73M9q0J97L4l6r4J61j59k7J43
2999I4j45j19K65n8r9K5j75N71l84k1Q3J26J8j56K4Pj20m5K64l2j43J43j60J01
3023F4j71K7J88l01K45L3j59O3M9p2l5lK32j52j27J49J39k49R2J45k61j34K88
3046E0j3k19Q6J39R4k65J22J84l96J85J79j07J2j24L29j67l16K21J50k45J52J0
3068F1J30k99R8K88j05k26R9k3j29l2J31Q6k55J38J35j09o3P6J74k39r5L14k49
3091i4r9J73K67l68n9K08q7O4N6J49j95k02L32P3k95j36M41j82l02K06L57m52
3113a45rJ20K08l01J67J70j39j73J8K14k91J06K16q4m08K47J19k76J59L10n8k73
$$ y = [250, -114, 18, 101, -52, 120, 10, -109, -112, -126, 3, 9, 162, -75, -25, 62, -4, -157, -22, -32, 66, -139, 21, 124, 114, -60, -191, 44, -133, -9, 70, 85, 60, -127, -41, -76, -124, 79, -94, -45, -125, 72, 106, 70, -24, 137, -22, -49, 94, -51, -170, 95, 37, -62, -37, -212, 359, -25, -46, 37, 163, 181, 25, 49, 56, -64, -109, 155, 123, -20, 123, -37, 64, -107, -80, 108, -193, 52, 85, -74, -11, 38, -34, -69, -72, 160, 8, -119, 30, 169, -80, 12, 157, -104, -238, 50, 37, -182, -96, 43, 137, -128, -6, 178, -218, -33, 146, 39, 51, -73, 256, 89, -227, -6, 144, -101, 51, 61, 191, -108, -10, 278, 173, -53, 46, 23, -106, -138, -7, 79, -176, -38, 97, -12, -75, 1, 175, -64, -159, 155, -94, -193, -20, 247, -121, -180, 28, -59, 5, 61, 210, 15, -187, 145, 218, -77, -213, 228, 46, -256, -50, 307, -145, -154, -34, 174, -127, 40, 210, 71, -102, -84, 130, -161, -55, 161, 77, -331, -84, 35, -241, -82, 228, 170, -103]
3135a03q2L42q3k65L68Pl78M8K70j33k8k8K41q2k49J44Nk7j33M30k39j29L4K12
3159A42j90J7J70j54j22j0M15j60l14R7L36k65N7K08q1l84J73L51m35J42P1Q9
3181A53l51R7L22k49j38K28K10l90j59N03N1m50J9L13k95q0J89K17l62j52M46
3202A22J4l23M6N77n83j47L33J41l21lK97k03j81J69J94l67K16K52k16k13L29
3223A33R1k92o8K99J18m69O6J84r1j71K63L30j95m44L93P1l15o3K46r0j6lK03
3246A80j98j42L15j68k64M53J9l03k9J46J43j84j05K29l9l91K50M29l23k52K25
3267iJ73l90K05M22m00j50K53J54m86P7N24j75m20K45K71m83m2M99q5l70K06K63
3289B82j60k94J56L08n22J3M81k19k98K95N9m2k40L00J18l26O5J88o4j46J71O9
$$ y = [-103, -185, 157, 74, -191, 177, 184, -194, -146, 124, -9, -37, -65, 176, 94, -155, -11, -6, -33, -166, 264, 25, -104, -70, 142, -48, -31, 139, -15, -137, -147, 268, 108, -206, -109, 227, -38, 19, 227, 146, -238, -65, 286, -149, -7, 64, 153, -198, -101, 221, -28, -166, 62, 272, -118, -277, 226, 277, -173, -154, 159, -136, -216, -27, 190, -172, -324, 122, 136, -187, -141, 436, -147, -294, 39, 180, -141, -144, 153, -50, -231, -62, 132, -235, -19, 233, 17, -196, 133, 224, -68, -136, 163, 281, -188, -122, 62, -29, -200, 63, 393, 198, -246, 147, 218, -97, -160, 86, -4, -20, -23, 180, -18, -160, 155, -13, -277, 176, 195, -108, -137, 9, 152, -32, -137, 92, 53, -338, -88, 341, 18, -234, -9, 164, -226, -21, 401, 1, -149, 104, 258, -228, -151, 373, 198, -222, 23, 294, -189, -231, 268, 183, -187, 19, 282, 122, -172, -16, 292, -230, -217, 264, 45, -253, 42, 101, 59, -181, 119, 237, -89, -24, 164, 100, -46, 125, 194]
3311A94l78j51M37m5l04K06M05l80j71K91j9k99O2L67k17k70K53J90j92j82N01
3332B98j47m33J46L18j52j05J72O8k75k6L32j04l06K25K13l14n6L8L81n44J55
3353a16L60k25k70K83P4l92J58K09P7l55J67K19l06o9K40J81k68r3K75j25j40
3374a16j2K66j61k11K35J48j99L2K49j62l06K30K64k66j36L35j58k24J73J07j91
3395a03j21L19K6k92R8K99k67j86J92J72k22r1N93m68m34M30K05j65m6L47j80
3416A06j75k64O33k31l11K95J85l72K74L6n3k69J61K77l21j17J42J4qj98M44p5
3438A73l87K19J56j67j34L24J9j01k37L69j60l22K79J69j79k81M48m5l54L06K8
3459A23n6j03K94j84l62L21NK2p8p7J06j65L1K24j6k75R8K20k07P7J04N2k08M
$$ y = [194, -184, -335, 102, 57, -247, -41, 364, -16, -187, 104, 85, -214, -152, 215, -2, -272, -19, 171, -21, -203, 298, 151, -282, -136, 182, 30, -75, 97, 165, -110, -136, 196, 92, -214, 11, 224, -90, -146, -108, 273, -271, -116, 244, 19, -251, 32, 106, -286, -128, 81, 158, -197, -30, 189, -117, -186, 54, 235, -33, -126, 149, 24, -116, -128, 138, -23, -234, 1, 149, -50, -18, 231, 69, -237, -7, 257, -9, -145, 190, 32, -192, -19, 88, -103, -224, 95, 121, -171, -73, 226, -41, -227, -35, 137, -85, -176, 417, -51, -485, -55, 150, -15, -61, 286, 106, -69, -333, 300, 69, -242, 53, 238, -134, 140, 176, 123, -146, 15, 292, -29, -146, -4, 10, 2, -196, 248, 173, -214, 5, 161, -6, -140, 184, 203, 102, -135, 234, 74, -248, 31, 200, 21, -260, 188, 143, -211, 95, 123, 67, -36, 258, 74, -288, 33, 38, 60, -18, -95, 11, -154, -123, 101, 85, -190, -92, 128, -79, -2, 102, 154, -54, -50]
3483e0J53L1j62Q9N2k60J24K48j06l36J64K39l13j29K59K39j19j29K72k21l05
3504b60L72N2q6k32J80J82k60Q9r5J01k35K23Jl03J61K85m1l04J63K46l15J38
3526F2m4J39l74N8K53j33Qm3J45j87P2K37r0k12J27J51k54j42Q4L68j57j81K52
3549A39j59jP0M6l7k73J88J08j80N6J21m6j45R4J13j76k8k5K01m2P1J37k86j5
3573f9J77N6k64J23j1K55k04j3Q8k05J26M3k8j38M5P5o8K5Ok6P7k19K37j80J61
3598F9j9O2k49j9K69j33j00Q4O6L7j38M1R9j04j46K41k14R6K2J44j83j40K47k3
3622Ir1mJ48o7l6k1J43J64k89j3J06p7M5R3R7l74K13p9Q4k51L94l2m5k54L14j87
3648a0q3r4K51j72K35o6O3j92J11j30j0l1J29L8j63K43k54J99M3J7k29J02j95
$$ y = [-50, 103, 134, -28, 61, 113, -147, -23, 225, 119, -217, -53, 186, -127, -256, 3, 242, 123, -6, 266, 45, -260, 112, 164, 78, -154, 26, 208, -52, 37, -58, 43, -192, 31, 32, -271, -110, 175, 134, -170, -7, 239, -76, 62, 18, 157, -217, -159, 94, -39, -31, -74, 71, -116, -44, 193, 103, -109, 18, 169, -85, -227, -143, 225, 68, -113, 139, -20, -21, 49, 95, 58, -215, -27, 81, -99, -43, 78, 32, -113, -19, 94, -82, -110, -135, 66, 24, 95, 232, -54, -69, 108, 164, -100, 23, 12, 267, 63, 50, 138, -67, 59, 102, 74, -64, -19, 56, -12, 13, 19, -7, 70, -149, 88, -92, 69, 50, 112, -137, -156, 113, -20, -120, -36, 30, 67, -71, -30, 69, -35, -181, 60, -154, -58, -36, 108, -75, -215, 32, 9, -82, -86, 62, -5, -41, -62, 81, 245, -44, -57, 49, -28, 17, 110, 207, -167, 46, -33, 51, -200, 194, 162, 117, -137, 177, -10, -93, -187, 64, -108, 127, 61, 124, -68, 43, -87, -97, -128, 1, 39, -124, 119, -135, 64, 107, 124, -105, -3, -198]
3671a98K55j18r9K81%j82j83K16J22M2j58n6p6K76k06O7R8j68M3Q0j04j06J70
3694dj16K05o2m0mj00K60n6j14K54j31J3M0j54q0K0M8K0k1j02K4J38j11l4K8N1
3720b8j40P5K6J09K1j10j0JK1K51j65K0j14j86K21j7po8nJ79n2j49p2L27k07K40
3746A61j32K3j27M8J23j57J97k10jJ64M3q9j34j3J16O8j0J4j00J97j54j27J11
3769A1K8r1K0M8Km0J44j79N8q6J92O6j20o6j1k4lQ5j54K71j12j02K01L7j1j88
3795b4RR0J7o7j53J82Q5k15R3jj49J61j10R8Q4J16r1j84k0J47L6q7j2J77j08j2
3821F2j70Q9K2j45J88J56k02O7J41j36N0lk64M7J18Np5J2P9O4k57K72M5j1r8k43
3847a87L08j71K52l65J23O9Jo3k6J41k54P5k2L7R9n4NJ41j54Kr9J6J34P0j02J79
$$ y = [-198, 57, -61, -160, 121, 121, -61, -244, -28, 94, 136, -22, -78, -154, 122, -84, -17, 81, -87, -44, 36, -68, -174, -4, -120, 85, 23, -17, -21, -121, 139, 83, -31, 223, 92, 105, 145, -9, -89, -69, -21, -1, -22, -124, -100, 38, -73, -107, -79, -28, -168, -93, -67, 42, 63, -47, -57, -56, -35, 216, 51, 71, -43, -229, -8, -25, -32, -100, -105, 74, 22, -127, -199, 128, -79, 161, 29, 52, -75, -27, 96, -61, 136, -74, -75, 89, 132, 43, -91, -104, 12, 80, 70, 84, -16, 181, 27, -100, 11, 39, -52, -32, 16, 18, -22, 122, -57, 1, -85, 107, 173, 53, -13, -24, -48, -51, 34, -120, 151, 39, -63, 138, 175, 164, -24, -15, 75, 92, 25, -128, 54, 139, -76, 17, 16, -133, 28, -82, 16, 100, 216, 125, -59, -79, 68, 104, 17, 5, 182, 74, 62, -108, -19, 3, -142, 46, 202, 0, 67, 208, 72, 122, 119, -145, -98, 20, 25, -50, -38, 41, 105, -152, 120, 165, 154, 56, -187, 121, -50, 202, -163, -40, 29, 30, -33, -59, 82, -172, -97, -119, -82, 17, -37, -32, 109, -45, -43, -142, -126, 8, 78, -24, 155]
3873A55r6j14j32K53j5K3O1n3j69pJ69j06J92k91J59j12k4K05O9j85j50K88k74
3896a54N6J73n5k34J36K14o2j50L5l7J0j41K73j13J48k64J77J64k21J72j0j27
3918a0L6Pj63M8L7J37M6k24Q8K09k65PM4%J4N1j69n0J55q3J93j65M3J12K04m46
3944a44J41o7M4O8q8J37lMn1J7k09J41J29k19P9J66j77j73N0K58l00J16JJ34j41
3969h7r5K54Qj86K78j88J07j95O7j10L9J07j64J95O2j87K18j49j40K16j93Q9J46
3992I2k0j39J08o0j66J64n8n8J10L0M5J19j82P2p4K09J35k85j21j0PN1J18j47
4016f0P4J41k2j26M8J2o7q2M3kK9j36O3J75j42J0P3m7jJ23j54K9j54K88k25M0
4042g0j9K72l06M0J37r5m6p2K14k8r9K11j06J7N9j73k6l0M6P9N1j41P5K0J42j95
$$ y = [155, 59, -55, -187, 66, 51, 74, 135, 82, -87, -94, 75, -31, 161, -130, 29, -83, -107, 98, 167, -18, -168, 120, -154, -98, 75, 20, -214, -78, 136, 74, -76, -41, -78, -68, -209, 64, -49, 99, -165, 12, 176, -45, 127, 117, -10, 26, 33, -130, -82, -45, 92, 138, -86, 2, 211, -54, -47, -3, -3, 11, 62, -107, -157, -2, -85, 108, -57, -14, 98, 302, -144, -3, -70, -26, 42, -46, 91, 88, 92, 41, 58, -151, -10, 119, -100, -21, 145, -32, -205, -155, 103, -197, -81, -80, 54, -87, -182, 72, 80, -106, 172, -16, 91, -104, -37, -147, -108, -1, -165, 30, 92, -95, 123, -26, -166, 50, -143, -54, 92, 72, -67, 41, -19, -185, -21, -79, -137, -27, 3, 48, 167, -15, 57, -17, 192, 327, 42, -79, -89, -82, -31, 87, -60, 14, 155, 133, 7, 55, 67, 0, -82, -39, -41, -12, -148, -85, 90, -52, -42, 31, -16, -17, 106, -48, -19, -173, 115, -110, -70, -89, 183, -123, -83, 54, -41, -87, -159, 55, 27, -72, 139, 33, 50, 109, -64, -90, -120, -74, 5, 56, -85, -10, 10, 152, -43]
4068d3L8j28J74JrN1k41J49no0M0J01P2j31j38Q0J8J29m8J10k18q7J79M2r3l0
4094d7OK21l15R1K88l90Q2j38J15l3K78j78R5n9O8j05n7K56r6Q9l56K95p8j00
4118f8N6K13j09j55J8J72p2N5j58J09L3n2Np8J49j24j69J47L6O5P9k98J82M9j35
4143e0O4Rj38L5J34P2k99R8Q0j4K5q1J40Q4j58K0J55j41j61m5K55q7J88k96K49
4168A38k13J88K2n6j46J00k57J91M7m6j51K52n5l3J08j97K22o7m5K07r8K0j27
4191Dj69J49p3n8J51q3j16K96r9K2k5K12j78k07L50p8o1j22R8m6L9r6K1k9k7P1
4217e4Mj62K44R4r6j01j08J14P1j20N6n2J03Q5j22K0j52J80K12k38LJ41n2j27
4241e7J57j68J58j46Q8L5j28Q9N2m8k43K22P9j13q8J40j02R9l1J34k09P9mJ4p6
$$ y = [-43, -5, -133, 41, 42, 33, 84, -157, -8, -13, -73, -33, 68, 140, 9, -129, -49, -31, 98, 50, 160, -58, -145, 34, 76, -17, -47, -41, 180, -135, -44, 244, -146, -64, -202, -87, -120, 158, -20, 75, 16, 84, -21, -78, 178, 82, 171, -185, 110, 32, -68, -12, 201, 92, -63, -45, 127, 55, 110, -48, 61, 94, 42, 47, -31, 118, -6, -175, -28, 8, 73, 152, -146, 36, 85, -50, 14, 23, -115, -80, 54, 126, -173, -75, 5, -9, 16, -65, 75, 159, 1, 21, 176, 35, -126, -171, 84, -3, 185, -111, 138, -75, 113, 135, 79, -67, 33, -224, -33, 14, -32, -183, 69, 14, -19, 89, -108, 114, 47, 2, 209, 111, 131, 4, -165, -16, -89, -147, 4, -79, -195, 101, 2, 24, -1, 211, 33, -174, 176, 98, 37, -85, 13, -33, 6, -90, -69, -98, -125, -54, -50, -212, 32, 126, 30, -71, -179, -65, 6, -114, -58, -110, -7, 78, -44, -24, -176, 4, 216, -22, -19, 122, 70, -57, 100, -68, 90, -56, 32, 67, -61, 28, 80, 32, -211, 11, 90, -23, -111, 29, -73, 26, -5, 129, -80, -1, -5, 9, -67]
4266f7lJ74n9m6M8k0O5j60j1K74k48K07j38M4j22OM8R0k34J59KNn4N0R0j03KQ6
4294H5j49J52J6Mpj76j37K45p7j11K98k37n1J78J04j19p8RO0j27J94J05j47p7
4318d3P6j4r1l4Q3J12o3J7j8M7j24L1K12k65J68Mk9J24j49%J3o0j05K75j72J29
4344A24j61%J20j97R1J54k30n3L09j69lm7r6J8K69l0l16J70L3J24j82Q2J52j96
4368c4J28j42J44P1q2j13JL3J58N8k79J24kj58N5J46m6j72J65Qo6N6L5k03J2N6
$$ y = [-67, -70, 104, 45, -1, 47, 27, 92, -68, -79, 195, -53, 154, 16, 60, -62, -56, -8, 82, -152, 7, 9, 14, -40, 10, 100, -3, -1, 85, -64, 88, 104, 108, 101, -75, -212, 33, -44, -155, 143, -94, -145, 33, 137, 18, -60, -51, 9, -118, 76, 181, 34, -43, 33, 19, -72, -106, -23, 89, 26, 43, 25, 72, -52, -21, 191, -74, 94, 98, 69, 193, 44, 44, 57, -3, -108, 167, -5, 124, -37, -37, 83, -114, -23, 131, -99, -152, 157, -12, -15, -62, -158, -140, 129, 99, -217, -47, -14, 110, -72, 10, 162, -34, 94, -48, 96, 167, 85, -28, -27, 6, 164, 222, -57, 67, 65, -93, -38, 108, 62, -110, 55, 63, -3, 53, 88, -115, -103, -47]
$$ [...]
8191A
##END NTUPLES=NMR FID
##END=
