##TITLE=1H_3PEPA0207
 D2O, 8 sc, 
 5.07.2021
##JCAMPDX= 6.0         $$ Bruker NMR JCAMP-DX V2.0
##DATA TYPE= NMR FID
##DATA CLASS= NTUPLES
##ORIGIN= UXNMR, Bruker Analytische Messtechnik GmbH
##OWNER= root
$$ XWIN-NMR		Version 3.5
$$ Mon Jul  5 09:48:32 2021 Russian Standard Time (UT+4h)  she@DPX200
##.OBSERVE FREQUENCY= 200.131506
##.OBSERVE NUCLEUS= ^1H
##.DELAY= (6, 6)
##.ACQUISITION MODE= SIMULTANEOUS
##.ACQUISITION SCHEME= undefined
##.AVERAGES= 8
##.DIGITISER RES= 18
##SPECTROMETER/DATA SYSTEM= spect
##.PULSE SEQUENCE= zg30
##.SOLVENT NAME= CDCl3
##.SHIFT REFERENCE= (INTERNAL, CDCl3, 0, 15.7039)
##AUDIT TRAIL= $$ (NUMBER, WHEN, WHO, WHERE, WHAT)
$$ ##TITLE= Audit trail, XWIN-NMR		Version 3.5
$$ ##JCAMPDX= 5.01
$$ ##ORIGIN= Bruker BioSpin GmbH
$$ ##OWNER= she
$$ F:/spectra/data/she/nmr/H-F/1/audita.txt
$$ ##AUDIT TRAIL=  $$ (NUMBER, WHEN, WHO, WHERE, WHAT)
(   1,<2021-07-05 09:47:04.12 +0400>,<she>,<DPX200>,
      <created by zg, POWCHK disabled, PULCHK disabled
       configuration hash MD5:
       00 E9 B6 7A A2 85 ED C7 34 08 36 98 17 FE 4E 26
       data hash MD5: 16K
       F9 A4 FC BA 7A 5B 4C 66 9F DC 57 AD 5A C2 39 69>)
$$ ##END=
$$ 
$$ hash MD5
$$ 04 B6 2D A6 B4 16 C1 DA EA 63 BE 04 C8 1D 5D 27
##$RELAX= 
##$RELAX= 
##$RELAX= 
##$RELAX= 
##$RELAX= 
##$RELAX= 
$$ Bruker specific parameters
$$ --------------------------
##$DU= <F:/spectra>
##$EXPNO= 1
##$NAME= <H-F>
##$PROCNO= 1
##$TYPE= <nmr>
##$USER= <she>
##$AMP= (0..31)
100 100 100 100 100 100 100 100 100 100 100 100 100 100 100 100 100 100 
100 100 100 100 100 100 100 100 100 100 100 100 100 100 
##$AQSEQ= 0
##$AQ_mod= 1
##$AUNM= <au_zg>
##$AUTOPOS= <>
##$BF1= 200.13
##$BF2= 200.13
##$BF3= 200.13
##$BF4= 200.13
##$BF5= 200.13
##$BF6= 200.13
##$BF7= 200.13
##$BF8= 200.13
##$BYTORDA= 1
##$CFDGTYP= 0
##$CFRGTYP= 5
##$CHEMSTR= <none>
##$CNST= (0..31)
1 1 145 1 1 1 1 1 1 1 1 1 1 1 1 1 1 1 1 1 1 1 1 1 1 1 1 1 1 1 1 1 
##$CPDPRG= <>
##$CPDPRG1= <>
##$CPDPRG2= <>
##$CPDPRG3= <>
##$CPDPRG4= <mlev>
##$CPDPRG5= <mlev>
##$CPDPRG6= <mlev>
##$CPDPRG7= <mlev>
##$CPDPRG8= <mlev>
##$CPDPRGB= <>
##$CPDPRGT= <>
##$D= (0..31)
0 1.2 0 0 0 0 0 0 0 0.06 0 0.03 0 0 0 0 0.0002 0 0 0 0 0 0 0 0 0 0 0 0 
0 0 0 
##$DATE= 1625464023
##$DBL= (0..7)
120 120 120 120 120 120 120 120 
##$DBP= (0..7)
150 150 150 150 150 150 150 150 
##$DBP07= 0
##$DBPNAM0= <>
##$DBPNAM1= <>
##$DBPNAM2= <>
##$DBPNAM3= <>
##$DBPNAM4= <>
##$DBPNAM5= <>
##$DBPNAM6= <>
##$DBPNAM7= <>
##$DBPOAL= (0..7)
0.5 0.5 0.5 0.5 0.5 0.5 0.5 0.5 
##$DBPOFFS= (0..7)
0 0 0 0 0 0 0 0 
##$DE= 6
##$DECBNUC= <off>
##$DECIM= 32
##$DECNUC= <off>
##$DECSTAT= 4
##$DIGMOD= 1
##$DIGTYP= 9
##$DL= (0..7)
0 120 120 120 120 120 120 120 
##$DP= (0..7)
150 150 150 150 150 150 150 150 
##$DP07= 0
##$DPNAME0= <>
##$DPNAME1= <>
##$DPNAME2= <>
##$DPNAME3= <>
##$DPNAME4= <>
##$DPNAME5= <>
##$DPNAME6= <>
##$DPNAME7= <>
##$DPOAL= (0..7)
0.5 0.5 0.5 0.5 0.5 0.5 0.5 0.5 
##$DPOFFS= (0..7)
0 0 0 0 0 0 0 0 
##$DQDMODE= 0
##$DR= 18
##$DS= 0
##$DSLIST= <SSSSSSSSSSSSSSS>
$$ [...]
##$SUBNAM2= <"">
##$SUBNAM3= <"">
##$SUBNAM4= <"">
##$SUBNAM5= <"">
##$SUBNAM6= <"">
##$SUBNAM7= <"">
##$SUBNAM8= <"">
##$SUBNAM9= <"">
##$SW= 20.0188882624521
##$SWIBOX= (0..15)
0 0 2 0 0 0 0 0 0 0 0 0 0 0 0 0 
##$SW_h= 4006.41025641026
##$TD= 16384
##$TD0= 1
##$TE= 0
##$TE2= 300
##$TE3= 300
##$TEG= 300
##$TL= (0..7)
0 120 120 120 120 120 120 120 
##$TP= (0..7)
150 150 150 150 150 150 150 150 
##$TP07= 0
##$TPNAME0= <>
##$TPNAME1= <>
##$TPNAME2= <>
##$TPNAME3= <>
##$TPNAME4= <>
##$TPNAME5= <>
##$TPNAME6= <>
##$TPNAME7= <>
##$TPOAL= (0..7)
0.5 0.5 0.5 0.5 0.5 0.5 0.5 0.5 
##$TPOFFS= (0..7)
0 0 0 0 0 0 0 0 
##$TUNHIN= 0
##$TUNHOUT= 0
##$TUNXOUT= 0
##$USERA1= <user>
##$USERA2= <user>
##$USERA3= <user>
##$USERA4= <user>
##$USERA5= <user>
##$V9= 5
##$VALIST= <valist>
##$VCLIST= <CCCCCCCCCCCCCCC>
##$VD= 0
##$VDLIST= <DDDDDDDDDDDDDDD>
##$VPLIST= <PPPPPPPPPPPPPPP>
##$VTLIST= <TTTTTTTTTTTTTTT>
##$WBST= 1024
##$WBSW= 4
##$XGAIN= (0..3)
0 0 0 0 
##$XL= 0
##$YL= 0
##$YMAX_a= 389876
##$YMIN_a= -389757
##$ZGOPTNS= <>
##$ZL1= 120
##$ZL2= 120
##$ZL3= 120
##$ZL4= 120
##$ABSF1= 10
##$ABSF2= 0
##$ABSG= 5
##$ABSL= 3
##$ALPHA= 0
##$AQORDER= 0
##$ASSFAC= 0
##$ASSFACI= 0
##$ASSFACX= 0
##$ASSWID= 0
##$AUNMP= <proc_1d>
##$AZFE= 0.1
##$AZFW= 0.1
##$BCFW= 1
##$BC_mod= 2
##$BYTORDP= 1
##$COROFFS= 0
##$CY= 11.3945322036743
##$DATMOD= 1
##$DC= 2
##$DFILT= <>
##$DTYPP= 0
##$F1P= 15.9154993809931
##$F2P= -4.1035820241983
##$FCOR= 0.5
##$FTSIZE= 0
##$FT_mod= 4
##$GAMMA= 1
##$GB= 0.15
##$INTBC= 1
##$INTSCL= 1
##$ISEN= 128
##$LB= 0.24
##$LEV0= 0
##$LPBIN= 0
##$MAXI= 10000
##$MC2= 0
##$MEAN= 0
##$ME_mod= 0
##$MI= 1.114404
##$NCOEF= 0
##$NC_proc= 0
##$NLEV= 6
##$NOISF1= 3.799351
##$NOISF2= 2.8
##$NSP= 1
##$NTH_PI= 0
##$NZP= 0
##$OFFSET= 15.70392
##$PC= 1
##$PHC0= -12070.75
##$PHC1= 6.000991
##$PH_mod= 1
##$PKNL= yes
##$PPARMOD= 0
##$PSCAL= 0
##$PSIGN= 0
##$REVERSE= no
##$SF= 200.130013532006
##$SI= 16384
##$SIGF1= 3
##$SIGF2= 2
##$SINO= 400
##$SIOLD= 16384
##$SREGLST= <1H.CDCl3>
##$SSB= 0
##$STSI= 0
##$STSR= 0
##$SW_p= 3612.71676300578
##$SYMM= 0
##$S_DEV= 0
##$TDeff= 0
##$TDoff= 0
##$TI= <>
##$TILT= no
##$TM1= 0
##$TM2= 0
##$TOPLEV= 0
##$USERP1= <user>
##$USERP2= <user>
##$USERP3= <user>
##$USERP4= <user>
##$USERP5= <user>
##$WDW= 1
##$XDIM= 8192
##$YMAX_p= 0
##$YMIN_p= 0
$$ End of Bruker specific parameters
$$ ---------------------------------
##NTUPLES= NMR FID
##VAR_NAME=  TIME,          FID/REAL,        FID/IMAG
##SYMBOL=    X,             R,               I
##VAR_TYPE=  INDEPENDENT,   DEPENDENT,       DEPENDENT
##VAR_FORM=  AFFN,          ASDF,            ASDF
##VAR_DIM=   8192,          8192,            8192
##UNITS=     SECONDS,       ARBITRARY UNITS, ARBITRARY UNITS
##FACTOR=    0.0002496,     1,               1
##FIRST=     0,             0,               0
##LAST=      2.0444736,     0,               0
##MIN=       0,             -389757,         0
##MAX=       2.0444736,     389876,          0
$$ Real data points
##PAGE= N=1
##DATA TABLE= (X++(R..R)), XYDATA
$$ [...]
2495a782K906J769j65j869k825j482J340K913J961M3j701k660j728Q68K875K160
2511B623J50j395k603j917N31K703K272M85j289k384k069Q2K419K618O67j186
2527A707k169k191k85K231K616R23q70k138k216o01J866K679J291p23j996k261
2543b137q77J500K789J499n42j768k245j258J304K698J729k36j777k244j291Q34
2559b022K535K040p0j565k147j565N52K418K205K30j419k129j655J86K156K426
2575B176N11j306k036j768k10K108K447O95j066j946j876l42J724K448J126r02
2591A783j922j890o30J383K612J327o89j842j826r53J118K462J528l70j683k021
2607a613j009R15K314J764j09j675j888j181N27K272J925Q2j410j929j414K66
$$ y = [-1782, 1124, 2893, 2728, 859, -1966, -3448, -2108, 805, 2766, 2809, 1108, -1552, -3280, -2412, 463, 2623, 2773, 1378, -1225, -3142, -2611, 92, 2364, 2849, 1560, -824, -2893, -2811, -392, 2226, 2893, 1707, -462, -2653, -2938, -707, 1909, 2832, 1962, -176, -2392, -2993, -1127, 1552, 2843, 2120, 124, -2137, -3014, -1514, 1275, 2774, 2232, 464, -1781, -3039, -1735, 963, 2692, 2456, 679, -1565, -2856, -2022, 513, 2553, 2483, 918, -1229, -2794, -2242, 176, 2381, 2611, 1192, -937, -2592, -2406, -250, 2176, 2687, 1381, -655, -2423, -2633, -525, 1922, 2617, 1551, -395, -2271, -2613, -889, 1559, 2685, 1783, -139, -2029, -2659, -1276, 1336, 2663, 1974, 132, -1694, -2647, -1529, 933, 2461, 2091, 408, -1613, -2622, -1707, 607, 2371, 2262, 587, -1301, -2482, -1955, 317, 2242, 2324, 914, -1015, -2429, -2163]
2623b163K078K121M46j309j978j442j1J846K247N38j035j885j535k57J647K193
2639A501R73q54j945j555m55J342K252J200p68j711j649p81J201K252J335m26
2655A912j624j805q06Q80K083J670k34j646j710r29M52K078J844l8j472j747j144
2672b236L80J912J846L14j275j799j211J62J617K017N39j220j692j244j37J442
2688e85K067P74r25j753j340k42J118K095J049p73j669j433m60R67K075J279n40
2705A704j655j491n95P83J898J505k97j657j429o82L87J844J752j58j487j452
2721a030r33L74J645J703K62j274j682r20K37J414J735N89j246j654q83r0J228
2738e25J943P33j069j609j076j45R65J919R44p94j602j239k38Q62J812J182n45
$$ y = [-2163, -85, 2036, 2482, 1173, -805, -2247, -2258, -412, 1835, 2373, 1338, -547, -2082, -2339, -692, 1501, 2474, 1620, -325, -1880, -2335, -993, 1259, 2459, 1691, -20, -1669, -2450, -1249, 1003, 2338, 1912, 288, -1517, -2323, -1443, 640, 2310, 2076, 430, -1280, -2209, -1757, 321, 2165, 2127, 655, -1092, -2236, -1856, 56, 1902, 2216, 941, -858, -2069, -1907, -290, 1727, 2266, 1046, -646, -1890, -2027, -585, 1482, 2256, 1331, -422, -1762, -2004, -886, 1209, 2258, 1485, -184, -1617, -2077, -1110, 965, 2244, 1704, 49, -1442, -2037, -1254, 644, 2149, 1852, 195, -1234, -1916, -1529, 315, 2067, 1909, 422, -1030, -1963, -1589, 56, 1759, 2021, 747, -935, -1855, -1618, -204, 1531, 2120, 874, -780, -1663, -1753, -525, 1418, 2151, 1082, -527, -1603, -1748, -783, 1136, 2080, 1286, -316, -1555, -1793, -931, 881, 2063, 1518]
2755A518j643j342l06P74J557J438k75j676j325m29M59J606J486q2j473j382o50
2772a745M38J419J473L43j288j605p09K94J218J581N96j211j638p93J21J059J699
2789A252O93j004j588r33N9R90J549Q81o65j611j133p5R46J393J067l82j606j170
2807a337j40N92J365J299k44j489j328l51N67J404J379q2j282j432n41N52J217
2824A49J257L29j192j554n68M34J078J314N70j156j489p21J80J099J476O24q67
2841I63j556r66J83J019J283Q04o26j562j011Q0Q27J320R33m19j448j153j06P09
2859g26J265J096j96j404j281j80N58J256J107Oj250j372l97O23J092J063L03
2876A563j103j343o00M40J034J174M48r33j480p28L73R74J238N42p60j410q69
$$ y = [1518, -125, -1467, -1773, -999, 558, 1996, 1721, 45, -1280, -1709, -1250, 356, 1842, 1760, 287, -1095, -1745, -1307, 112, 1585, 1928, 640, -965, -1674, -1380, -162, 1419, 2015, 804, -834, -1627, -1506, -447, 1252, 1945, 941, -647, -1580, -1521, -531, 1018, 1899, 1234, -377, -1510, -1585, -639, 754, 1821, 1439, -167, -1337, -1477, -885, 480, 1779, 1535, 46, -1282, -1633, -1066, 338, 1717, 1635, 353, -1079, -1620, -1068, 149, 1406, 1735, 543, -1011, -1579, -1145, -67, 1247, 1817, 661, -828, -1549, -1369, -270, 1206, 1830, 963, -593, -1559, -1376, -357, 926, 1730, 1104, -458, -1469, -1389, -562, 758, 1691, 1272, -176, -1329, -1435, -726, 539, 1635, 1439, 35, -1246, -1426, -868, 388, 1495, 1501, 251, -1121, -1518, -895, 197, 1260, 1563, 460, -883, -1483, -1043, -9, 1165, 1613, 680, -800, -1528, -1155, -181, 1057, 1599, 839, -571, -1440]
2893a440K23R34J191O06n76j360r38J12P85J116P77k76j290j104r6P23J121R78
2911A486j78j312j184j70O42J058J009N6j199j327j63N39Q94J013K02r86j283
2928i03l90M42Q50R83L83p67j327o37M28Q63R56N42n56j495o97K50Q71J022N85
2947A403m86j358p65J51P45R49O25k23j224r57J4O41R28P95r8j062j161j76P02
2966e57Q48Q62J60j016j356j92O43Q55Q43J70q91j216m79N64Q62Q09L13o03j260
2985f41o63M52Q38P77M71m03j370p37L12Q28Q20N39l36j130r42J57P50Q77N16
3004A115j53j063r98n7Q13P83O28N4r67j143j75O02R12O10J31q07j171l47O06
3023f27Q88O59K26p88j072m98M12Q94P40K23m09j128p64M25Q14O42M89l07j238
$$ y = [-1440, -1217, -283, 908, 1514, 938, -422, -1360, -1248, -463, 653, 1430, 1154, -136, -1240, -1336, -613, 508, 1486, 1308, -4, -1188, -1358, -716, 342, 1351, 1407, 208, -1119, -1282, -743, 151, 1164, 1366, 380, -903, -1293, -851, -1, 982, 1365, 598, -729, -1366, -938, -75, 881, 1423, 867, -628, -1325, -1075, -204, 818, 1403, 917, -441, -1206, -1055, -310, 639, 1264, 1041, -183, -1140, -1126, -485, 443, 1238, 1140, 78, -1083, -1259, -557, 291, 1153, 1313, 297, -1059, -1251, -608, 247, 1090, 1260, 369, -847, -1326, -762, 100, 909, 1222, 619, -641, -1304, -852, -14, 763, 1234, 831, -539, -1276, -964, -136, 684, 1223, 887, -243, -1185, -1028, -278, 599, 1115, 962, -101, -1099, -1156, -343, 440, 1068, 1122, 155, -988, -1163, -561, 351, 961, 1092, 285, -886, -1233, -627, 261, 920, 1146, 358, -714, -1212, -800, 94, 834, 1057, 648, -480, -1244, -819, -5, 637, 1126, 819, -419]
3042d19p98K96P98P56M77k38j113q27M3Q59P97L76j38r16j013l1P55Q39M49Lq13
3063A42j069k33P24Q04N78%o72j025m35N59R23O02L5n36j082m60L84R23O33J58
3083I53m16j005p33L96Q76O31K40k84j009p76K44Q15P36L31l09q69q03NP42Q57
3103F22L37j73q28q78j24P15Q31M20p5o94j016k17N84R31M50P6o62r71m40N41
3123e71Q86N46P6m95j024n76M17R67N35J32l35r96o74L30Q69O51J67k65q91p68
3143a019J70P70P54K35j70q44p93j29Q22Q01L22j91p15q62j79O77Q34L34k0o59
3163A38r16l06O26Q37M52n8m83r17m90N49R07M54N9l80r70n67L59Q86N83Q3l51
3184D95q55o66K41Q55O03J93k57q51o92J6Q18P64J91k57o52p92q3Q09P39J76q1
$$ y = [-419, -1217, -921, -123, 633, 1110, 872, -241, -1068, -1025, -166, 631, 1007, 869, -47, -1060, -1091, -336, 503, 952, 955, 142, -927, -1160, -436, 368, 946, 946, 274, -751, -1186, -627, 296, 898, 933, 397, -685, -1145, -761, 162, 795, 953, 537, -468, -1201, -805, 71, 702, 942, 658, -351, -1127, -883, -68, 668, 999, 690, -179, -982, -977, -235, 622, 959, 786, -42, -920, -1044, -329, 502, 922, 847, 153, -863, -1080, -496, 435, 885, 961, 299, -672, -1112, -571, 315, 861, 937, 442, -582, -1158, -741, 226, 761, 893, 558, -438, -1112, -782, 87, 738, 905, 640, -251, -1019, -849, -79, 675, 910, 740, -104, -897, -1026, -204, 597, 919, 728, 13, -849, -1028, -351, 483, 817, 797, 138, -778, -1084, -458, 379, 831, 773, 290, -627, -1117, -568, 339, 793, 852, 472, -498, -1065, -706, 180, 763, 846, 495, -360, -1026, -785, 70, 673, 866, 609, -242, -934, -918, -100, 664, 855, 598, -54, -846, -929, -120, 619, 795, 714]
3205G14o24q67j92O74Q07K77p9n05r34k96O07Q23M19j76m34p53n17M72R03N00
3225H19n5l99p59o21L51Q83N36J4l61o96o51J51Q90O34L9l01o40o81n1Q16Q01
3246G19J48m23n44o81j40O99Q81J67k13n29p97k83O51Q40L08j77n47o09m00M52
3266d78Q90M47k59m29o43m79L21R24M79j15l70o15n68K44Q37N90k8m36o06n96
3286h90Q4Q48P23Pl43o10o12qP32P26J60l75n28o43j01N88P64K81k93n52n70l37
3308i49O53P79L36k10n87o19k53L54Q62M72k52n15n06m37L27Q03M87j49l86o12
3328d02m01K19O82O05L0n19n37m44P5O93P29j7l98n29m71j09P17P47P2k95o35
3349a88m31j11N34P26K62l81m79n29k52M85Q29L18l06m34n82k83L35Q84L58k07
$$ y = [714, 90, -777, -969, -295, 512, 789, 710, 205, -729, -1025, -418, 405, 824, 648, 214, -539, -1056, -584, 319, 819, 764, 365, -394, -1015, -664, 219, 755, 769, 408, -288, -939, -788, 102, 736, 775, 474, -166, -847, -898, -82, 719, 867, 444, -100, -781, -921, -222, 659, 826, 613, 84, -713, -996, -345, 495, 803, 626, 79, -530, -930, -478, 412, 859, 600, 171, -472, -951, -630, 294, 773, 658, 288, -327, -895, -651, 186, 776, 748, 312, -294, -890, -806, 42, 765, 772, 429, -181, -793, -801, -69, 657, 817, 442, -86, -729, -830, -242, 522, 803, 510, -42, -612, -949, -296, 483, 819, 609, 22, -597, -850, -496, 366, 838, 586, 71, -435, -872, -545, 258, 745, 596, 210, -402, -803, -584, 98, 703, 733, 214, -323, -767, -692, 1, 730, 713, 315, -214, -685, -794, -77, 670, 742, 447, -188, -619, -730, -196, 530, 792, 411, -68, -597, -849, -364, 465, 783, 477, 43, -539, -822, -487, 397, 755, 548]
3369E48m20o26k76J85Q51M97j36m47m84m09J05O80O90r1m54m56m84p0P52P58l7
3390F76l99m59n14p6O45Q09R8m00n32m72j10M64P57L45m11n08m31l09M09Q79L28
3411G89l37m22m65l43L30P88M48k12n32m41l75K34P64N34r7n61m93l06J44N94
3431D1P70j06n65m14l65m0O32P54O4m62n09m37o7N90P56J56l96o06l54j29L51
3452c36Q48L69m87n61l33k66L27Q24M31k63n46n04k75K93Q04M80k05n64m87k13
3472f64J31O66O59q9o57m70k38RP33P46q0n62n08l75O9O12P08Q5m74o07l30R1
3494e45L18Q27K65m46o73k47j68K88Q72L71m10n92l49j98K75Q23M34l43o07m34
3514e39j30K66O51M99q4o60n26j28J61N68P04l0p56l69k67M5O50P32l8n15o00
$$ y = [548, 128, -498, -774, -589, 262, 759, 623, 176, -308, -717, -612, 68, 758, 667, 213, -243, -727, -797, -45, 713, 676, 277, -182, -696, -772, -127, 682, 780, 380, -152, -624, -734, -270, 487, 832, 421, -87, -518, -827, -418, 461, 789, 452, 30, -435, -778, -448, 340, 788, 576, 44, -397, -772, -538, 226, 760, 663, 102, -391, -697, -553, 41, 811, 705, 140, -274, -639, -679, -47, 707, 771, 309, -200, -637, -704, -114, 642, 798, 402, -204, -558, -687, -336, 512, 881, 394, -167, -500, -766, -439, 385, 816, 553, 7, -497, -772, -479, 325, 805, 600, 36, -451, -664, -533, 133, 792, 703, 46, -424, -662, -653, 80, 826, 746, 184, -324, -699, -630, -18, 690, 775, 301, -306, -636, -545, -227, 600, 865, 419, -254, -501, -669, -381, 491, 862, 452, -140, -489, -687, -412, 411, 845, 502, -105, -539, -669, -403, 248, 747, 663, 3, -523, -651, -490, 78, 782, 752, -4, -373, -640, -595, 55, 787, 749, 234, -366]
3535c66l28J35N98N64K08m86p42k30J00L71O58M12n04p46k11j10L27Q23L62l97
3555D38o21m23j10M04O60N06k69o66n45l8L30N41N92j00p16n45jJ20N87O14Lo77
3577H4n35k00J14O09O48K6n07o27l02J53N03O15L18n70o91k98P7M22P08L41n04
3598C84p30l10kM09P11L61l41n98m86q7L89O11N33k05p00n31p0K93N99N79j08
3619G01p42n41o2K37N51N92K8p03o20j12K16N36N94Q9n35o69k53J34N39N62L10
3640H52n10p23l11J58M01O10M21n19p03l35R4L41O88M05m03p18m03K2M14N84N07
3661H72k71p75m75L9L01N50N12m9p32o19K0K21N65N86K3o44o96j65L17M85O05
3682F70J76o87o92k01K84M41N92K28m47p99k77K17L94N77L61m04q20l58K03M07
$$ y = [-366, -694, -559, 39, 603, 811, 325, -417, -647, -547, -176, 482, 894, 390, -356, -567, -677, -350, 473, 835, 438, -183, -606, -716, -312, 348, 854, 585, -81, -626, -664, -334, 207, 799, 699, -17, -562, -563, -443, 144, 758, 761, 84, -451, -651, -537, 72, 720, 746, 239, -388, -690, -537, -34, 581, 899, 329, -362, -660, -583, -161, 547, 888, 384, -346, -656, -658, -249, 462, 823, 482, -116, -602, -689, -300, 311, 844, 639, -61, -592, -662, -369, 230, 809, 701, -41, -582, -644, -407, 144, 736, 764, 61, -559, -671, -455, 81, 675, 764, 229, -440, -693, -559, -20, 542, 852, 342, -381, -692, -534, -133, 477, 898, 379, -324, -659, -565, -224, 464, 869, 466, -252, -655, -633, -219, 365, 872, 601, -174, -649, -610, -309, 241, 753, 704, -28, -647, -627, -406, 159, 745, 768, 124, -572, -737, -420, 65, 670, 846, 159, -533, -734, -450, -9, 583, 811, 364, -435, -712, -495, -101, 476, 837, 433, -387, -745, -542, -135]
3702a35N64M77m01p62m70R1M64N02M80j92p53n88L7L95N26M75J5p55o85L2L77
3723c06M98N28J5o29p41r6L57N27M61J92o28p70k11M36M74N31J70n16q04k61K95
3744d78M92N02K66l42p68m97K71M90N30L49k44q43n08J49N59M84M05k10p39o55
3764g87J41M62M93M46o0o58p55j8M89N51L89L4o49o92j67M51N65M09R9n63p34
3785e54k17L62N93M36J07m49p52k98L22N46N19J41l78p66m64L16N98M52K13k27
3805E00p41n87J77O32M61K75j50p58n92O5O24M76L75j51o52o27m3N03N89L03j7
3826F62n48p86j21M90N80M20K0n05q21k74N21N56M81O8m68p47l58L87O68M25N9
3847G09l23p85m66L12O49M66J71j98q63n18K23O38M94K42j92p71n86J00N67O11
$$ y = [-135, 429, 906, 505, -257, -727, -636, -172, 330, 810, 618, -135, -723, -686, -291, 235, 710, 725, -30, -715, -683, -306, 192, 720, 735, 106, -635, -731, -374, 153, 614, 806, 178, -592, -803, -367, 107, 638, 808, 292, -512, -773, -478, 14, 516, 782, 440, -328, -825, -554, -64, 466, 815, 571, -272, -780, -631, -72, 412, 817, 607, -132, -787, -646, -184, 309, 755, 695, 37, -718, -736, -247, 304, 693, 727, 78, -614, -781, -330, 235, 644, 743, 180, -554, -771, -409, 184, 620, 727, 278, -474, -772, -450, 96, 615, 756, 378, -388, -852, -536, 62, 514, 727, 500, -241, -828, -651, -19, 442, 717, 567, -191, -783, -718, -94, 382, 757, 606, -46, -673, -716, -213, 376, 679, 662, 114, -672, -793, -303, 277, 697, 717, 212, -609, -883, -362, 194, 675, 743, 275, -472, -830, -443, 225, 650, 709, 386, -399, -865, -553, 96, 562, 733, 535, -328, -846, -623, 15, 509, 751, 559, -212, -798, -698, -131, 480]
3867D80J92j19o07o92k9O35O09K30q8n41p50j54N49O27L67j5n44p91k34M83O86
3888B94L81lm91p60k88L95P30M03L6l70p36m87L41P42M29J23l63p13m98K29O53
3909D7N23J98k99p08n96R7P07O05J26j96o21o96j0P00O80J04l7o64p51n7O42O11
3931D05L65j85n13p40k49N50Q37K68j61l90p14m34N67Q08K69l9m22p00m64M55
3951d87P25M39Q9m02p41n00K16Q05N85Kl85o52n55L4Q95O20L2k75n91o59kP93
3973a4N56J82k17o26o19j06O50P44K35k78n46n94l09O16Q59K79k30n17o44l74
3993i53M88R71K98j97m46o86l34L25P77N64n8n82n87m04J67Q35O50j52m45m97
4013b66n81R1Q63O47n1k88o67n94P4P98O22J90m15o59m84j9N39P79K05l62n08
$$ y = [480, 672, 553, -54, -746, -775, -140, 469, 699, 611, 70, -680, -834, -285, 342, 709, 694, 150, -641, -875, -392, 294, 675, 672, 181, -579, -867, -472, 258, 661, 697, 327, -409, -896, -555, 187, 616, 739, 376, -337, -835, -606, 47, 570, 768, 469, -239, -835, -738, -31, 574, 700, 504, -117, -813, -823, -123, 557, 661, 624, -40, -791, -848, -206, 405, 770, 585, 72, -668, -917, -367, 470, 738, 577, 187, -527, -961, -394, 414, 683, 644, 222, -478, -942, -487, 238, 677, 766, 364, -377, -877, -661, 144, 729, 731, 346, -306, -861, -827, 68, 688, 720, 445, -146, -805, -807, -14, 542, 724, 507, -119, -738, -844, -194, 550, 785, 507, -39, -633, -942, -326, 533, 812, 582, 65, -579, -953, -465, 506, 804, 607, 161, -525, -859, -534, 243, 807, 749, 167, -420, -824, -657, 178, 828, 676, 231, -266, -847, -756, 107, 754, 703, 415, -252, -846, -772, 26, 648, 838, 423, -236, -720, -739, -200, 579, 784, 422, -86]
4034h6n34j69M36Q92K96l70m59n88l13M98Q86L33k02n39p60k03L61Q38N48k11
4054F54o50m78l06J04R15O26k05n48m93m74J23Q68O35q4m04n81n32J20P54O57
4074G01J53n00p04l42q4N98Q61K45n60n85m99q9N31R16J72m15m96n76j72M97Q37
4095D89M16l60o34n44k14M32P80N43k42p01n30k24K20R08N30j83o32n41l88K69
4115f06Q30N86p3n60n89l79J57P14O97P5n55o99l77P6O43Q84P4n38p07l57r6O57
4137a43Q65K39n28o09n26j46O45P95K52l37o82m86j34M00Q58M24l01p25m60j73
4157g72L31P84N94k76o86n76k16K89P87N98j16p23n61k78K13P28P49k1p18o02
4177d72l31J30O06Q16J25o35o65l44M6O15Q04K12n46o89l81lN17P83L77m87p21
$$ y = [-86, -620, -789, -353, 539, 835, 465, 6, -582, -895, -397, 489, 822, 620, 81, -679, -882, -521, 317, 865, 654, 4, -474, -780, -676, 239, 865, 660, 112, -381, -855, -732, 136, 771, 687, 283, -298, -830, -710, 44, 701, 854, 354, -350, -692, -776, -178, 683, 928, 368, -217, -716, -805, -274, 642, 814, 399, -97, -673, -845, -348, 489, 905, 545, -89, -633, -847, -415, 365, 908, 666, -35, -565, -789, -569, 339, 869, 686, 54, -487, -875, -606, 224, 810, 737, 177, -412, -791, -634, 80, 777, 852, 297, -402, -779, -703, -60, 824, 898, 360, -347, -704, -800, -143, 722, 961, 433, -176, -702, -848, -203, 592, 844, 507, -175, -661, -795, -395, 463, 887, 586, -139, -599, -772, -441, 343, 937, 661, -25, -601, -817, -528, 259, 857, 741, 18, -543, -821, -608, 120, 869, 848, 130, -472, -803, -673, -67, 749, 874, 239, -426, -770, -724, -109, 695, 907, 361, -328, -709, -712, -195, 588, 965, 478, -243]
4198b43m81m7M56P90M99l45q17n07n2L08Q21N77k71p74n81p8K65P08O96j90p13
4219B1o71r0K96N62O74R1p65o87j58J89O11P13R3o74o73l14K27M75P83K32n81
4240C54p90l58J79M89P39L51m76r03l76J27M19P56M17l74q04n05L4M31O77N45
4260I32k97q82n10M8L10O82N93j82p62o67n7L83N94O32J1p42p27j66L03O26O74
4281G96R1p26p35k25K39O05O95J03n39q13l00J96N44O89L15m99q92l95K33N33
4301h5O94L05l76q41n52K38M41O19M56k48q69n60K7N48O03M81j51q67o53qM80
4322c18O28N64j05p29q01o9L90O82M86Q0o85p79j77L92O13N31J74n97q89k36K91
4343e54O15O26J98n36p96m05K81O04N22L48m04q56m96J77N90O41L52k85q72o36
$$ y = [-243, -724, -771, -315, 475, 974, 629, -188, -695, -747, -439, 382, 959, 688, -86, -667, -745, -480, 228, 924, 734, 21, -650, -740, -444, 118, 792, 883, 118, -569, -727, -538, 73, 786, 879, 205, -468, -782, -555, -80, 703, 935, 354, -436, -794, -615, -126, 613, 964, 488, -415, -791, -664, -245, 511, 928, 554, -250, -755, -721, -290, 387, 932, 635, -247, -757, -709, -399, 283, 876, 694, -68, -735, -792, -409, 185, 817, 828, 86, -641, -807, -504, 122, 796, 887, 161, -574, -799, -560, 45, 740, 843, 304, -509, -809, -613, -69, 620, 935, 436, -456, -851, -618, -85, 609, 914, 538, -303, -855, -617, -176, 443, 899, 651, -218, -778, -751, -203, 400, 881, 730, -137, -790, -798, -318, 310, 874, 769, 40, -761, -830, -440, 242, 728, 808, 123, -656, -833, -441, 172, 703, 877, 280, -609, -845, -554, 61, 687, 885, 349, -447, -852, -571, 33, 555, 903, 499, -357, -853, -676, -86, 555, 907, 622, -250, -886]
4363h86J61N21O56L83k06q80m97m8O09N80M54j77p34p14m7N50N68M62J4o80p81
4384f92j65M92N88N61O7o07r09k46M18O56N08J19m37q97l57L86N64N61K21l60
4404D71r09n27L75O50M52L11k70r41m83K45N62N02M07k94p46o13qO67N55M01j89
4425F18o81p71PO14O14L23J0o60q69r8N93N87M64K8o67p65k73N79O10N10K2n75
4447B20p70l97M20P87L57J73l68q99m80L88P06M77J67l49q57m99K37P86N08K21
4467H28l49o92o03O4P20O25J58j90o53p32l7P51O94J49p4n99q98p3O92O60K70
4488G11l6o42p43k24N01Q34L86j47n41p04l04M59P89L23Nl20q39m73M25P82M35
4509F77M9l54q12m71L09O84O66R5m88o73n11J01P54O06O4k16o13o94p3Q47O34
$$ y = [-886, -725, -204, 452, 835, 629, -251, -748, -796, -187, 393, 847, 670, -64, -778, -825, -275, 293, 755, 769, 89, -692, -857, -365, 223, 784, 851, 244, -665, -911, -493, 163, 671, 790, 353, -544, -901, -515, 49, 610, 831, 471, -438, -965, -590, 60, 512, 823, 553, -388, -871, -626, -64, 438, 845, 551, -195, -808, -816, -149, 406, 807, 618, -63, -834, -827, -213, 401, 724, 734, 74, -795, -893, -300, 287, 751, 779, 112, -653, -926, -347, 263, 773, 795, 220, -550, -947, -527, 260, 617, 790, 422, -477, -957, -569, 137, 614, 781, 432, -425, -924, -687, 99, 607, 828, 479, -213, -816, -752, -32, 593, 751, 561, -92, -824, -861, -110, 584, 733, 659, 60, -838, -911, -219, 441, 711, 675, 33, -710, -934, -433, 401, 787, 640, 99, -605, -909, -450, 339, 662, 667, 347, -492, -965, -540, 242, 677, 726, 372, -440, -911, -602, 82, 748, 843, 355, -318, -829, -728, 26, 632, 696, 480, -133, -827, -900, -53, 581]
4530E81J64j86o04p27j04P32O48K38j69o24o63j39N31Q13L69l19m27o47m00N93
4550c40P42L60j47m06p21m32M94P79L86N3n66o48m32K46P98O64m8n26n81n22J29
4571g18Q79O18j45k30n81o43P3P94N75J56k76p07o23PO53P35K32l15o13n81p8
4592g88N65P75K44l27n11n40k84M96Q19L44k47m35o61l55M38Q06M24j18m27o90
4612d72m14L41P56O03j36m82n57m91K04Q66N61n6m75n44n60J50P65N68J99m79
4632C47n97n61O6O24P62J85m45n76m87j43N85Q52K05l85m76n91k20O07P77K96
4652H25l51m96n95k34M76P24M48k16n98m59l15K13Q23O33k43n83n01l80K26Q08
4672B05O33j27n13n59m21J57O82P25mm82o22m00J7O28Q20O6n00o00l62j10N96
$$ y = [581, 745, 559, -45, -772, -876, -144, 504, 742, 573, -51, -714, -853, -322, 491, 860, 541, 114, -533, -933, -340, 402, 762, 615, 209, -512, -944, -450, 329, 715, 768, 202, -446, -878, -632, 166, 830, 782, 256, -325, -847, -718, 161, 779, 634, 404, -177, -820, -747, 47, 622, 778, 502, -205, -828, -821, -168, 567, 799, 484, -129, -710, -788, -223, 552, 796, 469, -42, -582, -866, -370, 449, 793, 546, 111, -550, -905, -467, 339, 763, 645, 218, -472, -886, -545, 211, 814, 678, 196, -361, -852, -648, 218, 779, 723, 248, -296, -856, -706, 59, 627, 826, 347, -250, -811, -745, -121, 641, 826, 381, -195, -682, -825, -240, 612, 817, 432, -44, -635, -855, -248, 529, 825, 474, -22, -617, -851, -375, 349, 797, 581, -17, -476, -791, -578, 245, 878, 635, 52, -449, -829, -603, 205, 838, 711, 198, -361, -782, -625, 57, 782, 778, 296, -326, -726, -709, -81, 739, 805, 305, -295, -657, -767, -171]
4693a71Q15J66m69n09m28j67N02Q40K94l49o34n36j66L98Q45M21k47o75n37j93
4713h00L42P97N07j67p16m17k53J60P71O16j29o00n37l01J92O93O50p8n46n93
4733d09l36J33N93P94N0o06o05k74JN41P80J91n04o38l13m7M76P59K76m64o36
4754b38l89j00M68P38L85l63o66l65j57L17P61N12l28o12n36r3K18P05O12k02
4774F67o63n61j79K83N90O85o7p04n51k04J77N95P26n3n55o18k26R1O07O22J73
4795H35n48o09l11L1N18O89L01n99o25l47L3M62N89L99l15p34m38rM58O11M48
4816H39l45o95m50k7L30O48M97j92o73n19k8K77N63N48m9p65n25j60L05N54N71
4837G04nn99o09j95K52M60O07J97n60p35k01J90M38O29J97m67p21k38J51L13P66
$$ y = [-171, 644, 810, 341, -168, -596, -763, -261, 579, 873, 524, -110, -646, -812, -414, 431, 852, 605, -70, -607, -800, -458, 339, 846, 679, -37, -454, -707, -547, 224, 840, 711, 111, -426, -727, -535, 158, 808, 730, 184, -409, -745, -612, -19, 775, 825, 219, -386, -660, -659, -118, 662, 853, 349, -289, -602, -649, -173, 586, 862, 398, -238, -627, -727, -259, 479, 864, 501, -165, -530, -687, -370, 391, 903, 575, -37, -573, -666, -448, 257, 869, 667, 4, -557, -736, -453, 137, 822, 755, 51, -500, -704, -527, 68, 794, 741, 186, -432, -658, -567, 40, 662, 835, 287, -322, -633, -602, -84, 605, 906, 307, -318, -665, -632, -170, 419, 818, 503, -231, -669, -678, -220, 391, 839, 494, -201, -651, -678, -348, 300, 797, 605, -68, -587, -615, -338, 225, 773, 724, -41, -566, -726, -421, 133, 704, 699, 100, -509, -704, -452, 8, 615, 812, 252, -483, -684, -494, -56, 573, 770, 303, -418, -656, -505, -192, 574]
4858E74K72l90p70m30J65L95O12L73k92p74l94N2L69O31M07j82p28n80P7K99O11
4879B97M80j61o72n76j1K65N60N93k7o65o68j21K81N53N45K4n34p15j55L26M25
4900D4N96J48n21o85k81K09M82N43K85l75q39l24J71N10M98L37l76p49m44K67
4920e04L70N04L48j76p74m52Q9L94M53M58j04o96o70P5M62M87N23p7n90p79o1
4941g20M48N12L88O7n41p60j41M26M68M55J43n14p67k21L24N16M76J76m23o86
4961c74l49K48N10L49K83l15o85m97L05N20L99L65k66p49m76J70M89M97K53j99
4981D78o91n70J00N40N79K13p2o34o03n7N38M90K98Mn49o62r1M60M63L94M9n62
5003A15o09k28L47N30M67Km15p06l30M39N61L32J68l72p59k86K48N72M18J68l00
$$ y = [574, 846, 456, -314, -744, -579, -184, 428, 801, 509, -265, -659, -607, -238, 393, 800, 618, -110, -690, -613, -314, 297, 777, 616, -56, -632, -643, -378, 182, 775, 748, 83, -585, -706, -425, 128, 673, 697, 163, -552, -707, -381, 44, 640, 788, 267, -418, -699, -490, -8, 535, 820, 445, -394, -718, -547, -37, 461, 798, 422, -327, -771, -504, -134, 370, 718, 542, -232, -684, -595, -201, 252, 710, 606, -90, -760, -685, -223, 264, 787, 710, 120, -659, -720, -272, 240, 628, 695, 154, -606, -747, -321, 147, 602, 745, 231, -536, -757, -433, 83, 559, 735, 312, -374, -723, -475, 35, 384, 667, 352, -333, -830, -525, -5, 394, 759, 493, -256, -732, -562, -73, 424, 677, 478, -213, -783, -683, -143, 436, 649, 577, -57, -660, -717, -179, 311, 609, 613, 64, -598, -689, -229, 234, 628, 677, 115, -494, -722, -375, 155, 622, 624, 209, -497, -827, -388, 173, 505, 673, 301, -458, -744, -496, 76, 494, 662, 362]
5024C62o45m46J54O27M00J99k22n63n56J3O08N48J46j27n98n48o0N71N16J97l5
5045E41n73n80NL64N64K48k0m79n75k00M27O01K75p9l49p06k18M18N78K99K8l33
5067B36o79l29L94N17L98M2k80n91m15K71M95M91O3l18n42m23P5O17M45J71k12
5088D26n83n50J28N61M71Q6j16n09n38n9N31N56K20j93m76m73j92M78N92L11j97
5109D74l57o60k32M69O38K76o2l83n87k79L28O39K83Pm35m75l38K15O91M09j43
5130D78j96n60m70J98O31M37N8l05m47n69J88N74M08K14k89m19m99r4N60O03J59
5151F60l19l93m64j85N08O58J08k10l75n02j97M42O26K45j63l64n53k10L47O28
5171B87L63j93l91m19k56J16O80M54j44l03n04l49J37O84M57n6l90m67l37N3O55
$$ y = [362, -283, -729, -575, 52, 452, 651, 429, -134, -690, -677, -69, 479, 625, 498, -100, -648, -708, -137, 379, 576, 541, -32, -612, -607, -243, 321, 569, 549, 70, -505, -705, -278, 323, 598, 519, 170, -536, -754, -336, 242, 541, 569, 236, -443, -772, -378, 139, 537, 579, 299, -292, -707, -436, 59, 550, 613, 295, -247, -670, -595, 22, 467, 638, 426, -157, -707, -579, -18, 453, 539, 423, -86, -624, -683, -152, 404, 624, 431, -45, -518, -710, -232, 360, 671, 474, 117, -543, -775, -306, 332, 608, 546, 163, -424, -703, -375, 264, 547, 554, 119, -356, -694, -479, 212, 621, 478, 282, -278, -748, -550, 81, 518, 576, 271, -176, -745, -557, 17, 425, 639, 350, -69, -568, -662, -102, 501, 660, 341, -52, -516, -701, -193, 465, 573, 363, -12, -514, -711, -269, 357, 602, 439, 75, -478, -688, -341, 287, 650, 457, 66, -353, -609, -493, 187, 641, 497, 194, -310, -659, -522, 162, 619, 563, 173, -294, -631, -578, 77]
5192G7M77Ll22m29l91j2N78N89O7l88l94m30m3M87N85J37k65m05m67j35L94P33
5214D46K34k81m92m01j83M02O57K21j41m51l79k37K48O80L65k74l61m50j69J37
5234d29O07M12o4m10m74j94M6N95N34j09l44m30l38O8N57N30N2m22m73k91J3N10
5256e4N36J91m25m15l12j01L98O45K35l83n30k79j34L61O69K22k55m74l31j16
5276e52K97N46M01k32m75l63k00K19N60M06q0n01m56j39J47N69M73q2n41l39j79
5297e21P4N27N35k9m84m15k10L5M53N85O8m24m61k51J5M19N36K07l69m98l35N6
5319d87L46N31K83l45n22l01n3L20N63L19k72n21l55o1L17N54L57k07n01l81r5
5340e11J76N68M17j06n39m00j19J74M63M58j2m85m56j36J17M16N24Rl84n05j19
$$ y = [77, 554, 557, 235, -194, -585, -597, -19, 570, 637, 249, -145, -575, -618, -131, 454, 591, 326, -79, -546, -681, -287, 446, 680, 399, -93, -494, -677, -275, 382, 603, 462, 11, -368, -605, -357, 323, 688, 414, 53, -397, -566, -429, 178, 590, 526, 116, -358, -552, -506, 89, 623, 514, 170, -260, -598, -530, 27, 557, 609, 187, -286, -577, -564, -54, 482, 673, 248, -167, -479, -580, -182, 463, 698, 315, -215, -494, -628, -267, 402, 624, 369, -105, -436, -552, -255, 291, 692, 460, -15, -378, -578, -359, 201, 607, 527, 26, -430, -569, -422, 147, 620, 538, -3, -342, -521, -447, 80, 615, 586, 102, -313, -523, -488, -35, 550, 618, 194, -267, -518, -503, -84, 452, 659, 290, -208, -543, -487, -141, 390, 673, 328, -194, -495, -548, -228, 335, 654, 382, -139, -494, -555, -238, 316, 673, 466, -35, -416, -511, -335, 233, 650, 544, 5, -395, -514, -340, 123, 581, 569, 84, -372, -508, -391, 25, 549, 558, 174, -331, -450]
5361d50P4L27N53J58m58n45j86R0L58M85L31m73n01l03O9L03N50K82l39n38l24
5382e37J16K08N35L23k16n33l89j9K19N30L70j64n41l32q3J77N50L92j10n30m53
5403d87pK59L73M43J7n08n29j10J94M38M66J9m04o13m4J07L83M77J65m25n54k14
5425e54J72L48M27K57l50n73k63J12L46M37K33k43o08k47J03K55M50K88j23o23
5445a56l97R5K65M49L01j4n53m42m2K83M00M10n8n11m90j04L24L96L20N7l90n91
5467d48r9K98L76K99J89m65n50j58K68L64L75J08k98n63l11K32L93L41K93l53
5487B91n48l50J50M24M18J83k16n38l79J23K89M51K33p5n60m29O2L24M28J81J5
5508D77m93n35nM10L70L14l2m57n03q9L80L16L40jl50n48k08L74M11L04L7l05
$$ y = [-450, -376, -49, 504, 662, 204, -341, -527, -437, -79, 406, 737, 264, -237, -540, -471, -168, 382, 664, 325, -213, -537, -421, -213, 322, 645, 429, -104, -493, -512, -293, 237, 607, 443, -98, -430, -513, -336, 214, 606, 496, -34, -487, -494, -235, 138, 581, 598, 90, -439, -549, -355, 83, 549, 568, 164, -449, -493, -386, -3, 474, 639, 214, -340, -554, -382, -34, 393, 650, 300, -273, -536, -424, -78, 359, 592, 349, -259, -506, -403, -148, 302, 590, 467, -156, -553, -458, -193, 256, 557, 543, -10, -452, -494, -211, 189, 599, 541, 30, -460, -564, -240, 156, 476, 533, 143, -448, -547, -249, 127, 426, 615, 150, -400, -558, -290, 74, 449, 557, 259, -304, -615, -383, 10, 351, 644, 291, -257, -607, -457, -33, 385, 568, 352, -186, -565, -442, -153, 298, 531, 456, -104, -533, -471, -147, 281, 462, 477, -16, -551, -556, -146, 224, 538, 506, 49, -454, -543, -163, 153, 493, 492, 142, -406, -614, -240, 171, 475, 512, 207]
5530B07n48k83K83M53K36K18k77n58l48J97M64L39J30k64m98l01J51M22L20J52
5550D95j28n45l80R7M29L98J20j25m00n28P3L96L55K99j22l38o10n0L72M71K03
5571D82l3l89n30j27L94M22K25M4l72n10k24L35M77K50L5l54m46l18K61N09L15
5592D46N3l03m32l31J04N66K86J06j67m59m39J19M61L76P1j35m45m03N0M08L97
5613C29K11j43m62m02q2M22M20J97j04l99n02q4M20M37K38q4l46n00j38L13M88
5634B29L25q7m03m30k85L73M53L21m1l19m38k96K31N26L02J8j91m56l92J30M78
5655D8M24j5j81m07m55R8N38L39J63k48l78m33m6N23M23O1j75l81l67j40M89N28
5677D08Q5j59l32l85j73L05N48K25j68l51l76j87K35O34J94j03l19l76k43K12
$$ y = [207, -341, -624, -341, 112, 348, 566, 289, -269, -617, -420, 44, 383, 513, 249, -249, -550, -399, 23, 343, 495, 367, -178, -558, -461, -32, 366, 486, 361, -39, -567, -494, -98, 257, 556, 434, 96, -514, -564, -192, 279, 482, 449, 60, -470, -597, -203, 219, 444, 488, 116, -394, -618, -283, 194, 444, 479, 125, -321, -639, -378, 131, 446, 499, 196, -236, -567, -463, 103, 389, 495, 328, -131, -570, -451, 10, 386, 457, 322, -123, -526, -476, -68, 329, 540, 397, -65, -467, -549, -127, 293, 490, 386, -13, -515, -599, -179, 258, 496, 412, 66, -434, -572, -259, 229, 554, 467, 64, -366, -651, -278, 175, 496, 455, 136, -302, -598, -367, 159, 461, 479, 288, -168, -560, -430, 48, 472, 457, 276, -131, -586, -488, 50, 389, 552, 304, -74, -507, -553, -30, 393, 454, 279, -102, -469, -609, -120, 408, 493, 334, 2, -383, -556, -251, 297, 522, 354, 3, -373, -560, -325, 309, 503, 400, 81, -295, -538, -326]
5697c26M69L92j30k55m58k52J58M57M21m1k93l57k60J5N13M27M0l24l72l20kM80
5719a8M71L2k43l33l64o5M71M73J34k43l87l76qK87N02K11k16l46l48j67K73N67
5741C07K00j85k97m07j53K57N24L10j29l82l73k14J66N46L48l4l33m62k14J14
5761d11N07M52m4l61l61k87Q1M25M68Q7l51m01k85nL76N40J58l70l73k83o1L44
5783a55N71J89l21m15k34j43L43N25K44k65m57k48j68L00M64L69j55m96l14j61
5803e27J90N61L31j37l93l29j83R2M82M46l2m21l92j66M6M51M58L8l84m22k01
5824d92J30L54N24N6l42m27k70L6L40N13J23k89m51k99k2L73N43J79k42m40l40
5845d43l4K32N39L68l03m31l48o8K43M71L53k03m23l31j35J98M81L92q1m55l87
$$ y = [-326, 143, 535, 405, 150, -308, -560, -402, 55, 476, 435, 142, -215, -475, -460, 53, 480, 520, 196, -176, -496, -498, -18, 453, 485, 242, -91, -455, -520, -49, 424, 558, 315, -72, -448, -456, -169, 333, 544, 328, -18, -366, -533, -260, 307, 507, 322, 25, -382, -535, -278, 246, 556, 427, 45, -328, -542, -376, 170, 518, 484, 151, -311, -525, -411, 96, 548, 504, 143, -218, -505, -424, 1, 469, 556, 205, -196, -481, -486, -110, 430, 588, 218, -155, -438, -499, -155, 416, 605, 284, -131, -365, -508, -165, 360, 604, 339, -118, -366, -534, -234, 230, 599, 444, -52, -366, -527, -337, 224, 555, 418, 25, -304, -487, -395, 87, 533, 501, 80, -312, -478, -432, 19, 477, 515, 131, -291, -492, -362, -8, 516, 572, 230, -197, -467, -431, -91, 422, 545, 256, -195, -494, -516, -143, 400, 579, 337, -103, -443, -477, -245, 294, 662, 359, -72, -420, -488, -245, 226, 579, 376, -47, -378, -513, -315, 166, 558, 477, 22, -365]
5866c65j76K43M41L85m5l86m46j61R4M31M79Nl36m89j61N2M08M78J61l38n22k89
5888e37J79L14M47J83l21m48l31P2L47M24K66k17n43l00nK87M09L52j68n08l26
5909d24m3K82M11L44j43m49m81L4J81M55L72m3m83l68j21J45M01M79rm22m69j78
5931e29J92L79M16J78n21m07j90J60K70M66J67l27n95j55J03L06M61K44k86n72
5951b40k85N9L13M23L34k11n53k70J5K63M31K54r9n10m49O6K55M07L35ln36m22
5973d23p4K88L66M00l1m78m85p2K15L96L43J06l87n60j37J62M23L83J12l28m74
5994b55k67J43L36M14K12l22n13k94J54L53L94K08j92n58l60J17M05L43K48j63
6014D03n12l30n3L59M14K55p8n25m22J0K85L62L22km51m79p2L14L59L29R0m84
$$ y = [-365, -541, -298, 143, 528, 483, 97, -349, -510, -416, 15, 494, 499, 163, -326, -487, -435, -27, 451, 612, 274, -248, -537, -358, -44, 403, 586, 265, -183, -514, -442, -95, 329, 595, 378, -165, -465, -470, -183, 226, 578, 410, -98, -424, -467, -185, 226, 570, 427, -22, -503, -469, -288, 167, 539, 496, 13, -355, -476, -331, 70, 549, 540, 118, -351, -529, -337, 42, 458, 636, 115, -292, -482, -322, -52, 414, 581, 254, -341, -496, -393, -87, 374, 618, 332, -240, -525, -466, -153, 270, 604, 393, -160, -430, -415, -152, 279, 533, 434, -76, -525, -459, -204, 203, 538, 535, -1, -423, -497, -209, 157, 557, 526, 48, -437, -509, -294, 102, 445, 551, 164, -396, -533, -371, 52, 435, 547, 219, -255, -522, -379, -43, 371, 583, 261, -252, -546, -392, -39, 355, 563, 371, -187, -547, -430, -25, 318, 566, 403, -109, -439, -492, -133, 281, 536, 458, -67, -489, -479, -194, 168, 490, 488, 37, -442, -514, -200, 159, 488, 578, 94]
6036I4n27j14K65L79L65P3m11m99j91K26M23L52J01k67o02j95J52M26L43J80k78
6057B95n90k70J21M44L58J82k48m63l50P5M08L74K02j24n12m37K4L79M03K65j01
6078D35m26m67j19M07M13K77q6l88m98q6L87L27K94L2m12n03j58L18L88L15K8
6099D78k82n41k30K04M75K98R7k01n38l11J55M26L85J36k17n65l40P6M98M08Q2
6120D93j06n09m24N3M03M18K19j52l85n14rL58N11J29m6m24m91n9L47M56K22k5
6142D65m36m37j92L89M91K08J6l51n51j88K37M49L80L8l12m61l52K18M66M26k7
6163D76k29n42l07J41N22L75O7k37m71l58P0N37L74J26k19m61l94m8M39M56K28
6184E45j94l85m86m8M10L97L34j84l57m89o5K63N12J76j1l43m40k36K29N10K85
$$ y = [94, -433, -547, -282, 97, 462, 535, 124, -375, -566, -340, 83, 435, 536, 269, -333, -528, -376, 50, 393, 573, 295, -295, -565, -444, 0, 358, 540, 292, -171, -521, -446, -38, 336, 538, 414, -98, -535, -511, -132, 271, 536, 435, 9, -458, -577, -170, 243, 520, 434, 46, -452, -538, -151, 176, 470, 502, 90, -413, -571, -253, 135, 450, 478, 196, -345, -575, -371, 104, 402, 499, 298, -240, -551, -396, 30, 415, 551, 334, -231, -571, -495, 3, 411, 493, 387, -122, -546, -493, -90, 328, 547, 395, 10, -504, -513, -155, 356, 485, 439, 15, -476, -535, -188, 268, 490, 465, 29, -408, -600, -211, 280, 488, 504, 153, -398, -586, -349, 100, 480, 518, 206, -255, -607, -389, 77, 503, 476, 247, -295, -602, -461, 61, 436, 503, 266, -205, -563, -493, 44, 418, 544, 325, -136, -530, -578, -139, 317, 545, 351, -34, -520, -568, -158, 239, 573, 389, 32, -457, -522, -259, 253, 429, 418, 75, -365, -601, -372, 138, 423]
6205D23L2l31m85k76K37N19L37L1l21m88k78K41M31L99N8k84m48l47J25M51M66
6226D92M3k72m61l73M4M84M41R2j34m82l58KL27N82J28k40l30m84n1L33N30K40
6248E53j80l73l96j90L51M58L62j91l12m58j54J70N71L60q0l34m82k90K18N63
6268A66L82j9l41m52l52J26N69M07P1l51m59k45N4M20M62J05k65m12m19L7L96
6289a20N39J72l05m38l21j04M07N03K22k04l38m88n7L11N70K03j37m08l94j20
6309e07K07N44K64o4l81m44j99J72N99L84j34l92m14j99J82M86M34j9m38m14k09
6330e42J60L98M84J6k95m53k99J24L67N13J26l23m23l27jL80N67J12l10l92l68
6351d86n3L75M97K07j17m12m76k7L04M64L39j92m81l50j42K88N03L05q2m10m32
$$ y = [423, 455, 124, -361, -637, -400, 119, 456, 487, 166, -322, -600, -359, 72, 471, 529, 245, -203, -550, -425, 26, 492, 535, 263, -198, -571, -527, -43, 398, 490, 356, -126, -484, -482, -155, 427, 555, 315, -15, -499, -550, -217, 313, 553, 373, 0, -396, -586, -235, 223, 585, 394, 82, -376, -530, -360, 211, 571, 491, 157, -325, -615, -397, 166, 548, 529, 188, -264, -616, -490, 79, 486, 557, 206, -253, -498, -444, -24, 438, 543, 278, -134, -553, -516, -120, 419, 591, 286, -152, -473, -577, -170, 333, 555, 351, 13, -475, -532, -221, 349, 552, 415, 7, -387, -507, -300, 244, 508, 444, 63, -381, -580, -408, 191, 575, 441, 49, -365, -564, -382, 104, 538, 519, 81, -333, -542, -382, 16, 500, 516, 221, -232, -531, -407, -40, 473, 599, 276, -147, -474, -475, -95, 472, 584, 274, -118, -486, -539, -164, 333, 540, 423, 11, -465, -492, -188, 276, 615, 423, -58, -408, -550, -262, 241, 546, 464, 54, -378]
6372c78j49J59N27L78m9l97m65j64J07N19M00K7l56m12l13J60M08M85P2l41l97
6393a79l12Q5L30N07J11k84m48l09J5M05M56K54l32m44l33J1K62N10K89k42m41
6414h9l13p5K29N03K76j22m86l93j17L00M77L91r2m47m71j27K47M45L98m9l35
6435A50m86j92K03M05M24J12n16m36j38O1M29M77P4l02n09l02J35L66M24J96l10
6456B65n20k58O8L24N00K22k99m32l65K8L17M51L08k33m51l45r9K86M70L31j13
6477D55m73l81j09K65M22L36l2m18n03j24K90L99M14J4m28m46j24J51L36M21O4
6498E29k70n38k27O7M13M96R4k94n05l14J10L60M67J81k69m51l57O3L48M23K42
6519E68j94n18l89oL58M63K76j22m61m82nL26L87L52j12m22m36r3K34M32L73n6
$$ y = [-378, -527, -368, 159, 537, 488, 91, -374, -538, -431, 88, 488, 515, 159, -253, -566, -406, 2, 487, 559, 218, -179, -491, -406, -76, 431, 542, 258, -190, -499, -484, -79, 377, 631, 299, -145, -478, -467, -205, 305, 594, 352, -89, -402, -477, -248, 255, 531, 409, -77, -470, -587, -287, 190, 581, 489, 42, -429, -556, -309, 136, 534, 485, 150, -336, -528, -325, 80, 504, 616, 100, -336, -474, -413, 16, 493, 567, 265, -244, -546, -411, -45, 379, 575, 265, -255, -513, -445, -121, 379, 601, 302, -130, -495, -467, -150, 301, 609, 376, -75, -420, -519, -233, 237, 568, 455, -18, -399, -508, -243, 179, 515, 483, 65, -438, -562, -272, 127, 541, 555, 127, -319, -443, -292, 44, 465, 529, 259, -279, -506, -439, -26, 470, 564, 270, -235, -549, -439, -79, 388, 569, 300, -151, -508, -445, -97, 326, 568, 374, -144, -533, -539, -181, 282, 558, 436, -25, -507, -512, -186, 201, 553, 441, 19, -417, -510, -276, 156, 529, 473]
6541D73m06m69j13K24M51L21R0l90n13j61J39M39L71J26l14n79k36J06M64L66
6561C89J43k85m29l69J29L50M42K42k83n02l75M6M05M19K55j59n39m35Q8K81M52
6582B65K38o9m86m35k2L25M41K34K8m84m06k08L12L93M06n9l40n06k23K98M59
6603A61L11P3l54m72k91J91M63L63N7k70n24k68J07M39M47Q7j58n31l81J19L98
6624c3L71J64j75m77m07Q7L61M59J57j38m28m13q3L87M49K56j21l63n02p3L20
6645b02M19K94km40m56j84K71N35L05j5l97m62k87K42N00L86M5l55n26l04K24
6666d09M33M15P9k52m98m08J99L96M13J95k59m96l88O0M52M39K00k19m52m59N3
6687e06M01M13K57k05l83m99o6M21M54K13n6m36l96j83L40M46L21k5m39m59j74
$$ y = [473, 67, -402, -515, -291, 160, 481, 571, 181, -332, -493, -354, 85, 456, 582, 268, -311, -547, -441, 23, 389, 532, 247, -182, -551, -422, -72, 370, 612, 329, -173, -548, -502, -97, 322, 577, 418, -121, -556, -468, -187, 265, 503, 434, -52, -487, -509, -184, 257, 491, 519, 35, -371, -579, -267, 126, 532, 473, 133, -373, -596, -298, 161, 472, 545, 191, -281, -572, -381, 82, 445, 502, 232, -292, -560, -453, -14, 433, 520, 362, -169, -550, -431, -33, 338, 502, 327, -150, -557, -470, -109, 350, 507, 369, -59, -472, -555, -168, 281, 537, 416, 53, -449, -522, -202, 217, 511, 509, 69, -387, -571, -300, 235, 540, 525, 128, -334, -621, -379, 121, 507, 552, 197, -329, -633, -409, 24, 439, 518, 266, -232, -640, -441, -45, 368, 563, 304, -192, -580, -520, -68, 371, 571, 352, -100, -559, -506, -105, 308, 565, 360, -23, -522, -588, -167, 287, 500, 444, 8, -388, -571, -231, 215, 536, 511, 72, -387, -561]
6708e61K70M46L85l9l87m22l01K77M59L63L4m00m30k54J15M33M97N3k92n21k54
6729e29N9M46M26J65k50m75l61J7L78M74K19k01m18m35k3L87M77J82j53m42m48
6750e05p5L87M00L08o0l94m42j52K68N28K78j09l63m50j90K84M54L49j4l44m82
6771c24k84K42M63L71K2k87m42l07J23M73L81P7k56m11m30J49M70M19J13k44m89
6792a71l42rM15M83J93k30m30l94m9L08N03K31j08l90m29j23K93N53K75j73m17
6813a1m24j76K86N20L64j47l46m11k17K61M17L85n3l67l81k41J23M58M27M2l54
6834A55m13l25J03M48M46N9k10m92k28o5M28N03J09k47l41m19l1L98M81K16k13
6855C62m40l28j13L20M47K59o7m51l79j55K74M64L18r8l32m08k93K37N44L56j5
$$ y = [-561, -291, 155, 540, 501, 114, -308, -609, -332, 127, 490, 524, 124, -306, -560, -445, -12, 485, 538, 246, -275, -529, -470, -24, 402, 567, 317, -158, -519, -502, -124, 350, 569, 368, -50, -485, -508, -121, 356, 538, 385, -57, -505, -580, -193, 207, 515, 455, 61, -381, -533, -265, 263, 541, 432, 69, -381, -571, -287, 167, 516, 502, 158, -324, -608, -366, 97, 468, 490, 203, -239, -546, -423, 50, 431, 508, 252, -159, -589, -440, 30, 449, 562, 318, -171, -513, -522, -107, 376, 569, 339, -91, -485, -534, -226, 277, 508, 400, 10, -419, -542, -249, 304, 579, 406, -11, -435, -611, -325, 195, 559, 412, 66, -345, -562, -301, 116, 501, 448, 81, -300, -541, -418, 40, 467, 509, 155, -258, -583, -480, -32, 414, 473, 263, -229, -457, -522, -94, 409, 518, 271, -70, -489, -520, -122, 359, 575, 362, -78, -406, -519, -199, 248, 507, 440, -11, -390, -545, -271, 193, 511, 413, 81, -327, -620, -383, 161, 517, 502]
6876E02l99m60k24K49M50L70L4l56m45k04J03M31M02L4k26n11k60N9M22M95P7
6897E43l04m11l15K7L67M50J90j89m81l31k8L14M86K40j83m21l30j59K69N56K76
6918E66j78m53l46j22K45N09L13n9m60l68k25K84M36L60K0l98m17j93Q4M75M56
6939E29O9m16m85k66R9M78M06J56m16l68l36N4M47M65O5k35m63l04P4L23M83J91
6961E50j69n08l51j1L31M68K20j12n05l79n9L05M68L32j47m05m80m6K03M85L68
6982E58j58l24m18j96J68N10L46N4m52m48j66J28M75L75L7l20m37l23J49M00N03
7003D61J31l18n72k49Q6L83M37K04k16n07l38K3L09N31K55k26n19l61n1L73M14
7024B50K65j35m62l92o1L19M45L77j29m59m36q0K06M24L77Om25n05j22J82L95
$$ y = [502, 103, -357, -581, -332, 118, 488, 522, 166, -279, -483, -380, 51, 453, 487, 261, -250, -510, -451, -29, 466, 543, 239, -172, -487, -460, -93, 357, 547, 358, -123, -454, -482, -168, 318, 558, 375, -46, -376, -535, -266, 290, 566, 388, -65, -411, -533, -288, 221, 534, 475, 15, -353, -578, -294, 142, 502, 522, 124, -293, -486, -402, 73, 529, 598, 182, -303, -569, -470, 8, 414, 570, 154, -214, -550, -496, -49, 416, 481, 246, -217, -521, -447, -124, 359, 550, 381, -127, -478, -489, -158, 310, 530, 418, -87, -466, -525, -220, 248, 580, 433, 28, -452, -498, -295, 190, 558, 400, 76, -342, -538, -370, 140, 486, 540, 88, -360, -526, -398, 77, 452, 489, 169, -268, -591, -442, -42, 461, 592, 274, -298, -547, -461, -78, 359, 563, 347, -160, -498, -475, -166, 365, 620, 394, -125, -486, -537, -164, 250, 515, 380, -82, -474, -535, -216, 229, 606, 477, 18, -418, -498, -292, 132, 509, 515, 90, -415, -537, -355, 40]
7045D0M68J5l81m67k12J61L74M01J15l34m47l19J57L86M55J18k19n23k89P4L61
7066f6L88K06k37m12l51m6L42M98K59j87m75m15qK63N00L11j31n04l65j16L33
7087b13L66L73p2l70n18j16K75M21L51j1l62m73j95J84M26L89L6l31m31k92J13
7108d50M62L89J58l15m79k89R1L89L85K37k52n17l41P0L28M56J70j30m37m41K8
7129d88L22M11K87j35m62m29J6L08L93L10r4l38m87j96L62M20K85m7l46m85j55
7150e48K59M09L82L6l66n20k05K26M09L79Q3l20m68l17J69L93L88J67k90n02k99
7171e35P0L88M08J85j73n19l07LL51M21K67j98m40l78q0L77L88K96r0n19l36j04
7193e25L57L60L15q8l64m93j27K41N14L16l6k99m74k36K37M12L16O8l30m40k44
$$ y = [40, 508, 523, 142, -325, -537, -376, -2, 399, 514, 180, -267, -586, -429, -43, 412, 530, 311, -212, -501, -427, -66, 322, 528, 291, -121, -472, -518, -176, 322, 581, 394, -81, -496, -504, -241, 259, 570, 439, -65, -430, -546, -213, 153, 526, 454, 84, -434, -550, -275, 146, 497, 486, 124, -349, -544, -360, 66, 455, 491, 160, -271, -563, -450, 12, 401, 559, 244, -235, -524, -433, -44, 341, 578, 326, -191, -532, -462, -134, 322, 492, 362, -75, -516, -488, -166, 245, 532, 397, -65, -494, -478, -170, 223, 533, 439, 101, -386, -582, -220, 200, 485, 438, 92, -393, -548, -289, 120, 502, 538, 172, -348, -553, -327, 82, 461, 544, 224, -244, -561, -392, 1, 389, 556, 266, -236, -535, -465, -77, 331, 516, 343, -176, -483, -480, -129, 292, 559, 361, -79, -457, -537, -160, 228, 524, 434, -85, -421, -525, -168, 192, 507, 419, 55, -438, -565, -324, 190, 506, 470, 171, -303, -539, -302, 110, 426, 494, 164, -276, -520]
7214e20J48M15L82Q5k84m86k46J37L58L85J75k73m85l03L7L87M25K53k58m65m02
7235e35O9L60M65J34j05m26m01j15L92M32K56j07l76m49j29L04M10L08k2l66m45
7256c46j45K13M18L64k5l74m09l02K51N07K89N3l22n11j86J36M64L11Q7k59m06
7277a92l82J02M66M20Q4k14m59l66J08L64M48J39j78m69l47m6L50M80K52k08l70
7298a8l23j91L62M64K06r3l50m90o4K25M06L35Kl63m17k54K51M13L30L9m04l47
7320b81k83J76N10L22L6k46m66l26J15M90L47J04k42m50l33J08L63M34J30k20
7340B88l89l52l2M15L94J56j76l65l53j17L56M52K38j47m36l65p7K57M96K38m7
7361D34l93m07j24J93M52L18j3l72m43k00K34M34M07o0k94m40k65J77M49L51K0
$$ y = [-520, -372, 43, 425, 510, 226, -260, -506, -369, -11, 374, 549, 276, -209, -512, -475, -88, 337, 590, 332, -133, -535, -466, -106, 359, 493, 388, -38, -439, -554, -162, 270, 526, 419, 43, -406, -535, -231, 179, 487, 465, 99, -346, -491, -278, 140, 504, 479, 105, -304, -606, -355, 152, 441, 494, 172, -339, -525, -389, 75, 386, 473, 214, -192, -574, -472, -6, 414, 498, 284, -175, -541, -433, -69, 379, 518, 340, -129, -476, -522, -172, 308, 560, 352, -18, -341, -532, -170, 294, 500, 407, 57, -433, -497, -272, 134, 469, 471, 108, -309, -563, -312, 101, 431, 470, 66, -281, -564, -388, 122, 444, 480, 234, -232, -558, -443, 47, 394, 498, 256, -194, -527, -419, -56, 378, 508, 288, -101, -453, -485, -70, 324, 480, 304, -61, -414, -531, -175, 277, 515, 368, -68, -433, -510, -253, 243, 481, 434, 41, -366, -490, -297, 155, 473, 460, 88, -355, -555, -321, 113, 520, 460, 166, -274, -539, -362, 87, 438, 458]
7382D58k62m51k54J07M16L72J51k78l71l81Q6L06M46J27j01m45l86k2L28N23J30
7403D99j20m50l26p6K79M56K47j70m03l54p5K14M71L05n9m18l95j29J47N13L08
7424D64Rl83m24j46J27M11M23j8k68m12k51Q8M09M21K2k57l62k86K2L50M62J55
7446E56l18l33l75pL91M47J52k32l89k96q4L33M00K28j25m05l70m8K58M30K81
7467D94j09l70l79q2J53N05K39m6l30l84j77K10L74L59p0k85l55k79K14L87L69
7488D38J1k83m43k10J20L49M16Q0k11m70k25k6L48N05J00k40m01k84l1L32M37
7509C12J87j64m48l31o9L43M34K63j59l91l95p3K38M94K25r6l31l73j62K35M26
7530A65L12n2l57l25k31J82L89L44L6l03m06k79J27M35L66P4k14n02k16R1L62
$$ y = [458, 196, -255, -509, -402, 14, 386, 537, 259, -112, -493, -407, -101, 345, 472, 371, -74, -460, -482, -154, 369, 499, 379, -71, -397, -473, -194, 262, 509, 339, -64, -418, -493, -279, 192, 497, 438, 20, -375, -504, -357, 156, 464, 473, 90, -334, -480, -353, 58, 481, 463, 195, -217, -468, -380, 29, 450, 472, 215, -147, -433, -411, -61, 401, 556, 238, -95, -470, -477, -86, 361, 513, 281, -108, -404, -488, -155, 245, 473, 348, -57, -427, -475, -217, 213, 494, 385, 15, -364, -446, -293, 212, 451, 405, 75, -309, -486, -276, 98, 457, 387, 102, -253, -532, -318, 69, 438, 449, 166, -277, -487, -367, -18, 398, 478, 267, -203, -428, -454, -106, 399, 499, 259, -142, -426, -457, -125, 312, 499, 335, -113, -444, -513, -170, 264, 527, 368, -23, -418, -491, -253, 241, 466, 370, 39, -334, -496, -261, 165, 477, 425, 68, -257, -488, -306, 83, 427, 463, 160, -246, -525, -398, 37, 403, 477, 263, -239, -455, -364, -2]
7551bL17K12l63m18k23L5L65L65J87k12l84l60L8L05M62K42k45l74l38q3L42K93
7573A61L37j17m20l33j40K57M44K36Ll58l75k10K73L91K85l5l27l64j67J55L46
7594D2L70M7k93l94k79Q8M23L73P7k18l91l41J15L39M16Q8k27l70l30J34K43L91
7616C03J52j50m46k83PK87M46J47j41l95k78q5K54M03K60j25l07l65j44K28L90
7637A58K62nl27l77j34J08M33L27Rl00m37j80J11M33K15J41k70l76k49J56K96
7658fL28J41k44l84k47O2L13L43J51j69m51k79P1L13L44K10j85l99l19j8K86M02
7680B63J70p4l88l32q2K61L60K45pl70l75j11J82L79K69K7k89m14j62J30L88K99
7702C69J34l41m79k05K19L19L13J36k37m63k65J45L12L79Q7j71m20k68O7K97L71
$$ y = [-2, 315, 527, 164, -254, -477, -442, -77, 288, 475, 263, -121, -481, -443, -138, 324, 566, 321, -53, -391, -474, -132, 161, 498, 381, -39, -372, -512, -255, 189, 425, 428, 70, -305, -515, -242, 149, 434, 399, 72, -292, -459, -304, 42, 412, 459, 166, -228, -507, -419, 4, 377, 454, 236, -155, -496, -381, -42, 374, 462, 235, -135, -465, -331, -88, 303, 455, 305, -141, -424, -417, -130, 316, 463, 322, -73, -351, -436, -182, 221, 481, 356, 49, -316, -460, -232, 158, 420, 415, 88, -289, -423, -315, 118, 445, 454, 154, -283, -463, -352, 81, 296, 437, 167, -209, -458, -302, -6, 322, 463, 219, -165, -412, -350, -37, 306, 457, 288, -163, -442, -371, -58, 286, 496, 311, -88, -407, -425, -139, 263, 433, 359, -29, -361, -443, -182, 178, 423, 416, 46, -329, -440, -258, 121, 390, 417, 128, -286, -448, -318, 70, 369, 503, 162, -317, -522, -303, 16, 329, 465, 228, -235, -500, -355, -43, 336, 423, 252, -168, -436, -369, -72, 299]
7723B99K13j99l80l50NL35L05J91p7m54k45j20L02L41L44j11m06l48j33L52K81
7744A45K80M2l52m33j21J89L41L12N1l28l87j55J20L71K97J0k24l68k33J23L56
7765C6L08J02k19m21k43O8L63L37R8j60l86k96K5L19L10J57j30l40l48NK69L86
7787B40K78j79l79l66l5K24L68K50nl57l53j18K28L63K31M7l90l19j90J86L41
7808F5K88J7k58l89j48J50L31L17M5k45l99k05R3L58K95J16k04m08k92J11L30
7829c2L52K7j20l08l58M0K74L56K36j90l49l25KK50L06K09pl80l48j19K74L66
7851A56K86r4k93l54j51K30L49K06O6l04l20k03J66L78K53Pk46l71j57R5L18L41
7873C58L1k33l19k66N7L92K98Mj22l52k64O1K84L61J15j80k49l91lL09L58J59
$$ y = [299, 512, 313, -67, -417, -412, -77, 228, 419, 342, -112, -357, -477, -175, 166, 510, 399, -7, -355, -488, -136, 145, 425, 467, 115, -318, -439, -250, 91, 403, 454, 126, -261, -416, -296, 75, 372, 382, 158, -210, -443, -320, 36, 344, 446, 227, -194, -437, -369, -6, 331, 429, 269, -117, -413, -388, -69, 241, 398, 268, -72, -420, -415, -146, 240, 518, 339, -40, -406, -441, -217, 151, 401, 396, 39, -314, -432, -204, 159, 390, 437, 47, -272, -462, -276, 65, 353, 370, 112, -277, -425, -275, 56, 373, 418, 173, -226, -431, -338, 20, 315, 431, 227, -181, -473, -362, -32, 320, 347, 227, -81, -439, -399, -125, 231, 467, 277, -72, -397, -395, -145, 161, 370, 363, -17, -365, -484, -210, 156, 442, 348, 55, -299, -450, -220, 129, 335, 401, 97, -223, -426, -260, 118, 371, 378, 132, -239, -396, -301, 17, 358, 389, 156, -163, -429, -372, 20, 318, 322, 200, -152, -416, -355, -71, 290, 405, 225, -24, -415, -418, -109, 249, 408]
7895D08j15l10l01j23K59L55J68o0k54l19j48K10L91K49n0k46l94j43J63L50K63
7916C53J3k55l15j92P3L76L18N6k17l79l15J55L45K90N4j54l67j94J7L04L24Q3
7938C73j86k48l20J7K96L60R8j49k94k59r1K92L18K02j34k76k78j41K29M06K04
7959D19q8k60l61j86K27L73K28k3k17l25k16J04L71K62Jk07l44j86J37L38L33
7980C80l4j41m25k07R9L11L66O6k24k97k45N1K81K72J56j57l78k12n8K59L20K74
8002D57j83l77k60O8K15K44K19q5k51l41q2J54L83K47pm13j87j81J18L84K22m6
8024B98k36l32j19J10L39K66M1k18l44j78J04K89K69J22k53k96k01K3L44L06K4
8045C58j87l12j64n1K95L35J07j18l63k59J2K45L56J17j48k23k64j15K30L44J96
$$ y = [408, 293, -17, -318, -441, -182, 173, 341, 281, 27, -292, -440, -230, 161, 410, 360, 114, -280, -423, -260, 90, 353, 366, 111, -204, -396, -323, 53, 371, 427, 210, -169, -484, -329, 16, 306, 360, 206, -161, -355, -338, -34, 290, 373, 187, -61, -381, -364, -68, 292, 390, 241, -53, -312, -403, -111, 207, 409, 275, -1, -279, -420, -191, 215, 419, 331, 71, -290, -476, -249, 124, 352, 329, 112, -213, -429, -325, 46, 308, 309, 102, -242, -428, -291, 47, 380, 346, 205, -220, -427, -328, -17, 349, 415, 191, -106, -351, -300, -19, 253, 409, 252, -126, -338, -396, -137, 183, 457, 274, -103, -363, -295, -80, 164, 383, 298, 47, -294, -376, -222, 161, 408, 401, -12, -199, -380, -262, 122, 344, 298, 62, -270, -389, -279, 60, 326, 367, 149, -195, -373, -269, 20, 289, 411, 158, -138, -339, -316, 28, 334, 358, 171, -141, -305, -356, -61, 274, 381, 263, -100, -359, -347, -102, 254, 371, 223, 0, -264, -379, -149, 195, 391]
8066C91n1k87l65k6J20L58K16J3l04l52n3O9L43L26q4j64l34k35J84K38L41jk15
8089A28l33j23j1L39K66J18k33k83j99M9K63K57J41j69k78k06pJ87L44J49j58
8110B41l09k24pK02K55K10p4l43k26r7J77L23K38p4k84k60j11J53K75L05n3k58
8132E9l19j23J13L78K26Pk73k79j48R3K16L14J24k49l45j56Q0L23K59L9j71k56
8154h8k21j1K57K95J17j50k33k46q2K69L36J06j04l18k43mJ84L15K30j29k32l65
8176c17%J46L37J80l3k28l84m4J43L07K34k2k43k89j61
$$ y = [391, 340, 53, -312, -338, -218, 140, 356, 369, 65, -287, -340, -271, 72, 398, 314, 150, -184, -419, -235, 3, 344, 343, 128, -205, -328, -339, 0, 266, 384, 151, -132, -331, -282, -19, 238, 379, 210, -68, -274, -281, -94, 250, 399, 241, -68, -292, -299, -97, 158, 368, 294, -49, -275, -372, -195, 128, 366, 292, 8, -252, -363, -210, 65, 370, 317, 59, -260, -383, -270, 108, 334, 341, 68, -211, -359, -266, -50, 264, 388, 139, -206, -362, -282, 41, 300, 339, 168, -88, -309, -320, -63, 232, 349, 199, -34, -280, -362, -93, 243, 349, 245, -73, -316, -320, -136, 179, 409, 280, 48, -317, -317, -171, 166, 346, 313, 85, -299, -343, -200, 107, 341, 319, 76, -213, -374]
8191c74
$$ Imaginary data points
##PAGE= N=2
##DATA TABLE= (X++(I..I)), XYDATA
0@%%%%%%%%%%%%%%%%%NnQj6J6j6J6j6K1k6K9l3L7m2M9n5N9o7P3q1R4j03J13j25
41f5J38j54J69j86K06k25K49k75L01l33L66m02M46m95N51o18O95p88R01j039J220
62F62j460J789k276L040m382P180j5116P7313L23126o2132k03901k39962k73638
75c89757O8050L52375K41760P2330j46945l36579j97986N0699K08402L06890J44557
86C73796j66623k79518k32573m3557K52874L13501J20662q9625k74844k81175
96c07082l0485K13890K93952J77139r6989k63490k29646r1889J61907L21851J69759
107C18917o7258k12951k59516r9868J43347K50177K16284Q395k41078k45318j00401
118b89270O1510K62438K52780l930j78756k45055j86513R6635K71454J81688O3166
$$ y = [0, 0, 0, 0, 0, 0, 0, 0, 0, 0, 0, 0, 0, 0, 0, 0, 0, 0, 5, 0, 8, -8, 8, -8, 8, -8, 13, -13, 16, -17, 20, -22, 27, -28, 31, -36, 37, -44, 50, -53, 60, -65, 73, -81, 88, -98, 108, -117, 132, -143, 158, -175, 191, -211, 235, -260, 291, -327, 368, -420, 481, -558, 662, -798, 991, -1285, 1755, -2627, 4553, -10563, 66750, 389876, 327744, 123843, -116119, -389757, -321707, 30668, 272428, 344758, 197813, -138766, -336752, -286053, -77651, 229239, 373796, 207173, -72345, -304918, -348475, -95601, 217900, 338562, 248937, -25907, -307082, -337567, -123677, 170275, 347414, 250425, -13065, -242711, -334600, -172693, 149158, 318917, 251659, 38708, -220808, -320676, -177329, 72848, 289132, 297527, 56449, -188869, -289270, -227760, 34678, 287458, 283528, 104772, -140283, -326796, -230161, 41293, 222981, 286147]
129B86147j30830l03585j47614R0665J72979K29325J10733j70593k34245j35067
139b32085k7484J84987K74163P9113j12628k02969k08625k2484J90772K24028
149A46788J28091o7587k42456j93781j5256J32407K23127J56535n8227k09164
159D77j95926n6222J21674K11385J59097j2019j92825k09034p0075Q5882K05282
170D7696J87928o379j71608j91306j12670O4188K15631J75910J9099j35032k12134
181a18677j19407N9980J71749J87695O2889j39379j99651j12972R446J59340K07286
192A68299O2340j03419j78130j57375l130J62458J81353R0672o1789j97466j62319
203a98506l715J23163J83553J22113o1083j80769j50468m1930J01919J92217J24242
$$ y = [286147, 155317, -148268, -295882, -205217, -32238, 197087, 307820, 137227, -97018, -232085, -259569, -74582, 199581, 278694, 166066, -36903, -245528, -268012, -77240, 146788, 274879, 207292, -35164, -228945, -244201, -111794, 111333, 267868, 209641, 477, -195449, -251671, -129997, 81388, 240485, 228466, 35641, -173393, -243468, -157586, 47696, 235624, 229245, 57637, -133669, -246339, -182151, 33480, 209390, 228489, 93457, -118677, -238084, -178104, -6355, 181340, 244229, 104850, -94801, -207773, -198327, -38987, 168299, 230639, 127220, -50910, -208285, -211415, -48957, 132396, 223068, 161279, -36187, -198506, -202221, -79058, 104495, 226608, 165525, -15244, -165712, -207642, -105723, 86494, 210736]
214B10736l7413j54656j65228o3849Q8673J79688J38025q025j45803j71342p7096
225b06290O9041J69900J48168J4354j30671j74878q9070N2380J54188J55707L7156
236A99985j17308j70985r9432K8012J42827J62660N2364r6093j64944j16930J0903
247a68941J31786J60925P3097p5118j65315j25266l781J13982J62198R0532n9527
258A34572j56975j31876k2167J00144J59312J02244l8070j46944j39943l7781
268a77484Q4723J53846J13865j7327j34723j46975n3782P1555J45800J22136N896
279A67530j23978j52853o3960N4563J35318J33389K2532j12058j49152p9619L6370
290a31918J31149J34978L7577q9787j51218r5432K6448J18147J34532N9774p5299
$$ y = [210736, 173323, 18667, -146561, -210410, -121737, 57951, 195976, 187951, 42148, -129194, -206290, -137249, 32651, 180819, 195173, 64502, -110376, -199446, -147066, 7122, 162829, 199985, 82677, -88308, -187740, -159728, -16901, 145759, 198123, 102030, -62914, -179844, -168941, -37155, 123770, 196867, 121749, -43566, -168832, -172613, -58631, 103567, 194099, 134572, -22403, -154279, -176446, -76302, 83010, 185254, 147184, 240, -139703, -177484, -92761, 61085, 174950, 157623, 22900, -124075, -177857, -106302, 39498, 161634, 167530, 43552, -109301, -173261, -118698, 16620, 150009, 172541, 60483, -88669, -168288, -131918, -769, 134209, 171786, 81999, -69219, -164651, -138203, -20056, 114476, 174250, 98951]
301I8951j50993j01622P955J05227J40300P0458n8735j39999j15829r086R9270
312e4103J34935Q1598l5149j36037j25353j9905Q3392J32003R5954k1621j25540
323A0174j27823l9701P1781J31388R9623k687j10512j36865n2608O1270J21826
334B5866J08421J5833j01847j36370o4610M3155J18825J14431K6267q4139j34521
345f8689q1998L1947J12941J13633M2732o8044j35072r1105J7670J02205J18747
356I4967N4556n5825j26860j00868p2R5902J19192O3008l7886j20193j10847j2711
368a37637Q4711J17166P5300k3596j13730j14494k7742P2125J17539Q3168j0918
379A21892j01807j18229m3208O1248J14755Q8887L766r0224j21067n6153M8816
$$ y = [98951, -52042, -153664, -145709, -40482, 99818, 170276, 111541, -28458, -144287, -153373, -54103, 80832, 162430, 127281, -8756, -134109, -154014, -70622, 61381, 157335, 135714, 10174, -117649, -157350, -85569, 45819, 145442, 142755, 32243, -104622, -157230, -95960, 25866, 134287, 150120, 48273, -88097, -152707, -109552, 9273, 123704, 149971, 65832, -68689, -150687, -118740, -5799, 107834, 150566, 82522, -52550, -143655, -125985, -23780, 94967, 149523, 93698, -33162, -134030, -134102, -38200, 80992, 144000, 106114, -14079, -124926, -137637, -52926, 64240, 139540, 115944, 2214, -112280, -140022, -67897, 49642, 132810, 121892, 20085, -98144, -141352, -80104, 34651, 123538, 127304, 37080, -83987, -140140, -91324]
390i1324J10184R4913J7079p9115j20742o7319L4789J04633J00636K8269o7377
401F4626j17053p8395K0226R9440J03464L8577n3262j13981q8065Q045R0593J04691
413G8906N0935m1656j09599r3275o698Q0465J07301N9748k9250j01742j00577
424a05442j9478P2205J04720O9027j5323r6446j03619l0579N9226J04534P6657
435A15482o313q4515j05113m6531N1348J02051P7878R961p3682j11124n2817L9863
447h3512R1917Q9253K2146p1106j04170o1200K0066R3312R5018K4274n4635j00436
459c9073p7270J5482Q8134Q8137M0755m0979j05365p7982O043P2028R4807N2107
471A16824l6382r4393q3281j3869O9960R7822N3476k1266q6672r3501k2096O2635
$$ y = [-91324, 18860, 113773, 130852, 51737, -69005, -136324, -101535, 3098, 103734, 132003, 64626, -52427, -130822, -110596, -11156, 92308, 130885, 77623, -36358, -124423, -116378, -25785, 78906, 129841, 88185, -21414, -114689, -121387, -40922, 66379, 126127, 96877, -4865, -105442, -124920, -52715, 52005, 121032, 105709, 9263, -94356, -124935, -65709, 38825, 115482, 109169, 24654, -80459, -126990, -75642, 26409, 104287, 114248, 40566, -70558, -123375, -83512, 8405, 97658, 119804, 48698, -55472, -116672, -96606, -3294, 91724, 115998, 61363, -39073, -116343, -100861, -12727, 75410, 116165, 75186, -30179, -108161, -102118, -30090, 64717, 116824, 80442, -13951, -97232, -111101, -41141, 56681, 110157, 88891, 2219, -91282, -113378, -50743]
483e0743R4298O2858j1894q1549r2283l4181N1338R4809O6566j180p0484r6847
495f9292m2718M2832Q5798P5286J3230o8394r3905m9364K4217Q7346Q3524J3326
507A01886n3482q8573o9569K0315Q9701P4266K6466l7562r7194p0440J6202P0651
519a7333Q1732M1731m0926q6527o7213r921O6166R3430L8886k9057p3116q3107
531h5255j9786O7426Q5838M6955j2742p6413q5966k1337N3210Q3533N8037q181
543H5319p0003q1970l3919M1192Q4030O3415J47o1296q1459m5114K9186Q4704
555A4232O9709M995n1719p9597n7531K2592Q3649O7941J6024m1602q4469n9016
567i4792J6825O8884P4432K9875m3310p7435n6659m708O3682Q5536K8510l3808
$$ y = [-50743, 43555, 106413, 94519, 12970, -79313, -113494, -62156, 32653, 99219, 98039, 27555, -69292, -112010, -69178, 16620, 91906, 105136, 36742, -57163, -106527, -82310, 5036, 88560, 101886, 48404, -40169, -109738, -89423, 278, 74544, 101010, 63448, -33746, -104186, -87984, -17333, 64399, 106130, 65204, -21323, -88536, -98457, -32291, 61139, 100025, 70968, -2148, -85255, -105041, -37615, 48223, 95178, 82436, 6023, -79943, -101280, -48070, 35463, 93500, 85319, 15316, -66654, -100573, -59381, 24649, 88064, 88211, 26915, -54544, -99658, -70472, 14232, 83941, 88936, 37217, -42380, -99911, -77319, 6330, 74271, 90295, 48693, -35776, -94792, -77967, -9083, 65349, 95224, 51914, -25521, -82180, -86888, -23206, 62330, 90840, 57032]
579E7032o4748p1219j5754O6509P9451L5238j6784o9793p6956j3757N3268P5423
591C7910N0417j4678o9708o7983k3916L7425P9751N5474j1392n6530o7649l9988
603i0867L0938Q0481N6736O63m7580p5505m6867K8101P3823O0928J3238m7644
615C6445p7136m4145J7588O4045O9202J8997m5778o7813m7630J491O1120P2608
627E8994K2445l2884o3365n9197n386N7597P0126L3434k2465o7511o2750q818
639g9780M8656P1023M2990k0030o5557n9824j6408L9070P2076M6905j5484n6412
651G225n8757k7948L1284P1286M8905m142m7132o6060l5910K8416O4616N4387
663F6170J0395m9254p0138l3138J7805N8610O5358J1289m8730n9208m0047M946
$$ y = [57032, -7716, -78935, -94689, -28180, 51271, 86509, 69725, -68, -77024, -90781, -37513, 37910, 88327, 73649, 3941, -64042, -87958, -50533, 29218, 84692, 73300, 16770, -50879, -90867, -59929, 20552, 77288, 77951, 30371, -45134, -92001, -63900, 9923, 70851, 84089, 36445, -40691, -84836, -67248, -3203, 65999, 84996, 39218, -28595, -76225, -74734, -13614, 58994, 81439, 48555, -14810, -74007, -79393, -21796, 48330, 81764, 59299, -8212, -70962, -79780, -31124, 39899, 82889, 62859, -2698, -62522, -78930, -39860, 32216, 79121, 63637, 7225, -51532, -79480, -48196, 23090, 71995, 67853, 20721, -45339, -81249, -52833, 11783, 66170, 76565, 27311, -42827, -75965, -58160, 450, 65808, 77097, 28367, -30841, -70888, -65942]
675f5942O1765O3020J2133l1771n8321n1606L869N3997N8833K8574k5542o3800
687a4791m9595m659M3425O7449L4545k5596n6843n2535j4440M2731O5852L5639
699G1182j5358n3858n5440j7153L3436O2143M3552r328m9077n4640k7061K6712
711d4890O2273M5988M65m4161o0404k9559K1332N5716N4320O903m5870n4827l2863
724f5577Q988N7491N6429O743l3575n3084m3594Q430N2123N1258K1663k7485n9754
737a9944l9894J086L9518O1479K8341l0540n0800m2604j2322M2312O1694K6019
749F4345j7567m8696n0962j0265L5339N3512L8295j1107n1341m6134j7193K3736
761c8038N8070M2085q193m2560n0341k5495K3659N3428M3728L208m2624n2587
$$ y = [-65942, -4177, 58843, 70976, 39205, -19116, -70722, -66853, -12856, 45977, 74551, 49009, -14791, -64386, -69045, -25620, 41829, 76374, 50778, -6065, -58600, -73040, -30309, 35543, 71182, 55824, 1966, -53474, -70627, -37191, 24952, 68504, 59176, 10099, -44541, -71602, -44890, 17383, 63371, 63836, 19675, -40729, -70288, -48956, 6760, 61080, 67983, 22113, -32714, -65577, -56589, 902, 57331, 64074, 30499, -22585, -66179, -57749, -5626, 45632, 67295, 39810, -19944, -59838, -58752, -19234, 42245, 70586, 40046, -10754, -53358, -65680, -23368, 38326, 64345, 46778, -1918, -52880, -63145, -27806, 25706, 64001, 52894, 1553, -44581, -61774, -38038, 20032, 62117, 53924, 11364, -38977, -64472, -40813, 12615, 56343, 59551, 16927, -35660]
773c5660k4364J4103M9416N1187N021l8323m7644l2744Q564M9165M8100J3353
785F0174k9295n3234l4207O401L8494N2208K3811l0429n0375l4453m701L7920
797a7686N5407K2644k1085m6664m3716m775L5721M7485L1692j2572n0755m1332
809d5636p976K3950N0868L8086j2194m3452m2323j8861K3729N0508L6489j602
821E1586l9981m8852j8297J9457M3178M3441M769m0070m5786k2746J1388M3967
833B054M4320Q311l1411m8110k9104J0924L9160M3210J7579k8172m9161k9406
845d9806L467L5017M7386J9889k3175m4623l6280j548L4937M4343K4331j4638
857C9300m6409l8389l116K7346M4141L1120j2222m3056l8262j1316K4138M5154
$$ y = [-35660, -60024, -45921, 3495, 54682, 59703, 21380, -26264, -59008, -50444, -1279, 46821, 60174, 30879, -22355, -56562, -50161, -11667, 40541, 64352, 33923, -16452, -50905, -55606, -17686, 37721, 60365, 39280, -7384, -51100, -55875, -20154, 27331, 59023, 46451, -4304, -45636, -53612, -29662, 21206, 59292, 47098, 3646, -38677, -57538, -33809, 16699, 53188, 51586, 11605, -37247, -55544, -36087, 7091, 50532, 55301, 15231, -30555, -53301, -41913, 2054, 46374, 54685, 23274, -24836, -53940, -43016, -3856, 39354, 56933, 28761, -20400, -49806, -46339, -11322, 36064, 55953, 32778, -11845, -48125, -49673, -14736, 29607, 53938, 39300, -7109, -45498, -48614, -21268, 22873, 53993, 41771, -1285, -39547, -50863, -26725, 18429]
869A8429L1574m872l8298m3886j4435K2379M0474L5229K339l7365m3790j7479
881d9701J5468M0033L8098M945l1179m3312k4554J2498L8905L7622J1310k6602
893B3531m5011k6515Q031L4491M0501J5788k3595m2615k9751K168L2718M0503
905C0244J9339j7119m2246l3748n72K9128L9544K4375j2755m0917l5173n493K5639
918a9754M0061K6273p866l6807l8007j0516K2967L8699K9154k372l4876l9197
930c2241j3862J8080L7696L2434J226l1650l9030j8209J3992L6192L3682O473
942D4783k7554m0308k1609J0714L3381L4899J1480k3745m0540k4773O878L1205
954e189L5454J5064j9057l9366k8084K433K8849L6087J8457j4837l7466l0764
$$ y = [18429, 50003, 45131, 6833, -37053, -51488, -29109, 11365, 46594, 48933, 11568, -32222, -49701, -34233, 5800, 43898, 48843, 17664, -25648, -50202, -37704, 1201, 38823, 50133, 23531, -21480, -47995, -39964, -5473, 35028, 50816, 27221, -15394, -45145, -42977, -10259, 30244, 49583, 32464, -9782, -43530, -44102, -14974, 24570, 48945, 36190, -4727, -39900, -45393, -19754, 20307, 46580, 38714, 1907, -36100, -46616, -23649, 15050, 44204, 41832, 6956, -32241, -46103, -28023, 9673, 42107, 43333, 11683, -27347, -45556, -31564, 4628, 38310, 44783, 17229, -23079, -44688, -33974, -593, 34306, 45786, 22041, -18499, -43272, -36394, -5189, 30265, 45329, 26272, -13094, -41178, -38745, -9896, 26191, 44648, 29811, -7655, -38419]
966c8419k254K6305L6474K1379j0465l5727l2908n562K2944L5256K4832n695l4132
979B028l4352r068J9336L4282K7300j238l0876l6012j3548J6953L3555K7931L301
992C9592k6708l7618j7463J4163L2072K9154P275k3494l7341k0558J0014L0256
1004f56L1121J0328k0435l5967k3398N389K8662L2081J3285j6074l4932k7102
1016c7698K096K7209L1504J6347j1070l4407l0270n00K5113L0736J9260p336l2677
1029a693l1266m775K1765L1726K1141m675k8762l2004j0731J9227L2472K2221
1041C4646r24k4991l4074j4517J7075L0771K4112L905k3499l4902j6185J2918
1053b5665K9031K6921O241k1025l2911j9961Q197K9291K7459P793j5482l1930
$$ y = [-38419, -40673, -14368, 22106, 43485, 33020, -2707, -35615, -41177, -18233, 17023, 41855, 36160, 2028, -32324, -41392, -22056, 12226, 39526, 38288, 7412, -28600, -42148, -25195, 8360, 36291, 39592, 12884, -24734, -42197, -28034, 4038, 33192, 40467, 16973, -20368, -40926, -30912, -656, 30465, 40793, 20358, -15609, -39007, -33618, -4956, 27125, 40410, 24336, -10596, -37698, -35602, -8393, 23111, 39458, 28388, -6019, -36289, -36789, -11676, 19060, 38320, 30984, -1693, -32959, -37734, -15969, 15757, 36898, 32223, 3461, -28543, -39274, -20047, 12425, 34646, 33722, 8731, -25343, -39860, -22785, 7986, 32098, 36003, 12504, -22398, -38583, -25665, 3366, 30287, 36528, 15503, -17408, -37369, -29172, 119, 27578, 35371, 19889, -12041]
1065a2041k4841N339K8182K7116J1903j1984l2050k6446J760K4884K9243J4983
1077C6048j0634k9858k6991l430K2641L0576J6397p685k6800k8461p798K0263
1089a5732L0390J8206l668k4185l0450j1281J7955K9402K0394M95k2856l1481
1101b2811j3075J3920K8199K3972K254k1669k8885j6533Q607K9409K5084L015
1113C1487j6524k8206k1582O914K8099K4118Q328j3435l0330k1701L917K3595
1125e320K7545J1901j3886k7554k2278k080K2990K9127J1662r739k4659k5929
1137b8220m397K1319K7301J5111n601k4544k6355p303J7110K8069J8283l657k2602
1150D514k7013j0823J4726K7967K0126r94k1232k6667j2983J0790K7603K1838
$$ y = [-12041, -36882, -31543, -3361, 23755, 35658, 23674, -8376, -34822, -33062, -8178, 21065, 36048, 25414, -4444, -31435, -34865, -12224, 18352, 34749, 27064, 264, -28197, -35995, -15732, 14658, 32864, 29196, 5011, -25439, -36720, -18765, 10637, 31031, 31526, 8670, -22811, -35886, -21966, 6233, 30205, 32459, 10790, -18095, -34628, -26021, 3388, 28472, 31487, 14963, -13243, -34825, -27911, 188, 24306, 32634, 19199, -11131, -32832, -28915, -5320, 22225, 34126, 20240, -7314, -29592, -31672, -8682, 20445, 32107, 22368, -2291, -28220, -32617, -11298, 16003, 31114, 25513, 969, -25386, -32689, -15579, 12490, 30773, 27116, 4514, -22499, -33322, -18596, 9371, 29497, 28503, 7271, -19396, -32379, -21589, 6014, 27852]
1162B7852N74j7709k5795j7222Q502K6478K1524N334j4345k8001j8200N869K2592
1175b547K4895R303j5161k5971j9017jK3039K7142Q174j1375k3133k3253j464
1188b9369K2218K4221J1727o798k4363k2963l289J6517K5549J6096o478k1907
1200A161k2658r101J4769K7383J6520l263j9771k5093j0868J3501K5606J8696
1212B6882o53j9150k4160j2491R520K5056J9979J262j5934k3800j5277O526K3224
1225I84K1718M970j4747k3324j6788K041K2474K4488N823j2507k2072j9861K92
1238b6509K2026K3118Q756r486k3008j9620j208J7221K4113J2608r232k0603j8989
1251b0813o917J5124K6356J2865o126j7847k2175r224J4391K4528J5525k572j8853
$$ y = [27852, 28426, 10717, -15078, -32300, -23798, 2680, 24204, 29538, 15193, -12808, -31008, -25139, -2547, 22348, 31651, 16490, -9481, -28498, -28499, -5460, 21682, 29856, 18481, -4652, -27905, -29369, -7151, 17070, 28797, 21999, -2364, -25327, -28616, -12099, 13450, 29546, 23068, 1161, -21497, -30598, -15829, 11554, 28074, 24811, 5040, -20053, -30921, -17420, 8186, 26882, 26229, 7079, -17081, -29572, -20052, 5004, 24983, 26245, 10311, -13489, -28766, -22240, 984, 22702, 27672, 12925, -10399, -27187, -25146, -2672, 21816, 27639, 15132, -6940, -26801, -26509, -4483, 18635, 27391, 17905, -5103, -24723, -25931, -8710, 15403, 28011, 18779, -1824, -20813, -27730, -12606, 13750, 26615, 20489, 2642, -19533, -28757, -14366, 10162, 25687, 23115, 4262]
1264D262k2004r559J0081K3794J8827j670j7471k0558j2363O960K3455J9421J217
1277B4392j4750k1229j4453M622K1508K0982M529j3353k1299j5930J918J9981
1289c082K2077P116j1684k1231j6503m91J7229K3188R810j0503j9918j6774m090
1302b4856J5176K3816J1545p553j8794j8827n814J3545K2436J4280m153j9385
1314A416j9510o507J0224K1747J7163k724j8293j8715r195P539K1755J8018m82
1327B2436j5795j9474j1444N877K0300J8897L102j4525k0505j2230L883J8009
1339a469K0378O007j3582k0325j2906J127J6384K1474P713j1517j9332j4652j222
1352b1922J5318K1040R805q312j9207j6560k434J3186K0542J2658o155j9134j6794
$$ y = [4262, -17742, -27301, -17220, 6574, 25401, 23731, 6260, -14298, -26661, -19701, 3754, 23175, 24392, 9642, -11587, -26040, -21418, 90, 21072, 25601, 12248, -9051, -24981, -23063, -3082, 18995, 26111, 14427, -6804, -23307, -23798, -6569, 16619, 26429, 15926, -3992, -20766, -24856, -9680, 14136, 25681, 18128, -666, -19493, -25307, -11762, 10674, 24954, 20801, 1416, -18094, -24601, -14377, 7370, 24533, 21809, 3516, -15199, -24394, -16855, 4900, 22918, 22436, 6641, -12833, -24277, -18400, 1900, 20797, 23899, 9374, -11131, -23361, -19478, -1469, 18909, 24916, 11334, -8991, -21897, -20770, -4386, 17088, 24801, 13284, -6048, -20700, -21922, -6604, 14436, 24241, 15929, -3278, -19838, -22272, -9086, 11456, 24114, 17959, -1175, -17969]
1365a7969m541J0827K0791J4334m340j7688j7551o651R305J9961J5521j511j6490
1378C998j8199q209P082J8897J6904J057j4779j8847j0101N409J7757J7696L814
1391B2479j3372j9289j1096L245J6166J8950N733j1997j8315j2747P74J5517J8962
1404A5010P270q913j8460j4523j83J3533J8401J0413p177j8609j4680k322J1221
1417i019J9308J1794n594j6883j5890m800J0498J8548J2779k434j6328j7012n621
1430b0654Q219J7463J5057q27j5331j6613p856O122J7350J5567J551j3346j7815
1443a1113r212N141J5417J6441M409j2555j7750j0014K549J4521J7451N523j0167
1456A0641j7279j2197J265J3559J6787Q160q053j7887j2600k74J1283J7468J0128
$$ y = [-17969, -22510, -11683, 9108, 23442, 19102, 1414, -16137, -22788, -13483, 6478, 21999, 20488, 3998, -14201, -22410, -15328, 3569, 20473, 21530, 6751, -12096, -22197, -16788, 969, 18665, 22479, 9107, -10182, -21278, -18033, -1867, 17083, 22816, 10819, -7496, -20243, -19469, -3952, 15010, 22280, 13367, -5093, -19616, -19799, -6266, 12135, 22548, 15371, -3238, -17918, -20240, -9019, 10289, 22083, 16489, -394, -16284, -21084, -10586, 7962, 20741, 18307, 1979, -15033, -20654, -12435, 5028, 20085, 19258, 3927, -12686, -20542, -14420, 2930, 18497, 20048, 6702, -11113, -20325, -15184, 233, 16674, 21083, 8528, -9222, -19236, -16687, -2166, 15285, 20808, 10641, -6638, -18835, -17570, -4011, 12776, 20936, 12883, -5004, -17604, -17878, -6595, 10873, 21001]
1469B1001o921j6572j3609k778J0657J7092J0832l759j5948j5377l393R045J5767
1482F037J3080j618j5682j5429n117O991J5999J3722L4j3501j6339p247O372J4727
1496B029J4105K927j2410j7068p954M371J3728J5257M391j0879j6599r938K815
1509a5225J3300J4832O340q422j7102j1232J912J1572J4969Q416o978j6510j2261
1522a6389k44J0883J5222Q981m566j5471j4017j619J0105J4267J0614k263j5168
1535C35j4564l008Q143J4437J1754r83j3478j4983n429P323J4227J1694J422j1808
1549E082j6113o675O199J3075J2609L292j0575j5973q292M397J2847J3037M611
1562A7521q654j5935r991L101J2137J3196O032o996j5359j1275J170J1466J3583
$$ y = [21001, 14080, -2492, -16101, -18879, -8222, 8870, 19702, 15943, -5, -15382, -18775, -9730, 6037, 19117, 17499, 1817, -13612, -18729, -11738, 4261, 17983, 18017, 4516, -11823, -19070, -12698, 2029, 16134, 19061, 6651, -10417, -18371, -14000, -272, 14985, 19376, 8497, -8102, -18040, -15225, -1925, 12907, 19247, 10825, -6277, -17509, -15597, -4025, 10944, 19360, 12382, -4128, -16389, -16633, -5750, 9472, 18453, 13887, -1584, -15601, -17220, -7115, 7152, 17766, 15503, 335, -14229, -17237, -9094, 5343, 17097, 16114, 2636, -12347, -17776, -10453, 3774, 15468, 16890, 5082, -11031, -17706, -11507, 1568, 14177, 17469, 6894, -9079, -17371, -12974, -127, 12910, 17521, 8867, -7068, -17059, -13958, -1821, 11375, 17407, 10411, -4948, -16223, -15053, -3587, 9996]
1575I996O877m967j4560j2652n19J0736J3181Q319l096j4034j3444k009R247J3487
1589F562R454j903j2808j3931m113Q383J3531R789k49j1256j4655n569P260J2734
1603C229J0516J590j0110j4610o985N241J2467J1471K918q787j4458q690L701
1616a2507J2253J2004M026p288j4220r896K319J1585J2056N204n682j3711j0846
1629a4703Q09J0404J2211O603m199j2922j1679j221R246J2837P639k965j1955
1642A05j2415l057Q572J2890Q207j396j1119j2927m203P378J2155R240P9j0078
1656C431j2939n581N667J1928J0036J404q707j2973p391M282J1815J0611K579
1669A4162p320j3053q611L150J1278J0812L785o123j2689r310J557J0185J1167
$$ y = [9996, 16873, 11906, -2654, -15306, -15825, -5089, 8092, 16411, 13315, -719, -14163, -16172, -6925, 6562, 16016, 14113, 1305, -12626, -16739, -8356, 5175, 14964, 14715, 3459, -11196, -16765, -9505, 3229, 13745, 15335, 5225, -9385, -16370, -11129, 1338, 12809, 15727, 6940, -7518, -16208, -12507, -254, 11750, 15776, 8488, -5732, -15628, -13309, -1724, 10332, 15536, 9854, -3857, -14703, -13894, -3490, 8721, 15324, 11125, -1797, -13476, -14697, -5451, 7386, 15025, 12060, 105, -12310, -15367, -6795, 6095, 14302, 12906, 1787, -11140, -15343, -7965, 4190, 13430, 13509, 3431, -9508, -15089, -9422, 2506, 12542, 13946, 5239, -7734, -15125, -10843, 972, 11583, 14162, 6842, -6211, -14822, -11672, -394, 10418, 14203, 8080, -4609, -13919, -12362, -2177, 8990]
1682H990N055m872j1927j0047m95R430J1736N940l370j1198j1400j872Q987J1537
1696F494O773j901j0658j1895k832P752J1186P741q92r621j1501m650N961J1573
1710C530Q422J23p957j1839o604M933J1653Q916J438p051j2179p448L912J0876
1724G25R572K697o559j1711p824K213J0018J0171L361n146j0625r134J13R796
1738b333J0451M256l424j0202j0564j005R090J0644N529k604j0165j0510k166
1751a3003P750J1217O238k314q880j0135l905O397J1280O751j053p516j0568n441
1765a3182N256J0922P666N83o927j0933o483M176J0478Q640J681o793j0617o796
1779a2329K349J0072R670J782n883r272p905N04R945R634K621m075r183r033k18
$$ y = [8990, 14045, 9173, -2754, -12801, -13296, -3866, 7870, 13810, 10440, -758, -12158, -14030, -5043, 6494, 13267, 11366, 708, -11187, -14019, -6267, 4919, 12660, 11768, 2147, -9354, -14004, -8043, 3530, 11952, 12075, 4118, -7721, -14325, -9392, 2261, 11177, 12615, 5564, -6615, -14063, -10151, 725, 10297, 12994, 6435, -5276, -13100, -10887, -869, 9302, 12663, 7517, -3108, -12242, -12129, -2333, 8118, 12374, 8950, -1252, -11816, -12821, -3731, 6913, 12442, 9838, -327, -10837, -13003, -5253, 5964, 12202, 9888, 1008, -9127, -13032, -6635, 4645, 11396, 10343, 2827, -7741, -13182, -7926, 2996, 10662, 11245, 4318, -6615, -13098, -8922, 1556, 10196, 11877, 5084, -5533, -12329, -9980, 92, 9762, 11544, 5661, -3611, -11516, -11012, -1067, 8567, 11188, 7113, -2070, -11103, -11321]
1794a1321Q606R745M696l540r530q616j690P074J0917N580l535q467q779l244
1808a2104O568J0967N609j996p637r392l928N470J0053O985p18p443r275m810
1822a1651L971R890Q004J69o931r116n628K560R634Q849Q80o395q649o389J243
1837i559R324R087J683n050q732p183O39Q172R005L625m370r193o954n79O676
1852c409R972M586m213q104p427k321O570J0105M641k639p404q367k754N635R209
1867D080O092j392p738q033l410L833R423P228j059o924p900m628L027R095P547
1882I241K62o181q277n075K006Q389Q110J296n516q086n864J040P900Q214K496
1897I955m601q291o192K23O681Q785L589m254p799o261j384O242R208L901l211
$$ y = [-11321, -2715, 7030, 11726, 8186, -1344, -9960, -11650, -4576, 6341, 11921, 8386, -81, -8860, -12104, -5536, 5431, 11040, 9044, 1407, -7985, -11913, -6443, 3610, 10595, 9877, 2434, -6841, -11651, -7680, 2210, 10214, 10383, 3452, -5664, -11292, -8732, 902, 9751, 10631, 4236, -4413, -10802, -9559, -235, 8852, 10535, 5485, -3247, -10430, -9791, -1619, 7386, 11011, 6641, -2552, -9506, -10085, -3409, 6563, 11149, 6936, -1168, -8595, -10916, -4346, 5759, 10400, 7761, 357, -8010, -10764, -5129, 4080, 10172, 8780, 1042, -6991, -10401, -6568, 2855, 10083, 9024, 2100, -5800, -10428, -7401, 1694, 9241, 9503, 3322, -4955, -10030, -8024, 365, 8475, 9771, 4255, -3831, -9695, -8655, -755, 7459, 9955, 5354, -2937, -9129, -8906, -2225, 6560, 10149, 5895, -1904, -8165, -9549, -3307, 5901, 9802, 6591]
1912F591p090p323j839N705Q421N056j847p473p195k339L998Q559O264j501o790
1927A197p066l735L389Q616O319l38n944p673m103K659P670P158P49n779p373
1942d254m547J389P235P653J560m994p392n152O80O521P897K732m408p435n300
1957g815m01N748Q316L413l683o988n944j090N162P995M376k597p043o174j587
1972h312M077P739N452k012o740o112k522L306P821N737j015o146o612l025K756
1987e608P045O364K63o017o710l316J722O580P031R06n338o726l978J060O231
2002d91O939J981m607o940m386O05N382P172K917l999o822m775j39M849P040L618
2018H344k993o797n168o65M144O914M441k176o659n403j376L517O834M859j251
$$ y = [6591, -499, -7822, -9661, -3956, 4465, 9521, 7674, 201, -6994, -9333, -5335, 3224, 9488, 7987, 1197, -5869, -9604, -6215, 2401, 8720, 8382, 2438, -5235, -9338, -6679, 991, 8149, 8898, 3119, -4254, -8801, -7412, -177, 7476, 9036, 4042, -3350, -8502, -7822, -1301, 6596, 9328, 4920, -2515, -7815, -8216, -2468, 5848, 9261, 5578, -1410, -7354, -8444, -3282, 4713, 9089, 6492, -551, -6725, -8312, -4235, 3504, 8956, 6944, 204, -5908, -8430, -5124, 2697, 8434, 7419, 1273, -5339, -8364, -5608, 1437, 7801, 8064, 2047, -4663, -7979, -6257, 323, 7354, 8260, 2922, -3804, -7782, -6722, -491, 6448, 8429, 3822, -3118, -7504, -6899, -1517, 5655, 8572, 4573, -2249, -7024, -7163, -2314, 4726, 8344, 5351, -1446, -6614, -7279, -3135, 3779, 8220, 6044, -615, -6018, -7394, -3877, 2957, 7816, 6565]
2033F565o223n964j754L044O223N408k31n904o153k287K330N983N808N30n273
2048B102o325k997J870N535N876J538m576o612l471J393N023O128K186l893o613
2063b836l905P15M692O027K926l085o567m430K35M111N979L606k373o255m952
2078f112l51L773N869L928j424n928n400r65L384N592M369n85n612n630j542K773
2094c861N495M633Q7m936n931k239K497N109M923Q75m371o085k781J927M840N113
2110E295J481l839o070l271J288M626N159K072l110n963l918Q38M202N184K753
2125F727k528n741m353J50L966N210L049j672n630m753l11L513N080L495r74n309
2141h1m946r66K984N069L889m81m666n255j692K706M857M009M07m239n575k085
$$ y = [6565, 342, -5622, -7376, -4332, 1891, 7299, 7068, 1164, -4989, -7276, -4946, 1037, 6845, 7375, 2102, -4223, -7220, -5350, 185, 6061, 7599, 3023, -3589, -7060, -5667, -644, 5484, 7670, 3777, -2836, -6741, -6026, -1334, 4693, 7619, 4534, -2033, -6463, -6228, -2117, 3862, 7468, 5095, -1160, -6112, -6463, -2690, 3179, 7107, 5683, -245, -5645, -6610, -3226, 2366, 6735, 6150, 538, -5092, -6634, -3861, 1634, 6267, 6354, 1418, -4513, -6752, -4255, 854, 5777, 6652, 2281, -3804, -6585, -4658, 182, 5295, 6776, 2937, -3133, -6404, -5116, -490, 4669, 6741, 3631, -2332, -6250, -5412, -1210, 3974, 6727, 4199, -1542, -5895, -5745, -1779, 3431, 6480, 4808, -822, -5575, -5886, -2373, 2707, 6202, 5228, -81, -5027, -5993, -3009, 2060, 5949, 5468, 802, -4453, -6145, -3439, 1418, 5427, 5834, 1595, -3980, -6065]
2157f065K191M619M341R27l816n538k668J667M504M560J228l153n451l281J271
2172d664M190M502J912k423n485l673O73L877M551K361j755n308m186J52L600
2187a676M618K848j306n067m393m94L294M648L042q16m433m785j076L015M427
2202A846L190O7m068n059j461K447M162L712N16l712n154k076J943M370L850P20
2218E293l096n043k833J680M292L658J253k319n133l241J255L887L821J766j952
2233C288m832l551M77L593M189K014j465m589l983r6L567M241K042r16m129m372
2249d522n55L307L982K378k47l758m687r97K708M055K829L3l451m542j771K202
2265c036M285L112J25k824m582k403J979M238K983O23k368m521k736J442L861
$$ y = [-6065, -3874, 745, 5086, 6013, 2197, -3341, -6009, -4342, 162, 4722, 5950, 2797, -2654, -5935, -4664, -474, 4028, 5940, 3517, -1968, -5641, -4968, -1091, 3460, 5821, 4066, -1242, -5428, -5276, -1676, 2942, 5790, 4484, -583, -4976, -5470, -2176, 2472, 5514, 4698, 265, -4520, -5596, -2581, 1846, 5036, 5103, 1035, -4024, -5485, -3038, 1124, 4836, 5352, 1640, -3514, -5590, -3647, 723, 4573, 5293, 2197, -2846, -5679, -3999, 293, 3951, 5204, 2885, -2248, -5489, -4234, -347, 3474, 5240, 3288, -1544, -5095, -4618, -1025, 3164, 5178, 3713, -876, -4859, -4955, -1388, 2853, 4895, 3979, -150, -4522, -5077, -1770, 2212, 4590, 4343, 585, -4102, -5099, -2391, 1664, 4493, 4526, 1075, -3467, -5238, -3036, 1249, 4361, 4486, 1662, -2920, -5323, -3344, 894, 3877, 4500, 2132, -2389, -5125, -3683, 178]
2280A78L294J178k028m377l025O84L634L831J326j821l979l446k7L803L901J362
2296D488j303l595l928k47L395L686J796p92l458l872p43K606L868K405n13l208
2312E85l920j520K257M286K555l58k829l991j988K018M212K624M1k503l976k132
2328d639J525L682K985M84k205l612k565O64L505L568Q11j894l529l060K55L537
2344d88L701R76j564l498l212l9L286L540J336j147l344l133n00K583L673J864
2360D034r49k953l245j167K174L949K105o17k635l535j641K084L787K429k42k637
2376I41l537j650J570L492K811J0k384l226k010Q82L455K972L70j966l146k575
2392c991M67L376L229P34j670l226k730J53L064L308J119j449l065k697l05K611
$$ y = [178, 3472, 4650, 2622, -1755, -4780, -4096, -462, 3369, 4695, 2874, -1105, -4551, -4578, -775, 3126, 4488, 3185, -410, -4338, -4585, -1190, 2496, 4292, 3500, 42, -3830, -4573, -1967, 1901, 4306, 3793, 585, -3335, -4855, -2598, 1688, 4243, 3885, 1056, -2935, -4923, -2905, 1307, 3931, 3972, 1469, -2507, -4639, -3114, 568, 3553, 4037, 1832, -1780, -4345, -3681, -176, 3392, 4203, 2309, -1220, -4280, -4025, -488, 3213, 4189, 2625, -873, -4085, -4124, -838, 2702, 4038, 2891, -453, -3586, -4086, -1503, 2170, 4034, 3085, 132, -3113, -4280, -2106, 1843, 3948, 3331, 696, -2839, -4480, -2396, 1391, 3820, 3578, 941, -2596, -4246, -2676, 816, 3627, 3637, 1253, -1973, -3983, -3101, 354, 3326, 3696, 1730, -1416, -3991, -3524, -148, 3081, 3815, 2145, -1081, -3811, -3658, -594, 2714, 3833, 2384, -681, -3378, -3683, -1072]
2408a072L360J466j182k811k807q32K267L536J718q50k529k990j316K105L505
2423A568K003m40k529l051j380J534L382K352k01k369k832j685R67L272K641K5
2439C257j966k785k051N66L196K754M13j809k765k214J94K903L036P15j586k739
2455h81k236j86K531L208J004j388k571k292o16K154L246J440j087k422k516q35
2471c447J817L260J796q41k424k436j149J509L106K099n77k254k431j364J119
2486b217L048K257k46k080k423j434N80K825K614J54k053k360j715L40K633K724
2502B647M41j722k514j716J32K152K953Q33j597k412j803l16K018K929J151j296
2518A880k363j951m69J643K833J623j009k389k067o22J280K833J896p94k209k032
$$ y = [-1072, 2288, 3754, 2572, -239, -3046, -3878, -1611, 1925, 3643, 2793, 264, -2726, -4042, -1937, 1568, 3571, 3131, 602, -2449, -3829, -2295, 1087, 3439, 3238, 869, -1963, -3648, -2681, 591, 3232, 3257, 1291, -1494, -3545, -2979, 217, 2971, 3384, 1575, -1190, -3404, -3210, -307, 2729, 3444, 1858, -881, -3117, -3303, -772, 2436, 3440, 2052, -519, -2811, -3427, -1273, 1973, 3413, 2326, -96, -2612, -3447, -1630, 1630, 3426, 2585, 161, -2275, -3424, -1915, 1191, 3290, 2713, 459, -1972, -3336, -2217, 831, 3088, 2842, 762, -1661, -3095, -2515, 310, 2924, 3078, 1025, -1335, -3050, -2710, -77, 2647, 3088, 1366, -1148, -2864, -2732, -580, 2373, 3206, 1609, -803, -2606, -2922, -904, 2025, 3176, 1880, -483, -2434, -2903, -1260, 1573, 3196, 2187, -202, -2269, -2891, -1611, 1222, 3118, 2324, 115, -1917]
2534a917r64J012K816J970l26k151k247r25P10K422K335P5k147k184j167M04K350
2551F6K449L55j814k319j403L37J955K487Q39j651k382j397N0J747K587R64j242
2568A628k319j660j49J637K432J333j003k398j670k82J225K401J697p58k291j737
2584a914o26J113K312J781m03k110j933p42R72K044K032j0k061k068p60N19K049
2601A95K113K12j748k121j072N10J820K124O30j477k326j183K80J591K268Q28
2617B644j331k115j405N9J474K185J085r65k149j600o4J259K095J399o73k212
2633c14j631l25J123K094J462l27k045j825m88R18J977J688q0j873k014o09P36
2650a533J888J815J82j711k028p84M73J721J833N89j527k089r94M27J458J979
$$ y = [-1917, -2881, -1869, 947, 2917, 2591, 440, -1807, -2732, -2022, 400, 2735, 2810, 663, -1521, -2688, -2284, 66, 2515, 2870, 1056, -1263, -2666, -2329, -374, 2113, 2952, 1301, -1081, -2478, -2428, -681, 1906, 2870, 1628, -691, -2351, -2500, -863, 1569, 2902, 1899, -499, -2169, -2451, -1226, 1175, 2872, 2114, -177, -1914, -2540, -1427, 885, 2666, 2263, 153, -1780, -2522, -1550, 494, 2526, 2516, 455, -1613, -2373, -1854, 195, 2308, 2520, 772, -1349, -2421, -1911, -91, 2033, 2663, 1186, -1140, -2323, -2043, -452, 1816, 2644, 1313, -802, -2207, -2148, -674, 1511, 2596, 1631, -518, -2118, -2182, -923, 1172, 2571, 1898, -314, -1945, -2270, -1147, 947, 2409, 2082, 37, -1788, -2276, -1358, 619, 2307, 2227, 354, -1660, -2269, -1533, 355, 2170, 2352, 641, -1387, -2171, -1698, 23, 1856, 2445, 918, -1171, -2165, -1738, -280, 1699]
2666A699P73j353j999j180J63J412J907J027j009k079j334K3J303J799J225p13
2682A664k030j472j17J011J817J372m05j961j621k80R39J678J538j36j774j809
2698a586m00P66J612J527J95j655j826o34O45J465J568M79j360j986q50O55J297
2715h8J558P47j221j953r79L50J236J723Q34r97j865j251J75J291J562R85n53
2732A554k011j446J56J102J468J191l58j799j614p7R80J515J221j02j655j638
2748a513l68Q62J411J317J21j301j892o10Q69J341J273M01j146j987p34P65J218
2765B7J317O57j073j871r00M62J229J400O78q14j716j211K42J328J156R15m69
2782A357j701j479J99J136J326R42l44j635j465j7J013J378R50j19j395j578l89
$$ y = [1699, 2472, 1119, -880, -2060, -1897, -485, 1422, 2449, 1440, -639, -1973, -1950, -647, 1152, 2377, 1664, -366, -1838, -1955, -944, 873, 2245, 1840, -121, -1742, -2022, -1083, 595, 2133, 1997, 223, -1586, -1986, -1220, 392, 1919, 2114, 459, -1367, -2001, -1356, 109, 1677, 2156, 796, -1190, -2040, -1385, -88, 1470, 2217, 996, -957, -1936, -1586, -350, 1373, 2207, 1210, -655, -1906, -1731, -440, 1122, 2107, 1554, -457, -1903, -1747, -645, 823, 2014, 1656, -143, -1757, -1834, -854, 661, 1882, 1780, 125, -1513, -1881, -1019, 392, 1709, 1830, 529, -1363, -1973, -1104, 237, 1510, 1911, 765, -1222, -1956, -1191, 27, 1344, 2001, 928, -943, -1843, -1381, -152, 1248, 1926, 1112, -604, -1815, -1573, -245, 911, 1826, 1357, -344, -1823, -1624, -488, 838, 1780, 1436, -199, -1664, -1681, -668, 710, 1660, 1541, 146, -1432, -1821]
2799a821R91J346R77J16j209j657o37R45J331J008L32j048j737p91P44J266J167
2816A323M29j020j563r16L87J384J200M18o35j566j189L38J286J178N23l94j510
2833c27j302J32J160J165Q24l90j465j286j15J050J282P77j54j268j474k56R26
2850g21J305Q19Nj017j593n43Q83J302Q90J80r71j554o83P20J239J051K05q37
2868F80j460r05N47J223J028L67o21j407j065M63J091J064M31l69j406j230J47
2885a422J097J160O50l41j322j251n3J041J204N57j30j132j353k11R90J115O55
2902A254l6r33j320m87P66J161Q02P7q32j352o60O22J241R07J21p32j359p79N17
2921a022J229Q17K03m99j252r61L76J105Q70L64l44j151j091J3J079J149L62k66
$$ y = [-1821, -830, 516, 1493, 1609, 400, -1257, -1894, -949, 382, 1390, 1722, 674, -1063, -1854, -1110, 156, 1323, 1752, 732, -831, -1747, -1360, 24, 1224, 1642, 1007, -559, -1748, -1410, -124, 1054, 1577, 1183, -327, -1629, -1497, -337, 828, 1652, 1262, -203, -1489, -1604, -554, 728, 1505, 1351, 83, -1391, -1647, -721, 584, 1403, 1408, 391, -1202, -1745, -862, 440, 1330, 1510, 539, -1015, -1698, -978, 261, 1312, 1517, 680, -780, -1685, -1138, 85, 1113, 1480, 859, -548, -1613, -1150, -59, 1005, 1436, 1067, -339, -1569, -1422, -325, 835, 1485, 1144, -178, -1429, -1482, -441, 763, 1320, 1190, 58, -1295, -1506, -516, 599, 1254, 1218, 285, -1035, -1522, -756, 405, 1207, 1284, 452, -900, -1560, -938, 303, 1210, 1331, 599, -760, -1539, -1022, 207, 1024, 1227, 728, -524, -1485, -1109, -4, 866, 1230, 886, -265, -1356, -1343, -264, 885, 1247, 981]
2939I81j069j231j38J079J152M39j58j042j174j96Q46J150M60k9q31j211m04P07
2957f69J107P31o6n70j290o56N32J241P16P2n56j181q34M44J212Q12P9n35j053
2976d64q40K56J032R11K45m24j003r42l8J130R35L36l27p69j216j39R90J007L88
2995A068j81p62j056l82Q07J046N94j83p57r98m80N53J211N70q4n94r66p17M86
3014h25J132O59J1n19r54q35L36J133P90P9m75r30p79P3J094Q82J74m08q25q53
3034a040j49J007J069J02k80p20r33l09R05J018M09k96p03r22l95O74J109N09
3052A055k84n63q38n83N09J104O58j40n87q97o47M21J042P54o1n13q88o52J70
3071i40R84R01O8m75q93o63lR68Q52K19m45p40q19j06Q52J005K68l97o62q21l32
$$ y = [981, -88, -1319, -1457, -378, 774, 1213, 1055, 13, -1161, -1357, -511, 639, 1099, 1070, 239, -972, -1376, -669, 438, 1169, 1103, 533, -757, -1413, -881, 360, 1076, 1148, 592, -589, -1423, -979, 233, 1045, 1124, 589, -464, -1304, -1048, -16, 895, 1140, 716, -287, -1229, -1267, -137, 798, 1134, 807, 38, -1178, -1317, -327, 680, 1068, 887, 125, -931, -1313, -506, 540, 1134, 951, 194, -804, -1284, -731, 480, 1050, 966, 372, -594, -1311, -825, 307, 966, 977, 458, -496, -1331, -995, 138, 928, 1007, 532, -398, -1177, -1104, -10, 872, 1046, 638, -187, -1040, -1189, -182, 887, 989, 709, -11, -944, -1253, -348, 670, 1079, 783, 80, -842, -1237, -563, 546, 1055, 771, 208, -630, -1213, -704, 400, 1058, 918, 331, -566, -1213, -792, 250, 1004, 943, 430, -458, -1110, -940, 44, 945, 1013, 538, -355, -1018, -1021, -53, 799, 1018, 573, -167, -986, -1092, -240, 765, 1033, 636, -26, -847, -1179]
3092a179Q36R76M41l20o94q66l51O26J032N58k75o44q32l95M01J082O95k79n87
3111B25q03n69M03R46P68j14n43p47n94J79R01P89R1n15p56p04J02Q62Q43K32
3131I96n22o32p33j09P21J047J93l53p25o92k34O37J049L38l01o26p49l27M96
3150e26J086M11k43n96o64m83L37J029O30k40n37p48m94K43J044O43n2n78o39
3169c77n33O4Q95Q24lm66o71n89p1P70R71N5m64n62o01j76O29J015K76n25n72
3190a11o07j80M29J009M47l86o07n78l64L77R71N66l02n70o22m24L22R18O30k00
3210G18n64o57l80J72Q66P27n0n86o73m07K9Q12P89M0m80o99m41r2P45Q81J83
3231I33n36o15m67j88O02R60K40m19o83m93j74M24R55M58m07o79m88k46K96Q34
$$ y = [-1179, -343, 633, 1074, 754, 60, -806, -1157, -531, 501, 1059, 784, 140, -692, -1087, -686, 396, 1091, 812, 225, -578, -1147, -744, 202, 970, 856, 313, -434, -1028, -849, 52, 841, 932, 417, -339, -1043, -941, -79, 764, 996, 474, -158, -891, -1000, -279, 768, 961, 608, -117, -809, -1043, -406, 643, 981, 680, 54, -695, -1022, -526, 560, 971, 728, 132, -532, -1015, -678, 351, 981, 741, 204, -544, -1038, -795, 249, 892, 840, 262, -377, -910, -846, 49, 873, 870, 404, -267, -856, -927, -157, 814, 869, 405, -157, -758, -934, -305, 710, 986, 461, -111, -718, -898, -469, 540, 987, 601, -6, -584, -948, -571, 400, 966, 664, 94, -528, -952, -630, 288, 918, 718, 154, -503, -883, -711, 155, 882, 832, 246, -427, -834, -805, 7, 796, 836, 356, -343, -784, -876, -131, 750, 933, 397, -218, -685, -873, -271, 689, 929, 510, -173, -666, -840, -416, 539, 997, 590, -89, -577, -823, -527, 307]
3251C07O70l49p12m40l46K55Q39O66r8o36o42l46J64P33P63jo51o50k73J5O96
3272c6Q41N0o61n24l73j6N65Q32K10m75n94m84j07M27R15L81l99p14n09r0M34
3293c27Q16L92k96o94m65j60K52P97N96k36p53m63k31K85P52N94r5o25o44k38
3313g43K27N65P59L8p16o13k68J30N21Q09J48o30n88l66K2N84P75J76m44o45l80
3334f39lM11P57L77m13o50m61k3L33P20M33k58p15m72r8L42N85O27j31p35n55
3355e68j37K48N93P09j31o56o07r6J30O20O45L0o54n58k41J23N15O92J31m77p27
3376d16k68Q2M87O55K74l87p22l51J1L47P72L99m22p04l40p7L50P16M63k91o99
3397a21n02n5L65N57N22o2p79n53j5J76O20O39k9p33n85r0J42N48O71J01o23o81
$$ y = [307, 977, 628, -84, -524, -870, -615, 224, 890, 792, 156, -486, -832, -668, 65, 828, 827, 176, -474, -747, -732, -36, 805, 855, 194, -330, -703, -719, -154, 678, 888, 413, -181, -665, -772, -345, 570, 951, 552, -162, -671, -761, -327, 489, 881, 585, -109, -574, -734, -482, 315, 911, 675, -78, -541, -772, -487, 265, 859, 764, 139, -505, -743, -516, 49, 808, 846, 130, -483, -751, -621, -100, 709, 857, 227, -361, -727, -705, -121, 654, 830, 386, -259, -639, -642, -231, 526, 903, 490, -160, -621, -644, -311, 409, 842, 584, -131, -603, -701, -359, 226, 853, 722, -13, -568, -705, -457, 136, 845, 714, 58, -549, -645, -515, 105, 750, 780, 126, -432, -673, -550, -35, 657, 788, 311, -416, -684, -602, -115, 540, 814, 427, -295, -646, -635, -288, 484, 883, 461, -243, -583, -660, -310, 406, 869, 578, -121, -623, -678, -313, 244, 766, 704, -75, -628, -643, -467, 153, 792, 763, 30, -555, -645, -503, 45, 716, 817, 194, -487]
3419d87j87J42N19N83K34m81p65k45J63L97O40M09m95p88k46M6L43N90M91l92
3439D71o70m58M5K77O28N35j91p03o26J8L20N29N80np72o54J7K26M54P31j5p34
3461Cm97j66K08N23N81J47n79o53k69K34M42N41L03m51q30j79J30L78O11M33m74
3482D36q12l13R4L51O57M37l01q09m65R2M40M80M49p1p65o42O1M00M26N74N7p99
3504b3o72m3L15N23O24L7p13o04k04L09N43N35J62m69p78k74L04M51M69L24m11
3525D05q53k87K95L53N41M04m08p57l54N7M29N93L60k43p37n91O9N20M90M00m0
3546F46p39o51R4M45L63N08J0o68o64OK36O03M25J10o34o23k64L92O16M52M0l70
3568C33q05l23M01M65M57K65m37p27m08K48N12N19L03k86q31m65J52N25N83K74
$$ y = [-487, -674, -532, -13, 570, 804, 323, -442, -687, -524, -127, 513, 922, 427, -361, -607, -561, -218, 372, 863, 471, -199, -657, -612, -335, 293, 828, 637, -66, -692, -674, -354, 175, 755, 750, -22, -676, -659, -433, 21, 752, 737, 3, -494, -660, -452, 71, 652, 799, 220, -433, -702, -468, -26, 515, 818, 367, -463, -642, -512, -134, 477, 910, 436, -376, -689, -595, -244, 413, 850, 549, -260, -725, -633, -193, 287, 736, 665, -100, -742, -681, -281, 145, 719, 776, -23, -695, -738, -423, 100, 724, 761, 48, -556, -760, -451, 92, 627, 789, 320, -458, -732, -428, 23, 492, 816, 405, -448, -735, -440, -87, 454, 858, 450, -307, -661, -604, -175, 418, 778, 535, -202, -793, -724, -204, 286, 686, 646, -93, -744, -650, -205, 158, 666, 676, 8, -656, -650, -414, 189, 614, 724, 90, -533, -797, -405, 211, 663, 703, 333, -472, -795, -394, 71, 528, 793, 356, -371, -779, -531, -19, 500, 803, 517, -314, -779, -627, -102, 481, 755]
3588G55k13p16n70P1N40M57L67op76o15N0M62M84L43N5o98o23r7L76N84M53o5
3610F18m72o54k20L18O39L46J30m05p64l18L76N09M30K21l90q11l41K78N53M55
3630D98K61k69p56n34J96N60M65L04k22p70n55J69N41N00K80o5o82o71O3M60N41
3651C14L90q2n35p45j09M77N22M34j4m83p41k23N16N45L08J16m45p40l94M47O14
3672A72L22K18l00r02l36K97N59M94J77k36p97n07J73O49M96K03k19o65o37J68
3692f71N90M83K38l6o64o90l6O08N08L08m3n57p19j49O08O07L26m3m84p80k34
3713h30M93O43L20kl68p77l59M50O09M35J02l75p36m53K52P43M81L8k55o63o04
3734h56J85P44M73R6k17n98o56J37O86M72K20k02o55n58RO08N81J93j91m59o72
$$ y = [755, 542, -174, -744, -673, -133, 324, 691, 685, -91, -706, -656, -194, 290, 633, 688, -10, -633, -730, -354, 230, 683, 618, 146, -508, -728, -410, 229, 575, 705, 300, -464, -782, -406, 103, 533, 754, 364, -447, -788, -510, 43, 498, 759, 490, -266, -800, -604, -44, 421, 725, 503, -267, -822, -653, -112, 388, 668, 603, -79, -750, -687, -227, 314, 704, 622, 87, -658, -767, -290, 232, 666, 652, 169, -572, -795, -279, 266, 574, 690, 245, -495, -889, -442, 172, 494, 712, 412, -490, -826, -529, 30, 524, 701, 465, -332, -839, -666, -17, 479, 682, 463, -202, -839, -671, -81, 402, 640, 604, -60, -750, -786, -178, 330, 638, 595, 38, -681, -830, -222, 385, 711, 668, 184, -596, -830, -337, 306, 626, 624, 256, -521, -880, -430, 179, 614, 716, 341, -395, -848, -596, 147, 628, 666, 411, -252, -856, -671, 73, 546, 642, 425, -173, -829, -692, -6, 466, 686, 484, -171, -729, -720, -112, 469, 662, 471, 12, -660]
3755f60j69N81P16K28j29m53p43j61M72O55L16k7m60p05l62M80O63M09n7l45o39
3776c90m87L07P03M93mk90o40n59K01P55N18qk38n64o28R1P02O39J08k63n50n80
3798f84q5O38O46K27k64m87o44j63O25P33J33j09n03o34k78M87P60L29j86l79
3818A62o39l25M35O85L37k4n20n31m03K95P59M97p3m30n27n22J67P36O38n6l54
3839C07n66n43J05P08N99J11l64n44n49%O69O82M6k56m85n63j84O58O94K33k45
3860E13n39n85k41N51P75L08k68m84o00k72L56Q42M10k27l77o77l33L30P86M79
3880G47r5m39n95m82J87Q32O12o1m68n49m85J02P02P84p8m47m88n45j5P33P02
3901F54J06l51n40m97j72O07P53K35l75n33n75j58N54Q10L02l15n85m74k83L84
$$ y = [-660, -829, -248, 468, 696, 567, 114, -629, -790, -318, 337, 653, 626, 166, -539, -901, -421, 242, 651, 594, 249, -390, -877, -570, 133, 626, 622, 332, -308, -867, -666, 89, 607, 599, 361, -203, -831, -740, -38, 601, 709, 446, -104, -684, -769, -131, 515, 742, 478, -9, -653, -816, -191, 542, 675, 566, 63, -571, -849, -362, 398, 727, 541, 162, -477, -802, -367, 318, 655, 631, 111, -420, -823, -528, 231, 728, 655, 225, -302, -824, -657, 79, 717, 661, 307, -259, -802, -697, 11, 610, 721, 357, -187, -736, -736, -67, 615, 661, 405, -80, -643, -827, -169, 525, 758, 513, -26, -611, -852, -301, 474, 782, 514, 30, -570, -842, -486, 356, 766, 539, 162, -515, -848, -518, 268, 747, 652, 213, -382, -864, -677, 155, 767, 706, 238, -311, -796, -694, 8, 792, 714, 267, -221, -766, -781, -48, 654, 760, 409, -131, -628, -800, -193, 560, 795, 420, -113, -688, -846, -292, 518, 820, 505, -80, -554, -837, -453]
3921d53Q89L45k43n31m74l80K94R09M62k56m59n97l05K14P40O61p3o71m94k67
3941f89kP56P92q2n54m93n17L4Q12O85J1l95o18m44o5O12Q02K25n07o29l76j33
3963g75M84Q11M19n42n82m56j48M37Q69L43l45n86m75l21L62Q08N18j59o31n78
3983e47j85K32O57P18j03o65n46k75K1Q15Q10j45o53n15m17Q8Q13O23O2m71p09
4004c92l34K5N70P17L37n79p18l12J8L53R49L08m98p18l33j86M74Q41L19l67o18
4025a44n42n5L89P42M93k28p40n86lK35O69O87k02p02n48j94J51P55P34j08p02
4046A01n93k71J79O96O91M7o35p53k62K11N31O66K91o02p01k93M1M98Q28K64n67
4067C67o29m62nN10P49L39m03o57n62K7M30O81M92k36p72n81n6L83O95O02j76
$$ y = [-453, 436, 781, 538, 7, -467, -847, -553, 356, 818, 562, 103, -494, -799, -585, 155, 816, 743, 72, -422, -689, -691, 65, 857, 775, 221, -272, -789, -755, 57, 742, 753, 358, -260, -704, -769, -157, 645, 870, 363, -266, -642, -775, -291, 520, 939, 397, -185, -641, -789, -352, 517, 860, 515, -71, -546, -867, -505, 303, 821, 662, 31, -547, -732, -500, 157, 875, 772, 107, -439, -714, -693, 122, 932, 787, 134, -381, -798, -710, 103, 726, 788, 317, -392, -726, -701, -131, 586, 923, 344, -374, -686, -668, -315, 634, 942, 444, -274, -607, -793, -319, 522, 841, 474, -144, -686, -741, -352, 390, 883, 655, -85, -671, -674, -439, 230, 917, 715, 13, -535, -729, -578, 177, 911, 803, 101, -492, -763, -584, 112, 803, 850, 215, -538, -800, -589, -58, 608, 899, 297, -404, -697, -656, -158, 670, 934, 367, -262, -724, -729, -219, 530, 869, 466, -191, -753, -726, -296, 385, 877, 641, -131, -712, -768, -385, 310, 912, 736]
4088G36q16o06l3K61P02O21j20o43p55j58K45P27N74J26p09p48j84K22O01O81
4108G24K13o93q18k03J19N15Q43K20o40o71l76M8N86O95L39m49p39n75J75N35
4128a52N76N56l76q55m72M1L83O67N52k02q75n96k9L84P35N36j14p66o90q5L57
4149d25O63N71K7p43p74j43L98M76O61K21o95q56k68L35N66O72J32m77q44l95
4169h98L39N00O16K92l17r95l84K18N53N61M15l44r04m64J33M73O59M06k27q35
4189b03o07J24L63O84M49p9q08p44L3M82N47N15j4o89p87j45M67O15N27R6o67
4210A59p88k41L86N83N42J80n21q42l07K81O24N36K16l48q50m77K96N53N96L06
4230H84l41r44m90K94N06O23L27k72p77p00J44O04O04L73k04p34p42N7N94N68
$$ y = [736, -80, -686, -719, -458, 244, 865, 745, 102, -653, -811, -566, 161, 735, 861, 152, -596, -780, -558, 43, 724, 937, 244, -574, -777, -658, -143, 700, 920, 280, -391, -767, -719, -133, 562, 901, 452, -287, -862, -687, -152, 424, 980, 604, -251, -723, -682, -299, 368, 920, 718, -157, -753, -782, -398, 337, 873, 759, -7, -697, -782, -425, 238, 809, 836, 93, -681, -824, -426, 50, 711, 932, 237, -619, -887, -552, 14, 686, 818, 341, -503, -898, -559, -59, 557, 849, 532, -463, -847, -629, -76, 485, 900, 556, -348, -812, -679, -206, 453, 859, 632, -203, -810, -686, -323, 361, 810, 731, -77, -821, -788, -306, 241, 756, 742, 53, -734, -879, -412, 203, 730, 826, 159, -629, -870, -484, 99, 641, 821, 300, -542, -849, -568, 56, 592, 808, 460, -390, -867, -571, -18, 578, 884, 543, -401, -891, -597, -91, 532, 859, 587, -190, -890, -746, -142, 462, 835, 631, -103, -845, -788, -194, 374]
4250C74L74l2o73p42j13N17N95N12n0o11q20k20M84O67M87J00n94q78k85M75O01
4271A68N63R2m06q93m13L42O16N75K24l74q47n52J89P45N15L26l65p64o27J65
4291g21O51O39K11k03o73p47J00N62O53K94j02p44p39q2O30O83L38o2o81o98k30
4312i21N51O49M34k5n22q03k97M94P32M59j5m41p89m51L75P46M95R4m65p21n52
4333i73L26P83M72J73l74p79n33J48Q11N40K14l01o68p62J10P25O43K09k07o90
4353a33p01k8O77O57L08j63o19p35j00N75P47K76j43n06p75k32M96P89L58p5m65
4374B08p02m41M23Q66M08n7m60o82m97L17P83N13L6l51p19n84K60P58N68Q2l18
4395D11p19n41J23P14O90J12l19o54n90p0O78P36J55k14o15o96j00P04P28J59
$$ y = [374, 748, 716, 43, -699, -812, -295, 300, 812, 762, 151, -669, -889, -405, 262, 749, 849, 255, -623, -908, -433, 168, 731, 823, 417, -476, -889, -547, 69, 644, 868, 494, -353, -905, -716, 29, 544, 870, 505, -259, -886, -721, -70, 569, 780, 577, -96, -843, -743, -181, 472, 766, 664, -80, -819, -901, -271, 412, 750, 688, 7, -691, -921, -370, 279, 713, 688, 166, -637, -934, -440, 292, 751, 736, 295, -494, -945, -570, 176, 671, 765, 300, -421, -973, -647, 136, 608, 781, 407, -372, -905, -757, 54, 594, 808, 507, -161, -923, -813, -88, 555, 764, 557, -133, -834, -862, -185, 472, 780, 617, -2, -737, -837, -262, 485, 761, 618, 112, -663, -895, -399, 390, 748, 673, 208, -494, -935, -512, 354, 762, 705, 245, -437, -934, -617, 166, 679, 715, 364, -355, -939, -679, 79, 647, 729, 411, -308, -849, -726, -12, 678, 790, 471, -183, -773, -843, -165, 571, 726, 512, -103, -799, -899, -195, 533, 692]
4415F92j11n27p96j22N34P57L65k09m32o84l91M28Q34N06j62m81o30n08L16R63
4435C42M78j26m35o68n12K49P94N61M9m17o83n31J82O91P54L9l59n80o98qP90
$$ y = [692, 581, 54, -742, -864, -330, 427, 792, 583, 151, -533, -924, -496, 338, 844, 682, 201, -429, -937, -621, 342, 820, 694, 259, -409, -921, -672, 122, 683, 732, 315, -368, -899, -717, -26, 728, 767, 408, -172, -870, -878, -88]
$$ [...]
8191a2
##END NTUPLES=NMR FID
##END=
