##TITLE=1H_3Mal0706
 CDCl3
 8 sc, 
 8.6.2023
##JCAMPDX= 6.0         $$ Bruker NMR JCAMP-DX V2.0
##DATA TYPE= NMR FID
##DATA CLASS= NTUPLES
##ORIGIN= UXNMR, Bruker Analytische Messtechnik GmbH
##OWNER= root
$$ XWIN-NMR		Version 3.5
$$ Thu Jun  8 13:48:56 2023 Russian Standard Time (UT+4h)  she@DPX200
##.OBSERVE FREQUENCY= 200.13135
##.OBSERVE NUCLEUS= ^1H
##.DELAY= (6, 6)
##.ACQUISITION MODE= SIMULTANEOUS
##.ACQUISITION SCHEME= undefined
##.AVERAGES= 8
##.DIGITISER RES= 18
##SPECTROMETER/DATA SYSTEM= spect
##.PULSE SEQUENCE= zg30
##.SOLVENT NAME= CDCl3
##.SHIFT REFERENCE= (INTERNAL, CDCl3, 0, 15.7039)
##AUDIT TRAIL= $$ (NUMBER, WHEN, WHO, WHERE, WHAT)
$$ ##TITLE= Audit trail, XWIN-NMR		Version 3.5
$$ ##JCAMPDX= 5.01
$$ ##ORIGIN= Bruker BioSpin GmbH
$$ ##OWNER= she
$$ F:/spectra/data/she/nmr/H-F/1/audita.txt
$$ ##AUDIT TRAIL=  $$ (NUMBER, WHEN, WHO, WHERE, WHAT)
(   1,<2023-06-08 13:47:50.15 +0400>,<she>,<DPX200>,
      <created by zg, POWCHK disabled, PULCHK disabled
       configuration hash MD5:
       00 E9 B6 7A A2 85 ED C7 34 08 36 98 17 FE 4E 26
       data hash MD5: 16K
       D3 57 C9 69 52 17 13 EB DF 0A 09 3C 69 B5 ED 4E>)
$$ ##END=
$$ 
$$ hash MD5
$$ DE 1F 73 23 68 93 C0 0F E4 3D F3 75 9D DC A1 46
##$RELAX= 
##$RELAX= 
##$RELAX= 
##$RELAX= 
##$RELAX= 
##$RELAX= 
$$ Bruker specific parameters
$$ --------------------------
##$DU= <F:/spectra>
##$EXPNO= 1
##$NAME= <H-F>
##$PROCNO= 1
##$TYPE= <nmr>
##$USER= <she>
##$AMP= (0..31)
100 100 100 100 100 100 100 100 100 100 100 100 100 100 100 100 100 100 
100 100 100 100 100 100 100 100 100 100 100 100 100 100 
##$AQSEQ= 0
##$AQ_mod= 1
##$AUNM= <au_zg>
##$AUTOPOS= <>
##$BF1= 200.13
##$BF2= 200.13
##$BF3= 200.13
##$BF4= 200.13
##$BF5= 200.13
##$BF6= 200.13
##$BF7= 200.13
##$BF8= 200.13
##$BYTORDA= 1
##$CFDGTYP= 0
##$CFRGTYP= 5
##$CHEMSTR= <none>
##$CNST= (0..31)
1 1 145 1 1 1 1 1 1 1 1 1 1 1 1 1 1 1 1 1 1 1 1 1 1 1 1 1 1 1 1 1 
##$CPDPRG= <>
##$CPDPRG1= <>
##$CPDPRG2= <>
##$CPDPRG3= <>
##$CPDPRG4= <mlev>
##$CPDPRG5= <mlev>
##$CPDPRG6= <mlev>
##$CPDPRG7= <mlev>
##$CPDPRG8= <mlev>
##$CPDPRGB= <>
##$CPDPRGT= <>
##$D= (0..31)
0 1.2 0 0 0 0 0 0 0 0.06 0 0.03 0 0 0 0 0.0002 0 0 0 0 0 0 0 0 0 0 0 0 
0 0 0 
##$DATE= 1686217669
##$DBL= (0..7)
120 120 120 120 120 120 120 120 
##$DBP= (0..7)
150 150 150 150 150 150 150 150 
##$DBP07= 0
##$DBPNAM0= <>
##$DBPNAM1= <>
##$DBPNAM2= <>
##$DBPNAM3= <>
##$DBPNAM4= <>
##$DBPNAM5= <>
##$DBPNAM6= <>
##$DBPNAM7= <>
##$DBPOAL= (0..7)
0.5 0.5 0.5 0.5 0.5 0.5 0.5 0.5 
##$DBPOFFS= (0..7)
0 0 0 0 0 0 0 0 
##$DE= 6
##$DECBNUC= <off>
##$DECIM= 32
##$DECNUC= <off>
##$DECSTAT= 4
##$DIGMOD= 1
##$DIGTYP= 9
##$DL= (0..7)
0 120 120 120 120 120 120 120 
##$DP= (0..7)
150 150 150 150 150 150 150 150 
##$DP07= 0
##$DPNAME0= <>
##$DPNAME1= <>
##$DPNAME2= <>
##$DPNAME3= <>
##$DPNAME4= <>
##$DPNAME5= <>
##$DPNAME6= <>
##$DPNAME7= <>
##$DPOAL= (0..7)
0.5 0.5 0.5 0.5 0.5 0.5 0.5 0.5 
##$DPOFFS= (0..7)
0 0 0 0 0 0 0 0 
##$DQDMODE= 0
##$DR= 18
##$DS= 0
##$DSLIST= <SSSSSSSSSSSSSSS>
$$ [...]
##$SUBNAM2= <"">
##$SUBNAM3= <"">
##$SUBNAM4= <"">
##$SUBNAM5= <"">
##$SUBNAM6= <"">
##$SUBNAM7= <"">
##$SUBNAM8= <"">
##$SUBNAM9= <"">
##$SW= 18.05172834244
##$SWIBOX= (0..15)
0 0 2 0 0 0 0 0 0 0 0 0 0 0 0 0 
##$SW_h= 3612.71676300578
##$TD= 16384
##$TD0= 1
##$TE= 0
##$TE2= 300
##$TE3= 300
##$TEG= 300
##$TL= (0..7)
0 120 120 120 120 120 120 120 
##$TP= (0..7)
150 150 150 150 150 150 150 150 
##$TP07= 0
##$TPNAME0= <>
##$TPNAME1= <>
##$TPNAME2= <>
##$TPNAME3= <>
##$TPNAME4= <>
##$TPNAME5= <>
##$TPNAME6= <>
##$TPNAME7= <>
##$TPOAL= (0..7)
0.5 0.5 0.5 0.5 0.5 0.5 0.5 0.5 
##$TPOFFS= (0..7)
0 0 0 0 0 0 0 0 
##$TUNHIN= 0
##$TUNHOUT= 0
##$TUNXOUT= 0
##$USERA1= <user>
##$USERA2= <user>
##$USERA3= <user>
##$USERA4= <user>
##$USERA5= <user>
##$V9= 5
##$VALIST= <valist>
##$VCLIST= <CCCCCCCCCCCCCCC>
##$VD= 0
##$VDLIST= <DDDDDDDDDDDDDDD>
##$VPLIST= <PPPPPPPPPPPPPPP>
##$VTLIST= <TTTTTTTTTTTTTTT>
##$WBST= 1024
##$WBSW= 4
##$XGAIN= (0..3)
0 0 0 0 
##$XL= 0
##$YL= 0
##$YMAX_a= 450580
##$YMIN_a= -542109
##$ZGOPTNS= <>
##$ZL1= 120
##$ZL2= 120
##$ZL3= 120
##$ZL4= 120
##$ABSF1= 10
##$ABSF2= 0
##$ABSG= 5
##$ABSL= 3
##$ALPHA= 0
##$AQORDER= 0
##$ASSFAC= 0
##$ASSFACI= 0
##$ASSFACX= 0
##$ASSWID= 0
##$AUNMP= <proc_1d>
##$AZFE= 0.1
##$AZFW= 0.1
##$BCFW= 1
##$BC_mod= 2
##$BYTORDP= 1
##$COROFFS= 0
##$CY= 11.3945322036743
##$DATMOD= 1
##$DC= 2
##$DFILT= <>
##$DTYPP= 0
##$F1P= 15.7292609196834
##$F2P= 12.9074282941183
##$FCOR= 0.5
##$FTSIZE= 0
##$FT_mod= 4
##$GAMMA= 1
##$GB= 0.15
##$INTBC= 1
##$INTSCL= 1
##$ISEN= 128
##$LB= 0.24
##$LEV0= 0
##$LPBIN= 0
##$MAXI= 10000
##$MC2= 0
##$MEAN= 0
##$ME_mod= 0
##$MI= 1.114404
##$NCOEF= 0
##$NC_proc= 0
##$NLEV= 6
##$NOISF1= 3.799351
##$NOISF2= 2.8
##$NSP= 1
##$NTH_PI= 0
##$NZP= 0
##$OFFSET= 15.70392
##$PC= 1
##$PHC0= -20064.98
##$PHC1= 12.05272
##$PH_mod= 1
##$PKNL= yes
##$PPARMOD= 0
##$PSCAL= 0
##$PSIGN= 0
##$REVERSE= no
##$SF= 200.130013532006
##$SI= 16384
##$SIGF1= 3
##$SIGF2= 2
##$SINO= 400
##$SIOLD= 16384
##$SREGLST= <1H.CDCl3>
##$SSB= 0
##$STSI= 0
##$STSR= 0
##$SW_p= 3612.71676300578
##$SYMM= 0
##$S_DEV= 0
##$TDeff= 0
##$TDoff= 0
##$TI= <>
##$TILT= no
##$TM1= 0
##$TM2= 0
##$TOPLEV= 0
##$USERP1= <user>
##$USERP2= <user>
##$USERP3= <user>
##$USERP4= <user>
##$USERP5= <user>
##$WDW= 1
##$XDIM= 8192
##$YMAX_p= 0
##$YMIN_p= 0
$$ End of Bruker specific parameters
$$ ---------------------------------
##NTUPLES= NMR FID
##VAR_NAME=  TIME,          FID/REAL,        FID/IMAG
##SYMBOL=    X,             R,               I
##VAR_TYPE=  INDEPENDENT,   DEPENDENT,       DEPENDENT
##VAR_FORM=  AFFN,          ASDF,            ASDF
##VAR_DIM=   8192,          8192,            8192
##UNITS=     SECONDS,       ARBITRARY UNITS, ARBITRARY UNITS
##FACTOR=    0.0002768,     1,               1
##FIRST=     0,             0,               0
##LAST=      2.2672688,     0,               0
##MIN=       0,             -542109,         0
##MAX=       2.2672688,     450580,          0
$$ Real data points
##PAGE= N=1
##DATA TABLE= (X++(R..R)), XYDATA
$$ [...]
2210B980J443j1803R504L964j3159O735O651j2113M740Q344j2070K071R580j0932
2224d065O15J1221j0506k703J2427p902n055J2648n910p674J1742l097q384J1423
2238D780j594j0706J0561J377j1587R068M050j2573O164O501j1256M328P388j1348
2252d847K311R128j0343L43J0713r630k950J1659o798n105J1227n065o940J0890
2266D593k704q056J0323j098r973R255K149j0506O995M288j0852M892O288r795
2280d201K857P006r478R17Q727q235j076R277p230l365R960m866n234R293l156
2295A196o683Q836q93p495P541M82q361O652K759q594M810M130q574L254N791
2310D851p974J328O418p298o4P632o154k190P886m881l780P990k826n033O915
$$ y = [2980, 4423, -7380, 2124, 6088, -7071, -336, 6315, -5798, -1058, 7286, -4784, -2713, 6867, -4065, -3450, 7771, -2735, -5438, 6989, -913, -5968, 6680, 770, -6904, 4838, 1741, -6643, 4780, 3186, -7520, 3041, 4418, -7169, 1899, 5949, -6624, -460, 6041, -5215, -887, 6501, -4847, -2536, 6592, -3751, -3408, 7305, -2325, -5275, 6384, -414, -5519, 5708, 643, -6297, 4593, 1889, -6167, 4156, 3058, -6915, 2340, 4489, -6017, 978, 5266, -5586, -694, 5594, -4201, -1344, 5662, -3816, -2899, 5828, -2407, -3483, 5794, -1436, -4801, 5159, 293, -4941, 4352, 1196, -5487, 3349, 2456, -5039, 2502, 2984, -5377, 1275, 4034, -4560, 250, 4380, -4194, -940, 4851, -3123, -1795, 4623, -2675, -2739, 4893, -1261, -3451, 4435, -446, -4226, 3764, 938, -4095, 2820]
2325B820j454n712O786L7o831N754J824p541M475L960p265K116M705o264J202
2340a388N230n962J4O189n579j778P428l963m215O778j493m791N546n53m576M970
2356A857k51n423N644J245p233M071M105o883J344N197n036k95M246m125L54M565
2372C382n172p77O534m309l652P107j445n554N025O03m194L640M7m085M464M02
2388B016n915M658L088p206J856N451n246o39M650l575n82L936l910k98N388m593
2404i21k593O810k138n016N490L70m933L601Q46l762L607J45m842M336J853o202
2420c349K721M284n638K00M674l720n88L657l562k01M510l931j567N676k843l712
2436c389N411n35m184L543L98l479L367J64l751L562Q15m874K909K887m866J056
$$ y = [2820, 1366, -4346, 2440, 2477, -4354, 1400, 3224, -4317, 158, 4118, -3147, -1031, 3674, -2590, -1388, 3842, -2120, -2106, 4083, -1496, -3274, 4154, 191, -4024, 2754, 1261, -3530, 2016, 1463, -3113, 1857, 1606, -3817, 1827, 3072, -4161, -90, 4015, -2868, -1524, 3673, -1363, -1658, 2588, -1537, -1183, 3382, -1790, -2567, 3967, -342, -3994, 3113, 1668, -3886, 1139, 1742, -2452, 1188, 1235, -2850, 1614, 2016, -3899, 759, 3847, -3359, -1503, 3948, -1298, -1937, 2713, -862, -1444, 2492, -1418, -1716, 3672, -921, -3514, 3296, 1158, -3858, 1632, 2002, -2931, 670, 1516, -2246, 1361, 1506, -3336, 1000, 2853, -3349, -628, 3656, -1982, -1782, 2892, -828, -1416, 2241, -1321, -1522, 2988, -943, -2510, 3166, 323, -3389, 2022, 1487, -2697, 846, 1244, -2235, 1132, 1296, -2455, 1107, 1922, -2952, -43, 2844, -2022, -966]
2452i66L445l649J51L100l173R3L252l493m89M436k784k278M237j176l002L309
2468A013j95k554K619k43k549L080L6l452K609J303l487J455K216k865N66J807
2484A359k400P46J948k840K30K834k433q54L196j414j868K172k90j507J754l51
2500B82j411J934k36j887J771M98k288J008J259j539M06R52j243L74P39j347L69
2517c59J400j409m71J705m60j122J066J27r92M05K75l80N01O8p58M10N38p62k15
2536d33O67m9o49L37N69k65l13N7PL9Ll06M18N00q56j86J085l41j016P27L10p31
2558d26N72K28p17O75R0j302Q38R98j646J2J738r73p98J302l56p03O68n76r5J337
2578H66q25q77J609k24j671J240O01j460P36M72j118J164K43j892J143J167k331
$$ y = [-966, 2479, -1170, -1019, 2081, -1092, -999, 2253, -1240, -1729, 2707, -77, -2355, 1882, 706, -2296, 1013, 818, -1736, 883, 640, -1909, 1171, 1207, -2245, 364, 1667, -1820, -365, 1851, -1014, -448, 1359, -1041, -295, 1653, -1187, -957, 1877, -556, -1410, 1786, 372, -1496, 676, 386, -1121, 633, 282, -1129, 805, 569, -1318, 453, 951, -1337, -329, 930, -609, -203, 749, -494, -120, 619, -728, -359, 1041, -368, -839, 866, 406, -716, 350, 477, -515, -110, 165, -215, 286, 354, -404, 6, 544, -218, -433, 234, 185, -464, -127, 442, 177, -136, -79, -72, -33, -30, -336, 82, 582, -274, -460, 625, 284, -732, -5, 305, -426, 146, 374, -343, 332, 422, -880, -42, 956, -690, -678, 1060, 87, -711, 591, 235, -468, 200, -376, -471, 866, 41, -836, 773, 549, -1122, 118, 719, -741, -5, 467, -651, 513, 756, -1136, 7, 1174, -1157]
2595a157M04K186j686o88J874q24p95J344r54n07J748r75j153K348m65k084J710
2612C26M04j720J122M61j410J273L64j967J458J118k713N87K268k177m21K433
2628A406j391r70J916j166r02K199j041j571K584k54k315K031N15k390J292R13
2644H56j987J385R40k415J163J629k733M30K454k471m62K800j690j058K581j375
2660D7j589K653p85k109K786O5k777K233Q09k839J397J385k648J063J689k558
2676a178Q94K098k800M0K783k597o35L274j990j524L374j363k249L174o52k756
2692b107L114J25l159K760R44l658K081J698l651J368K491l395O96K799l185J26
2708i53L142l280m31L851k926j433M421k127k653M239j112l161L801l56l622L836
$$ y = [-1157, -753, 1433, -253, -941, 933, 109, -686, 658, -296, -803, 945, -30, -1183, 1165, 700, -1384, 326, 730, -990, 132, 593, -817, 456, 820, -1147, 311, 1429, -1284, -697, 1571, -606, -1027, 1406, 15, -955, 961, -205, -1107, 1092, 51, -1520, 1064, 810, -1505, 526, 1041, -1349, -57, 856, -1131, 254, 1194, -1221, -58, 1571, -1162, -732, 1722, -749, -1211, 1589, -101, -1159, 1422, 47, -1542, 1111, 326, -1783, 1003, 1068, -1709, 524, 1333, -1506, -109, 1276, -1372, -309, 1380, -1178, -284, 1814, -986, -946, 1837, -760, -1395, 1879, -111, -1635, 1739, 376, -1873, 1301, 649, -2107, 1007, 1132, -2027, 733, 1677, -1981, 100, 1798, -1853, -485, 2006, -1389, -693, 2106, -1079, -953, 2189, -1091, -1522, 2329, -597, -2030, 2391, 264, -2389, 1850, 738, -2423, 1378, 1022, -2600, 1236]
2724A236L96m320L439J617n065K354K906m590J211L441m109M66L655m149P3M414
2740B975m060j362N423k974k774N357j893l643M879r19l992M747j11n037M532
2755A148J422n716L327K679n581K008L582m981J426L749n187O21M847m858p68
2770b282N675l977k201N647k671k854N196k170l567N633j274m718N499L14n744
2785c494M233J868n371L009K214n305K835K987n660J971M351n867J32N547m457
2800a007j237N161l531j671N159l323k244N801k894l973O199o65n218M847O17
2815B021n121L874J331m881L547J690n730L212L433n826J299M379m925R2M418
2830B813l925k92M297m198r21N515l563k773N714k029l764N005n09l818L859l90
$$ y = [1236, 1632, -2688, 751, 2368, -2697, -343, 2563, -2027, -816, 2625, -1484, -1018, 2637, -1512, -1439, 2975, -1085, -2447, 2976, 2, -2772, 2585, 692, -2951, 1928, 1009, -2983, 1764, 1653, -3384, 1148, 2570, -3146, 181, 2860, -2721, -713, 2869, -2112, -686, 3063, -2124, -1503, 3344, -1514, -2282, 3393, -584, -2785, 2862, 191, -2663, 2533, 363, -3204, 2429, 1155, -3563, 1936, 2250, -3494, 739, 2607, -2764, 245, 2459, -2846, -11, 2976, -2684, -713, 3638, -2229, -2097, 3450, -1007, -2244, 2917, -614, -2285, 2874, -449, -2693, 3108, 214, -3759, 2440, 1775, -3443, 1404, 2021, -3100, 774, 2105, -2776, 771, 2461, -3269, -57, 3376, -2450, -1151, 3228, -1697, -1605, 2813, -1112, -1404, 2893, -1305, -2226, 3289, -274, -3047, 2667, 638, -3126, 1879, 1370, -2448, 1411, 1021]
2846A021l929M213O56m844L405K028n227K224L160m330R03K847l961J050L570
2861B786m158j69M348l661j574M916k130k548L823j418k225L770j031l014L731
2876A446l61l883L734J234m246K003J814l430J600J920l341J130K183l482P85
2891h94L310l116q15L134j998j094L197j741j544L003j432j936L369l48l027K351
2907D19O37k533J912Q41k522J376R88k671J553J931k936M5K376j872l61K047j433
2924b03p00J791j406m18K537j438j858K414L0k029J677N80j787O66M99j059J369
2941F65L14k226R85J441j979J76J949j380r30J308l54j39R77j217m26J611o99
2958G6j072J872j53j900Q81R73r17M63J79j146P71O04j378P42J172j752n11J746
$$ y = [1021, -2908, 1305, 1961, -2883, 522, 2550, -2677, -453, 2707, -1623, -720, 2127, -1834, -784, 2786, -1372, -1541, 2807, -854, -2428, 2488, 358, -2190, 1633, 215, -2010, 1760, 729, -2285, 1446, 1085, -2798, 936, 2170, -2076, -73, 1741, -1689, -89, 1831, -1510, -380, 1803, -1679, -894, 2416, -700, -1515, 1619, -379, -1473, 1724, -17, -1561, 1442, 10, -1926, 1443, 1095, -1932, 419, 1056, -1477, 435, 1276, -1246, 130, 1118, -1553, 0, 1931, -1005, -960, 1416, -456, -817, 1230, -203, -903, 888, -518, -936, 1601, 163, -1695, 719, 749, -1280, 397, 977, -810, -144, 355, -704, 665, 979, -1247, -262, 1179, -800, -624, 1325, -55, -985, 323, -31, -170, 807, -410, -836, 775, 76, -996, 876, 723, -1177, -296, 677, -240, 223, 402, -744, 27, 631, -747, -5, 1167, -585, -1096, 650]
2976F50k84p77Q41n25n57J031m09n06J376o12j512J331Q94j319J77N85q66K27
2994b55O01n61M69M04j485K04J635q52q21J037k26p72P93J66l15M46p07o91J438
3013E08K02j266M75O01j091J40R69l23k44m0o75P17P50r20k72R86o18p24J153
3032C28L20p81r3l9P1P04j91p22M99J51r29M87J067o12o92J89K01J51J61l19j03
3053a52L11n04j22J034O2j096r7O62o8J1J76j63j04j04k98O92N92r20p48R32J82
3074B78m55M54Q7n98j41K54J07O36l13j035M20Q82o98n6P86o72o41O63J22J26
3094B06L65j043k59J236l54p99J265j64j336O59P83o23M12r0j244R09Q27j284
3112e34N34J045j724k84J754n63m92P75j041k63J625p07o79J473q47j552J895
$$ y = [650, 366, -411, 430, -95, -652, 379, -30, -536, 840, 228, -1284, 47, 941, -378, -201, 384, -482, -255, 346, -215, 254, 658, -827, -623, 1012, 160, -661, 376, 150, -622, 171, 337, 22, 468, -239, -930, 508, 710, -556, -81, 520, -571, -431, 538, 215, -29, -69, -744, -27, 723, -197, -469, 517, -101, -825, 328, 648, -133, -226, -265, -194, 510, 319, -403, 96, 247, -682, -195, 872, 260, -432, -243, -42, 109, 270, -49, -152, 159, -345, -467, 567, 629, -467, -564, 98, 30, 41, 217, 54, -50, -154, -452, 240, 832, -88, -836, 96, 278, -177, 277, 364, -234, -375, -121, -14, 622, 309, -726, -306, 576, -122, -178, 608, -64, -705, -42, 80, 206, 571, -472, -731, 505, 151, -648, 617, 453, -883, -224, 559, -64, 348, 258, -986, -77, 750, -534, 0, 1045, -679, -963, 791, 228, -264, 511, -530, -793, 832, 125, -554, 919, 72, -1480, 415]
3129D15M79j492R12qj415J370N91j672J072O76k311P94K147j721l70J321j396
3146f08j49J743j135l75J546j566q32K591n77j694J484k28j439J797J85j496J393
3163F40k99j989K004J102k471P17J389k104O08J769j637l2J100j875L69K398j768
3180g9j002K168j213j125K334n22j495J467p13j129K508k67k304J683M25k224
3196a488J661J277k338O03J089j945J100J721k383j71K040j927j85K533j334j343
3212a090J721q14p51K221q83j787J987k30j762K230M04k415R54Q07j603J379R68
3229A336k434O40J542k055N16K135k065q86J966q26m53J807j238j131J763o35
3245a8r79K130l57k161J367O85j355J168L14j860Q32Q37j476J146J204k318r6
$$ y = [415, 894, -598, 314, 306, -1109, 261, 852, -820, 252, 928, -1383, -589, 1558, -163, -533, 788, -608, -757, 986, -149, -524, 1022, -544, -1376, 1215, 638, -1056, 428, 200, -1239, 558, 743, -753, 640, 341, -1648, 356, 1458, -1013, -296, 1093, -1011, -403, 1366, -271, -303, 797, -1078, -709, 1689, -79, -1081, 1087, -126, -1251, 1083, 561, -934, 533, -180, -1309, 1199, 932, -1372, 311, 736, -1488, 173, 1450, -888, -285, 804, -1141, -41, 1680, -703, -874, 1166, -761, -946, 1587, 253, -1090, 631, -183, -934, 1287, 404, -1383, 604, 374, -1388, 842, 1246, -1169, -215, 592, -1011, 368, 1336, -1098, -458, 1084, -971, -455, 1680, -385, -1271, 695, -131, -584, 1223, -15, -1146, 617, -18, -997, 1133, 776, -1385, -18, 667, -688, 480, 794, -1066, -234, 603, -873, 273, 1477, -841, -937]
3262i37J906j130l45J481j147p62J536n71m94J623j041j652J833L53j422J227
3278D58K34j761R60O65j138R65L98k109P42J780j545k1J448j506o29J731n86m70
3296c84J394j301r72K168k53j600J549J8j981J326R67j184N84R7j642J138J284
3313A208j960N18J459k122j82K352r44r82J351j192n39K039p34j126J844p99j891
3330a700K336N40k104R83M87j684J291R44j724P64O92k190R53K046k024l45J796
3347A061j609l81K227j214r39J660j275q06K657p97j859J956l21j816K061N75
3363A180k189J106N07j843J492J182k370N61J306k056P75J970k114l12J790j697
3379g12j77K494j578j285K133r68j123K505o44j984J827j70j676K196L16k369
$$ y = [-937, 969, -161, -506, 975, -172, -934, 602, 31, -463, 1160, 119, -1533, 300, 653, -769, 458, 692, -1069, -109, 556, -582, 383, 781, -1328, -586, 1194, -351, -372, 1076, -430, -1059, 672, 86, -384, 1010, -291, -1263, 905, 652, -948, 601, 619, -1362, -36, 931, -253, 331, 428, -1214, -76, 1208, -752, -234, 1225, -897, -1079, 1273, 329, -653, 698, -494, -1033, 1006, 272, -854, 990, 191, -1700, 636, 1176, -928, 55, 542, -1142, 149, 1093, -631, 133, 825, -1365, -412, 1634, -390, -735, 1061, -548, -929, 1298, 84, -855, 805, -470, -1276, 1381, 584, -1275, 681, 360, -1456, 605, 1180, -1009, 97, 604, -1239, 253, 1435, -935, -374, 932, -1124, -349, 1621, -493, -805, 985, -712, -889, 1605, 27, -1258, 875, -93, -1216, 1289, 645, -1339, 488, 318, -1358, 838, 1154, -1215]
3395a215J269P38k002J452J148k349N65J268j830P87J828k321l53K069j578k76
3411h00K152j430r98J794q97p56K273r73j904K002L1j661J891L37k182J036O03
3428E18j374J373O03k356Q99J405j856N65J651j904n13J647r27j7J458j566n73
3445i67J823r53p65J992o92j750J398M44r76J050k30j351J175J66j217J358M53
3462I58j993N64J297j073J93P51j232J39Q96q80L96J035j542n88J703l37p36R33
3480D84l78q46Q84l1l33R17o16j118J124M88r75N78L41j022J61O38l35K90J0r51
3500f90M60Q51o86j47P31o89m52P58Q8q9R3o11j01P99k29k77N86l16p27N52M69
3521C73j94j14k65j48L87J60l02L39p2o38K19N66p3j26k18j92K22J42n4J83j00
$$ y = [-1215, 54, 792, -1210, 242, 1390, -959, -394, 874, -956, -169, 1659, -662, -1015, 1054, -524, -800, 1352, -78, -1076, 718, -179, -935, 1338, 365, -1539, 463, 494, -1167, 724, 1061, -1121, -85, 518, -856, 517, 1120, -1236, -337, 1068, -788, -223, 1428, -476, -989, 658, -269, -286, 1172, -394, -967, 856, -97, -862, 1130, 438, -1312, 86, 530, -446, 604, 374, -977, 198, 364, -853, 505, 958, -1035, -471, 826, -247, -54, 697, -535, -396, 500, -380, 16, 1051, -491, -1079, 624, 287, -449, 484, 106, -740, 144, 113, -220, 697, 81, -1037, 87, 575, -400, 178, 519, -503, -342, 296, -39, 251, 261, -690, -230, 621, -65, -212, 519, -170, -622, 136, 224, 135, 228, -383, -484, 315, 86, -191, 395, 79, -648, -96, 373, 179, 65, -200, -348, 39, 199, -103, 236, 164, -474, -255, 311, 238, 112, -106, -298, -76, 66, 12, 195, 95]
3542I5m32M3N13Q6k33k00r8J02J85k8J76m8m42n6M68J75j25k29j60J10J21J8K64
3565C05m3n72k5M93N4J9j45k84M4J84j22K73J80o54j33O65m5k47K96l39k04K79
3587b1O4J4K87m30m46O14K10m87L60J06p35K86M97l54J85O7p28K71P09n90L0N61
3609D70p03k68Q15k6m13M47l51m25P29n5m77N82k21q35P91N02p97J84L61q18L48
3630a60O83n85nL53p75J50R48n52l61P21o07l70R28q0n56N02l36m64J029k8q76
3651d41O55P5r77P00P25r15N4L73p55M59P16r62P4P78r90r4J365o71q18J016m62
3672i5m36J152m09p96R98l56q84J358J27j420P50N48j199O88Q00j237K24O89j116
3691f14M84J155j371l17J438r55m61J519o99r23J118l74o13J350m23j278J388
$$ y = [95, -337, -294, 219, 305, 72, -128, -226, -124, 61, 33, 209, 161, -281, -337, 131, 306, 181, -48, -208, -98, 23, 41, 305, 262, -310, -335, 158, 212, 231, 86, -198, -154, 30, -92, 181, 361, -293, -426, 239, 194, -53, 243, -96, -300, -21, 43, 57, 344, -86, -532, 82, 292, -195, 165, 271, -464, -178, 319, -35, 150, 217, -511, -240, 469, -121, -91, 470, -233, -501, 314, 288, -125, 322, -29, -454, 275, 220, -257, 325, 104, -731, 60, 562, -235, -51, 310, -508, -160, 523, -62, -67, 286, -489, -339, 609, 57, -304, 417, -190, -560, 368, 288, -268, 234, -102, -566, 463, 435, -441, 214, 289, -688, 12, 737, -178, -124, 249, -506, -47, 669, -293, -219, 559, -431, -525, 840, 169, -649, 367, -95, -531, 621, 212, -584, 414, 58, -826, 532, 659, -761, -11, 537, -662, 26, 826, -411, -187, 502, -614, -130, 1025, -346, -663, 775, -180, -641, 878, 179, -744, 374, 0, -613, 737, 314, -964, 424]
3708D24M4j467J310O24j772O18Q23j207O78P86j598N16J017j446K52J562j472
3725c08n52J642q07n55J400q60q23J510o15q53J722n05j637J592K83j551J166
3742B49M69j588Q24O54j361R21Q10j938N40J515j621P6J514j388m76J553q98m32
3760e77J513j105p93J871o95j283J879l64j655J518K67j393J190K43j719J247
3776A44P60j803R13J067j973M05J592j450n2J397j509j44J608j232l29J692j270
3793a84q65J906n25j296J538k71j417J522J76j400J251J77j774J294Q01j751O81
3810a37J069j712M27J354j407P7J216j399j02J596j182n59J709j015q41J732m96
3827C30j172J352k39j160J427jj352J159K43j600J030Q16j450L91R61j281K81
$$ y = [424, 468, -999, 311, 935, -837, -219, 604, -603, 75, 861, -737, -221, 796, -650, -398, 1164, -308, -860, 782, -25, -580, 820, -40, -863, 647, 32, -821, 901, 396, -1241, 351, 634, -917, 249, 718, -870, -46, 608, -753, 168, 978, -960, -420, 1095, -526, -450, 1064, -324, -800, 753, -145, -577, 936, -169, -962, 909, 214, -1069, 810, 446, -1209, 309, 576, -817, 373, 616, -1103, 144, 904, -899, 14, 1081, -892, -487, 1105, -345, -397, 1000, -509, -653, 955, -277, -606, 1086, -184, -1049, 857, 332, -964, 574, 303, -1114, 408, 584, -816, 435, 612, -1162, 132, 933, -818, -137, 932, -780, -353, 1001, -406, -329, 887, -512, -614, 982, -200, -759, 950, -65, -906, 826, 330, -842, 510, 271, -889, 538, 537, -815, 344, 587, -1013, 17, 833, -617, -226, 735, -546, -265]
3844b65J046j181L9J127j235q1J495j002o17J313n60q29J284k88q59R95j87r30
3862g35J169J07j321Q07N59j366O58Q30j098J18Q12q83J61Q61j019m5R95q82k94
3881e66J320o57p16R78j75p34Q64o5p90P83M8r36R05K36j109N07O70r51K67P27
3901F06q45n1P66o70q5Q58p31l57J005l96n98Q99j98p64P64O2o34O34Q2q68N95
3922G4L31r12M72N40r74J87Q45o97j01O40n71k65Q20m86k25Q23m68n22Q43j74
3942A80o62P33M9p31N63K13p46N32K79r13M77M71p96K26O88q04q3Q70o15k61P41
3963D11m88l37P96l88m15Q70l28p01Q65R5q80N67K58p52N82K38p25M33K82q81
3983d98M35O23q87Q9P08o97r0P77n26k34O37m27k67Q34m12n75Q67j15q23P65J93
$$ y = [-265, 781, -400, -361, 766, -469, -550, 945, -57, -674, 639, 79, -750, 534, 246, -613, 382, 195, -735, 434, 541, -780, 27, 586, -780, -122, 708, -390, -272, 540, -343, -182, 679, -340, -385, 610, -272, -566, 754, 97, -619, 359, 184, -550, 314, 249, -541, 242, 290, -646, 259, 495, -614, -107, 563, -388, -121, 606, -239, -290, 476, -194, -279, 579, -152, -509, 496, 100, -498, 401, 203, -561, 203, 265, -369, 265, 347, -521, 74, 405, -507, -35, 505, -469, -282, 563, -134, -235, 405, -166, -431, 389, -97, -322, 501, 33, -489, 354, 180, -482, 251, 300, -431, 132, 345, -401, 131, 410, -503, -26, 445, -351, -125, 563, -241, -324, 546, -69, -330, 411, -77, -414, 382, -6, -421, 449, 121, -580, 285, 380, -500, 67, 325, -427, 155, 393, -332, 101, 383, -498, -63, 560, -327, -238, 470, -227, -317, 460, -66, -300, 337, -90, -357, 477, 65, -510, 357, 242, -581, 184, 377]
4004C77p56M69P1n22N83J07p48M64L30q76L70O88q03%O24n51o9O14n88m7O89n44
4026a18k89R14l72o26P08k7n47N40j0m46M40j9n30O34J63q86M05N14o96P1N41
4047C64n47K7M53m69P2M46n54o2O70m41l18O35k05m15M22m4k23L91j91l17M92
4068A86r0m19L88J42m69K22J99k17J74J3l37K22K39m14J74K54l53rK43j42o9J67
4090A04k14P9J89k74M7K52k11j07J83J9j74J67j49J3K27k30r8L34j62k42L11M9
4112A13j97J44n6j14J96q7j34K40n2k68K10J47k26R6J8n3K4L9p0J17M2k98J66
4135cJ88l04R2J58k54P9J49k12J06J42l27Q0K78l11M2K82k23j68L04j02j94M08
4157B10k62j76M26j47l17M05J3m11L68O8m27L31J24m65K65K50l87Q2L14n05R4
$$ y = [377, -379, 90, 161, -361, 222, 329, -419, 45, 375, -501, -131, 557, -246, -246, 378, -173, -242, 372, -216, -263, 426, -118, -407, 507, 135, -491, 217, 190, -357, 183, 173, -273, 167, 148, -382, 252, 415, -471, -66, 448, -248, -177, 364, -183, -156, 297, -172, -100, 346, -208, -270, 400, -41, -359, 276, 71, -344, 78, 34, -189, 202, 11, -306, 186, 96, -323, 65, 207, -262, -40, 159, -58, 116, 129, -208, 14, 253, -161, 13, 267, -86, -95, 148, 6, -63, 104, -110, -31, 158, -116, -69, 183, -28, -135, 48, 67, -107, 60, -89, -76, 151, -79, -177, 157, -5, -247, 64, 113, -84, 60, 4, -110, 86, -1, -135, 105, 53, -215, -5, 142, -84, 12, 30, -23, 1, 40, -30, 87, 129, -169, -3, 185, -119, -27, 131, -123, -44, 105, -107, -1, 141, -186, -106, 172, -139, -97, 185, -38, -206, 98, -4, -198, 210, -52, -228, 198, 51, -266, 139, 152, -259, 109, 177, -250, 81, 205, -260, 5, 255, -132, -50, 264, -241, -147]
4178a47M91m32r6M92m72j09N33j84l36M68k00k80N44j50m32M69m5m87N25R4n66
4199c20L58J96n34K79L11n35J99L15n48J78N42n59o9N14l77k16N35k09l22N11
4219B49k60l15O29j68n84O42Jo01N00K61o79L42K83o26L11L84o95K22M93p00O6
4240b45O90n88k61P58m14k93P09l49m03P88k96n74P82n8p47O35J54o90M94K42
4260C34p31M13M46q60L35O04q54P3P12o52q8P83o79l36R46n36m31R87l66o65R17
4281C52n3q05P38R9q71P05K73r48N88M63j032M64O30r86J71P80q74N1Q79q70j58
4302d04J009p73l54J149n22o98J019k16p91R06q6q27Q92J5j012Q80L42j162N49
4321h4O85j074L15P73j048K74P43r69J01R94r26l28J220p19m92J103m41o46J011
$$ y = [-147, 344, -88, -184, 308, -164, -273, 260, 76, -260, 208, 8, -272, 272, 122, -310, 159, 114, -373, 152, 246, -320, 38, 234, -300, -21, 290, -245, -46, 269, -279, -101, 441, -118, -187, 327, -50, -266, 269, 60, -262, 249, -11, -326, 303, 135, -449, 193, 194, -407, 93, 354, -325, 17, 300, -326, -15, 369, -326, -104, 389, -311, -245, 445, -143, -404, 354, -60, -353, 356, 7, -396, 392, 96, -478, 304, 246, -501, 134, 288, -402, 92, 334, -397, 16, 462, -398, -63, 541, -313, -240, 472, -180, -268, 515, -164, -500, 446, -90, -521, 466, 100, -565, 352, 299, -506, 232, 331, -540, 165, 438, -510, 78, 541, -491, -27, 603, -383, -212, 568, -306, -255, 624, -246, -404, 605, -168, -522, 627, 105, -593, 426, 210, -581, 325, 239, -588, 304, 319, -693, 187, 529, -633, -84, 601, -473, -158, 615, -433, -159, 584, -385, -284, 710, -216, -544, 676, -43, -535, 568, 127, -519, 492]
4340D92m17o49J042j39j084J118J42j256Q88N65j308N48O16j055M63O26j072K99
4358a81R47j208j3J158r09m00J210o29m64R88m84n51J062m25q19J214j83j086
4376g73J089K08j269Q16M40j069N58N48j085N60O31j196L35R49j094r8J119q94
4394b25k82J075o66l82J052o35n12J122l80q46J136j70j017R44K19r73O41L04
4412D05r17O16L67j067O20N61j107L05R00r49o6Q83p10j47Q32o58j82Q45o56l67
4432d92J044l89p91J022j05p98O71J40p01N44K15q15O17K68j008N02O15r08J36
4451b33P37o88r3O65n64mO05o66j41Q83n69m41R78j84p72O20J18n57M66j4n14
4472c68O20l7p10O14M12r05N9P03m72j52M96m31R5L25m85P6O65o53l15Q34j50
$$ y = [492, 75, -574, 468, 329, -755, 363, 505, -751, 137, 702, -606, -58, 558, -497, -34, 592, -480, -181, 766, -442, -455, 703, -206, -606, 604, -25, -489, 499, 15, -536, 526, 101, -718, 496, 313, -773, 316, 524, -745, 71, 511, -558, 0, 548, -537, 23, 654, -542, -207, 742, -352, -450, 669, -225, -507, 568, -98, -480, 572, -63, -575, 547, 167, -679, 457, 287, -730, 214, 433, -540, 101, 405, -512, 104, 471, -596, 24, 585, -522, -217, 683, -266, -332, 551, -159, -306, 526, -132, -314, 531, -125, -492, 552, 163, -628, 394, 289, -509, 162, 302, -399, 145, 360, -455, 162, 430, -578, -76, 539, -369, -233, 504, -184, -277, 388, -176, -180, 425, -241, -382, 501, -68, -509, 469, 285, -487, 133, 251, -306, 160, 146, -368, 252, 215, -495, 119, 531, -374, -315, 388, -84, -236, 260, -171, -76, 249, -236, -160, 505, -148, -463, 371, 221]
4493B21o21N77J7l96K58l9k58N16j61n83O24K51p24J70M99m36j35L99r3p1J88
4514B03l87Q4M29m26j99O16k13m57M31J21k94J10p0l0K02j7l25K98K13n95J55
4535a51M99l13k12K81j29j7R6j31J02J40l13j05N00n3m83L61J46l10Q9R2n6L8
4557G1o9k06K90J20l96J37K75l14o0K77q3j35J44k00P7K94k66j05K47j11k26L03
4579F4O9k21N4l6n4K32J5l04J72J63l24J73J99k06o9M7r1J56J52k57m8K43j11
4602A8j42K31m2j97P0O1L7J38j63j82K21l0j58J40J59k16lM9kJ14q2j23L1J44
4626G3k15J49J23j30r6l5J68kJq6J5R0o1j1J79r7j93M9J15N8q2l0j1J19k14O4
4652f0K26j13j35J0L4R7mj03l6J19j28n1K83l4l25J46J05l9Q4k4j04P7j17q7L14
$$ y = [221, -400, 177, 194, -202, 56, 17, -241, 275, 114, -469, 155, 406, -318, -148, 351, -85, -220, 179, 86, 15, 203, -184, -100, 329, -97, -296, 320, 107, -350, 81, 202, -92, 18, -52, -82, 120, 103, -222, 76, 289, -306, -151, 348, 35, -177, 104, -25, -42, 54, -77, 25, 165, -148, -253, 247, 194, -289, 72, 218, -92, -3, 89, 33, 71, 2, -204, 86, 206, -190, -53, 222, -92, -152, 125, 42, -93, 51, -149, -72, 222, -44, -149, 98, -13, -239, 64, 133, -88, -34, -70, -124, 108, 123, -181, -9, 154, -170, 3, 202, -4, -73, -26, -117, 39, 191, -66, -114, 129, 18, -124, 107, 65, -132, -62, -1, 36, 174, 11, -171, 50, 20, -138, 2, 161, -55, -58, -9, -11, 103, 21, -102, -71, 73, -142, 7, 130, 0, -96, -131, 37, 35, 36, -50, -35, 55, -6, -17, 162, 65, -128, -79, 36, 94, 12, -18, -29, 90, -124, -60, 166, 53, -82, -72, -38, 59, 55, -48, -84, 35, -93, -144, 139, 105, -220, -74, 31, -8, 76, 52, -52, 25, -92, -179, 135]
4677A35M4l40L5K19p9ML1l0LJj93K56J98m09j09L70r4j37K76j36j85J37q0Q9K63
4702B69k55l30L63O5l15K44J31k95O5N9j14K97m0m51K71J85k95J59K54l04j44
4723a81L02j86P0J89l16j13L95j84p4L30k09l19M22qk30K95j15l64L78M1l12L11
4745A22J12n32J48M61m80J87K31m70N4L85k75k3L80m27j62N25j49k39M26k42m18
4766c86N51k8l32M13j12m86M20J59l75K68J30n23J84M25m62J46L00n69P8N85m27
4787d1q7L64l70j49N58k36k49L67j68l52N62N0m69L50k6m52L89K41m81K27J61
4808A89n06K10M75m52j9L85m81J3N08l27j88M61m22j34O22j68m26M20p1m05M39
4829A23J36n24L62L6m78M13L17o26P1L55m81J94M80m48j44M22l59j04N94l50l16
$$ y = [135, 179, -161, -126, 93, 14, 18, 49, 19, 22, 23, -170, 86, 284, -125, -234, 136, 42, -95, 181, 45, -140, -3, -83, 6, 269, 14, -316, 47, 112, -203, 41, 172, -123, -58, 1, -113, 184, 144, -307, -36, 149, -146, 13, 267, -37, -181, 121, -65, 5, 194, -122, -235, 160, -24, -98, 232, 23, -296, 126, 118, -112, 183, 68, -296, 82, 123, -189, 122, 234, -298, -150, 311, -169, 18, 249, -221, -167, 218, -57, -80, 300, -127, -289, 236, 87, -152, 274, 32, -386, 165, 137, -195, 218, 106, -380, 40, 199, -176, 92, 222, -301, -117, 308, -154, -8, 292, -277, -199, 386, -41, -128, 236, -134, -283, 275, 39, -210, 157, -11, -363, 199, 249, -220, 130, 104, -348, 41, 282, -199, 28, 189, -317, -107, 368, -84, -103, 282, -199, -186, 322, -5, -193, 268, -154, -288, 334, 166, -260, 160, 89, -316, 123, 259, -265, 97, 133, -345, 68, 385, -241, -170, 185, -296, -102, 378, -70, -214, 208, -151, -255, 339, -11, -327]
4850c27N45k37k96O51j56m91M23J2m61N03K03o31K06K53m08K82L39o19J9N25n07
4871a72j5O34n51k35N22j57k87O17l48l80N43j32m28O98l6p34N68J70o02L98K59
4892C32n81J64L52n73L53M10q29J27P47o61j23O77m53k74N18j88j79N89m42m41
4912d75Q20j89o07O92Q4p76M27L45n21K81K34p33M27L53p73L12O90r09j08Q50
4932D24m62j38N72n02k42P30m38k84P99m49o45Q04J87o96N20K2n80M93J72o27
4952c40N42K29r93M17P28p82J9N72o26o1O51n33j3O37p32j91J000m05o19Q12j67
4973A45o39O72N3m54M34j24o23P91J51q28M28M30q31J75O81n82J1L35n89K21O38
4994D95o84p4P44n79l97R16k28n36N05j54l76O42q9n68N97o2o61N55L18o44K28
$$ y = [-327, 218, -19, -315, 336, 180, -311, 112, 124, -337, 166, 369, -262, -56, 197, -211, 71, 410, -209, -190, 335, -172, -187, 447, -104, -339, 183, 26, -261, 356, 8, -372, 171, 39, -389, 309, 273, -461, 107, 277, -325, 73, 332, -249, -85, 267, -306, 47, 457, -372, -245, 502, -159, -282, 395, -58, -332, 186, -2, -181, 408, -34, -475, 345, 156, -451, 241, 325, -451, -24, 321, -200, 81, 315, -418, 9, 362, -411, -99, 591, -318, -426, 424, -38, -176, 396, -106, -348, 382, -56, -340, 459, 10, -635, 169, 356, -340, 180, 202, -378, 115, 287, -340, 202, 431, -562, -145, 583, -199, -180, 392, -234, -295, 356, -177, -190, 447, -285, -476, 524, 119, -500, 312, 145, -494, 178, 231, -223, 211, 87, -536, 255, 406, -422, 6, 436, -395, -220, 461, -121, -110, 225, -364, -143, 495, -189, -263, 481, -98, -495, 421, 193, -343, 162, 8, -368, 274, 185, -383, 214, 152, -509, 46, 364, -280, -52]
5015e2K43m78K61L35n14P5M25n51O9P00n92k65N80l47r3M82k93k47M66k58k13
5036b67N83r1n40M08N9m01M02J03n32L51J07m78M01K67n61o0M21l36P9L99l91
5057g7j25M23l56m0N36l75k49M06o8l18L59J4l44K28Kj76L82K7n05J94K02l26
5079a86K06K38l62j3K42k05J00K49m73RL03j34p8K20m8k97K13L9o8J69j44j98
5101b18K57J8k23J85J21l04j2K24L5m8k1j33J08Q6j96J29J76j74k47K37J55j18
5123C7j9Kp7O3j9K8J49q1k06O9J81j09m1m5K8l5J15l8Q9n7k01Q5J03L8q3M2K4
5150D2l7j7O1J5r1p8L4J38M0j14OJ8r5L9O1Q8l1j97J0J08N6m0k0m3N2j03RK25
5178A36r4j82L1N6J15Jp6l6N8m1j24K78mk05m6J38L9o3N0j6k3o6M7P9O7j44j35
$$ y = [-52, 191, -287, -26, 309, -205, -130, 295, -256, -187, 513, -79, -344, 236, -111, -204, 278, -15, -262, 204, -54, -267, 316, 225, -315, 93, 152, -249, 153, 256, -276, 75, 182, -296, 105, 372, -189, -249, 172, -164, -85, 314, -77, -202, 221, -135, -175, 361, -14, -263, 143, 75, -243, 116, 130, -214, 14, 16, -160, 222, 249, -256, -62, 140, -186, 20, 258, -104, -117, 125, -80, 20, 269, -204, -195, 108, -26, -104, 116, 68, -229, -16, 23, -45, 124, -20, -218, 39, 57, -166, 19, 140, -164, -176, 48, 83, 35, 14, -119, -11, 75, -121, 8, 184, 10, -237, 0, 155, 37, 18, 20, -57, 6, -13, 15, 164, 83, -123, -54, 127, 18, -23, -68, -40, -75, 40, 2, 91, 34, -167, -82, 21, 59, -24, 18, 42, 5, -12, 49, 64, -27, -105, -71, 67, 107, -7, -1, 17, -78, -39, 22, 110, 79, -118, -108, 0, 56, 16, -4, -47, 5, -98, -89, 136, 42, -140, -109, -53, 62, 63, -13, -49, 9, -32, -156, 122, 118, -87, -133, 5, 44, -19, 31, 15, -8, -74, -27, 52, 119, -25, -160]
5205a60J81J04j57M2L5j39j1J18P3ql2k05J58J34j39j18K68j16k48K13O1o6K4
5228A2m9o2J00M7j61J62M4l35J38K81j28j51J08p4R2R5j72nJ48k22j3K69J0k36
5252a02J71n2r1J15jr7J37q7k18L11J15k99k6K51k09o5K85j37k9M7j49P7K73k69
5276d9j30L43k29j32L20j4k41J15m2o1L03j49k45K54Qk80K13L18m02j0K03k04
5298a11J29J52l00N3K74l30rL60j80l01L76K2k89K87j10k10L05j22k19M57l2n26
5320c24L04K81m22J59J60l27J14J64k57K09K78n47K3M69l09k11M27j36k76L14
5340I3j14m6L31k95l12N03pm24L57J92m71Q0K70k88K16K9l87K78K96n41J52M59
5362C71m51j52M48j95j17L04k58q9L52k24k33N20j19n39M81J42l96K55K9k69K03
$$ y = [-160, 21, 125, -32, 10, 45, -94, -105, 13, 86, 78, 46, -159, -1, 133, -6, -124, 144, 28, -220, -7, 54, -12, 12, -37, -99, 1, 48, -113, 49, 93, -242, -104, 177, 49, -102, 6, -68, 24, 119, -53, -58, 90, -132, -145, 124, 134, -102, 69, 17, -74, 41, 40, -57, 80, -7, -225, 86, 201, -98, -124, 127, -82, -147, 138, 1, -28, 19, -130, -53, 220, -49, -179, 164, -65, -197, 123, 109, -132, -17, -59, -120, 183, 34, -211, 43, 51, -229, -16, 302, -100, -110, 93, -111, 18, 170, -130, -77, 197, -133, -142, 218, 38, -263, 113, 135, -154, 133, 23, -187, 118, -4, -223, 234, 202, -324, -20, 261, -161, -2, 158, -169, -55, 109, -148, 61, 339, -208, -185, 284, -25, -236, 191, 55, -221, 93, -21, -67, 264, -31, -343, 160, 153, -271, 86, 278, -193, -113, 157, -131, 85, 114, -273, 5, 301, -240, -88, 371, -80, -232, 216, 21, -96, 208, -50, -139, 213, -11, -244, 276, 157, -382, 99, 241, -155, 100, 129, -140, 63]
5383F3R9l83L24J59n56J79M72l85j67M01k23j87L79k03j15L33k95k27N19m7m00
5404b60L78Pl64K56J55l02J76R6l98K68K97n01O3L82l76l0L55j84j59L06k33j05
5426a73M09k37k05M11j33l80M55K5l48K12R8l28J92K02l88J77K30m07J24L44m59
5447a79j2L39k52p4L43j90j72L33j90j83M34p9l91L62N1l42L20P9m03K19J61m03
5469b29J76K94m47J48L07l73L6L42l29p9L33k04j59M40j96l27L70Rl47L19k3l15
5491b54K82J07l52K44J49m04J33L82l96K8L49m35J1L49j56j61L71k87j67M19j63
5512D9k90M60j29l23L88o9l01L05J02m95L40J83m89K35K52m19R5L36l29rL35m36
5534b09O4L96l79j13M95k17k76L93o8k75L67j22l20M52o9l95M14Q0m91K74L09
$$ y = [63, 162, -221, 103, 262, -294, -115, 357, -28, -195, 206, -17, -204, 175, -28, -143, 190, -105, -332, 187, 140, -260, 118, 125, -239, 17, 172, -130, 46, 142, -256, 12, 309, -192, -129, 253, -123, -153, 202, 18, -141, 165, -68, -173, 236, -1, -206, 205, 72, -308, 147, 172, -176, 36, 134, -194, -2, 200, -188, -11, 219, -188, -64, 280, -179, -191, 148, -104, -178, 165, -25, -197, 136, -54, -237, 197, 118, -273, 89, 140, -202, 118, 197, -206, 13, 174, -229, -53, 241, -206, -58, 249, -124, -88, 254, -75, -154, 179, -25, -184, 256, 60, -267, 103, 112, -235, 84, 61, -254, 28, 135, -217, 27, 176, -228, -95, 287, -109, -81, 268, -167, -156, 193, 37, -124, 247, -40, -207, 212, 49, -241, 219, 90, -233, 155, 86, -215, 90, 192, -303, 37, 220, -269, -34, 218, -201, -106, 230, -99, -108, 227, -209, -145, 251, -128, -241, 254, 37, -239, 154, 86, -189, 178, 56, -264, 188, 119, -276, 138, 218, -273, 1, 310]
5555C10n05J17K64l40R3K78l53O5L40m51n0M84k89k14M32k23j94M30j73k27L61
5576A55j07k70L47J28n22K56K41l71J28K57m02J49K19l68Q1L03l46LL47k82j36
5597a90M24l24p0L36j93k14M99k78k51L63J9l37K37J26l37J15J88k38J16J26k86
5618a69J13K14l01O9K51l00qK68k44J0K68k52pK68k50q6L24j01k38K45j5j81J33
5641A1J14k36J41L2j90K31K0l11O4K91k38L1R9p5n8J67j34k9J59k07K7K19j53
5664b5r3J80k0j31P7L5q0Q5%j31R3Q5j73O9J60k08J7J03qk1j3n6O7N4j19N3J21
5691A21j56j07K02Kj21KO6j8J11q3J7l7j7o9N9P8o3p0Q7J8k1l6L2lpo2N2K7Kj4
5721hL9k3j2k4N2M9j08rM1M5l0mrlK3o3K3J52j58q7J29K7q5L6KjK2j6m8P2M7j57
$$ y = [310, -195, -78, 186, -154, -61, 217, -136, -71, 269, -182, -232, 252, -37, -251, 181, -42, -236, 194, 21, -206, 155, 48, -222, 125, 253, -269, -13, 228, -143, -15, 242, -160, -11, 208, -160, -79, 224, -122, -119, 228, -54, -190, 234, -90, -160, 176, -17, -231, 268, -10, -261, 102, 121, -216, 21, 147, -190, -75, 113, -125, -9, 117, -169, -56, 158, -143, -74, 177, -123, -131, 137, -107, -97, 171, -81, -88, 180, -70, -156, 168, 67, -171, 74, 59, -122, 11, 125, -111, 30, 62, -128, 103, 123, -188, -124, 167, -71, -40, 59, -16, -74, 93, -41, -70, 89, -118, -91, 128, -25, -118, 62, 42, -89, -12, 23, -57, 28, 28, -103, -10, 75, -98, -29, 131, -77, -60, 43, 35, 14, 1, -55, 12, 66, -53, 0, 121, -35, -142, 60, 62, -59, -57, 9, -9, 102, 19, 36, -1, -18, -87, -28, 50, -13, -83, 4, 22, 1, -35, -3, -6, -13, -75, -23, 4, 6, -8, 31, 8, -4, -28, 24, 73, -35, -44, -3, 42, 12, 8, -1, -4, 19, -44, -21, 131, -27, -114, 15, 42, -43, -7, -5, -6, 16, 0, -48, 24, 71, -86]
5753h6K1N1K5o2Q9l7l6P4n5pP1j39N6J27j15j28J62Km8J08m3l5J02j08r0J75p
5780F7j57Q0P1j43kJ86j11n7J76j95P3J57j92k6J81j34j13K25n2j26J33m3q6J65
5804G7K6k39J91M2k08O5J92k01J7J56j44K0J24j55rK10k15r3K86j21j18J81k8
5827E6k35K22m8j42K66j00j58K27L0k56Q5K00k41K6J63j77O6R6j43OJ97j92p9
5850a31L05j77j03K25j15j68K60lk11K32q2k25K97L2l36K32J59l48J06K16l49
5871a84J35K60l23j5L35k95o9M03l03j09L34j32k55L33o9k67L62m0l23K99P5l22
5893a70J59K03k95O1K00k96J27K84l79P9K40k93j02L52k07j23L51j55j99L70j26
5914H1l28L50j0l47K72J64m19K41J40l36K44J32l48J80K17l81Q6L18l76n8L87
$$ y = [-86, -65, -14, 11, -51, 38, 1, -35, 39, -16, -23, 48, -91, -35, 92, -23, -151, 11, 13, -35, 73, 30, -5, 97, -11, -101, 74, 67, -90, -10, 61, -82, -84, 102, -9, -66, 110, -85, -12, 145, -47, -73, 108, -26, -139, 86, 34, -92, 41, -2, -88, 77, 103, -136, 55, 97, -111, -46, 146, -55, -38, 118, -26, -6, 118, -37, -46, 164, -51, -144, 142, 21, -97, 84, 56, -179, 43, -5, -147, 119, 19, -139, 88, 118, -138, -53, 147, -94, -68, 95, -82, -16, 80, -63, -57, 140, -52, -131, 174, -3, -106, 119, 4, -164, 96, 93, -118, 114, 32, -193, 104, 136, -200, 32, 191, -157, -51, 165, -184, -49, 211, -112, -127, 208, -87, -156, 247, -56, -165, 169, 37, -218, 115, 46, -221, 141, 101, -222, 77, 152, -170, -11, 192, -103, -42, 158, -138, -11, 273, -106, -27, 213, -80, -182, 170, -37, -160, 191, 36, -163, 207, 81, -247, 103, 93, -254, 18, 182, -237, 4, 144, -192, 52, 184, -164, 16, 233, -148, -62, 256, -120, -178, 209]
5935B09k20m8K41j73j81L90k35j69M24j53l78L78P9l70K43N5k93K66M1l33K35
5956HK49m78Q6L44l53N0K60j82p5K75l13P9K24k43j66M67j83k60L28m0k51K10
5978C6Q9k62K66j1l62L11J36m82K59K26l53%L82k88j3K36k23L3J68k44p6M25k31
6001B2k61L78m2k54K46m1k15K20P6l31L13P8l87J97J89l51J15K06k41L8K04j90
6023c1n3J79j90r5L48j74j72L36j26j01J67k0j97K19l2k15K20P6k64J29J33k85
6045a48M3K58j89J3J26j93J4K17k01j5J62j01j56L00l4k46J54O2j70J26M7j68
6067i9N4J46j98O7J83k06j0J78j21q2K51j80l2J58p9j10J91m5k46K44L4k26J66
6090C8L9j75P3J21k13R3J09j95Q6J27j47K3J30j55q1L04j20j29J93j09r6J73m6
$$ y = [209, -11, -59, 182, 9, -172, 218, -17, -186, 238, 85, -293, 85, 164, -206, 37, 92, -201, 65, 106, -227, 8, 257, -221, -135, 209, -144, -94, 166, -16, -91, 184, -129, -50, 174, -69, -235, 232, 49, -211, 117, 77, -174, 36, 125, -137, 129, 118, -244, 67, 203, -279, -20, 206, -147, -147, 235, -53, -66, 170, -53, -20, 148, -96, -172, 253, 22, -239, 139, 97, -157, 89, 48, -167, 53, 129, -202, 111, 189, -198, -1, 188, -163, -48, 158, -83, -45, 159, -31, -84, 95, -95, -190, 158, -16, -188, 148, 22, -79, 88, 68, -129, 90, 58, -157, 63, 139, -125, 4, 137, -148, -105, 153, -36, -23, 103, -90, -76, 141, -60, -75, 87, -14, -170, 130, 96, -150, 4, 66, -104, 22, 69, -99, -45, 101, -97, -30, 153, -53, -63, 115, -6, -88, 163, -17, -49, 109, 30, -80, 111, 66, -180, 64, 98, -128, 38, 77, -98, -25, 96, -117, -24, 85, -110, -24, 103, -44, -21, 109, -46, -127, 177, 57, -72, 121, 12, -84, 89, 43]
6113D3j13J90o4j73J41R8k50J52O1j74P8P1j01K7J30k22J5K40k70K2K47j78r3
6136a23K24l5j30J64j22q8J97p9j16K33L0l20K03J51l16Q7M6l6N8J00j85K3K30
6159A96l36L1K86o3k53J84rj07P1M8p9J42j88l0J17R7k43Q7J85j74kJ6m3K2O3
6184A8r0J01R5j73k5K51k30p5J35N2j19L4l6M5J24r4q6J82k1k04J02N0j9j4m5
6209d2K7P7m5r8R1M8q0J3P3p2r3J54p7m2P6q1L5N4m2j08J43K8j41J07M4o0j0N6
6237C5m8N2jq0J8J26j60n2J68n6j9N4O2j04Kk5M3R0j58p3J06J05p0o9M8K5q3k1
6265h5Q7M2m3j4L4m6Pq8M9Q8j04O7J1P2r1mRM0M7j05kP8j1j28J20M5j22L3RK0
6295A5j4Ll2M8L3j33Q2J19j24r1J17Pq0P5n0RP5q7p4K30p4j76R2J18j28K1O8j05
$$ y = [43, -70, 120, 56, -117, 24, 122, -128, 24, 85, -89, -11, 60, -41, -14, 116, -106, -91, 149, -121, -99, 148, -30, -123, 101, 66, -64, 100, -22, -110, 87, 8, -108, 125, 155, -165, 38, 189, -127, -40, 6, -30, 28, 128, -57, -34, 196, -140, -109, 177, 114, -139, 45, 36, -71, 0, 48, -31, 111, -77, -107, 10, 107, -136, -49, 136, -38, -40, -24, -67, -45, 18, -72, 29, 124, -49, -74, 177, -53, -128, 7, 59, -60, -26, -62, -17, 107, 13, -73, 109, 88, -116, -14, 36, 17, 3, -42, -15, 62, 17, -81, 10, 58, -22, -9, 64, -8, -101, 53, -24, -66, 10, -71, -36, 18, -24, -132, 11, 39, -102, 5, 49, -11, -21, 35, -13, 39, 38, -42, -24, 102, -58, -110, 58, 2, -17, 37, 99, -5, -3, -28, 15, 105, -53, -126, -20, 85, 15, -54, -6, 19, -64, -85, 2, 44, 1, -13, 21, -25, -18, -106, -57, 31, -73, -6, 5, 77, -14, -18, -9, 31, 78, -27, -29, 49, 38, -90, 30, 75, -47, -14, -5, 15, 1, 4, -28, 20, 53, -80, 2, 121, -3, -94, 23, 30, -50, 25, -25, -16, 59, -28, -102, 128, 54, -122, -30, 88, -40, -19, 49, -56]
6323e6OK7o6J17J31k85L9K48j57j06J91j9r5L2mjJ19j80q3K74l3k51J56J51k40
6348h5L4M7o5J04pj59J08J54k50L4L03k57j30K22k4m8N6o8l9J51r0j27K59k9k18
6373a24J47J04j64M2L1j90J52J19k44J44J42k82O4K12j58o0J71j26k8K34j72j16
6395a02K57j23j89K73K8l06K15k2j15R6Q3j95J61L3k81K04J70k92K4K01j78L0
6417b8J70j38j0J11k15K2L35j96k44K63M4k62K11N7k21J22qk14K74J14l50J37
6439b6J65k79Q8K01k08L9J22k17R7J80k29p1K72j38j98L62r8k07K57r3q7J65m6
6462E1j82J84J09l90K49J57k97M4K16j93K6J34k53N7K32k43r0L61k06j90L23j8
6484H1j43J38o2j47K28o7k62L62K0l47J60K03k42J3K37k78M1J88k63Q2K80l50
$$ y = [-56, -50, -23, -89, 28, 159, -126, -87, 161, 4, -102, 89, 70, -25, 7, 3, 2, 121, -59, -142, 132, 99, -152, 4, 155, -85, -51, -4, -69, 35, 28, -131, -23, 131, -119, -85, 218, -39, -169, 53, 29, -19, 37, -31, -70, 81, -9, -136, 123, 94, -124, 23, 127, -37, 5, 36, -154, -2, 117, -127, 17, 159, -123, -59, 153, -5, -65, 106, -20, -48, 186, 14, -102, 155, 32, -157, 116, 144, -162, 53, 31, -84, 12, 95, -100, 61, 94, -187, 17, 187, -105, -81, 120, -58, -28, 142, 4, -6, 105, -110, -88, 247, 51, -193, 70, 114, -148, 63, 120, -101, 21, 13, -201, 73, 187, -163, -26, 139, -140, -52, 149, -59, -20, 102, -115, -18, 162, -67, -138, 134, -4, -202, 160, 62, -145, 112, 19, -68, 97, 51, -131, 53, 162, -228, 21, 178, -119, -75, 141, -52, -26, 108, -145, -88, 144, -99, -189, 172, -34, -224, 99, 81, -62, 76, 14, -133, 95, 28, -234, 128, 148, -199, -39, 164, -78, -65, 172, -106, -65, 123, -140, -58, 222, -128]
6506a28q7L96k19j24L38j67j31J93o6j26L17j44l10L53L2k99J10J94l14J48J25
6527I1j84J01Q2k51P0K65l12J2L27k56r7L48j78p8J83j52j34L32j28j77K89k3
6549A30k96K82Q7k98J43N2k02J00J63l31J82P9k14K0L16k84l6J64r4n3J77j11
6571b4q4K25j43j61K61J6k79K35J0j30J07Q9k63J30Q7k37J61J63k59O5J86k50
6593i5QK00j59J2R8j55LK25j53j16J87j05j15K04K9k42K35p3j40K40k5j68R9K5
6617A9j18J17J34k16j1J53j46j0J32q2J2L3p7L6J15l3j64J89l6r0J30oj73Q6M5
6642C9j24J30Nr8Q1lj18O7J35j96J1O8pJJ7n1m2J19o7K4N0m3q9O6J5JM2l6n9Q4
6672B2k4m5L8K6p3L9Q5j05N2%m9N2m3LLJ7J1lj5O4n0L4n2o6J11j0k9L5rKl0K6
$$ y = [-128, -215, 181, -38, -162, 176, 9, -122, 71, 5, -121, 196, 52, -258, 95, 127, -172, -62, 132, -182, -34, 91, -93, 8, 90, -161, -91, 174, -138, -126, 201, -55, -152, 196, 18, -60, 123, -29, -163, 169, 41, -136, 153, 130, -166, 116, 203, -95, 48, 100, -102, -2, 161, -170, 12, 91, -123, -103, 213, -71, -107, 57, -37, -90, 87, -24, -108, 117, -26, -187, 74, 90, -189, 46, 56, -74, 33, 122, -141, -11, 76, -161, 0, 163, -96, -31, 155, -95, -87, 113, -46, -34, 64, -91, -88, 137, -16, -132, 55, -50, -165, 39, 68, -174, 61, -12, -152, 88, 63, -105, -6, 19, -99, 18, 152, -64, -75, 78, -68, -78, 54, -28, -16, 17, -60, -24, 91, 58, -106, 83, 47, -43, 87, 81, -92, -6, 39, -85, 45, 50, -48, 33, 30, -88, -21, 114, -82, -71, -3, -10, -9, 8, -43, -85, 34, -33, -9, 41, -2, -91, -25, -10, -9, 33, -3, -62, 22, -2, -47, -9, 17, -56, -17, 68, -37, 15, 15, -34, 18, -25, -22, -19, -2, 9, 6, -9, 55, 5, 39, -13, -79, 32, 22, -7, 28, 19, 21, -9, 17]
6704A7ll6K0j5m7O4J9J8j5J8o6M7N6m7j29J16J3j07J31Ko6K3rL1K0j2o3J8Q1j08
6734b9k3J52j00l8k8O8L5o5K0l2M5j24N4J00Qj65O9J37j16K9M3n4k4L9m9J39n5
6761C6m5o5J58o0jK1l4J8p4J3L0Q7j64MJ25O6j63M2M8n5n4J14j1Nl1j11Q1Q8j66
6790i8L6J68j07j85J73Q7o2J7l4KP6o4q2J16K8k03J05K02j69k9M7n2NL1r1M5J37
6817I9j66n4J91j2j46O1K2l7N6J2j12J60j06j23K01J26k12M3N7j27L9Q2n6J8L0
6842D6j56Q9K53k25r6J92o1j52J62J7j56J71j52j4K18k6k43J72N8j54N5J07k00
6865i5N5P6j11J45L8k60O0J97j65j10L19j64j24J34N6r5J14j27r0K83l5k32K23
6888I2M4k84J61Q0k01J57R2k82J30J39k48J9L09k52j01K95j83o7J86j58j1K36
$$ y = [17, 14, -22, -2, -17, -64, 0, 19, 37, 22, 40, -26, 21, 77, 30, -99, 17, 30, -77, 54, 56, -10, 13, 4, 35, 55, 43, -20, -2, 79, -29, -52, 100, 0, -38, -66, 2, 37, -28, -8, -40, 5, -119, -65, 35, 43, -122, -53, 84, -32, -3, 40, -14, -38, 1, -48, 91, 36, -9, -74, 84, 24, 23, 44, 10, 28, -46, -33, -3, 84, -80, -76, 49, 115, -48, -6, 42, -13, -67, 47, 36, 41, 10, -101, -20, 68, -98, -62, 106, -1, -186, -13, 74, 12, 29, -5, -3, 73, 9, -73, 43, 71, -132, -27, 175, 6, -23, 24, -28, -23, 8, -83, -38, 99, -67, -121, 70, 58, -88, -27, -5, -42, 14, 26, -86, 74, -32, -155, 46, 172, -40, 3, 60, -67, -28, 54, -2, 16, 46, -110, -21, 232, 7, -89, 103, 42, -110, 52, 69, -87, 84, -68, -82, 136, 110, -133, 39, 97, -57, -2, 105, -95, -40, 36, -75, 70, 108, -152, -92, 105, -60, -170, 149, -15, -139, -5, 51, -44, 70, -57, -147, 136, 101, -131, 92, 136, -148, 13, 93, -108, 49, 141, -141, -11, 128, -120, -101, 208, -44, -145, 150, -33, -100, 86, -72, -83, 153]
6910A53j68j60K86j0l22K26Q9k16J02O5j12O3O0k03J80J23l39P8L21k93J4J50
6932H7r2n5J52j09l9K48k11j78L76o4l00K48M7k04Q7P2j71J76J0l12K07J72l14
6955a67J00K96l08m1J94j06o0K14k08k4L15k84p8K73rl16K67M9k10J50Pj86K18
6978H6N0k94K20Q6k92J07K59k57p7K31k04k9K14j50m1K92k53j71M05j22k51K63
7000G2j5j73J88Mk28J75M0k66K53J35l19Q1K21j90p1K69j96q8K41j51jJ98j32
7023D7j62K73j64k16L57l4j96J30L3j78J72M1k62J79J06k50J78J00l07J04J72
7044A23l05L0K79j40q0K32j91n9K99j94j47K71p1j72K17K7k69J70N5k22J83N7
7066I3k26J79R1k24R8J52k67N0J57j51p5K46k39l7K92j59j05K32j39j31K90o2
$$ y = [153, -15, -175, 111, 101, -221, 5, 94, -122, -20, 45, -67, -4, 56, -147, 33, 156, -183, -105, 216, -77, -63, 87, -5, -60, 92, -17, -56, 192, -19, -197, 179, 115, -185, 63, 110, -94, -7, 65, -106, 70, 80, -232, -25, 147, -167, -67, 229, -79, -120, 74, -32, -92, 122, -86, -110, 205, -79, -157, 116, 107, -209, 58, 107, -103, 47, 54, -132, 86, 136, -158, 62, 148, -144, -37, 222, -35, -112, 119, -85, -114, 100, -50, -91, 201, -52, -223, 182, 60, -191, 72, 57, -116, 72, 76, -152, 23, 63, -203, 50, 185, -134, -53, 168, -22, -93, 176, -20, -108, 133, -18, -19, 179, 47, -115, 158, -6, -222, 135, 101, -95, 35, 68, -110, 62, 103, -159, 20, 126, -124, 54, 154, -153, -49, 123, -182, -152, 127, -13, -93, 139, -52, -111, 188, -6, -153, 118, 47, -125, 92, 119, -150, 20, 75, -147, 36, 93, -133, 46, 137, -87, 11, 163, -104, -54, 103, -48, -123, 123, -116, -153, 139, -20, -125, 107, -32, -163, 127, 65]
7088F5j84J87rk16J71P7k02K03Nk10Q6J68k64N2K09k02PJ75k04kK15j27j07K15
7112A08j26p0K40j34j79K43l3j41K06q8k11J89R3j87Q8J46k55Q4J34k44J15J59
7134A37k35k8K43j71m3K18j75l2J77j11n3J83j17p7J11M4j38Q3N1j23J09M9k25
7157a23J02J80k92J11J80k44L5J10j06lJ35r2j7Q4j24n7K13r8r4J61j0j47J55
7180E9m5j10J07Mm5oJ43j67QJ50k40J30J07r3n7J18m8k3J30j39p5J50k5j14J94
7205A13m7j34O7P0q3M4n2k4J00m7r2M6J33k08M1R4k1k3J9p8J33k2j02P5R0q5m8
7232d1J22n5m7K9j4J6M3o1rJ14j02n7K8Q3p0kpO6Jm0l8P9m6n6L5%O7j02P5L5o1
7263a5m5L6J05j36K0M7N0j09J3j2R2n6q8R6P8j9j39J51l1l6l5M4qj6kJ3P3m0j42
$$ y = [65, -119, 68, 59, -157, 14, 91, -111, 92, 97, -113, -27, 141, -123, -71, 138, -64, -57, 118, -86, -88, 127, 0, -107, 108, -18, -88, 152, 18, -161, 82, 49, -92, 114, 26, -185, 4, 97, -90, -2, 144, -111, -27, 107, -137, -22, 137, -98, -126, 117, -54, -97, 121, -54, -86, 91, -20, -73, 110, -7, -84, 27, 71, -67, 16, 67, -56, 53, 102, -123, -21, 159, -133, -22, 158, -86, -51, 59, -47, -50, 85, -7, -24, 60, -64, -121, 92, -6, -100, 61, 51, -96, 59, 14, -96, 11, 15, -30, -36, 107, -60, -52, 98, -142, -12, 95, 2, -55, 63, 15, -8, 122, -17, -92, 58, 33, -81, 113, 66, -68, -1, 69, -14, 30, -22, -46, 54, 7, -85, -39, 94, -114, -73, 21, 0, -23, -4, -82, 51, 29, -73, 2, 92, 7, -41, 81, 26, -21, 8, -6, 10, 53, -8, -17, 97, -5, -62, -34, 49, -21, -23, -30, 36, 37, -3, -41, 38, -8, -64, -29, -29, 38, -64, 11, 46, -15, -60, -24, 81, -55, -35, 12, 62, -47, -34, -46, 46, -10, -98, -2, 76, 57, -82, 69, 38, 2, -33, 11, 3, -13, -15, -2, 71, 31, -111]
7292a11Q1J38j96O5P6Op8J6l1L8J3q9l0K07q4n3P7K7j26K8K5RM3m3q6J50Pk07
7320a28J39J32j28m4Q1r9Q5J0j33N8J12j61M7J24p3j00J13Qj13J03p0n5K14j00
7344B2j57J96J9j48Q2J19j66L6P7j35O0M2q4L0J23j95J4J64o7j28J71m4o0O3l8
7369dm9J92j15j43J73L3j46K8R7j69N9R6j52R3M1q7Q1J27k29L8J14j35l2K16j35
7394hj17K13j05o0J69q8j81K61o9j14J69Oj04M5Rq9R3R9k29K2J96k17j3K72j88
7419b8rJ16j18p1K47j31j17K09o0j87J72J1k12J61J11j99R7J13k21J06K27l22
7441a05L7K13k29J02J11k11j9K62k61n3L00j01j47J89o8j80K61n0k29K65J7k55
7463a51K73K4k73J06J77k76O1J64k06L1K02k36J2J87j03j25K30r0k08L06r2j31
$$ y = [-111, -30, 108, -88, -23, 53, 59, -19, -3, -34, 4, 17, -72, -102, 105, 21, -32, 45, 72, -54, -26, -1, 8, 51, 8, -78, 72, 79, -128, 11, 143, 15, -29, 52, -47, 38, 48, -85, -27, 85, -76, -29, 95, 22, -78, 35, 43, -70, 33, -37, -92, 122, 22, -135, 61, 80, -68, 14, 133, -33, 3, 80, -55, 5, 47, -37, -7, 116, -79, -65, 99, 32, -96, 75, 31, -29, 34, -4, -53, 139, 24, -119, 54, 87, -59, -31, 66, -103, -44, 52, -100, -7, 34, -53, 28, 155, -74, -36, 78, -57, -89, 127, -8, -125, 88, -17, -77, 92, 4, -177, 84, 15, -99, 70, 76, -28, 17, 26, -63, 30, 129, -100, -78, 118, -99, -112, 160, -28, -37, 79, -39, -110, 137, 6, -111, 98, 38, -149, 23, 34, -178, -17, 94, -105, -8, 105, -116, -10, 217, -105, -68, 145, -84, 18, 129, -82, -101, 161, -100, -153, 147, 46, -101, 88, 20, -160, 101, 51, -178, 87, 104, -151, 122, 146, -127, -21, 156, -120, -59, 105, -101, -70, 132, -104, -92, 95, -8, -133, 97, 7, -201, 105, 13, -118]
7485a18J86l8j40K31q2j83J95O7k77J79J18k09L6J88k79P0J77k18J8K50k09j05
7507a43K70j07j26K43j31j37K82j45j49K40q1j94K24M9k94J75J91k84O1J57k35
7528a34N3K05k73P1K93k62K5J69j86o9K34j27j45K39r1j22K17m0k06K41j5k19
7550a42J62O0k61J73J64k58J26J19k38N8J32j81J9J96j41q6K26j28j33K50j60
7571d3r0J83k4j55K36mk21J13R0k03J64Q7k30R3J06k32R4J99k13JK20k26l7K26
7595A34j58p2J98j16r9K00j1k22K29m1j68J88o2j79J65M7j61P4J35j76O2J53j68
7618d8j4K07j83k3K44j97r0K58k27j06L46j40j08K30o8j77J62rj80J84L7k49J66
7641A5J10k23O4J69j97NJ69j30l8J72k18n5K98j72j38K35k6j62J51M2j12J14J
$$ y = [-118, 68, 30, -110, 121, 39, -144, 51, 118, -159, 20, 138, -71, -35, 153, -126, -56, 121, -97, -79, 171, -38, -143, 127, 20, -106, 137, 6, -131, 151, 6, -143, 97, 16, -178, 46, 95, -199, -24, 167, -117, -56, 101, -134, -81, 124, -149, -78, 215, -47, -22, 147, -39, -108, 126, -1, -146, 93, 2, -120, 97, 57, -149, 92, 77, -142, 20, 80, -181, -8, 156, -102, 24, 143, -95, -37, 95, -86, -67, 129, -12, -98, 128, 0, -133, 117, -43, -133, 50, 26, -129, 107, 103, -118, -5, 85, -118, 46, 133, -97, -4, 102, -130, -36, 163, -50, -49, 171, -55, -92, 134, -24, -96, 102, -14, -113, 87, 76, -146, 83, 42, -126, 62, 0, -179, -14, 33, -128, -54, 81, -95, -33, 120, -48, -62, 145, -38, -61, 183, -14, -104, 154, -73, -179, 167, 27, -81, 149, 81, -96, 66, 57, -123, 61, 98, -151, 15, 125, -98, -34, 135, -62, -57, 112, -18, -56, 116, -102, -157, 141, -31, -169, 66, 40, -122, 29, 71, -41, 73, 74]
7664G4k12J98K9k17J61P9j87P0P3r0l3J08r7%J76k18NJ12j4j34K34r5j22J31k9
7689Bo1Q5m9j22J68J9k02J44J06k15Q5J64j31k5N3j05R0R7j62QR7k9j51K37q2
7714B1n4J12o1q5J33o3o1J09pr7N0O6j70P2Q0n3rL3j28Q9J62k27L8J86j64j12
7740a40K24r0o1J13p3K0L7m4o2J30n9k8P3N9j23J6P9j12O9P4j85R4O0j20J9J20
7766I0j48K1J10q9m5J18q8%R4j36L3O8j6n2QQ9p7P6m0m8J3J2n0L8J06j57O1M2
7794C3o6N2l0N8k0rl5j0R6q8K4N4k6p3P5o6l1Q5ro7M4kj8J1L4m0l5OL6L0J1n5
7826c1K3Lk1QN1l9j5%L6J1j4l9L1L6p1KJ4K6l3pK7OJJ4M6o5p5N6J06j53M5L1J3
7859B3Po7%Q6n3n4J05Kl9n5L0MM8nm7l3P0j6o1P2J0j05J26K0n8j5M7n5N8n8n6
$$ y = [74, -138, 60, 89, -128, 33, 112, -75, -5, 68, -22, -55, 53, -44, -44, 132, -86, -81, 31, 17, -117, 117, 22, -100, 31, 2, -59, 26, -23, -145, 23, 42, -160, -16, 90, -125, -40, 124, -7, -32, 21, -84, 6, 103, -59, -51, 46, 17, -134, 103, 21, -33, 79, 18, -67, 66, 3, -58, 51, 44, -53, -3, 63, -107, -35, 45, -8, -17, 16, -112, -23, 139, -88, -50, 136, -28, -140, 84, -6, -67, 46, -27, -7, 30, -14, -76, 54, -5, -33, 40, 99, -24, -8, 71, -41, 28, 102, -83, 11, 71, -49, -30, 90, -58, -37, 73, -16, -61, 57, -31, -31, 63, -73, -40, 28, 12, -40, -32, 57, -20, 56, 16, -32, -19, -7, -57, -19, 87, -70, -9, 33, -33, 19, -11, 47, 27, 18, -17, -27, 69, -19, 5, 59, 33, -40, 35, -31, -62, 23, 14, -53, -9, -11, -29, -18, 16, -24, -59, -53, -17, 13, 24, -31, -8, -5, -26, -18, 33, -6, -21, -21, 15, 26, 12, -27, 4, 40, -31, -29, -15, 11, -22, -29, -2, 4, 5, 19, 65, 0, -75, -19, 87, -66, -21, 10, 23, 30, -37, -37, 49, -4, -58, 47, 49, 10, -45, -15, -11, 37, 32, -15, -48, 22, 6, -55, 17, 27, -78, 48, 68, 10, -5, 42, -13, 45, -13, -69]
7890f9R0R9j63L5J27j56M3M7r3O0Kq6O6P8r8m7J02o3p7J34K3q6N7o2J6Q4n6j23
7918a16J71K0j20Q0N3j08mQ6j04P7j4j03R8Q5j65M5P3k4j32J49n4j3J23j34l1
7943f2J54m4j29J09K3j51O8J13j61N4O8j57J04R5k37J56J11j63l6K01l2j98J92
7966G8l8j16J37l4q3R5j6j26R7P7j18Q2K1j49J67l4o9N4M8j77O6J45j79J3J48
7991H9j45qJ49j41j3J58r6p2J52k5j07J37n7j49J60M8j29L2O7r4M9P3j75J14R9
8016A16k03P7J47j21o0J51j39K3J03p1j22K00p1j21J30Nj50J66l4j22P1P5j08
8039e8O8N1j78J46N4j31M1J04j82K3J95j65m1J85r3q7J89j44r3J75pj26J38J5
8063G9j79J57j0j79J85K8j95J19P1j76O9R2r8r0K29j66m5K14p2j35J94r0j7R9
$$ y = [-69, 21, 120, -43, -8, 119, -37, 6, 53, -40, 20, 22, -64, 2, 80, -18, -65, 37, -26, -103, 31, 54, -32, 25, -37, -21, 63, 7, -116, 55, 75, -45, 35, 88, -20, -24, 62, -42, 35, 21, -82, 16, 101, -64, -19, 54, 30, -102, 47, -7, -20, 103, -31, -62, 92, 48, -81, 28, 51, -100, -32, 81, -80, -26, 42, -115, -11, 84, -153, 3, 114, -49, -85, 116, 84, -114, 78, 40, -76, 61, 27, -56, 39, 23, -103, -6, 71, -47, 35, 56, -93, 74, 40, -29, 25, 73, -104, -38, 107, -72, -59, 89, -56, -64, 85, -56, -69, 89, -7, -79, 73, 48, -59, 78, 21, -128, 32, 80, -49, -17, 50, -44, 5, 78, -97, 17, 116, -87, -10, 137, 16, -44, 107, -32, -9, 94, 23, -99, 101, 30, -91, 39, 44, -106, 60, 26, -96, -25, 50, -58, 10, 61, -117, 29, 83, -48, -7, 97, -85, -62, 133, -32, -73, 112, 19, -68, 121, -23, -116, 59, 52, -74, 64, 79, -100, 57, 47, -132, 53, 81, -114, 5, 76, -100, -31, 61, -37, -127, 102, -64, -109, 105, 33, -102, 92, 2, -15, 84]
8087H4q6r1J77n1j16J12N7j58L8J44j72R8O1j47K2J12j64R0J03j99k3J49j6j11
8111h7J97r4j07J36l0j59J80K3j67J74l7j18P1M3j31N3J02j71J69Lj83R8J01j45
8135g9N3J12j33j3J66j06mJ13j29o5K26j36r0J70p7j03J23L7o8K4Rj10R0M5j55
8160a00P6R2j61O3J14q1n7J52j63O3J9m0m2J39j03m6J16K1j53Q5M9l8J49j37n8
8185d1P9O9j81J04O9j44
$$ y = [84, -2, -93, 84, 33, -83, 29, 86, -72, -34, 110, -62, 36, 97, -50, -28, 84, -80, 10, 113, -86, -109, 40, 24, -87, 110, 16, -91, 45, 15, -144, 36, 59, -108, 66, 29, -89, -18, 25, -106, -53, 49, -122, 47, 50, -133, -35, 66, -79, -26, 86, -47, -60, 106, 0, -4, 109, -20, -85, 141, 5, -85, 85, 8, -95, 28, 65, -3, 21, 30, -80, 10, 55, -100, -24, 68, -93, -30, 84, 3, -54, 98, -65, -2, 17, -23, -65, 74, -29, -75, 41, 62, -91, -6, 43, 5, 154, 17, -41, 38, 107, -74, 30, 99, -45]
8191d5
$$ Imaginary data points
##PAGE= N=2
##DATA TABLE= (X++(I..I)), XYDATA
0@%%%%%%%Qj6J6j6J6k4L3m1N1o0P5r8J21j40J65j98K38k81L27l80M40n06N81o69
31c58P64q65R81j111J254j409J576j762J969k193K438k708K998l316L665m045
47b122M463m919N417n967O575p245P990q825R761j0824J2043j3452J5106j7078
61i077J9475k2464K6316l1478L8787m9998O9472j12375L59956j98937o31786P97353
73B55244r0945m40875M08590j7162l68262M40873j50800l66441O14280j5870p53487
84d84855M83439L77538o24726J45072M00119m48203P1202K72567l92954J92208
94h593L50768o12644L7262O41198m51493k76642O08072k01440l76000M15500o6066
105E9922k40515L87438j75597l36019N08949k7333n12754M18546J89672n37883
$$ y = [0, 0, 0, 0, 0, 0, 0, 0, 8, -8, 8, -8, 8, -16, 17, -24, 27, -33, 42, -56, 65, -75, 90, -108, 130, -151, 176, -204, 236, -270, 311, -358, 406, -459, 522, -589, 665, -744, 832, -930, 1039, -1154, 1284, -1424, 1574, -1742, 1923, -2122, 2341, -2578, 2839, -3128, 3447, -3798, 4192, -4633, 5128, -5696, 6347, -7105, 8001, -9077, 10398, -12066, 14250, -17228, 21559, -28439, 41033, -71342, 288614, 89677, -542109, 255244, 164299, -276576, 132014, 114852, -253410, 187463, 36663, -329778, 284502, 268632, -484855, -1416, 376122, -248604, -103532, 296587, -151616, -80414, 192153, -200801, -8593, 342175, -270469, -233207, 407991, -43502, -320144, 287928, 86488, -289512, 125988, 59922, -180593, 206845, 31248, -304771, 204178, 176845, -335909, 82637, 272309, -265574]
115b65574J94645K93331l53888J27357J88214l85153J66626K82784m44892Q1770
125a14780M30259m17741j33635M70620k13757j99531L56895j83804k01440L81776
135A74862j36126k61094M04223n9452l97858L30744J30165l58443J82449J31998
145A41468l05951J64151J56242l00721J49275J90931l69859O5430L28284k78154
155e8904o2871K94648k12851j01338K94368j55869j29077K86554j53394k05653
165b04387L33473j9936k76248K27429M2325k62847J80549R6883k34506J39219
175B1954R1272k64042J33405J90141k64003K1621K05556k09921j6193K25328j58155
186b3037n3207J97274j67143p7770K65491j10859j74788K27702k9920j90422J91915
$$ y = [-265574, -70929, 222402, -131486, -4129, 184085, -201068, -34442, 248342, -196550, -114780, 315479, -102262, -235897, 234723, 20966, -178565, 178330, -5474, -206914, 174862, 38736, -222358, 181865, 122413, -275445, 55299, 185464, -172979, 9470, 141468, -164483, -332, 155910, -144811, 4464, 195395, -174464, -109034, 219250, -58904, -121775, 172873, -39978, -141316, 153052, -2817, -131894, 154660, 1266, -204387, 129086, 109150, -167098, 60331, 102656, -160191, 20358, 117241, -117265, 21954, 113226, -150816, -17411, 172730, -91273, -69652, 135904, -74017, -90210, 135118, -23037, -76244, 121030, -46113, -123883, 141608, 30749, -144039, 83663, 53743, -136679, 55236]
197E5236L5309j87147J25212K7150j80289J53966R0046k21343P7436J38031j91979
208g8372K3799J67638j40306k8058J24721j21735L393J68165j41034p2133J90789
219I6867r2150j23901J93975r413j56940J13146J4268j11226J25514R194j56655
230i7321J15933N7037j77156R0719J32472j69093j3070J25062r2098j241J01003
241G2247j06513q320J18372j14628k9815J75291q6073j25973J42010J957j03917
252f5362R9050N558r7452Q2765j183r8744J17781L3657j64176O1681J07355j18910
264c7980N957J00944q4740k2372P0744o0498J6465Q5601j05646l3673J30381n5398
276I785p5996J14206j1843r8895O4688J9878m7925O2568j8089q2623Q2953K5065
$$ y = [55236, 90545, -96602, 28610, 55760, -124529, 29437, 119483, -101860, -24424, 113607, -78372, -54573, 113065, -27241, -55299, 69422, -52313, -48920, 119245, -21789, -93922, 96867, 4717, -119184, 74791, 65378, -91562, 21584, 35852, -75374, 50140, 59334, -97321, 18612, 75649, -101507, -10788, 121684, -47409, -60479, 64583, -27515, -28756, 72247, -34266, -42586, 75786, -38842, -68657, 106634, 20561, -105412, 36598, 38555, -65362, 33688, 39246, -58206, 24559, 23376, -75368, 42413, 76070, -88106, -26425, 80930, -37980, -32023, 68921, -15819, -38191, 32553, -27945, -11480, 74121, -31525, -65198, 65183, 9785, -66211, 47995, 36152, -62743, 1945, 21823, -26102, 36466, 18377, -64246, 18707, 43772]
288D3772j01917O2168O4816j10419n44Q4530m3659q033L9636n6494N876N8555
300C8287n9544j855Q2427o3752n7514Q7349L548n6096L8751r67l9170L7463o14
313H313k8966N0237j0915p0856M7873M6305n6830K695L7843l6725q623L1093r674
326A770O079Q193m2359P478M8174k5444k1891L5618j1196l3169K3708J9787j0848
339E900m092j1331m098K2771j19j6876J3168L979k5812K101K9105J667k1546n844
353a1027J0134K358k851O390K731r180o895p83J1279J6679j4235k2805J7022R721
367H538j9819J3829J8175k7912q035J8375o528Q644J3157l1868k124L1991k2395
380e972p573M0802k2599l4086L5790K354k1134L0903j1064l6461L7737N801l9079
$$ y = [43772, -58145, 4023, 68839, -41580, -42124, 42406, -1253, -9286, 30350, -26144, -20268, 38287, -21257, -23112, 59315, -4437, -61951, 25398, 28946, -27150, 11601, 10634, -28536, 8927, 8313, -20653, 29584, 18669, -52187, -4314, 41991, -14839, -12144, 25699, -11026, -19649, 11444, 1770, 7849, 16042, -26317, -18839, 29335, 3891, -18000, 17618, 6422, -26747, -3039, 16748, 5900, 1808, -9523, -13621, 9150, 9031, -7845, 5323, 9302, -16510, -14409, 14696, 16363, -5183, -11027, -893, 1465, -1386, 5004, 7735, -1445, -8340, -9123, 2156, 18835, 4600, -18205, -1183, 8538, -11281, 2548, 20723, -7189, -15224, 3151, -3377, 5267, 18424, -13444, -15568, 16423, -5972, -13545, 27257, 4658, -29428, 6362, 8716, -12418, 18485, 7421, -29040, 8697, 14498, -24581]
393b4581L8808J2892o0129K2859L6969m2122J5003K8970n4463R662M7673m7516
405a5975K073N5484n5698k4420O9476k5413l0787N6105l0410m0319O6221j4253
417A2084m8317O7509r321p6069O2913K9317p1156L8079K7501p2272L5664M3109
429C9041p1509K9524N3002q9542O679Q8622o4452k6513P6627m8123l2952P6135
441C6539l5611l4186P7614m5528o0231J01261o165q9412P3265K0018q8241N3003
453B326L6669p3513M4447K5553r2391N5200O8203j08476J2638R4993q9306k5872
465d9529J00965m7708l7723P1181n1361k6397R6685n4329o3083J10525k3955r9927
477g4656R6967L0058r9031M7733K9208p4140N7705K6963r5375O0528N6041j21930
$$ y = [-24581, 14227, 27119, -33010, -10151, 26818, -15304, -301, 28669, -25794, -16132, 31541, -15975, -13902, 41582, -14116, -38536, 30940, 5527, -25260, 30845, 435, -39884, 26337, 12084, -36233, 31276, 21955, -54114, 8799, 38116, -33040, 5039, 32540, -39732, -4068, 39041, -32468, -2944, 50058, -39484, -32805, 55817, -8635, -35148, 41479, -6644, -39596, 36539, 928, -33258, 44356, -1172, -61403, 39858, 33693, -55719, 17546, 37564, -50677, 2326, 38995, -34518, 9929, 35482, -56909, -1709, 66494, -41982, -29344, 65649, -23657, -49529, 51436, 3728, -33995, 37186, -14175, -40572, 56113, 1784, -61299, 49226, 25271, -74656, 22311, 52369, -46662, 1071, 30279, -43861, 13844, 40807, -54568, 5960, 62001, -59929]
489e9929L0705J10533j00025l3625J00323n1946l3560Q0789m9083k9279Q7445
500E2348o3339n3718J24840k7935j08641R6840K6819j00768N8182L6874q0383
511c8881M7494K1499q9495P2796N4898j29587L4239J05973j11083j8724J16112
522F5241o8327m3992Q9411n2694k8378J02167o7717o5149J27059l2304j07433
533h2116J15026K2947j18575O3765M1706q7169N7389K8708j02600O6647N7220
544F2948j27404M5514J07653j25951j7691J22697p7450l9616J05410o2804m3975
555e0669J09161o0368o3750J30154l8832j12853J19886J8139j19881Q2186M0267
566E3440j10055O0567M4280j06600O3285O0447j30448M3214J03898j24051K78
$$ y = [-59929, -29224, 81309, -18716, -52341, 47982, -3964, -37524, 43265, -5818, -35097, 52348, -10991, -64709, 60131, 32196, -76445, 20395, 47214, -53554, 4628, 41502, -38881, 8613, 30112, -59383, 13413, 68311, -61276, -27037, 78936, -32147, -50871, 65241, -3086, -47078, 42333, -10361, -38739, 63428, -4289, -69438, 57621, 25317, -82116, 32910, 55857, -62718, 1047, 42753, -44416, 12973, 41681, -60919, 5728, 62948, -64456, -18942, 88711, -37240, -54931, 67766, -9684, -49300, 56110, -6694, -50669, 58492, -1876, -65626, 64528, 25696, -87157, 32729, 50868, -69013, 13173, 53440, -56615, 3952, 48232, -58368, 4917, 65364, -65084, -21870, 82028, -42023, -41745]
577d1745J20903j02027l4182J21337p4260m3679J21789p0812o8512J36353m5341
588A9824j01599J32201r598j26784J11805L1318j27240Q3822M7887j29979O4173
599d170P0479j24500M4844Q5499j24552K4622J06693j19047k024J23718j11451
610b9889l5573J44561q0535p0271J38900n2363r2566J30100k5203j05194J23000
621D4967m810j26579J17225L4900j44275Q3443O6552j38550N2393Q4879j21272
632e1127L5873Q7952j27067K4948J16976j30976j3503J45490j06371n7165J50297
643G5327o4654q1526J29127m5916q7734J31692l0483j12051J34703L951j43281
654i0845J11612N2774j46743O5748P3840j24171M6832P8856j20111L5696R3529
$$ y = [-41745, 79158, -22869, -57051, 64286, -9974, -53653, 68136, -2676, -71188, 65165, 19824, -81775, 50426, 40828, -85956, 25849, 57167, -70073, 13749, 61636, -68343, -4170, 66309, -58191, -13347, 72152, -52400, -27778, 78915, -40132, -42156, 81562, -29889, -65462, 79099, -1436, -71707, 67193, 14830, -77736, 52364, 27161, -78033, 44967, 40157, -86422, 30803, 65703, -78572, 4871, 71423, -67127, -14734, 70145, -51127, -15254, 72698, -54369, -29421, 87555, -43421, -56924, 88566, -17805, -74970, 75327, 10673, -70853, 58274, 12358, -75376, 56316, 25833, -86218, 48485, 52436, -90845, 20767, 73541, -73202, -7454, 66386, -57785, -10953, 67903, -52208, -16512, 77017]
665G7017j28795J0714J26092j13546l2276J34379p9694n5533J26209o0207p0226
676f5866J24585m7124r1881J33664j2807j23388J11951K8347j28448P8025N0089
687E7147j16574N8914N7183j14759N3161P7648j25721K4154J04702j12259j0256
698d6660J15509q5226l1645J09604p1686m2113J16128o4694p0071J26651l2645
709B3152r8724J13636O530j09447Q1333K6585r9887O7602L5161j03681O0845N7205
721F0310j12201L5960Q3081j02917M10R1312p6062j3962Q6063o7107k1827R2323
733E5383o4962m3779J06529m2959p4373J00704n547q5227P5004J2562q1275O0815
745A2875J9847q2341N8877L7124r4200M0633O3025q9246R281P2238o8772p082
$$ y = [77017, -51778, -41064, 85028, -28518, -60794, 73585, -6109, -61642, 64567, 4360, -65866, 58719, 11595, -80286, 53378, 40571, -82817, 29134, 57481, -70967, 7058, 57147, -59427, -513, 56670, -58089, -4928, 72720, -53001, -28847, 75855, -36404, -46660, 68849, -16377, -48022, 61582, -10104, -52217, 63911, -783, -70854, 55797, 23152, -75572, 38064, 44594, -64853, 16480, 43065, -56822, 10780, 45941, -57740, 3105, 60310, -51891, -15931, 67150, -35767, -35357, 55955, -20107, -34069, 51994, -15113, -36940, 55383, -9579, -53358, 53171, 10212, -64161, 36543, 30996, -54231, 20773, 33335, -47940, 12875, 32722, -49619, 9258, 46382, -47818, -7185, 55840, -33406, -24125, 48113, -20659, -27741]
757b7741O8899n5935j0384P0941n8093k6388Q4321m4173n1697Q4556j4802o5612
769d6108O6289N585o3081N0583J0104o3014M9159K2579p1109L8699M2959p2357
781b9712J4021N5218n6761m226N2411m2878o888N1518m2086j4769N8993l8054
793c213l3098O4913j7404m7653N4032J632m8499L9974P654m6625L5859J2903n1101
806c0626L3613K7880n6201J7037M0861m8831m43M2804l5448o723L9596l0563r150
819a6194M2801l0557k1127M8654j8858l4084M5479j524l8960L2600P155l5548
831b0163K5253R150l5915K4165J7155l9437J6770K7868l8517J674L2605k7595
843f987o350K9893k0241p733K8390j9622j1970L2013j6254k1809L3292l708k7499
$$ y = [-27741, 41158, -14777, -25161, 45780, -12313, -38701, 45620, 1447, -50250, 34306, 19504, -46108, 20181, 25766, -37315, 13268, 23372, -39642, 9517, 32096, -39013, -314, 42645, -29712, -15691, 39527, -17234, -21460, 30951, -11927, -18815, 32703, -9383, -24152, 34841, -3213, -36311, 28602, 11198, -36455, 17577, 19209, -29290, 10684, 18338, -28287, 7572, 20475, -30626, 2987, 30867, -25334, -8297, 32564, -16267, -16710, 26094, -9354, -16077, 23519, -7044, -16194, 26607, -3950, -25077, 23577, 4719, -29365, 16114, 14590, -24370, 8230, 15385, -20163, 5090, 14240, -21675, 2490, 19645, -19792, -3022, 24846, -13671, -11997, 20608, -6987, -13337, 16556, -3685, -11418, 16972, -2650, -14620, 17393, 1139, -20670, 12622, 8914, -18585]
856a8585K5422N393k6583J6825P490k3159J5010R076k4898J3562J6019k6224N127
869e525K0866k1893l115K0999j3692n016J7526j2048n575J8340j1771j0025K0550
882I621o757j5631J8502K027j6687J0573M903j3329O614M772j0581O574N219j1708
896e888M861Q544j1086n97R281o234k964O923k153j832L493l486n10M781l825
911f92k595N550m86m609K574L447k627l126K070K610l258j308M852j135l610L479
927A136n80k690M572k312n039Q386j43r825Q311N071j2949L674Q949j0023J109
942b353P969r341K209Q749j2540J546J4142j4817m537J9572j0194j0903J8887
955H389n407j3406J6978l387j4322J8775k058j9972K0259N067k5556J5545J3100
$$ y = [-18585, 6837, 12230, -14353, 2472, 9962, -13197, 1813, 10889, -14009, -447, 15572, -10652, -5525, 15341, -6552, -9667, 11332, -2360, -7376, 10150, -1898, -7473, 10867, -904, -10929, 9621, 2864, -12767, 5735, 7762, -8925, 1648, 6551, -6778, -164, 4608, -5973, 601, 5820, -5888, -1027, 7517, -3569, -4166, 5115, -1119, -4083, 2840, 687, -1145, 2348, -1138, -1648, 3133, -692, -3287, 2263, 1777, -2832, -258, 3189, 562, -2564, -494, 2116, -1142, -2450, 2402, 1267, -2343, 1136, 556, -2134, 2438, 126, -4913, 3473, 3330, -6495, 1816, 6887, -6062, -2388, 6561, -3462, -2353, 5616, -3725, -1516, 7233, -5307, -3761, 10381, -4436, -8973, 10599, 405, -10498, 8389, 2982, -10424, 6554, 3167, -11155, 7620, 5562, -14410, 5849, 10916, -14640, 905, 14005]
968A4005k5953Q302J7012k2070N230J6990k2995M197K1684k5380j242K9138k3499
981d581j1118L2562j5528j7887L0141j0221k0451K9730p407k4917L2193j838l3737
994b3059L0268J0149l8537K1427J9298l6437J3109K2781l3423R707K5684l5712
1006a4745M965L4537l5401o168M1857k7985j8604M1709j7137k3860L7683j2191
1018D660k7048L8580p506l4692L9790K720m4465L3156J7349m5679K1273K4738
1030B2876m1450J3675K7545l9923J0100L3703m2697R91M4471l7603j3648M8063
1042B6103k6160k3962M4258j6392k6641M1776j3092l2689M4366m281m3075M0854
1054A1065J0179m8932K9019K2342m4695J8685K4883m2217J4983L0299m4413P943
$$ y = [14005, -11948, -3646, 13366, -8704, -3474, 13516, -9479, -5282, 16402, -8978, -10220, 18918, -4581, -15699, 16863, 1335, -16552, 13589, 3368, -17083, 12647, 5240, -19677, 12516, 10678, -23059, 7209, 17358, -21179, 248, 19546, -16891, -3782, 18999, -14424, -4717, 20967, -14745, -9780, 24757, -10644, -16812, 25045, -2940, -21544, 20165, 3028, -20832, 16851, 4660, -22388, 16192, 8686, -26006, 13784, 16504, -27961, 5195, 22544, -23135, -1862, 22876, -18574, -4899, 22646, -17277, -7177, 26526, -16171, -15180, 29291, -8312, -21960, 26103, -57, -24019, 20239, 3847, -22794, 18982, 5890, -26799, 17567, 13286, -29789, 11065, 21244, -27688, 1331, 23673, -21022, -2337, 22546, -19671, -4688, 25611, -18802, -10859]
1066a0859M1034m3348p454M9123l0867k0863M5236j9782k4888M1496j4557k8206
1078b3935M2914r658l8643M3110M889m6683L2660J7391m5283K2065K3103m1653
1090a9723J7498K6459m5364J2295L9118m5536l162M8171l5244j8187M7363k1649
1102B039k3704M1393j7540k6611M4948j1924l7807M5371J796m8450L5836J8839
1114B4186m7216K1109K3679m1505J6381K7294m2921J1300L6004m5166j051M8327
1126C0421l6104j7982M7942k2949k5332M4406j5009l0322M3228r076l8744M4257
1138A4736N039m8430L3171J8832m7148K1480K6015m2387J4202K7776m2611J1414
1150g911L7416m5245j747M7177l7996j5654N1163k5832k6607M6772j7362l1042
$$ y = [-10859, 30175, -13173, -20627, 28496, -2371, -23234, 22002, 2220, -22668, 18828, 4271, -23935, 18979, 9321, -29322, 13788, 18677, -28006, 4654, 22045, -23238, -1173, 21930, -19723, -2225, 24234, -21130, -8835, 30283, -15253, -18415, 29756, -5488, -23675, 23688, 2039, -21665, 19728, 2188, -24423, 20525, 8601, -29206, 16165, 17961, -30489, 5347, 24186, -23030, -1921, 21758, -19747, -3366, 23928, -18993, -7693, 28311, -16855, -17906, 30421, -5683, -23665, 24277, 1328, -24004, 20402, 5393, -24929, 18299, 9223, -29521, 14736, 19775, -28655, 4516, 23348, -23800, -2320, 23695, -18692, -4490, 23286, -19325, -7911, 29505, -15740, -17487, 29690, -8306, -23960, 27203, 1371, -25236, 21536, 4174, -26868]
1162b6868M7498j0034m1235M5391L172m8443L8366J7243n0963K4848K4955m6771
1174b2841J9248L1315m8057J0559L9666m6305o62M8549l9784j5391M9924k8639
1186b418k1846N0299k2651l1899N0404j3298m0760N0332K10n0729M0988J4309
1198B2941n1082L2005K2481n2765K2732L1486n1054J5303M0879n0498P82M7166
1210C0376m1907q189M9501l6863j7388N2745k9790k6524N6709k1684m1891N4322
1222A9417m515m7326M6782O281n1552L8526J5686n2856L3172K5601n8119K1356
1234g547M0095n2012P172M4101m5925l937M5746l8461q106M9907l7757k0990N6965
1247B9251k5455l4465N3696j2371m2883M6538M85m1989M1625L818m9992L8935
$$ y = [-26868, 20630, 10596, -30639, 14752, 17924, -30519, 7847, 25090, -25873, -1025, 23930, -22841, -3593, 27722, -20335, -9776, 29890, -16415, -17077, 31472, -8312, -23703, 26221, -2418, -24264, 26035, 3384, -28515, 21889, 8591, -32169, 18163, 18373, -32356, 8632, 22941, -28141, 3864, 26345, -26420, -3688, 27798, -23256, -7953, 32926, -17572, -16790, 30376, -11531, -19720, 29781, -7082, -24470, 28275, -1515, -28039, 28670, 6986, -34905, 19417, 14902, -32424, 14358, 20639, -30913, 7613, 23299, -29557, 3615, 29216, -28903, -7547, 32548, -19464, -12292, 31809, -14116, -18053, 27693, -10768, -18874, 31033, -6724, -27714, 29251, 3796, -30669, 23027, 10656, -32227, 14311, 14796, -27193, 14432, 18250, -31742, 7193]
1259G193J8006n4396K8395L0811n3425J3287L8672m3006M878L6008m2862R62M4567
1272B9090l9961r372N1361l3966k5582N2013j7342l1560M3251j1672l3242M4129
1284A7147m697m0181M2354M541n1020L4019K3674m7325J7964K6559m0787J2248
1296e504K8455l8804Q713L2898m2540q93M6478l1957j7315M2128k0798k2546L7771
1309A6086j2637k2011L5855j3531k9413M1927n18m1249L1183J2520m0377K0228
1321a937K1063l1926J2213J6022l2791J4570K4983l6796L909L3423l1431p988
1333a6686L7125j8599j5916K6662j5148j2500L0932j3674j9939L2441p551k9231
1345b2084L0308P375l1894J5694J1211k3610J4617J1911k4953J1289J3724k8244
$$ y = [7193, 25199, -29197, -802, 30009, -23416, -10129, 28543, -14463, -9585, 26423, -16439, -15477, 29090, -10871, -20243, 31118, -2848, -28430, 23583, 6241, -25319, 17932, 6260, -26982, 17147, 12450, -27731, 14623, 19164, -31856, 2163, 25837, -21488, -3524, 23035, -17752, -5504, 22951, -15853, -7140, 25758, -16782, -17675, 28803, -3154, -20469, 21659, 861, -21685, 16086, 3449, -18562, 17293, 3762, -25651, 16276, 15758, -25491, 5692, 18212, -22165, -1937, 19126, -12800, -587, 15435, -17356, -2786, 22197, -14599, -10690, 22733, -8698, -16686, 20439, 1840, -14076, 12586, -2562, -15062, 15870, 2196, -17743, 14698, 7147, -22084, 8224, 15599, -16295, -601, 10610, -13000, 1617, 13528, -11425, -136, 13588, -14656]
1357a4656Q448K5275k5008n385K4351j5368p083K2041j2714j0057J9765j1846
1369b237j1027K6445o034k1667J9365K752j9917J4826O920j8780R124O813j6395
1382i812J1843J0851k1505L095J4904j5535M80J6991j2575n237J3397r705l071
1395e879J6480j0346j1070J6362k575j1254J4284R12j4525P423L114r310R673
1408C289L504j4292N711Q478j0942K578R217j0176k986Q015m147J721P234r707
1422b503l209J0665n210n312J0907j932r954N854L569l565M206k089p285N986
1436A28K653o842N302N239r275k281P006R7j412l09l136J967K781l901K523N527
1452F067p074n740O727L577l348m88L23n51N00q77J284L429l287o196K971O827
$$ y = [-14656, -6208, 19067, -5941, -11326, 13025, -2343, -9426, 12615, -99, -10156, 9609, -2237, -13264, 13181, 7147, -14520, 4845, 7597, -12320, 2506, 9426, -9354, -230, 6583, -9812, 2031, 12882, -8623, -5528, 9376, -6159, -5679, 11312, -1263, -6500, 6897, -2808, -5879, 10601, 255, -10815, 5547, 2972, -8282, 6002, 6914, -7611, -188, 2926, -6384, 3289, 6793, -7499, -1788, 6690, -4252, -1674, 7543, -2633, -5619, 2396, -1751, -30, 7204, -2503, -5712, 4953, -257, -5569, 5338, 3406, -6548, -694, 2875, -690, 3516, 1427, -5858, 128, 2781, -4061, 1241, 6480, -2795, -5076, 1930, 2027, 615, 306, -2830, -863, 1918, -1983, 540, 6067, -1007, -6747, -20, 3557, 209, -279, 44, -507, -7, -884, 400, 3829, 542, -5654, -2683, 4144]
1468D144j363m594J291K647l921k442O210L046o233l060L658K534K10j941j728
1483a542K431j080m721N524O803p554n302N877J280j827J491k084Q7K175n627
1498d069K082J1032p325j0717R776L298q495N447L687p877K088J721m924Q782
1512D506K122j5195M528J1741j0639q83J2056q179o282P995k989P68Q262j1398
1526c587m131J5506o806r301J6321k654j6253J0876N106r635R121k8j4465J1336
1540A406N915j6295R930J0839k0702J406J7158j1180j653J1564j3389j737J5295
1553H557j1745k283J8234j4787j1407K2226m297j3901J7018m067j6248J7583J133
1566F016j5917J7143Q15k4021J6339J2644k2708Q413J3565k2547M499J8189j7844
$$ y = [4144, 2781, -1813, -522, 2125, -1796, -4238, 1972, 5018, -1215, -4275, -617, 1917, 2127, 186, -1542, 889, -191, -4912, 612, 7415, -139, -5441, 436, 1716, -111, 1380, -704, -617, 1558, -4069, -1987, 9045, 1720, -8997, 779, 4077, -4418, 1029, 4716, -3161, -1073, 648, -4276, 4506, 6628, -8567, -4039, 7702, -2937, -3820, 8236, 57, -6225, 1770, -1219, -451, 7811, -3587, -7718, 7788, 982, -8319, 8002, 5348, -10905, -29, 5077, -4558, 4563, 4535, -9930, 1406, 7321, -8974, 956, 11795, -8907, -7501, 9657, -1523, -3176, 8388, -5001, -6738, 8557, -3188, -5471, 12763, -2024, -13431, 8795, 4498, -9403, 7615, 3548, -12700, 4883, 6016, -9901, 7242, 8057, -15964, 375, 13019, -9689, -1276, 12289, -10258, -5759, 12430, -5414]
1579e414J821J6411k1701j483K5162j6028q792K3060j4069j3724K5248o034j5761
1592a1304K1345p024k0073K5162K414k4612J9036N820k7424J6047J5363k4589
1604i839Q562J3835k5566P778K1905k3862R0K2201k3014m330K8489j6161j1569
1617a1481K4001j4253j3398K8491q171j9458K4397n370k2833K6243M184k6858
1629a4506J7677O895k6129J7384J4292k7249R381J5772k6871P464K4087k4437
1641f240k976K2734k0056m386K6916j6355j1672K4167j3696j3474K8880p255k1834
1654a5247K2825j763k1674K3051M518k5407J5907P389k4513J6584J4512k7673
1666a1491O892J7638k3488M821K2261k2147l600K1252j8167l648K6119j6883j3716
$$ y = [-5414, -3593, 12818, -8883, -10366, 14796, -1232, -10024, 13036, -1033, -14757, 10491, 4457, -11304, 10041, 3017, -17056, 8106, 10520, -14092, 4944, 10764, -16660, -613, 14750, -9839, -1277, 12558, -13008, -5230, 16675, -7187, -7097, 15104, -7910, -12240, 16249, 88, -11481, 12520, -1733, -15131, 13360, 5189, -14269, 10128, 4758, -18075, 8168, 12352, -14506, 3171, 10066, -16063, 1321, 15613, -11636, -2255, 13517, -13354, -5890, 18197, -6240, -9216, 13518, -6538, -10924, 15992, -363, -12035, 12132, -1564, -15038, 13842, 6587, -15247, 7578, 5815, -15859, 7192, 11710, -13697, 2210, 9599, -14914, 1670, 16182, -11491, -4599, 13039, -10449, -5628, 16633, -5514, -9114, 12138, -6029, -9677, 16442, -441, -14157]
1679a4157K5137r763j5625K5948l842k2070J8936J295j8840J9863L973k4817J4775
1692H13R995k3898J2719J6727k5653J508J9343j7594O02J9410j8492n314K1058
1705A1224j4562p149K5237j2206j8301K2627j001j7221J8203P62j9657J4228M116
1718F300j7152J6207O350k5295J0403J6088k0957L832J7882j8986l417J7603j2072
1731c214j217J6984j6874p269K2800j0344j2735K2764n201k0114J7443M134j5229
1744h072J2972J139j8281J4353P023j9673J2028J1880k4198L494J9592j5270k066
1757e079J5013j4792k834J7764j2445m775J9908j3981j3845K3791k073j7395J6088
1770E345M90j7535J4338M447j5950J3336L851k2444J2804J5289k1355K994J6084
$$ y = [-14157, 10980, 1217, -14408, 11540, 7698, -14372, 4564, 5859, -12981, 6882, 10855, -13962, 813, 10808, -13090, -371, 16356, -9297, -7789, 11554, -6040, -5438, 13972, -4520, -9834, 11224, -3338, -10487, 14750, 2544, -15757, 6870, 5869, -11352, 6851, 7613, -12044, 2184, 6300, -10852, 5355, 11705, -13590, -3187, 12901, -8056, -4224, 13658, -5328, -8745, 8858, -3214, -4431, 12553, -4321, -11590, 11210, 866, -11869, 10895, 5694, -14420, 3023, 7157, -8072, 4900, 6039, -12242, 2111, 9134, -10539, 1489, 13369, -10829, -7335, 12257, -3013, -5079, 9934, -4858, -7692, 10072, -2373, -7148, 12760, -1221, -15066, 8725, 6652, -10743, 5345, 5835, -11700, 2638, 7085, -8865, 4471, 8322, -14122, -1318, 13971, -7384, -4390, 11694]
1783A1694j7972j283J7552j2220j989J4650j6562l934K3604j2226j3490K1718
1795I542n749j7922J9055K999j5933J2104n28j6013J7400N022k1891J2661J1289
1808A2036k3729O273J9422j7012k757J3453j3587J004J6343j5325l026J9266j5736
1821c375r966K5204n851j7954J6228j71j3943J5057O53j4660J3639q4j8575J7123
1835C325R714k3159O545J4105j7625K769J4907j4164o17J1664j4499K037J8516
1848A3518j5911p342J9447r937j0758J9555l856j3855J3294k158j0965J6089q75
1861F246j6968J3164M036j7090J1792R819j7959L854J0258j3443M492J1722j4939
1874e016l50J3369j1944j411J5967j0892q234J4276n812p101J4845m666j1828
$$ y = [11694, -6278, -7561, 9991, -2229, -4218, 10432, -6130, -10064, 13540, 1314, -12176, 9542, 3793, -14129, 4926, 7925, -8008, 4096, 3568, -12445, 4955, 9977, -11914, 747, 12036, -11693, -5420, 14002, -3010, -5767, 7686, -5901, -4897, 11446, -3879, -6905, 12361, -3375, -13341, 11863, 6012, -11942, 4286, 4115, -9828, 5229, 5882, -8778, 4861, 4777, -13798, 3325, 13039, -10120, -3575, 10530, -7095, -4326, 10581, -3583, -4200, 7464, -7035, -4998, 13518, -2393, -9735, 9712, -225, -10983, 8572, 4716, -9139, 4155, 1997, -8968, 7121, 6246, -10722, 2442, 6478, -10612, 1180, 10999, -6960, -3106, 7152, -6291, -1799, 9923, -5016, -5366, 8003, -3941, -5352, 10615, -277, -8511, 5765, -47, -7148, 7697, 3031, -8797]
1887h797J2565m43j0973J2058J604j4185P986M923j0783Q026N671j4184L881Q752
1901F101j0921K739J0055j1058j874J0084p001o67R952r249m856J1782m782n878
1915e573J1724k919j0241Q205J713o685O826l10q852P005L017q521O025M731j1132
1930d987J137P880n116K30M825o525J10O223n703j21P867o962n456R412K24n640
1946b602M505k63n072L636O25k790M990r40p314M821M913n677j72L688l686j029
1962b367L132m93J448M44n511J056N911l383k866M738j101m205K968K523j289
1977A005m00k118r82L749L41l031K095J512m180l44M183K56k655j082O53J717
1993G19J71j234J106P51l235j066L923J258k741r08J211L93k29J23L70p3j494
$$ y = [-8797, 3768, 3325, -7648, 4410, 6014, -8171, -185, 4738, -6045, 1981, 7652, -6532, -2651, 6101, -4820, -2081, 7974, -3084, -4958, 5126, -1875, -2542, 7410, -1839, -6695, 5087, 305, -5573, 6151, 3232, -7009, 1196, 2909, -3776, 3050, 2740, -6112, 893, 3910, -4611, 1414, 6145, -4987, -3850, 4030, -1086, -856, 3969, -2556, -2446, 3777, -1926, -2047, 5820, -1142, -6598, 2814, 3038, -2602, 1903, 1640, -3432, 204, 829, -1961, 3029, 2089, -5225, -404, 4509, -1168, -1340, 2348, -1338, -2367, 765, 272, 1720, 2164, -3347, -2291, 3620, 237, -2629, 2109, 1008, -3197, -229, 2294, 1005, 605, -1513, -2495, 1254, 1595, -1436, 659, 2171, -2009, -2353, 1830, 2086, -569, -1651, -998, 719, 890, -344, 762, 1513, -1722, -2788, 1135, 2393, -348, -1256, -45, 348, 119, 242, 612, 539, -955]
2010i55j158K232K679j766k819J340J440j917J07K473q02k629O10J905N31l23
2026I48j646o96J388k07o77K341L29l253j09K133N5l0m08j515J153J105j783J527
2044F55K185m136j696M236k82j993K405q68k527K689L16k158K583l77m493K847
2060f14L386l366L42K038l446J46L080k181L46K576m307k53N496k651k722M400
2076B270k343l546N359O4l971M216p24n610N229K474o436K687L429o303J778N465
2092D038m927m36L986n156J70O435m672k158O275m094l477P579j958n274N856
2107B187j495n179P377K85p463N787J649q501N444N080q567K033N544p456J642
2122a633O930p379o93P152o882j188R320n595m430Q410m091m772R298k981o819
$$ y = [-955, -2113, 119, 2798, 1032, -1787, -447, 993, -924, -817, 1656, 854, -1775, -1165, 740, 1271, 948, -698, -1394, -6, -213, -890, 1451, 1780, -1473, -1582, 551, 606, 576, 168, -1347, -194, 911, -872, 655, 2840, -1296, -2992, 1244, 962, -1031, 1374, 506, -2021, 668, 984, -1174, 1409, 1032, -3461, -614, 2772, -594, -252, 1786, -1660, -1514, 1566, -615, -269, 2307, -2000, -2253, 3243, 592, -2130, 2270, -73, -3619, 1740, 1804, -2167, 2049, 1325, -4285, 944, 3418, -3018, -331, 3098, -3205, -1427, 4038, -889, -1325, 2661, -2495, -2325, 4110, -562, -2720, 3555, -539, -4016, 3563, 1605, -3669, 2187, 692, -4487, 2890, 3175, -4288, 1499, 3148, -5353, 91, 5171, -3396, -1363, 4181, -3275, -1633, 5297, -2082, -2775, 4377, -2505, -3693, 5627, 32, -4398, 4012, -79, -4851, 4447, 1466, -5353]
2137e353Q650j470p768R496Q73j0564P085L436j0319O259N887j0878L134P056
2151E524r841K305Q859j0048r71J0174q227k265J1299p085n596J0896m804o375
2165f155J1654l365r069J0842p41j0182J0468J798j2640Q192M904j2062O560O972
2179G176j2800L498Q982j1484J829J0477j1086j536J1839q744l191J2160p742
2192f22n969J2286n080p181J2456l706r927J1806l90j1050J0633J902j2726Q528
2206I60N007j2291O747O553j3152M224R155j1877J884J0501j1266j239J1769q765
2220a790l141J1732p888n325J2566n468p337J2378l509j0110J1699J35j0845R651
2234B748J902j1743Q396M419j1893O611O137j2800M296R217j1455J178J0073j0259
$$ y = [-5353, 3297, 1827, -5941, 3555, 4428, -6136, 949, 4385, -5934, 325, 6212, -4666, -1532, 5524, -4317, -2012, 6847, -3201, -4172, 6002, -2225, -4490, 6809, -276, -5872, 5024, 220, -6155, 5499, 2134, -6935, 3907, 3166, -7016, 3452, 5250, -7390, 802, 5706, -6356, 204, 7176, -5624, -2126, 6856, -4628, -2799, 7678, -3408, -4944, 6895, -1849, -5040, 7120, -622, -6591, 5695, 615, -6566, 5890, 2184, -7743, 4063, 3673, -7377, 3256, 5158, -7568, 960, 5967, -6324, 423, 6976, -6176, -1952, 7203, -4674, -2790, 7711, -3555, -4794, 6975, -1790, -4931, 6801, -1087, -6412, 6154, 686, -6651, 5727, 2218, -7892, 3807, 3942, -6903, 2748, 4650, -7093, 1303, 5722, -6171, 440, 6577, -6223, -1927, 7290, -4165, -2987, 7086, -3173]
2248c173j238J0955q292k845J0986p522n045J2219n057p529J1443k615r382J0467
2262C372M58j0045Q514J881j0538P486M407j1162N361O320j1221L068Q747r834
2276c186Q7R056q434j639R843o644l621R618n328n161J0072l184p073R024j117
2291B313q236Q327J338q956O397K897q983N090M708q999L117N960q479J500P427
2306E421p557q10P665o248k067Q248m884l919Q013l361n147Q092j529o731O845
2321B031N02o986N788J975p300M334L153p369L453M866p532J216O188o235o78
2336b594O715m911k189O380l808k805O845l150m643P032r78o263O013J268o546
2351c634L839K511n485L188K315o027L116L829o742J582O087o226j503O664l473
$$ y = [-3173, -4411, 6544, -1748, -4593, 6393, -1129, -6174, 6045, 988, -6541, 4902, 2287, -7095, 3372, 3830, -6215, 2299, 4180, -6358, 1128, 5535, -5627, -266, 6054, -5167, -2099, 6648, -3186, -3099, 5957, -2477, -4116, 5727, -917, -4538, 5080, -248, -5409, 4663, 1479, -5594, 3430, 2313, -5923, 2404, 3742, -5214, 1183, 4080, -4903, 187, 4895, -4104, -987, 4973, -3506, -2006, 5421, -2136, -2946, 4719, -1529, -3596, 4652, -232, -4151, 3862, 501, -4646, 3446, 1917, -4814, 2031, 2533, -4453, 1335, 3310, -3990, 344, 3497, -3872, -419, 4447, -3085, -1869, 4319, -1916, -2594, 4121, -790, -2979, 3401, -407, -3212, 3633, 483, -4160, 2872, 1894, -4369, 1644, 2912, -3634, 205, 2716, -2769, 419, 2734, -3293, -177, 3652, -3090, -1508, 4579, -1647, -3150, 3514, 41]
2366D1k764N209k466k449N017k756k951O365k040n746O333J257o705L606L062
2381C013n253J827K570m300K434K466n877K222N126o314o35O698m106l156N625
2396B340j613k939M164k006k505N462k206m467O074R8o493M362L032n718J762
2411f53L055m262J667K480m720K016L717n808M69N961m606k185N501k326k745
2426b439M357j693k323M410k039l294N426o38n308M517J532n180K565K495m086
2441a698J617J956l942J958K656m707R77M173m176q45M631k753j862L690j856
2456a81j583L780k033k213M311j237l611M018N14m091K472J543l240J775J294
2471A518l128J756J518l506J460K564l453R4L158k322p91K608j838p51K402j741
$$ y = [41, -2723, 2486, 20, -2429, 2588, -168, -3119, 3246, 1206, -4540, 1793, 3050, -3655, -49, 3013, -2240, -413, 2157, -2143, 291, 2757, -3120, -898, 4228, -2086, -2721, 3977, -129, -3285, 2340, 727, -2212, 1952, -54, -2559, 2903, 697, -3770, 2304, 2402, -4091, 271, 3303, -2415, -653, 2402, -1860, -193, 2287, -2433, -417, 3300, -2508, -2039, 3922, -684, -2869, 2632, 306, -2439, 1918, 225, -2098, 2312, 273, -3021, 2405, 1767, -3541, 976, 2508, -2672, -107, 2388, -1698, -81, 1875, -2067, -109, 2547, -2160, -1183, 2990, -1186, -2031, 2600, -153, -2015, 1675, -181, -1764, 2016, -17, -2230, 2081, 844, -2767, 1251, 1765, -2326, 146, 1689, -1551, 224, 1518, -1610, 146, 1664, -1842, -382, 2182, -1271, -1177, 1981, -341, -1132, 1476, -362, -1113, 1289, -452]
2487d52q38L100j595k120L094k09k726K166O18k196J264P04j650J261N08k187
2503a258J121J316k077K64J865j461m38J436r08l26J033r87k90J638q04j007J674
2520G91k24j561R40P46j042J18N98n26K35L27n72J34M88p28k94Q80K07p96R3N64
2540C78l39l69K59J42q5j25q7K76N02o18n19R09j02r09O45O75p99K0N51o05L06
2561A06M18j161K60J253j153m58J797o25j444J254J60r81O92P0o54R85j75j194
2579h50J296K68j876Q15J241j346J89J105j234L35Q31j642M20J704j873m99K518
2596A402j021j578J966k39j547J321l5j073J532k34j674J740M60k260J103J232
2612A095j993M74J305j326M40R97j876M72J770k166k39K619j515j477K487m33
$$ y = [-452, -1290, 1810, 215, -1905, 1189, 980, -1746, 420, 1038, -1158, 106, 810, -840, 421, 929, -1258, -137, 1179, -898, -634, 1231, -230, -668, 768, -140, -466, 567, -420, -710, 928, 124, -883, 791, 567, -994, -54, 692, -350, -232, 366, -160, 75, 402, -170, -36, 452, -276, -570, 310, 517, -279, -186, 378, 39, -330, -71, 71, -14, -139, -226, 50, 552, -66, -585, 324, 222, -687, -42, 633, -166, -146, 405, -200, 106, 524, -637, -377, 876, -277, -735, 1062, 437, -1007, 247, 407, -574, 118, 188, -466, 519, 344, -850, 446, 714, -1162, -347, 894, -452, -263, 842, -392, -57, 774, -868, -448, 1256, -617, -1116, 1402, 381, -1197, 769, 530, -1017, 304, 269, -804, 728, 494, -1180, 560, 1020, -1240, -137, 1095, -898, -424, 881, -445, -5, 992, -884, -412, 1358, -808, -1047, 1572, 57, -1420, 1067, 634]
2628F34j874J876k83j623J893M9j987J926O79k777J262J560k394M97J726j838
2644f74K81J656j984J37K072k242n94K949j540j593K894p21k205K447j36k419
2660a672K308L63k636J976J282l104J254J845k816L32K420k291j21K424k063n56
2676a055K686k044j114L049j485j823L278p87k556K947M9l179K505R78l323K121
2692B47J621l525J481K280l566O28K912l242j50L447k567j071L489k199j594L563
2708A754j841k025L920j266k972L981k49l837L379Q65m194K819J629m080K327
2723B10K180m589J649L313m564L17M397l920q93M520k959j711M412k612k184M851
2739B417k147l178N144r05m583M626O26m989L671J450m990L238K356n402K472
$$ y = [634, -1240, 636, 353, -1270, 623, 672, -1315, 611, 1290, -1487, -225, 1335, -1059, -562, 1164, -674, -393, 1263, -721, -584, 1488, -754, -1348, 1601, 61, -1532, 1362, 641, -1564, 883, 747, -1672, 636, 999, -1637, 339, 1621, -1483, -229, 1616, -1200, -868, 1552, -739, -860, 1564, -499, -1055, 1631, -413, -1527, 1522, 37, -1786, 1492, 705, -1851, 1096, 1145, -2034, 471, 1449, -1874, 247, 1868, -1657, -176, 2104, -1462, -834, 2078, -1164, -1314, 2133, -434, -1505, 1984, -215, -1809, 1754, -87, -2112, 1808, 542, -2430, 1551, 1302, -2535, 844, 1709, -2485, 334, 1963, -2117, 210, 2390, -2199, -550, 2763, -1801, -1484, 2913, -1007, -1900, 2620, -339, -2050, 2362, -250, -2434, 2417, 270, -2908, 2236, 1331, -3252, 1374, 2000, -2989, 682, 2132, -2858, 380, 2736, -2666, -194]
2754a94L395n694J109M788m900l48M908l954j175M964l549j798N402l124l069
2769c239N949j616m358N188m13m747M551M52m885M211J342n827L768K947o145
2784b822K046M049n436Q72M415m605J27M558m790n11N726m306k415O109k636l651
2800c270N582j220l893M639j005m156N304j40n503M819J618o218L375L327n617
2815b358J608L455m866J496L877n128N47M822n007r20N822l487k528N062k269
2830A26k515M810k085l158N086j448m301N243M68n362L641J665m733K801K047
2845B285m605K282K509m953J833L941m911j57M416l494q80M180k882j368M108
2860B304k759j904M973k022l551M523k91l819L585N95l748K613P95l527K912J450
$$ y = [-194, 3201, -2493, -1384, 3404, -1496, -1844, 3064, -890, -2065, 2899, -650, -2448, 2954, -170, -3239, 2710, 1094, -3264, 1924, 1511, -3236, 1315, 1767, -3118, 1093, 2435, -3392, 376, 3323, -2822, -776, 3273, -2163, -1291, 3124, -1481, -1354, 3204, -1586, -2097, 3629, -677, -3092, 3017, 381, -3270, 2312, 1092, -2801, 1838, 833, -3323, 1981, 1841, -3662, 1157, 2775, -3443, -68, 3259, -2358, -750, 2705, -2161, -665, 3212, -1916, -1369, 3453, -1554, -2474, 3348, -139, -2667, 2395, 126, -2389, 2421, 336, -2822, 2264, 816, -3485, 1758, 2226, -3136, 505, 2170, -2563, 238, 2285, -2320, -38, 2471, -2482, -649, 3292, -1619, -1776, 2640, -854, -1734, 2446, -436, -1804, 2304, -455, -2359, 2614, 592, -2959, 1564, 1273, -2546, 1039, 1634, -2114, 499, 1294, -2233, 679, 2129]
2876B129m428J955K722m044P84L304l427l17L005k517j51L225k830j184L636j879
2892a7j912L592j008k636K756p2k259K660p7l093K430J080l173J793J809l147
2908a274O15K008k161N80J758k513P4K554k089p11K776j391j823K256k04j292
2924h37J770p65j514K095j56k004K064O52k812R69J705j554J53J013j497L34J204
2941H20j498M56J682k006q03K406n02j312J261k25j034J067j21o79J393n31j759
2958a385J548J040j840L38J084j293j0J083o32Q2N31j365P9J822r35r76J442l17
2976B96j301J147M45q45M37k22q39J334M09j506O12R00j569J16J395n08o11L50
2994D0m97K40J063r89m40J278p71r68J489M15j306J89K71m08P55M3q80O22J78
$$ y = [2129, -2299, -344, 2378, -1666, -882, 2422, -1005, -1322, 1683, -834, -985, 2240, -590, -1774, 1862, -17, -1929, 1663, 655, -1981, 775, 703, -1556, 1104, 1027, -2066, 364, 1444, -1729, 64, 1873, -1274, -659, 1349, -812, -232, 1526, -987, -913, 1641, -448, -1159, 1617, 226, -1597, 659, 455, -837, 933, 168, -1346, 749, 593, -1411, 653, 1305, -1507, -538, 1167, -387, -234, 779, -718, -384, 820, -678, -222, 1460, -546, -1349, 1057, 555, -757, 504, 279, -755, 312, 191, -488, 905, 374, -1385, 163, 1203, -637, -299, 785, -508, -518, 565, -67, 15, 546, -819, -740, 1082, 147, -829, 613, 296, -1005, 142, 587, -258, 179, -43, -882, 452, 861, -645, -33, 867, -702, -586, 809, 301, -310, 40, -457, -217, 846, -143, -583, 695, -76, -1044, 445, 860, -446, -257, 14, -394, 361, 404, -476, 146, 324]
3013C24j137O60J273j124o95Q31q9j68N24m20j38L96o25j46J331k70j294M89N70
3032B92n02L41K57m77m3k2l43Q21M75j147l55J011j10m40N40J3n48m9J15L54M92
3053F75n95p84O38M08n88J67O04n49n77M34M43J03j81o50L4O78j88l34Q07j31
3073D14j114K57R16j49k56q9l76L06M61n35K77M95j067m54J343K07q16K07j88
3092a61k39O57j20l21O73n05j123J216Q89j237K1O32r41K92R03p98J83N61j429
3111h47J94J885r13j107J279n25q50J451%r48Q38n64j019J879K25j942R27P08
3129F71j639Q78J228j474J17O99j592R08J697j892m81J847j206p69K129n79j446
3146i04J272n52p01K072n61j874J728J7j915J788R48k168N74P31j383J235R42
$$ y = [324, -813, -153, 1120, -4, -699, 132, 43, -125, 399, -21, -159, 237, -388, -534, 797, 527, -767, -278, 292, -210, 131, 388, -89, -132, -154, -497, 324, 799, -348, -703, 308, 198, -242, 298, 311, -237, -286, -171, 183, 675, 80, -704, -66, 342, -246, -79, 525, -24, -601, -167, 276, 379, 198, -452, -418, 260, 72, -262, 545, 414, -700, -443, 473, 324, 68, -21, -397, -91, 370, -165, 112, 607, -460, -914, 429, 636, -180, 27, -161, -400, 257, 137, -184, 489, -16, -1139, 77, 966, -271, -250, 382, -559, -267, 636, -162, 21, 582, -847, -653, 1232, 319, -788, 491, -34, -884, 567, 567, -381, 457, -107, -1126, 753, 978, -964, -37, 671, -968, -90, 1138, -336, -219, 480, -1112, -204, 1493, -399, -880, 967, -239, -1008, 1121, 542, -904, 368, -184, -885, 1187, 626, -1248, 480, 497, -1418, 370, 1318, -850, -276, 455, -928, 307, 1249]
3163A249k278N99J497k074M08K401j866j068J823q85m53J924j302j104K041r47
3179c5j244K577l47k411J520N11j561J646K86k072J219O85k016J490J438k812
3195a126K03K021j626J62J892j968o48K083j427l72K463j529j757K317j65j546
3211a023J952k57k092J561M51j585J791L51k638J144J510j886N40J497k125J0
3227g99J744j391J68J797k143r11K573p93j219K043o67j736J655J56j159J497
3243H15l61k089J793R43j844R05R01k093L32J594j156K91R58j883L3K127j351
3260h5o58J741j175j264J985J60j199J116n80j286J717L29j638J181M49k043R16
3277c34J513j321o1P51j444M41J516j345j05J454j624p05K347m77j469J251l89
$$ y = [1249, -1029, -430, 1067, -1007, -599, 1802, -64, -1132, 691, -194, -647, 1277, -25, -1129, 912, -35, -1279, 1298, 951, -1460, 60, 571, -990, 656, 942, -1130, 89, 774, -1242, 248, 1686, -1126, -923, 1098, -528, -366, 1526, -442, -1090, 993, -434, -806, 1657, 128, -1629, 688, 523, -1023, 929, 672, -1420, 141, 592, -993, 798, 1149, -1489, -345, 1165, -721, -181, 1316, -809, -799, 945, -446, -278, 1519, -624, -1535, 1038, 245, -974, 1069, 402, -1334, 321, 477, -682, 815, 454, -1635, 158, 1101, -743, 162, 1063, -1030, -698, 896, -260, 31, 989, -894, -861, 1266, -85, -743, 998, -177, -1441, 544, 704, -495, 621, 41, -1245, 472, 801, -837, 344, 793, -1250, -334, 1179, -142, -203, 548, -896, -455, 1061, -284, -389, 1065, -559, -1264, 1083, 606, -863, 388, -1]
3294aj045J677N2j473J298j01j882J565J344j964J36J072j351L76J379j396nJ085
3312G66j730K20K358j384j423J858n99j246J895k1j553J163k36j301K038M02k470
3329a263J098J093k075R49J738j944k15J243j338M56J687j849n29K028j440o47
3345a008K479j062j765J715k37j151K021l54j987J686K83k014J949Q40k651P64
3361d92J432j850Q73J507k241O3J677j712K00K133j946q92K177j048p46K304j266
3378A73j718K191l17j468K235k55k383J658O98j920J580P25k512R72J444j995
3394h92Q57J519k429K1J993j544J33J764j956o32K169j106p80K190j174j682K105
3411E56m5j344J709l55j973J752M69j851J676M99k522J034J508j664N01J041j981
$$ y = [-1, -1046, 631, 683, -790, 508, 407, -1475, 90, 1434, -530, -394, 678, -673, -297, 1082, -314, -319, 766, -964, -744, 1614, 230, -1193, 665, 66, -1180, 715, 694, -859, 304, 68, -1233, 805, 1207, -1263, -165, 928, -1147, -198, 1540, -404, -619, 624, -714, -258, 1429, -420, -949, 1079, -361, -1008, 1471, 409, -1356, 359, 122, -1029, 992, 638, -1349, 337, 620, -1394, 555, 1395, -1256, -492, 940, -910, -37, 1470, -771, -708, 969, -743, -543, 1590, -356, -1248, 929, -119, -865, 1439, 173, -1545, 646, 329, -1139, 1096, 841, -1542, 116, 814, -1106, 474, 1199, -1313, -341, 1103, -892, -35, 1484, -945, -924, 1069, -475, -342, 1422, -534, -1166, 1003, -103, -883, 1307, 133, -1549, 556, 511, -833, 876, 521, -1452, 300, 769, -1082, 594, 1093, -1429, -395, 1113, -551, -50, 991, -990]
3428i90M28J544j448K70J611k043o45K274q25r14J610q06j158J684l44q89J583
3445I42p89j728J970N65j751R80O42j838P40R60j088O58L27j669P54J462j428
3462b91j15J374j364m91J530m00m43P91j017l40J608n43r92J248l55j331J254
3479A23O05q96K98j16p68R74L03r74O35L12j352M52J169n93m58L93m83K49O13
3498D86n36jN29r23k43J317j33q17L53n5l54M88J37k93K82m48m15Q93L23p70J7
3519a63K44l84K22L50j58o2j20m44N97M75n74j57K00k03q0M57Q5j71l24k05L51
3540f4M80k90k24O8j09p0K89K60j74l49j89L02L37q1k26j3m7p2K01K37Nl47l34
3563d10L13M10j72j40J22k76j11L29J99m3j54m28J48N19j72k84L64l06m34O45
$$ y = [-990, -562, 982, -466, -196, 1415, -628, -1273, 1001, 176, -738, 872, 66, -1092, 592, 248, -641, 942, 153, -1575, 395, 960, -791, 189, 831, -1007, -267, 693, -395, 263, 590, -1079, -325, 1137, -291, -406, 968, -396, -887, 643, 243, -200, 591, -426, -766, 842, 299, -693, 555, 200, -1131, 123, 728, -168, 130, 14, -754, 220, 523, -451, 184, 496, -856, -404, 765, 172, -286, 107, -376, -127, 486, -50, -51, 478, -445, -688, 629, 496, -321, 32, -23, -377, 111, 248, -45, 237, -211, -626, 267, 590, -180, -163, 81, -303, -81, 269, 111, 49, -71, -515, 82, 557, -17, -174, 26, -177, -257, 200, 285, 114, -210, -415, -64, 416, 126, -98, -30, -139, -209, 80, 340, 166, -183, -372, -70, 267, 186, -40, -53, -100, -172, 29, 266, 271, -76, -410, -97, 313, 141, 1, 123, -153, -264, 65, 264, 221, 67, -361, -213, 306, 134, -150, 214, -92, -526, 119]
3583A19J85k47l3j55k57N21J58m51K58P0p02L27P23m03k60K65l31L3O18l93j50
3604a05L65n48j42R51j78o87M56j00m93P11J89o33K33Jn28O45M44q92J90M30p23
3625d14J76R30o39m09N25m30K7Q22n79l51O86m58l74J042j83q93N54R2n31P11
3645C04K10r27L55K08p69P28O77j238O7Q09o86O2Q52q17k74P29n27n5J062p13
3665E7q16J144k23q02J150l8j131O90K45p61Q58J96j361O98P44j278N22J099j404
3684d11j85J181p73j17J027r60l96J298p09o46J606o17j395J428J68j172J123
3701D50K1j308R95L23j300J191M88j849O56J222j367J23J273j315k15J350j004
3718b66o9J307j294o63J872o53j066J585m40j335J328J82j116J153q6j491J256
$$ y = [119, 304, 57, 24, -131, -388, 133, 291, -160, 98, 168, -534, -207, 516, 113, -147, 118, -213, -180, 438, 45, -105, 260, -288, -430, 521, 343, -344, 112, 12, -481, 230, 419, -214, 19, 20, -508, 137, 581, -311, -121, 309, -414, -238, 692, 53, -356, 169, -261, -234, 588, 9, -342, 344, -114, -488, 554, 371, -522, 32, 124, -407, 304, 514, -413, -58, 150, -619, 109, 786, -452, -385, 424, -262, -200, 652, -165, -439, 290, -237, -292, 770, 57, -759, 385, 162, -640, 510, 472, -659, 31, 276, -485, 373, 569, -792, -94, 650, -628, -106, 993, -411, -596, 585, -188, -305, 722, -238, -634, 664, -45, -691, 915, 298, -1097, 331, 499, -673, 450, 471, -837, 158, 481, -819, 372, 860, -989, -333, 889, -478, -355, 918, -397, -612, 738, -266, -335, 972, -322, -985, 887, 234, -832, 753, 313, -1022, 306, 488, -628, 525, 439, -1052, 204]
3735B04N86j687J087P34j884O25J243j297J54J055j529J85J493j305l31J746j364
3752b85q06K022o78j063J448m75j127J611k21j339J526j74j667J512O99j905Q97
3769b5R20j744O95J153j576L86J180j822K73J730j502l87J765j252p31J801o68
3786A96j035J494o61r46J767l37j535J582K2j762J448O85j732P96P04j532P63
3803h3J047j682L75J288j653J42J774j348o15J538r86n51J598p87q30J497o96
3820B8r73J701k69j433J296K19j500J127N25j430P15O75j500Q07R40j628K59J259
3838H18j245j75J500j055n00J234p56m02J296o74q12J374m30r59J348p5j335R57
3856A09L36j062Q62L70j247O38O34j258M69J049j363k5J160p84k86J009o75m38
$$ y = [204, 790, -897, 190, 924, -960, -335, 908, -389, -235, 820, -709, -524, 969, -336, -667, 1079, -285, -1091, 931, 253, -810, 638, 163, -964, 647, 426, -913, 613, 439, -1228, 284, 983, -922, -25, 895, -849, -154, 999, -577, -191, 989, -833, -560, 1170, -332, -719, 1046, -206, -937, 864, 196, -839, 655, -6, -952, 815, 478, -1057, 525, 547, -1215, 233, 918, -814, -18, 686, -846, -83, 964, -718, -343, 945, -708, -566, 1208, -140, -755, 783, -203, -754, 844, 57, -773, 724, 28, -945, 756, 487, -946, 350, 569, -931, 196, 721, -709, 6, 681, -819, -12, 928, -700, -441, 818, -427, -602, 898, -157, -657, 577, -179, -581, 715, 41, -771, 603, 173, -786, 562, 487, -848, 109, 445, -617, 245, 615, -632, 6, 640, -618, -149, 900, -463, -488, 672, -112, -398, 611, -64, -502]
3874e02R48m91m82J175n75q46J146q9r63R13K25j033O14L97q22N13M00j078M55
3893i5O61r73J19J009r75k53J021m95m11P94m29m80R20k86o10Q26j03q68P92K75
3913D39q97N46L46q63L95M60p28K77M97q80J60Q28p17j77Q53n53m83Q68k16n17
3933c62O61j77o10P97l5o79N51J81r31O05N21q97K24N54p54K19O31p15K2O61p31
3954b64p5R62n78m59P46j70p24Q60j82n82P20q5o90P23J32q95N92L96q54L72O03
3975E48q45J13N46o22J72O00p78lP90p22j75R44m39n94P57k06m86P71k57n49P44
3996C09j35o60P28J25r14M26N67p65K07M83o79K53M77q16L07O18q11j30R35n99
4016g4l73Q34k75n21O68k41l32P15l13n91Q16J1q67O62K85p50K79L56m99K84K48
$$ y = [-502, 446, -45, -527, 648, 73, -773, 373, 284, -679, 234, 459, -574, 40, 437, -385, 128, 528, -550, -95, 566, -407, -288, 721, -254, -507, 514, 19, -392, 402, -27, -507, 413, 127, -483, 343, 240, -628, 164, 439, -458, 88, 434, -429, -34, 426, -302, -25, 472, -408, -248, 580, -137, -314, 539, -14, -497, 371, 155, -362, 299, 122, -488, 309, 274, -405, 146, 327, -604, 1, 522, -375, -151, 403, -351, -132, 499, -216, -194, 467, -264, -339, 623, 45, -414, 332, 162, -562, 298, 116, -466, 254, 169, -521, 202, 334, -561, 31, 427, -427, -55, 548, -297, -184, 362, -260, -88, 512, -266, -269, 521, -201, -376, 568, 129, -465, 292, 86, -400, 371, 114, -435, 309, 174, -486, 242, 367, -547, -121, 446, -319, -112, 371, -308, -55, 422, -394, -87, 531, -280, -410, 525, -74, -447, 387, 112, -409, 259, 18, -314, 401, 88, -503, 313, 324, -543, 119, 404, -346, -67, 289, -210, 74, 322]
4037C22o66L00L43o47J57O47o09j72O60l24k27M35k71k40N90l00k68O21k38n55
4057d42N49J12m41K79J18m39K95O8l06K89J09m27K23L03m33Q2K94l39J4K74k53
4078g1P9K02l88J12L02j92j84K68j30j10J67n0n6K03k05q9L23r2k67K56l0j77
4100a29J51l6n0J61k01j00L55j01k47J78J51k13R8R6q5k3J3j93K60L4k22O7J97
4123A61k99P5K04j23n2R9k19J79J26j84J9K16k73p0K74j26o4J20j13r3K95k10
4145e8n1K94k27j19L76j07l16L38m1k73L44m2l03L00N8m62M13J28m79K51J66m12
4167b22J53L40l90M1L85m53j4M33l42j76M71l08j76N24k03m01N24k2m62M37R0
4188B29m80L28J27n37L77K27n70K70L44n85J32N08n55m9M99l45o0M42l97j95N64
$$ y = [322, -344, -44, 299, -348, -191, 456, -153, -325, 335, 11, -216, 219, -52, -292, 298, -2, -270, 351, 113, -442, 107, 219, -222, 57, 175, -264, 31, 99, -207, 82, 191, -236, -13, 290, -143, -61, 233, -106, -92, 182, -71, 8, 210, -178, -66, 236, 44, -140, 128, -2, -112, 55, 5, -51, 152, -53, -142, 181, 89, -178, 78, 48, -129, 22, -14, -64, 97, -104, -204, 151, 50, -197, -19, 132, -81, 17, 113, 28, 5, 18, -175, 85, 119, -103, -36, 161, -138, -63, 141, 18, -34, 65, -154, 25, 151, -33, -14, 202, -71, -141, 133, 7, -57, 63, -50, -143, 152, -58, -109, 185, -42, -161, 215, 108, -208, 130, 89, -184, 160, 118, -185, 115, 173, -289, 124, 252, -227, 24, 190, -222, -69, 271, -119, -78, 307, -146, -160, 273, -69, -245, 226, -82, -258, 266, 63, -338, 186, 164, -298, 139, 229, -251, 77, 204, -333, 44, 271, -299, -29, 315, -270, -138, 370, -185, -234, 265, -80, -140, 302, -95, -290, 274]
4209B74k44l23O08k32m43N70o3m74N23L7n56M17J26o14M30L34p77K86N28o35R2
4230a36N27o31K8N75n12j12O73n47k22P28l28m45O97j48n68O55j5o23O78j1p16
4251d53N55L40q09L28M57p48K54M90p49J81O50p50j21Q66o10k73R05n11m59P94
4271C37k54n96Q86j91p53P87J14q65O48L36r35N27M57r15L86N26q81K03Q29r45
4291b99rR58p97k76R67n50m69R69m92n46J019l20q20J083j07r92Q74L05j028O40
4311A10M11j022N36N43j067L95P74j166J04J124j020j00R76p29l20J021o21m73
4329e24J118n26p67J255k74r83J091M6j038Q29K16j056Q26L15j190P34O36j318
4347f10M01J002j179l3J030q39j07R70q50k34J096p90m98J285n13q73J295k60
$$ y = [274, 30, -293, 315, 83, -360, 210, 147, -327, 196, 233, -323, 94, 220, -394, 36, 370, -407, -121, 407, -228, -136, 391, -240, -212, 363, -149, -261, 412, -135, -357, 371, 43, -402, 295, 147, -421, 234, 219, -404, 274, 263, -453, 102, 442, -367, -39, 418, -330, -76, 414, -335, -154, 496, -254, -375, 491, -119, -392, 513, 2, -457, 337, 83, -513, 373, 182, -571, 216, 330, -535, 113, 449, -486, 41, 498, -417, -31, 495, -386, -183, 646, -299, -308, 650, -147, -423, 544, -6, -475, 494, 2, -544, 475, 155, -665, 418, 311, -681, 193, 498, -530, 110, 521, -501, 35, 578, -489, -94, 680, -486, -382, 742, -278, -378, 598, -131, -451, 570, -51, -524, 594, 68, -699, 556, 282, -701, 390, 436, -602, 227, 443, -613, 213, 528, -662, 72, 708, -610, -209, 793, -386, -419, 611, -228, -335, 635, -215, -449, 647, -143, -641, 644, 131, -742, 553, 293]
4365B93r68R52M4r72R64M1j077R55L67j299P12O89j268L83Q82j087P6R66q92o3
4385c02R62r38k35J227q53m82J199l76q24R81j50p39R16j97q44R91pj025R39L38
4405E81j188N82O40j100L44P08q90J50P48r93K21Q42r38j95J149p21m76J102m76
4424I0o60R29k25n66Q57k77p74R91rr76Q00L41j076N06N43p97K97M71q40K49O64
$$ y = [293, -675, 277, 321, -651, 313, 354, -723, 232, 599, -700, 12, 701, -567, -184, 698, -389, -313, 653, -239, -302, 660, -278, -513, 714, -139, -621, 578, 202, -622, 359, 209, -530, 386, 189, -655, 336, 329, -696, 243, 581, -607, -25, 615, -485, -141, 567, -323, -173, 575, -418, -197, 645, -293, -488, 661, -60, -536, 566, 90, -570, 359, 134, -432, 425, 148, -626, 365, 356, -620, 180, 521, -555, -49, 494, -303, -6, 465, -375, -126, 538]
$$ [...]
8191b6
##END NTUPLES=NMR FID
##END=
