##TITLE=1H_3MTBDP2212
 CDCl3
 8 sc, 
 23.12.2022
##JCAMPDX= 6.0         $$ Bruker NMR JCAMP-DX V2.0
##DATA TYPE= NMR FID
##DATA CLASS= NTUPLES
##ORIGIN= UXNMR, Bruker Analytische Messtechnik GmbH
##OWNER= root
$$ XWIN-NMR		Version 3.5
$$ Fri Dec 23 13:59:37 2022 Russian Standard Time (UT+4h)  she@DPX200
##.OBSERVE FREQUENCY= 200.13135
##.OBSERVE NUCLEUS= ^1H
##.DELAY= (6, 6)
##.ACQUISITION MODE= SIMULTANEOUS
##.ACQUISITION SCHEME= undefined
##.AVERAGES= 8
##.DIGITISER RES= 18
##SPECTROMETER/DATA SYSTEM= spect
##.PULSE SEQUENCE= zg30
##.SOLVENT NAME= CDCl3
##.SHIFT REFERENCE= (INTERNAL, CDCl3, 0, 15.7039)
##AUDIT TRAIL= $$ (NUMBER, WHEN, WHO, WHERE, WHAT)
$$ ##TITLE= Audit trail, XWIN-NMR		Version 3.5
$$ ##JCAMPDX= 5.01
$$ ##ORIGIN= Bruker BioSpin GmbH
$$ ##OWNER= she
$$ F:/spectra/data/she/nmr/H-F/1/audita.txt
$$ ##AUDIT TRAIL=  $$ (NUMBER, WHEN, WHO, WHERE, WHAT)
(   1,<2022-12-23 13:58:31.25 +0400>,<she>,<DPX200>,
      <created by zg, POWCHK disabled, PULCHK disabled
       configuration hash MD5:
       00 E9 B6 7A A2 85 ED C7 34 08 36 98 17 FE 4E 26
       data hash MD5: 16K
       FF D7 C2 5B 27 57 3D 2E 13 7C 20 D9 84 19 BF A2>)
$$ ##END=
$$ 
$$ hash MD5
$$ 9B 5F B5 4B 26 D4 A0 AB 59 38 0C 0F 46 31 7B 41
##$RELAX= 
##$RELAX= 
##$RELAX= 
##$RELAX= 
##$RELAX= 
##$RELAX= 
$$ Bruker specific parameters
$$ --------------------------
##$DU= <F:/spectra>
##$EXPNO= 1
##$NAME= <H-F>
##$PROCNO= 1
##$TYPE= <nmr>
##$USER= <she>
##$AMP= (0..31)
100 100 100 100 100 100 100 100 100 100 100 100 100 100 100 100 100 100 
100 100 100 100 100 100 100 100 100 100 100 100 100 100 
##$AQSEQ= 0
##$AQ_mod= 1
##$AUNM= <au_zg>
##$AUTOPOS= <>
##$BF1= 200.13
##$BF2= 200.13
##$BF3= 200.13
##$BF4= 200.13
##$BF5= 200.13
##$BF6= 200.13
##$BF7= 200.13
##$BF8= 200.13
##$BYTORDA= 1
##$CFDGTYP= 0
##$CFRGTYP= 5
##$CHEMSTR= <none>
##$CNST= (0..31)
1 1 145 1 1 1 1 1 1 1 1 1 1 1 1 1 1 1 1 1 1 1 1 1 1 1 1 1 1 1 1 1 
##$CPDPRG= <>
##$CPDPRG1= <>
##$CPDPRG2= <>
##$CPDPRG3= <>
##$CPDPRG4= <mlev>
##$CPDPRG5= <mlev>
##$CPDPRG6= <mlev>
##$CPDPRG7= <mlev>
##$CPDPRG8= <mlev>
##$CPDPRGB= <>
##$CPDPRGT= <>
##$D= (0..31)
0 1.2 0 0 0 0 0 0 0 0.06 0 0.03 0 0 0 0 0.0002 0 0 0 0 0 0 0 0 0 0 0 0 
0 0 0 
##$DATE= 1671789510
##$DBL= (0..7)
120 120 120 120 120 120 120 120 
##$DBP= (0..7)
150 150 150 150 150 150 150 150 
##$DBP07= 0
##$DBPNAM0= <>
##$DBPNAM1= <>
##$DBPNAM2= <>
##$DBPNAM3= <>
##$DBPNAM4= <>
##$DBPNAM5= <>
##$DBPNAM6= <>
##$DBPNAM7= <>
##$DBPOAL= (0..7)
0.5 0.5 0.5 0.5 0.5 0.5 0.5 0.5 
##$DBPOFFS= (0..7)
0 0 0 0 0 0 0 0 
##$DE= 6
##$DECBNUC= <off>
##$DECIM= 32
##$DECNUC= <off>
##$DECSTAT= 4
##$DIGMOD= 1
##$DIGTYP= 9
##$DL= (0..7)
0 120 120 120 120 120 120 120 
##$DP= (0..7)
150 150 150 150 150 150 150 150 
##$DP07= 0
##$DPNAME0= <>
##$DPNAME1= <>
##$DPNAME2= <>
##$DPNAME3= <>
##$DPNAME4= <>
##$DPNAME5= <>
##$DPNAME6= <>
##$DPNAME7= <>
##$DPOAL= (0..7)
0.5 0.5 0.5 0.5 0.5 0.5 0.5 0.5 
##$DPOFFS= (0..7)
0 0 0 0 0 0 0 0 
##$DQDMODE= 0
##$DR= 18
##$DS= 0
##$DSLIST= <SSSSSSSSSSSSSSS>
$$ [...]
##$SUBNAM2= <"">
##$SUBNAM3= <"">
##$SUBNAM4= <"">
##$SUBNAM5= <"">
##$SUBNAM6= <"">
##$SUBNAM7= <"">
##$SUBNAM8= <"">
##$SUBNAM9= <"">
##$SW= 18.05172834244
##$SWIBOX= (0..15)
0 0 2 0 0 0 0 0 0 0 0 0 0 0 0 0 
##$SW_h= 3612.71676300578
##$TD= 16384
##$TD0= 1
##$TE= 0
##$TE2= 300
##$TE3= 300
##$TEG= 300
##$TL= (0..7)
0 120 120 120 120 120 120 120 
##$TP= (0..7)
150 150 150 150 150 150 150 150 
##$TP07= 0
##$TPNAME0= <>
##$TPNAME1= <>
##$TPNAME2= <>
##$TPNAME3= <>
##$TPNAME4= <>
##$TPNAME5= <>
##$TPNAME6= <>
##$TPNAME7= <>
##$TPOAL= (0..7)
0.5 0.5 0.5 0.5 0.5 0.5 0.5 0.5 
##$TPOFFS= (0..7)
0 0 0 0 0 0 0 0 
##$TUNHIN= 0
##$TUNHOUT= 0
##$TUNXOUT= 0
##$USERA1= <user>
##$USERA2= <user>
##$USERA3= <user>
##$USERA4= <user>
##$USERA5= <user>
##$V9= 5
##$VALIST= <valist>
##$VCLIST= <CCCCCCCCCCCCCCC>
##$VD= 0
##$VDLIST= <DDDDDDDDDDDDDDD>
##$VPLIST= <PPPPPPPPPPPPPPP>
##$VTLIST= <TTTTTTTTTTTTTTT>
##$WBST= 1024
##$WBSW= 4
##$XGAIN= (0..3)
0 0 0 0 
##$XL= 0
##$YL= 0
##$YMAX_a= 106507
##$YMIN_a= -108801
##$ZGOPTNS= <>
##$ZL1= 120
##$ZL2= 120
##$ZL3= 120
##$ZL4= 120
##$ABSF1= 10
##$ABSF2= 0
##$ABSG= 5
##$ABSL= 3
##$ALPHA= 0
##$AQORDER= 0
##$ASSFAC= 0
##$ASSFACI= 0
##$ASSFACX= 0
##$ASSWID= 0
##$AUNMP= <proc_1d>
##$AZFE= 0.1
##$AZFW= 0.1
##$BCFW= 1
##$BC_mod= 2
##$BYTORDP= 1
##$COROFFS= 0
##$CY= 11.3945322036743
##$DATMOD= 1
##$DC= 2
##$DFILT= <>
##$DTYPP= 0
##$F1P= 2.36226072786647
##$F2P= -0.459571619588291
##$FCOR= 0.5
##$FTSIZE= 0
##$FT_mod= 4
##$GAMMA= 1
##$GB= 0.15
##$INTBC= 1
##$INTSCL= 1
##$ISEN= 128
##$LB= 0.24
##$LEV0= 0
##$LPBIN= 0
##$MAXI= 10000
##$MC2= 0
##$MEAN= 0
##$ME_mod= 0
##$MI= 1.114404
##$NCOEF= 0
##$NC_proc= 0
##$NLEV= 6
##$NOISF1= 3.799351
##$NOISF2= 2.8
##$NSP= 1
##$NTH_PI= 0
##$NZP= 0
##$OFFSET= 15.70392
##$PC= 1
##$PHC0= -19111.25
##$PHC1= 15.60073
##$PH_mod= 1
##$PKNL= yes
##$PPARMOD= 0
##$PSCAL= 0
##$PSIGN= 0
##$REVERSE= no
##$SF= 200.130013532006
##$SI= 16384
##$SIGF1= 3
##$SIGF2= 2
##$SINO= 400
##$SIOLD= 16384
##$SREGLST= <1H.CDCl3>
##$SSB= 0
##$STSI= 0
##$STSR= 0
##$SW_p= 3612.71676300578
##$SYMM= 0
##$S_DEV= 0
##$TDeff= 0
##$TDoff= 0
##$TI= <>
##$TILT= no
##$TM1= 0
##$TM2= 0
##$TOPLEV= 0
##$USERP1= <user>
##$USERP2= <user>
##$USERP3= <user>
##$USERP4= <user>
##$USERP5= <user>
##$WDW= 1
##$XDIM= 8192
##$YMAX_p= 0
##$YMIN_p= 0
$$ End of Bruker specific parameters
$$ ---------------------------------
##NTUPLES= NMR FID
##VAR_NAME=  TIME,          FID/REAL,        FID/IMAG
##SYMBOL=    X,             R,               I
##VAR_TYPE=  INDEPENDENT,   DEPENDENT,       DEPENDENT
##VAR_FORM=  AFFN,          ASDF,            ASDF
##VAR_DIM=   8192,          8192,            8192
##UNITS=     SECONDS,       ARBITRARY UNITS, ARBITRARY UNITS
##FACTOR=    0.0002768,     1,               1
##FIRST=     0,             0,               0
##LAST=      2.2672688,     0,               0
##MIN=       0,             -108801,         0
##MAX=       2.2672688,     106507,          0
$$ Real data points
##PAGE= N=1
##DATA TABLE= (X++(R..R)), XYDATA
$$ [...]
1565E63m83j017J396k9j109L80Q27j077k06J372q78n35J247j84q94P19O85j329
1583e52l0J411p82m26R89j31j163R80M24q84l2R73j047l32J180k04j098R20M89
1602F85j363J32J318j294l35J232k81q97R39K68q70L85Q81j049n1R11m50o12J034
1621E83J58j177O82O26j239J60J127r63m47O79J34j133R16L87j097P8J092q65
1639b99m26J070l50q91J065L48j002L20Q43r43r4J025m46p47Q20L62j192O81M97
1658F41q10j71Q41n19o26J038K4j262O13O41r51N6R28m38j026J436j78r98O26
1677a35N98p30J89P01o05m69J081l64p29R22K52j116J65J054r12l41R80l97q31
1696f87Q03J12q92L71O93p84k78J019m34n88R57o5q78M47P10q22j9J014o50l21
$$ plain form
1565 563 80 -937 459 430 -679 -299 528 -549 -755 617 -261 -796 451 267 -627 92 777 -552
1583 -552 -582 829 47 -379 610 479 -684 296 720 -164 -196 777 -270 -602 578 374 -724 196 685
1602 685 -678 -546 772 -522 -857 375 94 -803 136 404 -466 -81 800 -249 -300 611 161 -451 583
1621 583 741 -436 246 872 -367 -207 920 -43 -490 189 323 -810 106 493 -604 -526 566 -299
1639 -299 -725 345 -5 -896 169 517 -485 -165 678 -265 -359 666 220 -527 293 655 -537 144 641
1658 641 -169 -340 501 -18 -644 394 418 -844 -231 410 -541 -485 443 5 -1021 415 237 -761 -135
1677 -135 463 -267 -78 623 18 -451 630 266 -463 459 711 -405 -240 814 -98 -439 541 144 -687
1696 -687 116 228 -664 -293 400 -384 -662 357 -77 -665 292 227 -651 -204 506 -316 -335 679 29 -292
1716b92Q79l66m39M74K97q66K78O05q64N4O26l43o42O56K31q99L65M83o54p3R19
1737D29o39m81P27M76q87K36Q21j023j15R43l08n75Q57J05r96N04O14j107J1J021
1757F13q19k71P92K0r69N75L97r44K53O49n66m21R41j48o15O97J05o85K22Q31
1777F57q28k46J012p2q10O01L83j144N27M58o59k70N83j1p74P30J36r14L27M55
1797A41m57O3N33k53o66Q68n6o41M70M68o83J86N36m57l51Q61k42o08O52m1o69
1818c46L86M03o25j56O06k76n80Q20ml87l1K36l92J52O05n39l27P14k53o16O64
1839E4M21p98P8P30m85n42R73j49p79N75M06p53K6Q90p67k05Q68k59p83P28J21
1860C50r01L02N42o56j86Q45k18p90O90J37m18K47M94n32N3M13j46n34O87j11
$$ plain form
1716 -292 587 221 -218 256 553 -313 -35 570 -294 -240 386 43 -599 57 288 -611 -246 237 -417 -490 429
1737 429 -210 -691 36 512 -375 -139 682 -341 -456 487 179 -396 461 566 -430 74 688 -419 -408 613
1757 613 -206 -477 315 335 -634 -59 338 -606 -353 296 -270 -691 250 102 -513 184 289 -396 -174 657
1777 657 -171 -417 595 523 -287 314 697 -447 80 538 -121 -391 192 181 -593 137 273 -641 -314 141
1797 141 -316 -253 280 27 -639 229 173 -468 2 470 -213 -27 509 52 -299 562 320 -288 364 323 -346
1818 -346 40 443 -182 -338 268 -8 -588 232 228 -159 -190 46 -346 -194 411 -128 -455 259 6 -610 54
1839 54 475 -323 -245 485 0 -542 431 282 -497 78 484 -269 -243 647 -120 -325 543 284 -499 229 350
1860 350 -551 -249 293 -363 -549 296 78 -712 -22 115 -303 -56 438 -94 -41 372 226 -308 379 268
1880B68l82J12N17p99N0N29j68m39N51p4n64L79K16m89j90R08o19j67N28q6m11
1901c30K82K97l92MM41m33j08O37j98m17K98L27o36K14O03p67L7O68n58m35N31
1922F5o6m29N25L84o94k6N87m80m03N89J02p05O74L48p57J71O70m90m51O75o5
1943B24p11N49K35o31J61O63n90k51J061n00o96M78L11n25j7O61p84o7N57j94
1963f6l36N15R1k84J50J62l90O0O27n32j61N29n5l55R0M02n39J49J93k05j85M39
1985B99k7o63K85J89l71N9M15m46o4M93j14n04M37K81l88j5N03m08r8M06j84l0
2007E5J53Ol63L35J27n21J77K98l70j77M13o0m26L31J29l86o3M45k14l00L80J10
2029G9m00M23J98n72J76M22k69l57N30q6m12K56M53m53nM96m33k38N56m20l31
$$ plain form
1880 268 -114 -2 515 -284 -234 295 127 -312 239 165 -399 -20 196 -293 -483 425 -194 -361 167 81 -330
1901 -330 -48 249 -143 -139 302 -131 -239 398 200 -217 81 408 -228 -14 589 -178 -141 527 -31 -466 65
1922 65 -1 -430 95 479 -215 -241 346 -134 -537 52 154 -551 123 471 -286 -115 555 65 -386 289 224
1943 224 -487 62 297 -334 -173 490 -100 -351 710 210 -486 -8 303 -222 -239 422 -362 -429 128 -66
1963 -66 -402 113 204 -80 70 232 -158 -98 529 -3 -164 365 310 -45 45 447 -92 57 250 45 -140 299
1985 299 272 -391 -106 83 -288 -229 186 -260 -324 169 55 -449 -12 269 -119 -134 369 -39 -137 269 85 55
2007 55 208 214 -149 186 313 -208 -31 267 -103 -280 133 73 -353 -22 107 -279 -342 103 -111 -411 -31 79
2029 79 -321 102 300 -272 -96 326 57 -300 230 144 -268 -12 441 -12 -17 479 46 -192 364 -56 -387
2050c87M92J68n56J60K94m71J47J47nl49M70lm41K38L17k55j67N82j48m78M61
2071B16j4m78K76L01j52k23N89m81k79L02j60k20K28L48n78M03K37n35l8L73k31
2092a16j77M28J22l79N6K25l44k6N46m48m3N35m1m28K72K2k35o3N23n78j8M21
2114B54j34n31M94O0m13J88L56l53J17P0r4l41L06K62m24Q2K52j66l1L47k87j25
2136a11L58J15m06J23J49k86m5N95n84j88L62p7l21J96L68m54K4L13k43l08M13
2157gJ41l04O1J39k11K94J24l98J43M19j49n03M52r4j45J92K22l88j55K41k8k52
2179b06M22k57n4k2L05k72q6K37q8k03M71j82j71J84m8O5k99L69j23L1J46J4m41
2202b08N50O3n37J96L33l95j21L09r4l11L36k4k70j13L75j38q4J29j23j62L12
$$ plain form
2050 -387 105 273 -283 -123 171 -300 -153 -6 -11 -360 110 107 -334 -96 221 -34 -201 381 233 -245 216
2071 216 202 -276 0 301 149 -74 515 34 -245 57 -103 -323 -95 253 -325 78 315 -220 -258 115 -116
2092 -116 -293 135 257 -122 -66 159 -185 -211 335 -113 -156 379 338 -90 182 204 -31 -94 429 -149 -167 254
2114 254 120 -411 83 143 -270 -82 274 -79 38 108 14 -327 -21 241 -183 -101 151 -15 -46 301 14 -111
2136 -111 247 362 -44 79 228 -58 -103 492 -92 -280 82 5 -316 -120 248 -206 -182 131 -112 -420 -7
2157 -7 134 -170 -109 30 -181 113 237 -161 -18 401 252 -251 201 107 -38 154 376 -12 -167 74 46 -206
2179 -206 216 -41 -95 -117 188 -84 -170 67 -21 -224 247 65 -106 78 30 95 -204 165 42 73 219 233 -208
2202 -208 342 405 -132 64 397 2 -119 190 96 -215 121 97 -173 -286 89 -49 -133 -4 -127 -289 23
2223B3L70o16L03J26j67k01K72J1l54N96jo28N14J57m22L4M24m02l70N85k42l31
2245c19K82Q8l61R0J92J20k90J84k6l17L96P8j66j1K51l19M5L57j18k64M86m14
2267c6oQ2L8k88K57J26l31J03K51L4l22J27J27l64O5K96k49l9K45k18rL44k24
2290Iq0N7J82k01N1J21k1k32K16R5l62J10M20m48j81K89j35l4K85j66j23j59M03
2313I6j21j16J55L8m14M45j74j70K14J69k07LK48j05j88K20N3l39K47R1R1k03
2335C3J50m0j87J83l4j79KJ01j87K24J00j24j08J6L0j19K32j41k98M47J6j41q9
2358a13K94j28k46L76j87j23K71j6k45J68K15l50j39L83k06j59J04L4j52J70J08
2379E9M6m59M83k56j27K58J19j42P6J61r8r2M1J09j43J29n4j97j5L26j53j11L03
$$ plain form
2223 23 393 -223 80 206 39 -162 110 121 -233 363 362 -266 248 405 -17 17 441 39 -331 254 12 -319
2245 -319 -37 51 -310 -220 -28 92 -198 -14 -40 -357 39 117 -49 -60 191 -128 -83 274 156 -108 378 -36
2267 -36 -42 40 78 -210 47 173 -158 -55 196 230 -92 35 162 -202 -137 159 -90 -129 116 -102 -111 233 9
2290 9 -71 -14 168 -33 18 139 118 -114 102 197 -165 -55 365 -83 -264 25 -110 -144 141 -25 -148 -307 96
2313 96 -25 -141 14 52 -362 83 -91 -261 -47 122 -85 -82 166 61 -127 93 146 -193 54 145 236 33
2335 33 183 143 -44 139 105 -74 -72 29 -158 66 166 42 -66 -50 -20 -139 93 -48 -346 101 117 -24 -113
2358 -113 181 53 -193 183 -4 -127 144 128 -117 51 266 -84 -223 160 -46 -205 -101 -67 -219 -49 59
2379 59 105 -354 129 -127 -254 4 123 -19 57 218 120 28 69 178 35 164 110 -87 -102 224 71 -40 263
2402B63m5k61J65j54k62K38J49l05K2K69k1j96J97P4m67L55L3j87J57J5l6J40
2424A43j17j04K6j25L03k66j1L57l7l11K72k65R2J78l9l12Q4K80l29l4J57Q0m10
2447c88L46n8o6J34K55j71k75L77k14jJ45J93l94J65J84m3k25R6j1l01N00l69
2469a21J39j4K8j28j49L14p7j59K62m6k01J33J79k63J86J57k20L0k8j11o3K07
2491E5J30l84N17k17j92N6K08j57j80O0l0J90q5J12l16K93K9k33p5K84j89PP9
2514c8K17m15K79m0J4o1o8J95j67K04j23k6k4K48j58J4J38k10j31K4K61j70PQ3
2538E3k49J50lj9K0l6j9l8j9J90K54k03J33j21J2K6Q9j67J29l38m9K86L3q2o1
2563b9K38l2l55J38K72l70J99q9j93p6M07k65j03J19m3L03j33m7n5J13J69k18
$$ plain form
2402 263 218 -43 122 -32 -294 -56 93 -212 -190 79 58 -138 59 133 -334 21 54 -133 24 39 3 143
2424 143 26 -78 -52 -177 126 -140 -151 206 169 -142 130 -135 -43 135 96 -216 -132 148 -181 -215 -58 22 -388
2447 -388 -42 -100 -166 -32 223 52 -223 154 -60 -61 84 277 -117 48 232 189 -36 60 49 -252 248 -121
2469 -121 18 4 32 -96 -245 69 -8 -167 95 49 -152 -19 160 -103 83 240 20 50 22 -89 -152 55
2491 55 185 -199 318 101 -91 -35 173 16 -164 -104 -134 56 -29 83 -233 60 89 -144 -219 65 -124 -117 -38
2514 -38 179 -236 43 3 17 -44 -112 83 -84 120 -3 -29 -53 195 37 51 189 -21 -152 -128 133 -37 -30 53
2538 53 -196 -46 -49 -68 -48 -84 -103 -141 -160 30 284 81 214 93 105 131 220 53 182 -156 -205 81 114 32 -29
2563 -29 209 177 -178 -40 232 -138 61 -28 -221 -297 110 -155 -258 -139 -182 121 -12 -59 -114 -1 168 -50
2585e0k9J88L1l64M36J09m14M3K69j7k74Q4J58l1j23P8r2j66N6L4n4n5K71k15
2609a27j22K65k27J29j16K51m04L22JO4M4N4k9r7j22kK31l1r3k57L02J19l03l8
2633a86M03l28Q6J44k50k45M99j36j25KJ67k65M19j50q4Q8N6n8j19K38Oj15N2
2656I9K25k85j89K35j40j01J71n0j89J08J6j36K37j62Nj9L04r0j8N3j24j05m2
2679a97K95l16p5L56q9o5J29l2J40j00K4k0R4Jk10j12NJ90j7K1P7k13J44J4j11
2704f7j29J51K29j02l8j5k07L76r3k52Q7K15l96J89J34p9o1P5nJp4N0R6k29J08
2729c6J08j60J92J23k87J9J61k38m6L71j80R8k37J73j90N8J14k37j4L27J05o5
2751A59k39L42k32j87K16k52J47O5n2N0n1j09O6O4j2j28p0L23l7n7j48M7r0J08
$$ plain form
2585 -50 -79 109 140 -224 212 321 -93 -50 219 202 -72 12 170 139 16 94 2 -164 -108 -74 -128 -183 88 -127
2609 -127 -249 16 -211 -82 -198 53 -351 -29 -28 36 80 134 105 8 -114 -116 115 84 -9 -266 36 155 -148 -186
2633 -186 217 -111 -25 119 -131 -376 123 -13 -138 -136 31 -234 185 35 -49 39 95 37 -82 156 162 47 99
2656 99 324 39 -150 85 -55 -156 15 -35 -224 -116 -100 -236 1 -161 -156 -175 129 39 21 74 -50 -155 -197
2679 -197 98 -218 -293 63 -26 -91 38 6 146 46 70 50 144 145 -65 -177 -172 18 1 22 99 -114 30 44 -67
2704 -67 -196 -45 184 82 44 29 -178 198 105 -147 -60 155 -241 -52 82 3 -58 17 12 13 -61 -11 85 -144 -36
2729 -36 72 -88 104 227 -60 -41 120 -118 -164 207 27 125 -112 61 -129 -71 43 -194 -208 119 224 159
2751 159 -80 262 30 -157 59 -193 -46 19 -33 17 -34 -143 -77 -13 -25 -153 -223 100 63 6 -142 -95 -185 -77
2775g7j7J20k36L92r2j13l3K50j86j93K02l6P2o8J04Oj5j93J48L8q1j7l3n3n4
2800a65O1j11N2P2J45j5j29j3L12k75N0m9K15j35R6R0k30R2N8j63k2j2K50k03
2824b9L31l35j00K6Q2J0j56L10j52j17K72j63L3j06J59j87K1J61K0J38J3k1k44
2847c4M2j39J91n4o1k4JJ66j94L9M8J04j81j91O17l96j44L83k43j58K25k7K30
2870B00l00J83k6Q4M5k30o9K57r1r8J31l3O4j09J67j57j45J49L6j65pJ45j13L3
2894d9k3L4j24M2J15j12J39j55j3k0Q3O2K2J39r3j02L52K1k33P3o2j61o3J22K13
2919B07k09j02K01k11N2j37J63j69K0m9K39J8P2j0j30J98j72L5j58K03k41J66
2941a4N9o1p8K21Pj70m5K4J11o4m1R5L0n1K01k54O6K9k19K17o5k18K98P7l04P1
$$ plain form
2775 -77 -94 26 -210 182 90 -23 -56 194 8 -185 17 -19 53 -15 89 95 80 -113 35 73 -8 -25 -58 -111 -165
2800 -165 -104 -215 -163 -91 54 39 -90 -103 209 -66 -16 -65 150 15 111 201 -29 63 121 -42 -64 -76 174 -29
2824 -29 302 -33 -133 -107 -25 -15 -171 139 -13 -130 142 -21 12 -94 65 -122 -101 60 80 218 231 210 -34
2847 -34 8 -131 60 6 -55 -79 -78 88 -106 -67 -19 85 -96 -287 330 -66 -210 173 -70 -228 -3 -30 200
2870 200 -100 83 57 141 186 -44 -113 144 53 -45 86 53 117 8 175 18 -127 22 58 -107 -114 31 -82 -49
2894 -49 -72 -38 -162 -120 -5 -117 22 -133 -146 -166 -83 -21 1 140 47 -55 297 318 85 158 96 -65 -128 -6 207
2919 207 -2 -104 97 -114 -62 -199 -36 -205 -185 -234 5 23 95 85 -45 153 -19 16 -142 61 -180 -14
2941 -14 45 -16 -94 127 134 -36 -81 -57 54 -10 -51 44 74 23 224 -30 36 65 -154 63 -2 -220 78 155 -149 -78
2967g8J66K7l48K67O4k09K10O5k54J97J25m00J93N7l4J20o9j91k1r5L75l39P9
2990i3R4j16k8K36n2M6nj48p0pK99k23K09p9po6%J70l52K38K1o0j42J44k3r2j8
3017a24K62l57K90j6J5r6qnr2L01q3k82P7K42j68P4o0n4Q8P4k7j54j60K69jK0
3043B5J6J15j17Q6j55P0N8q0j73N6K27r9N2J28%k57m1l7O9r7L04k60N3J43L3n3
3069F6Moo5j44J05P3J05j63K36m9j31m7k6K95k04p8J81k9j45r6J84o6k10K08O7
3094F5l7j3O8j70J25m7r0j8Q3R9r6L12k36j22l0J20J90l73J77q0L1Q1o4Jo1J6
3120f9J97j27j5j90M25j39j52K13o2o3K4J74k07J02p1J23j35J94l00Q8j2MJ07
3143A09j65q7J24k2J32j08j11K40k32J28o2j50J61o0O6J46q8p2J76r9j0m8J71
$$ plain form
2967 -78 88 115 -233 34 98 -111 99 164 -90 107 232 -168 25 82 48 168 99 -92 -113 -208 167 -172 -93
2990 -93 1 -115 -143 93 41 87 82 -66 -136 -143 156 -67 142 63 56 -10 -10 160 -192 46 67 7 -135 9 -14 -106 -124
3017 -124 138 -219 71 55 70 -26 -34 -39 -131 170 87 -195 -118 124 -44 30 -30 -84 4 78 51 -103 -263 6 5 25
3043 25 41 156 39 125 -30 40 98 18 -155 -99 128 29 81 209 209 -48 -89 -126 -57 -154 150 -110 -57 86 119 66
3069 66 70 64 -1 -145 -40 33 138 -25 211 162 31 -16 -42 253 49 -29 152 123 -22 -118 66 0 -210 -2 65
3094 65 28 15 83 -87 38 -9 -99 -117 -34 65 -31 281 45 -77 -107 13 203 -170 7 -73 -42 39 -25 -24 -85 -69
3120 -69 128 1 -14 -204 221 82 -70 143 81 18 42 216 9 111 40 163 28 222 -78 10 -2 2 109
3143 109 -56 -143 -19 -41 91 -17 -128 112 -120 8 -54 -204 -43 -103 -37 109 21 -51 125 26 16 -32 139
3166A39k26M7P0K9j38n3J85k36n7K21oK44k06q2k0%K95j44J03o5k50J92r4KK12
3191A62j44k2p3K57l20P7J41N9M3l13K40q7J28k36J31L6k33J00k4R5J93k97Q4
3214cm5r2J36j56K24j33r6M8m1K6q5J88N1j44N4J74j64J34J0r1J06q7j33R0J56
3239A27k08j34K85j31N0m3J88k24J41j5J4j62J00j49J39q2J66M6k49Q0Q4r5L4
3262c8p4J47n0l9RKJ01k02L76k01j23N4O1j61J63j21J53j13N7j5l5R8j9p3j53
3287a96J74j5N8Rk54J67O7R1J3k8k25J79J01k94J87K5k5m9l1J0l2J17p5n2K05
3312A27n7k0n6k05K76R8k74J41o2M9K0K6k64K20K02j76j32O8o5Q8n1J43q2l0k01
3337b17K34L3NQ2j84m8J24k8j75J23OJ09q1m9J5O3N7l1r6J51j73K03k03K58l55
$$ plain form
3166 139 -87 -40 30 59 -79 -132 53 -183 -240 -19 -25 219 13 -69 -89 -89 206 62 165 100 -150 42 -52 -50 162
3191 162 18 -4 -77 180 -140 -63 78 137 180 -133 107 20 148 -88 43 79 -154 -54 -78 17 210 -87 -3
3214 -3 -48 -140 -4 -160 64 -69 -165 -117 -158 -132 -217 -29 22 -122 -68 106 -58 76 86 -5 101 14 -119 -29 127
3239 127 -81 -215 70 -61 -11 -54 134 -90 51 36 50 -112 -12 -161 -22 -104 62 108 -141 -61 23 -72 -38
3262 -38 -112 35 -15 -54 -45 -43 58 -144 232 31 -92 -38 23 -138 25 -96 57 -56 1 -14 -49 49 30 -43 -196
3287 -196 -22 -37 21 30 -224 -57 10 101 114 86 -139 40 141 -153 34 59 34 -15 -46 -36 -68 49 -26 -78 127
3312 127 70 50 -6 -211 65 163 -111 30 -32 17 37 63 -201 19 221 45 -87 -19 -84 4 -47 96 14 -16 -217
3337 -217 17 50 55 137 -47 -95 29 1 -174 -51 -45 64 -17 -66 -51 12 69 38 -58 93 -80 123 -80 178 -177
3362a77P9J65l4J82l63K82n2M1L4r4j44N4J46p5j61R5R1j12J61J19l47O9lj15
3386a59O9J61j9j35J14NJ7M9n7m4o4rK00j22Q3m9K9r3K7L2Q8L0j93j43K4K81j78
3413e6p2J97n5oJ61k25K40k96J01j1L9j32R1J33P1j34k4nJ49j73J34j2k57J41
3437aJ80j47J3N2j24J86r3k06J09j0Q0J3k3k13K75k07Q5K47k46P8j54k6K41j25
3461a6O3Np6j06J97j05k47K33P1j79L1J68OO5k80K72M7k12L2J28k33J7J11N2k82
3486b38K95r9J32r9J24J39k92J50j17K68n1j53l0j23J01K20k31j07QJ32nnO5p1
3510A3n0k01KJ56p4n5K79N6j57L5j0j96J86j12K10m1k9k09J79k4J06L03l33j75
3534a41J39P2j40k0R4pK10j45J25m43K84J12k65K53k07N1j44K21K07l31O5Lp4
$$ plain form
3362 -177 -98 67 33 215 -148 134 82 123 157 63 -81 -27 119 44 -117 -22 69 -43 118 237 -110 -41 -44 -159
3386 -159 -90 71 52 -83 31 36 53 102 45 1 -63 -72 128 6 89 40 69 -24 3 35 123 153 -40 -183 -159 122 -56
3413 -56 -128 69 14 8 169 -56 184 -112 -11 -22 17 -115 -24 109 180 46 22 17 166 -7 127 115 -142 -1
3437 -1 179 32 45 97 -27 159 66 -140 -31 -41 39 52 29 -184 91 -116 -31 216 -30 48 -106 -132 109 -16
3461 -16 47 52 -24 -130 67 -38 -285 -52 19 -160 -129 39 45 110 -170 102 149 -63 -31 97 -136 -119 -8 44 -238
3486 -238 57 -42 90 -9 115 254 -38 112 -5 263 212 59 29 -94 7 227 -4 -111 -103 29 24 19 84 13
3510 13 -37 -238 -236 -80 -154 -209 70 126 -31 4 -6 -202 -16 -128 82 41 12 -197 -18 -42 64 367 34 -141
3534 -141 -2 70 -70 -90 4 -3 207 62 187 -256 28 140 -125 128 -79 -28 -172 49 256 -75 -10 -7 -81
3557h1P2r8J15K6R8j44J36j78P8Q6l7j64K66j30n3J48k14j14J64j6m0K15j28R5
3581A02Pk91L03n7l6m2m0J67n2l3M9k07K1N6L0J71j43p0l4R3j24K18k26R5N0q
3607al6M2j46J45q5R6J00k05j2J54j96J10J00o3R2O4j32J5M3R1j32r9R6O5p9j01
3633g4j5K01l0q5L8J60k29j06K04L3k10Q0P9M1Q2k69m0K32nj6lj41J45k65J07
3658h6K45j48J03q2O7N1n1k57Q8L39k26j43J73r8R8jk08L8K17j84J48l6l7P2L4
3683A16J24k94R2qK04k77N7l8J17Or8N8q6O2rK0k8k4J52l38J46J21j08Q4j57N3
3709e3M6N0j73M5RR0m7j4J59kj42J9J9K34m24RJ02K38o1o1q0k9j4O9N4j32J39
3736E0o0k08J07J69k6J55j64P2n2k62K70J09l61K96j70k1L46l80J79L8j5k17K69
$$ plain form
3557 -81 -9 -107 8 34 132 -12 124 -54 24 110 73 -91 175 45 -8 140 -74 -188 -24 -40 -80 135 7 102
3581 102 109 -182 121 64 28 -14 -54 113 61 28 77 -130 -109 -53 -23 148 5 -65 -99 -6 -130 88 -138 -43 7 -1
3607 -1 -37 5 -141 4 -81 15 115 -90 -102 52 -144 -34 66 3 95 159 27 42 85 176 44 -55 41 106 27 -74
3633 -74 -89 112 82 -3 35 195 -34 -140 64 97 -113 -33 46 87 169 -100 -140 92 87 71 68 -73 72 -193 -86
3658 -86 159 11 114 32 99 150 99 -158 -70 269 43 -100 73 -25 73 72 -136 -98 119 -65 83 47 10 82 116
3683 116 240 -54 38 30 234 -43 14 -24 93 99 1 59 -27 35 26 46 18 -6 146 -192 -46 75 -33 51 -106 -53
3709 -53 -7 43 -130 -85 -76 14 -33 -47 112 110 -32 -13 6 240 -184 -175 -73 165 104 43 -37 -66 -80 -11 43 -89 50
3736 50 -10 -218 -111 58 32 187 23 95 43 -219 51 160 -201 95 -75 -96 250 -130 49 87 72 -145 124
3759A24j5k02J38p6nm4m9O8o3K63o4j14K84l40J03L5n1Q2j49J11J41o3J5lj36
3784a0J28o9P4j36J71l34L08l6J86l47J24j02Q9j02K6j32K59L1j88J31O6Qk16
3807g1Q4r6J25L0k24J95o3Q9k02l7K68j70P4n6J16j06O8j00M3K6p1K10q9j1p9
3832d7L4L3J42k13Q3j02O3r3J44o4K3P4pL9m8j5n2J35k08J27j68K67j55R7r4J45
3858A40o1k68M00j84o0Lm3m5R0o7P3p2R5K7L4rp9J85j30o9j17K11j09J76q9M2
3884G4J42l92L18l4r7M2k56L58p0k80K4M1K42k2j52M6J78k88L8O%J04k5q0M1n7
3910i9K97k51l4Q6r3J06Q6j97o7P6N4J12j98RK07m4j66q2J14J29M7p3n0o0j74
3935b65J43J26K1j25J11%N0p2J49K2m8j29M5r9J13m3j16K81k27K6J08J52k21k16
$$ plain form
3759 124 109 -93 45 -31 -36 -80 -129 -61 -124 139 75 -39 245 -95 8 43 -8 74 -75 36 177 114 129 126 -10
3784 -10 118 49 123 -13 158 -176 132 96 282 -65 59 -43 46 -56 -30 -162 97 128 -60 71 137 145 -71
3807 -71 13 -83 42 72 -152 43 -20 69 -133 -170 98 -72 2 -54 62 -44 24 -76 -33 -7 -78 132 43 32 -47
3832 -47 -13 20 162 -51 32 -70 -7 -100 44 -20 3 77 70 109 61 46 -6 129 -79 48 -120 147 -8 89 -5 140
3858 140 79 -189 211 27 -33 -30 -73 -118 -28 -95 -22 -94 1 28 62 53 -26 159 29 -40 -157 54 -55 121 32 74
3884 74 216 -176 142 108 11 53 -203 155 85 -195 -171 -130 112 90 -62 -16 162 -126 -88 -82 -82 22 -3 -83 -42 -99
3910 -99 198 -53 -87 -1 -94 12 98 -99 -166 -90 -36 76 -122 -113 94 50 -116 -198 -84 45 92 19 -31 -91 -265
3935 -265 -122 4 25 -100 11 11 61 -11 138 160 112 -17 28 -71 42 -1 -117 164 -63 -37 71 223 2 -214
3959b14K44Q7oj08Q5j15Q0j66J07l6R7M5m9J9qk00J59M9j7m5l5j05Q0NJ76j85
3985e6J34J1r0R5m8j41l3k1L14j53p9K9PP0l0j84K09k07K23P9l91L59l46K54K19
4010B24k73q2J68m2Lp0K73j16j16P9N4o6o2n6O6N8l6k0j71K91j31q2o2J43J10
4035H4M2M5l09P3K10j16k3j23RJ35N5j0%J17r5p9mR6k45RJ00J09j62m8R5L7J15
4062A17k28L2L5j64K82j13q9J84k29j01J89k2oM1J09J24p2o7q6K12m61M16l5j16
4086d8Q6J87q9k62J99R9j66j24J48k19L07k98J85j9j96L27k03J81j93L12l12O7
4108c1J67k75J64m4J06M6r0L3N0o0L2j98N4n2J88j42J61p7M7K2j08R5j14p5K43
4133A42j17j10K31k48L28k72O5NR7p7o2O3q3K6j42J28J32j25P9k77K79J14k73
$$ plain form
3959 -214 30 117 111 3 88 -27 53 -113 -6 -42 55 100 51 70 62 -138 21 70 53 8 -27 -132 -52 -47 129 -56
3985 -56 78 89 -1 94 46 -95 -128 -149 165 12 -67 -38 -31 39 9 -175 34 -173 50 129 -262 97 -249 5 224
4010 224 -49 -131 37 -5 -2 -72 201 85 -31 48 102 36 -26 -82 -16 42 6 -14 -185 106 -25 -107 -169 -26 84
4035 84 126 171 -138 -65 145 29 6 -117 -108 27 82 72 72 189 94 15 11 107 -138 -129 -29 80 -82 -130 -35 2 117
4062 117 -111 -79 -44 -208 74 -39 -128 56 -173 -274 -85 -107 -113 -72 37 161 89 22 -64 148 -313 103 68 -48
4086 -48 38 225 136 -126 73 172 6 -118 30 -189 118 -180 5 -14 -210 117 -86 95 -98 214 -98 -31
4108 -31 136 -139 25 -19 87 133 43 76 126 66 98 -100 -46 -98 90 -52 109 32 79 101 -7 88 -26 -101 142
4133 142 25 -85 146 -102 226 -46 19 24 121 44 -18 45 -38 -12 -154 -26 106 -19 60 -217 62 176 -97
4156i7J04JQ6j81K91j66o1N2O5Qj31k23M00n2r5q0J91rj57Q7O6R5j03j34m3r8
4182a84J02q9K97j1k39K46n0Nl33L31p2k8M0k6L2k7j17K20p5M0k82K16o1P9j37
4207a23P1j6N2O9k9J28L7j70N1rm1J33l09K31j24J02k1r2n1J52j38J1M0j2J84
4232A26o5M0j64n3J94r1m8J71K3j34q1J68p0j90K13o6k7k29J56J36j59J05J18
4255G3j34P0k3K04j31P5Lk63K52j56M4N2j70J47k69L97k18J0J71l32K07k50K60
4278A9j18n0J89j54N8p0L69l37L6P1J99j56j25J09r1j29P6O6J12j75O8L3N1j37
4302h6K4K85j44q8j9q1K18j82R3p2J29l35K81j2r9K1K8j06K24p3k9k4R9l01K43
4327fp7J29j19O5k5J13j66J94l11m1L80j94R0r0J67m09L73k4M9j23J7m1L5K4j33
$$ plain form
4156 -97 7 8 94 -87 204 38 -23 29 94 102 -29 -252 148 96 1 -79 112 103 -54 33 99 194 91 -43 -86 -184
4182 -184 -82 -171 126 115 -124 122 72 77 -256 75 3 -25 15 -11 21 -6 -123 97 22 62 -220 -4 -65 14 -123
4207 -123 -52 -68 -16 53 24 152 189 19 70 61 20 153 -156 75 -49 53 32 -60 -111 41 -97 -86 -46 -58 126
4232 126 61 101 -63 -116 78 -13 -61 110 133 -1 -82 86 16 -174 39 -27 -54 -283 -127 9 -150 -45 73
4255 73 -61 9 -14 190 59 134 137 -126 126 -30 14 66 -104 43 -226 171 -47 -37 134 -198 9 -241 19
4278 19 -99 -149 40 -114 -56 -126 243 -94 -58 13 212 56 -69 40 -51 -180 -104 -38 74 -101 -33 0 51 -86
4302 -86 -62 223 79 -9 -28 -109 109 -73 20 -52 77 -258 23 11 -88 -67 -39 -145 79 6 -23 -47 52 -249 -6
4327 -6 -83 46 -73 -8 -33 80 -86 108 -203 -244 136 -58 32 -58 109 -300 73 49 98 -25 -8 -49 -14 10 -123
4352a23J38P8j08p4J36J16n7n3j32N1J29N4k21K15j1j80K5J3o4J35q1K1O5M7r2
4377B7n9o4J59j69l1J24j61J55q7J47l6q4j2P6l6J04L5j27r8M4j3J38J85q3k15
4402h1J31p3J4r2O8J99j87L4r7L5R1Mk93L90l09K74k69O7Qj30K41k18J00J91q2
4427A6j9K0K6l10L30K7j14qq3J48R5j46J4j32q1K12q9Q9k7O0r0M5P9k16J13L2
4453iJ19m51K61J80j38J6L0j1r7J65m6j33n4K42O4n2r5J4j33J80o5o6j02K56q7
4478a2j86J89p2j6N4j40J45J80l57J47J06M1k7kk16J77L9Qqj10mJ57j34O0K2m6
4504eO6l0k4j06Q1Qn0J11J69k53J30j11K8J45l32J22K12p4J5j19M3Q8m0J59J7
4529B50j34k39K21j23m6J75M0j80p8R5k17L63j47n6K8Q7n9M6j97K3Q8O0j18J79
$$ plain form
4352 -123 15 93 -15 -89 47 163 106 53 -79 -28 101 155 -66 149 138 -42 -17 -4 -68 67 -14 7 72 119 27
4377 27 -32 -96 63 -106 -137 -13 -174 -19 -106 41 5 -79 -91 -15 -51 53 88 -39 -137 -93 -106 32 217 134 -81
4402 -81 50 -23 -9 -101 -33 166 -21 13 -84 -49 42 46 -247 143 -166 108 -161 -94 -86 -216 25 -193 -93 98 16
4427 16 -3 17 43 -267 63 90 -24 -32 -115 33 128 -18 -4 -136 -217 -5 -94 -5 -32 28 -62 -17 62 -154 -41 -9
4453 -9 110 -341 -80 100 -38 -22 8 -3 -100 65 19 -114 -168 74 138 86 -9 5 -128 52 -13 -79 -181 75 -12
4478 -12 -198 -9 -81 -97 -43 -183 -38 142 -215 -68 38 79 52 50 -166 11 50 58 50 -60 -64 93 -41 19 41 -5
4504 -5 61 31 7 -99 -18 -10 -60 51 220 -33 97 -14 14 159 -173 -51 161 87 102 -17 26 114 74 233 250
4529 250 116 -123 98 -25 -71 104 144 -36 -114 -19 -236 127 -20 -76 -48 39 -20 26 -171 -148 -60 0 -118 61
4553F1q3J33j95J78j32M6K75l00K32l43K4K32P7k56J39j10Q1r0K64K6l34K56k22
4576d1P6O6k25K67k28m5nK09LM0q3j98K46n2MJ0K54l44K04j31lNR4k02J66o2m6
4603b1J43j91N6n4K26l17K61o7j25r2J60r9Q3K4J26j02L5K6j87J46O1oj34Q0m8
4628a6J30Kq5J74p3k1k53J23J64j60J02l47Q2J42P8J1m1M8l17L60j89J28n5Q6
4652G3k3o2n2J9J18K2J5l8pj23N3n2P0j18J74p9q0J65jp7OJ13j36j40J81j28j5
4679a22J48m2o5R2J5n4J0j01J24N6o0Q7p6j41J50R8k68o9Q7J88j05J33lj08q0
4704a06jP6lJ41J2j83M0K35j54n7J3J08j32P2j64O9nm2oJ5J46M1j65QJ6Q3j04
4731d7l6J54l8j67J83j50J66q7J79q9J7J3j11J73j55k4L9j49J85j92K24k7p1r7
$$ plain form
4553 61 -22 111 -84 94 -38 8 283 -17 215 -128 -104 128 205 -51 88 -22 59 -31 233 259 -75 181 -41
4576 -41 35 101 -124 143 -85 -130 -135 74 77 117 34 -164 82 30 34 44 298 -46 158 27 24 29 123 -79 87 25 -21
4603 -21 122 -69 -13 -67 159 -158 103 36 -89 -181 -21 -120 -37 -13 113 11 46 72 -115 31 92 86 -48 32 -16
4628 -16 114 116 31 205 132 111 -142 -19 145 -15 87 -260 -178 -36 42 53 12 60 -257 103 -86 42 -13 73
4652 73 50 -12 -64 -45 73 95 110 72 65 -58 -5 -57 13 -105 69 -10 -90 75 74 -3 3 116 -20 -160 21 -107 -122
4679 -122 26 -16 -81 11 26 -28 -18 -119 5 61 1 88 12 -129 21 119 -149 -218 -131 57 -48 85 82 -26 -106
4704 -106 -107 -31 -34 107 119 -64 -24 211 57 0 13 121 -11 61 -103 -34 -39 -81 -87 -72 74 115 -50 -42 -26 57 -47
4731 -47 -83 71 33 -134 49 -101 65 -22 157 68 85 98 -13 160 5 -19 20 -129 56 -136 88 61 -10 -107
4755a07J38J7Q7j49j3P2L1N1m0m3j9j2p2N8p8J83j23J52Qj38P7pj69J06p6J22
4781E6m3J06j49K13m6j89K96o3j84j22J13R2k56J22LJ40j02j68K12Lj17J71R0
4804A78k09J36k05J87J3J30j82J7l0j22N7ok7J07m3J01j02J45k6l1j69K11L2M5
4828B07k95J87j17J25j38q8R7M5L4m1r7QK11r9L5k0j14j20L0J26M3j96K97l6J1
4853I5pj87O2j14J73p3L4J54k18J64J9q1n6R6k02J60O2k40J46j9j2K01j39Rm7
4878b0mJ54k8j31P2k17J91J24k4m2q1L7J78j73j05j67K00J53j28N2nJ31l24J95
4902C8j02Q7J03j21J04j31J02r4J70k11K48j54o4J50k06J02j66l2M2J41J8M6P0
4925A40k67Q7P6J91n03M07j65o3K24j82o1N4R8K17j23J6j99j21Q5Q0K3O1Pjk5
$$ plain form
4755 -107 31 48 135 -14 -27 45 76 127 87 44 25 13 -59 -1 -79 104 -19 133 141 3 80 73 -96 10 -66 56
4781 56 13 119 -30 183 137 -52 244 181 -3 -125 -12 80 -176 -54 -51 89 -13 -181 31 34 -83 88 178
4804 178 -31 105 -100 87 100 230 48 65 35 -87 -30 -36 -63 44 1 102 0 145 119 88 -81 130 162 207
4828 207 -88 99 -18 107 -31 -119 -22 23 57 16 -81 -73 138 39 74 54 -60 -180 -150 -24 19 -177 120 84 95
4853 95 88 -99 -37 -151 22 -51 -17 137 -81 83 102 21 -35 61 -141 19 81 -159 -13 -32 -44 157 18 27 -20
4878 -20 -24 130 102 -29 43 -174 17 141 117 75 -6 31 209 36 -69 -236 -36 117 -11 41 36 167 -157 38
4902 38 -64 23 126 5 109 -22 80 -14 156 -55 193 39 -25 125 -81 21 -145 -177 -135 6 24 70 140
4925 140 -127 -40 36 227 -276 131 -34 -97 127 -55 -116 -62 36 253 130 146 -53 -174 -89 -9 14 75 82 81 56
4950E6jj09J43k9K6K7k48J32jJ43j19k4j30k36N23j29L1J0q5J02j49K41p5j20
4974b1R1k8l8n0kJ11k7Q3O4rl18N9J85n7R0J40j79l6L5j37J09j02J26J0j56J76
5000A19j73k5n8j1K02j0o6K00j54j80J56J7q6P4Q2K5o7qj56K03j12J23j61Q6r9
5025g9Q4P8n9Mj28J6J7m4R2j17K01J07k3Jl4MJ04j83N6q4k9R9j5J21k26pj45N
5053a84L09J22k96J77j3j71J25M2o6J08k14Q2k55K31o6k52L95j90Q1nm6J87j60
5076e9QJ9O3lo0JJ14k08J40j06K01kj26N5j38J18n5P8P5K7k45J37r7K4o7J21M
5103A9m0j10J98j38J40J32j65pJ53p0mj87R8n6K9L2Q4n4L2j03J44n0p6K3k23J18
5129h1K04j29j43L09k34J61l10J73l0J7P4J04j49j8j81K50J1K1l7N4j17o7K55
$$ plain form
4950 56 55 -54 89 60 86 113 -135 -3 -4 139 20 -4 -134 -370 153 24 55 65 -20 82 -67 174 99 -21
4974 -21 70 42 4 -46 -48 63 36 119 183 174 -144 -85 100 43 133 273 94 58 93 -44 65 -37 89 99 -57 119
5000 119 -54 -79 -137 -148 54 44 -22 178 24 -156 0 17 -69 5 87 112 45 37 -119 84 -28 95 -66 20 -79
5025 -79 5 83 24 28 -100 -84 -67 -111 -19 -136 65 172 149 150 116 120 224 41 97 13 -16 83 68 189 -37 -44 -189 -184
5053 -184 125 247 -49 128 115 -56 69 111 45 153 -61 21 -234 -3 -69 -321 74 -116 -35 -40 -86 101 -59
5076 -59 -51 -32 31 28 -32 -31 83 -125 15 -91 110 108 -18 37 -101 17 -38 40 115 142 -103 34 -63 -39 -106 15 19
5103 19 -21 -131 67 -71 69 201 36 29 182 112 108 -79 19 -37 -8 24 108 54 86 -17 127 77 1 24 -199 -81
5129 -81 123 -6 -149 160 -74 87 -223 -50 -80 -63 11 115 -34 -52 -233 17 28 49 12 66 -51 -118 137
5152A37j68n4J55R7k90k2L47j99J0q7j05K54j28m4j9K00p0j91L0N5K41j01J11
5175A59k78K20L9j09L9q7j98K91p9j17K37o0k72J00J93j1j63J96k2L1j29Q6KJ24
5199A92k07j44K93q3k07P2M2n8Q5Q9j41R4P2k42M3K10q2oj8OK2O5jn4O2o6r6J74
5227A16k64m2J21J15j96K74l0r2k0j03J18NQ1r2N6l1m3m8K13mLj1j51J01J32o3
5253A45k03K55k84L0J36%k51K24j36K27j87J69p5LL7j71k6L0M8J27k03P9K30p9
5277A25q4J0K9q6J81j39k10J10K90r8k11M7L8K6q9N6J13O0j42o5Kj57N8J38o3
5302f1Q9P0j75J12J08k03K21k24%L05m34J13J3O3jK21l59J8J83J3N1j06j24J39
5326C2j13L3N4j1Q0K7Q4k61J90j26o5kJ8j21J95R6j86J43L6j2pR8l21J77N9Q3
$$ plain form
5152 137 -31 -85 70 167 -123 -145 202 3 13 -74 -179 75 -53 -97 -116 84 14 -177 -147 -92 149 48 159
5175 159 -119 101 140 31 70 -17 -215 76 -3 -120 117 57 -215 -115 78 67 -96 100 78 109 -20 66 68 192
5199 192 -15 -159 134 51 -156 -84 -42 -100 -15 74 -67 27 99 -143 -100 110 28 22 4 10 32 97 96 42 104 38 -58 116
5227 116 -148 -190 -69 46 -150 124 94 2 -18 -121 -3 2 83 -9 47 16 -27 -75 138 134 137 126 -25 76 208 145
5253 145 -58 197 -87 -57 79 79 -172 52 -84 143 -44 125 50 53 90 -81 -107 -77 -29 98 -105 -26 204 125
5277 125 41 51 80 -6 175 36 -174 -64 226 128 -83 -36 2 28 -61 -5 108 168 26 -39 -37 -194 -136 2 -61
5302 -61 28 98 -77 35 143 -60 161 -63 -63 242 -192 -79 -66 -3 -4 217 -142 -124 59 72 123 17 -107 32
5326 32 -81 -48 6 -5 75 102 186 -75 115 -11 -76 -78 -60 -181 14 110 -76 67 103 91 84 182 -139 38 97 180
5352A80j76k4J16j32j15J67j64Kj6O9J83n1j06O0j9K09j26J8j35P5L24k47o5p1
5376d4J35j93P7j27K27j51J03j12J90k07J13J01k10K55j65J87k45J50k5j7p5J8
5398a5R5j14K5r7lK51j62J40Jo4J0M7l5k25R4n2J80M3p0M9j68K03k77R1m1J59
5424F5m9oN9o1l2q2J21m7j15J42L14k56j32OK90l24K56k6n6j15R5j56J51j26N9
5449b5N3N9k48K80k9m6j51O5J27J47j54j31Pk5J37J00j69K0L62m95K62k14j05
5472a73J37J02k77K07J6l2J67l8j95K46j75P6k42J56Q2j9j26L1r4J69j66J46K6
5495B4r7P7M3l22L88j5k5P2j16N3rJ4J58j83p2O3P7k51J26m6k6n7M3K7M8R2j06
5522b0PJ7n0j9J86k57J08k4K47j67P7q0O3o5Q3j07j01L77k05j59K0P1k30K12q7
$$ plain form
5352 180 4 -20 96 -36 -151 16 -148 -146 -162 -93 90 39 -67 -7 -26 183 57 75 -60 15 339 92 27 -44
5376 -44 91 -102 -25 -152 75 -76 27 -85 105 -102 11 112 -98 157 -8 179 -66 84 59 42 -33 -15
5398 -15 80 -34 -9 -106 -109 142 -20 120 121 57 67 114 79 -146 -52 -104 76 119 49 98 -70 133 -144 -53 -94 65
5424 65 16 10 69 8 -24 -106 15 -32 -147 -5 309 53 -79 -73 217 -107 149 123 67 -48 47 -109 42 -84 -25
5449 -25 28 87 -161 119 90 44 -107 -42 85 232 78 -53 -46 -71 66 166 -3 17 379 -116 146 -68 -173
5472 -173 -36 66 -211 -4 12 -20 147 109 -86 160 -15 61 -181 -25 57 38 -88 -57 -151 18 -148 -2 24
5495 24 -73 4 47 -275 113 98 73 145 29 82 73 87 245 62 -10 53 130 -121 5 -41 -67 -124 -81 -54 -6 86 -20
5522 -20 -13 4 -46 -65 121 -136 -28 -52 195 28 105 25 88 23 106 -1 -102 275 70 -89 -69 2 -228 -16 -103
5547a03K52k10J33j10J5K8j43L01k23N7J1Rj35LP5J55k73J92K0L6M4j7k1j40Q7
5572D3j07L2n0O8K12l43K08j78J90m4pJ60k37k0L6O0k89K38l1jn7R7M5n5O8K51
5598B89k13L2j29j37J56K45j66m1N7Q5l42J57O1k1O4j36j5p6J58k9j7L4J41j21
5622C6p4J46j4j99R3L7j0p0R3K9OR1p0q2p4O2J7O3j41n2L15j44k40J89MK06j05
5649A12n7j08J0K18k74K68j64j03K25P0Km5k25M1J88j9j04Q6m5Jn5m9M9J87j93
5674A6j9PM0o7m2m1L05m70L22R9k00n7Q1P9J10q4l8j24R1m4J41q6j22J86o1K6
5700D8q2K62k85J74k19J86j40J4j62K39mq2N9j77J03n9J59n4O5q9R0l0j88J88
5724A6J11j9k23Q1K43k56K1J11k09K06J6J28k38J72l2p4j6K05k69J44l01J05K3
$$ plain form
5547 -103 149 -61 72 -38 -23 5 -138 163 -60 -3 8 17 -118 -115 -40 115 -158 34 54 90 134 117 96 -44 43
5572 43 -64 -32 -82 -14 198 -145 63 -115 75 31 24 184 -53 -73 -37 23 -266 -28 -59 -60 -117 -20 25 -30 38 289
5598 289 76 108 -21 -158 -2 243 77 36 93 178 -164 -7 54 33 97 -39 -54 -130 28 -1 -18 16 157 36
5622 36 -38 108 94 -105 -12 25 15 -55 38 67 73 164 94 12 -62 0 17 80 -61 -113 202 58 -182 7 11 217 112
5649 112 55 -53 -43 175 -99 169 5 -98 127 197 199 154 -71 -30 158 139 35 121 76 77 22 -27 22 209 16
5674 16 -3 4 44 -23 -65 -106 199 -271 51 150 -50 -107 -26 53 163 79 41 -83 8 -36 105 19 -103 83 22 48
5700 48 -34 228 -57 117 -102 84 -56 -42 -204 35 31 -51 8 -169 -66 -125 34 -20 45 -44 46 16 -172 16
5724 16 127 108 -115 -34 209 -47 -26 85 -124 82 98 226 -12 160 128 54 38 243 -26 118 -183 -78 -55
5747e5K53j00Or7o9J72j56J20l3J02j94J02j38K95l43N0J70l3L0j72J41L3J08
5770A92k02K30l76J83K58l10n9O0k1R5k00J31J60O4qj09r7m5P6o8Q2k33J08L27
5794B38k61j83P1R2j34L71m2j37O4j31J42k69L03k15K18j78O1o0O0M3j33r7M2
5817a35J83p0l8J44l14K15n2K34p0j6l8L3j5j13k1J77k83J35kL3P7j49J59n3J01
5842A22l09J56k18J03J49J15k79N3K67k73j26K41L8j06J67P1Nj62j57K16k19K
5864a44J37J09j02N2o2n6L83k12r7k04K77n8Q6j76K47j35L3J05r1j0j51J77j14
5887fj39J37j12K68m4j50p3J76J05q9l3J53m8q6j55J21j40l5P8J4J36j36l6K5
5911f9Q1J35r9l0R3k33J64J53j80Mj50J38J2J23m1l7j90R7J23N0k88J76k17K3
$$ plain form
5747 -55 198 98 104 7 -62 110 -46 74 41 143 -51 51 -87 208 -135 -85 85 52 82 -90 51 84 192
5770 192 -10 220 -156 27 285 -25 -84 -24 -45 50 -150 -19 141 205 197 88 -9 -54 22 -46 36 -197 -89 238
5794 238 -23 -206 -135 -43 -177 194 152 15 79 -52 90 -179 124 -91 127 -51 10 -50 10 53 -80 -177 -135
5817 -135 48 -22 -60 84 -230 -15 -67 167 97 81 43 76 61 -52 -73 104 -179 -44 -46 -13 64 -85 74 21 122
5842 122 -187 -31 -249 -146 3 118 -161 -108 159 -114 -240 1 39 -67 100 171 176 14 -143 73 -146 -144
5864 -144 -7 102 0 52 -10 -66 317 105 8 -196 81 23 109 -67 180 45 78 183 92 82 -69 108 -6
5887 -6 -145 -8 -120 148 104 -46 -119 57 162 73 40 193 145 59 -96 25 -115 -150 -72 -58 78 -58 -94 -69
5911 -69 12 147 48 18 111 -122 42 195 15 19 -131 7 19 142 101 64 -126 -29 94 144 -144 32 -185 -162
5935a62J71k01J95n2l0RN6J08j33J81Qk16J26j3jQj58K57k52r6L18j18n7J67j12
5960CO8Q1k68J42k8k5J03n5M0j93K78j93J8J68k92L6J41k59K10j28J17Q5Q1j92
5984f2J15j42J56P2l20O7K57M9k90J71O2j55J25J1L0k51N1r0j3K43j8j79K38j6
6008A11o3LK2j8P9j73N0n9l1J1k9J35r6M2JJ93k55J42M1L1j21K7N0j98J18M7j68
6035a08j34K82j01l8K94j62j31J08J15j13J00r6R2No1Ok24J87o5k7P7L5K1L7m
6060I5k31K0L97l01L4n2P6J16j40J42j79O9j01J54j09n9l2k13K82p9J43q4R6n
6084C9L4j59j4L4k4n2K23j90K34r2r8N3j22K46o7RR1k87J17J09o3K51l59R4M4
6109E1k16rJ59Q9j54K44N5j78P5r1M8j84R2m7R5L0Q3p0p9j06J89j24J41Om0j81
$$ plain form
5935 -162 9 -192 3 -49 -79 -70 -14 94 -39 142 150 -66 60 47 46 54 -104 153 -99 -195 123 5 -52 115 3
5960 3 71 152 -116 26 -2 -27 76 21 61 -132 146 -47 -29 139 -153 -117 24 -235 -25 -153 -36 49 130 -62
5984 -62 53 -89 67 139 -181 -114 143 192 -98 73 135 -20 105 116 146 -105 -54 -144 -157 86 68 -111 127 111
6008 111 48 51 73 55 134 -39 11 -48 -79 -68 -97 38 -58 -16 -15 178 -77 65 106 137 16 43 93 -105 13 60 -108
6035 -108 -242 40 -61 -99 195 33 -98 10 125 12 112 16 108 113 52 58 -166 21 -44 -71 6 41 62 99 95
6060 95 -136 -116 281 -20 14 -38 38 154 14 156 -23 46 -55 99 -10 -69 -101 -314 -32 -111 32 -52 44 39
6084 39 73 -86 -100 -66 -90 -142 81 -109 125 33 -65 -12 -134 112 45 54 145 -142 -25 84 21 272 -87 7 51
6109 51 -165 -174 -15 74 -80 164 219 41 116 25 73 -111 -19 -66 29 59 142 72 -7 -113 76 -48 93 99 59 -122
6135a22rN7J21l7k83M60l75K83j40p0J97r5N5q2M8O9l2k43K97j14J1M1o1R0k9
6160C7j5m6O3qM5n8K3j23P3pJ05k1j8p6j39N4K5M1j3K00n0j57L9K03j1r9nj28
6188f6L63k17k05K34k22J89J47j22k16J46m4l6m9J52np2o1J9n4R2j53J33J30n9
6212B4m1O8J67k95P6J34J5j39r5J67R0Ml96N12m04K94j40j69J2K59j40K6J12j93
6236e2l%jq1J11J66k53J42N3j60J73q9o2J29P2M9r8o3l5R9j58M15k02j80J7p6
6262h7J33J31k08q3O4O2j17J15m0P7K4PQ9k22J48j44K58j22L7j25p3J8j4k0M2
6287e0J8j2KJ0M4RJ10j16M7P7j95J01Q6j55N9R1j96K01l9j25M5j10O0Q3pq1K6
6314a7J07j4p9k1l2j31K35j9p3O6j9N7j70J29j11K1j01ML53j56N2j34q6j9J79
$$ plain form
6135 -122 -131 -74 47 10 -273 187 -188 95 -45 -115 82 -13 42 -40 8 77 45 -198 99 -15 -4 37 -24 66 37
6160 37 22 -24 39 31 76 18 41 -82 -9 -16 89 68 50 -26 -165 -111 -86 -45 -58 142 92 -65 -26 177 166 67 62 -66
6188 -66 297 80 -125 109 -113 76 223 101 -115 31 -13 -49 -98 54 49 -23 -84 -65 -119 -27 -180 -47 83 24
6212 24 -17 51 218 -77 -1 133 148 9 -86 81 171 175 -221 291 -113 181 41 -128 -116 143 3 29 141 -52
6236 -52 -55 -55 -56 -137 -26 140 -113 29 82 -78 95 6 -56 73 145 194 96 33 -2 97 -61 354 152 -28 -11 -87
6262 -87 46 177 -31 -114 -50 12 -105 10 -30 47 71 78 167 -55 93 -51 207 85 122 -3 -76 -58 -72 -92 -50
6287 -50 -32 -44 -42 -32 12 21 131 15 62 139 -56 45 131 -24 35 126 -70 131 92 -33 12 -98 -38 45 38 -43 -17
6314 -17 90 76 -3 -24 -56 -187 48 29 -44 22 3 60 -110 19 -92 -71 -172 -168 185 29 81 -53 -139 -158 21
6339B1j95J53L6o2J8j9K2N4l8j35L69k15J82m3r9q9J30K2k16J27RJ12k35J84p9
6364A4m7j13RL9K48j60J88j31j12j7p2J19K22k25J58k94j00L46n2j10Q4P7p4K4
6388B1p3J62l52K22o5J68j80J44j2n5j54J71n6J9J3j4K04k72J11k51L63J09j79
6411D4m5K02j96j7K08j92J02n9P7k94L6m7L65j03l64K47K13j39j20K19j57km0
6434f2j15Q8Q7J86l6k07p5K6K06k06J60k02J61J08J6j90L03r8j27j84mJ21J00
6457E6o4j35K46j09L4j7q4R5rp0J28k8K9r8o7qJ50q9J43J9m8P1nj39j30K89l27
6484a67J36k9O1l0j58Q2J07K4JRn5K59k09j80K19j42J52p4K4R7j11P2j88J13k5
6509a2m0l6K56r5k3j16L3o3K41k5l47K00m5k3L3OP8k35L03q6qJ03j5Mj42j0j13
$$ plain form
6339 21 -174 -21 15 -47 -29 -48 -26 28 -10 -145 224 9 191 148 49 -40 90 112 -104 23 32 144 -91 93 14
6364 14 -33 -146 -137 -98 150 -10 178 47 -65 -82 -154 -35 187 -38 120 -174 -274 72 20 -90 -6 71 -3 21
6388 21 -52 110 -242 -20 -85 83 -97 47 35 -20 -174 -3 -59 -40 -27 -41 163 -109 2 -249 114 223 44
6411 44 -1 201 5 -12 196 4 106 47 124 -170 -134 -181 184 81 -283 -36 177 38 -82 137 -20 -22 -62
6434 -62 -177 -89 -2 184 148 -59 -134 -108 98 -108 52 -150 11 119 135 -55 248 150 23 -161 -165 -44 56
6457 56 -8 -143 103 -6 28 11 -73 22 13 -57 71 43 72 -26 -93 -101 49 -40 103 122 74 145 140 1 -129 160 -167
6484 -167 -31 -60 1 -29 -187 -105 2 26 27 36 -19 240 31 -149 70 -72 80 6 30 127 16 88 -100 13 -12
6509 -12 -52 -88 168 73 50 -66 -33 -96 145 120 -227 -27 -72 -95 -62 -56 22 -213 90 4 -4 99 84 88 -54 -64 -177
6536a77K20M4j47J89j22k15J60J45j85j06M27m78L27j09N9R0k16L26K5k35j96
6557a74K72q7m2K3j46J10p0okK42k68rL38j13m5Lj29l0K54J24l27J33k5J5l8j82
6583a79J23j38M42k50J9l2M8K7q4J32j26N4Nm7P3j13J81k1j47J15j3k05L41k6
6607A79k55N4M1Jk07L81r7k2j19J23m6r8K3J72j24r7N0K19k48j0L5J23J92k93
6631b3L8J39j02l1P4q4pL4j30J18q0r3K43j19j58J68j30L51j49q4M5O4p0J68k14
6656c2p2K10L9m1on4l9R4n0n7j84O5QJ26n5n3Q8rjL7O9n5J01j85mj04K30o2k09
6685b05J62K01o6k7J87j73O1k45J52n8M0o8j83K95Q7k73N6L33j34j02j55M8M7
6708b0j68L09n6j03r2J46J60l9L3j8j49o0j62J85Rr1L56q0l97K27K2j03K28m4
$$ plain form
6536 -177 43 87 -60 129 7 -208 -48 97 -88 -194 233 -245 82 -27 32 122 -94 232 257 22 -174
6557 -174 98 11 -31 -8 -154 -44 -114 -120 -122 120 -148 -157 181 68 23 26 -103 -133 121 245 -82 51 26 41 3 -179
6583 -179 -56 -194 248 -2 17 -15 33 60 -24 108 -18 36 41 -6 67 -46 135 114 -33 82 69 -136 205 179
6607 179 -76 -22 19 20 -187 194 97 75 -44 79 33 -65 -42 130 6 -91 -41 178 -70 -80 -45 78 270 -23
6631 -23 15 154 52 21 95 11 4 38 -92 26 -54 -147 96 -23 -181 -13 -143 208 59 -25 20 84 14 182 -32
6656 -32 -104 106 145 104 98 44 5 99 49 -8 -192 -127 -119 7 -48 -101 -13 -22 -23 14 83 28 129 -56 -60 -164 66 4 -205
6685 -205 -43 158 92 65 252 79 140 -105 47 -11 29 -39 -222 73 160 -113 -57 276 142 40 -115 -67 -20
6708 -20 -188 121 65 -38 -130 16 176 137 170 152 3 -57 -219 -34 -25 -116 240 160 -237 -10 12 -91 137 93
6732I3j83Q9q5P5J52l58K10n4J04l78J24J05P3M8k2q5J85j20O2j28j13P3J10J33
6756A10j15j30K2R3K6o3K01k09L4R0j38J36j89M58k11k50J58N0M1j04j47j74K55
6779e6kk0L30k00p8J73k27k4J33k12R3J2N0J36m9L9Pj45l6J41k17K60p3M0J5k76
6805a86K03o1M4N3l6j26M1J35L2J4k42K2J09M4p9r3L2K66k79N2k45M73j59N6J4
6830H4p2M2Q3J34k00Q7k6n3l38L02j24O9l1R4M9k59K69Q6j6m09K96N2j10p1o9
6855a31K8q7K01J7L2j69K82j97k13J02K39j3j96L25j39k47L4J67J5n6k91K68J47
6878A18j03j3P%P2n3q7l3m0J06n9J60k05J43J2Kk25M91j31k49L4P7J32n6j7j90
6904a07J47l4N4N1j24n9P7J9j8K21m39K48l44K38j6J89J09j92J4j85P4N8P8j88
$$ plain form
6732 93 -90 -1 -86 -11 141 -217 -7 -61 43 -335 -211 -106 -33 15 -7 -92 93 -27 35 -93 -206 -133 -23 110
6756 110 -5 -135 -113 -20 6 -57 144 -65 -31 59 -79 57 -132 326 115 -135 23 73 114 10 -137 -311 -56
6779 -56 -58 -78 252 52 -26 147 -80 -104 29 -183 -90 -78 -28 108 59 98 105 -40 -76 65 -152 108 35 75 90 -186
6805 -186 17 -44 0 53 17 -109 -68 67 99 113 -129 -107 2 46 -33 -126 -94 172 -107 -55 -300 173 14 70 84
6830 84 12 54 137 271 71 158 132 79 -259 43 -81 -12 -43 51 100 -159 110 196 180 -229 67 119 9 -62 -131
6855 -131 -103 -190 11 28 60 -109 173 -24 -237 -135 104 91 -105 220 81 -166 -132 35 50 -6 -297 -29 118
6878 118 15 2 9 9 81 28 -59 -92 -132 -26 -85 75 -130 13 25 27 -198 293 162 -87 -53 24 156 100 83 -107
6904 -107 40 6 60 111 -13 -72 5 24 6 227 -212 36 -308 -70 -86 103 212 20 34 -151 -77 -19 59 -129
6928a29J01m0K81j76q5J35k5q3K9kJ41j86K13k32J40o3j0M1k1P4r6j10K84j60
6952B1M6j2Rj26N3N5j29L8ok08K05j2k9N2J7J73l6%j05K26j69k73K06O7rJ42j74
6979B2J12p7J68j39j76J49l9j36J97N9j21k9m2N0o8N2J19k57J53O3k41J92J06
7002A17j27O8L0J06j41k0n5j97Q6KO4j34K78m3k22O8J29j19L74j4m72L38j58K20
7026A78j43q6n0K6J17%j19l7K2o4JJ20j41J66m9j14oJ81k2q5m5J22L6K3r4n0j0
7053a23NO2Q4OLj04J25q1j51L65j63J81k0l91J88P4J41k26Kk8J3ml1L09l37J81
7079H0k72J58q9K09j38L1j07K75k42R4J56k17q4J34M8Q8j3q6j9J42m9M3q1k17
7103a56L9J59j56P9M2p5k7L6R3J05j54m0N0J62k76M1J02P8m6O4j16nJ94k30n8
$$ plain form
6928 -129 -28 -68 213 37 -48 87 62 -21 8 6 147 -39 174 -58 82 19 9 50 29 103 7 -103 181 21
6952 21 67 55 64 -62 -9 46 -83 -45 -51 -259 -54 -66 -95 -43 -26 147 111 111 6 232 63 -210 -4 63 54 196 22
6979 22 134 57 225 86 -90 59 20 -116 81 140 19 -10 -52 -2 -70 -18 101 -156 -3 60 -181 11 117
7002 117 -10 58 88 194 53 33 -22 -219 -133 -131 -67 -201 77 34 -188 -120 9 -110 264 250 -222 116 -42 178
7026 178 35 -51 -101 -75 42 42 -77 -114 -92 -156 -155 -35 -176 -10 -59 -173 -179 2 -20 -105 -150 -28 8 31 -63 -113 -123
7053 -123 -118 -56 28 34 37 -67 58 -23 -174 191 28 209 189 -202 -14 60 201 -25 -23 -51 -38 -42 -73 236 -101 80
7079 80 -192 -34 -123 86 -52 -21 -128 147 -95 -1 155 -62 -146 -12 36 124 111 25 6 148 99 142 61 -156
7103 -156 -117 42 -114 -35 7 -68 -95 -59 34 139 -15 -55 -5 157 -119 -78 24 102 56 120 4 -1 193 -37 -95
7128i5J53j53J1M3r9J47j07L5L43k36q5J15q1K44P7l21n2K06j51J47%j17m0K08
7152A92l29K14j20J74L1k17J22k03J01q4J86j22J12o7J55m4j35o2J06Q7L7k05
7174g1J4K7P7p5Jj56K5J11Q8J91r0k57Q4N8j0N2j54J35kj14r3K66N8k03Nk9k3
7201h5J28k7j7J13j68J28L3r2N3p1k8j49K50o5p9R0n0M5Q7M0j68J01l9J03k83
7226a50j7J57m4J56k56n5J26J79p3p2Q1j65j1L18k54n1J32Q6n8J66j77J4J42N0
7250B24l37j61K85j65K79r7J04j60J64p9M8q4P2k30L2K18k74K98j72kJ56q5j8
7273A6j97Q7K45l4j92jQJ85J8p4j50P8j42P2L7Kj67J74O5j7j70J94Jj14j59K29
7299fk6N3p2K1rO3q4K4J06K3j07k07J09J7K80r7j75O4J20J1l1j27R8p8J11K2j02
$$ plain form
7128 -95 58 -95 -84 -41 -140 7 -100 -65 278 42 -43 72 -9 235 312 -9 -61 145 -6 141 141 24 -16 192
7152 192 -137 77 -43 131 162 -55 67 -136 -35 -119 67 -55 57 -10 145 101 -34 -96 10 97 134 -71
7174 -71 -57 -30 47 -28 -27 -183 -158 -47 41 232 142 -115 -31 27 17 69 -85 50 48 -66 -159 107 165 -38 -33 -62 -85
7201 -85 43 16 -1 112 -56 72 105 13 66 -5 -33 -182 68 3 -76 14 -36 9 96 136 -32 69 30 133 -150
7226 -150 -167 -10 -54 102 -154 -209 -83 96 23 -49 32 -133 -144 174 -80 -131 1 87 29 195 18 32 174 224
7250 224 -113 -274 11 -154 125 28 132 -28 136 57 105 21 93 -137 -105 113 -161 137 -35 -37 119 34 16
7273 16 -181 -94 151 117 -75 -76 -68 117 135 61 -89 -11 -153 -81 -44 -42 -209 -35 30 13 -157 37 38 -76 -235 -6
7299 -6 -32 21 -51 -30 -39 24 -60 -36 70 93 -14 -221 -112 -95 185 88 -87 -23 97 108 77 -50 48 -30 81 103 1
7326AL2m5l4L8J5oJ5o0J90o7o2k2j47L40k76%LJ83j28N8K3k18K72r3Mk0k6J24
7354I4j05j42Q4J23j42J09l5RL3M6j37J41q4J17J09k32j4Q0pp7rr7K02K7k9L9
7380A03j22J26o6j51J3m0J39J04N3k14L9Q3L2k9k4r9R0j12J69J49l48P9%L7J6
7405B7O9j13O6j24K47k64M8q5J90rp5L7NM6m6n4k9L1K17j42l9j90J76o3P%J95
7432A28j0j84R3j81J20k15K86k22O7m9Q5J0L11k31J62j33m6j07MJ12o0K6J71k39
7456a02L9J03R3m7N2k14J0P2j57K2k3N6J36k6J2j48j49J96J2J1J24J26k72J16
7480D2K7N8j95MM5p8P2K60m82M36k8j37L0J3p3j47J87k29J59p5L2l2p3K38m0k16
7506b02J94J77j11j41J72j03O2m6l0J16q1j95K64q0o3j04J94j19J97j60J28K9
$$ plain form
7326 1 33 -12 -46 -8 7 1 16 -44 146 79 17 -5 -152 188 -88 -88 -85 98 -30 28 51 -167 105 12 16 -4 -30 94
7354 94 -11 -153 -69 54 -88 21 -14 -5 28 74 -63 78 -6 111 220 -12 -26 54 47 -30 -39 -136 66 93 64 103
7380 103 -19 107 41 -110 -97 -137 2 106 159 -55 -16 67 99 70 46 -53 37 -75 94 243 -105 -26 -26 11 27
7405 27 96 -17 49 -75 172 -92 -44 -129 61 52 -23 14 19 65 19 -35 -64 -33 184 42 3 -187 -11 -74 -67 -67 128
7432 128 118 -66 27 -154 -34 -249 37 -185 -118 -167 -82 -72 239 8 170 37 -9 -116 -112 0 -60 -34 137 -102
7456 -102 -63 40 133 86 138 -76 -66 6 -151 -129 -152 -96 40 14 26 -122 -271 -75 -63 -52 72 198 -74 42
7480 42 69 127 -68 -64 -19 -97 -25 235 -247 189 161 24 54 67 -6 -153 34 -195 -36 -111 -79 -111 -184 54 14 -202
7506 -202 -8 169 58 -83 89 -14 48 2 -28 88 7 -188 76 -4 -67 -171 23 -96 101 -59 69 98
7528I8l9q1O7r3P7k07L23N5l18J81M0l3j34J66l1P7k37K02j96K3PJ09j42M8J55
7553A17No0j31Q9L4p7J4n4K6j39J82j1J50q2L5j92K00J2J0pj56R6j00L04m05K20
7579H0k14J03N1K7n5o9P1n1J76l96K65P3k37K59j66L9J06K9l90K24J10N3K0Rk26
7604a09R4M9K9o0J22l03K86j99K03j29O6l39L15O2o4q2%K23kj97j96M30l34N9
7628g6J71k7j44J91j85J35J8J50k27p9m9K30q0k9j45M46L3n02R2O5J0o3J17o6
7652a4j72L77m11J69q0K56P7j01r8j65q5J83J06j29J26p1K50j81j26K07M7l63
7674a98K11j28J58m0J44k42J41n4q2q8q7K35K60k34L8r5q8J85j08q2P8J28O5j42
7698b5m2J73J34k2k93J44O9j24j51P1J71m1Q8k40R2r6l0NJ59k3J02j05j16K3r8
$$ plain form
7528 98 59 -22 45 -48 29 -178 145 200 -118 63 103 70 -64 102 71 148 -89 113 -83 -60 -53 56 -86 -38 117
7553 117 122 62 -69 20 54 -23 -9 -63 -37 -176 6 -5 145 63 98 -94 106 118 128 121 -35 61 -39 265 -140 80
7579 80 -134 -31 20 47 -8 -77 -6 -57 119 -277 -12 61 -176 83 -83 -44 62 91 -299 -75 35 88 108 117 -109
7604 -109 -15 34 63 3 125 -178 108 -91 112 -17 49 -290 25 87 23 -59 -59 164 162 -35 -231 199 -135 -76
7628 -76 95 68 -76 115 -70 65 83 233 6 -73 -122 108 28 -1 -146 300 333 -169 -77 -12 -2 -65 52 -14
7652 -14 -186 191 -220 -51 -131 125 202 101 3 -162 -247 -64 42 -87 39 -32 218 37 -89 118 165 -198
7674 -198 13 -115 43 3 147 -95 46 -8 -90 -178 -265 -30 230 -4 34 -61 -149 36 -72 -154 -76 52 117 -25
7698 -25 -67 106 240 218 -75 69 138 14 -137 -66 105 64 152 -88 4 -92 -122 -117 42 19 121 16 -100 -77 -175
7723a75P8L64k72K4j70J2J03J24l7j56R4O6K5K1l9J5m0J37j53j03J79o4k3j54
7747a44K84m21J12J27J75k79J08j41j1K98r6J27k23L8j84K73j18J09Lj41q8K76
7769H4Q4r6J4N7m23L13O4j93q8J13J87j39o0K08j09J22K6j86K2k00K86l9j57J70
7793F0k70J10Q6J03j32O8m1l6%J96l03K35k09J08P7l47M38j62o8R6j76M2J13j5
7817b7M9J39j17K43l27Q5K9M5m5n0R6k07M4K63j9k30O5J77k71MJ4r3K25jj08R5
7843G8p4J05k80K86j61l5L4O4J13k00J35r4J77k75K13j28lJ50k15P0J27o3j94
7866a70J04%QN2K23j21j77RN3r0J58p5j65nJ22J51o1J06m7l6k45K74K1j38J63
7891A14j61j60K38P3p0m8m8j00K36K8j70M9j12K3R3P2P8k22l7L5Q7K41j25j39
$$ plain form
7723 -175 -97 267 -5 19 -151 -139 -36 88 51 -105 -11 55 80 101 62 77 37 174 21 -82 97 33 10 -144
7747 -144 140 -281 -169 -42 133 -146 -38 -179 -190 108 12 139 -84 -46 -230 43 -75 34 37 -104 -192 84
7769 84 168 72 86 143 -280 33 97 -96 -184 -71 116 -23 -83 125 16 138 164 -22 0 -200 86 47 -110 60
7793 60 -210 -100 -14 89 -43 25 -16 -52 -52 144 -159 76 -133 -25 52 -295 143 -19 -87 9 -167 -125 -12 -27
7817 -27 22 161 44 287 -40 45 74 119 74 24 120 -87 -43 220 201 -29 36 213 -58 -54 -40 -133 92 91 -17 78
7843 78 4 109 -171 115 -46 -81 -47 17 130 -70 65 -29 148 -127 86 -42 -45 105 -110 -40 87 24 -170
7866 -170 -66 -66 -58 -6 217 96 -81 -72 -19 -109 49 -26 -191 -196 -74 77 16 122 75 39 -206 68 89 -49 114
7891 114 -47 -207 31 104 34 -14 -62 -162 74 102 -68 -19 -131 -108 -15 57 135 -87 -124 -89 -2 239 114 -25
7915b5l8MJ14j44J12k4J63j03Q5j48j1j0J00k54K3J89K4N1l3O6j63l6M4l6R6k84
7941b38L20m1j43M0J07j15J38J05q9j10J61r3J03L1l18J23n8J50j41j01K00k9
7963BQ7J3N7j43k1o2K59k52M1q0J87o0k47M4PQ6J79j16%K18j39L5j70J50k6p9
7989c0J49k30jJ2J45k2R9k05K30r3k12P6J08J25k16j97L75k69L09k37K6P6J8j50
8013a14j13K79j71J34p7J44j47j40N3J93j02M8Q2J01j86N3p7J92k12J14j97J06
8035c7j1o5o4J12J0J90j40jj15k0J70k30K46l6n2P8j86N7J9J83j67p8K57n0M0
8060A10r7n1J41p3K4n0j3M4M8k5q3l7K91k38K68m38J36K27l23K70j56KN8NK33
8085B73j24j38j31P3n0o7R9J65j25k9N0P7j01n0R0m4o3Q1j17J47M9r1o6J9q3L60
$$ plain form
7915 -25 -63 -59 55 -89 23 -1 162 59 144 -4 -15 -25 75 -179 -156 33 57 108 75 141 -22 -58 -14 -50 46 -238
7941 -238 82 41 -102 -62 45 -70 68 173 84 -26 135 42 145 176 -142 -19 -77 73 -68 -169 31 2
7963 2 89 102 159 16 -5 -67 192 -60 -19 -99 88 28 -219 -175 -168 -82 97 -19 -19 199 60 95 -75 75 49 -30
7989 -30 119 -111 -112 -100 45 23 122 -83 147 54 -158 -82 26 151 -65 -262 113 -156 153 -84 -58 18 36 -114
8013 -114 -227 52 -119 15 -62 82 -65 -205 -152 41 -61 -13 69 170 -16 37 -40 152 -60 54 -143 -37
8035 -37 -48 -113 -177 -65 -55 135 -5 -6 -121 -141 29 -201 45 9 -43 35 -151 -94 -75 108 -59 -137 120 70 110
8060 110 13 -38 103 30 54 4 -9 35 83 58 -25 -62 229 -9 259 -179 -43 184 -139 131 -25 -23 35 40 273
8085 273 149 11 -120 -47 -97 -164 -65 100 -25 -54 -4 73 -28 -78 12 -32 -95 -14 -131 16 65 -26 -92 -73 -156 204
8111B04j94l3J31%O6j43j29J17kj30K12J0j08M2j55K03P8k08M1N3J4j08K48j09
8135A00j40K32j88J93k22j6J38r2J9n2n4J51n2R0n3j59K46j68j7o7J75k07M1o1
8159a63N5k2J21l4J91p5k11J01K90k58N8Q0j11Nn0jm5J82k45O3p5O7K4J4o7LK05
8186A02J61k47nl9L2
$$ plain form
8111 204 10 -23 108 108 174 31 -98 19 17 -113 99 109 1 43 -112 91 169 -39 2 55 69 -39 209 100
8135 100 -40 192 4 197 -25 -41 97 5 24 -28 -82 69 17 107 54 -105 141 -27 -44 -111 64 -143 -102 -163
8159 -163 -108 -130 -9 -43 148 73 -138 -37 253 -5 53 133 22 27 -23 -24 -69 113 -132 -69 -144 -77 -53 -39 -106 -103 102
8186 102 263 16 11 -28 4
8191D
$$ Imaginary data points
##PAGE= N=2
##DATA TABLE= (X++(I..I)), XYDATA
0@%%%%%%%%%%%%%%%%%oJ4j6J6j6J6j7K5l2L2l8M6n0N8o6P4q5R5j07J22j36J50
39G9j66J85k07K29k53K79l08L41l75M13m54M99n52O09o73P45q25R18j026J151
59F09j299J478j699J984k361K881l655M912p278J3139m9645o7867J76145l358
73F3986j09738Q3125N4776r8830K2204N8320q2886k5886O8457m3666m8073N9987
85A776K51n2771M7329K8773o1788J3428O3192m5895l6198P1935K717p6139L7388
98f002N9214o4723k1894P7108j6057n3582N0887J5372o2757K1083L0502o4005
110c4854m147N2910m2537k4023O7254j0825m3231O1895K0439o3025L1805M9901
122F1562o2479j6808O2943k9832n4224M5040J1674n6232J4892L6259l4941o483
$$ plain form
0 0 0 0 0 0 0 0 0 0 0 0 0 0 0 0 0 0 0 -6 8 -8 8 -8 8 -9 16 -16 16 -22 24 -26 32 -34 40 -45 50 -57 65 -71 79
39 79 -87 98 -109 120 -133 146 -162 179 -196 217 -237 262 -290 319 -354 391 -434 484 -542 609
59 609 -690 788 -911 1073 -1288 1593 -2062 2850 -4428 8711 -40934 -108801 67344 63986
73 63986 -45752 37373 92149 -6681 15523 73843 -9043 -34929 33528 -10138 -58211 1776
85 1776 2027 -50744 -3415 25358 -36430 -23002 40190 -5705 -41903 30032 32749 -43390 -6002
98 -6002 53212 -11511 -33405 43703 27646 -25936 24951 40323 -22434 -1351 29151 -34854
110 -34854 -39001 13909 -28628 -52651 14603 3778 -39453 22442 42881 -20144 11661 61562
122 61562 -917 -17725 45218 15386 -38838 6202 17876 -38356 -23464 12795 -22146 -28629
134b8629M3615j4281k3900L7554N104l7295K1284K4624l9161p4M2723k6772k8421
147b3629M7050J182n1284K7341L3045n0636o135M9074k8291l3398M4963J121m4574
160c4171K7023K4744l8721R186L6969k8336q160M1114j7304l0157L7029M193m6117
173b2708J7658K9693l9496r408M1938j5568l0022L4139J2287l6007J2097K8884
185B3487k6285r936K9365j1641k1527K4301Q88k7686J8081J6696l0794M719L1423
198B1091k4332j6881L6436n357l4172K5365J8499l5898M044L2505k2185j4849
210a5734L0671n295k4459K1519P956k6728R878J7495k4274k218K5411j7058j6236
223a9072K8773o73k9865J9164K0628k9695k453L0924j4929k0082K6880K685k7689
$$ plain form
134 -28629 14986 705 -23195 14359 19463 -17832 3452 28076 -11085 -11159 31564 4792 -23629
147 -23629 23421 24603 -26681 660 33705 -16931 -23066 26008 -2283 -35681 9282 10403 -34171
160 -34171 -7148 17596 -21125 -11939 25030 -3306 -11466 29648 12344 -17813 19216 23409 -22708
173 -22708 -5050 24643 -14853 -24261 17677 2109 -27913 6226 18513 -17494 -5397 23487
185 23487 -2798 -12734 16631 4990 -16537 7764 8652 -19034 -953 15743 -15051 -10332 21091
198 21091 -3241 -20122 16314 10957 -23215 2150 20649 -15249 -11205 21300 -885 -15734
210 -15734 14937 9642 -14817 6702 14658 -12070 -2192 15303 -8971 -11189 14222 -2836 -19072
223 -19072 9701 9028 -20837 -1673 18955 -10740 -13193 17731 2802 -17280 9600 12285 -15404
236a5404J5098J7142k6276kK5474j6445j3395K5582m093k2989K0699R389k8758
249a3978Q973K3681k4790r547L0540r733k5297K4511R426k9636Q379K3754k2789
262f506q221K7291q395k0259K1847O595k4162J0573J7226k1014k346K2624j3798
275A455j4364K3335j586k5031J6916J4730k7210Q85K6171j6351j5731K5531l20
288H430k3850J5276J3617k3264J622K1745j4915j0505K1701m104j8055J7257N828
301A0783k2393R242J7236k1502m627K5560j0379j9709K2366O714k5691Q854J9350
314A5804k0220o454K3073q958j6662J8455K929k0272J0236J2428j9364N89J9850
327A1434j3885j0878K2525k875k0520J6532J1959k3272K921K2560j5398j2830
$$ plain form
236 -15404 -306 16836 -9440 -9442 16032 -413 -13808 11774 7681 -15308 5391 14780 -13978
249 -13978 -5005 18676 -6114 -15661 14879 5146 -20151 4360 13786 -15850 -7471 16283 -6506
262 -6506 -14727 12564 4169 -16090 5757 12352 -11810 -1237 15989 -5025 -7371 15253 1455
275 1455 -12909 10426 8840 -16191 725 15455 -11755 -10870 15301 -1050 -16781 8750 8430
288 8430 -15420 -144 13473 -9791 -8169 13576 -1339 -11844 9857 5753 -12302 4955 10783
301 10783 -11610 -2368 14868 -6634 -11261 14299 3920 -15789 6577 13291 -12400 -3546 15804
314 15804 -4416 -10870 12203 3245 -13417 5038 7967 -12305 -2069 10359 -9005 -8416 11434
327 11434 -2451 -13329 9196 6321 -14199 2333 14292 -8980 -6059 16501 1103 -11727
339a1727K2549j580k1209J3233J0199k0171K325J6959j4397p257J9190n570j5804
352a3260J6104N878j9792P373J5827j7216m612K1510q234j6188J8406M795k0832
365a0241P698J5456j6775m240J8219p883j3347J6143K182j6994R218J0397j5616
378e783M46J5735j0937q829J6338k103j5586J1891P874j7068K406J5344j2593
391b865p434J6956l118j4844J2757P211j5919L879J3829j1516n104J5393n188
404D037j1716J2945K478j5289O762R992j4797j125J5259r652j0089J5936N85j6300
418a0974R585J0529j5294q39J5617q506r329J4076O44j2898Q699P245j2878K149
432b174J1640j0726n358J4302m932j2324J1876N091j5397M304J2794j1919n325
$$ plain form
339 -11727 10822 9242 -11967 1266 11465 -8706 -6381 10578 -3819 -11076 8114 2544 -13260
352 -13260 2844 8722 -11070 -3697 12130 -5086 -9698 11812 3578 -12610 5796 10591 -10241
365 -10241 -2543 12913 -3862 -8102 10117 2234 -11113 5030 7212 -9782 -564 9833 -5783
378 -5783 -5337 10398 -539 -9368 6970 4867 -10719 1172 9046 -8022 -5616 9728 -2865
391 -2865 -10299 6657 3539 -11305 1452 8663 -7256 -3377 10452 -1064 -6168 9225 4037
404 4037 -7679 5266 7744 -7545 -783 9209 -5588 -6713 8546 -1106 -11195 4741 5326 -10974
418 -10974 -1389 9140 -6154 -6993 8624 118 -9211 4865 5509 -7389 1310 8555 -4323 -2174
432 -2174 9466 -1260 -6618 7684 2752 -9572 2304 7395 -8002 -3698 9096 -2823 -8148
445h148J5265l851j2094J1374M556j3820M135J0138j0716l156J2111n910p677
458g793J1720Q6j2083Q447P892j3259Q22J3081q624p426J3271q70j2143Q356O344
473G821j2668J522J0889q704n534J1612k891r686Q955L391j1651M063R003j0422
487d300k136J2418n163q679J1533K466j2296N806R245j1009j829J1890o178q342
501f574J1181M35j2314P054P317j2107P9J1790p563o603J1780j443j0941Q777
515H68N320j2678K947J0688r265m764J2667l033j0351R983M403j2426L478J0358
529H195r488m216J1533l354r157Q842L190j0564L852P682r095j769J0077m926
543H02p731J0008J154j1386O052P428j1097l98J1332o037p542J1163O60j0855
$$ plain form
445 -8148 7117 3266 -8828 2546 7102 -6718 -2583 7555 -3161 -6317 5794 -116 -7793
458 -7793 3927 4013 -8070 377 8269 -4990 -4168 8913 289 -7137 6134 5264 -6879 1477 7821
473 7821 -4847 -3325 7564 -1140 -6674 4938 2047 -7639 1316 4707 -6944 -2881 6122 -4300
487 -4300 -6436 5982 819 -7860 3673 6139 -6157 -351 8894 -2115 -3944 7946 1768 -6574
501 -6574 4607 5042 -7272 -218 7099 -5008 -4929 6861 -702 -7305 4475 3032 -7909 868
515 868 6188 -6490 -3543 7145 -2120 -6884 5783 2750 -7601 2382 6785 -5641 -2163 8195
529 8195 -1293 -5509 6024 2670 -6487 2355 5545 -5019 -1167 6515 -2580 -4349 5728 802
543 802 -6929 3079 4233 -7153 -1101 6327 -4770 -5168 6164 127 -7415 3748 4408 -6447
557f447O577O389j0213J035R313p012m333J0083k521q531Q302K536j0733M158
571a397Q377r720k677J0941m160q428Q789K746j0138L613P556q236k149R055l570
586F02o460Q423R77q834N354O131r263q1R824n807o399R938L01j0360O199O256
602F801j0408J19R548o844n498R906j379r134O972M063r321K160P809p103k726
617e035R479k800p138P598K518q524L070O863o992k189Q163l203o427P179J575
632D137q499L319N968p257j654Q134l557n819P261J037q123M544N168p501l92
647c234P789n074m231Q014j317o875O023L087q281K487O951o590k615Q210k341
662B003o280O351K051p148K517M977n813j012N965l397m340N760K00o470L666
$$ plain form
557 -6447 130 6519 -3694 -2659 6654 -358 -4691 5392 2871 -5660 2642 5178 -5555 -1397
571 -1397 6980 -2740 -5417 5524 1364 -7064 1725 4471 -5667 -2054 5502 -2734 -4883 4172 602
586 602 -5858 2565 3542 -5292 62 6193 -3070 -3151 6673 866 -5533 4405 4706 -5654 545 6801
602 6801 -3607 -3488 6060 -784 -6282 3624 2245 -6889 83 4146 -5175 -3015 4794 -2309 -5035
617 -5035 4444 1644 -5494 2104 4622 -3902 -832 6031 -961 -3150 5013 1810 -4617 2562 4137
632 4137 -4362 -1043 4925 -2332 -3986 4148 591 -5228 2033 3070 -5053 -509 4659 -2842 -3234
647 -3234 4555 -519 -4750 3264 1947 -4928 1095 4182 -4099 -1612 5339 -1251 -3866 4344 2003
662 2003 -4277 2074 4125 -3023 -506 4471 -1342 -2354 3611 214 -4126 1634 1834 -4636 -970
677i70M417o736l25P083l911m550P273Q40p520M486M927p209K9P507m551l932
693c142O867j239o151N016K663p738K182O015o479k278P764k792o023O374J930
708B969p072K723N308n860j274O553k591m426N368J106n808K830L860n346k97
723a957N601l408l482N818J06o353L757L986o122j16O286m180l637O136q47n787
739d199M637K502o456J553N586n470j662O432k382m810N958J240o031K873M265
754D036n388n87N936k982l923N688j99n584L305L350n798NN397l636l746N908
770A782l17n638M075K951n713K90N776l765k787N962r80n076M437K333o091J886
786h75N151m808k277O487k154n276N496J827o492K007M594m956j511N540k213
$$ plain form
677 -970 3447 -3289 -3614 3469 -442 -4992 2281 3121 -4399 87 5014 -2195 -2166 5341 790 -3142
693 -3142 3725 2486 -3665 1351 4014 -3724 -1542 4473 -2006 -4284 3480 688 -5335 1039 2969
708 2969 -4103 -1380 3928 -1932 -3206 3347 756 -3670 1698 2804 -3004 -174 3686 -1660 -1957
723 -1957 3644 236 -3246 2572 2678 -3675 82 4068 -2054 -2170 4116 -64 -3701 2435 1588 -4199
739 -4199 438 2940 -3516 -1963 3623 -1847 -3509 2923 541 -4269 1689 2929 -3102 -229 4036
754 4036 -1352 -1939 3997 1015 -2908 2780 2581 -3003 302 3652 -2146 -2141 3256 -380 -4126 1782
770 1782 1465 -4173 -98 2853 -2860 -2570 3206 -559 -3346 2616 1636 -3440 997 3330 -2761 -875
786 -875 4276 -532 -2809 3678 1524 -3752 1744 3571 -2921 -914 3680 -1276 -2787 2753 540
801E40m254N055N87n393K837L336n047N0N154l260l024N421ln431L296L737n341
818a740K06M962k737l188M877k47m365L056K060m842J008M172m375j415M805j782
834D55m173M179J681n435K070L945m292j421N605j955l942M490J002m687K624
849A46K827m175j16M524l107k643N095n61m854L218K710m809K70M343l133k436
865b701M567q78m204L093K322m994J088M166l276j922M891j457l803L953J610
880B455m867J920L806m039j233M824j600l566L823P82m074J625K813m060k66L988
896B331k465k819M287Q9m459K299L006m353L27L803k413k139M083m45l638K903
912C97J972l936R96L415k931j541M164j538l375L693R53m216J469L070l543q40
$$ plain form
801 540 -3714 1341 1928 -3465 -628 2708 -2339 -2289 2865 -395 -3419 2002 1999 -3432 -136 3601 -1740
818 -1740 -1534 3428 691 -2497 2380 2133 -2232 824 2884 -1958 -950 3222 -1153 -2568 2237 455
834 455 -3718 461 2142 -3293 -1223 2722 -1570 -2991 2614 659 -3283 1207 2209 -2478 146
849 146 2973 -1202 -1318 3206 99 -2544 2551 1990 -2864 354 3064 -1745 -1475 2868 -265 -2701
865 -2701 1866 988 -3216 -123 2199 -2795 -1707 2459 -817 -2739 2152 695 -3108 845 2455
880 2455 -2412 -492 3314 -725 -1958 2866 1266 -2300 1523 2305 -1769 -144 2669 -1391 -1657 2331
896 2331 -134 -2953 1334 1423 -3036 -737 2269 -2084 -1757 2046 -367 -2506 1577 1132 -2506 397
912 397 2369 -1567 -571 2844 -87 -1628 2536 998 -2377 1316 2269 -1947 -478 2592 -951 -1791
928a791L894j889k897L392O15l842K109K089l577J77L771k314k374M260m42l721
944b540K856K319m248O36L977k926j900M003p32l702L113J384l881Q97L109l155
960g90j282L774j499l012L441R39m245J821L084l343j016M023j429k890L308J035
976A919l877J780K666l251m20L632k100k277L541J63l897K395K256l708l50L758
992B230k419k233L875n99l351K676J258l351Q12K783k561j065L402j150k505L191
1008I93M66l320J663K626k914p91L366j349k333K787L40l168J754J942l160j06
1024a204L093k141j945L332l33l531K602J912l748M39L514k571j750M029p25l355
1040b382K861J513l573J247K877k902r08L583j549k718L188N81l870J900K665
$$ plain form
928 -1791 2103 214 -2683 709 1324 -2518 -409 1680 -1897 -1720 2051 -263 -2637 1623 1181 -2540
944 -2540 316 2635 -1613 -977 3000 74 -1826 2177 1445 -2257 856 2240 -1641 -744 2365 -790
960 -790 -2072 1702 203 -2809 632 1571 -2674 -853 2231 -1112 -2128 1895 466 -2424 884 1919
976 1919 -1958 -178 2488 -763 -1183 2449 349 -1928 1613 1776 -2121 274 2530 -1178 -1528 2230
992 2230 -189 -2422 1453 854 -2497 179 1437 -1914 -1102 1681 -880 -1945 1457 307 -2198 993
1008 993 1459 -1861 -198 2428 -486 -1277 2089 740 -1593 1194 1534 -1634 120 2062 -1098 -1204
1024 -1204 1889 -252 -2197 1135 802 -2729 -127 1785 -1963 -1524 1990 -581 -2331 1698 973 -2382
1040 -2382 479 1992 -1581 -334 2543 -359 -1267 2316 767 -1951 1237 1818 -2052 -152 2513
1055B513l333j052L797j423k852K932O61l199J240K387l057k45L183j786j727
1070a961K950J4k850J753K314l261N1L382k119j807L198k00l101J933J551k969
1086a122K87K678k138j228K977j046k486K526P98l161J152K198k490p41L243j287
1102A60j869K394N70k697J196K276k680KK583j600j513K424O3k817J865J519l074
1119a198J58K765j778j746K844l67k748J805J581k922M57K798k323j171L261q89
1135E27k401K701P64l074J219K207k377q00L018r64k391K537N40k767J206J899
1151A844k521m30K527j347j722K336N9k682J743J186k191QK538j365j641K440
1167G82p6k521K067J268k325J85K521k030q19K461o72j947J993N67k631P40K098
$$ plain form
1055 2513 -820 -1872 1925 502 -2350 582 1243 -1956 -716 1671 -1386 -1631 1552 -234 -1961
1070 -1961 989 1003 -1847 -94 2220 -1041 -990 2392 273 -1534 1664 1464 -1637 296 1847 -1122
1086 -1122 -835 1843 -295 -1523 1454 408 -2078 448 1246 -1915 -763 1435 -1055 -1796 1447 160
1102 160 -1709 685 1255 -1442 -246 2030 -650 -648 1935 335 -1178 1246 1309 -1508 357 1876 -1198
1119 -1198 -1040 1725 -53 -1799 1045 678 -2070 -265 1316 -1606 -1149 1649 -674 -1845 1416 527
1135 527 -1874 827 1591 -1483 -264 1943 -434 -1234 1784 820 -1571 966 1506 -1261 -55 1844
1151 1844 -677 -1107 1420 73 -1649 687 746 -1936 -193 993 -1198 -1190 1348 -17 -1658 782
1167 782 706 -1815 252 1520 -805 -620 1901 -129 -948 1513 841 -1106 887 1454 -1177 -437 1661
1184A661k232p76K699j193j821K224J89k321J160J279j901l49K457j195j318K205
1200G68N7k358J747J037k123M26K314k057r98K596l24k343J693J077k274M15J674
1217A327j498j197K563r14j865K111M36k631Q81K097k358m82K820j210k010K676
1233G46M19k497J219J580k085l82K754j377j454K230rk259J403J236k444K86J979
1250A345j491j447K277R2k426J335J550k485K50K189j550j083K287o26j579J627
1266B65P26k066R14J944k069p96K580j075j588J816P27k332Q33J471j826j49J642
1283A017j173j046J854k62j868J324J051k104K19K265j630r33K164l18j725J409
1299B44J001k265O81J730j339j096K304o39j583J726N49k252R63J463k021n01
$$ plain form
1184 1661 -571 -1347 1352 159 -1662 562 751 -1570 -410 869 -1032 -1381 1076 -119 -1437 768
1200 768 825 -1533 214 1251 -872 -446 1868 -189 -1187 1409 1085 -1258 435 1512 -762 -347 1327
1217 1327 -171 -1368 1195 281 -1584 527 963 -1668 -787 1310 -1048 -1530 1290 80 -1930 746
1233 746 1165 -1332 -113 1467 -618 -1000 1754 377 -1077 1153 1144 -1115 288 1524 -920 -634 1345
1250 1345 -146 -1593 684 776 -1650 -315 1235 -1250 -1000 1189 -361 -1444 843 217 -1362 265
1266 265 991 -1075 -161 1783 -286 -1082 1498 423 -1165 651 1378 -954 -121 1350 -476 -625 1017
1283 1017 -156 -1202 652 390 -1478 -154 897 -1207 -988 1277 -353 -1286 878 560 -1165 244
1299 244 1245 -1020 -339 1391 52 -1044 1260 621 -962 764 1313 -939 24 1487 -534 -1035
1315a035K097o33k014J999M83k296O26J810j742o10K330r63j302J921J45k121
1331a305J372J237j902k4K201j345j235K169l92j793J369R77k087K76J779j184
1347A13j158J646j31j732J137Q13j638K61J389j480l85J912m77j536J583O74k077
1364a086R91J138j261m05J707o06j385J573N53k135J188R25j958N9J776j226r99
1381a151K074m58j836J236R56j892L67J703j062j177K047l00j667J210Q73j702
1397g79N90J579j818j24J724n44j438J385N37j969Q49J384j843n12J905q66j105
1414a045J206M66j658O85J074j412j10J462q43q11J455L5j615J038J203j751K90
1431c31J647r01j060J523k29j249J003N37j445N69Q84r72o62J503o67j348J308
$$ plain form
1315 -1035 1062 429 -1585 414 897 -1399 -773 1037 -705 -1315 1015 52 -1250 671 816 -1305
1331 -1305 67 1304 -598 -622 1579 234 -1001 1168 776 -1017 352 1329 -758 -482 1297 113
1347 113 -1045 601 470 -1262 -125 688 -950 -689 700 -780 -1165 747 270 -1266 317 991 -1086
1364 -1086 -95 1043 -218 -623 1084 478 -907 666 1219 -916 272 1197 -761 -702 1074 -152 -1151
1381 -1151 923 465 -1371 -135 821 -1071 -704 999 -63 -1240 807 507 -1160 50 923 -779
1397 -779 -189 1390 -428 -552 1172 628 -810 575 1112 -857 -8 1376 -467 -979 926 60 -1045
1414 -1045 161 627 -1031 -346 728 -684 -794 668 -175 -986 469 504 -1111 -73 1130 -621 -331
1431 -331 1316 415 -645 878 649 -600 403 940 -505 64 948 -24 -686 817 150 -1198 110
1448A10L90j641M64J473j209m41J434m70j205J348K60j370Q49R94j256l16J519
1465I33q69n98J217nj628J252O49j674L04J250q47r32J583k89j270P38Q51j539
1483h74N65J003j020o51J610n09j279J679J99j541N35J552j769j33J884j019j034
1500h02J350L22j421O22Q90j293K1J144p99p46J280M7j732Q94R17j447n1J560
1518G56j115n09J316j59j237Q86Q50j412L02J205r10k45J113k72j290J260M61
1535A000j584O23Q43j116j85J111l58j456J192L16j118L95O69p74j04J269p63
1552d0r77J341J76j248Q77O36j245K16J179q75n80J191j64j064Q51M84j082L05
1570a9Q29q22n40J242n11j183J116M45j520O12J111j018k72J228o85q62J063M02
$$ plain form
1448 110 500 -1141 -677 796 -413 -854 580 110 -1095 253 513 -857 -8 986 -270 -586 933
1465 933 64 -534 683 678 -950 302 951 -723 -419 831 -16 -948 635 346 -924 -186 665 -874
1483 -874 -309 694 -326 -977 633 124 -1155 524 723 -818 -283 1269 -500 -633 1251 232 -802
1500 -802 548 870 -551 71 961 -332 -311 833 34 -712 568 615 -1117 -223 694 -753 -804 756
1518 756 -359 -868 448 289 -948 -62 788 -624 -322 883 -27 -272 841 569 -721 539 1000
1535 1000 -584 39 882 -234 -419 692 334 -1122 70 386 -732 -337 332 -442 -546 723 -40
1552 -40 -1017 324 500 -748 129 765 -480 -264 915 40 -540 651 487 -577 274 758 -324 -19
1570 -19 810 -12 -552 690 179 -1004 112 557 -963 -351 760 -258 -530 698 13 -849 214 616
1588F16j288N00R15r43j19R92m88j015J321K88j230O54O66j047j97J212r29o57
1606g49J066J62j216N51P91j233K64R29r37l75R90n3j206J169K56r23L27R29q70
1625a28j78J102l87q79Q58L21j057M89M17q60l1Q79o57n20R94k04j058Q94N24
1644E19j170K37Q41o35n69J046K27j061M80N16j028N11Q39q74j20Q10j61r25Q81
1663C64M42j224M89O10r37j43Q95k81r03Q23K60r81J66P98j034J2J201p06o46
1682g95R96Lq16P14M77r25R7J086p93n18J095r3j045Q48N84r48l29R42o14k85
1702c19O01j94n23J35O39j040J45J026p56k77P45j45r51R80K59p45L86Q47p86
1721B7k65R50j91o55N29n1p62N49K56o13q3R31o52k56N38j84p81O17L70q38K26
$$ plain form
1588 616 -672 -172 743 -200 -319 673 185 -830 491 779 -451 203 869 -178 -375 837 -92 -749
1606 -749 317 479 -737 -186 605 -628 -364 565 -372 -747 243 190 -1016 153 409 -514 -187 742 -128
1625 -128 -306 796 409 -470 388 709 -348 141 558 -302 -333 546 -111 -631 363 159 -899 -5 519
1644 519 -651 -414 427 -208 -777 269 496 -565 -85 431 -597 -86 753 -121 -241 569 408 -517 364
1663 364 806 -418 71 681 -256 -399 496 215 -688 135 395 -586 -420 378 -656 -644 557 -149 -795
1682 -795 201 204 -612 102 579 -346 -249 837 44 -474 621 528 -517 331 915 -33 -362 580 -34 -319
1702 -319 282 88 -435 -300 339 -701 -556 470 -286 -563 182 37 -914 66 325 -420 -34 813 27
1721 27 -238 712 521 -134 395 344 -418 131 387 -226 -309 622 -30 -286 252 68 -713 -96 274 -564 -338
1742c38P56n77n31Q40n2o54Q74m2q42M37N77p17j62Q11k11n88O38N33j194O32
1762A90M62r08p9O99l43n20P86j59p25M80N16p49j91R46o49l13P59N8r26P18M00
1783D52p21j34P30m06j86N98J63r41P49K01p36J52N12n34j60Q38n47p23O32M19
1803C58n43pL83l27l22P44k40o37O86J90p75O17M15j003L60N89n55l25O90J77
1823D75p90L81N79o94j12M75o02k14O17n4p08O42K97r09M20N60o56k01Q96l12
1843I0o61M84L79p83K91P97p70O7M68j30n05N57J24p30M79M53p16O2O83o32k65
1864b58N33o8n80L68K76m80K6M76l93l59P23l51k52J63M70l07m5O96q07k19P53
1885C65k06l52L55L23o91K39K85k20l80O35k41n32O14m3p44L19O20n45j30N80
$$ plain form
1742 -338 418 -159 -690 150 98 -556 318 276 -566 -129 448 -269 -431 380 169 -419 219 752 -442 190
1762 190 652 -256 -335 364 21 -499 287 128 -597 -117 399 -350 -541 405 -244 -557 202 260 -666 52 452
1783 452 -269 -403 327 -79 -265 333 496 -445 304 505 -231 -79 433 -101 -261 577 30 -693 -61 358
1803 358 -185 -192 191 -136 -458 286 46 -591 95 285 -490 127 542 -461 -101 488 -67 -392 298 475
1823 475 -315 66 645 -49 -161 314 -288 -502 115 61 -647 -5 292 -617 -197 363 -293 -494 402 90
1843 90 -571 -87 292 -491 -200 597 -173 -106 362 232 -273 284 408 -322 157 610 -106 -44 639 7 -258
1864 -258 275 207 -373 -5 271 -209 -183 293 -100 -459 264 -87 -339 -176 294 -13 -58 638 -169 -388 365
1885 365 159 -193 162 485 -206 33 318 98 -282 353 112 -420 194 151 -593 -274 346 -199 -329 251
1905B51l91m43Q07j18m18K93J96l69J07M60l02k02M95j14o13O08J03l75J7M51
1925D43n37l19R16n19l81O82Q6p46M91K68o09k35Q10n19l04N43M6n58K65O26n44
1946i5j60Q26n39l07N94k1q63O24M17m68n5M90l32l89M96j12m18L10K23o85K79
1967a85M54l35l23O43l16k07K41J52k61k0O45o46L7M42o9l55N33k35j45j97N25
1988C78m48P4K12k62k3K08mp05M89J42j84n6N44n48j13O81k20n65K36N75n94K49
2010F6K21l52k75O75k9n18L95J36n39Q3N19m35L9J73k1m71L42J86n60J99M64o08
2032c10M4M36j05m97N15J43p02L70L80m79P4M61k83k95M93Rk85J34P3j67k1M89
2054D77m51l13L52R2n07O10oo45L21K22n66J45M26J66o55L15J52m85K20M32l99
$$ plain form
1905 251 -140 -583 224 106 -312 -19 177 -192 -85 375 73 -129 366 252 -361 247 350 -25 -8 443
1925 443 -94 -413 503 -16 -397 285 371 -375 116 384 -225 -460 350 -169 -473 70 116 -442 -177 449 -95
1946 -95 -255 571 32 -275 319 298 -565 59 476 8 -47 443 111 -278 218 106 -312 -2 221 -464 -185
1967 -185 269 -66 -389 254 -62 -269 -28 124 -137 -157 488 -158 -121 321 252 -103 430 195 50 -147 378
1988 378 -70 4 216 -46 -69 139 135 -570 -81 61 -123 -179 365 -183 -296 385 165 -400 -164 411 -183 66
2010 66 287 -65 -340 335 306 -212 183 319 -220 -137 382 -53 -14 159 138 -333 9 195 -365 -166 298 -310
2032 -310 -266 170 65 -432 83 226 -476 -106 274 -205 -131 330 47 -248 245 254 -31 103 176 9 -12 477
2054 477 26 -287 65 157 -350 260 254 -391 -70 152 -414 -269 157 323 -332 -17 135 -350 -130 302 -97
2075i7j14M99k90j73L05M2k93K10K55l47K55Nl30n8L59k26k76L57j21l40J07K43
2097b8j21l3M09k27k77M33N7n90L28L35k24j94N34j85m49M41p9k55J22K90j40
2118A47m21O85m51j28M96j24m99K33K48j90l91N87m43o6M54j22j02R5J11l34R1
2139a24M04k44o6M41l17j06Q1K24n24K71K62m22k9M56m10QJ29R3j61j72K77k87
2161b16J18P0m2k54L23J11k30J42K46j97k02J36Kj41J84K31m13L46j5l01J60L20
2183C78n10L8J27k7k25L98j54n57L05J97o5j54M55k82j88K56p3n3N9L77m66N2
2205a12L86k74j33K54K28m23L18j18l00O5N09k48m29J64K46m24K38J84m09K61
2225a7J04j38k40M52k24l96N34J01m27J78M28k89j36J20K0j09J27K71l83J45R8
$$ plain form
2075 -97 -211 288 -2 -175 130 172 -121 89 344 -3 252 257 -73 -131 228 2 -274 83 -38 -378 -271 -28
2097 -28 -149 -182 227 0 -277 156 213 -377 -49 286 62 -132 402 217 -232 209 130 -125 -3 287 147
2118 147 -274 411 -40 -168 328 204 -295 -62 186 -4 -395 192 -251 -317 137 15 -87 8 119 -215 -124
2139 -124 280 36 -30 411 94 -12 69 293 -231 40 302 -120 -149 307 -103 -95 34 127 -34 -206 71 -216
2161 -216 -98 -28 -70 -324 -1 110 -120 22 268 71 -131 5 7 -134 50 281 -132 214 199 -102 58 378
2183 378 -132 -94 33 6 -219 179 25 -532 -227 -30 -95 -249 206 -76 -264 -8 -81 -134 -75 302 -164 -112
2205 -112 274 0 -133 121 349 -74 244 126 -174 -109 400 152 -277 -113 133 -291 -53 131 -278 -17
2225 -17 87 -51 -291 161 -63 -459 75 176 -251 -73 355 66 -70 50 70 -39 88 359 -24 121 219
2246B19l11K63J26k59j11K12N7m82M28j41k80J7L07k74j66M25o0l10K65J41j35
2267f9j14K92k47k6L78n9l39L11J73m24J27J08j38Q6M0q3m07L30J99k90Q0J56
2289H4j07l92N00j33l4j18J8k01L38J50j68%K47m6%P1j22k6J49J03l83J09J72
2312B11m57J62K03J22l65K47k9k43J69J04k41l5K42pk43J71K14l66Q2j8P0J31
2334A24K50m19j18L79K2j15k7M0l59J17M29l67j51K42O7l80M05M3l40J4K96k52
2356a00j05L23p6k49L48J8k99K26J34j51j03L26k75j8J85n2k22J89j0j22p2L84
2378B79j61k08J63K9k39M7K37l15O4L50l94p5M86l15k84K18K00j46o3L55r8k19
2400h9J30Lj82L14j02n9L5K8N4j17J73k29p5J38J98m97K99J87l43m5J66p2R7m9
$$ plain form
2246 219 -92 171 297 38 -73 139 196 -286 142 1 -279 -262 45 -229 -395 30 -30 -340 -75 66 -69
2267 -69 -183 109 -138 -164 214 155 -184 127 300 -124 3 111 -27 59 99 16 -391 -61 138 -152 -72 84
2289 84 -23 -415 85 -48 -82 -200 -182 -383 -45 105 -63 -63 184 138 138 209 87 61 210 313 -70 39 211
2312 211 -246 -84 119 241 -124 123 94 -149 20 124 -117 -152 90 83 -160 11 225 -141 -59 -77 -7 124
2334 124 374 -45 -163 216 238 123 96 136 -223 -106 323 -44 -195 47 114 -266 139 182 -158 -144 152 -100
2356 -100 -205 118 42 -207 141 159 -140 86 220 69 -34 292 17 -1 184 132 -90 99 89 -33 -105 279
2378 279 118 -90 73 102 -137 -90 147 -168 -104 246 -148 -223 263 -52 -336 -118 82 -64 -127 228 130 -89
2400 -89 41 44 -138 176 74 15 50 78 132 15 188 -41 -116 22 220 -277 22 209 -134 -179 -13 -85 12 -37
2424c7o2j12J3K09J4q5K1p4p0M74l8j61J61j55q1j12Q6J40q7j7j58j17K95j03
2448e6j26N0J05n5j65N24k58k66K63L8k35K28J0M4j26l5N3j14Q5N0j40J86R3k87
2472a34K03K27m85n7O11l16k88K15J85l10L9J03j19O4L62k71j41J83j28j87J49
2493i5J25k7K8J49j68q2K00O3n5j9J70l73o4P6N2l9j7K89m43J30O4o9N8P6j34
2518a05K5P8j18P8l0K40k80r4M01k48n5J55K1n2M5K07k27o3K04l28K15p0q0k1
2542a02L27n0j73njJ18j8n1n2k97K64N7m5m4K64k82J59J00n42K42J74J9o6J39
2566A35r8k86L68J41l28k48M64M3k27j52L7K9J35J98l19Q2J93l48OK15R3j50p1
2589h8Q8J05k98J93J32k02K1K22j47J23Ll18K54Q0Kk81M31j72l07L50k09j1j19
$$ plain form
2424 -37 -99 -211 -198 11 25 -60 -39 -113 -183 291 253 92 253 98 17 -95 -9 131 44 27 -131 -248 47 -56
2448 -56 -182 -132 -27 -82 -247 277 19 -247 16 54 -181 47 57 101 -25 -60 -7 -121 -36 14 -126 60 153 -134
2472 -134 69 296 -189 -246 365 49 -239 -24 161 -149 -110 -7 -126 -62 300 29 -112 71 -57 -244 -95
2493 -95 30 3 31 180 12 -70 130 193 138 119 289 -84 -148 -72 -20 -59 -76 213 -230 -100 -36 -105 -47 29 -105
2518 -105 -80 -2 -120 -42 -72 168 -112 -206 195 -53 -108 47 68 16 61 268 41 -22 182 -146 69 -1 -81 -102
2542 -102 225 175 2 -3 -4 114 96 45 -7 -304 -40 17 -28 -72 192 -90 69 169 -373 -131 43 62 -4 135
2566 135 37 -249 119 260 -68 -316 148 191 -36 -188 -151 -122 13 211 -108 -26 167 -181 -175 40 133 -17 -88
2589 -88 0 105 -193 0 132 -70 -49 173 26 149 152 -166 88 168 170 -111 320 148 -159 191 -18 -29 -148
2612a48J34Q5k58J07O7On3K0q9J95j2P2p3J01mj18RR7k15J99o2m5j69L72l3l74
2638a89K28J84k38Oj28P5P5J56k77k9L11j74r0J05%p8J57k11R4N9p1P7R8j48L12
2663C04k91j8j25Q4J4P1n6k23K03K86m19l0J88N6p5N5j09r8K14j52j84L35o7l4
2687g1p7M32k54j38L48m02J05j8J81j51m3L45k14k10K69P4k10J8M9KK11j27k30
2710a11L8J3K09l88K09k7j65K42j25q2J85L1o6P7m1J89J3j09p1j63J54M8j23q8
2734a51N4J20j12R7M7q6O9K32n09R5P4L7J07j07J93l53O1L04k19J39l6p5m1J46
2758H6n6K3R7oj68j19L17j66R7j23J11j33r9Q7Q8p1K03k86k45K11K95l05O7J37
2782D2k53J71K74j52j27lK66l71J64K10k25m3K44k02r5J23j09o6J12nM0p6K20
$$ plain form
2612 -148 -14 71 -187 -80 -13 -7 -60 -40 -129 66 54 126 53 154 150 32 41 138 -77 122 60 15 -154 218 185 -189
2638 -189 39 223 -15 -9 -137 -62 13 169 -108 -137 174 0 -90 15 15 -63 94 -117 -23 36 -35 42 140 -8 304
2663 304 13 -5 -130 -46 -32 39 -17 -240 -37 249 -170 -200 -12 44 -31 24 -85 -183 31 -121 -305 30 -37 -71
2687 -71 -148 284 30 -108 240 -162 -57 -75 106 -45 -88 257 43 -167 102 176 -34 -16 33 35 246 119 -111
2710 -111 -73 -60 149 -239 -30 -57 -222 20 -105 -187 -2 29 -37 40 -1 188 201 92 21 -142 12 60 -63 -151
2734 -151 -97 23 -89 8 55 -31 38 270 -239 -144 -70 -33 74 -33 160 -193 -132 172 -47 92 56 -19 -60 86
2758 86 30 53 150 144 -24 -143 174 8 105 -18 93 -40 -139 -52 36 -35 168 -118 -363 -152 143 -162 -95 42
2782 42 -211 -40 234 82 -45 -48 218 -153 11 221 -4 -47 197 -5 -100 23 -86 -152 -40 -45 -5 -81 139
2805A39k45j85M20rk47J2K91m65L32k00Q7R1r3J24N6j32K59k82K52k04M1J3J81
2828B36j35j5Q3qj86j2J55l19R4K41k53M1K32N6l92K89j77p8J54N9r9j24K01k72
2852b29J0J37K21J10l01J31j34j04L01k98J34J2M3j82O8J89k05j2J66q4j87K39
2874B5M6Jr8P6Jj66K56j83J5n0Q6k0J2O7q1k2J81j8k17K92j42r1m5j4K08k66J34
2901a3K83k10J08l24r8J73Q2q9J40l2n1j01J56j34j29M59j06o0l8J06o4J33k25
2924c4j55K21k2J10n5k16R2O0k08J53Q0m9K14m31J28p9L33k81nJ73q7j33K43j22
2948g0r3J13K24j75Jl0k4l9J52o9r3J52J09j56j55J85o9r3K71j73j22J81Oj69
2972a36J65k2Q5k2P4j62m5R1j05k4J12j7k7P4J90k47O3M8P0k70j4K50k62J70k7
$$ plain form
2805 139 -106 -291 129 120 -127 -115 176 -289 43 -157 -70 21 -72 52 108 -24 235 -47 205 1 42 55 236
2828 236 101 86 169 161 -25 -37 118 -201 -107 134 -119 -78 154 210 -182 107 -70 -148 6 65 -34 -158 43 -229
2852 -229 -219 -82 139 249 -52 79 -55 -159 142 -156 -22 -10 33 -149 -81 108 -97 -109 57 -27 -214 25
2874 25 71 72 -26 50 51 -115 141 -42 -27 -77 9 -11 1 68 -13 -35 146 128 -89 203 61 -30 -75 -89 119 -147 -13
2901 -13 270 60 168 -156 -254 -81 1 -88 52 20 -31 -132 24 -110 -239 220 114 54 16 122 58 191 -34
2924 -34 -189 32 10 120 65 -151 -59 1 -207 -54 26 -23 191 -240 -112 -191 142 -139 -144 29 -58 -191 52 -70
2948 -70 -163 -50 174 -1 0 -30 -54 -93 59 -10 -103 49 158 2 -153 32 -37 -130 141 -32 -154 27 33 -136
2972 -136 29 7 92 70 144 -18 -63 28 -77 -101 11 -6 -33 41 231 -16 47 95 165 -105 -119 131 -131 39 12
2997A2k85L25n7j16J75j50J6MK9J00j0k19L06k52O2K11k72N9j5K11oj33J43Jk51
3022a12L62k29r1R0j28nJ72J7j07k27J29R9j48J67J42j93J52j62J51j07p4J12
3044A0J06k16L53k39k7J49j51o7O9J7l0J78l79M41j76o5J79q9N2k98k06L50m8
3067h7j41L79j24n3J2L1qj01J66k93r2M22k34K26j22J19K42m69J86J39l76J95
3089A7K6j49MK34Kk50M36n16K9L13k75R2m3J72j71Q6j36K04j94J17P3l9J4jk2
3114B3N7%npL8p1r7J33L6n7j63J53J35k02R1J10k98K18k25J96r5J2K7N4j9J11
3140A55j18J06m6j55qJ98j39o0J28j49J93k3j97K7N6M5j38K9m4Q7J9J28oj18n0
3165h0J22j7j23K48k02Q7q5j36J61K08k32K94p5k56J31m1J48k41L7K93k49JK0
$$ plain form
2997 12 -273 52 -5 -121 54 -96 -80 -76 -47 53 43 -176 130 -122 -60 151 -121 -62 -77 134 128 -5 138 139 -112
3022 -112 250 21 -70 20 -108 -113 59 76 -31 -258 -129 -30 -178 -11 131 -62 90 -72 79 -28 -102 10
3044 10 116 -100 253 14 -13 136 -15 -82 -13 4 -26 152 -227 214 38 -27 152 63 115 -183 -389 -39 -87
3067 -87 -228 151 27 -26 -14 17 9 -92 74 -219 -311 111 -123 103 -19 100 342 -127 59 198 -178 17
3089 17 43 -106 -102 132 134 -116 320 -196 -167 146 -129 -37 -80 92 -79 7 -129 75 -119 -2 71 32 46 45 23
3114 23 80 80 75 68 106 35 -62 71 107 50 -113 40 175 -27 64 174 -124 94 -131 65 -30 -18 9 63 44 155
3140 155 37 143 97 -58 -66 132 -7 -67 61 -88 105 82 -115 -88 -32 13 -125 -96 -140 -53 -34 94 88 -30 -80
3165 -80 42 25 -98 150 -52 35 -50 -186 -25 183 -49 245 170 -86 45 4 152 -89 -52 241 -8 -7 13
3188A3Q3k53J92N9j44J3J99r8r9r0J87l34K76j17J61M7l8p9j64L45q5p3K38k77
3212c8J58j09M1r6J42k33K9K26J7j14j2j87J50k25K58J4J11j90o2J28j89J30m4
3235i5N4J35j58K8J36M6k12Lj06J88l1LRJ76k94J10LJ62j14J5r9L0l4l7J51j60
3261i1p3J05j2J77j32LJ91j82Q6q9j01K05j89K32k99J92q0J27J8r5p1o6J41M07
3285D04m43j47L09j08j06L11j67j06l1l4K29j77j5j14J37O8J00k38R9J73k73R4
3307c5j28J18M9Q0M3j22l0K7j33J13K4O7NK45l73J3K0%k54R3K31r5n9J56m6k37
3333b28K32J08J16j20L8k25L50k29O3k1l0N8j36L1N9M0R6l6j60o9J44J25k46J0
3357c0K26j07j42o5nL0J57k94M3K38p5J0P5Q2j60P9L2P0j86Q1q9O9n5J63j76j94
$$ plain form
3188 13 96 -157 35 94 -50 -37 162 64 -35 -125 62 -272 4 -113 48 95 57 -22 -186 159 74 1 239 -38
3212 -38 120 11 52 -44 98 -135 -106 120 137 23 11 -176 -26 -251 7 21 132 -58 -120 8 -181 -51 -95
3235 -95 -41 94 -64 -36 100 146 -66 -63 -169 19 -12 -9 0 176 -118 -8 -5 157 43 58 -41 -11 -45 -82 69 -91
3261 -91 -164 -59 -71 106 -26 -23 168 -14 72 -17 -118 87 -102 130 -169 23 -57 70 88 -7 -78 -144 -3 404
3285 404 -39 -186 123 15 -91 220 53 -53 -84 -118 111 -66 -81 -195 -58 10 110 -128 -29 144 -129 -35
3307 -35 -163 -45 4 84 127 5 -25 2 -131 -18 6 73 78 323 -50 -37 -17 -17 -271 -178 53 -42 -101 55 9 -228
3333 -228 4 112 228 108 146 -79 271 42 105 84 54 112 -24 7 66 106 202 166 6 -63 81 206 -40 -30
3357 -30 196 89 -53 -118 -123 -93 64 -230 -187 51 -24 -14 61 143 -17 62 94 164 -22 59 -30 39 -16 147 -29 -223
3383b23K08J53j40n4K02j76m3k0q0K8K52j7p5M1j39J80O7k02k11J39K92l96Q4
3406a30Q4P3j63J93m6j76K11k68Q8K71o4r3J51r4m9j15L08k20O1L0j66L6K92k09
3430EN1N0n4k81L7J07k8K79l48J30L76l67J65j07j70L4N1Mn0l4J66j24QK81j54
3455B7n3J39p0j03j38J12J93m0N6k03R2o2J59j72J53j71l0J58o7j00N2K35k65
3478i8J5O8J15l80L56L1Q2j36j68r0J45l9l6J10j34K34k48J82M2L7k0o9k4J63
3502A38k1k45K43j33J93p2k88J22J68j56J75k11K7J79j67Q9L1p4%N1j17j7l8P8
3526d5N9j00J00l1m6J52j76QJK04n7k70K59J8K1p3p2M4l4K3m0J74kk37J36KjJ29
3554A46n6rj2Kj6nj82J99q5L5J0K74k89j19J70Jp9K42n4j94O3N0k20K35j09l5
$$ plain form
3383 -223 -15 138 -2 -56 146 -30 -73 -93 -173 -145 107 90 15 56 -83 97 164 -38 -249 -110 182 -214 -130
3406 -130 -46 27 -136 57 11 -165 46 -222 -134 137 73 -20 131 37 -12 -127 181 -39 22 52 -114 -78 214 5
3430 5 56 106 52 -229 -192 -85 -113 166 -182 -52 324 -43 122 15 -155 -121 -70 -66 -116 -150 16 -108 -100 181 27
3455 27 -26 113 43 -60 -198 -86 107 67 123 -80 12 -50 109 -63 90 -81 -111 47 -20 -120 -68 167 -98
3478 -98 -83 -15 100 -280 76 107 189 53 -115 -205 -60 -99 -135 -25 -159 75 -173 9 51 88 68 -1 -25 138
3502 138 117 -128 115 -18 175 103 -185 -63 105 -51 124 -87 -60 119 -48 41 72 -2 -2 49 -68 -85 -123 -45
3526 -45 14 -86 14 -17 -63 89 -87 -79 -78 126 69 -201 58 76 97 24 -48 -4 -38 -15 -55 119 117 -120 16 18 17 146
3554 146 90 81 69 71 55 50 -132 67 -18 17 27 301 12 -107 63 64 -15 227 173 -21 42 92 -128 107 -2 -37
3580c7p0M7K35k24q6R9R7j36Kj05J0K45k9j3j24J17q8P8J9m2N5k2j22J57N4o1
3606E6j31L6J92j29j39O7P1p6k5J62k23L0J33j23N7r9P1j84K28O2J7J52k34N7
3630B8j6P9m2q8J94j88j07J26k0J94j12K3k22J26L5M7n7k04J82n3L12j39p3l0
3654eM9J15j73L8j11K43o6j48R1k0J63k12j37J50J46p1k44L02k31P6l9J44MN3
3678A17k67J39N2n9Q8j88J24oJ46j16M5j77L00Jj98r4j7O8m9K03L2k08K70j98
3702Hk4j9J97j02r7J21j11N9jM8k2j16L5Nn6%R7qj93J60j2J78p9n1L0J17j36n
3730B3L0R6j59p8K08n4m8p7M3j17J58J9o5J19j49j15J73lr6j16L56J10l45J85
3754I8R7k25M1j10K65j05l1po3J43j82J83r2r0K4K89k08j62K2Q2O0P6q8j76J68
$$ plain form
3580 -37 -107 -60 175 -49 -135 -36 61 -75 -73 -178 -168 77 48 35 -89 28 -60 18 37 -5 50 28 -94 63 117 56
3606 56 -75 -39 153 24 -115 -48 23 -53 -78 84 -139 -109 24 -99 -42 -141 -70 -254 -26 36 53 205 -29 28
3630 28 12 91 49 -39 155 -33 -140 -14 -34 160 48 71 -151 -25 10 57 0 -204 -22 -75 237 98 25 -5
3654 -5 44 159 -14 24 -87 156 90 -58 33 13 176 -36 -173 -23 123 52 -192 110 -121 -45 -84 60 64 117
3678 117 -150 -11 41 -18 70 -118 6 0 146 30 75 -102 198 199 1 -93 -110 -42 -91 112 144 -64 206 8
3702 8 -16 -35 162 60 -37 84 -27 32 31 79 57 -59 -24 -19 -75 -75 22 14 -179 -19 -31 147 68 17 47 164 28 23
3730 23 53 149 -10 -88 120 66 18 -59 -16 -133 25 44 -21 98 -51 -166 7 4 -92 -208 148 258 -87 98
3754 98 195 -30 11 -99 166 61 30 23 -40 103 -79 104 12 -78 -54 235 27 -135 -113 -31 29 105 17 -159 9
3779IN9j38L1J20j73M0O1J1j27J16P9j63K22k42K53K9j80J07m5MR4l57K18l0O1
3804E9j24J36J1j03O8q8Q1j00P6R2l16J96o0J80j26j23M09m67J45kn7J93M2k2
3828A00k29J35J09l19K48M0M4K2o5j78j4K89k73Q5j06M4J41K8j72J69l8J60j25
3851I5M6m7M7p1l28M56j57n7J06l4K7j14J84k49J24n4J20o3n9J34j52l9K35j84
3875c4l2O8q0J12N8j97K91j12j72K07q2j20J88m7o8K12k76m4J51J36k74L45k31
3898aJ07l04N9J81lm0j16K84j66P5j50R6j30N5n7J98k6j43J13m5J02P5k43P5j9
3923b3k42L09K5J48l49L0P2N7k42M17j52J5n1L2l30K21L7j49Q4j3K43j55N4N8
3947I6o3j24J73k76J84K68j56L9M1l10P8L3Q6j11K6R2j5J56l68L9j35J56L72j67
$$ plain form
3779 9 68 -70 -39 81 -92 -52 9 20 -107 9 88 -75 147 -95 158 187 7 114 69 73 167 -190 28 -2 59
3804 59 -65 71 82 -21 47 -41 40 -60 16 108 -208 -12 -72 108 -18 -141 268 -199 -54 -56 -113 80 122 100
3828 100 -129 6 115 -204 44 84 128 150 85 -93 -107 182 -91 -6 -112 -68 73 101 -71 98 60 220 95
3851 95 141 94 141 70 -258 198 41 -16 90 56 83 -31 153 -96 28 -26 94 31 -28 106 -46 -85 150 -34
3875 -34 -66 2 -78 34 92 -105 186 74 -98 109 27 -93 95 48 -20 192 -84 -128 23 159 -115 230 -1
3898 -1 106 -198 -139 42 39 -1 -117 167 1 76 -74 22 -108 -53 -110 88 62 -81 32 -13 89 164 -79 -4 -23
3923 -23 -265 44 69 217 -132 -102 -30 27 -215 202 50 65 14 46 -284 -63 -26 -175 -91 -104 139 -16 38 96
3947 96 33 -91 82 -194 -10 258 102 141 182 -128 -50 -17 69 -42 -16 76 61 217 -151 -112 -247 -91 281 114
3971A14j23o1K01j85k4J11r1J71j10P0j50J7J22Q3O9l88J77op0L2J74j76R0K3
3995G0L6n5j37Q2k9j56K29j08m5J68r0J48k4mp5j62J67K6k48M55l90K26O9j90
4019c7P0n0J03k27K20M0k19M7J96R6l68j0R2j20J14R6J00L8k76K04l53L44l0K3
4043I3P8k46l3J21j03K30j07M0o7p8J07k39L27k89J93K4q6K17n8NOm5L4mm9j95
4069a24L71l86J04K4j39K62n8o5K8j43k0J29J15k4k27J17j3R1j58N5qj4L2J56
4093A05j34o1J94j65K45q8O6j74J16n1l7R0j76J16k49L49k62Q0j1Q2j04K6j01
4116a44L55j16l6k31J63K0J9n3J4J57j57J7j31J58j61J21k21K86k01J69k67L38
4138I9o0k9k35K02K7j3k0K04k38J18J57k08N2p8J21J7j88K96l22j6K26K4o7p1
$$ plain form
3971 114 -9 -70 131 -54 -78 33 -58 113 3 73 -77 -60 62 145 214 -174 3 -3 -73 -41 133 -43 47 70
3995 70 106 51 -86 -4 -33 -189 40 -68 -113 55 -35 113 89 85 10 -152 15 41 -207 248 -142 84 153 -37
4019 -37 33 -17 86 -141 79 119 -100 -53 143 239 -129 -139 -47 -167 -53 43 143 181 -95 109 -244 100 70 93
4043 93 171 -75 -108 13 -90 140 33 73 6 -72 35 -204 123 -166 27 51 -35 182 124 129 135 90 124 120 71 -124
4069 -124 247 -139 -35 -11 -150 112 54 -11 17 -126 -146 -17 98 74 -153 -36 -49 42 -116 -61 -69 -83 -51 105
4093 105 -29 -90 104 -61 184 96 162 -12 104 53 16 106 -70 46 -203 146 -116 -36 -47 35 -69 -43 -144
4116 -144 211 95 59 -172 -9 11 30 -23 -9 148 -9 8 -123 35 -126 -5 -226 60 -141 28 -239 99
4138 99 39 10 -225 -23 4 -9 -29 175 -63 55 212 4 56 -22 99 116 -72 224 -98 -114 112 136 69 -2
4162brk1o8K19k16J70k03R6J32j62m1pL02j48k9m0K29k53j59L31j32j5q2j95K41
4187f2K6k9J19j48P8Q2j02KJ95m5n0p4oj23L39j67p8M1Q5p7j51J80L4L3N7k49
4213i0K20n8j61J08k03J17j6n8J26rl3L9pj92J69J23j00J13j70P3J05j22J12Q4
4237A70k19l4K32p7M8J1n1r1j1O6l2N9J25k80o8L90j97J41k55P0O8j78Q2P1k6
4262A4pn7J2l6O8lp1j8j89K45p4K28j27M9j57L2o2K06o4K35n7j06N4m2N8j65l4
4289f8p1J88m6m5j4rK26j10k8J63o8m7j27K0J26k02j98J77K01M9k44J12l5K43
4313A93l22O8J18j54K66k22J04J06k92K05j5r0J32Oj82K07l11K35j12R1j18J52
4335F5j44J54P5j09p6kj7L8R8k5j82nO9qP2Q8k24O7J56j62L1L0Q8k13j7K33L1
$$ plain form
4162 -2 -11 -32 -100 119 -97 73 -130 -34 98 -64 -105 -112 190 42 13 -27 202 -51 -210 121 -11 -26 -108 -303 -62
4187 -62 -36 -65 54 -94 -16 66 -36 -34 161 116 66 -8 -14 -137 202 35 -43 -2 83 6 -145 35 69 102 159 -90
4213 -90 130 72 -89 19 -184 -67 -83 -141 -15 -24 -57 -18 -25 -217 -48 75 -25 88 -82 -9 96 -26 86 170
4237 170 -49 -83 149 72 120 131 80 -11 -22 44 12 71 196 -84 -152 238 41 182 -73 -3 65 -113 -31 40 14
4262 14 7 -50 -38 -74 -6 -9 -80 -98 -287 -42 -116 112 -15 34 -123 -91 -153 53 -11 224 167 61 115 73 131 -34 -68
4289 -68 -139 49 3 -42 -56 -65 161 51 23 186 118 71 -56 -36 90 -112 -310 -133 68 117 -127 -15 -50 193
4313 193 -129 -61 57 -97 169 -53 51 157 -135 70 55 -35 97 103 -79 128 -183 52 -60 31 -87 65
4335 65 -79 75 150 41 -35 -37 -54 -16 82 57 -125 -130 -61 -69 3 91 -133 -66 90 -72 -41 -11 77 -136 -153 80 111
4362A11k08J27j35P3n8K02j19J18J34j60p7L9q5J95j93Q9J90k15j75J61oRN7j15
4386d1O4j58J05J04r0q0J53k11J85j34j9L9R6j91J0J32J38J03l79K83j76LK56
4409A92l51L6J86j12J65K5k23J13o0l9O8o9m2J46r1J12P4j80K02k62K96l87R2
4432a09NJ22j16K15j18k4l2J05j67J8N8J35n7j74J45k6J83j27L23l68oj54J62
4455gj33P4L2j13J24j87K21q5j12r6J61K96k81R5K21r8j7j77n7J71Q5k07K10j32
4479a2j88K55j04Q9j19j63J92J65m9L2m3K2j96L5OJ24p5o2j5J45q9N5JR4k17K66
4505A49l8M5j54l5J7Q7j47m1J52j29J35q3J23k4L0P5l0k41J59j07j38K62M5n3
4529E9J20k05O2n3J84j29L0J30k82K27j69LNOj9J38k70J52R6k40J16J77j03m2
$$ plain form
4362 111 -97 30 -105 -32 -90 112 -7 111 245 85 8 47 -38 157 -36 53 243 28 -147 14 8 17 74 -41
4386 -41 23 -135 -30 74 -16 -96 57 -154 31 -103 -122 -83 13 -178 -168 -36 102 205 -174 109 -67 -64 192
4409 192 -159 -123 63 -49 116 141 -82 31 -29 -68 0 -69 -111 35 -56 56 130 -50 152 -110 186 -201 -109
4432 -109 -104 18 -98 117 -1 -25 -57 48 -119 -101 -43 92 35 -139 6 -20 163 36 359 -9 -15 -169 -7
4455 -7 -140 -66 -34 -147 -23 -210 11 -74 -186 -282 -121 175 -106 -11 210 112 95 -82 -139 32 117 -90 120 -12
4479 -12 -200 55 -49 40 -79 -242 -50 115 66 98 55 77 -119 -84 -78 46 -29 -91 -106 39 -50 5 6 100 -117 149
4505 149 111 156 2 -33 -16 71 -76 -117 35 -94 41 -42 81 57 87 162 132 -109 50 -57 -195 67 112 59
4529 59 179 -26 36 -17 167 38 68 198 -84 143 -26 -23 -18 -12 -31 107 -163 -11 85 -155 -39 138 35 -7
4553gJ04l22N3J86j4k64L87j29N2j12O2P0l18K65j10K6p8K83k20L1K4M6M1q9L0
4578cj80K16j86L12j0j45n4j23P5j09K78k32K08M6n9j3j17j0N2R2L5J67j42J09
4602B07j52j59K7R6j7J41o8k55K27p6j3J1J29k09k8J92j03j17R6k7L06k52j44
4625a88J93K1L0J0j73K10j19l8J75L8m6n2P8J0j27m5P8q0J79k63R5J0r8R1K91
4650B80j74K2j77kN8l8O1j14K86j01M1r1r1O3j2J50L3o2j39pj67L30m7J5p0M2
4676H9L1k36K27n6j05k16J98K72l69L2J14Lq6r0l6R8J02n3R7m3pQ1j35J00N3j6
4702D9O0k12K40j02n4K92k11j70R2J6m3O2N0j03k03L69M2j59J73m3j95J35k10
4725a25J75j97K58M0j30Nn4j08Q5J07J05j69K1j15J90j47j5J81j28K4%k20K61
$$ plain form
4553 -7 97 -225 -172 14 0 -264 123 -6 46 -66 -4 66 -252 13 -97 -71 -149 134 -86 -55 -31 15 56 -33 -3
4578 -3 -183 33 -153 159 149 4 -50 -173 -98 -207 71 -161 47 93 34 21 -96 -106 -54 38 73 240 98 207
4602 207 55 -104 -77 19 2 143 75 -180 47 -29 -42 -31 98 -111 -139 53 -50 -167 -71 -98 208 -44 -188
4625 -188 5 26 56 66 -107 103 -16 -54 121 159 113 61 139 149 22 -23 55 -25 154 -109 -14 -4 -102 -11 280
4650 280 106 128 -49 -51 7 -31 30 -84 202 101 142 51 -40 23 11 161 194 132 -7 -14 -181 149 102 117 47 89
4676 89 120 -116 111 55 -50 -266 -68 204 -165 -133 -19 -16 -102 -192 -228 -130 -28 -81 16 -27 -34 47 -88 12 65 49
4702 49 109 -103 137 35 -19 273 62 -108 -16 0 -43 19 69 -34 -237 132 174 15 188 145 -50 85 -125
4725 -125 50 -147 111 151 21 26 -28 -136 -51 56 161 -8 13 -102 88 -59 -74 107 -21 3 3 -217 44
4748D4j61L75k73p7K82l24J49K9J11j54p2J53j3J46m91L46l2j4k75L25j09N1p4
4771e8M7K76k71r0q0OQ5J79n2j1J66k68J0PqJ34k38K84J8K5k95M7J04R2k33nJ65
4798C6r3Q0J29j55k2o8L64j03k59O0K2J87l07J0K60j24o6M2J02j98K37k29O5n2
4822h2J21Ro6j08K93k79J65k7j67J93J15j29l9rO0j07K71p2k74P8J50k20Mm2L27
4847A65r5j09N3n6o5K11r0L2K0o0l42M93J4r4j8J13j93J22k52J9J90j79K28j40
4871c3J55j67j08K45L0m8J00k75J65j23j00J32Mj28L18k87N1J58j20R8k03J18
4893a8k9P5j81J13o7J24l1J16j1k59K66k39K00j38J79k48K39j15k03L28n9q8l1
4916g7P9m8j7K03J63k18Pj11N3L4j31J05n3o9N4R4R6O4j99j60J77j37J47j03j83
$$ plain form
4748 44 -117 258 -15 -92 190 -134 15 44 155 1 -71 82 69 215 -276 70 38 24 -251 74 -35 16 -58
4771 -58 -11 265 -6 -96 -176 -170 -85 94 42 31 197 -71 -61 -54 -62 72 -166 118 136 161 -134 -87 17 109 -124 -129 36
4798 36 -57 23 152 -3 -25 -93 271 168 -91 -31 -9 178 -129 -119 141 17 -49 -7 95 -103 134 -95 -30 -82
4822 -82 39 48 -18 -126 167 -112 53 26 -141 52 167 38 -1 -10 50 -57 214 142 -132 -54 96 -124 -120 -162 165
4847 165 70 -39 14 -42 -107 104 14 46 66 6 -336 157 171 77 59 172 -21 101 -151 -132 58 -121 107 -33
4871 -33 122 -45 -153 92 122 74 174 -101 64 -59 -159 -27 -23 -151 167 -120 -69 89 -31 67 -136 -18
4893 -18 -47 28 -153 -40 -107 17 -14 102 91 -168 98 -141 59 -79 100 -148 91 -24 -227 101 42 -46 -77
4916 -77 2 -46 -63 140 303 85 92 -19 34 68 -63 42 -11 -80 -26 68 164 228 29 -131 46 -91 56 -47 -230
4941b30K04p5K56j19P7j61Nm6O6Q7j89J75K8k2q2Oj2M6j67K55m06M49q7J3j61
4966i0kJ15lnk6M5j19J55j1q0j03J25Q0j88L7J21j7j81J66n7M8k3J8n7j27L98
4992B19k20N5k5j91J64J40j60O5k7N0q5K7j56p6O9MP9r1J25J61K9j61J00K3k70
5017a52K37k13m8j40M29k9k11L20j08j35J64q0n4P6l4k07R2k6j20J57J01r6J8
5040e9k4j12Q3J99j16J31nj91J75l8K20k12rp5N2M1p0p7P6M1M9q9L2j94K68j70
5066g4n3K69o1j4j78K55k67P7k8j1l1J02P2N3o8o7l4n4L8L16l53K35k15J39N3
5091A01j49Kp2l1K8P1J09l4j00J82q6K8j80j08K29r1N3m0R8J04q7M0j62K22r8
5116B9j11K98j48k8q2J47p6K0J62l18J45J39o4P9k58Q5j39J76N5r3K8q2j05P9
$$ plain form
4941 -230 -26 -101 155 36 113 -48 -43 -89 -23 64 -125 50 78 56 -26 -20 -32 14 -153 102 -304 145 58 71 -90
4966 -90 -92 23 20 15 -11 34 -85 70 59 -21 -124 1 81 -107 -70 51 34 -147 19 -38 10 -13 5 -52 -179 219
4992 219 -1 54 29 -162 2 142 -18 47 20 70 -15 12 -144 -220 -151 -147 -68 -159 -34 127 156 -5 95 118 -152
5017 -152 85 -128 -176 -316 113 84 -127 193 85 -50 114 34 -20 56 22 -185 -93 -119 -239 -82 19 -77 -59
5040 -59 -83 -195 -112 87 -29 102 97 -94 81 43 263 51 42 -33 19 60 -10 -87 -11 30 79 -10 22 -172 96 -74
5066 -74 -127 142 81 67 -111 144 -123 -46 -74 -85 -116 -14 58 111 43 -24 -58 -112 -74 242 -111 124 -91 48 101
5091 101 -48 -46 -118 -149 -121 -50 59 25 -75 107 21 49 -131 -239 -10 -101 -48 -88 10 114 27 67 -95 127 29
5116 29 -82 216 68 40 -42 105 29 49 211 -107 38 177 113 192 -66 19 -120 56 111 18 46 -36 -141 -62
5140f2N4q7J60q7m3P7L1j16J10k9o3j11J64j24J75j09jn6N5J05j73K03r8R7o6
5165Fq2J38j3R3k4j26j25Q1P2Q0j64o4J11P0o1K6p8J52N7j60J3J38j79J99k16
5190e6K35n4r5n8Q6m3Q2q6M2j62m9J51lJ09q5J51k60M4M6j46J71J05j72J38Q4
5215A75l60J21R0j10j63L12j48L7J29n0n5l5R9n0j61J76n3J27j81q4J51n5P0M7
5239B9j01J92k4j04N1j63J59j30K00k58q9L97j26r5J31j38J15J9j2j7k96L36r2
5262a6k5J2l0J07o0l9Mj10J65q2J44j97L03j59j8k3K5M9L7Nl74L54K9k3o2o5N6
5289GM9L4oo2j19P6N0K1N3q4j31M4N3M2K0O3r6Mj5R5r0k4j2j85K40q5J60k44j2
5318a54K03M0L2j61N1k27L72j64K9j81K94q7ORj43R5nL9j60O1J75k22J15K78k54
$$ plain form
5140 -62 -8 -95 65 -22 -65 12 43 -73 37 8 -55 -166 -2 -126 49 -60 -61 -117 -62 43 -130 73 -25 72 6
5165 6 -76 62 49 142 118 -8 -133 -52 20 100 -64 -128 -17 53 -8 18 -60 92 149 -11 2 140 -39 160 -56
5190 -56 179 125 30 -28 58 15 97 11 53 -109 -158 -7 -10 99 14 165 -95 -51 -5 -151 20 125 -47 91 175
5215 175 -185 -64 26 -84 -247 65 -83 -46 83 33 -22 -57 42 -8 -169 7 -46 81 -100 -184 -33 -88 -18 29
5239 29 -72 120 96 -8 43 -120 39 -91 109 -149 -238 159 33 -62 69 -69 46 65 53 36 -260 76 -16
5262 -16 -41 -29 -59 48 -12 -51 -47 -157 8 -74 70 -127 176 17 -1 -24 1 50 87 92 -282 72 101 78 16 -49 7
5289 7 56 90 84 22 -97 -21 29 50 103 19 -112 -68 -15 27 47 110 14 18 3 98 8 -16 -28 -213 27 -58 102 -142 -154
5318 -154 49 89 121 -40 11 -216 156 -8 21 -160 134 47 53 62 -81 14 9 48 -112 -51 124 -98 17 295 41
5343D1o0o7J75k40R1O8m9K6J13j09nm9J81r2k58L14j76k11J21J08J96j8j21l0
5367e1l2K9O2J2j27J54k3q8O3N5O9o2k13J45l2L34j88j94M6L7J15j14P2j09Q5
5392D5k16J40K2j70K91j38K4J08k51J85n4J79k13K35q7j7q4rJ21k30L43k21r2
5415h9O0J84M2k83O4o7j11K73o8J6p3J17p0k9J59J3j19j7Q5p9l0j86MQ7o2K27
5441D8r2K8j4M2r2J25j86K92l11M11j94R1k04J07M6k72K17J19k53K15j67j03J98
5464E1J03k39J10j16K80k62J94Qm0P7j02M5j02K68k90O2Q9k42J30J28p3o6J12
5487A25q9j87J13n1%J66j5k71J70j4mJ66j85q0K58l33K00j52K86J02q2J0k04J98
5511A27q8lJ06j22j74R4J21j37K31j40J1J24k06o7J48j77K05k32L86k91Q2K24
$$ plain form
5343 41 -19 -86 89 -151 -60 8 -41 -15 98 -11 -16 -65 116 24 -234 80 -96 -307 -186 -78 118 100 -21 -51
5367 -51 -83 -54 8 20 -107 47 24 -64 -1 54 123 61 -152 -7 -39 295 107 -87 -41 -4 111 -3 69 -40 45
5392 45 -171 -31 -9 -179 112 -26 -2 106 -145 40 -14 165 -48 187 100 83 -1 -10 111 -119 224 3 -89
5415 -89 -29 155 197 -86 -22 -89 -200 73 5 21 -52 65 -5 -34 125 138 19 2 87 8 -22 -208 -204 -117 -179 48
5441 48 -44 -16 -30 12 -80 45 -141 151 -160 251 57 148 -56 51 97 -175 42 161 -92 123 -44 -147 51
5464 51 154 -85 25 -91 189 -73 121 129 89 166 64 109 7 275 -15 47 136 -106 24 152 79 13 125
5487 125 36 -151 -38 -89 -89 77 62 -209 -39 -53 -57 109 -76 -156 102 -231 -31 -183 103 205 123 133 -71 127
5511 127 39 36 142 20 -154 -60 61 -76 155 15 26 150 -56 -123 25 -152 53 -179 207 -84 -2 222
5533B22k53p3PJ08J12k87K67k5r7J87k32o7K35n1j03J90o9j9J05rj17m6j49Q4
5557h0nJ45k4J39k87J25k19K93r7j54K84nk7R3j59K8j89nJ99j53m6J87n5j14R5
5582c1J17k7j14R6M1q1q2O5pj02M0R5J11j06j76K02j87M9L12k06j1j20K46o6J26
5607A84k06P6jQj27J05r8O8r3j51L73j57O2j86J15j09Q0K32j81k0m9j07K57j04
5631b9m9R0K3o9j62K48K6K6j62L8j24P4R2j09R5rQ7n1NjQ6n9k95L64k82p0L27
5658A10j12QO2k45Q0K54j07j13J58nj81J29N1j69n7K17k5j46K59O7m42L44j36
5681AJ05m0K4K0j50J63j01j22R8Q6l8r9J49k3j30L3L7K00l7j49l4l5M1l4k8K0
5707d3M8j58J33J44o3mk50J98J2m7K0l9m2K13j40J2O4q2Oj73l6K10K01l17K07
$$ plain form
5533 222 -31 -104 -97 11 123 -164 103 78 -19 168 -64 -131 104 53 -50 140 71 52 157 148 31 -15 -164 -80
5557 -80 -85 60 36 175 -112 13 -206 87 -10 -164 120 115 88 181 22 50 -139 -144 55 -98 -144 43 -12 -126 -31
5582 -31 86 59 -55 41 82 1 -81 -16 -23 -125 -85 10 121 15 -161 41 -146 -97 215 9 -2 -122 124 58 184
5607 184 -22 54 53 61 -66 39 -59 9 -84 -235 138 -19 43 -143 -28 -137 -57 175 -6 -26 -75 -182 75 -29
5631 -29 -78 12 35 -34 -196 52 78 104 -58 -20 -144 -70 22 -87 8 -1 86 35 40 39 125 66 -229 135 -147 -217 110
5658 110 -2 6 68 -177 -97 157 50 -63 95 90 -91 38 89 -80 -137 80 55 -91 168 235 -207 137 1
5681 1 106 66 90 110 -40 123 22 -100 -2 84 46 -53 96 73 -57 -24 13 213 176 27 -7 -42 -1 -35 -63 -43
5707 -43 5 -153 -20 124 61 57 -193 5 17 -30 -10 -49 -91 122 -18 -6 58 -24 -18 -191 -227 -17 184 -133 74
5732G4J33j72j9l1j82K73l1k40J09qJ14j04n5J69j34J19J20qk37K5L07k33J27
5755A16J1j17J53l1j04j5k2J15l6n5qj19N5J63p7m3J98k66J22J06m02J40K0J33
5779C7j8j1n8J8J43k09L46k22lk7J2J30o7k05K31Jl11K21o3k18M16k12J12j6M4
5804G1k10Q9K1j27K82k89K13j19P8M5P7l17K91m6j64R1J02j91J41M2j66j98L18
5827C4K17j57q6J06j81L3j45K23L0j13p4O4M8j93Q8L9K01j9q2r7J0O9%r3P7k5
5853b6j2k9q6J03J44l3k0J38j04r2J55Qk41J9NK47J37m59K47j94J94p1o5J68k71
5878a38L42k18N5p7p2K4MP0J20j19l15L47k9p0K1J13o2NJ62k40o6J27J28J88l01
5903aJ41N4j12M7j48mj50R0l4J12q7J70qj38mJ09j19K11kj02L0r1l2j3p3K08m9
$$ plain form
5732 74 207 35 16 -15 -197 76 45 -195 -86 -94 20 -84 -139 30 -104 15 135 127 -110 -85 222 -11 116
5755 116 127 10 163 132 28 13 -9 106 70 15 7 -112 -57 106 29 -14 184 -82 40 146 -256 -116 -96 37
5779 37 19 8 -50 -32 111 -98 248 26 23 -4 8 138 71 -134 97 98 -213 8 -55 -273 143 -69 43 27 71
5804 71 -139 -50 -29 -156 126 -163 50 -69 9 54 131 -186 105 59 -105 -14 88 -103 38 80 -86 -284 34
5827 34 251 94 8 114 -67 -34 -179 44 74 -39 -113 -49 -1 -194 -106 -67 134 115 33 -64 -54 15 15 -78 -1 -26
5853 -26 -38 -67 -153 -50 94 61 41 179 75 -17 138 146 -95 -76 -71 176 313 -146 101 -93 101 30 -35 133 -138
5878 -138 204 -14 41 -36 -108 -84 -80 -10 110 -9 -324 23 -6 -76 -55 58 -4 1 163 -77 -143 -16 112 300 -1
5903 -1 140 194 82 129 -19 -23 -173 -83 -117 -5 -92 78 70 -68 -72 37 -82 129 127 25 55 -36 -68 -81 -154 54 5
$$ [...]
8191H0
##END NTUPLES=NMR FID
##END=
