##TITLE=1H_3MEPAN2906
 D2O
 8 sc, 
 30.06.2022
##JCAMPDX= 6.0         $$ Bruker NMR JCAMP-DX V2.0
##DATA TYPE= NMR FID
##DATA CLASS= NTUPLES
##ORIGIN= UXNMR, Bruker Analytische Messtechnik GmbH
##OWNER= root
$$ XWIN-NMR		Version 3.5
$$ Thu Jun 30 14:03:28 2022 Russian Standard Time (UT+4h)  she@DPX200
##.OBSERVE FREQUENCY= 200.1313499994
##.OBSERVE NUCLEUS= ^1H
##.DELAY= (6, 6)
##.ACQUISITION MODE= SIMULTANEOUS
##.ACQUISITION SCHEME= undefined
##.AVERAGES= 8
##.DIGITISER RES= 18
##SPECTROMETER/DATA SYSTEM= spect
##.PULSE SEQUENCE= zg30
##.SOLVENT NAME= D2O
##.SHIFT REFERENCE= (INTERNAL, D2O, 0, 15.7039)
##AUDIT TRAIL= $$ (NUMBER, WHEN, WHO, WHERE, WHAT)
$$ ##TITLE= Audit trail, XWIN-NMR		Version 3.5
$$ ##JCAMPDX= 5.01
$$ ##ORIGIN= Bruker BioSpin GmbH
$$ ##OWNER= she
$$ F:/spectra/data/she/nmr/H-F/1/audita.txt
$$ ##AUDIT TRAIL=  $$ (NUMBER, WHEN, WHO, WHERE, WHAT)
(   1,<2022-06-30 14:01:59.81 +0400>,<she>,<DPX200>,
      <created by zg, POWCHK disabled, PULCHK disabled
       configuration hash MD5:
       00 E9 B6 7A A2 85 ED C7 34 08 36 98 17 FE 4E 26
       data hash MD5: 16K
       2A 65 A6 06 86 05 42 E3 E1 16 18 80 C8 91 5F DA>)
$$ ##END=
$$ 
$$ hash MD5
$$ 99 E8 8B 13 E9 4F B5 7A 5A 16 E4 BB B1 22 AD 1E
##$RELAX= 
##$RELAX= 
##$RELAX= 
##$RELAX= 
##$RELAX= 
##$RELAX= 
$$ Bruker specific parameters
$$ --------------------------
##$DU= <F:/spectra>
##$EXPNO= 1
##$NAME= <H-F>
##$PROCNO= 1
##$TYPE= <nmr>
##$USER= <she>
##$AMP= (0..31)
100 100 100 100 100 100 100 100 100 100 100 100 100 100 100 100 100 100 
100 100 100 100 100 100 100 100 100 100 100 100 100 100 
##$AQSEQ= 0
##$AQ_mod= 1
##$AUNM= <au_zg>
##$AUTOPOS= <>
##$BF1= 200.13
##$BF2= 200.13
##$BF3= 200.13
##$BF4= 200.13
##$BF5= 200.13
##$BF6= 200.13
##$BF7= 200.13
##$BF8= 200.13
##$BYTORDA= 1
##$CFDGTYP= 0
##$CFRGTYP= 5
##$CHEMSTR= <none>
##$CNST= (0..31)
1 1 145 1 1 1 1 1 1 1 1 1 1 1 1 1 1 1 1 1 1 1 1 1 1 1 1 1 1 1 1 1 
##$CPDPRG= <>
##$CPDPRG1= <>
##$CPDPRG2= <>
##$CPDPRG3= <>
##$CPDPRG4= <mlev>
##$CPDPRG5= <mlev>
##$CPDPRG6= <mlev>
##$CPDPRG7= <mlev>
##$CPDPRG8= <mlev>
##$CPDPRGB= <>
##$CPDPRGT= <>
##$D= (0..31)
0 1.2 0 0 0 0 0 0 0 0.06 0 0.03 0 0 0 0 0.0002 0 0 0 0 0 0 0 0 0 0 0 0 
0 0 0 
##$DATE= 1656583319
##$DBL= (0..7)
120 120 120 120 120 120 120 120 
##$DBP= (0..7)
150 150 150 150 150 150 150 150 
##$DBP07= 0
##$DBPNAM0= <>
##$DBPNAM1= <>
##$DBPNAM2= <>
##$DBPNAM3= <>
##$DBPNAM4= <>
##$DBPNAM5= <>
##$DBPNAM6= <>
##$DBPNAM7= <>
##$DBPOAL= (0..7)
0.5 0.5 0.5 0.5 0.5 0.5 0.5 0.5 
##$DBPOFFS= (0..7)
0 0 0 0 0 0 0 0 
##$DE= 6
##$DECBNUC= <off>
##$DECIM= 32
##$DECNUC= <off>
##$DECSTAT= 4
##$DIGMOD= 1
##$DIGTYP= 9
##$DL= (0..7)
0 120 120 120 120 120 120 120 
##$DP= (0..7)
150 150 150 150 150 150 150 150 
##$DP07= 0
##$DPNAME0= <>
##$DPNAME1= <>
##$DPNAME2= <>
##$DPNAME3= <>
##$DPNAME4= <>
##$DPNAME5= <>
##$DPNAME6= <>
##$DPNAME7= <>
##$DPOAL= (0..7)
0.5 0.5 0.5 0.5 0.5 0.5 0.5 0.5 
##$DPOFFS= (0..7)
0 0 0 0 0 0 0 0 
##$DQDMODE= 0
##$DR= 18
##$DS= 0
##$DSLIST= <SSSSSSSSSSSSSSS>
$$ [...]
##$SUBNAM2= <"">
##$SUBNAM3= <"">
##$SUBNAM4= <"">
##$SUBNAM5= <"">
##$SUBNAM6= <"">
##$SUBNAM7= <"">
##$SUBNAM8= <"">
##$SUBNAM9= <"">
##$SW= 18.0517283424941
##$SWIBOX= (0..15)
0 0 2 0 0 0 0 0 0 0 0 0 0 0 0 0 
##$SW_h= 3612.71676300578
##$TD= 16384
##$TD0= 1
##$TE= 0
##$TE2= 300
##$TE3= 300
##$TEG= 300
##$TL= (0..7)
0 120 120 120 120 120 120 120 
##$TP= (0..7)
150 150 150 150 150 150 150 150 
##$TP07= 0
##$TPNAME0= <>
##$TPNAME1= <>
##$TPNAME2= <>
##$TPNAME3= <>
##$TPNAME4= <>
##$TPNAME5= <>
##$TPNAME6= <>
##$TPNAME7= <>
##$TPOAL= (0..7)
0.5 0.5 0.5 0.5 0.5 0.5 0.5 0.5 
##$TPOFFS= (0..7)
0 0 0 0 0 0 0 0 
##$TUNHIN= 0
##$TUNHOUT= 0
##$TUNXOUT= 0
##$USERA1= <user>
##$USERA2= <user>
##$USERA3= <user>
##$USERA4= <user>
##$USERA5= <user>
##$V9= 5
##$VALIST= <valist>
##$VCLIST= <CCCCCCCCCCCCCCC>
##$VD= 0
##$VDLIST= <DDDDDDDDDDDDDDD>
##$VPLIST= <PPPPPPPPPPPPPPP>
##$VTLIST= <TTTTTTTTTTTTTTT>
##$WBST= 1024
##$WBSW= 4
##$XGAIN= (0..3)
0 0 0 0 
##$XL= 0
##$YL= 0
##$YMAX_a= 785491
##$YMIN_a= -1011523
##$ZGOPTNS= <>
##$ZL1= 120
##$ZL2= 120
##$ZL3= 120
##$ZL4= 120
##$ABSF1= 10
##$ABSF2= 0
##$ABSG= 5
##$ABSL= 3
##$ALPHA= 0
##$AQORDER= 0
##$ASSFAC= 0
##$ASSFACI= 0
##$ASSFACX= 0
##$ASSWID= 0
##$AUNMP= <proc_1d>
##$AZFE= 0.1
##$AZFW= 0.1
##$BCFW= 1
##$BC_mod= 2
##$BYTORDP= 1
##$COROFFS= 0
##$CY= 11.3945322036743
##$DATMOD= 1
##$DC= 2
##$DFILT= <>
##$DTYPP= 0
##$F1P= 2.36226072786647
##$F2P= -0.459571619588291
##$FCOR= 0.5
##$FTSIZE= 0
##$FT_mod= 4
##$GAMMA= 1
##$GB= 0.15
##$INTBC= 1
##$INTSCL= 1
##$ISEN= 128
##$LB= 0.24
##$LEV0= 0
##$LPBIN= 0
##$MAXI= 10000
##$MC2= 0
##$MEAN= 0
##$ME_mod= 0
##$MI= 1.114404
##$NCOEF= 0
##$NC_proc= 0
##$NLEV= 6
##$NOISF1= 3.799351
##$NOISF2= 2.8
##$NSP= 1
##$NTH_PI= 0
##$NZP= 0
##$OFFSET= 15.70392
##$PC= 1
##$PHC0= -18043.77
##$PHC1= 7.60069
##$PH_mod= 1
##$PKNL= yes
##$PPARMOD= 0
##$PSCAL= 0
##$PSIGN= 0
##$REVERSE= no
##$SF= 200.130013532006
##$SI= 16384
##$SIGF1= 3
##$SIGF2= 2
##$SINO= 400
##$SIOLD= 16384
##$SREGLST= <1H.CDCl3>
##$SSB= 0
##$STSI= 0
##$STSR= 0
##$SW_p= 3612.71676300578
##$SYMM= 0
##$S_DEV= 0
##$TDeff= 0
##$TDoff= 0
##$TI= <>
##$TILT= no
##$TM1= 0
##$TM2= 0
##$TOPLEV= 0
##$USERP1= <user>
##$USERP2= <user>
##$USERP3= <user>
##$USERP4= <user>
##$USERP5= <user>
##$WDW= 1
##$XDIM= 8192
##$YMAX_p= 0
##$YMIN_p= 0
$$ End of Bruker specific parameters
$$ ---------------------------------
##NTUPLES= NMR FID
##VAR_NAME=  TIME,          FID/REAL,        FID/IMAG
##SYMBOL=    X,             R,               I
##VAR_TYPE=  INDEPENDENT,   DEPENDENT,       DEPENDENT
##VAR_FORM=  AFFN,          ASDF,            ASDF
##VAR_DIM=   8192,          8192,            8192
##UNITS=     SECONDS,       ARBITRARY UNITS, ARBITRARY UNITS
##FACTOR=    0.0002768,     1,               1
##FIRST=     0,             0,               0
##LAST=      2.2672688,     0,               0
##MIN=       0,             -1011523,        0
##MAX=       2.2672688,     785491,          0
$$ Real data points
##PAGE= N=1
##DATA TABLE= (X++(R..R)), XYDATA
0 0 0 0 0 0 0 0 0 8 -8 8 -8 16 -23 30 -38 46 -55 69 -85 107 -125 149 -178 210 -248 292 -339 394 -454 519
30 519 -597 680 -775 878 -993 1118 -1256 1410 -1577 1762 -1962 2178 -2420 2681 -2967 3281
46 3281 -3618 3991 -4399 4846 -5339 5881 -6481 7148 -7893 8731 -9684 10771 -12030
59 -12030 13503 -15262 17399 -20064 23491 -28078 34581 -44565 61998 -101229 379935 -367274
71 -367274 -656534 159817 -631149 -293252 602537 195418 -40330 410964 -22881 -154070
81 -154070 -843 -429794 -419184 163038 243859 385746 365677 -85477 -170740 -220946 -527088
92 -527088 -103382 311121 99640 269935 439717 -68156 -323339 -311310 -299557 54689
102 54689 200202 76654 307665 194803 -189644 -6271 -67345 -451991 -150124 121756
112 121756 125666 501891 338824 -297857 -215603 -215231 -417855 140181 376290 -44 212656
123 212656 206180 -252706 -31404 -29253 -487408 -26007 361737 -27263 216245 425746 -246504
134 -246504 -340647 -14690 -250324 -127651 307427 189252 144149 209365 -153531 -298464
144 -298464 -122906 -128967 -13353 201103 172832 129933 61850 -88932 -105005 -174031 -238669
155 -238669 13964 189297 173271 233747 68182 -196420 -161057 -174501 -167877 145595 192074
166 192074 37310 187541 109730 -207760 -140019 -95955 -187920 70339 220057 85064 153694
177 153694 80533 -203367 -142779 -76117 -168819 53997 228217 109054 135705 61046 -219976
188 -219976 -173804 -45876 -103715 63237 222588 73916 46619 80612 -113808 -193190 -97168
199 -97168 -68948 42667 200257 163025 50499 -32197 -129342 -152019 -85153 -6762 64697
210 64697 107134 127098 100322 -28023 -132045 -133661 -120554 -26908 131434 145185 81247 55792
222 55792 -43496 -131281 -93466 -74498 -44342 88981 146110 99188 60553 -43013 -153053
233 -153053 -122831 -48157 6566 94256 124096 73501 30948 -32515 -115799 -121157 -63690 8822
245 8822 97263 139046 85391 -2420 -65049 -101240 -97349 -41644 24180 68723 104503 96666 17408
258 17408 -66189 -109836 -118527 -46286 63866 99757 90011 67879 -12148 -78725 -74681 -78319 -53547
271 -53547 38421 92136 91770 77843 -3125 -91202 -97874 -73789 -25705 55582 88167 78821 59984
284 59984 -14096 -82668 -86224 -75131 -23645 70304 93150 63978 40564 -21352 -76975 -71176
296 -71176 -59382 -24752 50446 86404 83230 52249 -36088 -96128 -81773 -53921 6072 78249
308 78249 73506 46439 32808 -28025 -74268 -62913 -56315 -13767 68487 87378 60211 27134
320 27134 -44860 -87808 -60889 -35080 5298 65717 72439 50859 26707 -40716 -87442 -64280
332 -64280 -28960 18090 72728 69439 32103 6167 -33965 -62362 -55434 -40391 4643 70082
344 70082 82764 49891 3433 -60733 -88436 -47102 660 29344 53984 52983 28354 3808
356 3808 -30186 -65302 -64485 -24293 29364 69654 71422 30070 -23342 -54422 -56943 -39754 -7458
369 -7458 27120 51553 58448 34691 -12916 -53850 -67248 -44763 5858 44765 53488 43024 14742
382 14742 -15801 -35357 -52068 -46374 -6422 31970 61521 68218 15483 -41896 -51377 -51749 -29067
395 -29067 26270 37235 27048 44908 22428 -24543 -34251 -54668 -52878 18513 54283 45776 50856
408 50856 -752 -56473 -26430 -23988 -42520 17343 43014 19309 52217 32285 -53278 -54075 -32975
421 -32975 -36057 28464 63984 21857 21684 12519 -41155 -36018 -24380 -37278 13734 56133 35794
434 35794 30398 2602 -51693 -40907 -17645 -16639 18086 36804 28329 36387 5099 -40934 -40920
447 -40920 -46386 -18390 55542 48123 14297 26620 -21080 -53368 1742 -13782 -38969 31516
459 31516 35195 11134 57642 2972 -78908 -25612 -16895 -33297 61873 61850 -17185 22401 8251
472 8251 -71577 -17498 7257 -38187 35904 68633 -10263 4771 12940 -57684 -26339 13996
484 13996 -28229 8675 58718 20912 13620 4101 -61615 -56379 574 20904 41480 39125 -1310
497 -1310 -16686 -16777 -14209 -3838 -19018 -13414 23490 24388 31355 34805 -36108 -59591 -9731 -18225
511 -18225 2715 69540 20939 -18847 26380 -25088 -62037 15406 519 -24643 61468 34307
523 34307 -38352 21059 4605 -62408 6111 13272 -46661 33626 69362 -9597 5316 452
535 452 -83666 -33489 47830 16631 23562 37547 -29517 -30112 17936 -11016 -25011 4125 -5953
548 -5953 3026 47650 33395 -18288 -33113 -30003 -25835 5645 40541 28231 2803 7107 -9831
561 -9831 -38682 -11061 5564 -14483 21050 43479 -11488 -9300 22070 -26256 -30917 14293 -18152
574 -18152 -13286 57188 29810 -12147 8022 -39820 -64718 24051 41156 -2291 29364 14315
586 14315 -46516 -1752 26514 -31494 -17600 17488 -11719 14285 57991 -1851 -41873 -8875
598 -8875 -22744 -25630 36766 37142 -6238 11515 6774 -36272 -15580 8362 -16803 8378 37887
611 37887 -4029 -9282 21865 -12309 -27259 5881 -12095 -19636 34187 35170 1346 5409 -23397
624 -23397 -51221 -1237 28977 7534 18953 15352 -23382 -10289 14952 -10992 -19784 1744
636 1744 -697 6452 33395 17587 -21041 -19315 -11465 -21356 3471 35007 10614 -2649 17414
649 17414 -10834 -36115 2676 3538 -14715 25920 23654 -20843 6270 15574 -30111 -7563 9516
662 9516 -28697 6804 46985 2705 -2147 6264 -45846 -24246 31962 3012 2751 31983 -13255
675 -13255 -21076 21617 -7986 -28351 7921 254 -1690 31534 11088 -15554 -3819 -13904 -17154
688 -17154 7546 5979 5716 17474 6467 -2727 -9887 -23315 -7153 10189 4310 15908 10285
701 10285 -13521 2130 5094 -19878 -4022 649 -14596 23264 30873 -13338 -2881 -2138 -36543
714 -36543 2304 28598 -12702 5285 25755 -17161 -2569 16942 -30836 -17369 21288 -3260
726 -3260 10430 31099 -17366 -18022 10996 -16477 -8162 19941 -8216 -751 29599 -799 -13167
739 -13167 -802 -22186 -9756 22891 6872 3462 11354 -11430 -6239 7160 -14665 -9567 7108
752 7108 97 16894 19394 -14916 -11996 -3059 -16875 7404 17300 -11876 4064 17989 -8037
765 -8037 -571 -165 -29518 -3648 23494 2334 11957 11782 -25366 -8268 13130 -12584 -3680 12068
779 12068 -9094 7812 23786 -10384 -13032 -2699 -18161 3282 24485 -1163 -499 9764 -11512
792 -11512 -5443 6422 -14664 -5925 14426 4218 8782 9248 -16133 -10840 4268 -6320 1879
805 1879 10711 -4812 3891 14164 -5225 -8948 -7401 -14057 6517 19259 3255 1727 -1425 -14270
819 -14270 983 7531 -10469 -3199 5992 -349 12768 11841 -15611 -13525 -2662 -5658 9330 14359
833 14359 -5062 -1308 6345 -6533 -2879 -929 -12347 687 15892 5632 2209 -1155 -12939
846 -12939 -4177 5654 -2789 -613 4355 889 8167 8382 -9410 -13612 -5542 -854 11592 14147 -1564
861 -1564 -6329 -1922 -2045 1777 1039 -7155 -3759 6328 10916 8291 -3250 -13866 -9064 111 5878
876 5878 9475 1841 -4907 1358 2527 -2033 -3323 -7859 -6283 9192 12764 2017 -1436 -6662 -9800
891 -9800 2005 6032 -2957 -2447 3388 4219 6949 2208 -11387 -11622 349 5874 8724 6517 -4411
906 -4411 -6855 640 3065 -1819 -3978 -4349 277 10428 10587 -2067 -9902 -7279 -3720 3159 9090
921 9090 1799 -5010 1137 4022 381 -1099 -7520 -9068 5025 11700 4131 1215 -2865 -11133 -1948
936 -1948 7869 -1140 -4385 3353 1795 3503 7462 -4970 -13270 -2046 3944 3305 8248 2572 -7604
951 -7604 -802 4087 -4507 -4266 -194 -2223 5753 12399 -991 -9984 -3356 -2257 -85 7964 1151
966 1151 -7947 1852 8191 873 -1338 -5149 -12310 -625 14611 7375 -628 -1341 -9151 -6092 8524
981 8524 3276 -6206 1722 3059 -1654 6893 3680 -12241 -5218 5478 -1766 2668 9473 -4223
995 -4223 -3724 7767 -4987 -11244 4002 1692 5 12715 2570 -14838 -2489 3385 -3252 7470
1009 7470 4694 -13733 -1638 13131 1589 437 842 -15782 -8521 14640 9602 818 2373 -9223
1023 -9223 -10827 6834 6627 -3673 927 1071 -4235 4305 6051 -6535 -5587 2993 -1805 -2445 6032
1038 6032 2415 -2612 5232 1953 -12668 -5476 5826 1943 8000 8915 -12891 -11944 7279 1706
1052 1706 152 10073 -8845 -14324 13667 10183 -5213 4239 -7785 -18988 9787 15707 -3686
1065 -3686 4878 831 -17779 1388 12495 -7650 -481 9502 -7971 -1347 10673 -6977 -6197
1078 -6197 8112 -2674 -5637 5469 -693 -1716 8650 1586 -9638 -5718 -1436 2464 10060 7406
1092 7406 -5919 -11338 -2370 5178 3697 3762 -1389 -11625 -1044 13416 2840 -3347 -471 -12659
1106 -12659 -5313 16667 3812 -6187 6558 -6367 -10960 11969 2601 -12243 8385 5655 -9612
1119 -9612 7157 3630 -13942 5333 8471 -10757 2198 5708 -9241 6462 12240 -11976 -7824
1132 -7824 3001 -5366 5322 14691 -5124 -9826 464 -1116 2529 7232 -3576 -7612 497 4529
1146 4529 5278 1278 -5325 -6772 -2568 4563 7841 -253 -3526 827 -3881 -672 5830 -4934 -5034
1161 -5034 8619 801 -3189 5648 -6041 -7558 10374 1067 -8116 5883 -426 -6323 12056 3550
1175 3550 -14996 -201 3530 -3866 10451 6481 -12917 -2347 4928 -3462 4694 3964 -10894 -446
1189 -446 8842 -557 711 1487 -9082 -2222 7765 1801 -259 75 -3456 163 3544 -154 -2874
1204 -2874 -2851 1372 4663 2426 -1243 -2406 -4705 1278 6123 -1937 -3825 1836 -1272 1328 7081
1219 7081 -4487 -8794 2453 1321 658 7178 -3745 -8158 3677 2424 -2886 3149 -2460 -7531
1233 -7531 6924 7223 -4008 -423 -1798 -6110 5335 6930 -3176 -1713 -277 -1391 4181 3009
1247 3009 -4969 -3648 1743 2247 3913 1680 -4932 -4462 1880 3199 1208 -711 -3076 -916 2851
1262 2851 3797 -14 -5087 -2371 1206 2981 3127 -898 -5057 -1454 2931 1320 -1035 -1478 -4330 1765
1278 1765 6589 1127 -3105 -3800 -3380 1549 6086 453 -4292 -1751 340 1559 4402 -1831 -6168
1293 -6168 -375 3915 3403 3028 -2341 -4967 -786 3783 2215 -830 -1655 -2268 1762 3987 249 -3513
1309 -3513 -2081 -490 2155 3839 450 -3829 -1675 1766 1179 116 -1517 -3134 -56 5015 2485
1324 2485 -1612 -3365 -2931 1356 4535 984 -2757 -1330 -207 1725 3933 -950 -5523 -2067 2137
1339 2137 3303 3055 -1745 -4480 -1045 1797 2223 763 -2242 -2301 2159 2707 986 -1963 -3991 -1263
1355 -1263 2416 2799 1068 -2433 -2959 1469 3162 -211 -2093 -1690 -690 3650 3979 -2219 -3581 -2202
1371 -2202 71 4220 3101 -3927 -3235 1479 876 2785 1109 -5710 -3484 3771 2991 1647 -196 -4871
1387 -4871 -2361 3819 1987 -796 -1251 -2610 192 4961 1544 -3444 -2825 -1247 1729 3948 1187
1402 1187 -2743 -2132 164 2147 1378 -2201 -2784 -916 2192 3890 17 -3571 -2414 -629 1903 3623
1418 3623 -820 -4312 918 2362 636 1556 -2145 -5007 1480 4909 543 425 -1495 -4225 2192
1433 2192 5148 -1625 -3095 -78 -1608 2619 6090 -2327 -5964 -298 954 2191 3556 -1777 -4830
1448 -4830 1448 2956 273 741 -2080 -4461 1854 5475 481 -2553 -689 -1369 214 3783 -128
1463 -128 -4047 498 2473 542 707 -1080 -5011 391 4863 118 -1594 -526 -3016 5 5775
1478 5775 151 -5193 -328 96 104 5409 1141 -6331 -2087 2457 649 3367 1804 -6371 -1827 5187
1494 5187 340 -888 1213 -3972 -3283 5411 2337 -3182 215 -82 -2380 3317 1783 -4606 -295
1509 -295 3422 -1224 139 1414 -4820 -2039 6615 910 -3595 903 -1902 -1901 6032 1873 -6596 -1811
1525 -1811 1419 -235 4772 3482 -6407 -3060 3791 -39 1278 2866 -4439 -3528 4640 2430 -1653
1540 -1653 1108 -1885 -4697 3586 4063 -2477 -767 1493 -2397 308 3512 -2685 -2998 4345 1152
1555 1152 -2837 936 -2065 -4023 5105 4104 -4546 -1550 597 -2634 3654 5643 -5328 -4934 2276
1570 2276 560 1918 5736 -4994 -6972 2939 2846 -251 3653 -2033 -6746 2498 4661 -2005 453
1585 453 800 -4629 735 5012 -1831 -2031 2234 -632 -1311 3164 -1018 -3788 3289 2789 -2546 -1076
1601 -1076 -652 -3157 2814 4914 -2027 -3404 286 -642 2275 5843 -1665 -6254 186 1854 817
1616 817 5252 509 -6988 -1250 4269 234 1493 1841 -5042 -1601 4608 -289 -1620 2140 -2687
1631 -2687 -1693 4704 422 -3516 1374 1516 -1958 1296 102 -4761 960 4289 -367 -1136 -934 -3457
1647 -3457 1150 5964 462 -3908 -761 -330 635 4973 1009 -5447 -2100 1584 1028 3138 1915 -5467
1663 -5467 -2651 3405 1633 -338 1439 -2285 -2051 3873 1220 -2255 57 -235 -1039 3006 1593 -3656
1679 -3656 -665 2559 101 971 238 -3681 -1291 4577 2437 -1318 -1094 -2152 -1252 3777 2891 -2325
1695 -2325 -2185 -176 -261 3164 2665 -2668 -3399 1311 1644 1226 2032 -2834 -3796 2134 2553 -546 334 -1676
1713 -1676 -2547 2591 2941 -2569 -1420 -216 -731 3065 2021 -2628 -2310 1596 910 1651 365 -3858
1729 -3858 -2096 2268 2128 -137 -140 -2613 -2091 3152 2565 -835 -1878 -784 981 2575 1523 -1893
1745 -1893 -2487 -121 1768 2258 226 -1851 -2027 261 2672 585 -1417 -1354 -1455 1404 3035 -814
1761 -814 -3104 -121 382 662 2825 -581 -3672 471 2146 665 1297 -1981 -3075 2007 2982 30
1777 30 256 -1472 -2952 2103 3398 -582 -1156 -827 -661 2662 2461 -2149 -2189 -490 697 2245 1032
1794 1032 -2902 -1981 1172 1639 1651 -267 -2986 -566 1568 1947 1060 -1771 -2394 584 1833 1467 -98
1811 -98 -2543 -1786 2247 2153 271 -719 -2341 -1015 3062 1927 -1286 -600 -1080 -641 3007 663 -2234
1828 -2234 -1070 -271 516 2521 -182 -2958 320 1017 896 1536 -906 -2910 411 2011 924 -113
1844 -113 -1832 -2910 1566 2747 -175 -875 -2030 -1488 2429 2508 -617 -1932 -1387 -65 2736 1287
1860 1287 -1724 -1501 -998 567 2843 349 -2710 -1143 506 1113 1621 -1214 -2324 185 1183 1521
1876 1521 812 -1786 -2000 1595 2005 42 -317 -2125 -1242 2610 2056 -772 -1335 -1540 -144 2733 1265
1893 1265 -1999 -1230 -628 489 2882 600 -2716 -1533 833 1699 1649 -677 -2647 -710 1481 1729
1909 1729 310 -1476 -2017 305 1921 1253 -410 -2120 -954 1083 1356 419 -1300 -2096 186 2408
1925 2408 1095 -652 -1284 -1907 900 2498 223 -1671 -786 -506 1646 2662 -998 -2748 -137 704
1941 704 1071 1708 -1491 -2851 873 1733 553 368 -1842 -2254 1635 2786 -38 -1288 -1830 -1341 1703
1958 1703 2641 -761 -2572 -641 790 1467 1642 -1080 -3012 -236 2048 1166 399 -930 -2340 59
1974 59 2825 240 -1263 -515 -903 482 2612 -286 -2902 -319 1177 412 1481 309 -2995 3
1990 3 3064 448 -104 -952 -2807 530 3720 283 -1974 -1036 -1132 288 3681 580 -3228 -1207 841
2007 841 443 1903 823 -3700 -1146 1863 980 452 435 -2198 -946 2644 634 -1670 86 -125 -633
2024 -633 1883 197 -3206 -787 2038 313 986 401 -3031 -1194 3382 590 -1199 -4 -2743 -1567
2040 -1567 3814 1903 -2458 -567 -968 -1550 3089 2411 -3262 -1868 1075 -345 1075 1622 -2323 -1739
2056 -1739 1645 759 -684 1931 -724 -2178 2004 1569 -2500 -824 736 -317 1420 1808 -2822 -1887
2072 -1887 1636 1145 227 1018 -2564 -2521 2867 2415 -803 -1038 -1198 -2129 2362 3641 -1236 -1960 262
2089 262 -871 1520 3404 -1270 -2880 764 945 158 1574 -903 -2931 1265 1851 -821 -139 276
2105 276 -2029 832 2568 -1777 -1351 725 -93 238 2310 -1654 -3059 1360 1798 135 1176 -1061
2121 -1061 -3165 1338 3610 -329 -1013 -938 -2245 990 3664 -13 -2394 -386 -707 151 2713 -220
2137 -220 -3221 -252 1737 29 1019 158 -2514 -343 2486 150 -1149 -243 -1016 16 2573 65
2153 65 -2656 -74 949 83 1920 172 -3299 -44 2927 545 -48 -68 -2863 -580 3264 836
2169 836 -1511 -293 -1327 110 3241 909 -2578 -702 394 -565 1663 1054 -2610 -884 1389 352
2185 352 636 55 -1754 -695 2198 911 -1353 -662 -889 -109 2036 892 -1965 -1089 923 701 1107
2202 1107 409 -2056 -1799 2069 1537 -219 -385 -1606 -1265 2003 2077 -1252 -1242 -450 -714 1903 1932 -1815
2220 -1815 -1675 862 747 827 1266 -1738 -1852 1534 1242 -45 317 -1378 -1296 2065 1659 -885 -856 -676
2238 -676 -290 2161 1416 -1082 -1616 115 686 1307 731 -1606 -1365 460 1416 910 -541 -1610 -1259 874
2256 874 1878 -96 -1505 -1016 64 984 1338 -583 -2152 -545 1101 902 469 -1207 -2275 526
2272 526 2117 322 -471 -1282 -1505 778 2440 -81 -1279 -978 -537 880 1989 -634 -1682 -237
2288 -237 286 1065 1118 -1067 -1946 343 1132 604 168 -1390 -1064 1084 1393 345 -1172 -1073 -320 1148
2306 1148 1093 -706 -1281 -1234 767 1366 678 -1232 -1287 -254 1305 1415 -103 -1226 -1055 256 1775 934
2324 934 -1118 -1316 -113 912 1558 482 -1531 -1447 419 1509 824 -377 -1583 -760 1338 1009 337
2341 337 -939 -989 -12 1561 747 -944 -1384 -551 886 1714 211 -1389 -1109 426 1268 632 -623 -1781
2359 -1781 -197 1153 1643 -122 -1521 -1408 491 1494 1161 -650 -1872 -549 954 1151 406 -1197
2375 -1197 -1560 -108 1495 790 49 -1032 -827 535 1631 247 -1047 -1082 -258 1104 1403 -452 -1426
2392 -1426 -705 304 1068 652 -1204 -984 289 1130 517 68 -1283 -861 950 1636 317 -885 -1375
2409 -1375 -107 1263 1048 -455 -1559 -651 366 1281 599 -880 -1399 216 784 899 -368 -1100 -1790
2426 -1790 668 1467 -257 -1107 -1136 -704 1377 1009 -662 -1090 -524 -331 1487 1250 -1014 -1567 -87 1135
2444 1135 1002 303 -821 -1433 552 1310 308 -475 -1411 -445 856 1279 196 -1068 -424 319 815 747
2462 747 -393 -1816 -317 1848 1145 474 -657 -1607 184 1844 743 -850 -913 -936 667 1704 289
2479 289 -1417 -614 319 603 1782 -209 -1820 -280 1289 591 455 -670 -1251 64 1290 366 -652
2496 -652 -306 -1146 784 1410 -189 -1318 -705 106 519 1042 -483 -1843 -469 1333 920 478 -882
2513 -882 -1321 229 1999 804 -265 -548 -631 28 1811 905 -1251 -994 71 533 979 954 -1778 -1159
2531 -1159 1127 485 232 -20 -1309 -834 1662 1096 -1052 -234 -454 264 2099 463 -1916 -1013 641
2548 641 1252 767 624 -2196 -810 1656 1118 522 -420 -1736 -902 1888 1448 -579 -665 -997 -1077 1622
2566 1622 716 -951 -965 101 203 881 12 -461 -982 893 487 -458 -325 -812 -1036 1559 836 -567
2584 -567 -259 -687 254 1046 853 -986 -1386 232 271 336 511 -1717 -972 997 1191 313 -277 -1037 -1354
2603 -1354 944 1870 -97 -842 -384 -934 700 1624 -25 -1255 -300 -22 301 1045 -926 -1575 666
2620 666 903 -187 -77 -494 -798 837 1774 -541 -1128 -3 160 1010 1571 -1047 -1630 50 725 643
2638 643 790 -952 -1847 173 1169 510 94 -562 -1449 251 1761 71 -1032 -265 -393 139 1410 87
2656 87 -1444 -300 809 224 1157 -318 -1341 -171 1513 104 -450 -119 -793 355 1909 -85 -1652
2673 -1652 -488 46 462 1609 87 -1650 -408 869 800 676 -125 -1790 -699 1411 796 -139 -248
2690 -248 -1275 -230 1407 1064 -876 -565 -419 237 921 277 -1507 -852 859 904 262 -289 -859 -111
2708 -111 1491 1094 20 -362 -753 -311 1312 298 -844 -1029 -385 297 1204 753 -1560 -1427 445 822
2726 822 37 84 -1497 -1118 629 1075 -41 -635 -650 -423 671 1053 -930 -831 -235 27 1025 810 -1015
2745 -1015 -1325 561 970 939 112 -1138 -778 744 1075 35 -898 -1065 -371 1056 1191 -383 -988 -414
2763 -414 300 995 978 -764 -1532 -228 1177 256 -357 -1373 -995 910 1682 391 -488 -445 -422 874 660
2782 660 -496 -1076 -322 463 775 576 -636 -1572 59 1086 1034 -283 -928 -775 321 1274 566 -262
2800 -262 -690 16 534 1713 21 -860 -785 243 780 850 -302 -1002 -203 770 905 351 -703 -788 -39
2819 -39 1020 202 -563 -471 -506 566 862 203 -1026 -724 505 1039 1019 -439 -1006 -59 861 1087 215 -756
2839 -756 -883 -383 1328 893 -386 -799 -411 355 574 233 -1492 -416 30 526 393 -500 -787 -718 243
2858 243 946 -69 -609 -315 -89 1005 275 18 -360 -155 366 1336 338 -782 -995 157 400 995 600
2877 600 -802 -438 144 1057 -270 328 -872 -620 119 924 -225 -824 -284 91 695 364 -344 -905 -419
2896 -419 529 1092 425 -1265 -776 8 672 289 -263 -383 -218 266 688 35 -1234 -356 107 754 412
2915 412 -770 -845 -411 754 691 -261 -506 -1033 1020 733 391 -214 -731 -129 198 1188 -50 -802 -409
2934 -409 -70 781 136 -192 -542 -109 1133 553 555 -546 -936 -107 812 598 -29 -777 -520 205 1091 -38
2954 -38 -764 -711 -39 631 1139 271 -1177 388 678 1110 481 56 -1500 289 543 -184 -557 -96 -389
2973 -389 364 1289 -500 -530 -1185 393 1082 878 -527 -279 -698 604 413 731 -899 -764 -459 650
2991 650 348 50 -323 -740 758 1075 341 -1106 -150 -335 582 584 200 -1300 448 1141 336 211 -619
3010 -619 -518 79 1127 1145 -186 -613 -469 81 1041 430 -708 -752 279 976 1240 -38 -625 -695 492
3029 492 1264 327 -598 -619 71 1075 680 288 -269 -997 -196 335 100 -984 -1085 101 22 548 378 -808
3049 -808 -1250 761 425 275 -407 -186 299 30 199 -403 -754 -116 274 1362 -35 -104 98 -394 415
3068 415 266 355 -1120 -357 569 952 324 68 -1326 -677 571 1082 22 -372 -1355 -926 419 279 233
3087 233 -522 636 422 945 781 -308 -778 248 202 163 -188 -173 -1122 -84 475 -307 -209 -299 -386 112 750
3108 750 -468 -1867 -574 471 1022 646 -1006 -1023 26 966 369 143 -466 -1232 343 483 -100 -206
3126 -206 -678 -778 -488 1347 -20 -839 -370 149 743 413 45 -550 -216 372 462 -393 -141 -912 105
3145 105 1442 10 -925 -133 -235 397 907 348 -876 -588 381 982 400 -361 -998 -380 256 527 241
3164 241 -62 -823 -224 1113 624 -993 -741 -289 -188 562 504 -658 -575 553 700 866 205 -680 -607 799
3184 799 618 -459 -802 -510 -287 492 736 -854 -1103 -189 -90 966 247 -385 -714 -148 517 963 28
3203 28 -937 -444 241 429 79 -220 -302 0 307 680 -131 -747 -208 -152 533 469 46 -315 35 624 -37
3224 -37 644 -706 -295 737 1049 -260 -87 -713 -532 592 410 172 -303 -662 144 698 415 -389 -714
3243 -714 -335 257 104 -12 -616 -504 29 926 599 146 -685 -533 456 1013 4 -1289 -86 39 447
3262 447 343 -72 -473 -327 511 328 358 -558 -778 -188 204 -120 -263 -425 -477 547 804 -212 -282 -493
3282 -493 148 882 167 30 -832 -153 636 751 200 -606 -555 157 521 427 -74 -340 -759 279 499 -6
3302 -6 45 -910 38 420 454 -115 -879 -991 121 1013 -14 -492 -118 -251 1252 473 44 -886 -291 257
3322 257 381 174 -317 -615 -412 30 292 64 -815 120 187 539 87 -455 -127 261 250 660 39 -565 -691
3343 -691 657 841 256 -755 -381 -416 273 342 276 -156 -240 517 957 781 -309 -513 -793 700 463 31
3363 31 -314 -659 -279 941 324 -586 -597 -289 198 984 11 -731 -777 276 432 416 32 -861 18 222 504
3384 504 308 -355 -411 -285 438 140 -90 -602 -203 256 773 207 -579 -683 533 495 641 -110 -278 -8
3404 -8 691 989 158 -740 -398 210 123 363 -393 -553 -337 131 419 441 -828 -1095 -75 398 420 116 -758
3425 -758 -413 411 800 725 -432 -176 129 424 271 -29 -620 318 145 98 469 -431 -1003 -271 677 89
3445 89 -336 -237 -275 63 843 345 -767 -702 -545 340 842 -432 -608 76 468 833 165 -334 -904 135
3465 135 398 408 127 -726 -716 -12 623 161 -109 -283 71 422 1022 576 -341 -622 33 -79 370 -42 -548
3486 -548 34 334 729 141 -270 -757 112 424 -24 -26 -142 -335 258 558 252 -569 -369 -111 213 655 -72
3507 -72 -581 -284 302 842 134 56 -467 -87 562 407 40 -561 -121 -362 338 161 -593 -304 162 488 534
3528 534 601 -777 -640 298 307 -165 -60 -336 -168 558 142 -285 -779 -248 162 424 109 -669 -306 93 338
3549 338 107 84 -628 -380 153 603 51 -463 -606 -388 167 343 76 -630 28 -145 495 371 -161 -413
3569 -413 173 717 222 -563 -686 -599 198 462 137 -241 -445 -259 467 525 -118 -599 -264 188 214 609 -178
3590 -178 -803 -42 284 547 74 -124 -621 19 595 54 -288 -249 -257 114 318 -97 -412 -205 46 372 233
3611 233 -377 -807 -236 524 -92 -19 -88 -763 92 748 465 -216 -293 -235 70 662 105 -446 -381 11 155 655
3633 655 -73 -668 -456 179 364 494 120 -616 -154 644 244 215 -238 -359 35 321 106 -390 -373 -6 274
3654 274 99 367 -695 -116 569 748 133 -240 -506 -377 583 324 -379 -573 -147 -338 533 236 -579 -464
3674 -464 25 388 332 19 -567 -364 42 311 87 50 -471 -135 454 448 -84 -620 -116 50 526 218 -412
3695 -412 -432 -187 280 526 163 -209 -386 313 292 107 -100 -426 -302 350 400 -188 -72 -340 -101 299 586
3716 586 -152 -294 70 41 387 266 -161 -454 -62 481 125 -280 -373 -292 469 766 111 -409 -507 7 373
3737 373 536 -43 -410 -153 310 326 187 -206 -540 44 624 436 21 -291 -275 45 584 148 -137 -54 193
3758 193 453 464 -91 -492 -279 16 394 240 -353 -488 -93 441 397 -132 -185 -201 55 517 159 -238 -378
3779 -378 -131 354 297 -132 -377 -197 17 402 340 -8 -648 -232 343 519 -120 -258 -343 36 474 248 -197
3800 -197 -451 32 237 606 62 -542 -313 111 489 236 -212 -390 -51 380 411 -46 -334 -112 143 337
3820 337 169 -342 -314 -78 86 380 239 -348 -116 126 422 123 -111 -430 -277 276 400 200 -369 -354 -118
3841 -118 396 230 -44 -203 -222 -36 428 323 -370 -412 131 501 283 -53 -483 -308 312 543 287 -186 -112
3862 -112 97 527 523 -134 -361 -227 171 339 116 -323 -563 -186 330 291 68 -507 -277 162 563 85 -179
3883 -179 -350 -159 421 287 -69 -340 -224 68 359 101 -378 -67 113 415 222 -126 -101 -274 406 652
3903 652 -57 -193 -211 -38 275 198 234 -215 -337 142 483 512 -682 -360 -287 418 192 -108 -607 -136 221
3924 221 522 290 150 -368 -160 174 256 15 -397 -233 47 147 266 -79 -573 167 123 514 -90 -123 -503
3945 -503 19 282 333 -392 -376 -81 81 131 -29 -789 -699 145 319 258 -222 -532 -342 162 519 -68 -424 -573
3967 -573 123 383 255 -101 -298 -222 91 350 -193 -454 -247 231 591 126 100 -615 18 468 286 445 -176
3988 -176 -598 201 248 581 73 -513 -143 430 506 123 -402 -541 -93 682 463 -230 -237 -185 466 422 101 181
4010 181 -594 82 429 190 -213 -334 -332 202 377 179 -357 -347 -140 54 364 184 -369 -326 88 403 161
4031 161 -123 -327 -112 169 291 160 -322 -287 -140 326 275 -118 -417 -232 161 124 243 -344 -465 137 142 246
4053 246 -88 -380 -151 195 372 70 -126 -249 -198 136 273 31 -356 -229 247 396 268 -207 -459 -158
4073 -158 377 205 -180 -236 -218 232 279 153 -238 -267 14 83 219 -30 -382 -211 37 272 220 -146 -437 37
4095 37 341 198 -237 -306 -281 61 524 221 -197 -236 -153 193 305 -61 -364 -163 -50 177 145 -99 -298 -28
4117 -28 179 227 118 -181 -211 -11 430 336 -152 -234 -3 98 492 28 -581 -233 204 202 279 -71 -336 -234 314
4140 314 322 75 -92 -281 -46 415 300 -249 -191 -100 212 367 222 -443 -147 47 215 251 97 -399 -350 378
4162 378 201 108 -57 -63 6 285 197 -220 -269 126 209 338 285 -367 -279 240 200 177 14 -278 -249 150 292 -4
4186 -4 -19 -318 -198 294 259 -65 -318 -192 3 242 328 -243 -266 51 290 246 55 -241 -525 233 379 139
4208 139 -49 -270 -107 267 250 -191 -364 -182 22 324 206 -106 -240 28 141 204 130 -367 -464 237 379
4229 379 63 -56 -245 -184 236 236 76 -296 -177 47 120 338 -25 -589 -60 106 292 145 -42 -360 -21
4250 -21 277 142 -117 -289 -78 153 338 120 -339 -187 -67 223 428 -136 -291 -41 119 318 -31 -134
4270 -134 -327 -8 214 232 -72 -323 -114 262 214 7 -82 -240 -125 281 318 -49 -352 -38 396 246 89
4291 89 -197 -272 -126 380 225 -113 -254 -64 157 194 167 -92 -323 43 237 274 19 -257 -253 136 303 11
4313 11 16 -428 -249 269 168 -26 -208 -244 -41 156 -11 -43 -299 -53 224 177 187 -175 -199 136 374 160 -38
4336 -38 -209 -161 133 257 -134 -346 -201 222 251 183 32 -252 14 137 155 25 -246 -272 7 189 289 -25
4358 -25 -214 -30 160 263 48 -176 -287 129 227 295 38 -282 -300 118 222 171 -131 -120 110 169 64 -35 -153
4381 -153 -235 213 242 61 -193 -93 107 45 175 -56 -189 -338 65 275 216 -60 -353 19 269 196 41 -66
4403 -66 -332 -46 590 218 -19 -143 46 64 150 -76 -431 -25 507 10 -139 127 -369 -84 433 92 278
4424 278 -134 -268 17 14 354 -173 -300 -129 252 355 -33 -105 -250 275 -157 45 -688 -143 94 73 -94
4445 -94 -266 -82 -341 -5 557 230 -465 -548 155 -194 95 100 -29 -362 138 209 187 -64 -339 197 107 123 144
4468 144 -415 221 221 34 419 16 -382 156 -74 708 220 -461 -219 -321 143 281 -135 -250 -154 302 501
4489 501 -63 -156 -39 278 171 218 23 -345 30 209 206 84 -427 26 282 189 91 90 -305 -162 500 194 331
4512 331 11 -233 -261 246 112 375 -15 -70 -290 304 -23 -188 -427 212 348 95 277 -477 -21 -188 415
4533 415 -308 252 -180 -11 477 39 -371 -219 154 141 348 -62 -259 -347 607 -153 29 462 41 -13 346
4554 346 32 115 101 -539 -186 -15 148 -127 200 -444 -123 463 -59 -180 35 124 564 537 106 -507 -598 34
4576 34 330 412 -373 125 -99 336 534 430 -469 -740 330 96 428 -10 128 -301 295 185 -211 201
4596 201 -251 85 154 130 -151 -406 -122 -90 223 181 -255 -138 -209 249 227 46 -271 -17 207 287 60 -76
4618 -76 -117 -63 182 199 -53 -223 -119 -31 204 181 -189 -141 97 111 161 84 -305 -84 135 56 257 -122 -256 54
4642 54 285 62 -78 -52 20 70 150 362 -181 -222 -100 227 235 0 -294 -118 38 103 255 147 -172 -48 211
4665 211 158 -194 -62 -272 14 324 260 -177 -301 -189 -3 194 190 -282 -260 -27 85 200 11 -283 -75 8
4687 8 107 -198 -18 -125 61 20 451 -163 -431 -291 -181 -56 20 -29 -234 257 367 192 -56 -80 -35 -128 445
4710 445 -198 -156 -21 -290 113 342 32 -327 -88 97 320 -148 -427 -133 -52 94 310 -7 -69 -521 232
4731 232 232 73 -97 -4 132 -125 167 39 173 -166 256 41 197 -19 -486 -280 9 361 25 -419 -272
4752 -272 -79 61 399 -374 -438 -88 394 155 -81 21 -401 -37 -98 328 -34 -265 245 116 438 221 -93
4773 -93 -235 249 -24 19 -45 -265 -310 110 417 31 -234 -74 -4 10 97 -60 -56 114 297 -97 -99 -55 -280 -203
4797 -203 262 156 29 -415 104 -83 221 37 -70 -290 11 151 -99 -80 -357 13 185 283 26 24 -133
4818 -133 -153 -458 195 -124 -497 -23 323 300 377 -160 -283 -287 -257 134 -28 -234 -247 -179 42 -176 -219 -212 -41 -136
4842 -136 73 520 -449 -633 302 615 612 -254 -512 119 -121 483 119 268 62 269 269 369 340 -176 -158 156
4864 156 346 -556 -157 -12 552 239 275 -333 -370 94 -184 240 -363 -241 92 477 496 483 136 -229 -97
4885 -97 -580 -443 -286 150 227 -288 701 -196 -96 -634 -36 365 734 81 -727 -306 -15 7 166 -111 204
4906 204 -192 161 351 -733 -407 -520 -49 -174 345 204 -155 -241 -767 319 89 -45 -282 -269 -43 327
4926 327 -367 -49 -116 247 140 435 -411 95 -338 506 136 -231 129 -535 440 429 -396 -19 -641 489
4946 489 -332 -417 -284 -219 -79 85 390 425 13 -153 -49 342 253 -85 29 -34 -193 128 84 150 -25 -145
4968 -145 -92 164 -396 -52 -103 107 -236 -162 -279 -304 -143 125 497 -6 49 -219 -72 314 -85 -415 -427 -437
4990 -437 -114 287 -171 -366 -37 -295 -225 -19 48 111 83 199 -30 -191 -524 -662 -332 549 237 293 406 121
5012 121 25 172 -304 2 -97 18 462 226 319 -404 -341 480 167 -403 -174 135 -108 605 266 -450 -286
5033 -286 -198 -46 538 -51 -124 -295 -34 -202 422 -275 41 -229 121 348 -134 -421 -691 -251 -69 561 140
5054 140 39 86 438 677 508 -232 5 -131 43 -223 339 131 36 418 -51 -188 174 266 -317 -198 140
5075 140 506 -159 68 -144 6 315 -336 -238 -103 275 595 520 37 -106 -75 -324 296 643 -395 -449 867
5096 867 384 -491 -324 425 -140 328 -42 327 -430 -41 -90 -87 -16 -398 -121 511 39 330 -318 56 -122
5117 -122 83 755 73 -146 58 262 166 -79 -248 -66 -373 446 605 208 -613 -103 288 115 -150 222
5137 222 -16 -253 -163 125 234 213 32 39 -136 174 -179 127 -129 -193 198 120 -157 157 85 292 336 607 101
5160 101 -326 -78 64 60 -105 -126 -317 742 168 204 -374 -374 -147 81 -40 -130 -498 -16 236 309 -217 -13
5182 -13 210 73 287 304 -302 -4 138 415 520 -136 278 -262 263 -26 270 97 228 151 416 283 -83
5203 -83 -106 -472 101 238 607 -275 95 26 206 290 327 28 -279 131 32 404 114 -397 -77 -18 -403 245
5225 245 -314 -637 -50 -162 -186 249 -171 -538 -27 228 152 -508 -359 469 13 680 188 177 -296 -325 383
5246 383 253 -21 -542 -394 74 -32 2 -110 -558 226 268 338 268 -118 -187 238 27 -87 -33 187 365 16
5268 16 21 -22 -316 108 -141 14 -106 -553 -247 355 242 -369 102 -175 106 -348 455 181 -33 -32 340 -161
5290 -161 -161 -247 10 -33 427 -43 -125 -190 -22 114 -94 68 -3 -351 39 -48 -197 -46 -60 -326 -39 600 497
5313 497 -13 -404 -5 252 168 83 -310 -327 -3 436 479 -287 276 69 208 -203 212 -327 -192 399 253
5334 253 190 -81 281 234 120 105 10 126 155 -107 463 227 -43 188 -104 100 208 121 -151 71 272 -124
5356 -124 597 -376 -215 -505 -153 386 -15 -404 -341 -465 -51 163 173 8 -199 -33 -273 411 -161 -406 -202
5377 -202 -292 204 -204 -35 219 -315 31 53 -165 54 11 -12 500 -179 -317 125 -190 -160 264 145 217 101
5399 101 -182 231 -105 5 -140 -268 123 1027 263 -115 -318 -303 -152 155 104 124 17 202 124 544 -114
5420 -114 -273 -96 44 -189 285 310 168 95 533 -320 209 -73 220 -338 -643 -438 199 -631 57 934 -311
5441 -311 -18 118 394 54 -141 -292 -870 451 -18 -369 -580 -32 275 538 452 373 -319 -705 -152 374
5461 374 -9 312 10 -251 -16 -182 273 114 -150 -920 -64 103 53 -76 -372 -353 19 -404 -340 -806 -357
5482 -357 51 -221 25 332 -164 -213 521 371 -74 301 -545 -387 213 201 -138 -265 77 77 -311 -366 -32 -92
5504 -92 32 -177 -132 -3 316 -589 201 500 32 -409 262 191 22 -73 77 331 -76 -117 34 -439 -597 -232
5526 -232 191 -246 -531 19 -369 603 159 124 -212 -510 65 -63 254 248 294 -183 -423 -497 573 -412 65
5547 65 305 -386 35 104 -397 -210 -346 137 1114 -662 -398 274 -73 433 -160 -816 19 130 -485 -101
5567 -101 333 -153 -315 391 -433 605 -387 -197 -122 254 737 -343 285 101 419 1029 1037 413 915 401
5587 401 834 302 -801 -143 -78 -76 -39 559 -868 -315 -143 432 530 -93 -306 -232 99 263 -202 -218 -420 -198
5609 -198 29 653 136 -368 257 -61 158 -258 97 220 377 378 221 646 -775 -156 180 63 323 196
5629 196 -591 36 123 -68 -186 -550 -236 308 32 -124 -331 315 -93 -96 465 57 43 -188 116 255 -200
5650 -200 15 -81 -356 -97 218 632 85 459 365 -190 -98 154 -325 -159 -156 307 -114 22 229 29 -131 -12
5672 -12 83 -557 -42 54 318 208 151 -261 -158 442 124 -119 -254 -71 -480 -107 -793 389 94 660 -258
5693 -258 -139 79 -398 656 -153 -4 -43 -694 -510 -270 36 -50 428 64 32 -207 99 545 -382 -130 -38
5714 -38 22 0 301 27 350 661 -161 -175 -809 -217 108 30 -225 233 122 -276 577 305 -16 -298 -460 518
5736 518 210 360 432 -375 -515 622 253 15 -81 335 178 512 -333 -607 -770 432 3 444 -267 71
5756 71 72 -398 -162 -170 -318 -495 -59 47 -51 288 -153 -382 219 317 -345 156 42 -403 38 -88 -143 -345 192
5779 192 -321 -103 144 1 102 -27 142 -231 -413 -191 -70 -262 -470 -62 -36 352 -359 -193 -11 71 20
5800 20 163 -64 -392 179 -14 -121 0 267 108 217 185 -417 -203 -318 240 61 265 -279 95 -103 65
5821 65 -675 -386 -629 22 290 322 -743 -97 2 83 442 -19 -515 -31 535 -71 349 29 -678 -95 97
5842 97 243 -7 17 -523 -166 -319 25 55 -421 -156 333 -59 29 -289 35 82 -82 109 -223 470 -479 94
5864 94 -102 -164 77 -360 -84 467 687 -256 -274 -367 339 -120 137 -123 -166 41 43 -91 -173 158 -468 222 19
5887 19 52 10 370 -118 180 -346 1 -47 38 280 121 -250 504 -335 -87 214 341 -682 -58 -239 302
5908 302 366 -98 470 -40 -448 115 -20 114 -181 -361 391 380 158 110 252 -565 499 -208 -278 13 -31
5929 -31 -255 -112 278 -470 -284 390 61 777 94 -377 -99 129 160 -11 -152 -119 124 138 319 560 123
5950 123 168 -3 238 -42 -122 -334 139 -604 193 -309 -16 -118 -103 155 -88 -193 -332 187 -129 96 62
5971 62 125 -395 84 144 109 -60 -497 -158 422 425 19 58 -187 -349 303 6 -72 -493 -64 465 255 -136 25
5994 25 307 97 -123 -61 -553 -538 -42 -128 163 30 -158 -472 206 114 147 354 252 -69 -386 -141 120 -101
6016 -101 -395 247 -96 214 71 79 -23 112 230 140 116 213 66 -136 498 -2 -8 328 -245 227 -128 -270
6038 -270 -267 181 486 -77 62 -217 347 -13 443 269 -475 -41 -274 -362 -587 -13 219 322 48 -49 12 -34
6060 -34 -76 99 165 57 186 159 161 -359 45 52 -314 -329 -65 258 422 171 -4 -327 5 276 -207 -203 -295 86
6084 86 129 235 25 -92 -201 170 82 -80 45 -384 -117 -178 -62 -84 96 -155 -369 246 292 -29 -67 -265
6106 -265 238 50 104 -65 -25 261 54 49 122 -111 -8 -174 69 -173 -324 -323 -340 -174 200 129 46 29 -9 64
6130 64 -12 -34 -181 129 18 251 -154 73 -245 109 122 -76 -95 68 115 78 62 265 -133 -176 -33 141 214
6153 214 17 170 27 116 -4 -92 10 105 -158 177 -77 -357 -8 13 422 64 -16 -414 128 -139 143 -60
6175 -60 -325 -308 -337 -131 286 113 -56 167 -103 -136 -135 121 -145 18 128 14 92 -292 -234 -62 137 266 -174
6198 -174 -192 -368 7 161 -34 -270 -316 135 42 194 26 -82 -153 36 123 26 -79 -133 71 32 164 -190 -46
6221 -46 -168 39 202 84 -260 -118 38 31 5 -108 -131 -67 78 112 221 2 -95 -25 190 73 109 -76 -106 -32
6245 -32 172 -30 -30 -79 -38 26 138 0 -161 -237 -18 125 49 -87 -206 -118 290 30 1 -132 47 -4 79 -89
6269 -89 -82 50 -15 198 69 50 -117 -93 -25 182 230 -18 -24 -245 -179 240 -132 24 -184 33 162 63 -23 -222
6293 -222 -102 -44 87 -38 -223 -133 58 120 -7 -61 -120 18 112 -44 73 -72 -31 -56 75 55 -2 109 12 46
6317 46 141 4 -148 -163 -201 175 126 218 -143 133 243 247 28 140 -45 106 20 47 -94 -102 -315 29 -49 127
6341 127 67 -171 191 176 39 103 -2 -308 -178 58 61 -23 -90 -65 154 -72 16 -299 -99 248 -92 166 -42
6364 -42 -234 -231 122 26 -109 -260 -168 63 59 -113 -16 -401 186 63 48 -9 140 -6 -249 117 -182 -247 -48 44
6388 44 42 169 -34 -161 312 -222 -27 109 148 -24 -67 126 418 9 -5 -23 -42 110 249 47 -351 19 -346
6411 -346 -68 407 -346 -311 230 0 -482 -280 -226 -178 345 -97 -150 79 -605 504 211 84 -226 -193 135
6432 135 -19 225 -179 -433 312 5 -25 -15 229 163 166 99 37 327 19 -323 221 522 323 -177 -86 -107 144
6455 144 19 146 -380 41 -15 20 68 137 -125 59 124 167 61 -40 -72 118 107 34 114 -23 -109 136 230 6
6479 6 -17 -77 -210 54 1 -67 -89 -131 -109 331 153 -65 -126 -114 128 73 -55 -181 -103 197 67 63 55 -92 -30 170
6505 170 73 83 -87 -40 -84 136 249 -158 -49 36 198 47 42 -53 -7 38 149 138 53 1 -4 49 131 132 -45 -104 30
6532 30 -31 87 -142 61 -73 -66 155 45 -133 -137 69 166 -1 34 -126 -115 209 76 47 -61 81 -90 105
6555 105 131 -35 -227 57 -27 89 128 -173 -13 11 13 140 -167 -51 28 57 45 53 -128 -179 64 58 -2 -42 -189
6580 -189 -104 65 89 42 -148 -14 32 17 105 -86 -257 -174 -78 37 109 -60 -213 -85 148 65 21 -45 -146 73
6604 73 29 216 18 -125 146 -128 72 -65 -8 -33 10 189 42 -50 -183 139 -6 -13 -3 75 -100 -4 58 238
6628 238 -18 13 -18 58 55 185 -23 -23 68 162 107 17 -74 -15 -50 176 -128 -112 -61 -70 42 -105 -60 -87 -107 8 194
6655 194 -96 -160 -80 -193 197 153 92 37 -152 105 71 73 -93 -172 101 223 2 36 -136 -132 30 57 16 26 -144
6680 -144 -46 220 62 -102 -97 -98 81 122 140 -163 -101 -144 124 57 -87 -85 -76 5 147 46 -307 -296 -11 32 304 -60
6706 -60 -164 -145 110 91 -110 53 23 -98 110 115 -86 -169 38 54 186 -20 -97 -152 -110 75 197 -63 -86 36
6730 36 65 225 16 -45 -88 56 16 54 62 -145 -135 59 159 65 -32 -70 -59 113 129 31 -44 -138 53 14 -6 10 -116
6757 -116 -256 122 13 97 -86 -64 57 46 117 72 -31 -255 60 80 77 -34 -313 -29 19 42 -40 -50 101 62
6781 62 -72 -5 -189 -38 -54 106 102 -80 -2 -79 85 81 87 -61 45 104 199 135 -161 -131 -10 -135 148 133 -74
6806 -74 -225 20 187 250 188 -146 -51 -8 99 41 -269 -212 -9 -84 39 -19 -44 -184 -42 172 265 29 -124 16
6830 16 167 216 94 -78 -88 -115 99 66 25 -95 165 24 93 129 9 -97 155 304 165 -123 -403 35 -21
6853 -21 99 36 126 -78 -61 110 65 -32 -29 43 33 180 151 -82 -310 89 101 13 -18 -96 -67 13 158 177 122 67 30
6880 30 -5 43 -15 -34 -54 14 24 89 -105 -143 73 30 -47 105 0 -17 21 120 12 -126 -103 -3 67 -30 -6 -119
6906 -119 -78 152 -7 77 -83 -85 -9 30 -93 35 -66 -22 129 145 -29 51 3 -66 192 246 43 -85 53 18
6930 18 142 5 41 -64 4 133 40 -12 -77 -53 67 108 -23 -129 -98 -180 95 156 51 -161 50 -13 93 -141
6954 -141 116 -75 -150 257 12 193 -212 -58 88 230 38 -22 -39 122 55 177 26 -101 -18 5 17 234
6976 234 152 -48 -136 22 192 54 -23 -161 1 -18 80 -250 -35 -115 41 167 38 -54 -13 39 6 -52 96 -199
7000 -199 -162 116 229 186 -77 -157 -65 210 62 -71 -83 -96 44 113 4 -52 17 31 46 99 -95 30 -66 -55 117
7025 117 139 -162 -168 -107 13 -15 63 94 51 49 -4 273 149 -237 177 -149 -37 -165 160 88 167 209 32 -332 -251
7050 -251 99 -21 294 -96 149 -430 -23 35 45 -293 -273 -53 -45 155 -65 -101 -67 5 83 201 15 -52 29 156
7074 156 249 -88 -239 -37 -5 97 67 61 -44 128 186 13 202 -74 -72 -28 249 40 112 0 -63 -35 26 86 73
7099 73 -156 -86 88 46 110 37 6 187 91 22 -35 -73 39 210 110 22 -164 -3 186 -48 49 -174 -111 66
7123 66 83 36 204 -143 53 9 142 -96 170 -119 -197 4 241 -108 83 -187 -231 162 -124 16 -305 49
7145 49 205 -119 329 -180 -158 -53 267 10 6 -113 333 77 -5 -193 -391 -193 74 47 -257 -194 -62 -241
7167 -241 -74 -165 96 -10 -209 242 79 -49 192 -158 81 199 176 -64 -8 -167 89 199 159 116 -225 -140
7189 -140 192 214 -26 18 40 -5 126 190 -117 -2 -15 164 79 180 4 -113 99 146 -4 -80 41 -61 206
7212 206 111 -10 -48 -54 -79 -31 22 -129 39 30 -7 186 79 -60 -118 -11 -59 -106 5 -157 -243 146 159 -50 16
7237 16 395 -324 -292 -48 -112 -126 -122 75 165 -105 -170 46 302 -143 79 -236 436 272 301 -89 187 231 -459
7260 -459 122 199 304 86 136 -221 68 178 220 -170 -171 132 77 184 181 -51 -202 64 -43 -119 153 -9 -173
7283 -173 73 221 113 -203 -93 118 101 89 -194 -182 120 -22 176 -205 -62 -31 38 234 -17 -355 -59 -38
7305 -38 60 94 -66 148 -89 -68 226 -117 71 -91 -198 36 337 248 -152 -360 -221 379 -44 -6 -63 167
7327 167 248 -241 194 -177 -309 -140 -46 33 202 -36 76 -82 -22 -142 186 549 290 -25 351 -157 7
7348 7 -132 -77 134 176 -400 -82 -277 259 10 -158 -11 -30 -48 -385 279 -148 38 216 163 26 -275 -82
7370 -82 -158 375 196 -186 -341 313 -149 -206 -268 -86 28 -23 223 87 -286 315 -381 -92 -426 259 1 -826
7392 -826 -440 -130 -569 187 219 5 -81 96 276 -59 -264 269 -423 362 112 -12 247 152 190 40 -248
7413 -248 241 -104 3 113 93 132 -255 -69 -11 215 64 -90 -67 -249 504 95 -26 -163 -285 -116 5
7434 5 134 -132 -139 -3 199 157 101 32 70 239 323 -62 -155 14 -121 168 71 -19 -75 -116 40 93 -30 -188 -2
7459 -2 226 167 237 -239 299 -191 113 133 35 317 -380 38 92 171 -61 -51 47 304 -214 364 -133 -174 390 46
7483 46 39 6 112 -110 -25 118 4 -379 -98 -439 1 -217 170 -257 -87 -217 115 -4 -450 -16 -30 -44
7505 -44 187 -181 -119 -268 80 48 97 87 118 -47 74 -186 126 43 -10 -226 331 114 66 191 117 252 -71
7528 -71 154 -226 -71 103 99 130 47 -110 -407 -194 -145 -126 -362 -109 -133 -324 -83 -134 -84 50 -134 -96 267 160
7552 160 -232 -166 164 123 -100 171 -180 2 259 199 14 100 123 108 388 -4 -428 -219 363 388 191 -194
7574 -194 259 103 -221 -83 266 -413 -274 -2 -212 75 -35 68 5 46 111 160 -77 -117 95 86 184 12 27
7597 27 97 -164 -1 -46 129 226 12 -122 -85 64 -206 1 70 405 -8 -185 -191 81 92 -49 261 -131 18
7620 18 332 158 -168 23 -215 379 199 -104 -204 -347 -95 237 -77 -107 224 216 169 2 4 -264 1 371
7642 371 93 229 26 126 60 255 -88 11 -372 209 212 -83 70 -36 -133 33 177 25 86 -5 -184 315
7664 315 -94 12 33 -29 13 121 66 187 -482 -45 108 -85 63 68 -126 -118 -42 88 8 -11 -124 -166 -17 37
7688 37 -103 -210 -60 -21 60 187 96 -268 -99 99 234 414 -15 69 -286 324 -70 21 6 -13 240 217 -142
7711 -142 -191 -203 -121 181 107 -63 117 -102 127 218 -41 45 124 -146 -257 217 181 -150 -111 153 38 89 199
7734 199 156 117 57 -54 -38 -32 -46 -36 114 251 172 115 190 -47 252 -83 -107 -22 308 -56 -31 116 147 28 12
7759 12 -153 -108 -252 -295 614 396 157 -574 299 949 267 237 -1077 -441 -117 -65 578 5 -147 68 262
7780 262 -98 -541 -328 -64 -342 432 298 -27 -378 234 57 74 171 -276 72 -217 -482 -6 -169 320 92
7801 92 73 346 164 -401 -79 -218 231 -216 -371 137 -298 -295 -215 -263 297 -59 -22 -5 142 629 -308 -16 -381
7824 -381 -320 -275 -117 -180 -124 -71 282 22 94 180 347 -70 301 -335 81 -209 -2 16 67 -301 -152 -77 143
7847 143 83 73 26 -479 -32 114 126 87 47 31 -376 55 171 -406 -60 188 142 428 4 -54 -438 25 112
7870 112 -232 -40 272 -561 88 -200 324 -388 -76 -83 -212 11 -20 -126 238 139 -57 -131 2 33 -30 334
7892 334 -238 268 -203 246 277 206 45 -114 168 -57 42 494 152 -32 -125 184 331 103 154 -57 -211 -78
7914 -78 158 273 -38 330 44 -105 59 -193 52 101 54 312 134 -144 -69 344 200 284 -286 -59 -100 197
7936 197 42 -4 100 91 -106 269 -30 -109 -77 229 189 -49 21 -71 -18 165 -29 131 -72 -39 182 -17 -3 -265
7960 -265 -315 -239 139 118 -10 144 -54 -164 -132 -151 -152 -110 -188 95 -330 154 47 118 -25 412 17 -241 140
7983 140 34 -154 16 -110 6 -110 -283 264 20 -91 0 -60 -8 189 -59 13 32 9 172 78 -315 -51
8005 -51 -128 45 -183 215 -27 33 -233 -95 225 -130 -99 -217 387 -44 -121 -201 -32 280 172 75 -74 93
8027 93 67 -15 39 -5 197 -163 61 185 241 93 -150 -86 -262 35 13 61 84 -180 -173 79 120 -133 -62 84 -154
8052 -154 -266 357 456 418 -421 93 160 -564 -304 29 116 93 -57 -46 175 192 199 150 186 58 -142 379 238 -143
8076 -143 -348 159 144 -62 152 -173 -110 -97 -36 175 -291 -115 -48 -119 314 30 -226 223 -119 -378 -136 -14
8098 -14 -190 -23 -139 213 101 19 122 140 200 -3 347 147 0 198 84 -173 -29 -235 -228 21 -95 465
8120 465 98 18 -290 263 -148 -374 262 265 -88 -117 340 175 -12 64 -116 -22 -555 88 191 -326 6 143
8142 143 -38 -176 -243 -170 -294 234 -506 175 30 50 -213 -650 70 170 2 219 -12 -532 -62 -335 392
8163 392 -12 138 -920 -402 153 572 541 -639 -313 -3 307 167 -287 -211 -229 303 240 -113 -390 -328 42
8184 42 -142 36 -138 -595 -254 16 240
8191B40
$$ Imaginary data points
##PAGE= N=2
##DATA TABLE= (X++(I..I)), XYDATA
0 0 0 0 0 0 0 0 8 0 8 -8 8 -16 16 -18 24 -26 34 -42 50 -62 72 -88 102 -119 143 -164 189 -218 249 -287 326
31 326 -370 420 -473 534 -599 669 -752 835 -929 1033 -1145 1268 -1401 1549 -1709 1883
47 1883 -2075 2284 -2518 2773 -3054 3371 -3724 4120 -4574 5091 -5692 6400 -7246 8278
61 8278 -9572 11240 -13477 16638 -21435 29492 -45424 88423 -455999 -1011523 227098
72 227098 -74910 -165779 785491 366013 -306453 144795 -83724 -413156 -67160 -194287
82 -194287 -213993 425969 449699 189663 90042 -322401 -412526 -149839 -229189 96992 550690
93 550690 208053 32537 177629 -270821 -505166 -184247 -9658 238083 372038 81675
103 81675 87076 57023 -331784 -188946 13503 -265762 -3529 404987 224506 245139 106996
114 106996 -517686 -397361 -5266 -116766 249549 526752 -17754 -68834 95882 -326151
124 -326151 -204134 90198 -251747 39086 535761 57927 -56378 225021 -320269 -488120
134 -488120 87195 43006 -11218 386840 222065 -78812 -15673 -231902 -343870 -8306
144 -8306 101301 108650 248690 139327 -33982 -84271 -180112 -151431 -69313 -60732 150606 299221
156 299221 130090 31506 -86258 -298035 -180393 -2989 11554 223134 259062 -24987
166 -24987 -5612 5435 -272683 -179884 49294 -10686 138631 280499 34932 -40414 -34132
177 -34132 -250019 -165872 60047 5745 118710 270517 53284 -59596 -60960 -246268 -166143
188 -166143 91232 62819 104518 223423 24782 -106884 -32272 -137308 -182794 6616 90659
199 90659 120117 191065 81501 -95890 -142016 -143545 -94177 26225 105135 123704 100005 45340
211 45340 -19926 -119793 -168693 -83097 10377 86655 178451 127799 -18295 -66056 -103841 -140298
223 -140298 -47358 37422 55086 127860 133483 11632 -64923 -112725 -152709 -60145 66202 99544
235 99544 115120 90738 -8673 -71015 -91988 -112490 -62075 39312 99640 122223 93540 -6972
247 -6972 -99190 -115237 -82618 -27551 45602 95299 92593 63089 13506 -69584 -121278 -96473
259 -96473 -36158 48436 129175 109926 29772 -22371 -78662 -110164 -56641 -4249 26889 91970
271 91970 106052 42052 -13817 -74865 -122266 -72494 6963 55049 98812 88669 22739 -24665
283 -24665 -73972 -106010 -56181 5051 51476 105686 86178 3909 -39050 -69767 -90143 -42185
295 -42185 11517 42300 86275 82447 23358 -29571 -88640 -106235 -37882 27816 66857 97379
307 97379 55110 -14915 -34635 -63193 -80997 -29231 15478 45083 92157 72386 -2705 -45480
319 -45480 -79679 -83755 -17041 36092 55506 78220 51599 -8512 -39165 -72041 -81454 -18578
331 -18578 41202 64232 76700 39946 -24420 -48706 -57097 -55154 -16542 21058 51493 80507
343 80507 53933 -14504 -59350 -81171 -65845 4771 59465 60831 47030 20797 -19116 -42496
355 -42496 -51409 -51445 -20507 32665 69348 68168 30369 -27352 -68194 -64805 -30403 8401 39294
368 39294 54733 47402 22549 -15952 -55002 -65578 -39625 6298 52482 66707 40130 3128
380 3128 -28204 -47762 -43044 -28215 -3622 37976 60026 49669 22228 -33182 -76222 -51670
392 -51670 -11834 16126 55589 52065 10911 5327 -10791 -53345 -44636 -21805 -6192 52828 74108
405 74108 23426 -2683 -34474 -73965 -26963 13961 -3793 34641 61326 8914 3813 -1944
417 -1944 -72659 -58949 8364 14948 46280 68707 2619 -25611 -14507 -48572 -36633 8613
429 8613 5496 32901 64305 17094 -17107 -27342 -58318 -32940 18539 19516 32023 41790 9897
442 9897 -3106 -21873 -56019 -33357 -1316 19771 67904 48222 -20021 -16763 -28626 -55651
454 -55651 6059 23450 -15723 35773 51299 -8972 7735 -13417 -87347 -22853 36337 3377
466 3377 54275 62062 -43243 -28398 3820 -62574 -18833 47472 -3441 25476 66011 -26232
478 -26232 -40433 4415 -44070 -25707 42134 5972 7136 55459 5973 -30965 -18450 -51807
490 -51807 -35953 39652 50560 32035 16024 -26533 -37422 -15971 -6150 5468 2138 1149 31505
503 31505 27350 2936 -640 -45024 -60530 12544 28438 15260 57253 15190 -52093 -5588
515 -5588 -11756 -54611 22719 40716 -15436 40077 35453 -58020 -13421 17461 -51914 -47 46313
528 46313 -22368 19104 67849 -27313 -42809 -2812 -55069 -17260 79252 35007 -6702 12752
540 12752 -34490 -43699 20511 6656 -21839 13316 15541 5422 31942 12694 -42798 -43281 -11716
553 -11716 5379 26741 43763 18644 -20233 -17371 -13875 -30732 -3292 27421 4847 13353 35484
566 35484 -17547 -33398 12436 -14165 -31771 23846 12715 -9068 46321 24045 -43566 -19530
578 -19530 -20700 -41325 38786 65131 -8920 -3796 6921 -46439 -13726 36181 -16887 -21355 31835
591 31835 8223 1673 37515 -13430 -60930 -9071 9361 -4822 39245 39856 -21644 -16852 1231
604 1231 -31783 -14787 25311 3179 4575 34166 -5680 -27714 9772 -6122 -30446 9571
616 9571 10913 -9083 31050 31991 -21019 -21145 -19415 -33982 13879 48707 9875 -1533 3473 -27287
630 -27287 -17752 17241 -1715 -17525 10259 13614 6323 19759 3754 -34457 -25505 2503 823
643 823 12988 35806 7466 -20994 -581 -9532 -32707 6233 24468 -5295 15784 23741 -26175
656 -26175 -12294 16980 -23728 -14213 23788 -7716 2432 44937 -3039 -30726 -1801 -27576
668 -27576 -17921 45539 19553 -12429 17793 -10623 -32807 15860 4202 -28060 11952 18378
680 18378 -2817 20006 6105 -28874 -11184 -2132 -8363 14929 16231 1977 8670 -1199 -15985
693 -15985 -12120 -13614 1080 21905 9397 4817 4812 -18034 -7798 7774 -14278 -5006 14877 -2075
707 -2075 14118 26478 -22008 -22597 3240 -19777 3017 39631 -4913 -11011 21899 -14841 -18924
720 -18924 16495 -17147 -18187 32300 10141 -4191 19908 -17601 -30399 13596 -729 -10202
732 -10202 23725 2592 -9995 21529 -2710 -26961 -1411 -6138 -3942 28912 11587 -9358
744 -9358 2702 -11148 -12757 8632 -5855 -8230 15680 7852 6057 10717 -20127 -20075 5332 -3024
758 -3024 6790 22102 -8223 -6652 15905 -9771 -13433 3165 -15929 -234 33099 5356 -6082
771 -6082 4783 -23066 -13763 20756 -2712 -7700 16739 -1089 -1807 17430 -12787 -22816 3859
784 3859 -2652 4791 26455 -1028 -13455 5249 -8609 -10627 9545 -4593 -5236 18832 6656
797 6656 -3280 2269 -16003 -13610 11343 2918 480 11696 -2380 -3501 9583 -7885 -14680 -1203
811 -1203 -2424 9386 20985 -373 -10450 -4101 -11016 -332 12023 -5605 -4154 11135 2254
824 2254 3436 5655 -17807 -15527 6885 4944 8410 13110 -7247 -8902 4973 -5011 -6699 3052
838 3052 -3922 2962 16947 2859 -7947 -4831 -10583 -3009 10399 1556 -2087 5992 1409 1286
852 1286 2928 -11571 -13247 2477 8495 11355 10103 -7185 -12245 -1648 446 1380 2595 -3998
866 -3998 -1128 9437 8269 -233 -9182 -14420 -4288 8150 9730 6658 -1125 -8454 -1100 2880
880 2880 -3419 -3813 -2307 -575 11228 11613 -4294 -8477 -5864 -6171 4152 9434 -1507 -3140 4608
895 4608 3018 754 -2531 -11317 -7508 6926 11217 6060 1036 -7477 -8462 1621 4840 -1221 -3203
910 -3203 -135 3656 8409 5633 -7786 -12559 -3466 3160 6395 8223 763 -7329 -602 4032 -2088
925 -2088 -3662 -4258 -3675 8126 12852 -105 -6160 -5235 -7840 -337 10644 1477 -5626 3521 3694
940 3694 -429 2353 -5926 -12056 1781 10240 4186 3423 -512 -9379 -2987 4833 -2679 -4070 2897
955 2897 2539 3931 7718 -4315 -13686 -2074 3867 2628 5978 1575 -8046 336 8502 -1651 -6170
970 -6170 -3322 -5830 3181 16019 5291 -8628 -5979 -5747 -3444 9855 6112 -7286 -198 5541
984 5541 -1676 1731 2661 -10609 -5397 10108 2945 -526 6720 -3766 -8031 5688 -1033 -10442
998 -10442 5289 8209 -1261 6404 1436 -16654 -3675 10221 -166 2703 4832 -11190 -3115
1011 -3115 14965 1305 -7790 -1556 -9400 -4542 17959 10501 -7194 -4456 -6923 -7931 8566 9684
1025 9684 -5159 -2320 2921 -2832 1653 5196 -6389 -6451 5062 2903 -2113 4849 3465 -4988 469
1040 469 1173 -10039 -3449 10918 4952 1568 3709 -12291 -12892 10784 7963 -4046 4892 -4976
1054 -4976 -12839 12433 13503 -10577 -3840 -1655 -12731 10265 20668 -6621 -6592 1908 -13736 -146
1068 -146 17013 -4591 -6242 9784 -4878 -6388 9934 -3415 -9250 8122 1782 -6824 5263
1081 5263 2619 -3740 4891 884 -10778 -4208 4645 5519 7162 2364 -9364 -10763 1547 9087
1095 9087 3814 -935 -2930 -8029 261 13999 2066 -9903 -2552 -5102 -2698 16938 5916 -12328
1109 -12328 745 -429 -10222 10037 8529 -13095 3585 9901 -10515 590 7402 -12140 955
1122 955 12305 -9004 -3319 10394 -5767 567 11248 -10855 -11611 8552 2256 2346 11238 -6521
1136 -6521 -14155 2854 3569 1281 5600 -3563 -7822 2598 6705 1990 -2073 -6314 -4440 1608 6209
1151 6209 6786 -2486 -6652 368 -342 -1752 5300 -1868 -5377 7970 3084 -6405 2499 -1804 -7732
1166 -7732 9091 5373 -9900 3078 5009 -7214 6666 4967 -15282 -1796 10646 -2124 4254
1179 4254 5895 -13437 -5074 9890 -839 198 4310 -8791 -2368 11240 -136 -4796 173
1192 173 -5688 -1906 9539 1958 -4622 -462 -2146 -380 3259 -462 -3505 -192 1812 4097 1090
1207 1090 -3706 -2393 -2069 1616 5652 -1945 -5894 2116 1233 -808 3939 -3740 -9315 3776 6203
1222 6203 -371 2588 -2659 -8622 3605 6278 -4131 341 20 -5818 6092 7666 -6166 -4438
1236 -4438 403 -3786 4090 7443 -6369 -4840 2353 -357 1138 3174 -6193 -3466 4155 3818 769
1251 769 -177 -5326 -4026 4280 3494 63 -1846 -1734 -168 3375 1590 -2549 -5217 -1537 3806 3989
1267 3989 1456 -1489 -4276 -886 4068 896 -2198 -1131 -906 1992 5345 -665 -5450 -2066 273
1282 273 2427 5240 -827 -5608 -837 2303 1412 1924 -2979 -5250 1376 5762 1915 -341 -3182 -4789
1298 -4789 847 5478 1618 -2010 -2413 -1011 2312 3474 -648 -3965 -2203 1780 2119 2523 -975 -4122
1314 -4122 -858 3375 1535 -1306 -1033 -1722 1035 4437 665 -4229 -3082 -973 2592 4091 295
1329 295 -4431 -1021 1543 2119 1884 -1850 -5571 -31 4500 2930 729 -2905 -4045 418 2936 2139
1345 2139 -80 -2436 -1708 2493 3033 -658 -2883 -2350 724 4011 2329 -905 -2760 -2215 1392 3287
1361 3287 -871 -2675 -581 1219 3229 2335 -3629 -4690 -466 2157 3180 2167 -4193 -2610 2385
1376 2385 1614 720 -103 -4857 -2509 5649 3991 -761 -2196 -4191 -1600 4767 2421 -2519 -1690 -1067
1392 -1067 573 4505 302 -4697 -2306 823 2387 2989 -277 -3455 -1849 1737 2356 474 -2699
1407 -2699 -2361 802 3163 2445 -1049 -4436 -1294 1757 1630 1959 -1320 -4105 588 3823 29 -773
1423 -773 -2069 -4068 2014 5725 -186 -2679 -1356 -2433 1945 5134 -2423 -4482 729 561 1608
1438 1608 4042 -3098 -6083 966 3610 1637 2253 -1955 -5007 2012 4364 -453 -1204 -1324 -2315 1993
1454 1993 5157 -444 -4473 -915 396 475 3158 114 -3922 278 3475 56 -1072 -844 -3232 508
1470 508 5379 393 -3100 -611 -1190 -135 5054 -17 -6356 -69 3450 476 2909 51 -7281
1485 -7281 -1785 5158 1394 981 1027 -4722 -2702 5743 1520 -3160 490 -1509 -2086 5053 2559 -5117
1501 -5117 -1384 1294 -1433 1516 3083 -4623 -1317 4764 -333 -2834 1113 -2601 -2001 5933 1514
1516 1514 -4779 -214 711 -1523 4159 2375 -6899 -2119 4513 787 2278 1692 -6684 -4338 5133
1531 5133 2192 -452 1367 -3410 -4207 4444 3685 -3018 -817 260 -2579 3223 4546 -3501 -2790 1864
1547 1864 -974 -720 3642 -1002 -3450 4109 1764 -3809 -341 694 -2829 3555 4207 -5355 -3097
1562 -3097 2533 -467 1624 4363 -5368 -5902 4429 3415 61 3177 -3760 -7673 3770 6025 -1372
1577 -1372 1046 -1105 -6123 2348 6407 -2111 -1992 1562 -2818 114 5561 -1380 -3503 2369 635
1592 635 -2401 2020 524 -3082 2601 3538 -2525 -1683 957 -1226 2169 4802 -2408 -4862 869 1733
1608 1733 1098 3639 -1498 -7248 678 4424 1066 1494 -481 -6701 -825 6311 737 -594 672
1623 672 -3492 -1646 5498 1156 -3399 600 -288 -2193 3598 894 -4151 726 3111 -2077 103
1638 103 1177 -3077 964 5261 -324 -3479 -127 -1173 458 5302 262 -5169 -1110 1356 990
1653 990 3155 78 -5932 -2089 3778 1825 782 729 -4331 -2211 4231 2198 -1509 -313 -1474 -2062
1669 -2062 3386 2000 -3334 -671 1688 -1173 1659 1884 -3397 -834 3387 420 -1078 -18 -2211
1684 -2211 -873 4235 2103 -3329 -1743 -378 -132 3731 2168 -3386 -2884 1559 780 2225 1786 -3851
1700 -3851 -2913 2359 2228 -245 760 -2696 -2980 2853 3198 -2159 -852 -538 -1861 2942 2680 -3448
1716 -3448 -2133 1754 301 1557 1723 -3352 -2951 2175 1415 94 -86 -3260 -1805 2905 2276 -1005
1732 -1005 -1073 -1762 -568 3108 2235 -2095 -2429 236 1253 1927 44 -1788 -2959 826 2149 1417 -754
1749 -754 -2365 -1417 1066 2475 -523 -1719 -856 -68 945 2418 -986 -3822 -110 2561 1423 1906
1765 1906 -928 -3652 291 2824 206 149 -719 -2847 2128 3676 -942 -1123 -844 -1549 1938 3478
1781 3478 -1999 -2944 212 513 2327 2082 -2943 -2534 1617 1065 2111 606 -2976 -1493 2055 2213
1797 2213 313 -1372 -2743 47 2554 1896 -262 -2216 -2413 2005 2866 432 -1525 -2074 -1246 2796
1813 2796 2367 -1136 -910 -1388 -509 3073 1750 -2381 -1398 17 188 2696 542 -2762 -629 1123
1829 1123 731 1908 -383 -3676 216 2673 305 123 -545 -2522 903 3261 568 -1194 -1354 -1456
1845 -1456 2262 2676 -330 -2363 -1104 -545 2266 2661 -1449 -1969 -123 807 2391 593 -2426 -1438
1861 -1438 628 1259 1969 -350 -2791 -913 1629 1240 626 -1356 -2321 380 1931 433 -321 -1797
1877 -1797 -1649 2284 2175 -700 -1243 -1135 -632 2564 1883 -1867 -1536 -390 706 2734 862 -3008 -1308
1894 -1308 671 797 1843 -216 -3184 -1162 1794 1485 617 -1149 -2378 102 2839 1398 -413 -1392
1910 -1392 -1697 1025 1984 517 -1294 -1668 -590 1635 1425 -528 -1653 -1434 478 2382 862 -1623
1926 -1623 -1371 -483 1102 2186 -467 -2375 -366 559 1524 1771 -1565 -3097 494 1904 665 493
1942 493 -1471 -2573 1234 2616 -48 -1056 -1278 -1224 2226 2848 -820 -2236 -971 -77 1930 2242 -1251
1959 -1251 -2966 -90 1547 1248 540 -1253 -2759 273 2643 820 -822 -1175 -1464 517 2615 -8
1975 -8 -2126 -418 460 408 1827 -337 -3070 82 2333 512 113 -463 -2220 -158 3105 521 -1748
1992 -1748 -687 -1059 557 3751 4 -3203 -526 517 836 2553 155 -3710 -1152 2252 887
2007 887 666 111 -3153 -987 2962 805 -1003 -137 -1533 -1181 2257 773 -2256 -45 890 -550
2023 -550 959 842 -2571 -535 2698 569 -373 349 -2535 -771 4085 671 -2291 -479 -929 -715
2039 -715 4063 2171 -3567 -1951 907 832 2049 1545 -3435 -2193 2090 1242 764 661 -2613 -2695 2331
2056 2331 1630 -1009 70 -297 -1599 1669 1770 -2112 -1168 2048 261 288 1124 -1992 -1611 2307 1754
2073 1754 -967 -449 -1741 -2122 2435 2987 -2472 -2152 -413 -1049 2388 3029 -2264 -3145 520 873 1098
2090 1098 2775 -1559 -3082 1566 1875 -448 1091 -695 -2461 999 3173 -1827 -1331 511 -733
2105 -733 197 2616 -1296 -2311 1398 933 -462 1149 -1524 -2899 1848 2250 -582 -448 -593 -2574
2121 -2574 1184 3837 -717 -2540 -322 -548 937 3528 -388 -3234 -190 1042 686 1755 -195
2136 -195 -3102 360 2457 147 -347 -261 -1647 -141 2788 306 -1911 -34 117 45 1575 37 -2921
2153 -2921 171 1905 -289 221 36 -2782 -286 3260 361 -1442 -93 -1543 -331 3437 656
2168 656 -2579 -826 152 176 2768 288 -3182 -735 1464 283 1208 755 -2554 -766 2300 880
2184 880 -649 -174 -1356 -385 2137 806 -1640 -888 119 210 1673 439 -2275 -1157 1427 1193 48
2201 48 -47 -1863 -1195 1936 2074 -1287 -1176 -621 -369 2146 1835 -1795 -2216 568 200 1584 1411 -2153
2219 -2153 -1957 1327 1246 72 520 -1673 -1444 1874 1531 -472 -342 -837 -1002 2006 1818 -1663 -1088 376
2237 376 130 1717 1163 -2029 -1912 828 1228 1073 83 -1669 -1276 1107 1714 -180 -661 -1015 -399 1567
2255 1567 1625 -716 -2078 -786 701 1093 1065 -916 -1781 -31 1659 675 -51 -1138 -1624 501 1928
2272 1928 122 -1478 -901 -692 1053 2038 -334 -2011 -612 855 741 1128 -697 -1808 -71 1545
2288 1545 1115 231 -1396 -1627 864 1368 158 -645 -1093 -731 1110 1566 -461 -1288 -486 140 1102 693
2306 693 -922 -1090 -112 1287 1316 212 -1356 -808 424 1611 1141 -833 -1508 -250 665 1634 345
2323 345 -1501 -1278 348 1376 878 -129 -1614 -856 1185 1374 268 -947 -1228 -237 1296 892 -577
2340 -577 -1281 -591 636 1527 212 -1411 -1060 362 1359 1098 -665 -1420 -514 1102 1426 283 -1117
2357 -1117 -1396 58 1429 862 -633 -1747 -739 1007 1667 477 -954 -1568 -249 1489 666 -325
2373 -325 -1722 -698 1036 1189 514 -1044 -1124 -352 876 1449 -578 -1585 -438 633 1435 1119 -734
2390 -734 -1553 73 1207 667 65 -1186 -1024 353 1525 364 -631 -1185 -688 910 1446 -424 -1934
2407 -1934 -620 420 1142 1087 -931 -1456 -304 1121 740 123 -606 -1207 701 2005 491 -1091 -1512
2424 -1512 -340 644 1592 -434 -1272 -419 585 868 1140 -958 -1506 -215 796 295 704 -1253 -1728
2441 -1728 260 1574 670 -816 -845 -836 844 1205 -63 -980 -983 -48 1515 1005 -846 -1457 -104 1106
2459 1106 991 453 -1099 -1642 23 1720 690 -414 -1086 -843 738 1731 477 -1067 -887 -13 1069
2476 1069 1420 -339 -1983 -408 968 708 684 6 -1629 -150 1864 687 -223 -708 -1326 347 1342
2493 1342 -190 -1247 -596 -174 785 1527 -461 -1977 63 944 343 492 -829 -1404 256 1079 423
2510 423 -363 -945 -790 686 1532 71 -1391 -585 153 518 1292 263 -1663 -440 891 624 115 794
2528 794 -1516 -235 1118 832 -422 -294 -831 -108 1347 698 -1131 -157 348 -62 1425 168 -1540
2545 -1540 -360 1247 797 1190 -432 -1221 -108 1600 1096 -261 -1296 -1277 -149 1511 1186 -1698 -798
2562 -798 386 -152 1326 426 -1400 -1345 849 751 -202 -201 -1714 -907 834 1166 -166 -506 44 -436 821
2581 821 1358 -1213 -1087 340 -151 577 1084 -1068 -1428 790 239 399 23 -1473 -1185 1435 1251 -325
2599 -325 -748 -748 -482 1284 1618 -624 -1535 76 155 721 1207 -446 -2015 -109 454 -23 675 -566 -1400
2618 -1400 513 1317 -260 -831 -252 -620 590 1279 -701 -1542 144 637 628 636 -813 -1747 821 1202 263
2637 263 24 -935 -1366 274 1847 341 -635 -497 -757 465 1893 -119 -1335 -223 361 493 1062
2654 1062 -357 -1421 -48 959 327 -94 -399 -1020 -157 1426 -240 -1206 -328 -179 350 1618 -19
2671 -19 -1256 -527 711 523 568 -39 -1819 -190 1115 767 135 -363 -1672 -41 1849 737 -635
2688 -635 -517 -691 189 1435 442 -1473 -810 118 419 754 -246 -1183 -570 1258 606 -99 -296 -653 -580
2707 -580 917 438 -736 -717 -33 550 1010 435 -1835 -960 189 790 882 75 -1228 -882 737 1080 -179
2726 -179 -418 -1007 -231 828 773 -166 -814 -379 1 787 1142 -946 -1298 121 908 506 390 -1045 -926
2745 -926 946 848 -18 -285 -732 -655 675 1127 -527 -1001 -183 365 1067 680 -1000 -1248 298 475 990
2764 990 304 -994 -977 821 1123 242 -923 -1007 -83 558 883 -63 -855 -301 200 723 979 -435 -1096
2783 -1096 -50 1122 631 742 -582 -730 -166 1077 290 -771 -585 -621 516 827 237 -866 -687 96
2801 96 811 1058 -25 -1154 -851 870 580 340 -666 -834 74 455 468 -371 -1286 -627 484 1148 403
2820 403 -616 -597 231 818 678 179 -1239 -584 962 1103 677 -357 -1033 -263 900 695 -17 -778 -509
2839 -509 788 1151 731 -565 -644 -121 694 1029 -79 -801 -983 331 798 121 -635 -851 225 613 931
2858 931 -827 -642 -521 683 825 668 -505 -1206 203 392 603 -83 -606 -1010 -263 661 483 -76 -741
2877 -741 -563 566 882 -720 -853 -919 -506 1053 1137 -539 -985 -384 467 391 -296 -815 -443 -359 770 483
2897 483 -21 -154 -847 491 1179 133 39 -436 111 463 630 -200 -1279 -231 447 761 39 -1163 -510
2916 -510 85 1237 379 141 -652 -356 56 1278 -119 -1174 -272 -489 111 1058 -1124 -788 302 555
2934 555 398 432 -301 -1493 584 491 400 92 -563 -169 1121 842 -326 -897 104 -1014 674 1288 24
2953 24 -456 -428 1073 1150 1120 -875 -1074 60 941 305 479 -99 -698 423 1629 139 -758 -836 -270 1048
2973 1048 1079 -77 -1432 41 465 331 416 -279 -1326 -167 631 389 -103 520 -773 488 811 627
2991 627 -909 -453 -326 -234 709 -461 -1130 -1073 -599 673 433 206 -1167 -301 1202 133 156 -726 -524
3010 -524 -250 -524 -194 -458 -173 -469 817 1362 127 -1709 -1166 -36 363 833 77 -1152 311 548
3028 548 1027 -277 -395 -419 -1092 547 783 -620 -921 -526 -127 497 441 -853 163 618 1400 244 189
3047 189 -467 -481 794 1050 612 -180 -212 -314 624 563 -165 -647 -617 1124 1197 483 -1033 -751 426 1218
3067 1218 841 162 -441 -464 175 712 -9 -644 -847 634 395 742 215 -885 -630 214 900 779 -449
3086 -449 -1553 -283 -39 858 45 -648 -839 -47 847 784 -1157 -275 116 867 696 -349 -395 -358 56 1094
3106 1094 225 -978 -1019 -459 752 300 184 -824 -1137 641 574 139 -13 -911 -594 -100 909 122 -788
3125 -788 -734 -63 215 334 -746 -1322 -293 878 638 -695 -462 -792 77 1542 784 160 -111 82 638
3144 638 1057 -229 -838 -603 172 417 552 -124 -1012 303 689 168 430 -841 -729 528 74 675 -299
3163 -299 -622 -416 -16 787 152 -647 -565 -431 772 354 76 -1168 -137 439 516 409 -327 -764 572
3182 572 704 599 -412 -364 -355 362 1076 12 -550 -790 97 567 517 429 -290 -840 292 1061 613 -105 -731
3203 -731 -514 82 559 -136 -737 -454 100 487 312 -74 -595 -340 611 503 38 -1121 -490 435 614 272
3223 272 -468 -812 -584 661 927 -400 -642 -167 171 570 400 -848 -722 262 409 713 55 -578 -427
3242 -427 450 931 60 -279 -959 -752 855 372 -454 -677 -66 113 859 1048 -159 -596 -246 34 667
3261 667 323 -513 -380 -22 639 392 -293 -546 -669 982 665 377 -482 -924 -506 129 272 106 -539 -287
3281 -287 864 535 484 -191 -754 -200 621 437 -51 -693 -333 416 556 244 -592 -178 -377 694 593 -14
3301 -14 -401 -107 449 789 -242 -269 -842 6 236 -13 142 -1003 -41 -276 809 448 252 -461 -248 625
3321 625 843 -266 -702 -305 3 388 470 -253 -588 15 966 192 -538 -661 -131 273 450 292 -128 -205
3341 -205 -334 98 759 258 -696 -441 600 243 39 43 -459 -93 395 936 -164 -291 -97 101 440 115
3361 115 -129 -755 -173 490 259 190 -916 -421 -275 708 219 -111 -926 -530 395 968 215 -272 -339 -85
3381 -85 475 402 -1 -151 201 -76 410 608 -773 -367 418 559 384 -220 -331 -368 413 724 -35 -593 -815
3402 -815 133 797 348 -549 -332 -1 193 830 581 -624 -557 41 709 579 217 -777 -618 877 551 143
3422 143 -295 -254 -386 375 841 -86 -805 -208 34 430 474 -440 -624 195 547 137 354 -570 -264 462 634
3443 634 388 -275 -488 -154 552 433 -346 -939 -176 -138 440 271 -267 -1171 47 408 336 249 -499 -784 92
3464 92 1046 207 -441 -197 -657 565 341 385 -522 -142 -64 732 820 -271 -989 -79 -114 734 52 -258 -777
3485 -777 157 1104 368 -211 -525 272 261 945 -437 -411 -324 36 707 241 55 -314 -386 168 585 248 -406
3506 -406 -618 -126 843 309 -199 -610 -402 -399 888 -14 -676 -737 -165 527 552 358 -874 -457 243 434 305
3527 305 -260 -751 -251 571 659 -110 -408 -279 72 644 158 -579 -405 -165 422 263 -272 -526 -611 25 746
3548 746 232 -386 -352 -374 438 668 119 -429 -331 -158 885 425 -373 -548 -186 357 419 63 -495 -482 339
3569 339 313 -83 -374 -572 -427 509 631 -199 -534 -602 312 370 603 -336 -887 29 197 138 403 -292 -582
3590 -582 76 775 396 -30 -264 -297 130 901 31 -402 -183 -119 273 655 -271 -407 104 158 106 32 -8 -261
3612 -261 73 608 90 -22 -290 -243 219 508 278 -568 -585 -257 238 407 156 -575 -123 373 347 392 -95
3633 -95 -590 -161 470 195 55 -408 -506 98 560 269 -330 -179 -206 166 500 296 -341 -195 274 162 113
3654 113 -149 -272 -144 697 305 -265 -269 -420 187 705 297 -507 -327 -88 154 267 268 -707 -566 151 222 83
3676 83 17 -564 -488 599 493 -292 -183 -152 -196 652 65 -192 -425 -69 191 472 177 -428 -286 87 355
3697 355 135 -120 -357 -169 323 432 -50 -327 -347 -136 546 411 -156 -487 -148 358 425 170 -336 -484 108
3718 108 175 321 -133 -536 -252 217 734 115 -179 -290 -9 312 370 -51 -443 30 152 618 353 -459 -528
3739 -528 178 212 271 140 -451 -80 399 658 245 -311 -397 -124 410 307 -111 -298 -370 -87 323 367 -583 -621
3761 -621 -173 232 271 -20 -437 -703 153 288 239 -289 -501 -298 13 452 -37 -623 -279 119 401 391 -133
3782 -133 -539 -335 444 529 171 -421 -398 -21 374 396 -223 -447 -116 186 434 -16 -275 -392 90 151 396
3803 396 -259 -398 -174 210 514 12 -197 -273 171 518 412 -232 -434 -306 347 419 238 -326 -270 -22 430
3824 430 335 -199 -459 -151 272 318 87 -204 -437 -98 452 460 -39 -477 -333 46 305 346 -155 -139 -96 161
3846 161 251 33 -335 -380 293 473 254 -171 -551 -19 206 258 -22 -428 -374 -82 473 180 -186 -436 -36
3867 -36 351 189 159 -98 -317 282 281 124 -303 -322 126 379 363 65 -372 -347 -77 288 83 -387 -438 -97 74
3890 74 560 174 -572 -387 183 242 408 -114 -206 -174 587 140 200 -275 -366 -781 552 154 -331 -316 -170 -88
3912 -88 407 382 -367 -387 22 96 313 -27 -432 -600 135 360 134 -458 -643 -319 158 437 -131 -189 76 91
3934 91 291 153 -380 -207 134 422 197 -45 -338 -327 156 262 -237 -105 63 -228 362 555 142 -385 -471
3955 -471 7 763 121 -368 155 -25 285 570 -286 -184 -749 -258 303 -469 -56 89 -288 254 609 -28
3975 -28 -117 -75 238 164 539 -199 138 130 635 71 452 -242 -172 148 386 96 -267 -47 -864 18 741 505
3997 505 -199 -124 351 47 -79 -299 -489 -14 -195 310 -45 -814 66 374 327 321 -299 -504 -143 90 424
4018 424 184 -412 -295 80 216 249 67 -325 -123 196 306 -109 -98 -201 -100 136 287 -181 -239 -193 265
4039 265 343 115 -203 -238 -60 217 321 60 -290 -308 130 419 105 -198 -242 -84 328 405 -95 -586 -246 76
4061 76 373 246 -191 -386 4 232 186 74 -313 -291 165 340 66 -225 -106 -61 254 269 -64 -405 -164 121
4083 121 289 293 -353 -575 -72 182 215 180 -424 -470 98 437 196 4 -238 -259 200 393 -72 -337 -204 65
4105 65 264 313 -71 -382 -51 230 152 49 -133 -339 52 448 143 -194 -195 -139 257 412 67 -487 -295 218
4127 218 158 226 15 -532 -138 251 219 -117 -131 -360 -58 454 253 -209 -212 -119 94 364 59 -548 -323 40
4149 40 49 355 57 -399 -337 224 306 71 -14 -371 -155 297 153 -183 -207 -174 -67 258 304 -301 -254 264 132
4172 132 185 -17 -403 -231 76 376 182 -377 -315 -214 332 280 -54 -199 -258 -29 274 289 -364 -370 -26 98
4194 98 65 193 -257 -182 34 186 50 -129 -280 -224 391 284 -39 -268 -55 -66 174 205 -132 -438 -160 315
4216 315 172 78 -387 -311 -16 363 241 -11 -142 -174 6 351 41 -239 -175 -72 186 86 -273 -185 -163 264
4238 264 39 239 -276 -309 87 374 206 -136 -124 -228 -104 506 90 -225 -188 -97 95 372 -101 -401 -63
4259 -63 -91 295 132 -162 -323 -55 236 176 -44 -265 -201 126 438 161 -150 -128 6 176 522 10 -356 -66
4281 -66 139 246 5 -161 -345 -111 182 171 -163 -162 -202 -17 296 192 -113 -291 -159 155 193 139 -251 -138
4303 -138 -82 303 154 -233 -130 -77 210 227 -74 -181 -207 -25 373 121 -343 -203 -84 281 227 69 -300 -213
4325 -213 118 102 256 -113 -191 -230 226 326 219 -30 -279 98 254 142 41 -339 -197 339 291 172 -139
4346 -139 -164 -168 263 65 20 -246 -146 141 252 66 -416 -133 118 327 309 -85 -276 -230 -19 257 121 -194
4368 -194 -213 -41 318 310 -8 -291 -421 -75 320 2 -13 -296 -55 21 149 9 -399 -100 4 70 236 14
4390 14 -303 88 223 115 143 -218 -191 148 332 207 -306 -368 -270 187 229 418 -332 -206 75 200 112 -220
4412 -220 -459 -27 290 449 37 -232 -266 169 355 68 -183 -234 -55 207 430 -75 -620 -126 -186 465 232
4433 232 -4 -437 -55 -48 365 -72 -169 26 -49 -71 131 80 -146 -93 -43 387 268 -328 -300 -205 -46 349 -441
4456 -441 -323 -204 519 111 -213 -237 -1185 475 207 258 292 -416 314 364 554 327 123 -276 150 641 408
4477 408 157 -185 -109 -165 488 260 -443 -232 -190 178 270 128 -232 -566 186 379 -162 14 -145 -212 179 342
4499 342 53 -615 -295 -45 90 123 -118 -34 12 152 78 62 64 -218 -43 98 233 26 -243 143 31 843
4521 843 -22 -52 -411 149 90 -46 68 -64 -306 -96 156 -134 -302 -316 -230 262 343 -278 -305 -75 -127 -499
4543 -499 117 -89 -223 101 485 -3 -768 -693 -416 32 -28 -221 -95 -213 462 826 91 -321 -342 58 370
4564 370 -63 -675 -328 37 -578 669 523 311 -18 -363 -314 -340 650 -517 -583 249 262 242 32 117 -177
4585 -177 431 142 81 19 106 -74 570 13 -54 -587 -357 59 343 31 -4 -103 22 92 224 -47 -261 -90
4607 -90 56 200 310 -91 -247 -59 108 166 -80 -182 -76 91 108 94 -135 -206 -265 122 282 186 -270 -152
4629 -152 70 113 160 -156 -255 -292 312 106 140 -203 -229 140 194 162 -194 -159 -211 35 179 142 -448 115 -124 134
4653 134 57 -66 -302 -142 140 17 -74 25 -176 -140 229 290 45 -337 -120 -3 261 14 -198 -282 -67 350
4675 350 96 -236 -281 -145 227 317 167 -30 -407 -38 136 112 -191 -111 28 111 168 16 -62 -203 121 -24
4697 -24 257 7 66 -180 -173 79 312 -155 -89 87 263 153 107 -519 -166 -430 275 198 -595 -106 -319 153
4719 153 241 127 -143 -96 -340 106 -36 -11 -284 13 451 7 -138 -304 324 293 161 124 -15 -118 533 339
4741 339 213 54 -218 -107 -166 120 -207 -147 -114 -321 387 588 -24 -450 -197 179 18 235 -144 -16 -459
4762 -459 231 123 -435 -318 -305 49 33 199 -30 -301 -357 534 297 -483 -251 -162 -165 -27 170 -264 -154 -201
4784 -201 241 210 351 -194 -286 -3 363 -96 -188 -183 -329 127 73 76 -146 -327 28 -16 290 -244 -283 -534 -195
4807 -195 221 -5 -109 -726 -190 521 203 37 -504 -222 -41 10 223 -219 -334 -130 257 -47 246 -257
4827 -257 -397 145 367 142 -623 -123 -125 117 536 -159 59 -210 -299 315 319 41 -166 13 -62 -4 -29 -19 91
4850 91 52 237 150 -36 -15 -403 149 260 294 -370 -197 -48 250 -479 -283 -201 78 -86 211 -222 -95 -246
4872 -246 -133 375 470 -153 -289 388 -443 86 -443 211 -460 -67 20 190 44 -263 56 -203 613 -44 -509
4893 -509 -695 -308 657 165 177 -279 76 -195 -103 52 131 -496 -233 -285 -480 -346 6 160 603 19 -22 89
4915 89 -168 -39 120 212 -703 97 -312 -626 264 -403 -196 -294 -282 15 143 -274 -362 -152 181 77 27 140
4937 140 41 -181 -20 298 125 38 -166 97 85 407 -204 69 485 298 -264 464 84 -676 -182 221 308
4958 308 -157 -196 125 245 128 -167 -48 251 207 356 151 -63 -452 63 -50 414 396 30 -585 -13 379
4979 379 96 2 -373 -305 82 -276 -55 -531 -123 73 628 351 -44 -277 376 211 -145 15 -28 -515 -185
5000 -185 210 -301 -66 120 -12 -63 57 -78 136 -723 -133 79 236 -159 -289 -91 -1 -88 52 -283 52
5021 52 109 438 161 -266 280 39 38 324 -19 -284 168 -707 520 224 -151 -392 107 563 294 51 15
5042 15 -426 -149 -60 77 104 225 139 -92 129 407 -79 -426 -306 417 -162 357 -27 -51 251 -221 129 -36
5064 -36 -469 -393 340 33 455 -476 -613 5 1 -264 -218 -233 -357 458 264 -631 -211 -610 17 263 80 104
5086 104 -150 -429 683 -121 -486 3 -134 0 335 331 -282 -269 -196 -177 285 -265 -229 -313 383 -102 295 -85
5108 -85 -299 369 242 248 502 27 -395 -317 218 200 62 -674 -137 -344 328 439 -399 -198 -120 281 539 163
5130 163 -151 -916 318 396 318 203 -113 -283 -26 -89 112 172 81 182 19 -169 -235 -493 37 141 304 387
5152 387 -389 43 -341 -248 416 307 -399 37 374 14 -242 -94 -295 -367 -242 386 -155 196 -153 -129 230
5173 230 226 366 -277 -126 262 113 -68 77 -77 434 -88 -316 -218 -67 -320 62 225 -28 -177 -681 584
5194 584 743 -304 198 812 -228 -298 -92 19 -87 151 63 -22 32 -166 -133 234 663 372 88 -367 -441
5215 -441 -92 564 -39 -296 84 -401 493 255 846 233 26 396 172 -178 -488 -454 -281 48 -108 -227
5235 -227 -157 -106 355 -37 141 315 -88 321 -38 88 374 -221 170 -98 480 471 17 -94 -54 -100 461 341
5257 341 25 -81 -123 335 -85 -355 -253 -94 23 -239 -368 -455 180 8 341 487 -86 9 -112 -184 149
5278 149 -28 91 -286 202 452 -358 -120 -56 -163 421 418 48 -108 -45 135 -24 405 -664 -56 26 -356
5299 -356 410 128 -245 -557 249 452 -336 -509 -120 -279 90 553 -200 -244 -282 -322 530 248 253 -231 -578 205
5321 205 790 133 217 -471 -127 364 501 51 228 365 -100 147 371 245 4 -192 66 328 -94 -283
5341 -283 -248 -129 56 272 -237 -77 134 661 385 131 -83 -132 -315 -61 235 -76 -435 -2 90 113 -149
5362 -149 69 -113 -30 24 228 32 -77 -415 221 -55 -169 -495 -368 262 48 -99 -323 -97 -451 -421 104
5383 104 268 -399 228 -108 -242 -133 329 -153 16 259 637 -192 206 65 -120 157 424 -207 -38 -315
5403 -315 150 578 -149 391 126 -208 284 219 -160 158 -150 62 77 -3 -143 174 -218 210 267 309 -259 -286
5425 -286 162 38 -287 -321 191 340 349 846 -343 -476 201 160 573 51 -94 -214 -109 326 -523 229 16
5446 16 86 179 239 -152 123 447 -621 708 -115 234 -169 -116 90 124 1181 -592 -9 592 365 218 34
5467 34 -888 -261 285 616 142 150 217 -162 120 229 -458 -4 171 -548 146 -178 258 116 -538 -119 482
5488 482 -404 -614 -221 -194 360 -467 -591 -544 -3 288 594 254 1 977 -255 359 148 27 37 -203 238
5509 238 108 190 218 -382 -6 -59 246 193 -55 -868 -51 362 -338 -111 -271 -25 -13 556 -274 145 -224 88
5531 88 635 -44 -258 -188 -113 141 122 -370 -269 -17 205 31 225 -100 -335 -709 151 219 -76 470 -184 106
5553 106 14 -177 184 -338 -522 -375 -245 64 -228 -179 165 -92 12 -395 -403 -6 597 317 436 -37 50 -317
5575 -317 316 109 -11 71 -583 277 -94 175 -676 -113 -225 62 -139 -338 196 237 321 28 282 -367 -322
5596 -322 -376 -481 -500 -339 -46 901 424 704 1056 166 -292 640 160 13 85 90 116 601 79 -133 -426 141
5618 141 -68 531 -80 171 -31 -380 -161 121 265 -604 -377 -199 683 286 541 -875 -39 -154 447 224
5638 224 -438 -580 82 -69 381 -304 -499 -251 -488 140 -95 -521 -877 -113 -156 -256 -5 -180 23 587
5658 587 362 -33 -252 276 -73 107 649 -222 -366 -621 -358 -100 28 -47 -339 59 283 -238 -282 -266 488
5679 488 78 -103 659 -323 -715 103 -62 740 459 -114 92 -18 -266 -105 426 652 -192 -502 122 -377
5699 -377 142 -105 11 -286 -13 49 -821 -71 19 665 -508 173 -88 -416 103 98 196 -227 405 -105 324
5720 324 -107 -692 23 -665 1213 -228 588 -41 -8 -127 110 169 -158 12 88 467 -133 -430 60 186
5740 186 38 96 313 -294 -130 -433 172 342 -680 -103 194 -137 390 -261 -720 -780 -53 63 285 93
5760 93 -316 -357 313 -65 214 -163 -216 190 -175 -314 42 -671 -512 -412 57 -24 57 16 11 -260 331 95 102
5783 102 -156 -4 356 -169 318 -314 300 274 -20 -374 -249 242 -26 139 -93 -571 -993 -51 360 127
5803 127 -36 -154 104 240 384 -119 -137 204 -177 601 179 438 -606 356 72 -315 -32 33 -159 146
5823 146 486 389 -374 -80 -128 385 -145 -508 18 -517 237 -247 501 17 -117 66 101 245 -40 -104 -83 -450
5845 -450 -308 319 695 -37 -167 452 640 3 80 -503 397 386 413 -500 301 -107 -398 809 139 218 -171
5866 -171 -48 518 -289 -74 526 152 -513 -227 -306 -366 -69 -106 221 -85 352 -153 -241 -384 244 28 144
5887 144 -52 -289 199 66 1 134 -98 -134 -104 273 32 -42 -214 249 132 -65 -416 112 212 92 412
5908 412 -79 -345 -490 149 256 -210 338 -245 -39 294 522 -200 207 -407 -12 476 420 147 -199 -301
5928 -301 280 473 -42 28 -49 -107 -218 338 -286 -285 -34 87 -184 -180 -364 -213 -357 -638 35 424 189 -195
5950 -195 -469 -129 155 -268 63 353 397 -289 222 -365 382 181 232 -14 -284 -257 7 125 95 -34 -130 270
5972 270 -54 143 37 67 -239 166 443 202 -176 -101 -379 274 428 94 98 -518 -503 -42 393 -23 -33 -561
5994 -561 -77 51 242 -143 -413 -20 154 161 -263 -99 -97 -392 657 -201 -521 -138 -301 -129 90 -222 -47
6015 -47 16 491 -73 91 -264 -280 -44 -71 -293 39 334 124 204 215 -159 215 -82 -220 451 339 411 2
6037 2 -90 159 -49 -149 -186 248 30 199 299 -93 -389 -165 79 219 207 -91 -223 167 285 -64 165 73
6059 73 120 242 350 125 -86 -11 -315 -276 628 -14 -106 -281 48 131 151 83 -308 164 -338 -23 434 -356 -221
6082 -221 427 91 297 -28 -70 -332 46 21 113 -7 -218 -297 -54 181 -96 -218 -213 -195 120 -151 79 -58
6104 -58 88 37 -167 312 -126 -289 -85 340 294 -58 -158 -248 107 188 -80 -95 -293 188 356 223 -315 -36
6126 -36 -2 190 38 253 -165 -284 97 -25 94 -143 -180 -179 254 113 18 -257 -40 118 -99 20 175 -357
6148 -357 -116 126 91 28 -489 -52 -47 -135 302 48 -503 62 129 332 2 -182 11 -80 114 241 97 -310
6170 -310 -102 -112 -244 274 -94 -117 -77 316 68 -221 -162 224 89 322 186 -170 9 -156 58 -81 167
6191 167 -237 193 -133 -93 159 -274 -393 -266 301 189 -18 -54 -139 27 447 -70 141 94 -184 -106 141 65
6213 65 -211 -36 92 142 89 -91 -32 -32 176 134 -117 -179 -24 -9 233 -3 -106 -238 26 126 166 -12 -184
6236 -184 -79 -38 220 21 -126 -437 -164 -24 97 -86 -87 -110 123 257 70 -37 102 -17 57 275 53 66
6258 66 -64 -5 232 215 87 -125 -102 155 277 94 -88 -121 51 45 128 -40 -251 -23 200 123 -82 -34 -202
6281 -202 29 223 153 -134 -84 -79 43 272 41 46 -59 44 148 95 21 -250 -81 33 156 25 -264 -21 -166
6304 -166 157 169 -47 -138 -196 58 189 -74 -118 -142 -208 81 88 -62 -171 -36 187 225 85 -85 -3 139 317
6327 317 64 208 -125 -67 -78 177 90 -36 7 -14 -119 287 45 -119 -379 113 405 -15 -50 56 -5 96
6349 96 122 44 147 -499 -54 14 -32 -139 164 -204 101 323 53 -237 67 -17 -20 73 -95 -29 -152 -298 -76
6372 -76 364 -132 -34 71 128 25 187 348 28 357 -84 80 110 -71 133 -230 74 -4 -563 103 328 94
6394 94 -222 -4 -356 -149 -91 357 -420 -402 -14 30 87 285 198 -101 80 105 203 -369 41 5 616 -240 371
6417 371 95 203 -283 -266 282 -299 -77 -12 144 -379 -233 -388 -263 -88 117 331 45 -120 -191 -214 327
6438 327 -204 -344 -140 -112 411 213 57 -283 29 -294 65 132 -308 1 -156 162 140 -49 -199 -340 -75
6459 -75 71 123 -99 -222 -195 172 133 86 -153 -217 9 260 159 11 -132 -150 5 149 120 -63 71 110 110 30
6483 30 134 -120 -133 95 162 127 -128 -25 -30 142 -26 -5 -111 -14 79 194 -50 -214 -62 114 220 97 27
6506 27 -188 -77 24 37 1 -130 -222 21 187 135 117 -66 -1 67 308 93 -1 -92 -92 214 92 -16 -278 -157
6530 -157 -10 122 65 -114 -31 22 149 -99 37 -197 -102 -14 179 68 -91 -42 -13 -45 55 77 -186 -31 26
6553 26 56 114 -146 -252 12 159 -20 -79 -197 -187 194 129 113 10 -38 -60 15 179 -18 -86 -208 -54 146 -1
6577 -1 -48 -213 -134 183 90 -21 -83 90 -4 111 64 27 -87 -25 104 183 252 -95 -172 -91 200 73 106 -151 -40
6602 -40 136 222 139 -185 9 7 94 135 12 -129 -57 89 199 175 77 -66 -43 -17 169 68 -62 -30 42 32 163
6627 163 14 -163 61 215 133 -40 -166 -118 -16 305 12 -184 -114 31 104 89 -36 -42 -171 34 204 85
6649 85 6 -52 26 70 120 65 -77 -71 -68 112 165 -119 -4 -66 156 -12 -26 -142 -255 44 160 -5 53 -120 -93
6674 -93 51 152 24 -194 -137 33 121 -20 23 -13 -42 27 214 -141 -31 -150 91 36 49 -207 -68 -57 -71 148
6698 148 18 69 -72 -49 73 -40 -44 -191 -139 122 -3 25 -151 82 56 80 57 -50 -6 -5 43 66 -2 52 -134
6723 -134 116 270 201 -137 -127 12 -56 229 36 -63 85 38 171 126 -44 -115 -70 115 148 206 -48 -116 -53 117
6747 117 12 -17 -73 -115 11 130 127 -60 -178 75 141 90 -49 -175 -292 73 114 79 1 -89 -29 -29 127 -140 -234
6772 -234 -94 154 130 -12 -186 -89 47 143 83 -174 6 -96 15 135 137 -67 1 -122 -74 166 57 -77 -40
6795 -40 40 61 46 -212 -270 13 93 -23 111 -52 -27 23 27 -159 -59 -82 -44 -27 153 94 -111 -128 48 144 47 8
6821 8 -132 61 108 69 -123 -116 37 6 157 -76 -177 -24 -133 33 238 14 -183 -94 40 -49 52 -199 -49
6844 -49 -41 160 111 45 -273 -52 86 139 70 -40 -205 -61 -42 -10 -11 -52 -174 -40 -80 66 59 -159 135 115 45 161
6870 161 -86 -121 -26 294 154 51 -55 70 53 115 55 -80 -30 -40 81 110 -27 -127 -118 96 138 89 11 -166
6894 -166 68 174 165 124 -20 -141 89 202 289 17 -240 -66 222 1 -62 -7 -174 53 32 -4 -125 -257 34
6917 34 143 86 28 -12 -65 -90 25 63 -29 -65 -49 100 90 39 -111 29 59 97 91 27 -137 21 85 13 -129 -110 -114
6944 -114 58 55 122 -5 -37 -70 -48 -64 56 -116 -43 -78 -58 -50 1 -83 -193 182 171 96 -56 -11 14 93 79 89 -245
6971 -245 57 -157 243 -105 -257 -124 -3 119 -26 -84 -192 -91 135 88 -61 -112 -230 -23 58 125 -189 -164
6993 -164 -62 16 77 82 -41 -82 63 197 293 -8 -69 64 78 45 115 -70 -266 121 150 112 59 -155 -8 0 223
7018 223 -11 -10 -110 -115 252 112 168 -178 -117 -41 -6 60 -40 -34 -75 56 130 -16 -230 -310 -11 -97 274 326 -469
7043 -469 -32 185 58 -147 -641 -266 202 217 -39 -197 -48 117 225 150 205 17 -208 236 -167 -271 19
7064 19 -142 131 23 250 -89 140 45 -37 114 7 -121 -15 -136 -18 193 136 27 -57 -119 185 -30 -104
7086 -104 -59 -63 92 153 248 -200 69 -6 176 110 -245 -30 -91 4 183 0 -227 -44 -37 75 154 64 -203 -31
7110 -31 64 -9 73 -27 -89 112 98 140 29 -180 -19 180 335 41 -200 -147 -9 -23 -70 408 -40 117 32 259
7134 259 136 -148 -124 -108 136 -17 98 122 110 21 -99 191 -95 -30 70 -238 527 10 -14 -210 79 89 28
7157 28 19 175 -96 230 244 -48 242 -334 431 251 -190 152 -292 -89 267 -142 66 -182 292 -166 -75 51
7179 51 208 114 -182 40 -15 128 -149 80 21 64 117 194 -101 42 34 -204 166 10 -163 -61 138 83 -209
7202 -209 -270 91 114 92 70 64 -117 -9 117 79 33 -98 113 218 -46 45 -78 -55 51 206 181 -121 -105 -199
7226 -199 -112 -19 154 -146 -69 -51 119 -39 59 -354 -62 -188 -409 576 -173 229 -43 339 -29 -150 -343 224
7248 224 168 280 -302 -293 27 -84 63 106 -119 -136 -192 219 98 212 317 -334 -216 287 301 -34 -110 -251 -171
7271 -171 120 290 -210 162 62 -38 240 -172 -97 -324 -14 188 49 -124 -312 -80 283 -114 -41 -127 -77
7292 -77 20 -5 113 -134 144 -170 138 103 -75 -7 -282 105 301 121 33 216 -85 -136 184 4 -195 145
7314 145 -57 104 119 109 2 59 -36 -143 20 135 -482 -287 107 -88 -292 53 -4 -159 443 168 -277 -541
7336 -541 19 104 -91 299 -154 173 118 19 -229 187 -238 -95 33 250 122 -109 200 -135 107 -106 -153
7357 -153 -236 181 -76 324 67 -99 -8 -345 -319 132 -168 486 255 248 146 442 149 124 288 -689 -189 203
7379 203 -51 -279 353 -41 -129 -174 -73 325 127 470 180 -145 -75 -147 147 -278 232 138 185 353 337 -86
7401 -86 -109 -68 330 -28 -660 -159 -289 335 231 404 75 -132 -153 67 626 40 -141 -91 59 143 363 214
7423 214 165 -15 68 -3 110 254 -27 -121 20 169 125 96 -57 -149 253 264 -235 -294 303 248 528 47 -327
7446 -327 -56 -141 109 -106 -139 -67 83 171 -12 30 17 58 -112 -166 -8 -163 -178 143 -5 130 47 -453 -295
7469 -295 -37 -165 22 -32 44 -209 22 466 41 -400 -12 254 83 -261 -144 -241 -123 110 17 -251 -212 -307
7491 -307 162 265 -72 -61 -426 -2 345 58 -36 378 73 54 114 -6 109 -115 -289 44 300 238 -328 -186
7513 -186 70 -58 108 -401 38 154 -71 -226 -192 268 -236 114 155 -84 -147 -79 -225 -177 179 -70 -9 -298
7535 -298 26 161 -167 -219 -312 -51 -279 -84 -354 -184 31 -398 265 57 -62 -56 -135 125 -53 -96 -2 50 -308
7558 -308 22 -355 128 -104 213 269 141 -204 -26 -180 249 361 228 -337 -65 61 108 8 438 198 -466
7579 -466 -193 21 172 141 -753 -152 -1 -205 -128 63 -213 190 253 -145 -92 -78 -38 -59 338 84 188 -134
7601 -134 -167 -123 75 198 7 1 119 85 -27 -31 58 -63 126 -141 -50 27 135 50 -219 76 -140 -202 5 -136
7625 -136 257 207 -302 -95 -35 132 237 12 -116 -87 25 -100 -333 -131 121 -108 123 -29 276 -35 -22
7646 -22 -121 -139 -170 11 245 -13 -160 92 -161 42 -345 -2 68 64 -125 -44 -76 85 69 -112 -27 -304 142 2
7670 2 56 -307 -164 -104 277 220 -257 -148 -21 20 108 -46 120 166 12 4 494 114 -87 114 40 459 6 -264
7694 -264 -31 115 116 213 -120 -160 -102 48 -93 84 -246 7 142 -73 210 -208 -283 -103 1 15 -207 -156 -9
7717 -9 -165 203 122 214 -159 -133 -65 21 28 -8 26 -131 184 84 -159 -32 -178 103 25 225 -53 -146 114 -1
7741 -1 120 297 147 -120 135 146 159 23 130 200 -91 5 191 189 -254 -141 305 -59 115 10 -130 232 -263
7764 -263 -18 -498 -582 117 -159 291 733 -238 -74 -80 -701 -172 -138 -503 272 97 -232 -67 703 -216 255
7785 255 -47 225 -47 -40 320 243 17 -217 -344 -126 -31 -169 33 -117 69 -15 -218 -391 -354 -42 412 773
7807 773 99 712 -324 -8 -118 770 -155 -25 -36 437 -24 -78 -47 80 -97 86 -415 -310 90 18 -197
7828 -197 113 299 -94 8 -253 -318 -292 -216 -297 29 -297 207 330 251 72 40 -204 229 -100 72 -156 -80
7850 -80 -258 -72 0 -405 36 61 226 41 -10 145 -26 -121 175 -235 106 -123 -305 -40 199 151 100 -326
7872 -326 109 -27 -132 -42 -196 -14 -129 -94 31 100 -309 73 429 50 -219 -384 -88 -241 120 91 309
7893 309 118 -182 92 89 283 -294 162 74 515 59 35 86 -207 17 134 122 -354 -170 100 15 249 213 -121
7916 -121 -139 -46 170 93 -176 -234 300 298 -195 -136 142 -71 29 143 89 -46 49 -369 -4 27 158 -311 163
7939 163 201 120 118 101 131 -111 414 -79 -61 -97 -34 44 -170 -164 9 18 32 84 -173 80 -260 -3 -206 -19 -78 -76
7965 -76 -168 111 161 -27 293 -201 249 120 -94 -46 12 -118 -238 -150 -57 209 -212 47 40 97 248 -151 -104 -93
7989 -93 -86 30 -231 -137 97 -191 174 56 -277 -11 -114 2 88 -23 198 -280 46 25 -95 -76 196 121 -168
8012 -168 228 -66 -150 -17 112 137 -30 335 -169 -35 252 -98 -321 -32 11 146 121 105 169 -40 43 -160
8034 -160 133 -303 -97 2 0 -287 208 17 -265 92 -137 310 248 -287 -200 25 -176 -156 446 -516 170 150
8056 150 -231 -69 85 -57 -70 208 -146 -87 -290 230 31 22 -104 -133 -109 72 113 -6 61 91 -67 123 -21
8079 -21 -8 -320 -44 22 130 21 -112 -116 -73 38 257 -6 -253 95 240 -53 18 -10 -73 -70 -116 171 -127 -101
8103 -101 -140 -86 68 73 -16 54 63 -151 -134 -281 -161 37 46 -51 22 326 -494 -77 -71 -607 95 -296 81 -50 699
8128 699 208 -147 118 285 187 -187 116 -169 164 -306 281 -693 -60 27 -146 -124 -161 -1 158 -109 262
8149 262 644 -120 33 142 -59 169 -536 502 -330 35 674 471 -76 -436 311 -142 61 -6 -514 -153
8169 -153 83 104 318 243 401 14 328 -278 192 307 447 201 -360 47 94 -2 52 -346 248 -122 -74 -330
8191c30
##END NTUPLES=NMR FID
##END=
