##TITLE=1H_3MBPA2401x
 CDCl3
 200 sc, 
 25.1.2023
##JCAMPDX= 6.0         $$ Bruker NMR JCAMP-DX V2.0
##DATA TYPE= NMR FID
##DATA CLASS= NTUPLES
##ORIGIN= UXNMR, Bruker Analytische Messtechnik GmbH
##OWNER= root
$$ XWIN-NMR		Version 3.5
$$ Wed Jan 25 14:06:06 2023 Russian Standard Time (UT+4h)  she@DPX200
##.OBSERVE FREQUENCY= 200.13135
##.OBSERVE NUCLEUS= ^1H
##.DELAY= (6, 6)
##.ACQUISITION MODE= SIMULTANEOUS
##.ACQUISITION SCHEME= undefined
##.AVERAGES= 11
##.DIGITISER RES= 18
##SPECTROMETER/DATA SYSTEM= spect
##.PULSE SEQUENCE= zg30
##.SOLVENT NAME= CDCl3
##.SHIFT REFERENCE= (INTERNAL, CDCl3, 0, 15.7039)
##AUDIT TRAIL= $$ (NUMBER, WHEN, WHO, WHERE, WHAT)
$$ ##TITLE= Audit trail, XWIN-NMR		Version 3.5
$$ ##JCAMPDX= 5.01
$$ ##ORIGIN= Bruker BioSpin GmbH
$$ ##OWNER= she
$$ F:/spectra/data/she/nmr/H-F/1/audita.txt
$$ ##AUDIT TRAIL=  $$ (NUMBER, WHEN, WHO, WHERE, WHAT)
(   1,<2023-01-25 14:04:39.39 +0400>,<she>,<DPX200>,
      <created by zg, POWCHK disabled, PULCHK disabled
       terminated by command 'halt'
       configuration hash MD5:
       00 E9 B6 7A A2 85 ED C7 34 08 36 98 17 FE 4E 26
       data hash MD5: 16K
       ED 71 B2 D8 A4 C6 30 A1 C6 E4 FB 8E 32 4D 8F A1>)
$$ ##END=
$$ 
$$ hash MD5
$$ B3 92 C8 E2 95 84 42 95 8A 03 B2 48 13 9A 50 BB
##$RELAX= 
##$RELAX= 
##$RELAX= 
##$RELAX= 
##$RELAX= 
##$RELAX= 
$$ Bruker specific parameters
$$ --------------------------
##$DU= <F:/spectra>
##$EXPNO= 1
##$NAME= <H-F>
##$PROCNO= 1
##$TYPE= <nmr>
##$USER= <she>
##$AMP= (0..31)
100 100 100 100 100 100 100 100 100 100 100 100 100 100 100 100 100 100 
100 100 100 100 100 100 100 100 100 100 100 100 100 100 
##$AQSEQ= 0
##$AQ_mod= 1
##$AUNM= <au_zg>
##$AUTOPOS= <>
##$BF1= 200.13
##$BF2= 200.13
##$BF3= 200.13
##$BF4= 200.13
##$BF5= 200.13
##$BF6= 200.13
##$BF7= 200.13
##$BF8= 200.13
##$BYTORDA= 1
##$CFDGTYP= 0
##$CFRGTYP= 5
##$CHEMSTR= <none>
##$CNST= (0..31)
1 1 145 1 1 1 1 1 1 1 1 1 1 1 1 1 1 1 1 1 1 1 1 1 1 1 1 1 1 1 1 1 
##$CPDPRG= <>
##$CPDPRG1= <>
##$CPDPRG2= <>
##$CPDPRG3= <>
##$CPDPRG4= <mlev>
##$CPDPRG5= <mlev>
##$CPDPRG6= <mlev>
##$CPDPRG7= <mlev>
##$CPDPRG8= <mlev>
##$CPDPRGB= <>
##$CPDPRGT= <>
##$D= (0..31)
0 1.2 0 0 0 0 0 0 0 0.06 0 0.03 0 0 0 0 0.0002 0 0 0 0 0 0 0 0 0 0 0 0 
0 0 0 
##$DATE= 1674641079
##$DBL= (0..7)
120 120 120 120 120 120 120 120 
##$DBP= (0..7)
150 150 150 150 150 150 150 150 
##$DBP07= 0
##$DBPNAM0= <>
##$DBPNAM1= <>
##$DBPNAM2= <>
##$DBPNAM3= <>
##$DBPNAM4= <>
##$DBPNAM5= <>
##$DBPNAM6= <>
##$DBPNAM7= <>
##$DBPOAL= (0..7)
0.5 0.5 0.5 0.5 0.5 0.5 0.5 0.5 
##$DBPOFFS= (0..7)
0 0 0 0 0 0 0 0 
##$DE= 6
##$DECBNUC= <off>
##$DECIM= 32
##$DECNUC= <off>
##$DECSTAT= 4
##$DIGMOD= 1
##$DIGTYP= 9
##$DL= (0..7)
0 120 120 120 120 120 120 120 
##$DP= (0..7)
150 150 150 150 150 150 150 150 
##$DP07= 0
##$DPNAME0= <>
##$DPNAME1= <>
##$DPNAME2= <>
##$DPNAME3= <>
##$DPNAME4= <>
##$DPNAME5= <>
##$DPNAME6= <>
##$DPNAME7= <>
##$DPOAL= (0..7)
0.5 0.5 0.5 0.5 0.5 0.5 0.5 0.5 
##$DPOFFS= (0..7)
0 0 0 0 0 0 0 0 
##$DQDMODE= 0
##$DR= 18
$$ [...]
##$SUBNAM2= <"">
##$SUBNAM3= <"">
##$SUBNAM4= <"">
##$SUBNAM5= <"">
##$SUBNAM6= <"">
##$SUBNAM7= <"">
##$SUBNAM8= <"">
##$SUBNAM9= <"">
##$SW= 18.05172834244
##$SWIBOX= (0..15)
0 0 2 0 0 0 0 0 0 0 0 0 0 0 0 0 
##$SW_h= 3612.71676300578
##$TD= 16384
##$TD0= 1
##$TE= 0
##$TE2= 300
##$TE3= 300
##$TEG= 300
##$TL= (0..7)
0 120 120 120 120 120 120 120 
##$TP= (0..7)
150 150 150 150 150 150 150 150 
##$TP07= 0
##$TPNAME0= <>
##$TPNAME1= <>
##$TPNAME2= <>
##$TPNAME3= <>
##$TPNAME4= <>
##$TPNAME5= <>
##$TPNAME6= <>
##$TPNAME7= <>
##$TPOAL= (0..7)
0.5 0.5 0.5 0.5 0.5 0.5 0.5 0.5 
##$TPOFFS= (0..7)
0 0 0 0 0 0 0 0 
##$TUNHIN= 0
##$TUNHOUT= 0
##$TUNXOUT= 0
##$USERA1= <user>
##$USERA2= <user>
##$USERA3= <user>
##$USERA4= <user>
##$USERA5= <user>
##$V9= 5
##$VALIST= <valist>
##$VCLIST= <CCCCCCCCCCCCCCC>
##$VD= 0
##$VDLIST= <DDDDDDDDDDDDDDD>
##$VPLIST= <PPPPPPPPPPPPPPP>
##$VTLIST= <TTTTTTTTTTTTTTT>
##$WBST= 1024
##$WBSW= 4
##$XGAIN= (0..3)
0 0 0 0 
##$XL= 0
##$YL= 0
##$YMAX_a= 576549
##$YMIN_a= -907002
##$ZGOPTNS= <>
##$ZL1= 120
##$ZL2= 120
##$ZL3= 120
##$ZL4= 120
##$ABSF1= 10
##$ABSF2= 0
##$ABSG= 5
##$ABSL= 3
##$ALPHA= 0
##$AQORDER= 0
##$ASSFAC= 0
##$ASSFACI= 0
##$ASSFACX= 0
##$ASSWID= 0
##$AUNMP= <proc_1d>
##$AZFE= 0.1
##$AZFW= 0.1
##$BCFW= 1
##$BC_mod= 2
##$BYTORDP= 1
##$COROFFS= 0
##$CY= 11.3945322036743
##$DATMOD= 1
##$DC= 2
##$DFILT= <>
##$DTYPP= 0
##$F1P= 2.36226072786647
##$F2P= -0.459571619588291
##$FCOR= 0.5
##$FTSIZE= 0
##$FT_mod= 4
##$GAMMA= 1
##$GB= 0.15
##$INTBC= 1
##$INTSCL= 1
##$ISEN= 128
##$LB= 0.24
##$LEV0= 0
##$LPBIN= 0
##$MAXI= 10000
##$MC2= 0
##$MEAN= 0
##$ME_mod= 0
##$MI= 1.114404
##$NCOEF= 0
##$NC_proc= 0
##$NLEV= 6
##$NOISF1= 3.799351
##$NOISF2= 2.8
##$NSP= 1
##$NTH_PI= 0
##$NZP= 0
##$OFFSET= 15.70392
##$PC= 1
##$PHC0= -19114.09
##$PHC1= 14.60079
##$PH_mod= 1
##$PKNL= yes
##$PPARMOD= 0
##$PSCAL= 0
##$PSIGN= 0
##$REVERSE= no
##$SF= 200.130013532006
##$SI= 16384
##$SIGF1= 3
##$SIGF2= 2
##$SINO= 400
##$SIOLD= 16384
##$SREGLST= <1H.CDCl3>
##$SSB= 0
##$STSI= 0
##$STSR= 0
##$SW_p= 3612.71676300578
##$SYMM= 0
##$S_DEV= 0
##$TDeff= 0
##$TDoff= 0
##$TI= <>
##$TILT= no
##$TM1= 0
##$TM2= 0
##$TOPLEV= 0
##$USERP1= <user>
##$USERP2= <user>
##$USERP3= <user>
##$USERP4= <user>
##$USERP5= <user>
##$WDW= 1
##$XDIM= 8192
##$YMAX_p= 0
##$YMIN_p= 0
$$ End of Bruker specific parameters
$$ ---------------------------------
##NTUPLES= NMR FID
##VAR_NAME=  TIME,          FID/REAL,        FID/IMAG
##SYMBOL=    X,             R,               I
##VAR_TYPE=  INDEPENDENT,   DEPENDENT,       DEPENDENT
##VAR_FORM=  AFFN,          ASDF,            ASDF
##VAR_DIM=   8192,          8192,            8192
##UNITS=     SECONDS,       ARBITRARY UNITS, ARBITRARY UNITS
##FACTOR=    0.0002768,     1,               1
##FIRST=     0,             0,               0
##LAST=      2.2672688,     0,               0
##MIN=       0,             -907002,         0
##MAX=       2.2672688,     576549,          0
$$ Real data points
##PAGE= N=1
##DATA TABLE= (X++(R..R)), XYDATA
$$ [...]
$$ plain form
2461 -566 3315 235 -3216 272 3726 -166 -3748 586 3736 -1217 -4167 1250 3991 -2098 -3602
2476 -3602 2103 2961 -2650 -3337 2331 2616 -2880 -2599 2511 1766 -2950 -1583 2760 1495 -2661 -958
2492 -958 2987 607 -3113 -474 3396 254 -3217 287 3120 -948 -3489 1489 3448 -1824 -3266
2507 -3266 2044 2707 -2842 -3087 2873 2789 -2745 -2584 2430 1788 -3121 -1962 3251 2208 -3235 -1667
2523 -1667 3140 1323 -3378 -914 3836 1266 -3531 -584 3301 -535 -3579 729 3363 -1126 -2923
2538 -2923 903 1681 -2021 -2225 2140 2205 -2014 -2220 1340 1482 -2633 -1658 2865 1977 -2784 -2099 2940
2555 2940 1087 -3495 -521 4210 756 -3464 -188 2908 -713 -3070 1090 3568 -961 -3257 611
2570 611 1831 -1379 -1908 1782 2161 -1910 -2242 1119 1351 -2192 -1085 2661 1380 -2990 -1609 2389
$$ packed form
2461e66L881l080l451L488L454l892l582M334L150m953k950N417K741o089j504
2476c602N705Q58n611o87N668K85n496K81N110p45m716J367M343j265m156J703
2492i58L945k380l720K639L870l142l471L504K833m068k541M978J959n272j442
2507c266N310O63n549k45N960q4n534J61N014o42m909J159N213j043n443J568
2523a667M807j817m701K464M750k570m797K947L885l836l044M308K634m489j797
2538b923L826P78l702k04M365O5m219k06L560J42m115R75M523q88m761O85N039
2555B940j853m582K974M731l454m220L276L096l621k357M160K478m529k296L868
2570F11J220l210n29L690L79m071l32L361K32l543J107L746j281m370J381L998
$$ plain form
2586 2389 317 -3055 634 4090 -339 -4134 341 3087 -1134 -2722 2044 3286 -1778 -3487 1055
2601 1055 2157 -1722 -2102 2157 2527 -2249 -3071 1292 1976 -2090 -1808 3049 2030 -3678 -1984 2688
2617 2688 1252 -3022 240 3747 -33 -3962 -130 3102 -342 -2381 1535 3075 -1596 -3480 675
2632 675 2245 -1198 -1981 1776 2253 -2471 -3239 1907 2491 -2025 -2071 2301 1449 -3430 -2487 3114 1711
2649 1711 -2577 -393 2814 37 -3284 -493 3067 343 -2278 668 2274 -1375 -2942 744 3032
2664 3032 -320 -2106 1187 1869 -2109 -2806 1753 2545 -1718 -1759 2306 1107 -3401 -1699 2796 1347
2680 1347 -2176 -568 2499 -451 -3147 7 2707 517 -2274 245 2005 -1076 -2895 754 2902
2695 2902 -901 -2197 992 1804 -2180 -2258 1927 2273 -1806 -2072 1644 835 -2848 -1082 2908 1234
$$ packed form
2586B389k072l372L689L456m429l795M475K746m221j588M766J242n064j709M542
2601A055J102l879l80M259L70m776q22M363O84m066K82M857j019n708J694M672
2617B688j436m274L262L507l780l929L832L232l444k039L916J540m671j884M155
2632F75J570l443p83L757M77m724p68N146N84m516m6M372q52m879R43N601j403
2649A711m288K184L207k777l321K791L560k724k621K946J606l649j567L686K288
2664C032l352j786L293O82l978o97M559P92m263m1M065j199m508J702M495j449
2680A347l523J608L067k950k696L154K700k190k791K519J760l081j819L649K148
2695B902l803j296L189Q12l984p8M185L46m079k66L716q09l683J766L990j674
$$ plain form
2711 1234 -2365 -657 2058 -186 -2625 106 2866 105 -2147 131 1933 -1046 -2297 1141 2761
2726 2761 -1049 -2317 1133 1668 -1991 -1507 2377 1838 -2413 -1833 1637 748 -2763 -797 2649 903
2742 903 -2564 -1068 2359 107 -2774 207 3175 233 -2862 104 2976 -808 -2515 1187 3014
2757 3014 -1030 -2712 780 2086 -1624 -1792 2206 1723 -2286 -1865 1393 998 -1965 -988 2203 1137
2773 1137 -2514 -1310 1873 721 -2333 -571 2777 -20 -2808 -60 2530 -323 -2357 1210 2433
2788 2433 -929 -2635 1092 2106 -1461 -1778 1665 1702 -1977 -1892 1347 1223 -1616 -1223 1538 743 -2223
2805 -2223 -1490 1833 901 -2047 -436 2345 97 -2814 -99 2531 -220 -2196 914 1781 -904 -1854
2821 -1854 1059 1759 -1251 -1669 1287 1260 -1582 -1796 953 1139 -1256 -1348 1488 768 -1996 -1334 1704
$$ packed form
2711A234l599J708K715k244k439K731K760k761k252K278J802k979j251L438J620
2726B761l810j268L450N35l659M84L884n39m251N80L470q89l511J966L446j746
2742I03l467J496L427k252k881K981K968k942l095K966K872l784j707L702J827
2757C014m044j682L492J306l710j68L998m83m009M21L258l95k963R77L191j066
2773A137l651J204L183j152l054J762L348k797k788K748K590k853k034L567J223
2788B433l362j706L727J014l567l17L443L7l679Q5L239j24k839L93K761p95k966
2805b223P33L323r32k948J611K781k248k911K715K630k751j976L110Q67k685r50
2821a854K913P00l010m18K956k7k842k14K749J86k395r2K836p20k764O62L038
$$ plain form
2838 1704 619 -1838 -585 2380 123 -2416 124 2444 -431 -2159 858 1964 -1132 -2072 1222
2853 1222 1881 -1296 -1683 1274 1377 -1332 -1597 1010 1180 -1381 -1215 1411 1028 -2035 -1163 1887 865
2870 865 -2256 -453 2182 169 -2480 115 2119 -821 -2255 608 1978 -1247 -1617 978 2047
2885 2047 -1258 -1845 874 1721 -1187 -1686 1210 1419 -1951 -1767 1413 1075 -1754 -1503 1970 745 -2468
2902 -2468 -1056 2080 401 -1892 -225 1948 -253 -1967 291 1795 -333 -1532 651 1454 -920
2917 -920 -1495 934 1475 -841 -1279 939 1229 -1605 -1644 1629 1056 -1992 -1033 1750 572 -2301 -838
2934 -838 2058 258 -2302 -284 2131 -107 -2088 197 1975 138 -1507 155 1551 -478 -1717
2949 -1717 486 1575 -746 -1441 866 1155 -1212 -1323 1259 1066 -1382 -1060 1372 155 -1704 -636
$$ packed form
2838A704j085k457J253K965k257k539K540K320k875j728L017J106l096r40L294
2853A222O59l177l87K957J03k709k65K607J70k561J66K626l83l063Q72L050j022
2870H65l121J803K635k013k649K595K004k940j434K863J370l225l70K595J069
2885B047l305n87K719Q47k908m99K896K09l370J84L180l38k829K51L473j225l213
2902b468J412L136j679k293J667K173k201j714K258J504k128j199K183Q03k374
2917i20n75K429N41k316m38K218K90k834l9L273n73l048R59K783j178k873J463
2934h38K896j800k560K018K415k238j981K285J778j837j645J662J396k029j239
2949a717K203J089k321o95K307K89k367j11K582j93k448L22K432j217j859J068
$$ plain form
2965 -636 1550 -273 -1991 -80 1647 -825 -1770 279 1845 -314 -1819 587 1458 -864 -1934 898
2981 898 1937 -1007 -1641 1130 1272 -1452 -1546 1211 1057 -1408 -876 1196 251 -1638 -568 1169 121
2998 121 -1705 -252 1297 -234 -1510 298 1596 -527 -1601 525 1291 -754 -1841 855 1562 -975
3014 -975 -1458 1096 1349 -1720 -1026 1686 1060 -1832 -1196 1161 513 -1853 -954 1347 599 -1668 -574
3031 -574 1480 306 -1813 -747 1679 360 -1970 -314 1309 -460 -1403 505 1583 -563 -1486 718
3047 718 813 -1212 -1214 887 867 -1041 -652 986 358 -1712 -625 1431 251 -1391 -578 998 72 -1780
3065 -1780 -210 1629 -11 -1626 67 1651 -656 -1766 813 1868 -847 -1314 847 975 -1081
3080 -1081 -705 862 1108 -992 -887 868 522 -1473 -626 1375 540 -1461 -606 1113 -272 -1646 187
$$ packed form
2965f36K186j823j718J911J727k472r45K049J566k159j505K406Q71k322j070K832
2981H98J039k944o34K771J42k724r4K757j54k465N32K072r45j889J070J737j048
2998A21j826J453J549j531j276J808J298k123j074K126P66k045j087K696P07k537
3014i75m83K554K53l069O94K712o26k892O36K357o48k366Q99K301p48k267J094
3031e74K054j174k119J066K426j319k330J656J623j769r43J908J078k146r23K204
3047G18R5k025kK101k0j908L89J638o28k070J087K056j180j642Q13J576r26j852
3065a780J570J839j640j615J693J584k307j110K579J055k715m67K161J28k056
3080a081L76J567K46k100J05J755l46j995Q47K001q35k001Q55J719j385j374J833
$$ plain form
3097 187 1624 -139 -1599 129 1480 -449 -1474 907 1466 -675 -1548 578 1236 -1054 -1035 937
3113 937 1121 -1010 -1127 699 580 -1073 -736 1362 874 -1616 -798 1158 204 -1501 -20 1728 62
3130 62 -1782 -158 1197 -515 -1162 818 1452 -707 -1476 345 1030 -780 -966 1409 1096 -1121 -1283
3147 -1283 763 813 -980 -441 1492 536 -1718 -696 1150 419 -1324 -33 1414 -147 -1684 -255
3163 -255 1172 -425 -1020 380 1188 -662 -1480 434 1068 -354 -1015 716 984 -1367 -1445 835 974
3180 974 -964 -677 1114 617 -1503 -897 1060 374 -1186 -91 1179 -197 -1534 -221 1106 -287
3196 -287 -1062 214 1033 -755 -1259 428 1245 -355 -851 618 792 -1252 -1267 878 657 -692 -731 1156
3214 1156 268 -1672 -379 1052 308 -1112 -243 919 -386 -1456 -174 1081 -16 -1038 24 620
$$ packed form
3097A87J437j763j460J728J351j929j025K381N59k141q73K126O58k290J9J972
3113I37J84k131j17J826j19j653L37K098m88k490Q18J956r54j705J481J748j666
3130F2j844J624J355j712o47J980O34k159p69J821O85j810j86K375l13k217j62
3147a283K046N0j793N39J933r56k254J022J846p31j743J291J447j561j537J429
3163b55J427j597n95J400Q08j850q18J914O34j422o61J731K68k351p8K280J39
3180I74j938K87J791m97k120O06J957o86j560J095J270j376j337J313J327j393
3196b87p75J276Q19j788n04J687Q17j600m96J469J74k044j5K145k21j349l9J887
3214A156q88j940J293J431p44j420Q69J162j305j070J282J255j097j022J062N96
$$ plain form
3230 620 -586 -1364 411 1119 -577 -1299 707 818 -1007 -1000 997 761 -989 -844 928 66 -1709 -471
3248 -471 1045 47 -1190 -212 694 -250 -1307 -96 801 54 -1121 -175 894 -615 -1298 469 1328
3265 1328 -421 -1101 777 1065 -961 -881 1119 735 -932 -745 758 385 -1224 -579 1161 282 -1267
3282 -1267 -531 566 -51 -836 -278 1145 -91 -1108 -167 763 -246 -1111 335 1259 -258 -1225 668
3299 668 890 -815 -765 995 962 -1140 -879 698 410 -758 -52 797 296 -1110 -557 918 496 -1183
3317 -1183 -308 984 107 -1354 -285 684 45 -1277 58 1206 -578 -1373 147 945 -335 -594 588
3334 588 663 -841 -595 792 517 -381 -338 791 232 -864 -532 837 146 -1191 -397 886 -127 -1125
3352 -1125 -135 767 -318 -1153 535 1049 -666 -1026 367 885 -872 -969 668 993 -722 -754 743 486
$$ packed form
3230F20j206p78J775P08j696p22K006J11j825PJ997k36j750J45J772q62j775J238
3248d71J516r98j237R78R06r44j057J211Q97p47j175R46J069j509o83J767Q59
3265A328j749o80J878K88k026Q0K000l84j667J87J503l73j609O45J740q79j549
3282a267P36J097o17p85N58J423j236j017R41R30j009q65J446R24j517r67J893
3299F68K22j705N0J760l3k102K61J577k88j168P06Q49n01j406N53J475m22j679
3317a183Q75J292q77j461J069R69o39j322J335J148j784p95J520P98j280k59J182
3334E88P5j504K46J387k75q98M3J129n59j096L32J369o91j337P94J283j013r98
3352a125R90R02j085q35J688N14j715l60J393N18j757r7J637L25j715l2J497k57
$$ plain form
3370 486 -478 -516 761 191 -995 -357 687 -11 -1053 -289 810 -359 -1143 -95 804 -611 -1006 299
3388 299 1097 -834 -967 511 500 -754 -1027 773 794 -797 -592 577 694 -895 -698 920 492 -845
3406 -845 -769 1002 480 -1159 -520 991 1 -1162 -248 1016 -312 -973 66 872 -373 -867 356
3423 356 563 -620 -992 366 556 -737 -587 692 497 -945 -575 842 257 -1231 -346 891 126
3440 126 -1168 -272 927 99 -1010 -159 1129 -137 -1264 144 871 -269 -831 214 674 -415 -1020
3457 -1020 254 974 -551 -745 522 429 -859 -505 386 215 -933 -53 789 -157 -971 22 682 -270
3475 -270 -1023 155 717 -631 -1051 254 578 -405 -966 191 900 -598 -908 653 570 -727 -774 765
3493 765 627 -1007 -795 848 578 -996 -255 723 328 -829 -92 549 -8 -756 -97 737 -168 -1084 -36
$$ packed form
3370D86r64l8J277n70j186O38J044o98j042P64J099j169p84J048Q99j415l95J305
3388B99P98j931j33J478j1j254k73J800K1j591K05J169J17j589J97J618m28j337
3406h45P6J771n22j639O39J511r90j163R14J264j328o61J039Q06j245m94J223
3423C56K07j183l72J358J90j293J50J279j95j442L70J417n85j488Q85J237p65
3440A26j294Q96J199q28j109Q51J288j266j127J408P27j140n62J045M60j089o05
3457a020J274P20j525j94J267r3j288L54Q91j71j148Q80Q42r46q14R93O60r52
3475b70p53J178N62j348m20J305L24r83n61J157P09j498l10J561q3j297m7J539
3493G65j38j634K12J643k70j574P41R78l95j157P37O41n57p48O59Q34r05r16J048
$$ plain form
3512 -36 625 -260 -907 110 422 -385 -827 751 614 -971 -516 679 491 -1108 -421 646 491 -1010
3530 -1010 -166 495 89 -935 -208 955 26 -1137 -364 772 -206 -1184 -369 794 -152 -909 301 619
3548 619 -411 -877 505 694 -654 -502 364 290 -739 -414 468 519 -844 -291 649 -103 -776 -133 494
3567 494 212 -623 -125 805 -85 -716 265 768 -86 -946 -68 840 -534 -1229 592 643 -569 -696 276
3586 276 420 -705 -534 585 495 -686 -456 380 44 -607 -181 748 501 -751 -261 622 -144 -945 -132
3605 -132 689 -247 -776 -42 425 -526 -818 439 501 -576 -519 270 221 -876 -384 735 365 -479 -232 430
3625 430 -46 -568 81 683 398 -748 -389 732 121 -805 -63 497 -358 -755 175 529 -440 -921 433
3644 433 499 -521 -643 408 368 -679 -568 582 422 -462 -632 343 -60 -572 -121 549 91 -785 -273
$$ packed form
3512c6O61q85o47J017L12q07m42J578j37j585M55J195j88j599O87J067j55j501
3530a010Q44O61m06j024P27J163r29j163P73J136r78r78Q15J163r46p57J210L18
3548F19j030m66J382J89j348J52Q66p4j029L25Q82N1j363N53R40p52o73O43O27
3567D94k82q35M98R30q90o31R81N03q54q60Q78R08j374o95J821N1j212j27R72
3586B76J44j125J71J119r0j181K30Q36l36o51M26R29k47j252M90Q83p66q01Q13
3605a32Q21r36n29P34M67r51k92J257O2j077N7P89m9j097M92J119l70q44K47O62
3625D30m76n22O49O02k85j146L59J121o11r26P42N60q55l97R30L54r69m81J354
3644D33O6j020j22J051m0j047J11J150j60q84j70R75m03n12M51O70m58q76N12
$$ plain form
3663 -273 518 -157 -678 169 822 -402 -817 256 542 -286 -640 568 557 -589 -740 65 450 -523 -494
3682 -494 302 380 -800 -569 542 368 -631 -225 676 5 -1001 -200 200 -91 -553 183 555 -188 -795
3701 -795 41 203 -388 -451 288 192 -413 -808 181 368 -315 -547 327 474 -626 -555 399 475 -610 -76 445
3722 445 33 -893 -342 593 -159 -827 224 528 -191 -816 -1 443 -80 -525 158 3 -674 -628 256 555
3742 555 -374 -456 340 148 -644 -251 270 299 -548 -185 348 -66 -761 36 574 -59 -551 -156 576 -579
3762 -579 -673 423 298 -133 -689 191 66 -848 -752 498 572 -687 -639 586 471 -764 -348 373 143 -1173
3782 -1173 -366 398 15 -964 -197 410 3 -832 -226 610 -227 -724 85 821 -446 -490 -30 409 -559 -629
3802 -629 347 249 -595 -606 328 357 -499 -592 707 146 -558 -516 315 -102 -719 -138 620 262 -961 -21 491
$$ packed form
3663b73P91o75n21Q47O53j224m15J073K86q28l54J208j1j146j51Q05L85r73K9
3682d94P96P8j180K31J111j74r99M06R01o71j006Q01M00k91m62P36L72p43o07
3701g95Q36J62n91o3P39r6o05l95R89J87o83k32Q74J47j100P1R54P6j085N34N21
3722D45m12r26N51R35p52o68J051L04p19o25Q15M44n23m45O83j55o77M6Q84K99
3742E55r29q2P96j92p92L93N21K9q47L63N33m14o95P97N38o33m92L95P32j155
3762e79r4J096j25m31n56Q80j25r14R6J250P4j259M8J225j15j235M16P21k30j316
3782a173Q07P64l83r79P67O07m07q35O06Q36q37m97Q09P36j267m4M60M39r68p0
3802f29R76r8q44j1R34K9q56r3J299n61p04M2Q31m17o17N81P58l58j223R40N12
$$ plain form
3823 491 -53 -658 117 652 -374 -693 -45 423 -227 -387 195 568 -318 -551 211 269 -585 -280 372 175
3843 175 -345 -233 418 398 -325 9 701 -63 -506 -12 599 -177 -677 114 585 -312 -630 -40 255 -451
3863 -451 -571 144 278 -598 -598 372 238 -486 -689 564 47 -477 -240 607 130 -722 -335 352 29 -639
3883 -639 -78 596 39 -510 243 407 -140 -653 -127 348 -554 -536 370 159 -448 -658 229 32 -510 -366
3903 -366 423 15 -750 -267 647 391 -956 -187 737 -119 -669 119 625 -54 -695 -75 687 178 -515 153
3923 153 520 -185 -768 20 236 -271 -365 247 175 -339 -385 213 514 -436 -259 167 170 -485 -287 356 261 -461
3945 -461 -213 755 -101 -641 201 579 -470 -528 265 341 -449 -894 145 413 -489 -812 520 413 -533 -484
3965 -484 246 138 -448 -556 240 151 -553 -241 506 157 -621 -13 417 -25 -535 15 191 -169 -653 209
$$ packed form
3823D91n44o05P75N35j026l19O48M68o50j60N82L73q86k33P62N8q54L05O52j97
3843A75n20J12O51k0p23L34O92p64m43M94O11p76n00P91M71q97l18N90K95p06
3863d51j20P15J34q76%R70j34p24k03J253n17n24K37Q47m77q52L87O87l23o68
3883f39N61O74n57n49P53J64n47n13N26M75r02J8R06k11o07k10Q87j97n42J44
3903c66P89m08p65M83R14k56j347P69R24q56n50P88N06o79o41O20P62n09o93O68
3923A53L67p05n83P88K16n07r4O12p2n14m6N98L01r50J77M26Lo55J98O43r5p22
3945d61K48R68q56n40Q42L78j049n8P93P6p90m45J039K68r02l23J332j07r46M9
3965d84P30j08n86j08P96q9p04L12P47l49p78O08M30m42n10N50J76l60m84Q62
$$ plain form
3985 209 74 -345 -217 288 227 -392 -422 90 351 -622 -393 690 299 -653 -379 492 397 -747 -390 561
4005 561 -103 -742 -225 559 132 -756 206 725 -245 -754 88 256 -65 -712 34 427 -322 -370 84 320
4025 320 -205 -34 366 361 -216 -462 468 103 -450 -150 570 -151 -723 97 390 -147 -559 -17 557 -447
4045 -447 -766 34 308 -178 -784 179 585 -329 -413 169 479 -414 -564 303 388 -270 -297 390 206 -840 -250
4066 -250 127 -89 -705 -13 398 -233 -674 77 452 -220 -653 62 463 -339 -309 138 512 -144 -348 275
4086 275 419 -451 -328 351 390 -469 -233 337 130 -546 -346 358 87 -752 -300 93 -396 -469 212 316 -190
4107 -190 -565 320 631 -146 -440 342 344 -322 -594 305 231 -385 -351 604 90 -434 -271 316 -182 -526 4
4128 4 201 -5 -568 119 246 -3 -649 112 410 -167 -450 40 512 -307 -480 206 308 -493 -420 395 327
$$ packed form
3985B09j35m19J28N05o1o19l0N12K61r73K29J083l91r52K74Q71r5j144L57R51
4005E61o64o39N17P84m27q88R62N19r70n09Q42J68l21o47P46L93p49m8M54K36
4025C20n25J71M00nn77k46R30l65n53L00P20p21n72Q20K93n37m12N42N74j004
4045d47l19Q00K74m86o06R63M06r14q4N82L10q93j50Q67Q5o58k7O87j84j046N90
4066b50L77k16o16O92M11o31m41P51L75o72m33P15M01q02L0M47L74o56k04O23
4086B75J44q70J23O79L9q59K36N70k07o76K00P04k71q39M52L93m89p3O81J04n06
4107a90l75Q85L11p77k94P82Ko66k72Q99p4o16L4R55n14n24J63N87m98l44N30
4128DJ97k06n63O87J27k49o46P61K98n77k83M90M72q19j73O86J02q01P3Q15o8
$$ plain form
4149 327 -665 -448 433 400 -679 -364 314 -54 -402 -51 319 106 -717 -286 161 -142 -534 -12 571 -333
4169 -333 -591 -45 255 -248 -333 469 426 -493 -608 417 327 -747 -348 224 59 -609 -166 462 -11 -645
4189 -645 -248 340 148 -929 3 555 40 -683 -84 329 -192 -727 -142 517 -155 -437 144 372 -393 -485
4209 -485 251 347 -299 -186 524 168 -582 -367 201 111 -424 -354 352 257 -693 -108 632 149 -657 78 318
4230 318 -80 -527 150 507 -366 -389 -12 299 -309 -449 -199 111 -469 -345 340 257 -239 -341 488 -104 -411
4251 -411 -411 369 51 -508 -206 249 -95 -488 -149 240 -532 -729 268 443 -239 -341 -29 288 -514 -477 167
4272 167 319 -352 -312 216 161 -612 -385 357 115 -342 -209 580 37 -684 -312 635 33 -507 -296 583 -248
4293 -248 -652 40 431 -149 -607 -123 321 -302 -376 229 268 -460 -421 201 164 -338 -402 545 592 -693 -243 287
$$ packed form
4149C27r92K17Q81l3j079L15O78l68l48L51L70k13q23M31M47l03l92N22N83r04
4169c33k58N46L00n03q5Q02m3r19j15J025r0j074L99N72j65o68M43O28m73o34
4189f45L97N88j92j077R32N52n15p23N99M13n21n35N85O59o72k82N81K28p65r2
4209d85P36R6o46J13P10l56p50K15N68r0n35P0P06r5r50N85P40m83q06P35K40
4230C18l98m47O77L57q73k3L77L11o08j40K50L10n80J24O85q3m96j02Q29n92l07
4251d11%P80l18n59L02M55l44l93L39L89p72j97R97J75o82j02L12L17q02L7O44
4272A67J52o71M0N28n5p73K27P42k42m57J33P89n43p21L72R47o02n40K11Q79q31
4293b48m04O92L91n80m58M84M44o23p4O05L9p28L9O22l7n02o4R47M7j285M50N30
$$ plain form
4315 287 184 -593 -251 365 30 -390 -193 316 -361 -633 64 551 -276 -542 152 277 -261 -532 54 572
4335 572 -475 -743 270 156 -451 -362 577 228 -500 -330 494 1 -598 -279 411 -192 -448 93 300 -184
4355 -184 -646 -225 184 -96 -526 -99 360 -493 -350 197 297 -254 -536 31 378 -618 -91 409 153 -523
4375 -523 -175 335 226 -374 -277 222 93 -485 121 355 19 -599 -423 214 -187 -392 -123 405 -252 -688
4395 -688 -37 515 -424 -367 243 200 -473 -544 146 141 -380 -460 415 77 -439 -278 252 -125 -648 -116 266 -52
4417 -52 -469 -120 359 -153 -495 1 206 -412 -664 -72 419 -262 -458 14 -105 -430 -644 289 395 -364
4437 -364 -426 82 148 -304 -177 198 -61 -423 -400 562 292 -423 -106 489 -275 -503 30 265 -323 -551 260
4458 260 543 -522 -445 511 330 -279 -321 96 258 -578 -349 108 -9 -356 -14 309 8 -296 -300 448 -18
$$ packed form
4315B87j03p77L42O16l35m20J97N09o77k72O97M87q27k66O94J25n38k71N86N18
4335E72j047k68J013j14o07Q9R39l49p28J70Q24m93n99L19O90o03k56N41K07m84
4355a84m62M21M09k80m30M27M59q53J43N47J00n51k82N67L47r96N27N00k56o76
4375e23L48N10j09o00R7M99j29n78O06K34l36o18J76O37m01k05K69N28o57m36
4395f88O51N52r39N7O10m3o73p1O90nn21q0Q75l38n16J61N30l77n23N32L82l18
4417e2m17L49M79n12l42M96K05o18k52N92M91o81j96M72j19l25k14R33J06p59
4437c64o2N08O6m52J27L75k59l62K3R62k70p15L17N95p64k28N33K35n88k28Q11
4458B60K83j065P7R56j81o09m2M17J62q36K29M57j17l47L42L23l01l04mP48m66
$$ plain form
4479 -18 -305 -80 701 123 -469 -45 291 -193 -648 114 452 -132 -294 58 216 -304 -547 316 -85 -455
4499 -455 -79 304 101 -624 -146 501 -196 -616 -247 349 -62 -654 33 288 -259 -716 -226 52 -494 -512
4519 -512 81 203 -470 -396 309 203 -191 -329 470 437 -69 -195 237 -23 -779 -579 517 189 -545 -284
4539 -284 276 -161 -571 79 568 -181 -322 160 610 -259 -530 -202 481 -350 -541 262 218 -311 -428 132
4559 132 252 -389 -505 389 399 -644 -501 329 308 -509 -208 332 -114 -309 20 403 -80 -315 -112 474
4579 474 -176 -362 170 335 -448 -674 -116 204 -354 -632 -63 225 -641 -381 329 376 -447 -412 289 314 -440
4600 -440 -222 164 38 -351 -153 681 -241 -405 134 176 -276 -640 133 373 -373 -328 -3 167 -377 -107 218
4621 218 216 -423 -624 125 -74 -477 -245 225 -8 -624 -122 274 -43 -429 31 20 77 -451 76 510 -145
$$ packed form
4479a8k87K25P81n78n92M24L36m84m55P62L38n84j62L52J58n20k43Q63m01l70
4499d55L76L83k03p25M78O47o97m20L69N96m11n92O87K55n47m57M90K78n46j8
4519e12N93J22o73P4P05j06l94j38P99l3n06j26M32k60p56K00J096l28p34K61
4539b84N60m37m10O50M89p49j41M82M50q69k71L28O83q31j91Q03m4n29j17N60
4559A32J20o41j16Q94J0j043J43Q30k1q17L01N40m46j95L29L83m83k35K03N86
4579D74o50j86N32J65p83k26N58L20n58k78N69K88q66K60P10M7q23L5P01K5p54
4600d40K18L86j26l89J98Q34r22j64N39M2m52l64P73K40p46M5L25J70n44K70L25
4621B18ko39k01P49j99m03K32M70k33o16N02L96l17l86M60j1N7n28N27M34o55
$$ plain form
4642 -145 -730 34 356 -132 -467 251 234 -365 -498 168 159 -547 -308 132 2 -571 -380 299 -27 -642 -226
4663 -226 264 -199 -311 -106 584 -206 -364 127 255 -252 -386 149 366 -395 -473 45 198 -244 -565 415
4683 415 155 -340 -249 16 82 -495 -329 148 -50 -554 -335 176 -36 -623 -149 248 22 -581 -144 197 27
4704 27 -505 -99 472 -478 -705 -1 380 -215 -478 -29 126 -459 -533 166 -64 -460 -314 87 82 -462 -478 286
4726 286 -31 -393 -18 253 -37 -654 -162 229 68 -205 -36 533 -258 -404 -41 338 -331 -534 248 184
4746 184 -267 -347 0 39 -217 -605 189 283 -299 -534 296 171 -302 -132 398 -235 -492 17 458 32 -390
4767 -390 157 367 -377 -373 195 276 -290 -435 129 410 -204 -517 154 31 -256 -375 163 119 -315 -321 164 -138
4789 -138 -366 -213 159 56 -340 -251 213 -21 -466 122 73 -119 -453 -101 264 -331 -553 -43 -4 -439 -471
$$ packed form
4642a45n85P64L22m88l35P18j7n99j33O66rp06K39M40j30n73J91O79l26o15M16
4663b26M90m63j12K05O90p90j58M91J28n07j34N35K17p61p8N18J53m42l21R80
4683D15k60m95R1K65O6n77J66M77j98n04K19N11k12n87M74L97k26o03M37L41j70
4704B7n32M06N71r50k27P04L81n95k63M49J55n85p4O99k30l96J46M01nn44j6P64
4726B86l17l62L75K71k90o17M92L91j61k73J69N69p91j46L63L79o69k03P82o4
4746A84m51q0L47L9k56l88P94R4n82k35Q30j25m73J70N30o33k57N09M41m26m22
4767c90N47K10p44MN68Q1n66j45N64K81o14l13O71j23k87j19N38m4m34oM85l02
4789a38k28J53L72j03l96Q9M64k34m45N88m9j92l34L52L65n95k22N10L9m35l2
$$ plain form
4810 -471 -113 215 -367 -218 221 213 -564 -231 -4 116 -498 -244 351 117 -541 110 352 -247 -369 -59 43
4831 43 -73 -160 -76 117 -242 -470 -6 287 -116 -462 161 205 -400 -578 181 195 -371 -377 25 106 -472 -305 120
4854 120 -66 -541 -186 354 190 -447 -282 304 115 -362 -56 174 -5 -417 -193 97 -334 -436 -120 356
4874 356 100 -356 266 71 -255 -419 297 197 -349 -182 138 -121 -539 22 347 -386 -445 -204 332 -249
4894 -249 -521 -69 158 -239 -352 54 153 -406 -304 71 185 -210 -321 -27 169 -511 -153 142 -86 -314
4914 -314 -309 303 -149 -344 81 260 -211 -157 21 395 -18 -553 -188 227 -50 -538 -81 199 -310 -356 58
4935 58 326 -453 -431 339 222 -466 -388 59 -105 -422 -415 324 145 -267 -326 180 80 -272 -134 145 76 -511
4957 -511 20 258 -142 -470 -272 381 -112 -354 169 281 102 -499 59 210 -217 -224 118 -76 -389 -383 143
$$ packed form
4810d71L58L28n82J49M39qp77L33K27J20o14K54N95k34o58O51K42n99j22L10J02
4831D3j16q7Q4J93l59k28M64K93m03l46O23M4o05j78P59J4n66oM02Q1n78J67M25
4854A20j86m75L55N40j64o37J65N86j89m77L06K30j79m12K24K90m31j02L16M76
4874C56k56m56O22j95l26j64P16j00n46J67L20k59m18N61L25p33n9K41N36n81
4894b49k72M52K27l97j13M06R9n59J02L75J14l95j11K94J96o80L58K95k28k28
4914c14NO12m52j95M25J79m71N4J78L74m13n35L65M15k77m88M57K80n09m6M14
4935E8K68p79K2P70j17o88P8M47j64l17PP39j79m12n9N06j00l52J38K79o9n87
4957e11N31K38m00l28J98O53m93k42N23J12j79o01N58J51m27pL42j94l13ON26
$$ plain form
4978 143 -97 -487 -256 231 23 -487 -338 197 -39 -317 -186 224 -85 -404 -8 284 -298 -588 141 421
4998 421 -284 -283 221 220 -277 -132 16 38 -389 -210 144 -19 -361 -194 126 -241 -191 -128 219 -177 -560 64
5020 64 352 -66 -357 20 258 -338 -249 274 328 -588 -370 110 299 -508 -450 266 192 -379 -425 92 21 -388
5042 -388 -177 272 9 -592 -60 245 109 -339 -153 188 -174 -423 -45 117 -261 -138 119 485 -204 -353
5062 -353 64 165 -327 -361 167 149 -436 -365 446 203 -337 -170 127 6 -508 -281 214 27 -260 104 462
5083 462 -212 -586 -374 160 -19 -445 -183 418 94 -295 33 117 -360 -352 166 267 -404 -474 -49 144 -394
5104 -394 -402 266 8 -484 -143 303 -330 -732 -6 474 131 -212 -202 355 60 -254 -152 156 -46 -319 187
5125 187 98 -240 -493 22 332 -176 -375 6 148 -153 -7 424 128 -293 59 170 -137 -322 -130 177
$$ packed form
4978A43k40l90K31M87k08n10J49N35k36k78J31M10l09l19L96K92n82k90P29K80
4998D21p05JN04jm97J45J48K2m27J79L54j63l42J67L20l67N0O3L47l96l83O24
5020F4K88m18k91L77K38n96Q9N23N4r16K18M80J89q07N8P16p4n71m6N17p1m09
5042c88K11M49k63o01N32L05j36m48J86L41l62k49L78J62l78J23K57L66o89j49
5062c53M17J01m92l4N28j8n85P1Q11k43n40J67K97j21n14K27M95j87k87L64L58
5083D62o74l74K12N34j79m26K62O01l24l89L28Q4m77QN18J01o71p0M25J93n38
5104c94qO68k58m92L41M46o33m02P26M80l43l43J0N57k95l14J02L08k02k73N06
5125A87q9l38k53N15L10n08j99L81J42l01J46M31k96m21L52J11l07j85J92L07
$$ plain form
5145 177 -266 -519 28 235 -89 -212 -17 189 -76 -425 -74 225 -244 -252 305 390 -127 -569 132 103 -360
5166 -360 -192 292 -11 -287 -395 180 -20 -202 -188 220 -30 -266 57 134 -130 -363 0 67 -126 -366 111
5187 111 548 -395 -296 130 246 -250 -475 -63 265 -354 -104 139 35 -514 -145 327 -4 -454 -282 170
5207 170 139 -110 -133 161 54 -268 -5 183 -59 -359 -222 437 -200 -288 107 397 -62 -409 -20 -28 -356 -108
5229 -108 327 205 -279 -246 -11 -241 -497 -121 252 72 -538 -181 136 -135 -217 -378 392 -96 -490 -124 350
5250 350 13 -256 51 479 -296 -485 159 128 -246 -166 189 15 -430 -234 -346 -8 -436 -318 143 -227 -517
5271 -517 -295 77 -204 -113 -124 374 -360 -537 30 191 -42 -248 93 120 -360 -537 264 -86 -200 -403 -211
5292 -211 152 -544 -571 216 83 -336 81 145 -242 -461 -126 355 -4 -437 101 32 -339 -424 -135 347 -365
$$ packed form
5145A77m43k53N47K07l24j23J95K06k65l49L51K99m69qN57Q5n17m42P01k9m63
5166c60J68M84l03k76j08N75k00j82J4M08k50k36L23P7k64k33L63O7j93k40M77
5187A11M37r43R9M26J16m96k25M12L28o19K50K43j04n49L69M72l31m50J72M52
5207A70l1k49k3K94j07l22K63J88k42l00J37O59o37q8L95K90m59l47L89ql28K48
5229a08M35j22m84L3K35k30k56L76L73j80o10L57L17k71q2j61P70m88l94L66M74
5250C50l37k69L07M28p75j89O44l1l74Q0L55j74m45J96j12L38m28J18M61l70k90
5271e17K22L72k81R1j1M98p34j77N67J61k33k06L41K7m80j77Q01l50j14k03J92
5292b11L63o96k7P87j33m19M17O4l87k19L35M81l59m33N38o9l71q5K89M82p12
$$ plain form
5313 -365 -279 187 95 -327 -156 328 134 -80 -97 146 -227 -424 -324 255 105 -285 -384 270 67 -724 -194
5334 -194 316 -161 -456 68 359 -304 -353 -173 389 -37 -211 -87 183 -259 -301 44 1 -146 -512 -48 307
5355 307 -198 -377 148 99 -395 -157 84 358 -472 -301 340 131 -278 -22 182 -91 -293 -24 239 122
5375 122 -422 -128 31 -284 -200 170 248 -448 -337 -38 117 -218 -171 161 -88 -337 -230 224 -45 -396 23
5396 23 102 -19 -316 -29 230 -173 -371 -129 322 -365 -477 -55 180 -277 -329 23 152 0 -525 261 -141
5417 -141 -437 -135 280 79 -357 -105 170 41 -250 -76 -12 110 -175 -300 -38 -92 -158 99 175 -167 -414
5438 -414 -209 289 -100 -334 139 126 -464 -470 242 29 -356 -95 30 248 -377 -162 222 27 -309 -184 161
5459 161 119 -192 7 306 152 -390 -20 154 -38 -482 52 203 -254 -511 32 388 -254 -388 180 57
$$ packed form
5313c65Q6M66r2m22J71M84j94k14j7K43l73j97J00N79j50l90r9O54k03p91N30
5334a94N10m77k95N24K91o63m9J80N62m26j74J24K70m42m2L45m3j47l66M64L55
5355C07n05j79N25m9m94K38K41K74q30J71O41k09m09K56K04k73k02K69K63j17
5375A22n44K94J59l15Q4L70P8o96J11K99J55l35M7L32k49k49J07M54k69l51M19
5396B3P9j21k97K87K59m03j98K42M51o87j12M22K35m57n2L52J29j52n25P86m02
5417a41k96L02M15k01m36K52K75j29k91J74O4J22k85j25K62n4o6K57P6l42k47
5438d14K05M98l89k34M73j3n90oP12k13l85K61J25K18o25K15L84j95l36J25L45
5459A61m2l11J99K99j54n42L70J74j92m44N34J51m57k57N43L56o42j34N68j23
$$ plain form
5479 57 -222 -217 175 311 -428 -232 250 174 -269 -232 -57 -99 -392 -160 428 -188 -538 -272 221 17 -251 -78
5501 -78 364 -138 -359 -9 288 35 -258 236 36 -316 -321 61 34 -423 -345 153 144 -317 -428 160 146 -306 -189
5524 -189 300 118 -491 -194 189 -266 -479 -165 131 -236 -174 164 435 -154 -380 102 241 -313 -124 307
5544 307 127 -245 -117 140 258 -246 -151 57 125 -390 -308 300 -214 -241 -130 149 -226 -439 -146 186 -265
5565 -265 -270 66 96 -301 -283 122 194 -84 -261 38 15 -504 -182 32 287 -540 -208 423 -71 -186 -314 87
5587 87 -10 -493 -226 254 -74 -219 65 24 -285 -430 -56 480 -162 -165 -83 117 -66 -225 208 116 -400 -228
5609 -228 213 166 -447 -421 317 22 -332 -283 193 130 -261 -43 390 -396 -160 13 242 -286 -344 -244 -10 -484
5631 -484 -401 17 102 -383 -214 54 323 -66 -135 144 53 -117 -425 173 5 -57 -23 -60 -65 -437 -161 133 -181
$$ packed form
5479E7k79NL92J36p39J96M82p6m43L7J75m2k93K32N88o16l50K66M93k04k68J73
5501g8M42n02k21L50K97k53k93M94k00l52nL82k7m57P8M98rm61j11N88j4m52J17
5524a89M89j82o09K97L83m55k13L14K96l67O2L38K71n89k26M82J39n54J89M31
5544C07j80l72J28K57J18n04R5K08O8n15Q2O08n14k7J11K79l75k13K93L32m51
5565b65nL36L0l97J8M05P2k78j77K99k3n19L22K14K55q27L32O31m94j15j28M01
5587H7r7m83K67M80l28j45K84m1l09j45L74N36o42lQ2K00j83j59M33r2n16J72
5609b28M41m7o13K6P38k95l54M9M76o3l91K18M33p86K36J73K29n28n8J00K34m74
5631d84Q3M18Q5m85J69K68K69l89o9K79r1j70l08N98j68o2L4l7nl72K76K94l14
$$ plain form
5654 -181 -2 -176 306 -141 -274 -284 94 -163 -161 212 193 -320 -339 76 342 -86 2 69 97 -496 -416 175 27
5677 27 -128 -312 96 -143 -279 -62 122 -144 -296 -279 -12 -94 -370 -53 94 -224 -403 29 189 -229 -289
5698 -289 46 -10 -166 -140 300 71 -264 -330 44 -130 -337 -287 82 26 -338 -323 273 118 -358 -73 80 -148
5720 -148 -331 -225 163 -242 -388 -239 53 -163 -117 227 178 136 -104 -136 -9 -262 -343 8 -74 -80 -42 -157 155
5743 155 -390 44 143 -221 -167 -241 87 -68 -502 -53 188 89 -180 87 43 -1 4 63 65 50 -309 54 32 -169
5767 -169 -160 5 -59 -239 -534 88 -202 -429 -95 -5 -32 -355 -135 50 -65 -320 -9 125 -15 -218 -137 304
5789 304 -131 -389 217 203 -203 -298 23 69 -146 12 139 25 -505 -370 312 -93 -33 -238 101 -87 -440
5810 -440 -169 219 -97 -375 -344 64 -236 -409 39 -82 -174 -340 21 -112 -322 -292 135 -113 -186 -394 -166
$$ packed form
5654a81J79j74M82m47j33j0L78k57KL73j9n13j9M15K66m28Q8O7K8n93Q0N91j48
5677B7j55j84M08k39j36K17J84k66j52J7K67q2k76L17J47l18j79M32J60m18o0
5698b89L35n6j56K6M40k29l35o6L74j74k07N0L69n6l64J5N96j55m76K85J53k28
5720a48j83J06L88m05j46J49K92k16M6L44m9m2k40l2J27k53q1L51q2oL8j15L12
5743A55n45M34R9l64N4p4L28j55m34M49K41r9k69K67m4m4NN9Kj5l59L63k2k01
5767a69RJ65o4j80k95O22k90k27L34R0k7l23K20J85j15k55L11J34j40k03Q1M41
5789C04m35k58O06j4m06r5L21M6k15J58J27j14n30J35O82m05O0k05L39j88l53
5810d40K71L88l16k78L1M08l00j73M48j21r2j66L61j33k10L0M27k48p3k08K28
$$ plain form
5831 -166 -164 -470 -231 14 171 -389 -119 154 211 -445 -198 214 170 -296 -186 290 -215 -250 -86 -32 -126 -159 83
5854 83 34 -164 -319 -65 164 -103 -67 -118 27 -122 -436 290 205 -251 -166 -143 152 -225 -219 326 -203 -489 -123
5877 -123 145 -120 -556 -225 76 -206 -134 -21 231 -196 -256 44 240 -225 -318 -156 -97 -145 -382 266 271 -190
5899 -190 -217 244 196 -343 -160 190 170 -361 33 39 -366 -319 235 149 -221 -260 -213 -107 -223 -204 49 228 -306
5922 -306 -163 8 -32 -338 -309 -98 250 -257 -370 80 128 -175 23 233 -38 -379 -242 150 -380 -348 184
5943 184 351 -343 -164 20 -125 -111 -438 -26 -145 -341 -476 117 203 -326 -34 23 101 -249 -89 178 -18
5964 -18 -190 -129 235 -96 -552 -171 -40 79 -497 -207 85 -94 -372 58 245 -219 -148 -125 134 -135 -282
5985 -282 42 42 125 -384 -51 97 -178 -102 85 -47 -233 -63 -24 -324 -348 -106 -94 -80 -389 -102 55 -156 -400
$$ packed form
5831a66Kl06K39K45J57n60K70K73N7o56K47M12m4m66J10M76n05l5J64N4r4l3K42
5854H3m9j98j55K54K29k67L6n1J45j49l14P26q5m56Q5K3K95l77ON45n29k86L66
5877a23K68k65m36L31L01k82P2J13K52m27o0L00J96m65r3J62N9m8k37O48Nm61
5899a90k7M61m8n39J83L50k0n31L94Om05M7N54q6l70l9M7J06j16J9K53J79n34
5922c06J43J71m0l06K9K11L48n07j13M50M8l03J98K10k71l41J37L92n30L2N32
5943A84J67o94J79J84j45J4l27M12j19j96j35N93Q6n29K92N7P8l50J60K67j96
5964a8j72O1L64l31m56L81J31J19n76K90K92j79k78M30J87m64P1K3K59k69j47
5985b82L24%Q3n09L33J48k75P6J87j32j86J70L9l00k4K42J2J4l09K87J57k11k44
$$ plain form
6008 -400 -122 249 -6 -459 7 102 -239 -331 9 -39 -309 -461 -35 265 49 -146 381 -113 -315 -90 285
6029 285 6 -456 -70 75 -260 -315 -325 196 -119 -358 -127 79 -261 -365 47 56 -68 -267 -64 101 -213
6050 -213 -120 55 57 -349 -120 -21 8 -346 -48 134 -221 -308 -225 111 -306 -184 -35 173 -108 -302 -105 135
6072 135 -359 -216 -161 -60 -249 -319 120 -66 -263 -345 -15 111 -274 -112 33 170 -309 -4 118 168 -335
6093 -335 -137 80 -87 -420 -136 122 -190 -348 -61 302 -74 -323 -190 216 -247 -192 37 82 -188 -230 32
6114 32 69 -156 -145 -62 188 -400 -433 166 -78 -450 176 516 -141 -132 -212 -109 -43 -261 243 31 -239 -271 -43
6137 -43 -23 -182 -295 40 52 -217 -480 -122 -71 -251 -105 133 -5 45 -119 128 17 -315 49 -29 0 -324
6159 -324 -173 123 -89 -420 -38 -166 0 42 -169 130 -192 92 12 3 -319 -240 78 13 -139 -276 -55 -134
$$ packed form
6008d00K78L71k55m53M66R5l41r2L40m8k70j52M26L00k16j95N27m94k02K25L75
6029B85k79m62L86J45l35n5j0N21l15k39K31K06l40j04M12Rj24j99K03J65l14
6050b13R3J75Km06K29R9K9l54K98J82l55q7Q3L36m17J22J49K08k81j94J97K40
6072A35m94J43N5J01j89p0M39j86j97q2L30J26l85J62J45J37m79L05J22N0n03
6093c35J98K17j67l33K84K58l12j58K87L63l76k49J33M06m63N5K29M5k70m2K62
6114C2L7k25J1Q3K50n88l3N99k44l72O26L40o57Rq0J03O6k18N04k12k70l2K28
6137d3K0j59j13L35J2k69k63L58N1j80J46K38j38N0j64K47j11l32L64p8K9l24
6159c24J51K96k12l31L82j28J66M2k11K99l22K84q0rl22P9L18o5j52j37K21p9
$$ plain form
6181 -134 -251 33 123 39 -175 36 157 129 -126 -132 57 6 -267 77 42 -307 -164 -56 171 -105 -224 4
6203 4 122 -120 -127 -51 233 -61 92 -75 279 -242 -99 157 -92 -520 199 -25 7 -194 -117 199 -271 -107
6225 -107 -197 194 105 -194 -124 134 -50 -5 -97 29 -222 -321 67 325 -166 -134 137 -4 -78 -298 20 -133 -31
6248 -31 -288 320 -138 -170 -21 419 57 -436 47 114 -509 -269 -33 53 -160 -526 -75 56 60 -405 -196 59
6270 59 -187 -320 23 -15 -96 -164 -133 227 -241 -233 -154 40 -175 -147 25 -37 -218 -217 -119 1 -109 -8 65 -32 -492
6295 -492 -196 -44 -223 -24 0 -88 -201 -354 112 -39 -353 -142 175 49 -150 -354 153 325 -145 42 -17
6316 -17 24 -154 -271 76 -62 116 -67 -106 -300 -180 -180 71 -103 -353 58 -33 -89 -206 207 -104 -329 -114
6338 -114 337 -23 -132 -281 274 -39 -208 25 -18 60 -374 -214 -207 -191 -293 49 -28 -262 -276 -132 255 -275
$$ packed form
6181a34j17K84R0q4k14K11J21k8k55oJ89n1k73L44l5l49J43J08K27k76j19K28
6203DJ18k42pP6K84k94J53j67L54n21J43K56k49m28P19k24L2k01P7L16m70J64
6225a07r0L91q9k99P0K58j84M5r2J26k51r9L88K58m91L2K71j41p4k20L18j53J02
6248c1k57O08m58l2J49M40l62m93M83O7o23K40K36Q6k13l66M51J31Mm65K09K55
6270E9k46j33L43l8q1o8L1L60m68QP9J94k15K8J72o2j81JR8J20j10J01P3r7m60
6295d92K96J52j79J99K4q8j13j53M66j51l14K11L17j26j99k04N07J72m70J87n9
6316a7M1j78j17L47j38J78j83l9j94J20%K51j74k50M11r1n6j17M13l11k25K15
6338a14M51l60j09j49N55l13j69K33m3P8m34J60PJ6j02L42p7k34j4J44L87n30
$$ plain form
6360 -275 -95 95 -6 -125 -205 -92 280 -191 -50 179 -130 -140 -104 216 116 -100 -132 45 148 -300 -47
6381 -47 -116 -162 -295 -350 168 -179 -171 70 -32 -51 -307 -189 76 -170 -317 44 -57 -63 -110 128 26 -356 -296 -23
6405 -23 79 84 -259 260 56 -213 -104 117 -58 -199 101 -100 -169 -171 147 -59 -36 -80 -60 88 78 -110 108
6428 108 -17 -151 -127 106 -201 -201 68 -7 -76 -334 152 355 -116 -186 -138 -25 147 -544 210 -14 -7 -239 -159
6451 -159 -75 -153 -3 2 52 -328 -240 -64 -139 -355 -207 51 -18 -182 -251 4 -45 -240 -269 133 -67 -449 -182 -201
6475 -201 -34 -490 20 98 -71 -111 -192 -44 -283 -83 -258 -104 -72 -367 -156 140 -452 -136 60 -79 -278
6496 -278 -239 106 -17 -463 229 57 -37 -321 -8 31 5 -100 -107 -14 -204 57 -44 -175 -94 -179 50 131 -32
6519 -32 -247 32 73 -409 -429 -11 2 -209 -308 101 -102 -82 -89 179 15 -178 -141 -54 -132 -101 -60 -198 -206 -332 -188
$$ packed form
6360b75J80J90j01j19q0J13L72m71J41K29l09j0L6L20j00k16l2J77J03m48K53
6381d7o9m6j33n5N18l47QK41j02j9k56J18K65k46j47L61j01om7K38j02l82O0K73
6405b3J02Nl43N19k04k69J09K21j75j41L00k01o9kL18k06K3m4K0J48j0j88K18
6428A08j25j34K4K33l07%K69p5o9k58M86K03m71p0M8J13J72o91P54k24Pk32Q0
6451a59Q4p8J50NN0l80Q8J76p5k16J48K58o9j64o9K55m9j95k9M02k00l82K67j9
6475b01J67m56N10P8j69m0q1J48k39K00j75J54L2k95K11K96n92L16J96j39j99
6496b78L9L45j23m46O92j72r4k84L13L9k6j05pR3j90K61j01j31Q1q5K29Q1j63
6519c2k15K79M1m82k0M18J3k11r9M09k03K0pK68j64j93L7Q7p8L1M1j38qj26J44
$$ plain form
6544 -188 232 15 -165 -218 74 -220 -381 180 77 -216 -320 25 -290 -366 -191 163 -161 -226 -311 80 -125
6565 -125 20 104 -172 -172 -187 -140 149 19 -542 71 -209 84 -220 -34 15 -255 -126 62 195 -390 -438 128
6587 128 139 -181 15 48 -192 -464 -186 139 -48 -519 -110 -67 -74 -359 -102 7 -73 -175 -192 227 -85 -272
6609 -272 -202 -121 -92 -193 66 -45 -238 -329 -110 16 -381 -210 -256 -260 -56 -266 303 -23 -419 -120 -127 -19 -299
6632 -299 -19 -5 -365 -174 293 -73 127 -14 -2 234 -125 -151 -211 80 -245 -103 32 82 -176 -140 -113 -69 -20
6655 -20 -94 -143 336 -203 107 53 -182 -320 -225 -95 -19 -163 -296 -20 -83 -384 -16 78 -142 -3 -70 -16 -118
6678 -118 -165 65 71 -457 -140 -74 155 -257 -226 -39 -13 -119 -495 309 -372 -119 -113 51 -212 -422 -25 70 -191
6701 -191 -230 -62 76 -46 40 -54 10 3 -313 90 41 -225 -164 -40 59 -71 17 205 12 -275 -160 95 -134
$$ packed form
6544a88M20k17j80n3K92k94j61N61j03k93j04L45l15p6J75L54l24o5q5L91k05
6565a25J45Q4k76%j5M7K89j30n61O13k80K93l04J86M9k70J29J88J33n85m8N66
6587A28J1l20J96L3k40k72K78L25j87m71M09M3pk85K57J09q0j02j7M19l12j87
6609b72P0Q1K9j01K59j11j93r1K19J26l97J71m6mK04k10N69l26l96K99pJ08k80
6632b99K80J4l60J91M67l66K00j41J2K36l59k6o0K91l25J42J35N0k58L6K7M4M9
6655b0p4m9M79n39L10n4k35j38R5J30P6j44j33K76o3l01L68R4k20J39o7N4j02
6678a18m7K30On28L17O6K29m12L1J87K6j06l76Q04o81K53OJ64k63k10L97R5k61
6701a91l9J68J38j22Q6r4O4pl16M03m9k66O1J24R9j30Q8J88j93k87J15K55k29
$$ plain form
6724 -134 -272 -238 79 -106 -431 36 -135 -237 -482 45 70 31 -198 -138 235 -228 -144 -18 -101 -252 -246 122 118
6747 118 -171 -29 97 101 -448 -118 208 -213 -138 -181 -16 -230 -254 -59 36 166 -68 -93 -35 -14 -52 55 5 -127
6771 -127 -353 -303 -86 -179 -245 23 102 -224 -97 -163 -42 -372 -273 17 -116 29 -154 -243 -44 -163 -11 -183
6793 -183 -99 -158 -196 -86 -10 -411 153 265 -243 -269 89 -96 -147 179 45 -152 -263 45 -115 -155 -521 -92
6815 -92 67 1 -281 -269 37 -83 -241 -86 31 -176 -239 -59 -177 -361 -304 -36 59 37 -259 155 75 -303 -237
6838 -237 -21 253 -336 -398 -28 7 -188 -25 -127 -135 -68 -154 36 -126 -326 -47 193 -158 -237 -47 261 28
6860 28 -93 7 169 -59 -322 -13 55 -413 -264 85 -211 -211 -57 60 -44 -448 -128 213 -153 -29 -146
6881 -146 -93 -19 -216 55 160 155 -166 -66 -15 -163 -139 -90 45 -229 -495 -100 155 -298 -169 135 86 -102 -19
$$ packed form
6724a34j38L4L17j85l25M67j71j02k45N27K5l9k29O0L73m63Q4J26q3j51OL68m
6747A18k89J42J26Mn49L30L26m21P5m3J65k14k4J95R5J30k34k5N8K1l8J07n0j32
6771a27k26N0K17r3o6K68P9l26J27o6J21l30R9K90j33J45j83q9J99j19J52j72
6793a83Q4n9l8J10P6m01N64J12n08k6L58j85n1L26j34j97j11L08j60m0l66M29
6815i2J59o6k82J2L06j20j58J55J17k07o3J80j18j84N7K68R5k2k96M14q0l78O6
6838b37K16K74n89o2L70L5j95J63j02qO7q6J90j62k00K79K40l51p9J90L08k33
6860B8j21J00J62k28k63L09O8m68J49L49k96%J54J17j04m04L20L41l66J24j17
6881a46N3P4j97K71J05nl21J00N1j48K4M9J35k74k66L95K55m53J29L04m9j88Q3
$$ plain form
6904 -19 11 -52 -381 -9 -57 -233 -176 -264 -56 38 -242 65 37 116 62 -125 303 90 -177 -82 -18 -96 -136 -65 91
6929 91 -120 -145 -104 115 -267 -149 -223 -228 -100 -294 173 -37 -430 -314 -88 -67 -202 -252 42 -40 -354 -62 -14
6952 -14 -84 -117 175 194 26 -374 -76 -4 -96 -199 71 -41 -233 -139 69 117 123 -241 -51 -175 -6 -19 83 -242
6976 -242 -278 -47 37 -150 -145 -208 -8 -41 -247 -12 8 -124 -360 76 132 -133 -149 115 95 18 -500 28 -86 -410
7000 -410 -62 170 142 -365 -185 111 -67 -202 56 123 -196 -374 35 -106 -22 -53 32 -56 -73 -37 -193 159 -406
7023 -406 -152 -12 -209 -231 -278 155 114 -235 -112 -194 66 -265 -318 188 97 -262 -14 -161 -220 -252 9 -66 -119
7046 -119 -108 -39 111 -124 -252 94 20 -45 99 4 -27 -176 -282 45 -299 -297 -77 188 121 -319 -187 155 59
7069 59 -457 -67 366 -33 -286 35 -3 -22 -333 -234 4 -104 -232 -43 61 64 -264 65 -49 -218 -186 37
$$ packed form
6904a9L0o3l29L72m8j76N7q8K08R4k80L07k8P9n4j87M28k13k67R5O4p8m0P1J56
6929I1k11k5M1K19l82J18p4nJ28j94M67k10l93J16K26K1j35n0K94q2l14K92M8
6952a4p0l3K92J9j68m00K98P2r2j03K70j12j92R4K08M8Ol64J90j24J69j3J02l25
6976b42l6K31Q4j87No3K00l3k06K35K0j32k36M36N6k65j6K64k0p7n18N28j14l24
7000d10L48K32k8n07J80K96j78j35K58O7l19j78M09j41Q4l1Q5q8j7L6j56L52n65
7023d06K54J40j97k2m7M33m1l49J23q2K60l31n3N06r1l59K48j47n9l2K61p5n3
7046a19J1O9J50k35j28L46p4o5J44r5l1j49j06L27l44KK20K65o7m40J32L42r6
7069E9n16L90M33l99k53L21l8j9l11R9K38j08j28J89J04Ll28L29j14j69L2K23
$$ plain form
7091 37 -61 -434 -80 142 19 -179 37 53 -25 -341 -74 -17 -128 -380 55 -27 -173 -158 15 158 -240 -371
7113 -371 -297 164 -76 -149 205 172 -115 -247 106 74 -204 -9 -191 167 -144 -114 135 63 210 -62 -50 -292
7135 -292 -94 -2 85 -169 -161 -40 10 -37 -63 187 -52 -229 -196 99 -114 -249 -95 37 87 -144 -199 145 -19
7158 -19 -181 -247 144 -77 -100 -92 185 -6 -119 -214 -96 -225 -266 -221 -64 -295 -293 34 135 -265 -149 -144 -107 68
7182 68 -133 43 26 -164 28 209 -97 -258 -8 -102 -155 -197 -367 18 -14 -62 -213 88 -64 -269 -121 0
7204 0 -114 29 -84 211 -393 106 -39 -139 -56 -255 0 10 -184 -334 -22 26 -219 -247 -140 -237 -333 -215 8
7227 8 -204 -166 97 97 -44 -236 121 -105 -146 -435 -274 60 -265 -81 57 62 -319 -104 -54 192 -98 -172 136
7250 136 26 -198 5 48 177 -253 -237 166 -37 -348 -48 -84 27 -271 -340 -153 -99 -402 4 146 -219 -313
$$ packed form
7091C7r8l73L54K22j23j98K16J6p8l16K67N7j11k52M35q2j46J5J73J43l98j31
7113c71P4M61k40p3L54l3k87j32L53l2k78J95j82L58l11L0K49p2J47k72J2k42
7135b92J98R2Q7k54QJ21N0m7k6K50k39j77L3K95k13j35J54J32N0k31n5L44j64
7158a9j62o6L91k21k3QK77j91j13r5J18j29m1M5J57k31KL27J01m00J16NL7J75
7182F8k01J76j7j90J92J81l06j61K50r4n3m2j70L85l2m8j51L01j52k05J48J21
7204@j14J43j13K95o04M99j45j00Q3j99K55J0j94j50L12M8k45k8J07r7r6J18K23
7227Hk12L8K63%j41j92L57k26m1k89J61L34l25J84J38Nl81K15N0K46k90p4L08
7250A36j10k24K03M3J29m30J6M03k03l11L00l6J11k98o9J87N4l03M06J42l65r4
$$ plain form
7272 -313 116 0 -139 -158 -85 -2 -27 -206 -11 -37 -341 -250 165 222 -159 -266 -35 -119 -258 25 170 -77 0
7295 0 -201 -150 -236 -372 -149 72 -173 -283 49 30 -81 -182 -42 -56 23 -168 -222 47 -169 -164 154 303 -343
7318 -343 25 231 -149 -169 -52 267 26 -177 -191 -81 -10 -268 -94 110 -169 -130 27 -306 -383 -267 25 85
7340 85 -1 -309 30 -115 -276 -314 -171 -31 -65 -31 80 10 65 -189 185 -210 -243 -159 84 -178 -77 74 138
7363 138 -77 -138 78 65 -103 -129 5 205 -219 -65 -18 -147 -14 -46 -3 -158 -207 -62 24 -282 -315 -89 168
7386 168 -399 -150 -48 13 -215 -169 83 308 -136 -360 -418 132 -137 -252 -59 97 -203 -215 30 -158 -94 -262
7408 -262 -128 99 -149 -496 129 -89 -92 -164 -61 127 -223 -192 -143 0 36 -264 132 -122 -167 -130 -242 -192 -99
7431 -99 180 48 -148 -240 -164 -259 -301 12 37 320 -227 -285 72 -294 -26 -126 129 -58 -393 -9 163 71 -105
$$ packed form
7272c13M29j16j39j9P3Q3k5j79J95k6l04R1M15N7l81j07K31q4j39K83J45k47P7
7295@k01N1q6j36K23K21k45j10L32j9j11j01J40j4P9j91n4K69k16NL18J49o46
7318c43L68K06l80k0J17L19k41k03j4J10P1k58J74K04k79L9J57l33p7J16K92O0
7340H5q6l08L39j45j61l8J43J40l4L4J11p0N5k54L74l95l3Q4K43k62J01J51O4
7363A38k15o1K16j3j68k6J34K00m24J54M7j29J33l2M3j55m9J45Q6l06l3K26K57
7386A68n67K49J02O1k28M6K52K25m44k24n8N50k69j15J93J56l00j2K45j88O4j68
7408b62J34K27k48l47O25k18lp2J03J88l50L1M9J43L6l00L96k54m5L7j12N0R3
7431i9K79j32j96r2P6r5m2L13K5K83n47n8L57l66K68j00K55j87l35L84J72r2j76
$$ plain form
7454 -105 -104 -75 29 -324 -26 -18 -233 -269 108 -133 -286 -241 -117 -238 -235 13 -260 199 -110 -287 125 183 -464
7477 -464 -136 32 -12 -316 -141 25 -48 -251 -89 -23 -57 -455 -129 106 -257 -231 85 -248 -40 -267 114 79
7499 79 -94 38 -25 -15 -447 53 -207 88 -123 43 33 -155 -301 -181 -142 -240 -127 144 -185 -102 -414 26
7521 26 -70 -73 -279 -25 124 149 93 -8 6 -343 -272 -34 -94 -344 -20 -138 -3 -160 -54 125 152 -382 121
7544 121 255 -189 -98 20 1 83 -271 -129 -77 -347 -170 85 -102 -224 -246 -54 -107 -59 -227 4 30 90 -586
7567 -586 -26 201 -237 96 -4 125 -272 -28 181 143 -93 -232 128 -41 -144 -172 113 -59 -176 -65 81
7588 81 -217 -161 18 -55 -351 28 21 -37 -222 -206 5 204 -40 44 -176 -64 -344 -223 38 -69 -42 140 84
7611 84 -144 20 -11 -101 -367 -323 119 -86 -192 66 102 29 -34 -103 82 -133 -101 -174 -86 -233 -131 -145 65 -125
$$ packed form
7454a05JK9J04l53K98Qk15l6L77k41j53M5J24j21LK48k73M59l09j77M12N8o47
7477d64L28J68m4l04J75J66p3k03J62O6l4l98L26K35l63K6L16l33K08k27L81l5
7499G9j73J32o3J0m32N00k60K95k11J66j0j88j46J20L9r8J13K71l29Q3l12M40
7521B6r6lk06K54J49K5n6j01J4l49P1K38o0k50L24j18J35j57J06J79K7n34N03
7544A21J34m44R1J18j9Q2l54J42N2k70J77K55j87j22k2J92n3M8j68K31K6O0o76
7567e86N60K27m38L33j00J29l97K44K09l8k36j39L60j69j03k8K85j72j17J11J46
7588H1k98N6J79p3k96L79pn8j85J6K11J99k44Q4k20J12k80J21K61j07K7J82n6
7611H4k28J64l1r0k66M4M42k05j06K58L6p3o3o9J85k15L2p3Q8j47J02j4K10j90
$$ plain form
7635 -125 -273 -89 -96 -197 -307 44 -174 -118 -220 -95 112 139 -227 39 -195 -307 -68 45 -48 -307 -256 57
7657 57 -64 -258 -98 -94 -73 -449 -214 22 -55 -26 -127 -68 -299 -87 -99 -249 44 -200 -23 -167 -57 -138 -197
7680 -197 2 -83 -138 -168 10 -107 -233 -73 44 -193 -432 -159 -111 -317 -156 -50 -106 -42 4 169 102 -240 163
7703 163 296 -261 -53 -94 -144 -189 -214 -82 109 -33 -395 -201 43 -213 -30 78 39 -372 -82 92 -132 -81
7725 -81 -7 247 306 -38 -130 -148 27 6 -104 -62 -12 29 -4 80 -168 -205 -119 -163 -102 -212 -21 48 -208 -380 93
7750 93 -47 -210 -174 -47 -170 -188 -25 -217 -44 -107 -285 131 -5 -202 91 131 -156 -196 43 98 -238 73
7772 73 89 -54 -185 -115 -96 -83 -185 -132 -75 -257 -142 -132 151 -65 -75 -111 291 26 -15 -205 85 164 -251 -190
7796 -190 13 86 -167 -246 -76 27 -309 -208 -33 -151 -264 -90 113 -10 -164 -27 -34 -120 -183 235 137 -355
$$ packed form
7635a25j48J84pj01j10L51k18N6j02J25K07K7l66K66k34j12K39J13r3k59N1L13
7657E7j21j94J60MK1l76K35K36p7K9j01N9k31K12j2j50K93k44J77j44J10q1n9
7680a97J99q5n5l0J78j17j26J60J17k37k39K73M8k06J61J06n6O4M6J65o7l42M03
7703A63J33n57K08m1n0m5k5J32J91j42l62J94K44k56J83J08l9m11K90J74k24N1
7725h1P4K54N9l44r2j8J75k1j10M2N0M1l3Q4k48l7Q6m4O1j10J91O9k56j72M73
7750I3j40j63L6J27j23j8J63j92J73o3j78M16j36j97K93M0k87m0K39N5l36L11
7772G3J6j43j31P0J9J3j02N3N7j82J15J0K83k16j0l6M02k65m1j90K90P9m15O1
7796a90K03P3k53p9J70J03l36J01J75j18j13J74K03j23j54J37pq6o3M18r8m92
$$ plain form
7818 -355 -49 -215 35 -119 -106 -101 53 -129 186 -198 -6 -116 -99 104 -306 55 109 -155 -237 -86 -181 10
7840 10 -100 -62 -103 96 -144 -262 -278 -20 -115 -35 -31 -51 -160 -192 -295 -48 -121 -239 -141 -85 -306 84 -84 -131 22
7865 22 70 -19 67 -207 -140 9 -226 -66 -209 -18 -432 -157 -110 88 -138 -85 -132 -195 -218 -377 -102 -251 -39
7888 -39 -261 -150 -339 -91 -185 -3 -36 -256 98 -3 -197 -303 -35 52 39 -128 -151 54 -455 -222 26 38
7910 38 -284 -73 181 -21 -227 45 -171 44 -279 -156 -95 -120 -280 -198 129 -318 -234 -223 -219 -333 81 -42 65
7933 65 -28 -47 157 53 -352 -403 -24 161 -25 -105 -151 -210 -33 -293 99 146 -90 -221 -11 27 -240 -42 -74
7956 -74 83 -82 -137 1 -93 -172 -139 -191 -64 -255 -91 -56 -183 -138 -46 102 -133 -240 -81 265 -218 -405 -109
7979 -109 -212 -82 -1 -179 -109 -110 -2 -40 -262 -14 -145 69 15 -279 -16 -170 -57 -150 -118 -28 -85 -88 53 -288
$$ packed form
7818c55L06j66K50j54J3NJ54j82L15l84J92j10J7K03m10L61N4k64q2J51r5J91
7840A0j10L8m1J99k40j18j6K58r5Q0Mk0j09l2j03K47p3j18R8N6k21L90j68m7J53
7865B2M8q9Q6k74O7J49k35J60j43J91m14K75M7J98k26N3m7o3k3j59K75j49K12
7888c9k22J11j89K48r4J82l3k20L54j01j94j06K68Q7j3j67k3K05n09K33K48J2
7910C8l22K11K54k02k06K72k16K15l23J23O1k5j60Q2L27m47Q4J1Mj14M14j23J07
7933F5r3j9K04j04m05n1L79J85j86q0m6n9J77k60L92M7k36j31K10L8k67J98l2
7956g4J57j65n5J38r4p9L3n2J27j91J64L5j27M5R2J48k35j07J59L46m83j87K96
7979a09j03J30Q1j78P0jJ08l8k22K48j31K14n4k94K63j54J13r3L2R0n7lJ41l41
$$ plain form
8003 -288 -141 -119 -245 -162 33 -223 16 -150 -323 -62 150 222 -218 107 -85 -161 -102 -231 45 -213 -159 102
8025 102 285 -31 -272 41 195 -44 -247 32 -69 -373 32 -33 -39 -45 96 -82 2 -190 -164 15 -310 -189
8047 -189 73 -52 -92 -185 -31 -47 -93 -110 -11 -26 -15 -42 -78 -164 -151 -279 -268 -105 -57 -69 -88 -216 -284 -143 104 -181
8073 -181 -284 -98 3 -1 -220 -91 224 -128 -231 -240 -226 -93 -5 24 24 -301 24 -105 147 -168 -205 -37 -160
8096 -160 23 -211 -42 -182 -207 -103 -139 -107 -325 46 19 -145 -331 45 -194 -137 93 -220 78 -142 -237 -37
8118 -37 186 20 -252 -247 16 -251 -80 -216 296 10 -176 99 -81 -134 -94 31 105 -225 11 123 -10 -137
8140 -137 -268 -117 -259 68 116 8 -239 -421 -124 -155 -62 -15 -123 -28 -58 -328 -75 11 74 -377 -207 -116 -142
8163 -142 -238 -74 -11 -113 -296 45 -57 -157 -26 -97 -99 -73 -58 -153 -60 10 -253 -76 27 -141 -87 -55 -228 -232 -144
$$ packed form
8003b88J47K2j26Q3J95k56K39j66j73K61K12P2m40L25j92p6N9j29K76k58N4K61
8025A02J83l16k41L13J54k39k03K79j01l04M05o5ooJ41j78Q4j92K6J79l25J21
8047a89K62j25m0r3J54j6m6j7R9j5J1k7l6q6J3j28J1J63M8j2j9j28o8J41K47k85
8073a81j03J86J01mk19J29L15l52j03rJ4J33Q8K9%l25L25j29K52l15l7J68j23
8096a60J83k34J69j40k5J04l6L2k18L71k7j64j86L76k39N7K30l13K98k20r5K00
8118c7K23j66k72NK63k67J71j36N12k86j86K75j80n3M0J25P4l30K36J12j33j27
8140a37j31J51j42L27M8j08k47j82K97l1R3M7j08R5l0k70K53Q6O3m51J70R1k6
8163a42r6J64O3j02j83L41j02j00J31p1kK6J5r5R3P0k63J77J03j68N4L2j73mQ8
$$ plain form
8188 -144 -42 -222 -417
$$ packed form
8188a44J02j80j95
8191d17
$$ Imaginary data points
##PAGE= N=2
##DATA TABLE= (X++(I..I)), XYDATA
$$ plain form
0 0 0 0 0 0 0 0 0 0 0 0 11 -11 11 -11 22 -22 22 -33 44 -46 55 -66 81 -95 110 -128 150 -172 194 -225 258 -293
32 -293 329 -372 419 -471 528 -589 657 -732 813 -901 996 -1104 1218 -1344 1482 -1633 1798
49 1798 -1980 2180 -2406 2652 -2928 3243 -3597 4006 -4476 5033 -5699 6511 -7527 8841
63 8841 -10603 13094 -16889 23290 -36027 70640 -348072 -907002 432376 475484 -520567
74 -520567 -154424 576549 23315 -453437 -101016 250686 156525 -118461 -168441 182089
84 182089 206654 -231775 -255431 157635 199524 -35760 -97517 21972 61649 -119760 -145167
95 -145167 211769 172920 -288555 -104165 318721 -57890 -297689 210637 212593 -308663 -102387
106 -102387 345848 69304 -280847 -83403 181255 113677 -125651 -129613 156884 164616 -180424
$$ packed form
0@%%%%%%%%%%J1k2K2k2L3m4M4n5P7r0J01j21J47j76K05k38K78l22L66m19M83n51
32b93O22p01P91q90R99j117J246j389J545j714J897k100K322k562K826l115L431
49A798l778M160m586N058n580O171o840P603q482R509j0732J2210j4038J6368
63H841j9444K3697k9983M0179n9317J06667m18712n58930J339378M3108r96051
74e20567L66143P30973n53234m76752L52421L51702r4161k74986m9980L50530
84A82089K4565m38429k3656M13066M1889k35284o1757J19489L9677j81409k5407
95a45167L56936l8849m61475J84390M22886l76611k39799N08326J956n21256K06276
106a02387M48235k76544l50151J97444K64658o7578k39328l962K86497P732l45040
$$ plain form
117 -180424 -156150 180193 92230 -194512 -32516 237195 40094 -260002 -99534 185090
127 185090 53650 -124676 75498 123965 -196034 -157882 203991 104764 -183176 -17278
137 -17278 174719 -14842 -159458 -28218 109978 75953 -61022 -53677 118594 52633 -215695
148 -215695 -89880 269893 128333 -246148 -98381 219762 29229 -229225 22298 237099
158 237099 -61913 -221363 104995 183706 -154248 -162592 144673 114571 -107208 -55367 75450
169 75450 19484 -65270 -30025 68711 71011 -73600 -91782 111818 113745 -145012 -119295 157319
181 157319 103597 -138628 -37559 152891 -21535 -191395 38368 204524 -38930 -179613
191 -179613 52471 131507 -93671 -112368 99337 86169 -83350 -51150 75284 32351 -90277
$$ packed form
117a80424K4274L36343q7963k86742J61996K69711j97101l00096J60468K84624
127A85090j31440j78326K00174M8467l19999L8152L61873r9227k87940J65898
137a7278J91997j89561j44616J31240J38196l4025j36975P345J72271o5961k68328
148b15695J25815L59773j41560l74481J47767L18143j90533k58454K51523K14801
158B37099k99012j59450L26358P8711l37954q344L07265l0102k21779N1841J30817
169G5450n5966q4754L5245R8736K300j44611j8182K03600J927k58757K5717K76614
181A57319n3722k42225J01069J90450j74426j69860K29763J66156k43454j40683
191a79613K32084P9036k25178j8697K11705j3168j69519L2200J26434m2933j22628
$$ plain form
202 -90277 -59970 96203 107013 -74750 -111411 69712 82675 -91471 -45108 134322 38773
213 38773 -143489 -26141 136975 6551 -132911 5990 127497 -12257 -115193 18090
223 18090 87493 -48401 -81086 67910 80439 -78169 -90047 67835 83401 -69151 -79060
234 -79060 76370 75329 -80916 -55942 101247 41874 -115836 -23932 132054 26613 -118677
245 -118677 -20423 100182 10199 -85557 3548 85270 -7482 -84999 9408 80468 -22924
256 -22924 -90997 26170 93971 -32334 -97162 29659 78164 -48231 -64303 74279 57735
267 57735 -92198 -51096 98668 40135 -92637 -21259 89797 12853 -77893 -1614 73345
278 73345 541 -66970 7084 73421 -9228 -85618 4560 86406 -11387 -89626 16421 80721
$$ packed form
202i0277L0307J56173J0810j81763l6661J81123J2963j74146M6363J79430r5549
213C8773j82262J17348J63116j30424j39462J38901J21507j39754j02936J33283
223A8090O9403j35894l2685J48996J2529j58608j1878J57882J5566j52552r909
234g9060J55430j041j56245K4974J57189n9373j57710R1904J55986j05441j45290
245a18677R8254J20605q9983r5756Q9105Q1722r2752p7517R4407P1060j03392
256b2924o8073J17167O7801j26305o4828J26821M8505j26395j6072J38582j6544
267E7735j49933M1102J49764n8533j32772P1378J11056p6944r0746P6279P4959
278G3345p2804o7511P4054O6337q2649p6390R0178Q1846r7793p8239J06047O4300
$$ plain form
290 80721 -34977 -79964 48629 73204 -65760 -70027 73849 61007 -79962 -51931 79214
301 79214 40922 -73491 -25777 73843 21122 -67331 -11988 74106 16398 -75467 -16742 79932
313 79932 16053 -82444 -10346 80911 -4361 -82916 17061 78849 -35169 -80685 40623 70817
325 70817 -49628 -65533 48622 51899 -50996 -41903 52806 37127 -51044 -30941 57044 36123
337 36123 -55991 -34488 63928 37894 -66591 -31000 75878 23050 -81286 -8473 87591
348 87591 -6650 -90646 17487 83243 -31641 -79067 34030 64357 -41527 -58142 38101
359 38101 47749 -38580 -45005 37163 46704 -36790 -49950 39737 54670 -42790 -52422 53565 51956
372 51956 -58195 -38678 70317 28371 -75142 -13517 78196 2142 -75202 6147 63115
$$ packed form
290H0721j15698m4987J28593K4575j38964m267J43876j2842j40969K8031J31145
301G9214l8292j14413M7714R9620n2721q8453N5343Q6094n7708r1865N8725R6674
313G9932o3879r8497P2098R1257q5272p8555R9977O1788j14018m5516J21308L0194
325G0817j20445j5905J14155L277j02895R093R4709j5679q8171K0103Q7985k0921
337C6123r2114K1503R8416k6034j04485L5591J06878n2828j04336P2813R6064
348H7591r4241q3996J08133O5756j14884m7426J13097L0327j05884j6615R6243
359C8101R648q6329o425Q2168R541q3494j3160Q9687J4933r7460r632J05987j609
372E1956j10151J9517J08995m1946j03513O1625R1713p6054p7344Q1349N6968
$$ plain form
383 63115 -20392 -57535 24414 47765 -29888 -45564 27273 40074 -31865 -44255 33531 49397
395 49397 -35534 -51382 41574 50272 -51450 -43654 70074 46443 -73583 -36898 78452 26410
407 26410 -79341 -12088 82983 6734 -78093 -2573 65860 -8466 -60213 14142 56489 -16086
419 -16086 -58183 7740 47388 -14026 -47669 20231 50924 -27678 -53562 34429 47923 -46671
431 -46671 -36467 67613 34719 -74292 -25565 74894 11657 -71435 8565 78586 -11527
442 -11527 -77866 9006 70075 -11729 -67516 15888 71405 -17885 -82228 8003 74843 -16111
454 -16111 -72256 31347 76572 -43394 -84320 42323 75161 -44072 -54860 60410 46191
465 46191 -69563 -40327 67715 32000 -56629 -8798 63623 2185 -68114 -7203 61217 7771
$$ packed form
383F3115q3507l7143Q1949K3351p7653j5676P2837J2801p1939j2390P7786J5866
395D9397q4931j5848R2956Q698j01722P796J13728k3631j20026L6685J15350n2042
407B6410j05751O7253R5071p6249q4827P5520O8433p4326n1747P4355M2347p2575
419a6086m2097O5923L9648o1414l3643O7900L0693p8602k5884Q7991J3494r4594
431d6671J0204J04080l2894j09011M8727J00459o3237q3092Q0000P0021r0113
442a1527o6339Q6872O1069q1804n5787Q3404N5517q9290o4343R0231O6840r0954
454a6111n6145J03603M5225j19966m0926J26643L2838j19233j0788J15270j4219
465D6191j15754K9236J08042l5715q8629M7831P2421o1438p0299O0911O8420n3446
$$ plain form
477 7771 -52242 3309 56691 -14542 -75610 8425 77364 -11667 -72924 26213 71658 -45613
489 -45613 -82777 44748 77501 -41777 -55907 54403 45587 -65466 -46666 63648 48544
500 48544 -44757 -27301 45621 14903 -53386 -18425 50954 22535 -37644 -7850 37132 -12244
512 -12244 -56141 9922 59126 -9320 -48215 22933 33916 -54407 -44545 61561 47712 -55479
524 -55479 -32149 60017 15877 -76168 -17494 83087 28407 -67211 -15258 64927 -548 -77531
536 -77531 2885 89455 10319 -76718 -6169 65025 -14081 -74796 19733 81871 -16992 -74291
548 -74291 19623 53989 -45798 -56938 57656 60853 -50954 -48233 45166 23972 -59130 -18190
560 -18190 71854 29212 -62813 -23638 59667 7818 -72222 664 91176 11120 -83750 -7948
$$ packed form
477G771o0013N5551N3382p1233o1068Q4035O8939q9031o1257R9137M5445j17271
489d5613l7164J27525L2753j19278j4130J10310q816j11053J8800J10314j5104
500D8544r3301J7456P2922l0718o8289L4961O9379k8419o0179K9794M4982m9376
512a2244m3897O6063M9204o8446l8895P1148J0983q8323R862J06106j3849j03191
524e5479K3330R2166m4140r2045N8674J00581n4680r5618N1953Q0185o5475p6983
536g7531Q0416Q6570p9136q7037P0549P1194p9106o0715R4529O2138r8863n7299
548g4291R3914L4366r9787j1140J14594L197j11807K721R3399k1194q3102M0940
560a8190R0044m2642r2025L9175Q3305n1849q0040P2886R0512q0056r4870P5802
$$ plain form
572 -7948 68123 -16874 -73293 31181 87715 -24021 -86150 13416 63563 -30239 -59392 44103
584 44103 66508 -41539 -65349 29121 41200 -38854 -26465 58609 37140 -53450 -39315 38745
596 38745 22993 -35831 -35 55678 1363 -60637 -4787 49946 -8374 -45039 28958 55974
608 55974 -33616 -61935 25061 43586 -36561 -33828 52775 37988 -59478 -47334 47627 36283
620 36283 -48226 -23507 63247 27571 -67482 -31031 59871 19463 -55014 3705 70849 -3429
632 -3429 -73751 -2742 60932 -1842 -45952 21604 50880 -29283 -61345 18588 50104 -22272
644 -22272 -38266 38084 38543 -51277 -50660 41363 41794 -37779 -23054 52116 15263 -68000 -21152
657 -21152 66404 19994 -53752 811 58761 -11360 -63855 10465 60038 -6663 -44726 18521
$$ packed form
572g948P6071q4997n6419J04474N6534j11736o2129R9566N0147r3802k9153J03495
584D4103K2405j08047k3810R4470J2079q0054J2389Q5074k1469r0590J4135P8060
596C8745j5752n8824L5796N5713n4315o2000N5850N4733n8320l6665P3997K7016
608E5974q9590k8319Q6996J8525q0147K733Q6603j4787r7466J2144R4961j1344
620C6283q4509K4719Q6754l5676r5053L6451R0902m0408p4477N8719O7144p4278
632c429p0322P1009O3674o2774m4110O7556K9276q0163l2062P9933L1516p2376
644b2272j5994P6350M59q9820O17R2023M31p9573J4725P5170l6853q3263M6848
657b1152Q7556m6410p3746N4563N7950p0121n2495P4320M9573o6701l8063O3247
$$ plain form
669 18521 42851 -29162 -52334 24788 52038 -21505 -43603 27503 35126 -42639 -42090 42347 39055
682 39055 -41812 -28278 48013 18656 -60111 -18641 63280 18213 -54340 -1041 55155 -13103
694 -13103 -58788 18272 58247 -15268 -45006 22431 40004 -29528 -44794 26245 46997 -21875
706 -21875 -41495 25701 33099 -42856 -40167 47013 41545 -45901 -35251 44931 21683 -53232 -17071
719 -17071 58892 17063 -53779 -8211 51876 -2105 -52442 10139 55791 -6569 -46133 9767
731 9767 38498 -15907 -37796 19703 41172 -20188 -42635 19909 36606 -30717 -37825 36931
743 36931 34748 -41855 -30224 41503 17973 -47700 -11148 50872 7907 -48427 -3114 45099
755 45099 -2015 -41129 9268 43109 -7405 -38058 9854 35559 -12290 -34709 16366 38679
$$ packed form
669A8521K4330p2013k3172P7122K7250p3543k2098P1106P623p7765N49Q4437l292
682C9055q0867J3534P6291k9357p8767M1470Q1921m5067p2553N3299N6196o8258
694a3103m5685P7060L9975p3515k9738O7437J7573o9532j5266P1039K0752o8872
706b1875j9620O7196P398p5955K689Q7180n468q7446J0650Q0182k3248p4915L6161
719a7071P5963m1829p0842M5568O0087n3981n0337O2581M5652o2360l9564N5900
731I767K8731n4405k1889N7499K1469o1360k2447O2544J6697o7323p108P4756
743C6931k183p6603J1631P1727k3530o5673L6552O2020m2965n6334M5313M8213
755D5099m7114l9114N0397L3841n0514l0653M7912K5705m7849k2419N1075K2313
$$ plain form
767 38679 -17029 -40929 17473 37016 -25528 -34702 32574 30449 -41118 -28795 40814 19034
779 19034 -43691 -11481 44449 5608 -43404 -1617 40508 -1863 -35786 7595 36296 -8112
791 -8112 -34441 9645 34907 -9428 -33392 13034 35325 -16044 -36196 19777 34998 -26907
803 -26907 -34404 31056 29044 -39290 -26008 40591 17881 -43782 -12652 41901 6172 -41205
815 -41205 -1702 39365 -874 -36244 4189 36827 -2746 -34554 5594 36801 -4751 -35551
827 -35551 9130 37279 -12992 -38068 17612 37567 -23234 -36204 26175 30274 -32089 -26527
839 -26527 33559 19471 -36658 -15978 34989 9188 -35036 -5628 34625 3644 -33310 -971
851 -971 33183 131 -32194 4725 35667 -5056 -35473 9451 37289 -12510 -35763 17879
$$ packed form
767C8679n5708k3900N8402J9543o2544r174O7276k125p1567J2323O9609k1780
779A9034o2725L2210N5930l8841m9012M1787M2125m2371l3923M3381K8701m4408
791h112k6329M4086K5262m4335k3964M6426K2291n1369k0152N5973J5221o1905
803b6907p497O5460k012o8334J3282O6599k2710o1663L1130N4553l5729m7377
815d1205L9503M1067m0239l5370M0433L2638l9573l1808M0148L1207m1552l0800
827c5551M4681K8149n0271k5076N5680J9955o0801j2970O2379M099o2363N562
839b6527O0086j4088n6129K0680N0967k5801m4224K9408M0253l0981l6954L2339
851i71L4154l3052l2325L6919L0942m0723l0417M4924K7838m9799k3253N3642
$$ plain form
863 17879 35822 -22584 -34739 24508 30140 -28925 -28054 29254 22169 -32150 -21027 29737 16289
876 16289 -30412 -14573 29495 12017 -28990 -9654 29000 7620 -28825 -3172 31731 1401
888 1401 -29949 4375 30996 -8153 -28690 14220 28240 -18518 -25553 21458 21091 -26217 -19529
901 -19529 26938 16102 -29303 -15363 27850 11046 -31294 -10815 32266 9658 -33546 -8979
913 -8979 33907 5919 -34804 -1007 37988 701 -35804 4015 34937 -7368 -31346 12786
925 12786 31395 -13915 -28554 14947 23191 -18951 -21237 21402 19387 -24066 -19193 22287 12416
938 12416 -27255 -10019 30270 8480 -33245 -7819 32074 3042 -33195 3302 37823 -3506
950 -3506 -37363 5621 35973 -9051 -33049 15589 36319 -15676 -34960 14648 30368 -17252
$$ packed form
863A7879J7943n8406j2155N9247N632n9065Q71N7308p085n4319J1123N0764j3448
876A6289m6701J5839M4068j7478m1007J9336L8654k1380l6445K5653L4903l0330
888A401l1350L4324K6621l9149k0537M2910J4020m6758p035M7011l67m7308O688
901a9529M6467j0836m5405J3940M3213j6804m2340K0479M3081k2608m3204K4567
913h979M2886k7988m0723L3797L8995l7287l6505L9819L0922m2305k3978M4132
925A2786J8609m5310j4639M3501Q244m2142k286M2639k015m3453M873M1480r871
938A2416l9671J7236M0289k1790m1725K5426L9893k9032l6237L6497L4521m1329
950c506l3857M2984L0352m5024k3998M8638K0730n1995j9284M9608J5720m7620
$$ plain form
962 -17252 -26690 21014 26903 -23696 -29645 19650 22940 -23225 -18319 27705 15464 -31819 -15550
975 -15550 28128 8683 -25923 126 29459 -2014 -30053 2005 26883 -3330 -21988 11992
987 11992 26069 -13971 -29051 12408 26711 -13985 -21688 20939 21702 -27520 -26994 23818 22317
1000 22317 -24702 -16372 29008 11304 -36031 -14179 31480 9963 -27169 -1496 29443 -2381
1012 -2381 -32010 424 29887 1204 -21433 7965 24086 -12763 -28973 11706 28842 -10275
1024 -10275 -20958 17972 18435 -27493 -23831 26326 22170 -24904 -14492 28224 6264 -38303 -10649
1037 -10649 35802 9860 -29489 -2292 28354 -4574 -34018 1685 35799 4081 -27460 1940
1049 1940 26761 -9484 -31902 11633 35866 -7318 -27937 11966 20523 -21720 -22346 23348 23521
$$ packed form
962a7252r438M7704N889n0599n949M9295L290m6165M906M6024j2241m7283J6269
975a5550M3678j9445l4606K6049K9333l1473k8039L2058K4878l0213j8658L3980
987A1992J4077m0040j5080M1459J4303m0696p703M2627P63m9222N26N0812j501
1000B2317m7019Q330M5380j7704m7335K1852M5659k1517l7132K5673L0939l1824
1012b381k9629L2434K9463k8683k2637K9398J6121l6849j6210M0679J7136l9117
1024a0275j0683L8930M63m5928L662N0157m156m7074J0412M2716k1960m4567K7654
1037a0649M6451k5942l9349K7197L0646l2928k9444L5703L4114l1718l1541K9400
1049A940K4821l6245k2418M3535K4233m3184k0619L9903Q557m2243o26M5694J73
$$ plain form
1062 23521 -19454 -17729 18145 7092 -27328 -8344 29169 10411 -24110 -5589 20690 -4169
1074 -4169 -26772 5834 32326 140 -26399 3478 23002 -12677 -27296 18844 34432 -14704
1086 -14704 -27909 16700 19309 -27201 -18541 31877 21620 -26569 -17802 20313 6203 -26645
1098 -26645 -6429 31157 11748 -27873 -12978 21185 2921 -26132 2070 35603 2622 -33485
1110 -33485 -2727 27443 -6665 -26262 18100 34078 -16114 -31397 14517 21940 -20752 -15934
1122 -15934 28938 19133 -27394 -19794 19697 10032 -22593 -6477 27718 8892 -29541 -13595
1134 -13595 23041 6640 -24709 324 31906 211 -33616 -1625 28150 -3930 -23489 14453
1146 14453 28320 -14567 -28085 12334 20817 -14037 -12761 21773 14605 -23227 -17868 16337 10908
$$ packed form
1062B3521m2975J725L5874j1053l4420J8984L7513j8758l4521J8521K6279k4859
1074d169k2603L2606K6492l2186k6539K9877J9524l5679j4619M6140J5588m9136
1086a4704j3205M4609K609m6510Q660N0418j0257m8189Q767L8115j4110l2848
1098b6645K0216L7586j9409l9621J4895L4163j8264k9053K8202L3533l2981l6107
1110c3485L0758L0170l4108j9597M4362J5978n0192j5283M5914P423m2692M818
1122a5934M4872r805m6527P600L9491r665l2625J6116L4195j8826l8433J5946
1134a3595L6636j6401l1349K5033L1582l1695l3827L1991K9775l2080j9559L7942
1146A4453J3867m2887j3518M0419Q483l4854J276L4534p168l7832N359L4205n429
$$ plain form
1159 10908 -16392 -4814 22346 4854 -28140 -11042 23077 6138 -22008 2754 27486 -7164
1171 -7164 -32567 5434 29085 -8108 -21419 17918 22730 -20975 -24394 18435 20895 -15417 -12453
1184 -12453 21195 12275 -24661 -16898 21036 15449 -19107 -10494 22361 6476 -29587 -9696 27959
1197 27959 7008 -26049 -356 27278 -6082 -31396 6032 29145 -6308 -22460 13086 20702
1209 20702 -17299 -20848 16867 20360 -13204 -13987 15999 12016 -19573 -14971 19025 16191 -17555
1222 -17555 -12984 18930 8000 -26651 -9676 27963 7564 -27162 -2832 25318 -5226 -27891
1234 -27891 6733 26945 -7007 -21677 10313 18800 -13261 -17948 15089 19615 -11688 -15435 12800
1247 12800 13165 -15536 -12815 17737 14186 -17574 -12791 17450 8398 -22244 -7868 23375 5798
$$ packed form
1159A0908k7300J1578K7160j7492l2994J7098L4119j6939k8146K4762K4732l4650
1171g164k5403L8001K3651l7193j3311L9337M812m3705l419M2829K460l6312K964
1184a2453L3648q920l6936P763L7934n587l4556Q613L2855j5885l6063J9891L7655
1197B7959k0951l3057K5693K7634l3360k5314L7428K3113l5453j6152L5546P616
1209B0702l8001l549L7715L493l3564p83K9986l983l1589M602L3996k834l3746
1222a7555M571L1914j0930l4651J6975L7639k0399l4726K4330K8150l0544k2665
1234b7891L4624K0212l3952j4670L1990Q487l2061m687L3037M526l1303l747K8235
1247A2800L65k8701K721L0552l551l1760M783L0241r052l0642J4376L1243j7577
$$ plain form
1260 5798 -24144 -3634 21777 -3024 -23284 5213 23653 -6195 -21210 7526 18537 -9847
1272 -9847 -16914 12811 18746 -11382 -16665 12636 14989 -14221 -12718 17695 12979 -18686 -12169
1285 -12169 17822 8185 -19428 -5806 19724 3406 -20936 -2986 19030 -725 -19276 2593
1297 2593 19302 -4274 -18979 5084 17818 -6443 -15681 9576 16269 -10743 -15235 13090 15386
1310 15386 -14106 -13257 16896 11532 -18128 -9197 19039 6017 -20549 -4023 19704 1252 -20632
1323 -20632 -1368 18806 -847 -19620 1199 18892 -3424 -19325 4298 19188 -6530 -18190
1335 -18190 8667 18575 -9930 -17101 11938 16695 -12243 -13693 14773 12181 -16145 -10680 17636
1348 17636 8574 -17695 -7148 16961 4202 -18442 -3784 17237 1920 -18523 -1416 17487
$$ packed form
1260E798k9942K0510K5411k4801k0260K8497J8440k9848j5015K8736J1011k8384
1272i847p067K9725N935l0128n283K9301K353k9210J503L0413m716l1665O517
1285a2169K9991r637k7613J3622K5530j6318k4342J7950K2016j9755j8551K1869
1297B593J6709k3576j4705K4063J2734k4261r238K5257O693k7012m492K8325K296
1310A5386k9492Q49L0153n364k9660Q931K8236j3022k6566J6526K3727j8452k1884
1323b0632J9264K0174j9653j8773K0819J7693k2316j5901K3623J4890k5718j1660
1335a8190K6857R908k8505p171K9039M757k8938j450K8466k592k8326N465K8316
1348A7636r062k6269J0547K4109j2759k2644J4658K1021j5317k0443J7107J8903
$$ plain form
1360 17487 -1709 -19303 3786 19714 -5360 -19319 7412 18177 -9169 -15425 12483 15003
1372 15003 -13049 -13015 13899 12100 -13764 -9587 14714 9192 -14987 -8382 14254 6757 -15281
1385 -15281 -6704 15375 4474 -17796 -4611 17506 1618 -19261 11 18721 -3569 -17942
1397 -17942 6300 16685 -8607 -14425 10974 13351 -10736 -10255 12370 9308 -11498 -7652 12745
1410 12745 7952 -12524 -6997 12822 5483 -15342 -5528 16242 4418 -18503 -4206 17732 394
1423 394 -19504 1590 19444 -4180 -19111 6378 17343 -8576 -15303 10382 14221 -9609 -11831
1436 -11831 9940 10495 -9813 -8691 11098 9586 -10775 -9210 10981 7991 -12585 -7020 14354
1449 14354 5587 -16716 -4738 16156 -308 -18161 2730 18487 -5278 -17700 6596 14778
$$ packed form
1360A7487j9196j7594K3089J5928k5074j3959K6731J0765k7346o256K7908K520
1372A5003k8052L4K6914j799k5864M177K4301n522k4179O605K2636p497k2038
1385a5281Q577K2079j0901k2270J3185K2117j5888k0879J9272J8710k2290j4373
1397a7942K4242J0385k5292n818K5399K377k4087M81K2625l062k0806L846K0397
1410A2745m793k0476N527J9819p339k0825R814K1770j1824k2921J4297K1938j7338
1423C94j9898K1094J7854k3624j4931K5489J0965k5919o727K5685L839k3830k222
1436a1831K1771N55k0308J122J9789j512k0361J565K0191k990k0576N565K1374
1449A4354q767k2303J1978K0894j6464j7853K0891J5757k3765j2422K4296Q182
$$ plain form
1461 14778 -9751 -13022 11556 13411 -10721 -11832 10458 10179 -10907 -8824 13663 10959 -13091
1474 -13091 -11061 12770 8808 -14686 -6891 17242 5987 -19148 -6009 16851 908 -17805
1486 -17805 1961 17880 -4226 -18299 3634 14191 -6821 -12068 9869 13438 -10062 -13523
1498 -13523 8936 11626 -8993 -9009 13154 10999 -14283 -11722 14462 10083 -14987 -6840 18562
1511 18562 5959 -21116 -6802 18572 2693 -17737 895 18312 -3324 -19738 1288 15677
1523 15677 -2701 -12604 5847 13256 -6929 -14685 5071 13603 -4419 -9353 9107 10088 -11480
1536 -11480 -11146 11426 9944 -10497 -4925 13784 2496 -17222 -4001 15303 1884 -13161 2023
1549 2023 13249 -6393 -16853 3208 14579 -2978 -11227 6025 10475 -9420 -13501 8633 13852
$$ packed form
1461A4778k4529l271K4578J855k4132j111K2290k79k1086K083K2487k704k4050
1474a3091K030K3831l962k3494P795K4133j1255k5135J3139K2860j5943j8713
1486a7805J9766J5919k2106j4073K1933J0557k1012n247K1937L569k3500l461
1498a3523K2459K690k0619j6K2163k155k5282K561K6184m379k5070Q147K5402
1511A8562j2603k7075J4314K5374j5879k0430J8632J7417k1636j6414K1026J4389
1523A5677j8378r903J8451P409k0185p756J9756Q532j8022m934J8460R81k1568
1536a1480L34K2572j482k0441N572J8709j1288j9718J3221J9304j3419j5045J5184
1549B023J1226j9642j0460K0061J1371j7557q249J7252M450j9895m081K2134N219
$$ plain form
1562 13852 -6337 -9566 10051 8459 -13586 -9807 14153 10289 -11189 -4472 13303 396 -16948
1575 -16948 -1779 16264 1880 -13261 1597 11685 -6631 -15701 4969 15621 -3831 -12767
1587 -12767 5976 10373 -11199 -13480 11619 15326 -8887 -11378 10797 8624 -15078 -8762 17072
1600 17072 11496 -12956 -7321 13067 2733 -16631 -2902 18279 5024 -14917 -3509 11697
1612 11697 -2542 -15507 2571 17423 -1164 -15553 1251 11324 -7202 -12639 9656 15203
1624 15203 -7859 -12858 7543 8067 -10914 -6672 15037 9344 -12351 -7578 10219 2870 -12103
1637 -12103 -877 14964 3144 -13913 -4112 10307 -998 -12325 2739 15015 -2238 -15445
1649 -15445 886 11022 -6027 -10872 9723 12938 -8803 -12033 7540 7749 -9488 -4933 13794
$$ packed form
1562A3852k0189l229J9617j592k2045L779K3960l864k1478O717J7775j2907j7344
1575a6948J5169J8043j4384j5141J4858J0088j8316r070K0670J0652j9452q936
1587a2767J8743M397k1572k281K5099L707k4213k491K2175k173k3702O316K5834
1600A7072n576k4452N635K0388j0334j9364J3729K1181j3255j9941J1408J5206
1612A1697j4239j2965J8078J4852j8587j4389J6804J0073j8526n437K2295N547
1624A5203k3062m999K0401N24j8981M242K1709n693k1695M773J7797p349j4973
1637a2103J1226J5841j1820j7057R801J4419j1305j1327J5064J2276j7253j3207
1649a5445J6331J0136j7049m845K0595L215k1741l230J9573K09j7237M555J8727
$$ plain form
1662 13794 7595 -12099 -7209 9540 3671 -9867 -280 13946 1937 -14738 -3858 10928 245
1675 245 -11272 3354 13515 -4296 -15365 1955 11082 -4924 -9493 8881 10532 -9798 -11941
1688 -11941 7263 8841 -7725 -4805 11459 6026 -12487 -6891 11130 5207 -9356 -1403 12214
1701 12214 1379 -13768 -2861 11937 1101 -10873 2136 12063 -4702 -15126 3094 11804
1713 11804 -5047 -9578 7377 8672 -9504 -9958 7735 8245 -7119 -5346 9555 4998 -11180
1726 -11180 -5996 10796 6179 -9207 -2592 11107 1249 -13352 -1496 12643 1058 -11380 1600
1739 1600 11390 -4246 -13678 3228 12006 -4157 -10066 5522 8270 -8611 -9593 7822 8926 -6809
1753 -6809 -7034 7281 5831 -8746 -5832 10136 6447 -8880 -4043 9882 2371 -11401 -1258
$$ packed form
1662A3794o199j9694M890J6749n869j3538R587J4226j2009j6675J0880J4786j0683
1675B45j1517J4626J0161j7811j1069J7320R127j6006m569J8374J651k0330k143
1688a1941J9204J578j6566K920J6264n433j8513N596J8021n923j4563P953J3617
1701A2214j0835j5147J0907J4798j0836j1974J3009R927j6765j0424J8220Q710
1713A1804j6851m531J6955J295j8176m54J7693N10j5364J773J4901m557j6178
1726a1180N184J6792m617j5386O615J3699r858j4601J1856J4139j1585j2438J2980
1739A600R790j5636r432J6906Q778j6163n909J5588K748j6881r82J7415J104j5735
1753f809k25J4315j450j4577K914J5968l689j5327M837J3925p511j3772J0143
$$ plain form
1766 -1258 12177 987 -10944 294 9673 -3108 -10828 3164 10379 -4104 -9836 3894 7727
1779 7727 -6257 -8566 6312 8494 -6304 -7531 6528 6321 -7672 -5466 9101 6010 -8721
1792 -8721 -4338 9303 3079 -9849 -904 10545 562 -9690 281 8445 -2425 -8933 2769
1805 2769 8708 -3623 -9040 2787 7455 -4878 -7609 5655 6875 -6618 -7084 6959 6535 -7804
1819 -7804 -5425 9140 4600 -9376 -3834 9781 2759 -9134 -909 10072 134 -9350 442 8856
1833 8856 -1270 -8622 1412 7715 -2738 -8545 2433 7753 -3758 -8214 4207 7614 -6096
1846 -6096 -7862 6991 6972 -7686 -5857 8909 5049 -9391 -3531 9609 3108 -9281 -1395 9371
1860 9371 872 -9102 -188 9020 -239 -8185 422 7711 -1793 -8463 1621 8215 -2544 -8698
$$ packed form
1766a258J3435j1190j1931J1238R379j2781p720J3992P215j4483n732J3730L833
1779G727j3984k309J4878K182j4798j227J4059k07j3993K206J4567l091j4731
1792h721M383J3641o224j2928Q945J1449r983j0252R971Q164j0870o508J1702
1805B769N939j2331n417J1827M668j2333k731J3264J220j3493m66J4043m24j4339
1819g804K379J4565m540j3976N542J3615p022j1893Q225J0981r938r484R792Q414
1833H856j0126p352J0034O303j0453n807J0978N320j1511m456J2421L407j3710
1846f096j766J4853j9j4658J829J4766l860j4440N860J3140o501j2389P886J0766
1860I371q499r974Q914R208r259p946Q607P289r504o670J0084O594j0759o154
$$ plain form
1874 -8698 2490 7457 -4927 -7785 5643 6962 -6676 -6366 7499 4955 -7975 -3660 9367
1887 9367 3110 -8253 -2019 8583 1686 -8063 -372 8656 374 -8745 -465 8452 -428 -8897
1901 -8897 686 8287 -2138 -9273 1910 8286 -3707 -8161 4591 6766 -5731 -6194 6056 5164
1915 5164 -6493 -3780 6999 3224 -6476 -1841 6508 1530 -6414 -749 7170 608 -6941 -647
1929 -647 7269 -305 -7790 1171 8173 -2286 -8523 2557 7426 -4876 -7782 5244 6623 -5831
1943 -5831 -6260 5967 4509 -6311 -3795 7032 3160 -6332 -2683 6361 2105 -6390 -1278 6941
1957 6941 1275 -6934 -324 7161 -1139 -7831 1666 7815 -3062 -8470 3372 7267 -5510 -7419
1971 -7419 5658 6714 -6683 -6301 6232 4935 -7389 -4426 8033 4427 -7285 -3898 7185
$$ packed form
1874h698J1188M967j2384k858J3428J319j3638L10J3865k544j2930M315J3027
1887I367o257j1363O234J0602o897r749P691R028q282r119Q280Q917q880q469
1901h897R583P601j0425p135J1183O376j1993m454J2752K175j2497m63J2250q92
1915E164j1657K713J0779l775r700M635Q349m978p944N665P919o562p549O294
1929f47P916p574p485Q961P002j0459o237J1080M869j2302k906J3026J379j2454
1943e831m29J2227j458j0820K516J0827l872r492L649R044m256q495N112Q219
1957F941n666q209O610P485q300o692R497O149j0877n408J1842L895j2777j909
1971g419J3077J056j3397L82J2533j297j2324K963J2459l606j1712L387J1083
$$ plain form
1984 7185 3254 -7344 -2408 8486 2442 -8403 -1994 7931 629 -8515 1056 8911 -1535 -8844
1998 -8844 1528 6844 -3483 -6937 4337 6787 -5570 -7173 4661 5514 -5738 -4562 6986
2011 6986 4911 -7177 -5241 6594 4073 -6893 -2276 8951 2717 -8365 -2471 7831 1232
2024 1232 -7230 755 8220 -1080 -8447 63 6585 -1847 -6178 3316 6119 -4214 -6725 2827 4853
2039 4853 -4180 -3999 5732 3959 -6431 -4598 5864 3479 -5865 -1015 8018 1044 -8487 -1249 7482
2054 7482 521 -6308 1999 6855 -2614 -8060 1205 6396 -1899 -5651 3079 5597 -4747 -7204 3291
2069 3291 5914 -3935 -4389 5647 3811 -7680 -4476 6848 3839 -5897 -895 7230 -3 -8368
2083 -8368 -240 7922 588 -5765 1841 6253 -3124 -7891 2119 7274 -1494 -5736 3014 5384 -5549
$$ packed form
1984G185l931j0598M936J0894o044j0845O409R925p302r144R571P855j0446p309
1998h844J0372N316j0327l454J1274K450j2357j603J1834Q53j1252J176J1548
2011F986k075j2088J936J1835k521j0966M617J1227o234j1082N894J0302o599
2024A232q462P985P465r300p367Q510O522q432m331R494K803j0333k511R552K026
2039D853r033J81R731j773j0390J833J0462k385r344M850R033o974r531P238Q731
2054G482o961o829Q307M856r469n446R265N191q295l752Q730K518j0344k457J0495
2069C291K623r849m54J0036j836j1491L204J1324l009r736N002Q125p233q365
2083h368Q128Q162p334o353P606M412r377m767J0010N155q768m242Q750K370j0933
$$ plain form
2098 -5549 -7543 4170 7116 -4054 -5144 5131 3417 -7735 -4781 7672 4267 -6151 -1970
2111 -1970 6436 -252 -7972 -124 8368 1120 -6147 658 5589 -2484 -7101 2203 7837 -1116 -6639
2126 -6639 2214 5372 -4893 -7171 4645 7592 -4405 -6321 4843 3571 -7835 -4130 7926
2139 7926 4506 -6494 -2925 5666 550 -6682 129 7845 1739 -5692 -1006 4741 -1059 -5803 1625
2154 1625 7516 -457 -6503 680 4959 -3578 -5999 4451 6493 -4295 -6151 3738 3247 -6300 -2917
2169 -2917 7126 3460 -6425 -2951 5108 531 -5524 519 6961 1049 -5782 -839 4433 -380 -4906
2184 -4906 1950 6933 -921 -6732 805 4899 -3124 -4822 4668 5320 -5030 -5587 3810 2828 -5278
2199 -5278 -1799 6337 2118 -6449 -2495 4671 976 -4607 287 5944 551 -6175 -735 5037 -150
$$ packed form
2098e549j994J1713K946j1170j090J0275j714j1152K954J2453l405j0418M181
2111a970Q406o688p720P848Q492p248p267O805M931q073m617R304N634q953n523
2126f639Q853L158j0265k278J1816K947j1997j916J1164j272j1406L705J2056
2139G926l420j1000L569Q591n116p232O811P716o106p431M686N747n800m744P428
2154A625N891p973o046P183M279q537k421J0450K042j0788j856R889m91r547L383
2169b917J0043l666r885L474Q059m577o055O043O442n912o831M943N272m813m526
2184d906O856M983p854n811P537M094q023j698R490O52j0350n57R397r82q106
2199e278L479Q136m219q567L954P166l695n583M894N657n393o726N440N772n187
$$ plain form
2214 -150 -4926 1731 6040 -1746 -6582 1473 5201 -2738 -4427 4326 4408 -5363 -5158 4011 3427 -4702
2230 -4702 -2160 5680 1693 -6482 -2569 5092 1508 -4731 -228 5470 131 -6412 -500 6097 774
2245 774 -5314 1494 6182 -1998 -6511 1594 5839 -2182 -4876 3056 3952 -4430 -4859 3583 3650 -3744
2261 -3744 -2746 4002 2012 -5236 -2555 4501 2092 -4667 -1272 5242 526 -5812 -243 5854 280
2276 280 -5039 985 5340 -2020 -5766 2236 5580 -2338 -5125 2792 3817 -3993 -4394 3373 3773 -3183
2292 -3183 -3458 3082 2457 -4488 -2821 4286 2493 -4426 -1749 4186 730 -4922 -393 5072 56
2307 56 -4605 617 4518 -1411 -4243 2184 4837 -2108 -4271 2370 3563 -2907 -3150 3138 3008 -3543
2323 -3543 -3181 3203 2568 -3863 -2628 3805 2284 -4399 -2163 4407 1049 -4361 -385 4680 -121
$$ packed form
2214a50m776O657M309p786m836Q055L728p939j689Q753Q2r771K05R169n84q129
2230d702K542P840l987q175L913P661l584o239M503N698n339o543N912O597n323
2245G74o088O808M688q180m513Q105M245q021k694P932Q96q382m29Q442O7p394
2261c744R98O748j990p248K681P056k409o759L395O514m716o338N569O097n574
2276B80n319O024M355p360l746Q002L344p918k787P917J025p810m01P767M00o956
2292c183k75O540o25o945J667P107j793o919K677N935l456n652M529N465n016
2307E6m661N222L901n929k832O427K653o945k163O641J193o470k43O288j30o551
2323c543L62O384o35o431J235O433j521o683K236O570l358n410L976N065m801
$$ plain form
2338 -121 -4347 543 4056 -997 -3611 1601 3786 -1850 -3384 2129 3186 -2734 -3531 2763 2922 -3244
2354 -3244 -3216 3331 2328 -4161 -2480 4161 1626 -4824 -1625 4737 1020 -4820 -272 4756 -195
2369 -195 -4554 691 4652 -582 -3721 1096 4052 -1401 -3860 1481 3813 -1784 -3632 2023 3054
2384 3054 -3089 -3564 3122 2971 -3518 -2963 3545 1781 -4341 -1818 4280 1233 -4347 -1104 3841 262
2400 262 -3895 56 4380 -212 -3789 195 3774 -464 -3559 797 3757 -1494 -3870 1505 2964
2415 2964 -2293 -3167 2538 2669 -3175 -2732 2860 1498 -3863 -1521 3388 927 -3811 -828 3436 30
2431 30 -3608 26 3554 -115 -3352 217 3571 -311 -3432 1065 3523 -1252 -3343 1816 3169
2446 3169 -2280 -2963 2418 2651 -2900 -2439 2661 1292 -3074 -1546 3078 827 -3281 -750 3268 206
$$ packed form
2338a21m226M890L513n053k614N212K185n636j534N513J057n920p97O294J59o166
2354c244K8O547j003o489J681O641k535o450L199O362l717n840M548N028m951
2369a95m359N245L961n234l139M817K956n453k459N341K332n597j848N655J031
2384C054o143m75O686j51o489N55O508j764o122K523O098l047n580L243M945l579
2400B62m157L951M324m592l577L984L579m238l095M356K960n251k376N375J459
2415B964n257q74N705J31n844M43N592j362n361K342M909k461m738K983M264l406
2431C0l638L634L528l669l237L569L354l882l121M497K458m775k091N159J353
2446C169n449o83N381K33n551M61N100j369m366J528M624k251m108K531M018l062
$$ plain form
2462 206 -3426 49 3695 -170 -3581 548 3684 -879 -3769 1303 4049 -1373 -3763 2229 3233
2477 3233 -2367 -3173 2868 3013 -2826 -2742 2633 1818 -2966 -2145 2274 1482 -2927 -1454 2550 756 -3333
2494 -3333 -782 3232 525 -3189 67 3421 -494 -3710 1484 3586 -1379 -3433 1890 3060 -2479
2509 -2479 -2762 2782 2734 -3016 -2730 2674 1865 -3307 -2022 3086 1966 -3406 -2096 3074 1250 -3468
2525 -3468 -960 3896 995 -3904 -772 3577 -122 -3182 745 3633 -843 -3396 1229 2473 -1506
2540 -1506 -2002 2296 2349 -2265 -2431 1734 1733 -2178 -1751 2674 1839 -3237 -2415 2513 1124 -3222 -1134
2557 -1134 3631 475 -4090 -656 3490 7 -2838 1008 3415 -930 -3127 590 2480 -904 -1920
2572 -1920 1698 1819 -1929 -2289 1072 1462 -1774 -1118 2372 940 -3058 -1798 2374 742 -2689 -294
$$ packed form
2462B06l632L475L646l865l411M129L136m563k890N072K746n422k390N992J004
2477C233n600q06O041J45n839Q4N375q15m784Q21M419p92m409J473M004j794m089
2494c333K551M014k707l714L256L354l915l216N194K102m965k054N323J170n539
2509b479k83N544m8n750K86N404q09n172J285N108j120n372J310N170j824m718
2525c468K508M856k901m899L132M349l699l060L927K888m476k553M625J244l979
2540a506m96M298N3m614j66M165jl911M27M425q35n076Q22M928j389m346K088
2557a134M765l156m565L434M146l483k845L846K407m345k197L717J890l384j016
2572a920L618J21l748l60L361L90l236O56L490j432l998J260M172j632l431K395
$$ plain form
2588 -294 3487 -471 -4060 18 3453 -634 -3074 1593 3239 -1776 -3416 1537 2927 -1104 -1924
2603 -1924 2216 2471 -2204 -2913 1751 2406 -1855 -2242 2518 1458 -3634 -2486 3146 1561 -2963 -306
2619 -306 3174 -253 -4066 -85 3513 -86 -2563 1026 2421 -1587 -3381 1387 3145 -709 -2240
2634 -2240 1486 2214 -2241 -2933 2181 2885 -1613 -2211 2032 1209 -3134 -2050 3274 1878 -2625 -1205
2650 -1205 2472 -179 -3903 -547 3167 512 -2975 133 1861 -1040 -2827 943 3070 -249 -2128
2665 -2128 611 1905 -1689 -2241 1966 2959 -1718 -2388 1767 1106 -2846 -1407 3011 1439 -2671 -1402
2681 -1402 2084 -265 -2925 -180 2839 65 -2369 -241 2014 -799 -2563 1274 3208 -286 -2606
2696 -2606 918 1899 -1755 -1933 2445 2665 -2080 -2224 1597 1131 -2634 -1010 2673 1230 -2651 -1284
$$ packed form
2588b94L781l958l589M078L435m087k440M667J646n015j640M953J390m031q20
2603a924M140K55m675p09M664O55m261l87M760j060n092J148N632j585m524K657
2619c06L480l427l813L981L598l599k477L589J395m008j794M768J758l854j531
2634b240L726P28m455o92N114P04m498n98M243q23m343J084N324j396m503J420
2650a205L677k651l724L356L714k655l487L108J728k901j787L770K127l319j879
2665b128K739J294l594n52M207R93m677o70M155o61l952J439M418j572m110J269
2681a402L486k349k660K745L019k774k434K128K255k813j764L837J934l494k320
2696b606L524R81l654j78M378K20m745j44L821m66l765J624L683j443l881J367
$$ plain form
2712 -1284 1984 222 -2654 -60 2878 149 -2693 -434 1670 -602 -2033 970 2728 -903 -2546
2727 -2546 876 1849 -1467 -1549 2338 1935 -2293 -1856 1914 955 -2356 -501 2708 698 -3087 -1154
2743 -1154 2261 397 -2539 -32 2995 -358 -3263 -240 2477 -461 -2502 846 2951 -1106 -2793
2758 -2793 1105 2400 -1272 -2029 1872 2013 -2179 -2070 1809 1553 -1636 -1030 2055 1071 -2719 -1223
2774 -1223 2036 875 -2148 -460 2256 212 -3024 -63 2685 -153 -2412 380 2345 -947 -2728
2789 -2728 1173 2526 -1089 -1669 1474 1871 -1855 -1347 1719 1640 -1360 -1531 1367 1141 -2097 -1128 1950
2806 1950 961 -2218 -693 2034 464 -2587 -370 2475 -297 -2482 476 2056 -1002 -2094 1246
2821 1246 2227 -709 -1496 1253 1453 -1374 -1441 1254 1457 -1377 -1212 1268 1211 -1660 -1187 2110 1042
$$ packed form
2712a284L268j762k876K594K938k729k842K259K104k272j431L003J758l631j643
2727b546L422R73l316q2L887m03m228M37L770r59l311J855L209k010l785J933
2743a154L415j864k936K507L027l353k905L023K717k938k041L348K105m057j687
2758b793L898J295l672p57L901J41m192J09L879k56l189O06L085r84l790J496
2774a223L259j161l023J688K716k044l236K961K748k838k259K792J965l292j781
2789b728L901J353l615n80L143L97l726N08L066p9l000j71K898k26l238R69L078
2806A950r89l179J525K727j570l051K217K845k772k185K958J580l058j092L340
2821A246R81k936p87K749K00k827o7K695K03k834J65K480n7k871M73L297j068
$$ plain form
2838 1042 -1836 -954 1895 19 -2404 -124 2150 -499 -2446 440 2304 -1131 -2054 1414 1778 -1321
2854 -1321 -1461 1313 1539 -1455 -1467 1479 1123 -1544 -1128 1401 1232 -1729 -1115 1963 620 -2362 -828
2871 -828 2346 52 -2165 23 2101 -416 -2554 544 1875 -630 -1740 987 1786 -1213 -1772 1009
2887 1009 1777 -1284 -1722 1336 1533 -1261 -1691 1788 1634 -1907 -1549 1869 1204 -2312 -1013 1989 630
2904 630 -2317 -295 1809 -387 -2142 328 1964 -417 -1859 387 1313 -872 -1491 796 1463 -621
2920 -621 -1400 1177 1319 -1311 -1472 1605 1159 -1674 -1131 1803 728 -2278 -543 2101 447 -2335
2936 -2335 -255 1914 94 -2224 -10 1769 -254 -1772 -107 1582 -448 -1739 316 1721 -535
2951 -535 -1456 746 1672 -999 -1493 1135 1203 -1208 -776 1505 465 -1728 -558 1851 81 -1846 -278
$$ packed form
2838A042k878Q82K849j876k423K280K274k649j947K886J864l435r23L468L64l099
2854a321j40K774K26k994j2K946l56k667M16K529j69k961O14L078j343k982J534
2871h28L174k294k217K188K078k517k138L098J331k505j110K727P99k999n59K781
2887A009P68l061m38L058J97k794m30L479j54l541L58L418o65l516J299L002j359
2904F30k947K022K104k196j755K470J636k381j442K246R26k185o19K287O67k084
2920f21p79K577J42k630j61L077m46k833N43K934j075l006J735K644j654k782
2936b335K080K169j820k318K214J779k023j518J665J689k030j291K055J405k256
2951e35r21K202R26k671m94K628O8k411M32K281j040k193J170K409j770j927J568
$$ plain form
2968 -278 1414 -430 -1711 206 1588 -492 -1935 320 1887 -502 -2044 1028 1911 -777 -1618 866
2984 866 1746 -1274 -1464 1339 1514 -1253 -1164 1406 1025 -1489 -538 1376 420 -1594 -553 1265 -366
3001 -366 -1546 11 1621 -394 -1834 51 1319 -803 -1579 921 1631 -1204 -1722 1241 1524 -1666
3017 -1666 -1214 1607 1516 -1646 -1274 1737 866 -1661 -924 1889 873 -1648 -1018 1456 174 -1839 -271
3034 -271 1888 386 -1624 -292 1363 -145 -1529 271 1320 -662 -1525 544 1034 -947 -1041 1292
3050 1292 1045 -1080 -647 1055 509 -1088 -517 1517 469 -1607 -841 1391 327 -1590 227 1689
3066 1689 -30 -2025 -387 1403 -353 -1409 607 1588 -579 -1567 558 863 -718 -826 1167 802
3082 802 -1093 -1096 907 693 -1025 -272 1292 542 -1439 -588 1225 68 -1101 -107 1671 -377 -2059
$$ packed form
2968b78J692j844j281J917J382k080j443K255J567k389j542L072Q83k688q41K484
2984H66Q80l020j90K803J75k767Q9K570l81k514R51J914r56k014J041J818j631
3001c66j180J557J610k015j440J885J268k122p76K500P10k835n18K963K83l190
3017a666M52K821r1l162L72L011q71k527P37K813j016k521O30K474j282k013J568
3034b71K159j502k010J332J655j508j384J800J049j982q63K069M90j981r4K333
3050A292k47k125M33J702n46j597N71K034j048k076P66K232j064j917J817J462
3066A689j719j995J638J790j756j056K016R81k167r88K125L05j581j08J993l65
3082H02j895lK003k14j718P53J564p50j981Q51J813j157j169R94J778k048j682
$$ plain form
3099 -2059 79 1470 -384 -1491 697 1342 -946 -1742 564 1072 -891 -1154 928 1219 -1120 -1387
3115 -1387 906 923 -935 -556 1177 358 -1691 -1010 1212 541 -1341 -231 1315 -107 -2045 -95
3131 -95 1414 -386 -1304 404 1343 -917 -1558 547 1219 -530 -802 956 944 -1050 -996 983 1122 -960
3149 -960 -509 1468 665 -1593 -531 1430 661 -1338 -125 1524 -225 -1744 -17 1195 -35 -1498
3165 -1498 74 1075 -607 -1619 243 1313 -102 -930 527 727 -958 -1215 889 1355 -684 -998
3181 -998 937 488 -1286 -606 1350 411 -1225 -121 1034 -391 -1475 43 1019 47 -894 225 466
3198 466 -728 -1476 423 1218 -414 -1143 479 714 -1174 -913 1053 1108 -878 -921 1120 427 -1169 -386
3216 -386 1404 572 -1129 -283 895 30 -1249 -42 1262 83 -1104 -419 738 -366 -1427 486
$$ packed form
3099b059K138J391j854j107K188O45k288p96K306N08j963k63K082K91k339k67
3115a387K293J7j858L79J733q19k049O81K222o71j882J110J546j422j938J950
3131i5J509j800r18J708R39k260o41K105O72j749k72J758j2j994N4J979J39k082
3149i60M51J977q03k258J062J961p69j999J213J649j749j519J727J212j230j463
3165a498J572J001j682j012J862J070j415q28J457K00j685k57K104M66k039l14
3181i98J935m49j774O80J956r39j636J104J155j425j084J518R76r72r41J119K41
3198D66j194p48J899P95j632p29J622K35j888K61J966N5j986m3K041o93j596P83
3216c86J790q32j701Q46J178q65j279J207J304j179j187O85J157j104j061J913
$$ plain form
3232 486 1337 -655 -1322 255 768 -923 -1027 1250 969 -995 -567 939 188 -1051 -128 1482 598
3249 598 -1075 -173 868 -49 -1051 -78 1107 -153 -1158 -221 1025 -235 -1183 415 1274 -704 -1564
3266 -1564 464 889 -989 -948 1105 941 -1031 -733 923 427 -1046 -243 1178 311 -1045 -413 803
3283 803 -46 -827 -197 1091 44 -1286 -186 1007 47 -1126 288 1183 -564 -1216 500 1041 -921
3300 -921 -813 905 828 -1195 -682 819 473 -722 -518 821 501 -1047 -689 916 361 -898 -179 1086
3318 1086 134 -1106 -129 985 83 -1039 -192 957 -373 -1000 344 870 -613 -905 805 577 -739
3335 -739 -574 651 252 -749 -259 652 201 -861 -202 884 408 -957 -261 902 -98 -1147 -134
3352 -134 1137 -531 -849 116 967 -423 -1111 468 836 -552 -1118 537 655 -744 -533 714 581
$$ packed form
3232D86Q51j992o67J577N13j691j04K277k81j964M28J506p51j239R23J610q84
3249E98j673R02J041r17j002R73J185j260j005R37J246j260r48J598Q59j978q60
3266a564K028M25j878M1K053j64j972K98J656m96j473Q03J421q67j356O32J216
3283H03q49p81O30J288j047j330J100J193r60j173J414Q95j747o52J716N41j962
3300i21J08J718p7k023N13J501l46j195K04J339l20j548L58J605n55j259P19J265
3318A086r52j240R77J114r02j122Q47J149j330o27J344N26j483k92J710k28j316
3335g39J65J225l99j001M90R11m51j062O59J086m76j365O96J163j000j049J013
3352a34J271j668l18R65Q51j390o88J579L68j388n66J655J18j399K11J247j33
$$ plain form
3369 581 -979 -573 604 420 -984 -203 881 183 -965 -206 897 -153 -1092 329 1110 -589 -1013
3386 -1013 587 882 -672 -907 525 759 -1033 -1063 472 512 -874 -841 1038 781 -875 -758 895 581
3404 581 -941 -560 1174 557 -1060 -269 1274 206 -967 17 1090 -138 -796 93 724 -516 -1010
3421 -1010 342 565 -494 -730 370 704 -467 -783 507 431 -873 -701 746 449 -946 -826 1084
3438 1084 231 -989 -494 1119 -6 -1072 -95 969 -221 -1221 -116 1079 65 -1004 -7 707
3454 707 -178 -918 292 782 -329 -903 501 686 -615 -709 551 342 -846 -370 841 263 -877 99
3472 99 740 -163 -542 204 791 -160 -881 382 593 -443 -907 250 752 -486 -1050 490 729 -582
3490 -582 -924 835 513 -692 -531 724 431 -1159 -556 816 195 -912 -145 842 63 -743 -243 766
$$ packed form
3369E81j560M06J177j84j404P81J084o98j148P59J103j050r39J421P81j699m24
3386a013J600K95j554k35J432K34j792l0J535M0j386L3J879k57j656J17J653l14
3404E81j522L81J734o17j617P91J543j068j173R84J073j228o58Q89O31j240m94
3421a010J352K23j059k36J100L34j171l16J290p6j304J72J447k97j395J20J910
3438A084q53j220M95J613j125j066R77J064j190j000J105J195j014j069R97P14
3454G07q85p40J210M90j111n74J404J85j301r4J260k09j188M76J211n78j140R76
3472I9O41r03l79P46N87r51p21J263K11j036m64J157N02j238n64J540K39j311
3490e82l42J759l22j205J61J255k93j590O03J372o21j107P67R87p79q06N00J009
$$ plain form
3508 766 -130 -743 189 980 -63 -967 166 802 -587 -992 511 717 -747 -1084 834 565 -942 -462
3526 -462 735 494 -949 -719 755 301 -910 -242 742 -164 -1011 -30 857 -75 -745 -253 966 152
3544 152 -860 2 719 -153 -1029 142 676 -434 -989 349 466 -653 -584 603 367 -928 -443 612
3562 612 -122 -903 -135 587 292 -912 -252 507 -155 -679 -70 766 -182 -943 58 922 -589 -744 414
3581 414 697 -368 -822 601 358 -548 -540 390 281 -746 -372 362 233 -401 48 629 99 -712 -230 723
3601 723 76 -880 -115 664 -109 -952 173 633 -371 -872 438 410 -643 -630 729 433 -527 -411 672
3620 672 102 -816 -596 298 59 -672 -271 718 0 -875 -178 593 -59 -764 -45 571 -186 -1031 33 411
3640 411 -398 -537 541 488 -573 -691 404 484 -443 -199 454 250 -774 -710 360 -87 -661 -376 484
$$ packed form
3508G66q96o13R32P91j043r04J133O36j389m05J503K06j464l37J918k69j507M80
3526d62J197k41j443K30J474m54j211O68R84r06q47R81Q87r32o70M92J219q14
3544A52j012Q62P17q72q76J171N34j110n55J338J17j119O9J187k36j295M85J055
3562F12p34p81P68P22k95j204O60P59o62n24O09Q36r48p61J001Q64j511j55J158
3581D14K83j065m54J423k43r06QR30j09j027L74P34j29o34M49N81n30q11M82R53
3601G23o47r56P65P79p73q43J125M60j004n01J310k8j053J3J359k96r60J16J083
3620F72n70r18K20Q94k39p31M01R89p18q75O97P71o52p05P19O16p57q45J064L78
3640D11q09j39J078n3j061j18J095Q0r27K44O53k04j024O4J070m47n74K85Q60
$$ plain form
3659 484 -19 -868 -80 803 45 -927 -27 629 -277 -1252 -99 854 -81 -410 234 423 -323 -826 313
3678 313 474 -536 -302 272 396 -634 -360 434 496 -415 -307 739 1 -1038 -411 779 -97 -724 -78
3697 -78 662 -67 -800 206 548 -72 -522 172 167 -395 -626 272 507 -308 -456 455 365 -697 -552 551
3717 551 423 -671 -476 769 151 -580 -169 695 174 -350 -159 542 -252 -630 196 565 -174 -430 67
3736 67 274 -191 -696 148 343 -242 -585 130 175 -342 -489 597 408 -494 -224 223 154 -542 -284 511 -42
3757 -42 -754 177 419 -477 -283 349 541 -190 -268 184 361 1 -413 495 485 -575 -835 406 456 -785
3777 -785 -331 829 255 -686 -333 594 234 -541 -97 511 -221 -450 -52 523 -17 -604 120 414 -146 -656
3797 -656 284 651 -367 -601 449 350 -372 -595 552 466 -615 -304 506 205 -733 -238 655 220 -379
$$ packed form
3659D84n03q49P88Q83p58r72R00O56r06r75J153R53r35l29O44J89p46n03J139
3678C13J61j010K34N74J24j030K74P94O2r11J08J046p38j039O27J190q76o27O46
3697g8P40p29p33J006L42o20m50O94nn62k31Q98K35q15j48R11r0j062J45J103
3717E51j28j094J95J245o18p31M11Q64n21n24J91P01p94l78Q26L69p39k56M97
3736F7K07m65n05Q44J95n85l43P15M5n17j47J086j89r02K70M47o9o96K58P95n53
3757d2p12R31K42q96J94O32J92p31p8M52J77l60m14R08j0j060k60J241N0j241
3777g85M54J160n74r41L53R27l60p75M44O08p32k29L98N75n40n87P24K94n60n10
3797f56R40L67j018k34J050r9p22k23J147q6j081L11Q10l01r38M95Q93m35n99
$$ plain form
3816 -379 148 556 72 -612 46 696 -8 -648 10 385 48 -709 -185 514 -492 -462 247 473 -373 -704
3836 -704 2 184 -148 -359 421 61 -519 -146 463 13 -578 25 217 -118 -505 109 212 -257 -201 -176 631
3857 631 -365 -695 116 465 -390 -567 511 503 -503 -540 433 426 -761 -574 357 195 -444 -334 385 249 -545
3878 -545 -77 320 -63 -430 -135 265 -33 -573 76 588 -11 -614 258 556 -474 -632 62 415 -409 -572
3898 -572 297 94 -401 -469 448 482 -652 -382 475 -113 -478 -264 556 159 -640 -243 383 -209 -524 -304
3918 -304 312 -45 -786 -248 414 -369 -655 254 528 -603 -449 163 348 -226 -462 114 240 -490 -513 323
3938 323 144 -512 -118 572 144 -761 -146 280 -26 -806 165 721 -265 -521 -68 352 -236 -309 -123 504
3958 504 -255 -549 65 329 -472 -482 173 538 -251 -644 373 380 -269 -158 471 251 -342 -35 298 -64 -775
$$ packed form
3816c79N27M08m84o84O58O50p04o40O58L75l37p57N24O99j006L0P09K26q46l31
3836g04P06J82l32k11P80l60n80L73O09m50n91O03J92l35l87O14J03m69N6K5Q07
3857F31r96l30Q11L49q55j77J078qj006l7R73pj187J87R31j62o39J10P19j36p94
3878e45M68L97l83l67K95M00k98n40O49N12n99o03Q72K98j030j58O94L53q24j63
3898e72Q69k03m95o8R17L4j134K70Q57n88l65K14Q20l97p99L97O26n92l15K20
3918c04O16l57p41N38O62p83k86R09K74j131J54O12J85n74k36N76J26p30k3Q36
3938C23j79o56L94O90m28r05O15M26l06p80R71N56r86k56M53M20n88p3J86O27
3958E04p59k94O14K64q01j0O55L65p89l93J017Po49J11O29k20n93L07L33l62p11
$$ plain form
3979 -775 70 358 -477 -364 45 321 -329 -392 65 14 -348 -492 149 278 -321 -415 419 321 -626 -321 746
4000 746 288 -661 -316 475 102 -821 -132 450 -8 -692 249 257 -252 -619 94 129 -224 -157 234 340 -293
4021 -293 -336 118 386 -306 -547 226 217 -304 -248 212 49 -754 -298 583 -310 -892 73 649 -141 -582 43
4042 43 593 -274 -600 96 354 -515 -614 150 397 -297 -693 210 350 -637 -463 418 475 -432 -332 401 84
4063 84 -448 -266 627 145 -480 -108 509 -148 -555 -21 372 59 -648 -146 258 -195 -412 -11 537 -250
4083 -250 -634 275 370 -387 -472 386 236 -254 -362 261 346 -854 -385 282 417 -564 -241 495 48 -352 -122
4104 -122 412 -196 -408 -300 293 -324 -457 110 366 -397 -351 339 263 -572 -424 545 135 -645 -224 301 288
4125 288 -713 -215 407 -73 -666 45 391 -256 -488 70 436 -159 -656 99 233 -88 -240 340 299 -320
$$ packed form
3979g75Q45K88q35J13M09K76o50o3M57n1l62j44O41J29n99r4Q34r8r47L05J067
4000G46m58r49L45P91l73r23O89N82m58o84R41Qn09l67P13L5l53O7L91J06o33
4021b93m3M54K68o92k41P73rn21N6M60j63q03M56Q81q93n82R65N76p90m41O25
4042D3N50q67l26O96K58q69r9P64K47o94l96R03J40r87J74Q81N7r07J00P33l17
4063H4n32J82Q93m82o25L72O17o57m07N34L93l13p07N02M04m53k17M01N48p87
4083b50l84R09R5p57q5Q58j50m90j08O23Q5j200M69O67J35r81L23P36m47m00K30
4104a22N34o08k12J08N93o17j33N67K56p63M6O90p6q35J48R69m10p80M21N25j3
4125B88j001M98O22m80n93P11L46o47k32N58L66n95m97P55J34l21j52N80m1o19
$$ plain form
4145 -320 -313 210 243 -422 -414 318 409 -866 -311 354 82 -448 10 379 -125 -545 -130 393 -81 -548 -160 274
4167 274 -231 -527 -116 393 -255 -510 52 463 -406 -384 327 361 -426 -217 446 184 -650 -349 356 310 -415
4188 -415 -95 586 -177 -721 -171 477 48 -543 -63 534 -71 -642 183 367 -80 -615 342 326 -414 -518
4208 -518 92 374 -406 -393 263 379 -525 -333 413 -12 -570 -118 338 294 -586 -315 611 377 -303 -121 422
4229 422 -88 -764 6 570 -380 -391 246 453 -405 -395 292 292 -91 -264 -4 -1 -450 -453 436 485 -370 -234 308
4252 308 29 -456 -215 482 62 -576 49 225 -201 -264 201 305 -330 -488 133 280 -220 -429 235 180 -470
4273 -470 -364 633 88 -530 -452 355 41 -465 -162 398 82 -622 -111 442 81 -601 -157 373 -107 -416
$$ packed form
4145c20PN23L3o65QP32R1j275N55O65k72n30M58L69n04m20M15N23m74m67L88M34
4167B74n05k96M11N09o48k55N62M11q69K2P11L4p87K09O63k62q34L01P05m6p25
4188d15L20O81p63n44N50O48m29n91M80N97o05n71Q25J84m47n35R57j6p40j04
4208e18O10K82p80J3O56J16r04J92P46m25n58M52M56m4q80K71R26k34o80J82N43
4229D22n10o76P70N64r50j1O37K07q58J0O87%l83j73K60Lm49lQ89M9q55J36N42
4252C08k79m85K41O97m20o38O25J76m26o3M65J04o35j58O21J47n00k09O64n5o50
4273d70J06R97n45o18P8Q07l14n06L03N60l16p04N11N53l61o82M44N30m80l09
$$ [...]
8191i4
##END NTUPLES=NMR FID
##END=
