##TITLE=1H_3MBPA2401A
 D2O
 8 sc, 
 25.1.2023
##JCAMPDX= 6.0         $$ Bruker NMR JCAMP-DX V2.0
##DATA TYPE= NMR FID
##DATA CLASS= NTUPLES
##ORIGIN= UXNMR, Bruker Analytische Messtechnik GmbH
##OWNER= root
$$ XWIN-NMR		Version 3.5
$$ Wed Jan 25 15:51:30 2023 Russian Standard Time (UT+4h)  she@DPX200
##.OBSERVE FREQUENCY= 200.13135
##.OBSERVE NUCLEUS= ^1H
##.DELAY= (6, 6)
##.ACQUISITION MODE= SIMULTANEOUS
##.ACQUISITION SCHEME= undefined
##.AVERAGES= 8
##.DIGITISER RES= 18
##SPECTROMETER/DATA SYSTEM= spect
##.PULSE SEQUENCE= zg30
##.SOLVENT NAME= CDCl3
##.SHIFT REFERENCE= (INTERNAL, CDCl3, 0, 15.7039)
##AUDIT TRAIL= $$ (NUMBER, WHEN, WHO, WHERE, WHAT)
$$ ##TITLE= Audit trail, XWIN-NMR		Version 3.5
$$ ##JCAMPDX= 5.01
$$ ##ORIGIN= Bruker BioSpin GmbH
$$ ##OWNER= she
$$ F:/spectra/data/she/nmr/H-F/1/audita.txt
$$ ##AUDIT TRAIL=  $$ (NUMBER, WHEN, WHO, WHERE, WHAT)
(   1,<2023-01-25 15:50:22.98 +0400>,<she>,<DPX200>,
      <created by zg, POWCHK disabled, PULCHK disabled
       configuration hash MD5:
       00 E9 B6 7A A2 85 ED C7 34 08 36 98 17 FE 4E 26
       data hash MD5: 16K
       47 63 07 AB 71 65 F7 FD 96 FE 00 A6 80 E2 B0 50>)
$$ ##END=
$$ 
$$ hash MD5
$$ 2C AD 8B B9 D2 F3 2E CB E6 4A BD BD 2F 61 87 9F
##$RELAX= 
##$RELAX= 
##$RELAX= 
##$RELAX= 
##$RELAX= 
##$RELAX= 
$$ Bruker specific parameters
$$ --------------------------
##$DU= <F:/spectra>
##$EXPNO= 1
##$NAME= <H-F>
##$PROCNO= 1
##$TYPE= <nmr>
##$USER= <she>
##$AMP= (0..31)
100 100 100 100 100 100 100 100 100 100 100 100 100 100 100 100 100 100 
100 100 100 100 100 100 100 100 100 100 100 100 100 100 
##$AQSEQ= 0
##$AQ_mod= 1
##$AUNM= <au_zg>
##$AUTOPOS= <>
##$BF1= 200.13
##$BF2= 200.13
##$BF3= 200.13
##$BF4= 200.13
##$BF5= 200.13
##$BF6= 200.13
##$BF7= 200.13
##$BF8= 200.13
##$BYTORDA= 1
##$CFDGTYP= 0
##$CFRGTYP= 5
##$CHEMSTR= <none>
##$CNST= (0..31)
1 1 145 1 1 1 1 1 1 1 1 1 1 1 1 1 1 1 1 1 1 1 1 1 1 1 1 1 1 1 1 1 
##$CPDPRG= <>
##$CPDPRG1= <>
##$CPDPRG2= <>
##$CPDPRG3= <>
##$CPDPRG4= <mlev>
##$CPDPRG5= <mlev>
##$CPDPRG6= <mlev>
##$CPDPRG7= <mlev>
##$CPDPRG8= <mlev>
##$CPDPRGB= <>
##$CPDPRGT= <>
##$D= (0..31)
0 1.2 0 0 0 0 0 0 0 0.06 0 0.03 0 0 0 0 0.0002 0 0 0 0 0 0 0 0 0 0 0 0 
0 0 0 
##$DATE= 1674647422
##$DBL= (0..7)
120 120 120 120 120 120 120 120 
##$DBP= (0..7)
150 150 150 150 150 150 150 150 
##$DBP07= 0
##$DBPNAM0= <>
##$DBPNAM1= <>
##$DBPNAM2= <>
##$DBPNAM3= <>
##$DBPNAM4= <>
##$DBPNAM5= <>
##$DBPNAM6= <>
##$DBPNAM7= <>
##$DBPOAL= (0..7)
0.5 0.5 0.5 0.5 0.5 0.5 0.5 0.5 
##$DBPOFFS= (0..7)
0 0 0 0 0 0 0 0 
##$DE= 6
##$DECBNUC= <off>
##$DECIM= 32
##$DECNUC= <off>
##$DECSTAT= 4
##$DIGMOD= 1
##$DIGTYP= 9
##$DL= (0..7)
0 120 120 120 120 120 120 120 
##$DP= (0..7)
150 150 150 150 150 150 150 150 
##$DP07= 0
##$DPNAME0= <>
##$DPNAME1= <>
##$DPNAME2= <>
##$DPNAME3= <>
##$DPNAME4= <>
##$DPNAME5= <>
##$DPNAME6= <>
##$DPNAME7= <>
##$DPOAL= (0..7)
0.5 0.5 0.5 0.5 0.5 0.5 0.5 0.5 
##$DPOFFS= (0..7)
0 0 0 0 0 0 0 0 
##$DQDMODE= 0
##$DR= 18
##$DS= 0
##$DSLIST= <SSSSSSSSSSSSSSS>
$$ [...]
##$SUBNAM2= <"">
##$SUBNAM3= <"">
##$SUBNAM4= <"">
##$SUBNAM5= <"">
##$SUBNAM6= <"">
##$SUBNAM7= <"">
##$SUBNAM8= <"">
##$SUBNAM9= <"">
##$SW= 18.05172834244
##$SWIBOX= (0..15)
0 0 2 0 0 0 0 0 0 0 0 0 0 0 0 0 
##$SW_h= 3612.71676300578
##$TD= 16384
##$TD0= 1
##$TE= 0
##$TE2= 300
##$TE3= 300
##$TEG= 300
##$TL= (0..7)
0 120 120 120 120 120 120 120 
##$TP= (0..7)
150 150 150 150 150 150 150 150 
##$TP07= 0
##$TPNAME0= <>
##$TPNAME1= <>
##$TPNAME2= <>
##$TPNAME3= <>
##$TPNAME4= <>
##$TPNAME5= <>
##$TPNAME6= <>
##$TPNAME7= <>
##$TPOAL= (0..7)
0.5 0.5 0.5 0.5 0.5 0.5 0.5 0.5 
##$TPOFFS= (0..7)
0 0 0 0 0 0 0 0 
##$TUNHIN= 0
##$TUNHOUT= 0
##$TUNXOUT= 0
##$USERA1= <user>
##$USERA2= <user>
##$USERA3= <user>
##$USERA4= <user>
##$USERA5= <user>
##$V9= 5
##$VALIST= <valist>
##$VCLIST= <CCCCCCCCCCCCCCC>
##$VD= 0
##$VDLIST= <DDDDDDDDDDDDDDD>
##$VPLIST= <PPPPPPPPPPPPPPP>
##$VTLIST= <TTTTTTTTTTTTTTT>
##$WBST= 1024
##$WBSW= 4
##$XGAIN= (0..3)
0 0 0 0 
##$XL= 0
##$YL= 0
##$YMAX_a= 285021
##$YMIN_a= -283960
##$ZGOPTNS= <>
##$ZL1= 120
##$ZL2= 120
##$ZL3= 120
##$ZL4= 120
##$ABSF1= 10
##$ABSF2= 0
##$ABSG= 5
##$ABSL= 3
##$ALPHA= 0
##$AQORDER= 0
##$ASSFAC= 0
##$ASSFACI= 0
##$ASSFACX= 0
##$ASSWID= 0
##$AUNMP= <proc_1d>
##$AZFE= 0.1
##$AZFW= 0.1
##$BCFW= 1
##$BC_mod= 2
##$BYTORDP= 1
##$COROFFS= 0
##$CY= 11.3945322036743
##$DATMOD= 1
##$DC= 2
##$DFILT= <>
##$DTYPP= 0
##$F1P= 2.36226072786647
##$F2P= -0.459571619588291
##$FCOR= 0.5
##$FTSIZE= 0
##$FT_mod= 4
##$GAMMA= 1
##$GB= 0.15
##$INTBC= 1
##$INTSCL= 1
##$ISEN= 128
##$LB= 0.24
##$LEV0= 0
##$LPBIN= 0
##$MAXI= 10000
##$MC2= 0
##$MEAN= 0
##$ME_mod= 0
##$MI= 1.114404
##$NCOEF= 0
##$NC_proc= 0
##$NLEV= 6
##$NOISF1= 3.799351
##$NOISF2= 2.8
##$NSP= 1
##$NTH_PI= 0
##$NZP= 0
##$OFFSET= 15.70392
##$PC= 1
##$PHC0= -19269.69
##$PHC1= 6.200793
##$PH_mod= 1
##$PKNL= yes
##$PPARMOD= 0
##$PSCAL= 0
##$PSIGN= 0
##$REVERSE= no
##$SF= 200.130013532006
##$SI= 16384
##$SIGF1= 3
##$SIGF2= 2
##$SINO= 400
##$SIOLD= 16384
##$SREGLST= <1H.CDCl3>
##$SSB= 0
##$STSI= 0
##$STSR= 0
##$SW_p= 3612.71676300578
##$SYMM= 0
##$S_DEV= 0
##$TDeff= 0
##$TDoff= 0
##$TI= <>
##$TILT= no
##$TM1= 0
##$TM2= 0
##$TOPLEV= 0
##$USERP1= <user>
##$USERP2= <user>
##$USERP3= <user>
##$USERP4= <user>
##$USERP5= <user>
##$WDW= 1
##$XDIM= 8192
##$YMAX_p= 0
##$YMIN_p= 0
$$ End of Bruker specific parameters
$$ ---------------------------------
##NTUPLES= NMR FID
##VAR_NAME=  TIME,          FID/REAL,        FID/IMAG
##SYMBOL=    X,             R,               I
##VAR_TYPE=  INDEPENDENT,   DEPENDENT,       DEPENDENT
##VAR_FORM=  AFFN,          ASDF,            ASDF
##VAR_DIM=   8192,          8192,            8192
##UNITS=     SECONDS,       ARBITRARY UNITS, ARBITRARY UNITS
##FACTOR=    0.0002768,     1,               1
##FIRST=     0,             0,               0
##LAST=      2.2672688,     0,               0
##MIN=       0,             -283960,         0
##MAX=       2.2672688,     285021,          0
$$ Real data points
##PAGE= N=1
##DATA TABLE= (X++(R..R)), XYDATA
$$ [...]
1470D741l416m626n816m83O528O398L073J763p83o327p632k425K203L469N113
$$ 4741 1325 -3301 -9117 -9600 -3072 3326 6399 8162 7379 1052 -6580 -9005 -6802 -3333 1780
1485A780O261J712m752o108l824k716p28N177P793L231j115j780l973o921l496
$$ 1780 8041 9753 5001 -1107 -4931 -7647 -8375 -3198 4595 7826 6711 4931 958 -5963 -9459
1500i459L261N019L527L851K600l171p021m633r60N04L060O460N467l90m338m255
$$ -9459 -6198 -1179 2348 6199 8799 5628 -1393 -6026 -6986 -6482 -3422 3038 8505 8115 3777 -478
1516d78m318l889P99O542O092K153L63j950o300o553j072L536M026M386M508N34
$$ -478 -4796 -8685 -7886 -1344 4748 6901 7264 5314 -986 -7539 -8611 -5075 -1049 3337 7845 8379
1532H379n156o114k988q48P04M519O571K938k043l410l489m595k793K748N916
$$ 8379 3223 -2891 -5879 -6727 -6023 -1504 5067 8005 5962 2552 -937 -5532 -8325 -5577 339
1547C39L813J807R27k544o436m958N1K414L258N091M542p84n357m799l082j949
$$ 339 4152 5959 6886 4342 -2094 -7052 -7001 -4587 -1329 3762 8304 7520 2163 -2636 -5718 -7667
1563g667J622O215N921J260j691k856n166n155l87M484M723K938K603K2n101o128
$$ -7667 -6045 170 6091 7351 5660 2804 -2362 -7517 -7904 -3420 1303 4241 6844 6866 1765 -4363
1579d363j930Q80J207L792N953K197l201l691k716l597k146L305N937L329Q05
$$ -4363 -6293 -5413 -4206 -414 5539 7736 4535 844 -1872 -5469 -7615 -4310 1627 4956 5761
1594E761J03k998o311m160J366L348L099M292L689j992o198m187j189j206J817
$$ 5761 5864 2866 -3445 -7605 -6239 -2891 208 4500 8189 6197 -1 -4188 -5377 -6583 -4766
1609d766O819N245r43k771k275m357m673R49N557L895J456J819k02n389n737n91
$$ -4766 2053 7298 6355 3584 1309 -3048 -7721 -6772 -1215 2680 4136 5955 5753 364 -5373 -5964
1625e964J888J229L363N450J428m142l814j906k948j604M034O185K332l63m18
$$ -5964 -4076 -2847 516 5966 7394 3252 -562 -2468 -5416 -7020 -2986 3199 5531 5168 4750
1640D750l338o395k701K924L535K596L933K427l531n958k853o31l07K840O182
$$ 4750 1412 -4983 -7684 -4760 -1225 1371 5304 7731 4200 -1758 -4611 -5242 -5549 -2709 3473
1655C473L612j826l095k237l669l318J750N407L131Q35J417r95n563m607L50J868
$$ 3473 7085 5259 2164 -73 -3742 -7060 -5310 97 3228 4063 5480 4485 -1078 -5685 -5335 -3467
1671c467J497L816M489j11m185l309k042k446jM594N281J418q33j389l686n070
$$ -3467 -1970 1846 6335 6224 2039 -1270 -3312 -5758 -5759 -1165 4116 5534 4701 3312 -374 -5444
1687e444j453L331L702K405K733J158l662n613k182K87N95L050N244K357k234
$$ -5444 -6897 -3566 136 2541 5274 6432 2770 -2843 -5025 -4738 -4143 -1093 4151 6508 4274
1702D274l048k378l028j902K037M734L052Q15P0j798m662l766L71K497K443L166
$$ 4274 1226 -1152 -4180 -6082 -4045 689 3741 4556 4626 2828 -1834 -5600 -5229 -2732 -289 2877
1718B877K980m79m206l613j814q97J021M334M545P33j722k128l338l680m49L374
$$ 2877 5857 5378 1172 -2441 -4255 -5152 -4131 203 4748 5481 3759 1631 -1707 -5387 -5836 -2462
1734b462L728K227J498j03l507m735j910J012J779K654L853K012k276l838k249
$$ -2462 1266 3493 4991 4888 1381 -3354 -5264 -4252 -2473 181 4034 6046 3770 -68 -2317
1749b317j720j174J960M854L009k01r55j950m069l124R61L144K635K294K067j018
$$ -2317 -4037 -5211 -3251 1603 4612 4411 3456 1506 -2563 -5687 -4726 -1582 1053 3347 5414 4396
1765D396m299l731p85L29J359L777M006L12k941k468k045k832m70L884M230J044
$$ 4396 97 -3634 -4419 -4090 -2731 1046 5052 5364 2423 -45 -2090 -4922 -5392 -1508 2722 3766
1781C766J99j36l199m710j223K039K034K080L266J503k657m117j906q15n74K274
$$ 3766 3965 3829 630 -4080 -5303 -3264 -1230 850 4116 5619 2962 -1155 -3061 -3876 -4450 -2176
1797b176M819K451j270j727j631l438k740J721M034J987J188J599j192m940l111
$$ -2176 2643 5094 3824 2097 466 -2972 -5712 -3991 43 2030 3218 4817 3625 -1315 -4426
1812d426N73R67J034L717L499r31l266j961j633k359K96M196L684L74m89l98l124
$$ -4426 -3853 -2886 -1852 1865 5364 4433 1167 -794 -2427 -4786 -4490 -294 3390 3764 3275 2877 -247
1829b47m275n15K838K064J434K842J084l447m043j013k44k21K730M593J172j900
$$ -247 -4522 -5037 -2199 -135 1299 4141 5225 1778 -2265 -3278 -3522 -3743 -1013 3580 4752 2852
1845B852j538j622l312j627K559L549J510R38R23j958m480k228J113J239J213
$$ 2852 1314 -308 -3620 -5247 -2688 861 2371 3309 4232 2274 -2206 -4434 -3321 -2082 -869
1860h69L314K764j515l556j631j221j763J040M324K774k37n79r58l347l135N55
$$ -869 2445 5209 3694 138 -1493 -2714 -4477 -3437 887 3661 3424 2845 1887 -1460 -4595 -4040
1876d040K555J881J743K080j84l438l118q31j2O69K820L634O25k089j749j679
$$ -4040 -1485 396 2139 4219 4035 597 -2521 -3352 -3364 -2695 125 3759 4384 2295 546 -1133
1892a133k605q43K817L359J173M26K79k317l964j421J313J511J594K701J659j709
$$ -1133 -3738 -4581 -1764 1595 2768 3194 3473 1156 -2808 -4229 -2916 -1405 189 2890 4549 2840
1908B840l218j830q58n10J369L529K446l06j514j400k402k316N11K785K284J153
$$ 2840 -378 -2208 -3066 -3576 -2207 1322 3768 3462 1948 548 -1854 -4170 -3659 -874 1410 2563
1924B563J044m88l101k947n86P46J276K398K745L81k090k385j577j410j82K342
$$ 2563 3607 3119 18 -2929 -3515 -2769 -1493 905 3650 4031 1941 -444 -2021 -3431 -3613 -1271
1940a271L349J407m98q77j933k954j377J562K318J462J647J064j711l281j672
$$ -1271 2078 3485 2987 2110 177 -2777 -4154 -2592 -274 1188 2835 3899 2188 -1093 -2765
1955b765j61K93J351L028K016p73j778j401j860j791P50K988K132N86L73n43k993
$$ -2765 -2926 -2633 -1282 1746 3762 2989 1211 -190 -2050 -3841 -3091 -103 2029 2615 2988 2445 -548
1972e48k945JJ681J114J837K594J55k941k578n42q30j48K672L409O01j412q73
$$ -548 -3493 -3492 -1811 -697 1140 3734 3889 948 -1630 -2172 -3002 -3150 -478 2931 3532 2120 1247
1989A247j547k712r24K186K499Q85Q69Q24j837l304j244Q14M97Q95K828K018j434
$$ 1247 -300 -3012 -3936 -1750 749 1634 2503 3327 1490 -1814 -3058 -2244 -1747 -852 1976 3994 2560
2006B560k357q80j121j965R92L538J908l72J49n80l037k624O44K138J154J531
$$ 2560 203 -677 -1798 -3763 -2771 767 2675 2303 2452 1872 -1165 -3789 -3145 -1007 147 1678
2022A678J961m01l057k312k60q9K47K568K921j52j763q91j226k349k69K670K013
$$ 1678 3639 3238 181 -2131 -2391 -2480 -2233 335 3256 3104 1341 450 -776 -3125 -3394 -724 1289
2039A289K79Q03N30k252k950m26R66K60J232K753J179j892j948q34j265j139J586
$$ 1289 1568 2371 2901 649 -2301 -2727 -1761 -1501 -269 2484 3663 1771 -177 -1011 -2276 -3415 -1829
2056a829L240J331m74l04r46k985j860J391K149R76J311J571j285l106j555K59
$$ -1829 1411 2742 2268 1964 1018 -1967 -3827 -2436 -287 689 2000 3571 2286 -820 -2375 -2116
2072b116M5O64K622K010p63j642q69j163j717K84K307J757L17L57J6j981k434
$$ -2116 -2071 -1407 1215 3225 2462 820 -49 -1212 -2929 -2645 -338 1419 1736 2093 2109 128 -2306
2089b306m02J130O78J240K221O87j903j967q72q88l99J848K727R68o51p19j390
$$ -2306 -2708 -1578 -900 340 2561 3248 1345 -622 -1494 -2382 -2781 -933 1794 2762 2111 1392 2
2106Bk262j053J387K109J187Q09M78j207k565j311L33P15P85J884J536o86j699
$$ 2 -2260 -3313 -1926 183 1370 2179 2657 1450 -1115 -2426 -2093 -1378 -593 1291 2827 2141 442
2123D42j061p85j087M01K090J722K25r6l98j791k040k02J278J164J042J532M04
$$ 442 -619 -1404 -2491 -2090 0 1722 1947 1851 1453 -338 -2378 -2580 -1302 -138 904 2436 2840
2140B840j840k314p81M4J98J465K463Q84j219j417q68j479q30J399K316R15J9
$$ 2840 1000 -1314 -2095 -2051 -1853 -388 2075 2959 1740 323 -545 -2024 -2854 -1455 861 1776 1795
2157A795J03r20k242j283O99J121O87J235J320n46k030j019l40o45K47K093J921
$$ 1795 1898 978 -1264 -2547 -1848 -727 -40 1195 2515 1969 -61 -1080 -1420 -2065 -1818 275 2196
2174B196j74o92m61j377k019j50J957J386L87J149K85k094k349j68O38K54J347
$$ 2196 2022 1330 869 -508 -2527 -2677 -720 666 1053 2202 2487 393 -1956 -2124 -1486 -1232 115
2191A15K150L98j532j434n39j031o01J529K277N24m11L3q11k212r81J242J063
$$ 115 2265 2663 1131 -303 -842 -1873 -2474 -945 1332 1856 1445 1478 667 -1545 -2526 -1284 -221
2208b21K71J291J337j061k270o47L3n99L67K428J458p45q51l05j432j703M42K144
$$ -221 50 1341 2678 1617 -653 -1300 -1267 -1866 -1499 929 2387 1642 791 486 -946 -2649 -2207 -63
2226f3J133K10O86j02k202j930L81Q92K28J184J972j42j836r58k63j041l72J946
$$ -63 1070 1280 1966 1864 -338 -2268 -1887 -995 -767 417 2389 2247 411 -547 -810 -1851 -2223 -277
2244b77J958p4n09J51j024k071m72J390R59L56J174Q14j284k056o00J94j40P52
$$ -277 1681 1607 1098 1249 225 -1846 -2318 -928 31 387 1561 2375 1091 -965 -1565 -1371 -1511 -759
2262g59K046J074r89r86m21j223j146Q93J906P64K31L37n09k107j190O07P08L29
$$ -759 1287 2361 1372 386 -35 -1258 -2404 -1511 395 1159 1390 1727 1218 -889 -2079 -1472 -764 -435
2280d35J282J324l38j621j013l10n77O3J680J677j6p78l07r12j510l06J383J054
$$ -435 847 2171 1833 212 -801 -1111 -1688 -1625 55 1732 1716 938 631 -281 -1791 -2097 -714 340
2298C40N60P05K24j298j738m50K98L39R38J517O03q47j137n91p85o44P99J799
$$ 340 900 1605 1829 531 -1207 -1657 -1359 -1020 -82 1435 2038 1191 54 -537 -1322 -1966 -1167 632
2316F32Q48j44j62n25j515j094M47J123N80P60R63l49j604j120j75l1L53J341
$$ 632 1480 1336 1174 649 -866 -1960 -1513 -390 190 950 1913 1564 -40 -1160 -1335 -1366 -1013 328
2334C28J325m9q08n93q63j008p6J269J243L36K28J03j213j613l43Q18M69M87J367
$$ 328 1653 1604 796 203 -660 -1668 -1744 -475 768 1104 1332 1435 222 -1391 -1734 -916 -447 40 1407
2353A407N81j167j277l49l26m46P67J748P48n77l94l66j255j047O32J364N32L39
$$ 1407 1988 821 -456 -805 -1131 -1577 -810 938 1686 1109 715 349 -906 -1953 -1321 43 575 914
2371I14O86k89j744j126L85L21O3J243J442l84j233n26l29r64j04J600J265j14
$$ 914 1600 1311 -433 -1559 -1174 -853 -790 453 1895 1511 278 -248 -577 -1541 -1645 -45 1220 1106
2389A106o6L3j046j538j29J014O00L79J016M64j270j376j66l6k45P23J775M05
$$ 1106 1040 1073 27 -1511 -1640 -626 -26 353 1369 1833 563 -813 -979 -1015 -1260 -537 1238 1643
2407A643q49m19j82j320p94J000J420J77K13O47o55j721p13O48K03K22J232J079
$$ 1643 794 375 193 -1127 -1921 -921 499 676 889 1536 881 -840 -1553 -905 -702 -480 752 1831
2425A831o16j235m50k24q18K44J620R95l82j45N5j245j421M16J160L18L73J022
$$ 1831 1215 -20 -470 -694 -1512 -1268 352 1347 965 820 875 -370 -1791 -1375 -215 103 476 1498
2443A498P9j563j079J85l6j42J021J479J1r69l98k48j008m83J155J200Q3L5L69
$$ 1498 1577 14 -1065 -880 -916 -1058 -37 1442 1453 484 86 -162 -1170 -1653 -498 702 785 820 1189
2462A189o26j547m45O20L42L06J117P37p62j158l87k73m86N62J515N89l47k74
$$ 1189 563 -984 -1429 -809 -467 -161 956 1693 931 -227 -614 -887 -1373 -811 704 1293 946 672
2480F72l55j019q58L40J123O30J90N34j06j396q93J86K14J97Q43J005j53p95m39
$$ 672 317 -702 -1560 -1220 -97 533 723 1257 1151 -245 -1138 -952 -738 -541 302 1307 1154 359 -80
2499h0l80o78o6R69R17K07p7K9o86j127m30O12O30L94P78M67o86j285m72O0q6
$$ -80 -460 -1138 -1204 -235 682 889 812 841 155 -972 -1402 -790 -160 234 1012 1479 793 -492 -964 -904 -990
2520i90M67J248P03m78o51m07o88o30M72J153N94N3J10k88j033p28J61N00K99
$$ -990 -523 725 1428 950 299 -108 -796 -1426 -954 199 793 846 956 668 -365 -1093 -932 -432 -133
2539a33M81P77j3q94o26j38l98j42Q84J063J69l60p3n30j087l71P93P80K91M11
$$ -133 348 1125 1112 218 -408 -546 -944 -1086 -202 861 1030 670 597 67 -1020 -1391 -598 182 473 884
2559H84L78p65j266l82L54J73M45J040N72o84q76k12l55n35N17J214M32l28L0
$$ 884 1262 497 -769 -1151 -797 -624 -179 861 1433 749 -127 -339 -694 -1229 -712 502 934 606 636
2578F36l2j022q05M31O91L6L77Q42p4j137n42O6k91j70R85J154j6p60o7l91j075
$$ 636 604 -418 -1223 -792 -101 -65 312 1154 1080 -57 -599 -533 -824 -994 -9 1145 1129 369 302 -89 -1164
2599a164k48J127Q89k9K49K54q66j300j9O27J09L57R76L98r89p74N4l21l94N42
$$ -1164 -1412 -285 604 575 824 1078 212 -1088 -1107 -480 -371 -14 962 1360 371 -403 -349 -670 -1064 -522
2619e22J226J84l74l9q2r00p92O65P16n2L58P30k11j165n27K14j87L7J034R76
$$ -522 704 888 514 475 393 -507 -1299 -634 82 30 388 1118 907 -258 -785 -571 -758 -721 313 1289
2639A289m20o37j13m94q61J89J105O45q0R3P3r43q87J05O46J36L40P78J21r78
$$ 1289 869 232 119 -375 -1236 -1047 58 703 623 716 789 -154 -1041 -936 -290 -154 186 964 1085 107
2659A07n20J0j94k77O49R03J50l92k9k65q38m00N72N98Q1N23L95m79j007l83J48
$$ 107 -413 -403 -597 -874 -225 678 828 436 407 142 -696 -1096 -524 74 155 678 1073 594 -413 -796 -648
2680f48P3J98R23N94m03n99l19l14n81K73J044N91j62q6j22p85o70J74O03K47
$$ -648 -575 -377 546 1140 737 138 -181 -495 -1076 -803 241 832 670 584 462 -323 -993 -819 -216 31
2700C1K50N89m1p44m78j82j06qO07P45J89m09k03l02o29l48N86P59J55Q9L27m29
$$ 31 281 870 829 85 -393 -575 -681 -689 -82 663 852 443 240 -62 -691 -1039 -453 306 461 550 877 448
2722D48r99l60L14K99K28N94N26l48q03l43j02k35K36Q52N24j18m09r2m63o44
$$ 448 -551 -911 -597 -298 -70 524 1050 702 -101 -444 -546 -781 -545 307 831 713 304 212 -251 -895
2742h95J19O58L26J56L43M0p15p28M7K33OL45Q78J16o31l94r9m04l46N80Q83R7
$$ -895 -776 -118 208 364 707 747 32 -696 -649 -416 -410 -65 813 929 298 -96 -195 -599 -945 -365 518 615
2764F15j62O0j59q63m45M69M24J98L68M63m58q29k10J33k41J56Q19N77l93l70
$$ 615 453 513 354 -509 -954 -485 -61 137 505 968 510 -319 -529 -396 -637 -481 338 915 522 152
2784A52l1l98p01K05Q94K42JK72j6p80o11J87L37j1L50P59M4p81m03J04m43j86
$$ 152 121 -277 -978 -773 121 363 364 636 620 -160 -771 -584 -247 -258 92 851 895 114 -289 -185 -628 -814
2806h14P40P57j60k30J68l57p81j74O07L28q6M99L84n40p95p8J71j55J86Q23L55
$$ -814 -74 683 523 293 461 104 -677 -851 -244 84 -2 497 881 341 -454 -532 -361 -516 -330 493 848
2827H48n01l27Ml84n20L09Q24J95j40K81p3q54n64L98L66j25M81O61k51p10k14
$$ 848 347 20 24 -360 -880 -571 253 448 308 589 516 -338 -902 -504 -138 -263 218 879 628 -82 -296
2848b96K5l31o2O82P02j96k51K1l45o49p1O28K72O9L49K13o09p26O9J11J4K57
$$ -296 -271 -602 -664 18 720 524 273 294 -51 -700 -771 -143 129 198 547 760 151 -575 -506 -395 -381 -124
2870a24P55J41m86k19j86l68l08M50O54J26K3p2p3p19l72L51K87J63K87M59k31
$$ -124 631 772 286 67 -119 -487 -795 -345 309 435 458 386 313 -406 -778 -427 -140 23 310 769 538
2891E38o15l46N0m9O8N30N09j59k86j14l52m54J07N17L03Q3J95J1m91n87l1L13
$$ 538 -77 -423 -373 -422 -354 176 685 526 240 126 -226 -680 -573 -56 247 330 525 536 45 -542 -573 -260
2913b60L6J65O27J50m34n07k6j30k67K67P83K37l30o0j11m11m65L13M43J33J78
$$ -260 -224 -59 568 718 284 -223 -249 -379 -646 -379 404 641 311 251 140 -271 -736 -423 20 153 331
2934C31K54j32n54m30J14P6J27M22M14j03m16j35k16l39r0P04N02j69nK9m03n67
$$ 331 585 453 -101 -531 -417 -341 -214 208 622 519 103 -32 -248 -587 -677 27 529 360 355 384 -19 -586
2956e86j2N06J3N6M87K63m86o41J07K2k34J91P04K96l61k20Mm73m01L90O41J0
$$ -586 -598 -92 -79 -23 464 727 241 -400 -293 -271 -505 -314 390 686 325 105 109 -364 -765 -375 266 276
2978B76%L00k44p43k05L58O1j0N12M21l48n72M4k2l64kO58M13l16n2J52k88o82
$$ 276 276 576 332 -411 -616 -258 -197 -207 305 726 378 -194 -150 -172 -536 -538 120 533 217 165 317 29 -653
3001f53P0N08J55n8M15K16n50m77Q6j4k09M55N99M3l98o6j19n58r9N42M54j4l8
$$ -653 -583 -75 80 22 437 653 103 -374 -288 -302 -511 -56 543 586 188 122 3 -555 -654 -112 342 328 290
3024B90K15l18o74j30M88Q7q7M74L40l98n09L8j9l16J73N85K42k41o8J10m50m51
$$ 290 505 187 -487 -617 -129 -42 -129 345 685 287 -222 -184 -203 -519 -346 239 481 240 172 282 -168 -619
3046f19J50N20J2L3M79j7o74l26J70%j11M12O29r2n12p6q4l86r9N48M75j04p8
$$ -619 -469 51 63 96 575 558 -116 -442 -272 -272 -383 29 658 566 54 -22 -106 -492 -591 -43 432 328 250
3069B50J14l04n15l3M00M8qL64J57k80l61l9j3j65J42M92J95j73j33Pl14m23K21
$$ 250 364 60 -455 -488 -88 -40 -48 316 473 193 -168 -207 -220 -385 -243 249 444 271 138 145 -169 -592 -371
3092c71M02J37J35K14j63m77l34O7J88J01K59M07j34m13j63j25j10l5M30L79n4
$$ -371 31 168 303 517 354 -123 -457 -390 -202 -101 158 565 431 18 -145 -270 -380 -415 15 394 340
3113C40j65k6j81m06j2L74J92J3J13K33l28m64kJ19j08J22L84L06k05k82n4j90
$$ 340 175 149 -32 -438 -450 -76 116 129 242 475 147 -317 -319 -200 -308 -186 198 504 299 17 -37 -227
3135b27l27J32M84K74m5J3J0n13m07K06L50R4J75K97j33m96k23J31q1q2M41M21
$$ -227 -554 -422 62 336 291 304 314 -199 -606 -400 -50 44 219 516 383 -113 -336 -205 -286 -368 73 494
3157D94k16k96O7k6m27q4M80J55j21J45L05k64n17j08L14r7k5N22K71m11k18K2
$$ 494 278 -18 49 23 -404 -488 -8 147 26 171 476 212 -305 -413 -99 -196 -221 301 572 161 -57 -35
3179c5k12l29L11N71O3j86N1k6m57l20L14L12o7J12L89r4o07j93L01j13r8L86
$$ -35 -247 -576 -265 306 369 183 234 208 -249 -569 -255 57 -10 102 491 397 -210 -403 -102 -215 -313 73
3201G3M39k22l40J16n5m31n2N47J69k08J52K39l54m83Q0K45p7J54M40J03m04l02
$$ 73 512 290 -50 66 11 -420 -472 75 244 36 188 427 73 -410 -330 -85 -162 -8 432 535 131 -171
3223a71R5j51k09K53N58rl13J25K7n55k19L95L13j03J55L06k13n01j10J98j17
$$ -171 -76 -227 -436 -183 375 366 53 178 205 -350 -569 -174 139 36 191 497 284 -217 -327 -129 -246
3244b46J2M06K54j54k80M0j19l23N7M57J07j05J10J00l61l87O3K75oQ8L58N4m31
$$ -246 -234 172 426 272 -8 32 -87 -410 -353 104 211 106 216 316 -45 -432 -369 -94 -100 -12 346 400 -31
3267c1j49J0j45k0K71M42p8j85L9j14l75m6L00K26l6K9K39k29m24l0J54O9j1K28
$$ -31 -180 -170 -315 -335 -64 378 300 115 154 40 -335 -381 -81 145 109 138 377 148 -276 -306 -152 -83 -94 134
3291A34L64k50k87q8ok16O7L79K02j15m6J6k48k22pK49J06J19J27N1l21k06pJ4
$$ 134 498 248 -39 -127 -133 -349 -282 97 299 184 138 154 -94 -316 -323 -74 32 151 278 329 8 -198 -205 -191
3315a91n3K13M04j6k79r0P5l36j57L08L11K5j31J54o8m29n4J72J06qL00K00k47
$$ -191 -244 -31 373 357 78 -12 63 -273 -430 -122 189 214 83 237 169 -260 -314 -142 -36 -44 256 456 209
3338B09k88j05L4j38P6L77J97k11r8O2j63l91J78L80Pj00K26J23m22k92J94R1
$$ 209 -79 -184 -150 -288 -212 165 362 151 53 115 -48 -439 -261 119 126 26 252 375 -47 -339 -145 -54
3360e4j82J43M35J02m23o4M1k13k17L34L87p4j99K13j25l81j48L29J55r8K01K69
$$ -54 -236 -93 342 444 21 -43 -2 -215 -432 -98 289 215 16 229 104 -277 -425 -96 59 -39 162 431
3382D31k47l78KJ56k38Q7L54J85k85o1J18j54l85J74M17L0j51J64M3l05l56J87
$$ 431 184 -194 -192 -36 -274 -187 167 352 67 6 124 -30 -415 -241 176 206 55 219 262 -43 -399 -212
3404b12J91j15J54L50l5l69j06L3j23j55L90L15j86n2J38j68l75j2L62L8j03L19
$$ -212 -21 -136 18 368 333 -36 -142 -109 -232 -387 3 318 132 80 218 50 -325 -337 25 63 -40 279
3426B79J17m19k51J27R1j78R2M47N3k79j33J48j87l12K03M05j4j71J94m3l40j32
$$ 279 396 -23 -274 -147 -56 -234 -142 305 358 79 -54 94 -93 -405 -202 203 189 18 212 169 -171 -303
3448c03J80J35m5K20J80k04k58n3J09j59k1K98K03j82q1J48j45l72K7L32P0k9
$$ -303 -123 12 -33 187 367 163 -95 -148 -39 -198 -219 79 282 100 19 167 22 -350 -323 9 79 50
3470E0J42Q8k67k69Q6L3K0Q9K66M5k03j40k3q0j35K44K36n6j8k3n6j99j14J97
$$ 50 192 280 13 -256 -170 -137 -117 -28 238 283 80 -60 -83 -163 -298 -54 182 126 108 85 29 -170 -284 -87
3494h7J17m2J16K28j68k43lm6Nk0K06K51j10j68J0q3k32n9L18J75p4L4J04k34
$$ -87 30 -12 104 332 164 -79 -82 -128 -123 -143 63 314 204 36 46 -37 -269 -328 -10 165 91 125 229 -5
3518ek76J8K44j6pK97P3k34k46Nj4p2J66L15l3k35Q3k2j66j64J93K05o8K2J56
$$ -5 -281 -263 -19 -35 -42 255 328 94 -152 -147 -161 -233 -67 248 215 -20 63 41 -125 -289 -96 109 41 63 219
3543B19Pl35j55J48L5q5K14K64j17k46J2J4k43j3L72J54j29p9J35j70l00P8K78
$$ 219 226 -109 -264 -116 -81 -166 48 312 195 -51 -39 -25 -268 -281 91 245 116 37 172 2 -298 -220 58
3566E8n0M9J06P4l03j34J10Nq2J13K92k7k33L2Q8k59j17K45J95j11j7K06o6l57
$$ 58 8 57 163 237 -66 -200 -90 -85 -167 -54 238 211 -22 10 98 -161 -278 -33 162 51 34 240 174 -183
3590a83j07K22K6j30L09L10k89k85N5K9k29N8L94J22k17r0J28j57l21J71L25o0
$$ -183 -290 -68 -42 -172 137 447 158 -127 -72 -43 -272 -214 180 302 85 -5 123 -34 -355 -184 141 81
3612H1r3K09J4k70j37K01q4p9J34L06j35j38K4O4k39j44K72J28o3qK05j83l13
$$ 81 -12 197 211 -59 -196 5 -79 -158 -24 282 147 9 33 97 -142 -286 -14 114 51 43 248 65 -248
3635b48J1J68l9O0K65J28l19k35J63r5r1J48K79J3j61r4J81k36j33J22K75o3j26
$$ -248 -237 -69 -108 -48 217 345 26 -209 -46 -141 -232 -84 195 208 47 -47 134 -102 -235 -113 162 99 -27
3658b7K20j17j64j26J44rl4J35K18j04j54M9n6j93l4K06J83p0Q3q6l9k28m8K23
$$ -27 193 76 -88 -214 -70 -79 -113 22 240 136 -18 31 -25 -218 -252 -46 137 67 150 64 25 -203 -251 -28
3682b8M6L4O8J34k20k10O0Q4j33O6K03J30k22j0n1m2q8M7K09L0k8N6%k41p5J31
$$ -28 18 52 120 254 34 -176 -116 -32 -165 -99 104 234 12 2 -49 -91 -179 -132 77 107 79 135 135 -106 -181 -50
3708e0%M6J2K22l4k43j00J23j04o7K38J67n0r6Pn5k00m5K33Q7q5J26P8j72j66
$$ -50 -50 -4 8 230 196 -47 -147 -24 -128 -195 43 210 160 64 71 16 -184 -229 4 91 6 132 210 38 -128
3733a28k7J36j7MJ50R0j77m9K9n0j67P5K40N9j15N9l6k10q7J20J61p7J7K75r5
$$ -128 -155 -19 -36 -32 118 208 31 -18 11 -39 -206 -131 109 168 53 112 76 -134 -221 -101 60 -17 0 275 180
3758A80k72j06J31l3o7J98K46j40k42J57j7k68l9L41J02j59L7J08j59k20J16J05
$$ 180 -92 -198 -67 -100 -167 31 277 137 -105 52 35 -233 -272 69 171 12 49 157 -2 -222 -106 -1
3780ap7l0L10P1l81MQ6n0j94K44K22n8j44R9N9l30j48K56J94j52O8K36j59k59
$$ -1 -78 -108 202 273 -108 -104 -18 -68 -262 -18 204 146 2 101 160 -170 -318 -62 132 -20 48 284 125 -134
3804a34k4J57j01o7K92J23j70j62J24p8j50N7K55lr7Q2P7k20k28J61J57k18J08
$$ -134 -158 -1 -102 -169 123 246 76 -86 38 -40 -190 -133 122 119 22 104 181 -39 -267 -106 51 -167 -59
3827e9L45n4l13o4J68o1j82J57L38k04j36J22L6k41q9K21Q8r2N5J19j10k18L2
$$ -59 286 232 -81 -145 23 -38 -220 -63 275 71 -65 57 93 -148 -237 -16 72 -20 35 154 44 -174 -142
3850a42P6L7q4K05J17j91o7J9n4j22P0K71k4q8P9l9j53j45R5J83j09P1J79l6k03
$$ -142 -66 -29 -113 92 209 18 -49 -30 -84 -206 -136 135 111 23 102 63 -90 -235 -140 43 -66 5 184 148 -55
3875e5q0O8J9q5J16K32l3j61l6J2j61K5J59L1J1O8K1o4k62P5J00m2J9J37Q5k03
$$ -55 -135 -67 -48 -133 -17 215 182 21 -15 -3 -164 -139 20 51 62 130 151 87 -175 -100 0 -42 -23 114 199 -4
3901dl7O6j58m4N9K17R0j29o1P1r3j92O4K77k6r8J18L7j79j65J43Ln9Q3K05n1
$$ -4 -41 25 -133 -177 -118 99 189 60 -1 70 -23 -215 -151 126 100 2 120 157 -22 -187 -44 -41 -100 -17 188 137
3927A37j54k9j4m3j15K47J00l4n5P2o7k28J6J31K6p2J67J32j25k49R2N3j48M1
$$ 137 -17 -46 -60 -103 -218 29 129 95 40 112 45 -183 -167 -36 -10 -82 85 217 92 -157 -65 -12 -160 -119
3951a19K53N3k12J8R7j43j53O8K50Nj17J69j7k20j35J29J01j32J27K18n6k83P0
$$ -119 134 187 -25 -7 90 -53 -206 -138 112 117 0 169 152 -68 -203 -74 27 -105 22 240 184 -99 -29
3974b9R5j71q2K91J02j73m8J33l9l09M8K43M8j53J56L5j11k01J39M3j62Q0J98
$$ -29 66 -105 -187 104 206 33 -15 118 79 -230 -182 61 109 -44 112 147 36 -165 -26 17 -145 -65 133
3997A33M1j89l8J10j08j97K28K00j38l9J45K3k83k4J42n8J2Q8J93j55k26R3M7
$$ 133 174 -15 -53 57 -51 -248 -20 180 42 3 148 171 -112 -136 6 -52 -40 48 241 86 -140 -47 0
4020@j46L3K27O5j11j18P9r3j10P7J54mm9N7P4j60j65J33J3q0M8K57K6k32NL8
$$ 0 -146 -113 114 179 68 -50 29 -64 -174 -97 57 53 4 61 135 -25 -190 -57 -44 -124 -76 181 207 -25 -20 18
4046A8j30m9Q9J84k9n5J07j34j28m1J58M8n9R2R6j84j50M7J50j41NK48J12k69
$$ 18 -112 -161 -72 112 83 28 135 1 -127 -168 -10 38 -21 71 167 -17 -167 -120 30 -111 -106 142 254 -15
4070a5n2R4j15p2M2J70om3J8O5j32l3kJ08r5J9J95J5q5j85R2r2o3J85J24J9p8
$$ -15 -67 27 -88 -160 -118 52 46 3 21 86 -46 -79 -81 27 -68 -49 146 161 76 -109 -17 -109 -172 13 137 156 78
4097G8Po5j53o7J91J16p8M8R1j37j67J0P4N5n7J41R0j29q1O4Jj40K4K06j6j13
$$ 78 85 20 -133 -200 -9 107 29 77 168 31 -136 -126 -52 3 -54 87 177 48 -33 31 32 -108 -84 122 106 -7
4123gO5K0j24j13J42k2M3K2J23M2k35m6M4mo8J48J40l2j31J5pj35r8K14R1o7M7
$$ -7 58 78 -46 -159 -17 -39 4 26 149 191 -44 -90 -46 -50 -118 30 170 138 7 22 15 -120 -218 -4 87 20 67
4150F7O1q5j86L5R3m6k3J55J06j79j53J44J8j18q0K84L0j49O3L6j16j79J39J57
$$ 67 128 43 -143 -108 -15 -61 -84 71 177 -2 -155 -11 7 -111 -191 93 123 -26 37 73 -43 -222 -83 74
4174G4p8oJ81Rk52r6J59n0q0J31K26j12j59M2J7j84r1L09O9p2LO0j02j98Q2K07
$$ 74 -4 -10 171 180 -72 -168 -9 -59 -139 -8 218 106 -53 -11 6 -178 -269 40 109 37 40 100 -2 -200 -118 89
4200H9j17m2J34J22j57j51J45J4j76L3K23l5j12Q8k0p7j13J37J22j42O0J22j9
$$ 89 -28 -70 64 186 29 -122 23 37 -139 -106 117 82 -30 58 38 -39 -152 -15 107 -35 25 147 128
4223A28k15m3J71n3m6J07J81j65j07N1J1j75oK18N4j44M3J17j52j20M4J06n0K3
$$ 128 -87 -130 41 -12 -58 49 230 65 -42 9 20 -155 -161 57 111 -33 10 127 -25 -145 -101 5 -45 -22
4247b2J21M6j82p7J07q5kP3J70Nj45J7lj49oJ38J45j64J8J37j06k24N6J78l8r0
$$ -22 99 145 -37 -114 -7 -92 -94 -21 149 154 9 26 23 -126 -132 6 151 -13 5 142 36 -188 -132 46 8 -82
4273h2J69N3k6k01L4M7j22J5J56J03j25m3K2J7j58lJ63K0k8O6O4j24q9k9K3RO1
$$ -82 87 140 114 -87 -53 -6 -128 -113 43 146 21 -22 0 17 -141 -144 19 39 11 77 141 17 -72 -101 -78 -69 -8
4300hJ17jj21J3j6j0j73J26J94r1m1N8O0j87q4J00J31r6P2J08j15p8p1J06r5M1
$$ -8 109 108 -13 0 -16 -26 -199 -73 121 30 -11 47 107 -80 -164 -64 67 -29 43 151 36 -42 -113 -7 -102 -61
4326f1N1J28p3j55J59q5r7L5J78p3m5J34L2k06j29J48M9o4J8J72M4j79p4M3K6
$$ -61 -10 118 45 -110 49 -36 -133 -98 80 7 -38 96 128 -78 -207 -59 -10 -74 -56 116 160 -19 -93 -50 -24
4351b4j44J04K24n8j10O4l3j14o0J55Q6l8rJ38j29j66N3P7q8q5K33O6j36k6L1
$$ -24 -168 -64 160 102 -8 56 23 -91 -151 4 90 52 43 181 52 -114 -61 16 -72 -157 76 142 6 -20 11
4376A1m1j29O2J70j0q6Q6N1k11j14J52J89j83L1J50Kj75m7R8k7j32J34J39m3k6
$$ 11 -30 -159 -97 73 63 -23 63 114 -97 -211 -59 130 -53 -22 128 130 -45 -92 6 -21 -153 -19 120 77 51
4401E1k4J0j53o5K25j3l8M1J46k11o7M9Q4p0m1K63p4j55j9O7l0j12Q0J87m5j22
$$ 51 27 37 -116 -181 44 31 -7 34 180 -31 -98 -49 35 -35 -76 187 113 -42 -61 6 -24 -136 -56 131 86 -36
4427c6Q1N1j35q1R3J08j05OJ47k0j17p5J18m1q4J23K9l9l8J9J9r3n4J38J14j50
$$ -36 45 96 -39 -120 -27 81 -24 -18 129 109 -8 -83 35 -6 -90 33 62 23 -15 4 23 -70 -124 14 128 -22
4453b2M2O0l9j99J14M8Rm4J19or8p6R8m9l8j1J96j8r2P3j1j15m4R8L5pj2P9o6
$$ -22 20 80 41 -158 -44 4 13 -31 88 82 -16 -92 6 -43 -81 -92 104 86 -6 67 56 -59 -103 -5 30 23 11 90 24
4482B4q4m1J07l7J7L4R4j22o3R6l2j22m3K03M2m5%J16j36j22j5J22o7Q7pJ40j12
$$ 24 -60 -101 6 -31 -14 20 114 -8 -71 25 -7 -129 -172 31 73 28 28 144 8 -114 -129 -7 -74 13 6 146 34
4509C4r4N7K7j31L9J42J9q7r0N2n6p9R8R0M7o0M1O2k37K2J06P3j13K2J33q0r6
$$ 34 -60 -3 24 -107 -68 74 93 6 -84 -32 -88 -167 -69 21 68 8 49 111 -126 -104 2 75 -38 -16 117 37 -59
4536e9M0Q4j92j6J30J38j46j1J08p5j51L8J19J7j04J61O2j95n0M9O9p2PJ59L9
$$ -59 -19 65 -127 -143 -13 125 -21 -32 76 1 -150 -112 7 24 -80 81 143 -52 -102 -53 16 -56 -49 110 149
4561A49k19N1O1r4j00J55P8o8l2L1O4j82n3J59L6q2O8J47j98j7P4Jj03r2K21K3
$$ 149 -70 -19 42 -52 -152 3 81 13 -19 12 76 -106 -159 0 36 -46 22 169 -29 -46 28 29 -74 -166 55 78
4587G8q3L9rj03q7P6J23L1j12J11N9j33j29J36J9j05P4J58o8j40R0K0q4j01J71
$$ 78 -5 34 25 -78 -165 -89 34 65 -47 64 123 -10 -139 -3 16 -89 -15 143 75 -65 25 45 -39 -140 31
4612C1R3n5p7O4j8j66J4J37kn5L0J17j03q3O8K5j52P1J52M9j42j1J06j09j12K7
$$ 31 124 69 -8 56 38 -128 -114 23 21 -34 -4 113 10 -73 -5 20 -132 -61 91 140 -2 -13 93 -16 -128 -101
4638a01J62J6n5K1L8j24n3L8P9j8K2R1m5r9n1O4l2m3J26N7r5PO5k8j04n4J55j4
$$ -101 61 77 22 43 81 -43 -96 -58 21 3 25 116 71 -28 -79 -15 -47 -90 36 93 -2 5 70 42 -62 -116 39 25
4666B5n8J24L2j0j81M0Jl3j8J25M3m6j28R2p0m6M4J43j6r6R1lp9r4P6J18o3lN4
$$ 25 -33 91 123 113 -68 -28 -27 -60 -78 47 90 44 -84 8 -62 -108 -64 79 63 -33 58 55 -24 -118 -42 76 13 10 64
4695F4Rm7m1M4k8n5M6J53r4p7P6J5j39o5J53K6j4lP9q0j80L9J23l1m2R4N5p8p6
$$ 64 73 26 -15 29 1 -54 -8 145 51 -26 50 65 -74 -139 14 40 26 23 102 22 -158 -119 4 -27 -69 25 80 2 -74
4724g4L9P1j50K3J75kj13K2O5j12q7J56N5j2n1J13n9j01p5J73m6j00N0J38nk09
$$ -74 -35 36 -114 -91 84 82 -31 -9 56 -56 -143 13 68 56 5 118 59 -42 -117 56 10 -90 -40 98 93 -116
4750a16J34P3j64o6K32l5q5rR1N4k20L4J01lp1J42K8j67n5J12oj22Q9J14o1n2
$$ -116 18 91 -73 -139 93 58 -27 -36 55 109 -111 -77 24 21 -50 92 120 -47 -102 10 4 -118 -29 85 24 -28
4776b8L0N3j31n9J00J11p6k6J53m3j71L8R6p5o2J41Q2j18j16J33mr2oJ25N6j85
$$ -28 2 55 -76 -135 -35 76 0 -26 127 84 -87 -49 47 -28 -90 51 133 15 -101 32 28 -64 -70 55 111 -74
4802g4M4J03j00j28P0J34o1m9J09Lq7j4L3mn2O5J23o6r7J08K1o6r9O7J58j09p0
$$ -74 -30 73 -27 -155 -85 49 -12 -61 48 51 -36 -50 -17 -21 -73 -8 115 49 -48 60 81 15 -84 -17 141 32 -38
4829c8J26k4j75N2N1k6k9O2P2m9n3K3K9j01JJ02M2p0kL8n2p3m5J57o8n0J84K4
$$ -38 88 64 -111 -59 -8 -34 -63 -1 71 22 -31 -8 21 -80 -79 23 65 -5 -7 31 -21 -94 -139 18 -50 -100 84 108
4857A08j24r8J25l0l8nJ85n5l7l4K7m1o9O0R0r1P5J9o3l9l5J03nl0L4J5k8q7N
$$ 108 -16 -114 11 -19 -57 -62 123 68 31 -3 24 -17 -86 -26 64 -27 48 67 4 -35 -70 33 28 -2 32 47 19 -68 -63
4886f3L5l1J8Q6K4kr3N5k3j37P8J43p3n0J01k7p8j06J28J1j5j3Q4K6r3n0J19k0
$$ -63 -28 -59 -41 45 69 67 -26 29 6 -131 -53 90 17 -33 68 41 -37 -143 -15 -4 -19 -32 52 78 -15 -65 54 34
4914C4r8L3J46m3q7K6P2j25m1J09M2j01P7K9p8k4n4R0J2k0QJ05r2o7P3Kj27j9
$$ 34 -64 -31 115 72 -15 11 83 -42 -83 26 68 -33 44 73 -5 -29 -83 7 19 -1 7 112 20 -47 26 28 -99 -118
4942a18J34M6p4J2J11j43p8J05M7j10K8J13j0j12rQ8nj11P8J16l3q2K4K0j30R
$$ -118 16 62 -12 0 111 -32 -110 -5 42 -68 -40 73 63 -49 -58 30 25 -86 -8 108 75 -7 17 37 -93 -84
4968h4J40m3l7j6J18n4q2L3J04j22o2J55K4j03n9J18j1j11N3J33j03m8O3N8j39
$$ -84 56 13 -24 -40 78 24 -58 -25 79 -43 -105 50 74 -29 -88 30 19 -92 -39 94 -9 -57 6 64 -75
4993g5l6Q1J15j18KJ59q9j27j4J39n1n8R1Q8r4j04J16Pj14J8J06n5j6J0R2j18
$$ -75 -111 -30 85 -33 -31 128 39 -88 -102 37 -14 -72 19 107 13 -91 25 32 -82 -64 42 -13 -29 -19 73 -45
5019d5q8J18N6k7j15J48L5j57K8O9k6j06P4O6M4l8l0M1p1o0O1Q2o7J5P5k0j20
$$ -45 -133 -15 41 14 -101 47 82 -75 -47 22 -4 -110 -36 30 74 36 6 47 -24 -84 -23 59 -8 7 82 62 -58
5046e8K4R4j33L9P2N4q1j04J33q3r6J02O9j5n4N9L3k1r9K3R8q7j9P0L1m8k8kO4
$$ -58 -34 60 -73 -34 38 92 11 -93 40 -43 -139 -37 32 17 -37 22 55 34 -65 -42 56 -31 -50 20 51 3 -25 -27 37
5075C7r0J7N9K4q7L0J7k2p3P0O3m7NL2N8j68n5J58Rq1J19rpj34L6J14k10Q6Q4
$$ 37 -53 -36 23 47 -40 -10 7 -15 -88 -18 45 -2 3 35 93 -75 -130 28 37 -44 75 66 59 -75 -39 75 -135 -49 35
5104C5qk5p1J11m1p3L2Q7J3r3J5J31j65j1P2J1qq3J24J3n3k2K8l7o4Q8M7jm5P7
$$ 35 27 2 -69 42 1 -72 -40 47 60 -33 -18 113 -52 -63 9 20 12 -71 53 66 13 -9 19 -18 -82 6 53 52 7 84
5134H4m2j32L6R1qp0L6P4m7m0qN8n3o2J18K5j24L1J02Rj49N0J13n3o0M7N3j08
$$ 84 42 -90 -54 37 29 -41 -5 69 22 -18 -26 32 -21 -83 35 60 -64 -33 69 78 -71 -21 92 39 -21 26 79 -29
5162b9p1R5jq4K6J36Pj02j5K8J4r4J03N0j18K7J43j30o9K1R5K9j17P6j9j1n4P5
$$ -29 -100 -5 -6 -90 -64 72 79 -23 -38 -10 4 -90 13 63 -55 -28 115 -15 -84 -63 32 61 -56 20 1 -10 -64 11
5190A1M3p2j9O9P5j96O7K4kp9K0J16k1q1J43k6r2p9J07Q1j09K4J01oj60M6L2q5
$$ 11 54 -18 -37 32 107 -89 -22 2 0 -79 -59 57 36 -45 98 72 -20 -99 8 89 -20 4 105 99 -61 -15 17 -68
5218f8K4P2N8l5m1nM5j59L3J52j4j39M3N0q2l9J07M7p8j4Q4O0j57M4K2qk3j8O7
$$ -68 -44 28 86 51 10 5 50 -109 -76 76 62 -77 -34 16 -66 -105 2 49 -29 -43 41 101 -56 -12 10 2 -21 -39 28
5247B8M2p2K1P2j27J4K3J9o8M1M6K9q6k2Q2p7l1Q5Q7j33q9J52J5r1k3R3L6p6o
$$ 28 70 -2 19 91 -36 -22 1 20 -48 -7 39 68 -18 -40 42 -35 -66 19 106 -27 -116 36 51 -40 -63 30 66 -10 -16
5276a6J24j19nm9Q6Om7O9P6j19k0O4k6m5K4L1O5j64J50k0q2o8J33Pj8o4L6L2r3
$$ -16 108 -11 -16 -65 21 27 -20 49 125 6 -14 50 24 -21 3 34 99 -65 85 65 -17 -85 48 55 37 -27 9 41 -52
5305e2M0M2k5j02J38R1j10r7L4P1n1l2O4O5n0o7R2p2n6N6l6R2n6O7L2j15j3O5
$$ -52 -12 30 5 -97 41 132 22 -75 -41 30 -21 -53 11 76 26 -41 51 -21 -77 -21 -57 35 -21 46 78 -37 -50 15
5333A5lr8K0J29k5n7J3J15j54m9O2R5o5j8J78j25q1m5J05J9j31J38M0o0n2J4J0
$$ 15 12 -86 -66 63 38 -19 -6 109 -45 -94 -32 63 -2 -20 158 33 -48 -93 12 31 -100 38 78 18 -34 -20 -10
5360a0o1J0P2Q1j17m8J90r4q0LP1l5m6J69m6rq7L7M5j11N2J33r6n9OJ10j03r1
$$ -10 -71 -61 11 92 -25 -73 117 23 -57 -54 17 -18 -64 105 59 50 -37 0 45 -66 -14 119 23 -36 -30 80 -23 -114
5388a14J26P2j08j1Q0m2l8o3J10Rj39J65Np5j5M8k6n2nJ64n3k7L9Rp6l2O3J8j3
$$ -114 12 84 -24 -35 45 3 -35 -98 12 21 -118 47 52 -23 -38 10 -16 -68 -73 91 38 11 50 59 -17 -49 14 32 19
5417A9l6N9Ll5o2J5L9j48J57Rj2o5R4n1J8o2Q8L4q2P0j9Pp7n6J59l9k0M0j4p9
$$ 19 -17 42 45 10 -52 -37 2 -146 11 20 8 -57 37 -14 4 -58 30 64 -18 52 33 40 -37 -93 66 27 7 47 33 -46
5447d6l1J25p7L5PM3K7o4NJ3Kr0M1L6K4p0Q0kp5n2R6M1j06L7Q4m6j7o1N1k9o0
$$ -46 -77 48 -29 6 13 56 83 19 24 37 39 -51 -10 26 50 -20 60 58 -17 -69 27 68 -38 -1 83 37 20 -41 10 -19 -79
5478g9L2L9J00j11P8l1j05O8K8j6q6P2N6j00q0J15L7o3k7P2J9q2J5N9Np7O3M8
$$ -79 -47 -8 92 -19 59 28 -77 -9 19 3 -83 -11 45 -55 -135 -20 17 -46 -73 -1 18 -64 -49 10 15 -62 1 49
5506D9k1j04O4Q4j47j5J02P8j34M1R8m1j35J07J8p3k2R7K3r0j6J09n5p8K2J13
$$ 49 28 -76 -12 72 -75 -90 12 90 -44 -3 95 54 -81 26 44 -29 -51 46 69 -21 -37 72 17 -61 -39 74
5532G4n9r7Q8Q6n3j19L1R3p8M3P6j1r9l8J20p3j3k5J26m0n9NP6m8l5O7J8r7J7
$$ 74 15 -82 6 92 39 -80 -49 44 -34 9 85 74 -25 -63 57 -16 -29 -54 72 32 -27 -22 54 6 -29 38 56 -41 -24
5561b4O3L3j88J26M0Pj36J05Q2r0o9M8M3p4J0M9Oj44P9J19j08k6K6N4m6m2J16
$$ -24 39 72 -116 10 50 57 -79 26 108 18 -51 -3 40 -34 -24 25 31 -113 -34 85 -23 -49 -23 31 -15 -57 59
5588E9oq6j1K5Oq5Q3N8J7j14J30l7j00M4K7M8j11LJ25m7l7k9Q5n2l7Q5m0l6j0
$$ 59 53 -33 -44 -19 -13 -98 -15 43 60 -54 76 39 -61 -17 10 58 -53 -50 75 28 -9 -38 47 -5 -42 43 3 -33 -43
5617d3M9M8r5j3P7J7n6j3O6q0j1M7K3k6m3Q0M0r0PN3m8o0R1J12j21k5M5Qk0j11
$$ -43 6 54 -41 -54 23 40 -16 -29 37 -43 -54 -7 16 -10 -53 27 67 -23 -16 37 -11 -71 20 132 11 -14 31 39 19 -92
5647i2R0J09r4j0M4po2j4P2Mo4N7Kk8L0m0Qm1kO5k7o1Q3L6q1j09P6Q9kj6O1j3
$$ -92 -2 107 13 3 47 40 -22 -36 36 40 -24 33 35 7 37 -3 5 -36 -38 27 0 -61 22 58 -23 -132 -56 33 31 15 76 63
5679F3o3r2J07M5j04J1P5M0j34P2P8j48kM2M5n2j6Q2j6p4OL9p2L5l1P5m9j7P2
$$ 63 0 -92 15 60 -44 -33 42 82 -52 20 98 -50 -52 -10 35 -17 -33 49 33 -41 -35 4 -68 -33 -64 11 -38 -55 17
5708A7%m9m4J13J2k4l5R7j35l2N8Q8p5p2O2P7p8k0Q7no5mP5qj03L7M6j1q0K1M6
$$ 17 17 -32 -76 37 49 25 -10 87 -48 -80 -22 66 -9 -81 -19 58 -20 -40 47 42 -23 -27 48 40 -63 -26 20 9 -71 -50 -4
5739dMk3O5j8j01K0N2Jl8Q6J9n8q9K3J15j16q5J88L7j15MR3j04J7j5Q8o4n3Q6
$$ -4 0 -23 42 24 -77 -57 -5 -4 -42 44 63 5 -84 -61 54 -62 -147 41 78 -37 -33 60 -44 -27 -42 46 -18 -71 15
5768A5K5j29j0J30j5p1O9O2m9n8L1M9j14k9J26M8m3m0N3l6j32J20M9m2o8J01K9
$$ 15 40 -89 -99 31 16 -55 14 76 27 -31 0 49 -65 -94 32 80 37 -3 50 14 -118 2 51 9 -59 42 71
5795G1r3k6M0M0q8j6R9K5j11J4R0j10j0P0O9o6K0L8rn3p0J35m7o0J03j4J4j32
$$ 71 -22 -48 -8 32 -56 -72 27 52 -59 -45 45 -65 -75 -5 64 -2 18 56 47 -6 -76 59 12 -48 55 41 55 -77
5823g7P5M0l3r5P9N2m4K1J6j2l9m9J32m3k5K5Kk5o7R5l7m8O6N9n0l9lN3J4r8K0
$$ -77 -2 38 5 -90 -11 41 -3 18 34 22 -17 -66 66 23 -2 23 25 0 -67 28 -9 -57 9 68 18 -21 -24 29 43 -55 -35
5854c5J04j8j09R3rml9N1l2k6K2M2n5j4k7P0Ro6M9J4k9k1kL9p2PP0K8j14O5pL8
$$ -35 69 51 -58 35 26 22 -17 34 2 -24 -2 40 -15 -29 -56 14 23 -43 6 20 -9 -30 -32 7 -65 -58 12 40 -74 -9 -16 22
5886B2j04O0Q8j04O3L9Pp7k6O6m0p6P7R4k2j01M9R2j57LM5L2q1L7N2J9j12m5J59
$$ 22 -82 -22 66 -38 25 64 71 -6 -32 34 -6 -82 -5 89 67 -34 15 107 -50 -47 -2 30 -51 -14 38 57 -55 -100 59
5915E9q5K0L4P1j10l5P8Kj31P5MO2j19P0J0j3o5N4M1l0j1lJ07j81O9qN7q3N2J44
$$ 59 -26 -6 28 99 -11 -46 32 34 -97 -22 -18 44 -75 -5 5 -8 -73 -19 22 -8 -19 -22 85 -96 -27 -35 22 -61 -9 135
5945A35r1j09P9M7q5mQ4J5n4OM4o4r2jJ06oo5O6J0m3o5J32k3j08P1P0k4p8K2R1
$$ 135 44 -65 14 61 -24 -28 56 71 17 23 67 3 -89 -90 16 10 -55 11 21 -22 -87 45 22 -86 -15 55 31 -47 -25 66
5975F6p2p8L8J12j14L2Q2qq1j7R5l5p2L5M5jK6p0O6q7j4O1N0r4Q2lm1l3JN8l7
$$ 66 -6 -84 -46 66 -48 -16 66 58 -23 -40 55 20 -52 -17 28 27 53 -17 49 -38 -52 9 59 -35 47 44 3 -30 -29 29 -8
6006hj0N3N3j17lL0J5p2OR7No5J5J8Po9O2L7k9k3K7J0m8o3J27l8l6M9Rk8j3%L0
$$ -8 -18 35 88 -29 -32 -2 13 -59 -53 44 49 -16 -1 17 24 -45 17 54 25 2 29 39 -9 -72 55 17 -19 30 39 11 -2 -2 28
6039B8o4M0j4N8q6O6K3m3k6%N8j5o6L0N4l2k7j0M7n8l5O4O5r6M5pL2p0N9K8l7
$$ 28 -36 4 -10 48 -38 28 51 8 -18 -18 40 25 -41 -11 43 11 -16 -26 21 -37 -72 -8 57 -39 6 -1 31 -39 20 48 11
6070A1l7K9Lk6LO6m6J4l6R7j9q7k9J38l1p7rJ23o8k8QM1j06J8O1k8j1O9K5m7m9
$$ 11 -26 3 6 -20 -17 49 3 17 -19 78 59 -28 -57 81 50 -27 -36 87 19 -9 -1 40 -66 -48 13 -15 -26 43 68 21 -28
6101b8J4N8r2J0N9L7o8J1L0Jp6L7M2m8j1N1ko0n0O4O2p5kO9J2n8J6j2q2k9J17
$$ -28 -14 44 -48 -38 21 58 -10 1 31 32 -44 -7 35 -13 -24 27 25 -35 -85 -21 41 -34 -36 33 45 -13 3 -9 -91 -120 -3
6132cM6l9qN1l3j12O0J10o6k7J5N1n7p3R0K4p7K5N8K3j16J2J00qj36J16lk1j21
$$ -3 43 4 -4 47 14 -98 -38 72 6 -21 -6 45 -12 -85 5 29 -48 -23 35 58 -58 -46 54 46 -90 26 23 2 -119
6161a19Q9J07j21k0J01j1l4rR1o6o4P0Qo0n5K31j22k9KO0n1n6nJ02j5l8K3K2l8
$$ -119 -30 77 -44 -64 37 26 -8 -17 74 8 -56 14 22 -38 -93 138 16 -13 -11 49 -2 -58 -63 39 24 -14 9 31 -7
6190gk0N5L8m0n4Q5Kn7j3PJ2l1j9R1k5q7O8N2n5m0J9K8R%jqo7l5J00l0QN7L7j09
$$ -7 -27 28 66 26 -28 57 59 2 -11 -4 8 -23 -42 49 24 -63 5 57 2 -38 -19 9 18 18 17 9 -58 -93 7 -23 -15 42 79 -30
6224c0k4M4P9q0J4QL0r8L0J04j5o5n1J20l9q5K9J08q0l0K5K7m5nO8ml9l4M3ln3
$$ -30 -54 -10 69 -11 3 11 41 -57 -27 77 62 -3 -54 66 27 -58 -29 79 -1 -31 -6 21 -24 -29 39 35 -4 -38 5 2 -51
6255e1N8P0r6mO3Rj01M3J03j04MJ1M7n5o6R6M0j21L9K7Mj2j8O9j2j26P8L7o3l0
$$ -51 7 77 -19 -23 40 49 -52 -9 94 -10 -6 5 52 -3 -69 27 67 -54 -15 12 16 4 -14 55 43 -83 -5 32 -31 -61
6285f1Q7jm9%M6j1p5J23n8L6p9J0O7k6Lk2M3j3n9N0pl3j9J38p9k1rN1j1m9j4O3
$$ -61 26 25 -24 -24 22 11 -64 59 1 37 -42 -32 35 9 12 -10 33 20 -39 11 4 -29 -48 90 11 -10 -19 32 21 -28 -42 21
6317B1k0m1N0L3j06O3q2J33j62J07K6j5m8P4N0q7NK7M1j15J3O2Qr0J08k6k4j9
$$ 21 1 -40 10 43 -63 0 -82 51 -111 -4 22 7 -41 33 83 -4 1 28 69 -46 -33 29 37 -53 55 29 5 -14
6345a4ON0p5n8J93m2j09j1R3p4J9O4L3o8l9P8J8o9K5K0k4r4O0O5j03k3J25J2n8
$$ -14 -8 42 -33 -91 102 60 -49 -60 33 -41 -22 42 75 7 -32 46 64 -5 20 40 16 -78 -18 47 -56 -79 46 58 0
6374@m9P9Ln0j5O5J1r8Q8QLo3J8J8j0l5N9m7Nk2P2K5j31O0P4q5n5Q6P0j07j4M7
$$ 0 -49 30 33 -17 -32 33 44 -54 34 42 45 -18 0 18 8 -27 32 -15 -10 -32 40 65 -66 -6 68 -17 -72 14 84 -23 -37 10
6406A0K1o6k6J21j2q6K6Q0n9p9J31ro4j9Q8ro9oQ1mp8M4J9j5m9Q2o3j5qJ2J0o0
$$ 10 31 -35 -61 60 48 -38 -12 68 9 -70 61 52 -12 -31 57 48 -21 -27 54 50 -28 16 35 20 -29 53 -10 -25 -33 -21 -11 -71
6438g1M5N6j1j03N2M9l4K4K0j0m9NK5L7l4lJ2K2n7K3K0J4m0l7R8l1k4l1M3m2K4
$$ -71 -26 30 19 -84 -32 17 -17 7 27 17 -32 -27 -2 35 1 -2 10 32 -25 -2 18 32 -8 -45 53 22 -2 -33 10 -32 -8
6469hJ2N1n2k8Q3j1r1M7J9k7k5P1L3o9rKjK9n6M0oo9Q1M9j18l7R0J0Pl5k4J24
$$ -8 4 55 3 -25 58 47 -44 3 22 -5 -30 41 74 5 -4 -2 -3 26 -30 10 4 -65 16 65 -53 -90 0 10 17 -18 -42 82
6501H2j04L1M4m8L5nJ3om0k5Kk5k3N7M3n2KQ3n7o9O2Pk8m1L2J05m2o9K2K3J7o0
$$ 82 -22 9 53 5 40 35 48 42 2 -23 -21 -46 -69 -12 31 -21 -19 64 7 -62 0 7 -21 -62 -30 75 33 -36 -14 9 26 -34
6533c4Q7m6rp5N3K1m7N8Q0o8p8J39m3m7K6ppj41J20J27j12o1P8kj0m2N0P0n0o6
$$ -34 53 7 -2 -77 -24 -3 -50 8 88 20 -58 81 38 -9 17 10 3 -138 -18 109 -3 -64 14 12 2 -40 10 80 30 -36
6563c6K9Rm4MN8%q6N1R4r1l4O0N1j14QJ01o3l7K5Q3j09Rk3P6l7K0oK9n3l4M8N9
$$ -36 -7 2 -42 -38 20 20 -66 -15 79 -12 -46 14 65 -49 -41 60 -3 -40 -15 68 -41 -32 -55 21 -16 4 -2 27 -26 -60 -12 47
6595D7j09J04Np7K2k3K5l1L2K7K9j04O0L9o3J2l5P9m5rJ3M5p6m7J10l4m5O7kL7
$$ 47 -62 42 47 -30 -8 -31 -6 -37 -5 22 51 -53 7 46 -17 -5 -40 39 -6 -15 -2 43 -33 -80 30 -4 -49 18 16 53
6625E3q5O1j1qp9L6P7L3o2Q6o9j7l4J6M1q6P9J4p5j4N0M3l7l%lj4j8L4Rp7qR7
$$ 53 -32 29 18 10 -69 -33 44 77 15 101 32 15 -19 -3 38 -48 31 45 -30 -44 6 49 12 9 9 6 -8 -26 8 17 -60 -68 29
6658B9K3r2K7J7O4p6k4P3k6l4M3l4O1q2P5o4K9m8R4mj18M2J04j16J2N1N7j26K7
$$ 29 52 -40 -13 4 68 -8 -32 41 15 -19 24 -10 51 -31 44 -20 9 -39 55 51 -67 -25 79 -37 -25 26 83 -43 -16
6687a6M7Mrn7Q1o3RJ6N7o4J3m8N8p0L4l4M8k0K3M5m9n9M8O0n9k2P5Qj33L5R2n1
$$ -16 31 35 26 -31 50 -13 -4 12 69 5 18 -30 28 -42 -8 -42 6 -14 9 54 5 -54 -6 54 -5 -27 48 56 -77 -42 50 -1
6719alK4M0No9J8M3o5J6j7M9j06J0O9N4r9p0J08mjL0J6n1K6J9r0oK3Q6m9no9J43
$$ -1 -4 20 60 65 -4 14 57 -8 8 -9 40 -66 -56 13 67 -32 -102 6 2 1 31 47 -4 22 41 -49 -55 -32 54 5 0 -69 74
6752G4r4J6j6L1k0nL0j9J3k8L3L9r8Q8ORq4P5M9r4o1Q8K1q5MO0j4l8J5M1k8j4
$$ 74 -20 -4 -20 11 -9 -14 16 -3 10 -18 15 54 -44 44 50 59 -25 50 99 5 -56 32 53 -32 -28 32 18 -20 -5 36 8 -6
6784fQ2o2p0L4Q8m4n5NM0k8L7j3Jqp0M7N1n0j5P7qn0L3M0n2m8Q7lom2O6jj52O8
$$ -6 76 14 -56 -22 66 22 -33 -28 12 -16 21 8 9 1 -69 -22 29 -21 -36 41 33 -17 16 56 4 -44 43 40 34 -8 58 57 -95 -27
6818b7N8L3j12k1L8K3k2Q2o3rk1M0j0K5k8L5L9q7L1j2N3n4MM1m6kj5P3m1K8J0
$$ -27 31 64 -48 -69 -31 -8 -30 52 -11 -20 -41 -1 -11 14 -14 21 60 -27 4 -8 45 -9 -5 36 -10 -12 -27 46 5 33 43
6849D3k4n1k1O7J5o3P7J8o5lJ6Qo4PO6j2j0j0j0N1p4L4J0m3L8j6Q6m8m8L0J8l0
$$ 43 19 -32 -53 14 29 -34 43 61 -4 -7 9 17 -47 -40 26 14 4 -6 -16 35 -39 -5 5 -38 0 -16 70 22 -26 4 22 -8
6881hm6Q9%j7K8Rk8m5M1L5r8Q3Nl3j4j8K4n8P6j8L8l9%m1L8n2J7J18l8r6j2J09
$$ -8 -54 35 35 18 46 55 27 -18 23 58 -40 43 48 15 1 -17 7 -51 25 7 45 6 6 -35 3 -49 -32 86 48 -48 -60 49
6913D9m8m7J6O9o5M5j5M3n8m5Q0J3m0n1K0P5q4l8J34j7m1j0O5Kq5P2Pn5K6nk1
$$ 49 1 -46 -30 39 -26 19 4 47 -11 -56 24 37 -3 -54 -34 41 -43 -81 53 36 -5 -15 50 52 -33 39 46 -9 17 12 -9
6944ij6L5N8j16K6J6P0j06M7j9P7p2pN7k9m6K9J3l6lK1P5m9n5N9Jn9nR9l9j7K5
$$ -9 -25 10 68 -48 -22 -6 64 -42 5 -14 63 -9 -16 41 12 -34 -5 8 -28 -31 -10 65 16 -39 20 21 -38 -43 56 17 0 25
6976B5Jm1j7N0J2j4jL3M4j28K6K6j9k2L3L6l0n6N3J0n7K6N1J6j11M5K7Jm8K4J3
$$ 25 26 -15 -32 18 30 16 15 48 92 -36 -10 16 -3 -25 8 44 14 -42 11 21 -36 -10 41 57 -54 -9 18 19 -29 -5 8
7007Hpl6O5Lmm7L6j8n0M9N1l8q5N8LL8q8M3N2l4KRL9p3J8M2k8m5P2l8K9k6m4N6
$$ 8 1 -35 30 33 29 -18 18 0 -50 -1 50 12 -73 -15 -12 26 -62 -19 33 -1 1 10 49 -24 -6 36 8 -37 35 -3 26 0 -44 12
7041A2J4%n7J4N0l3p1R1m1j7O7l1J7k5Q5n8k8M3l9Mj6RJ2NK6K0l1m4L7K3p7MO2
$$ 12 26 26 -31 -17 33 0 -71 20 -21 -38 29 -2 15 -10 75 17 -11 32 -7 -3 -19 -10 2 7 33 53 22 -22 15 38 -39 -35 27
7074B7RL7p2M9l3j6O0m1K3o9J4Q9p5Om0J21n7q1P4M5k7p4j0L3J8qj4N3l1j9nK4
$$ 27 36 73 1 50 17 1 61 20 43 -26 -12 77 2 8 -32 89 32 -49 25 70 43 -31 -41 -8 10 2 -12 41 10 -9 -14 10
7106A0PL4qk5o6J07o4o5L7N0k3j9O2J6l4o5L8M6j34L6R9m6l1K1K1k2MJ7J6l0R
$$ 10 17 51 43 18 -48 59 -5 -70 -33 17 -6 -25 37 53 19 -46 -8 38 -96 -60 39 -7 -38 -17 4 -18 -14 3 19 -11 -2
7137bK7m5m0LO8On3KN7j6l2K1N3j9o8%J03Nj06M7j0m4L5Q2n5l1K6Km8o0J02K6
$$ -2 25 -20 -60 -57 11 17 -36 -34 23 7 -25 -4 49 30 -38 -38 65 70 -36 11 1 -43 -8 74 19 -12 14 16 -32 -92 10 36
7169C6l6J3K4m2mj9L1J0j5N3K5n0m6J9O3r1L9J7K8o7k8J1M7jPM2p4j4Q5n7n0J3
$$ 36 0 13 37 -5 -9 -28 3 13 -2 51 76 26 -20 -1 62 -29 10 27 55 -12 -40 -29 18 17 24 66 -8 -22 63 6 -44 -31
7201c1O2n7m7N9L5jj9M5l2k4m2P9l2jJM7ml5k6M4M1j26R1Po3N6k7K1L0m0L7o7
$$ -31 31 -26 -73 -14 21 20 1 46 14 -10 -52 27 -5 -6 -5 42 38 3 -23 21 62 -64 27 34 -29 27 0 21 51 11 48 -19
7233a9k2P4J1k8j6K3J7L0m6l3L3No9O1M0r2N1k1J7k6N3k1p9J7M8Rn1J1Q4n7n9
$$ -19 -41 33 44 16 0 23 40 70 24 -9 24 29 -40 21 61 -31 20 -1 16 -10 43 22 -57 -40 8 17 -34 -23 61 4 -55
7264e5O0k0JM9n4P9n8m4O5j0j4K5K7rl5j8lO7Pp4L2J0q8Q6kn7N0%n8J0L0K2m4
$$ -55 5 -15 -14 35 -19 60 2 -42 23 13 -1 24 51 42 7 -11 -14 53 60 -14 18 28 -60 26 24 -33 17 17 -41 -31 -1 21 -23
7297b3KL8L6o6nN5Jm4k1N6M3j30M5K8J0j3jK2m0j2N9l7jl0JP5o2r5J18ql5K3P0
$$ -23 -21 17 53 -13 -18 37 38 -6 -27 29 72 -58 -13 15 25 12 11 33 -7 -19 40 3 2 -28 -27 48 -14 -109 9 1 -34 -11 59
7330E9o9ML1J6m7q5P6N9q0M8N0r9jK0O9j30N0NQ2m0l7N8p0k3M6K3j1n9J11Kp1
$$ 59 -10 -6 25 41 -6 -91 -15 44 -36 12 62 -37 -38 -18 51 -79 -29 -24 58 18 -19 39 -31 -54 -8 15 4 -55 56 58 -13
7361a3L1KJ9p8PP1j9j2NO7l3o0k5N2lk2J9M9m2r7M2L5j2K7jrl3Rj4L8J5l9N7m9
$$ -13 18 20 39 -39 -32 39 20 8 13 80 47 -13 -38 14 11 -11 8 57 15 -82 -40 -5 -17 10 9 0 -33 -24 -38 0 15 -24 33 -16
7395a6l1Q9m0j1M3K9o2j1M0M3j00j9M9l2l6O4K3Jj8n0N8J2r5J15Lo2l1LM6m5O4
$$ -16 -47 42 2 -9 34 63 1 -10 30 73 -27 -46 3 -29 -65 -1 22 23 5 -45 13 25 -70 45 48 -14 -45 -42 4 -41 23
7426B3n5O6q4lJ21p8n0O1J3l4pj9O4K7q5O6m3m0N4M1j8k5O9j3n3l0K7K6m8K8M0
$$ 23 -32 34 -50 -53 68 -10 -60 1 14 -20 -27 -46 18 45 -40 26 -17 -57 -3 38 20 -5 64 51 -2 -32 -5 21 -27 1 41
7457D1q7L7j0O4q0PLJ04l2o0k6O8j06M1M2k5K4r7J00K6n3k2Q5o2J7J6m8P5j32
$$ 41 -46 -9 -19 45 -35 -28 -25 79 47 -13 -39 29 -77 -36 6 -19 5 -92 8 34 -19 -41 44 -18 -1 15 -33 42 -90
7486i0J02L7m2n3J14m3l3j8P7K7r5j2P8o6j0O0K9o8n3M0N8k3n0L2L2o6M9N6m7
$$ -90 12 49 7 -46 68 25 -8 -26 51 78 -17 -29 49 -17 -27 33 62 -6 -59 -19 39 16 -34 -2 30 -36 13 69 22
7515B2r5J28M6r1k4O2rr7J8k1O7k1J9Oj7m7O2L1p2M0k7J9Qk1L4ok3O9m5J7q7R4
$$ 22 -73 55 101 10 -14 48 39 -58 -40 -61 6 -15 4 10 -7 -54 8 39 -33 7 -20 -1 7 -14 20 14 -9 60 15 32 -55 39
7547C9k8m2joL5l1L8m1L3k5L7rOn5M8L4q0M7J4j4j5rR4o7n2M0OJ2K0l3L4p5L3
$$ 39 11 -31 -32 -38 -3 -34 4 -37 -4 -29 8 -1 5 -50 -2 32 -48 -1 13 -1 -16 -25 69 2 -50 -10 -4 8 28 -5 29 -46 -13
7580a3%J8j1M4j0j1k9j6J2L9N3p6J9pn6L3qJN0p2K8M3l6K2k2q1J02J1k8l7Q4R
$$ -13 -13 5 -6 38 28 17 -12 -28 -16 23 76 0 19 12 -44 -11 -19 -18 32 -40 -12 31 -5 17 -5 -86 16 27 -1 -38 46 55
7612E5r4O5l0j8J3j1N7L6n1NJ1q3Q6jJ6n7nP9o1j8L1K3p1k4O1l0L2k1M9j4m2j9
$$ 55 -39 26 -4 -22 -9 -20 37 73 22 27 38 -45 41 40 56 -1 -6 73 12 -6 25 48 -23 -47 14 -16 16 -5 44 30 -12 -31
7644c1L6k7k5N7k8j8k5Q2k5k0oL8K6n5J1N6Pr0L2Q2r0n3Q5j5kK2J9J5j08L0K8
$$ -31 5 -22 -47 10 -18 -36 -61 21 -4 -24 -30 8 34 -21 -10 46 53 -37 -5 77 -13 -66 19 4 2 24 43 58 -50 -20 8
7675Hj2qJ7M1Jm6l6L3L1nKl1l9nL1J7l9L1LK0mLn7O0m1L8J3p2m7J04N5r6O2J0
$$ 8 -4 -12 5 46 47 1 -35 -2 29 24 26 -5 -44 -49 -18 -1 -40 -9 -6 14 10 13 -44 16 -25 13 26 -46 -93 11 66 -30 32 42
7709D2l8l4N9j9k4n5J11l3k0l5P0Mo4L6O0k8r1L4N2l3k1N2j3j7J6j6n0N2M9m7
$$ 42 4 -30 29 10 -14 -69 42 9 -11 -46 24 28 -36 0 60 32 -59 -25 27 -6 -27 25 12 -5 11 -5 -55 -3 46 -1
7739aM8k5n9O1n3O1n1Rl4P0oK4o3O1l7L8q6M7K0l2L6L2j0q0NO6l1p0M9L4j3j6
$$ -1 47 22 -37 24 -29 32 -19 -10 -44 26 20 44 -19 42 5 43 -43 4 24 -8 28 60 50 -30 -25 41 10 -60 -11 23 10 -6
7771fj7K4l4L0J8K1p1K4M1K2o2RPJ6n4j1R6q7L9jJ1n0LJ01o6m3M7Lj3j1L7J0l5
$$ -6 -23 1 -33 -3 15 36 -35 -11 30 52 -10 -1 6 22 -32 -43 53 -34 5 4 15 -35 -32 69 3 -40 7 10 -3 -14 23 33 -2
7804bn4P6j7k6J01n3n5J7M0Jm9l1qJ04p7lP1ko1K1L4n7J3J2l0N2Rm0L7o1M1mn4
$$ -2 -56 20 3 -23 78 25 -30 -13 27 28 -21 -52 -60 44 -33 -36 35 33 -28 -7 27 -30 -17 -5 -35 17 26 -14 23 -38 3 -1 -55
7837e5O1L9K0p2l2M2K0l1l2O9Om2m9J07o0O7p6K0J7n2K5oL4l5j2N8l0k3M7n2k7
$$ -55 6 45 65 -7 -39 3 23 -8 -40 29 35 -7 -56 51 -9 58 -18 2 19 -33 -8 -14 20 -15 -27 31 1 -22 25 -27 -54
7868e4L2PK1o5O0O3q8J1N7J8j14L7J4P1r7J3Q4o4n7L2M0n1L5Pj3Lm5M0J0k5K2
$$ -54 -22 -15 6 -59 1 64 -24 -13 44 62 -52 -15 -1 70 -27 -14 70 6 -51 -19 21 -30 5 12 -1 2 -43 -3 7 -18 4
7899DRmn0L2M4q8jK4O9j9j5N1j3q6K0L7m0KL1O5r2m8K2J18q4K4JM0n5nO7m8oJ0
$$ 4 13 9 -41 -9 35 -53 -54 -30 39 20 5 56 43 -43 -23 14 -26 -24 7 72 -20 -68 -46 72 -12 12 13 53 -2 -7 60 12 6 16
7933A6j4j8l7O5K5Kk7Rk0k5K3k9Jj5J06l8j4l9M3K2l6mk8N4pJ0rM5j12N0J7K6
$$ 16 2 -16 -53 12 37 39 12 21 1 -24 -1 -30 -29 -44 62 24 10 -29 14 36 0 -4 -32 22 15 25 16 61 -51 -1 16 42
7965D2Mn0K7k7m3O0K4r3O3O1l0n2rK3kj4K4J6m5Q0o3%J2m3J7J3K1k2m1J14p7N3
$$ 42 46 -4 23 -4 -47 13 37 -56 7 68 38 -14 -23 0 -2 -16 8 24 -21 59 -4 -4 8 -35 -18 -5 16 -6 -47 67 -10 43
7997D3j1Jo8nO3j1o9P4Pp4%Q5q0J0jK7j0l3Q4Nl4J7j9J8l3l0N1j4k5n4R7nk5J3
$$ 43 32 33 -35 -40 23 12 -57 17 24 -50 -50 35 -45 -35 -36 -9 -19 -52 32 37 3 20 1 19 -14 -44 7 -7 -32 -86 11 6 -19 -6
8031fM0p4J2l2Q1o7RLL9PJ7Jq3pO8LL0N5m8K0q4J5K9n0jN0k4k1qL1Oql6M8nj5
$$ -6 34 -40 -28 -60 21 -46 -37 -34 5 12 29 30 -53 -60 8 11 41 96 48 68 -16 -1 28 -22 -23 27 3 -18 -26 5 11 3 -33 15 10 -5
8067ej2J26j03o9N5J7Jj8J9J6n1l0M7no6M9K1Qo3N2K8k0k5N7pn8K1O0L7j09jL8
$$ -5 -17 109 6 -63 -8 9 10 -8 11 27 -24 -54 -7 -12 -78 -29 -8 0 -63 -11 17 -3 -28 29 22 -36 -15 45 82 -27 -28 10
8099A0j1l1M5j6M5j06K3Q6n2p7O1N1j09M9mP8l9K3LJm3M0J4j08N3K7Nkn7L0J7
$$ 10 -1 -32 13 -3 42 -64 -41 45 -7 -84 -23 28 -81 -32 -36 42 3 26 29 30 -13 27 41 -67 -14 13 18 16 -41 -11 6
8130Fo0J0M4m5j0O3L9k8l0L5l9j6L1j7L3j1M2n4mM8n4R1j17K8lO9r0J4N1J3r5
$$ 6 -54 -44 0 -45 -55 8 47 19 -11 24 -15 -31 0 -17 16 5 47 -7 -11 37 -17 74 -43 -15 -18 51 -39 -25 26 39 -56
8161e6M3OrN7m9K4j5nL0%m5M7m4K6KOKn3J6j2kM3J9K4j8p6M4M4m6k6
$$ -56 -13 -7 -16 41 -8 16 1 -4 26 26 -19 28 -16 10 12 18 20 -33 -17 -29 -31 12 31 55 37 -39 5 49 3 -23
8191b3
$$ Imaginary data points
##PAGE= N=2
##DATA TABLE= (X++(I..I)), XYDATA
0@%%%%%%%%%%%%%%%%%%%%%Oj0J2j6J6j6J6j6K1k6K9l2L6m1M3n0N7o2O9p7Q3r1
$$ 0 0 0 0 0 0 0 0 0 0 0 0 0 0 0 0 0 0 0 0 0 0 6 -4 8 -8 8 -8 8 -8 13 -13 16 -16 20 -21 22 -28 29 -33 36 -41 42 -49
43d9J03j13J23j35J50j63J79j99K18k41K67k96L31l71M19m76N44o30P40q90J100
$$ -49 54 -59 64 -71 79 -84 95 -104 114 -127 140 -156 175 -196 223 -253 291 -339 401 -489 611
64F11j408J900k773M617r962N2917K39119k2516j04182n5726j78940k06896p21
$$ 611 -797 1103 -1670 2947 -7015 45902 285021 262505 158323 102597 -76343 -283239 -283960
77b83960J62926J67487J20129P3305j3362j51210k09667j07156J1257Q3473J72031
$$ -283960 -121034 46453 166582 239887 226525 75315 -134352 -241508 -230251 -146778 25253
88B5253J76803M3454o8040j16349j60808j35520j0145J22493J76002J24165M0791
$$ 25253 202056 245510 177470 61121 -99687 -235207 -245352 -122859 53143 177308 218099
99B18099k0666j26879k08896j08324N0765R6348J19798J52121P6199o8339j55935
$$ 218099 197433 70554 -138342 -246666 -195901 -99553 20245 172366 248565 180226 24291
110B4291j55711q2997J2655R2671J57396J45876L0909p8375j27944j43664q9795
$$ 24291 -131420 -214417 -201762 -109091 48305 194181 225090 146715 18771 -124893 -214688
121b14688K6376J09326J34864J18450M1978p0739j46360j33220n1941K1116P7315
$$ -214688 -188312 -78986 55878 174328 216306 145567 -793 -134013 -185954 -164838 -87523
132h7523J42402J32173J1390q5542j04629j13353q8335R884J11469J46676J00666
$$ -87523 54879 187052 198442 112900 8271 -105082 -193417 -183533 -72064 74612 175278
143A75278O752o5672j07928j33791q0741M5026J18937J11883Q6394L0279p0186
$$ 175278 182030 116358 8430 -125361 -206102 -161076 -42139 69744 156138 186417 116231
154A16231j36885j14205m1443K9382R3214J33114R4670o350p9148j04011j08651
$$ 116231 -20654 -134859 -176302 -146920 -53706 79408 174078 167728 88580 -15431 -124082
165a24082n8839M3769J12665J10295O8225N389o4407j15175j12218l6227N4715
$$ -124082 -182921 -139152 -26487 83808 152033 157422 93015 -22160 -134378 -170605 -115890
176a15890R0149R3872Q4559J3380q7870j18565q0545l2607K6444R6156J21024
$$ -115890 -25741 68131 152690 166070 78200 -40365 -120910 -153517 -127073 -30917 90107
187I0107O9735j5889p6239r9378r2884l9157M9934J06666R8078N4894m489p3616
$$ 90107 159842 143953 67714 -31664 -124548 -163705 -113771 -7105 90973 145867 141378 67762
199F7762j13377q6670j4022N0060Q5773R8852O5372k1018q8982r0379o6967l2894
$$ 67762 -45615 -132285 -146307 -96247 -10474 88378 153750 132732 43750 -46629 -113596 -146490
211a46490M1836J09490R6038L2913j6988o0976j01790q7780q743O4641Q4490P6624
$$ -146490 -104654 4836 100874 133787 116799 55823 -45967 -133747 -142490 -77849 6641 83265
223H3265N3574r847q6835j03959n6856m536L9234Q7542J00936M1108m0516p5038
$$ 83265 136839 126992 40157 -63802 -120658 -125194 -85960 1582 102518 143626 103110 28072
235B8072p7084p0900k0131O6650J01756O6887K7257j2325p5617j05722n6893J4248
$$ 28072 -49012 -119912 -140043 -73393 28363 95250 122507 110182 34565 -71157 -128050 -113802
247a13802N2519P4507Q2525M0737l8597q6126p5962m5864r880N0480R9733P7596
$$ -113802 -61283 13224 95749 136486 97889 11763 -64199 -110063 -119943 -69463 30270 107866
259A07866J0712l4414o0659q5637o5572J1865P2885P4643N7623L4333k6711r0582
$$ 107866 118578 84164 23505 -62132 -127704 -115839 -42954 31689 89312 123645 96934 6352
271F352q6130l1281J1165M5275Q4088P9161J3085n0268o8834o6343n0660K647
$$ 6352 -79778 -111059 -99894 -54619 29469 108630 121715 71447 2613 -63730 -114390 -111743
283a11743P0638Q8376N0326Q281k6991p2666q8340l7067K9813N7013O5294O5394
$$ -111743 -41105 47271 97597 105878 78887 6221 -82119 -119186 -89373 -32360 32934 98328
295I8328K1173n1521q2357n9695k8826N888N9036Q8880N4612n514m1017o1381
$$ 98328 119501 67980 -14377 -74072 -102898 -97010 -37974 50906 105518 100004 58987 -2394
307b394p2605m1211K6935P1054O6508M3591J2460l9188q2177o8934j6141K4994
$$ -2394 -74999 -116210 -89275 -18221 48287 91878 104338 65150 -17027 -85961 -102102 -77108
319g7108N0876P2598N8377k899n6022o5147n3767l0974J9327P0522P3813L5122
$$ -77108 -26232 46366 104743 101844 45822 -19325 -73092 -104066 -84739 -14217 59596 94718
331I4718m814l8652o8848o7420j9137L5852N9588N9800M4306J122n3623p3965
$$ 94718 89904 51252 -17596 -85016 -104153 -68301 -8713 51087 95393 96515 42892 -31073
343c1073m9306j2172K2097N8647P3217L8411j7002m8762n8100n4894k1827L4932
$$ -31073 -80379 -92551 -70454 -11807 61410 99821 82819 34057 -24043 -78937 -100764 -65832
355f5832O8758N7979K7232n532m4048p1243n4810l749L7255N3237N7523L8647
$$ -65832 2926 60905 88137 82605 38557 -32686 -87496 -91245 -53990 -753 56770 95417
367I5417j2512n8633o2614l9055j0020K8185O3987O2696K2621j9635m5231n8825
$$ 95417 82905 24272 -38342 -77397 -87417 -59232 4755 67451 90072 70437 25206 -33619
379c3619m9611o530M2206N9621M7995K5661j0439n3367o6828l6713M043L1006
$$ -33619 -83230 -89760 -47554 12067 60062 85723 75284 21917 -44911 -81624 -77581 -46575
391d6575N2670N9960K6693k7763n4576m9359l6276r429L7677O7495M9483R906
$$ -46575 6095 66055 92748 64985 10409 -38950 -75226 -84655 -46978 20517 70000 79906
403G9906j9377m3066o0445m2752P931M5684N1048M2944K2672k0933n8971n4978
$$ 79906 60529 17463 -42982 -85734 -77803 -32119 18929 61873 84545 63612 4641 -50337
415e0337k4010L364L2285N9935N1520O111l0313m1533m8410l9808N094N1023N4024
$$ -50337 -74347 -70983 -38698 21237 72757 78868 48555 7022 -41388 -81196 -76102 -25079 28945
428B8945L1471J3207j4357n3963o2246k2423J9400L3980M4069M9734J6934l7276
$$ 28945 60416 73623 59266 5303 -56943 -79366 -59966 -25986 18083 67817 84751 47475
440D7475n6445l9508k1817R03M1392O3084L7233l668k6104m2610n3106k7684K1767
$$ 47475 -8970 -48478 -70295 -69392 -28000 35084 72317 68649 42545 -65 -53171 -80855 -59088
453e9088M6303M1669L4316J2728l2217n8737m0864r973J0103L3358N5271M1106
$$ -59088 -12785 28884 63200 75928 43711 -15026 -55890 -65863 -55760 -22402 32869 73975
465G3975o402l8049l8245l6397k8855J0989N3296N0961K0759r0k1480m9497n0848
$$ 73975 67573 29524 -8721 -45118 -73973 -62984 -9688 41273 62032 61942 40462 -9035 -59883
478e9883j3785K5133L9859M1889L4166J988l8079n0906l5856j3199J6392M6567
$$ -59883 -73668 -48535 -8676 33213 67379 69367 31288 -19618 -55474 -68673 -52281 -5714
490e714M9871K2537q595k9964m5009m2546j0870K8833M2877L5007K5210K313l7803
$$ -5714 44157 66694 58099 28135 -16874 -59420 -70290 -41457 1420 36427 61637 63950 26147
503B6147n4476k8978K36J4794L4771M9658K7641j5336l7659l6452l1311j5783
$$ 26147 -28329 -57307 -57071 -42277 -7506 42152 69793 54457 16798 -19654 -50965 -66748
515f6748K0672N0462M2503J3582q160k8047m7316l9421j545K9938L8201L7288
$$ -66748 -46076 4386 46889 60471 52311 24264 -23052 -62473 -64018 -34080 4121 41409
527D1409K5078r562m4016m5630k2982k077K0001M5092M4872J0931k0962l1095
$$ 41409 66487 56925 12909 -32721 -55703 -57780 -37779 7313 52185 63116 42154 11059
539A1059l5358l2881n188L2864M5289K9074R461p623l1782m6921k8395Q210K8127
$$ 11059 -24299 -57180 -62368 -29504 15785 44859 54320 46697 14915 -32006 -60401 -52191 -24064
552b4064L1549L3806K1203j4610m2262l8503k0315j414K3849M4327L6988Q379
$$ -24064 7485 41291 62494 47884 5622 -32881 -53196 -54610 -30761 13566 50554 58933
564E8933j7862l4232m0206k6168N745L2193L8697L0463J1421j7840m1387l9235
$$ 58933 41071 6839 -33367 -59535 -53790 -21597 17100 47563 58984 41144 -243 -39478
576c9478j5370Q572K5379L7639L4543O076k6002l5037k8448j9902J514L2413M2150
$$ -39478 -54848 -46276 -20897 16742 51285 57361 31359 -3678 -32126 -52028 -50514 -18101 24049
589B4049K3549J389j5380l2629l7771j8304J0924K9167L3913K7963P913k1410
$$ 24049 47598 48987 33607 978 -36793 -55097 -44173 -15006 18907 46870 54783 33373
601C3373l9001l2511j3585O242K8547M2559K7885m430k3331k8849l3990k1983
$$ 33373 -5628 -38139 -51724 -45482 -16935 25624 53509 49079 25748 -3101 -37091 -59074
613e9074J4965M0443L1909J5295N131j7207m2514l5720k734J8076K2656L0060
$$ -59074 -44109 -3666 28243 43538 48669 31462 -11052 -46772 -49506 -31430 -8774 21286
625B1286K8925P66l1251l4750k0452j0366N333L2041M0351J6436q672j7804k8075
$$ 21286 50211 50977 19726 -15024 -35476 -45842 -40509 -8468 31883 48319 39647 21843 -6232
638f232l4706j2719K1095L1079K5513K1883L917k8672m0245k2452l156J0350K8980
$$ -6232 -40938 -53657 -32562 -1483 24030 45913 49830 21158 -19087 -41539 -44695 -34345 -5365
651e365L8231J8952j2044k6353k6928k5732j2094J9037L8347K7666Q547l555k0444
$$ -5365 32866 51818 39774 13421 -13507 -39239 -51333 -32296 6051 33717 42264 38709 18265
664A8265l7027k7555L258K1200K2215K6342K2048p571l3463k8433j4926p474J2270
$$ 18265 -18762 -46317 -43059 -21859 356 26698 48746 41175 7712 -20721 -35647 -43121 -30851
677c0851L5406L1507P317j0326k0133k9378k6804l229K4138L0868K1828J3012
$$ -30851 4555 36062 43379 33053 12920 -16458 -43262 -46491 -22353 8515 30343 43355
689D3355l709l0378l6632j4406M951J3700K7222L2732J0675j8100k6275k2509
$$ 43355 39646 9268 -27364 -41770 -36819 -23119 4103 36835 47510 29410 3135 -19374
701a9374k0108m994K3845L5823J9952K837p222k3227l2908j8007P440K1091K3892
$$ -19374 -39482 -44476 -20631 15192 35144 37981 30759 7532 -25376 -43383 -35943 -14852 9040
714I040K2558J1726j1814l1028k7120j0581J519J6050L1889K6053J298j5128k1169
$$ 9040 31598 43324 31510 482 -26638 -37219 -35700 -19650 12239 38292 39590 24462 3293
727C293k6482j9657N054K5992K7187J7712O414j1148k9656k8913r195Q532J8333
$$ 3293 -23189 -42846 -37792 -11800 15387 33099 39513 28365 -1291 -30204 -39399 -30867 -12534
740a2534K5713K3326M256j8578k7283k1243j0525L040K1861L1420J7679l189j3611
$$ -12534 13179 36505 40761 22183 -5100 -26343 -36868 -33828 -11967 19453 37132 33943 20332
753B0332k1517k6594j3217J1069K3765K2701J6920M110j5989k8948k2868n834
$$ 20332 -1185 -27779 -40996 -29927 -6162 16539 33459 37569 21580 -7368 -30236 -36070
765c6070Q400J9206K6517J9414k169j9474k3108j9417j0795P335K6039K7054J1031
$$ -36070 -27670 -8464 18053 37467 35298 15824 -7284 -26701 -37496 -30161 -4122 22932 33963
778C3963k963j2680k5111k5911m904J5352J9686K0225J7397J91k1537k6564j5860
$$ 33963 31000 18320 -6791 -32702 -37606 -22254 -2568 17657 35054 35245 13708 -12856 -28716
791b8716m056P294K1637K7367J3069q137j7282j9517k0504q725J4468K6244J9235
$$ -28716 -32772 -25478 -3841 23526 36595 28458 11176 -8341 -28845 -37570 -23102 3142 22377
804B2377Q554o17j5895k8392j9430K168J3175J6606K2615J5901q002k3051j9447
$$ 22377 30931 30314 14419 -13973 -33403 -31235 -18060 -1454 21161 37062 29060 6009 -13438
817a3438j3581o247J1129K6334K1984N251o979j4355k2574k0532j39J8794J9621
$$ -13438 -27019 -33266 -22137 4197 26181 31432 24453 10098 -12476 -33008 -33147 -14353 5268
830E268J5100J1971k884k3636k5334r132K074Q173K0590K5264P167j4048j7508
$$ 5268 20368 32339 29455 5819 -19515 -28647 -26573 -18400 2190 27454 34621 20573 3065
843C065j5705j6526l845J8400K4828J3929M115m317j8017k5000j2873N956J4645
$$ 3065 -12640 -29166 -33011 -14611 10217 24146 28261 23944 5927 -19073 -31946 -25990 -11345
856a1345J6644J8720R695j2070k3197j5987q224k648J3171K6685J7025j840r236
$$ -11345 5299 24019 33714 21644 -1553 -17540 -25764 -28412 -15241 11444 28469 26629 17393
869A7393j3178k1171j5972O135K0493J6776J1357P211p227k3208k0922n216N631
$$ 17393 4215 -16956 -32928 -26793 -6300 10476 21833 29044 21817 -1391 -22313 -27529 -21898
882b1898J1462J9220J8668K295j4881j7702j4375j0857J893J9031K1642R911N51
$$ -21898 -10436 8784 27452 29747 14866 -2836 -17211 -28068 -26175 -7144 14498 24409 24960
895B4960p068j8929k2003o407J0153J3841J5030J6090M123j5833k1614j2286m317
$$ 24960 17892 -1037 -23040 -29447 -19294 -5453 9577 25667 29790 13957 -7657 -19943 -24260
908b4260J989J4531K3086J3065n037j3012j3464j5597j0396P636K0442J6324P274
$$ -24260 -22271 -7740 15346 28411 23374 10362 -3102 -18699 -29095 -21459 -1017 15307 22581
921B2581J179r493k0394j6878k346Q174J3366J7341J2931k214j4852j6264j2783
$$ 22581 23760 14267 -6127 -23005 -25351 -17177 -3811 13530 26461 24247 9395 -6869 -19652
934a9652o556O422J8891J8206O904l030j0064j7505j7238l401J2301J6142J2922
$$ -19652 -26208 -19786 -895 17311 24215 21185 11121 -6384 -23622 -27023 -14722 1420 14342
947A4342R482O7j5063k0502j0855N49P194J4099J7663Q908o174j4317j4403j1552
$$ 14342 23824 23891 8828 -11674 -22529 -21980 -14786 -687 16976 25884 19710 5393 -9010 -20562
961b0562l477R413J7388J4149N611k946j2042j7932j2471Q72R941J3059J4710
$$ -20562 -24039 -14626 2762 16911 22522 19576 7534 -10398 -22869 -21997 -12056 1003 15713
974A5713R895n095j7236j5353p645k127O677J8380J7888K967q965j1247j3055
$$ 15713 25608 20513 3277 -12076 -19721 -21848 -15171 3209 21097 24064 15099 3852 -9203
987i203j3709j769J4838J7741R430L329k716j3948j8680q213M867R657J1912J4131
$$ -9203 -22912 -24681 -9843 7898 17328 20657 17941 3993 -14687 -22900 -18033 -8376 3536 17667
1001A7667O326r067j5289j1075p449k295J0503J8746J1087l39m559r751j7093
$$ 17667 23993 14926 -363 -11438 -18887 -21182 -10679 8067 19154 18815 14256 4505 -12588
1014a2588j1626M962J3696J1251J0058P487n826j8893j5251l152L027P753J5887
$$ -12588 -24214 -19252 -5556 5695 15753 23240 17414 -1479 -16730 -19882 -16855 -9102 6785
1027F785J5030L44j1743j2456j0587q680J794J4877J5992O643O8n444j4097j5262
$$ 6785 21815 22159 10416 -2040 -12627 -21307 -19513 -4636 11356 17999 18067 12623 -1474 -16736
1041a6736l693O927Q858J1305J2296J931j1521j3501q436n684L47J2348J7148
$$ -16736 -20429 -13502 -4644 6661 18957 20888 9367 -4134 -12570 -18254 -17907 -5559 11589
1054A1589P621l054n892j0114j5467q089Q489J4319R668P738M118r257j8762j1193
$$ 11589 19210 16156 10264 150 -15317 -23406 -14917 -598 9070 16808 20926 11669 -7093 -18286
1068a8286P79M698Q416J5394J1101m694j2718r848q606o425N513J5919J2194K888
$$ -18286 -17507 -12809 -4393 11001 22102 17408 4690 -5158 -13764 -20189 -14676 1243 13437 16325
1082A6325j546o238j3604j2619m97Q673Q903R454R458k09j2667j3050o450k515
$$ 16325 14779 8541 -5063 -17682 -18179 -9506 -603 8851 18309 18100 5433 -7617 -14067 -16582
1096a6582K695J2645J5016N091m836p979j0793j2120l492R704J3591R291N086
$$ -16582 -13887 -1242 13774 18865 14029 6050 -4743 -16863 -20355 -10651 2940 12231 17317
1109A7317r98j0836j5163q112J923O976J0041J1900O296n726j2076r911o340k054
$$ 17317 16319 5483 -9680 -17792 -15869 -8893 1148 13048 19344 13618 1542 -8369 -14709 -16763
1123a6763P026J3869J0021J225l641p449j1889r498J208R135R553Q417N923k725
$$ -16763 -9737 4132 14153 15378 11737 4288 -7601 -17099 -15891 -6756 2797 11214 17137 14412
1137A4412j2202j2339n149P77N459J1489J2383L393p126j0109r287p912r79J0228
$$ 14412 2210 -10129 -15278 -14501 -9042 2447 14830 18223 11097 988 -8299 -16211 -17190 -6962
1151f962J3863P310O95l338r703j3343o216M767Q651Q633R033L892o981j2311
$$ -6962 6901 14211 14906 11568 1865 -11478 -17694 -12927 -4276 4357 13390 17282 10301 -2010
1165b010q697l200P36O925J2199Q971m69o346p578r379p754K142J1199J0284N247
$$ -2010 -10707 -13907 -13171 -6246 5953 14924 14455 8109 531 -8848 -16602 -14460 -3261 7023 12270
1180A2270K541l657j2264j1789k317M200O347R794J0278J240r387j0633o937m498
$$ 12270 14811 11154 -1110 -12899 -15216 -11016 -4669 5125 15403 16643 7256 -3377 -10314 -14812
1194a4812J129J0539J2761M946k251m977q602j0876m449O443R757P082O081K459
$$ -14812 -13683 -3144 9617 14563 12312 7335 -1267 -12143 -16592 -10149 -392 6690 12771 15230
1208A5230p745j3004o521RJ606O649J2320P198l686p445o570q320n970M818J2331
$$ 15230 7485 -5519 -12040 -12031 -10425 -3776 8544 15742 12056 4611 -1959 -10279 -16249 -11431 900
1223I00Q554K580L41m581j2005j0203N13O546O235Q070Q387r13j1259r869l807
$$ 900 9454 12034 12375 7794 -4211 -14414 -13901 -7355 -1120 6950 15337 14424 3165 -6704 -10511
1238a0511k285J999J1017J1485J775m192m596q087j0030j495Q364Q670N708M920
$$ -10511 -12796 -10797 220 11705 13480 9288 4692 -3395 -13425 -14920 -6556 2114 7822 12742
1252A2742K21r146j1612m449J471L031P086J1081M966n752q450n680o457l757
$$ 12742 12963 3817 -7795 -12244 -10773 -7742 -656 10425 15391 9639 1189 -4491 -10948 -14705
1266a4705O765J2351O154L30o92n753j1618p139K918O596O227P621N422l894j0567
$$ -14705 -7940 4411 10565 10895 10203 4450 -7168 -14307 -11389 -4793 1434 9055 14477 10583 16
1281A6p924k929m04M038J0314Q805K71m871n465p521p660N36R138Q186M276L060
$$ 16 -7908 -10837 -11241 -7203 3111 11916 12187 7316 1851 -5670 -13330 -12794 -3656 4530 8806 11866
1297A1866j442r786j0167k277K711L907P582R176J981o643q057n611m447m60P094
$$ 11866 10424 638 -9529 -11806 -9095 -5188 2394 11570 13551 6908 -1149 -6760 -11207 -11667 -4573
1312d573J0367N408q06l327o207q950n141L383P699O430N361K647m586r757o982
$$ -4573 5794 11202 10396 7069 862 -8088 -13229 -9846 -2147 4283 9644 12291 7705 -2052 -9034
1327i034j547J316N320R178O646j071n496o250o749m601K323Q532P784L434K47
$$ -9034 -10581 -9265 -3945 5233 11879 10808 5312 -938 -7687 -12288 -9965 -1433 6351 9785 10032
1342A0032l222q162q631j916M715N581O070O346J202p095q762m565j571J169O674
$$ 10032 6810 -1352 -9983 -11899 -7184 -1603 4467 10813 12015 4920 -3842 -8407 -9978 -8809 -2135
1357b135R223M330k341m851o032o879l227M124P975O209L214M29m845q960o375
$$ -2135 7088 11418 9077 4226 -1806 -8685 -11912 -7788 187 6396 9610 10039 5194 -3766 -10141
1372a0141K78L614M796P405N907k023p607o010l810l009K259R036P792J139k048
$$ -10141 -9863 -6249 -1453 5952 11859 9836 2229 -3781 -7591 -10600 -8341 695 8487 9626 7578
1387G578l265p043p653p08O051O214M638M180M4p132q680l438O99K252O074Q375
$$ 7578 4313 -2730 -10383 -11091 -5040 1174 5812 9992 10036 2904 -5776 -9214 -8515 -6263 -189 8186
1403H186L103m253n595m709n562k354N790Q550L971J103J88n071r299m519K682
$$ 8186 11289 7036 1441 -3268 -8830 -11184 -5394 3156 7127 8230 8418 3347 -5952 -10471 -7789
1418g789L868M081O644M608l621q027m997k164j660K775Q673P037n57l485l053
$$ -7789 -3921 160 6804 11412 7791 -236 -5233 -7397 -9057 -6282 2391 9428 8871 5386 2333
1433B333o280o807R36P418N390L113L408j036q291p603j033J545K270O543P563
$$ 2333 -3947 -10754 -9818 -2400 2990 6103 9511 8475 184 -7419 -8452 -6907 -4637 1906 9469
1448I469O12n644m990l781m589p06O847P894K283m68n33m968q498l170M174M491
$$ 9469 10081 4437 -553 -4334 -8923 -9629 -2782 5112 7395 6927 6394 1426 -7072 -10242 -6068 -1577
1464a577L105N541L409m648q053l778j090p18L780Q256N123j541l615l979n974
$$ -1577 1528 7069 10478 5830 -2223 -6001 -7091 -7809 -4029 4227 9350 7809 4194 215 -5759
1479e759m400K593O798N079K889J516l120p547n924j40K506L255O069N522j013
$$ -5759 -10159 -7566 -768 4311 7200 8716 5596 -1951 -7875 -8015 -5509 -2254 3815 9337 8324
1494H324n893m535l038l194R37O899O277J250p48j763n424o436j403L806M402
$$ 8324 2431 -2104 -5142 -8336 -7399 -500 5777 7027 6279 4516 -908 -7344 -8747 -4941 -539
1509e39L934M142J091m785o870l641m70R76M391P205L837k481m410m110m880k658
$$ -539 3395 7537 8628 3843 -3027 -6668 -7138 -6162 -1771 5434 9271 6790 2380 -1730 -6610 -9268
1525i268L572O994M333J430j72l541o746m737Q61L660L776M430L589j211n766
$$ -9268 -5696 1298 5631 7061 6889 3348 -3398 -8135 -7274 -3614 162 4592 8181 6970 1204
1540A204n017k039p76J421N388N956J331k494k856m008n010j344M226N504L312
$$ 1204 -3813 -5852 -6628 -5207 181 6137 7468 4974 2118 -1890 -6900 -8244 -4018 1486 4798
1555D798K049J29m412o870l261J101K574M122N774K826l121n513l908k832j048
$$ 4798 6847 6976 2564 -4306 -7567 -6466 -3892 230 6004 8830 5709 196 -3712 -6544 -7592
1570g592L641O666M086m41j772l046n464m107J708M836L253K736K825j554o112
$$ -7592 -3951 2715 6801 6360 4588 1542 -3922 -8029 -6321 -1485 1768 4504 7329 5775 -337
1585c37m535n95J17J430N163N419L23l220l118l531m125m44N047N544K254P73
$$ -337 -4872 -5467 -5350 -3920 1243 6662 6985 3765 647 -2884 -7009 -7453 -2406 3138 5392 6165
1601F165m68m788o623j958K834K797L301N343J872m838n712k177j454p46M069
$$ 6165 5697 909 -5714 -7672 -4838 -2041 1260 6603 8475 3637 -2075 -4252 -5706 -6452 -2383
1616b383O731K529k049j905k387n006l432K890N161K484J704K268j908o302m003
$$ -2383 4348 6877 4828 2923 536 -4470 -7902 -5012 149 2633 4337 6605 4697 -1605 -5608
1631e608N57Q23J389N134M864p49m195k878k938l566P57O079M728Q20J84j097
$$ -5608 -5051 -4228 -2839 2295 7159 6410 2215 -663 -3601 -7167 -6410 -331 4397 5217 5401 4304
1647D304n366n501j26L287K729L353M023K00n165m861j455m80Q2M135N743J381
$$ 4304 -1062 -6563 -6689 -3402 -673 2680 6703 6903 1738 -3123 -4578 -5058 -4976 -841 4902 6283
1663F283k376j898k456m603k071L565M595J980J625J296l021n751k635P42J079
$$ 6283 3907 2009 -447 -5050 -7121 -3556 1039 3019 4644 5940 2919 -2832 -5467 -4725 -3646
1678c646K379M957L325j817m102k991k551j994J876N613L958J68q58j830m709
$$ -3646 -1267 3690 7015 5198 1096 -1895 -4446 -6440 -4564 1049 5007 5175 4317 2487 -2222
1693b222m354P02L774K844K610K777p34m932m116r30O9J041L891M441R10k272
$$ -2222 -6576 -5874 -2100 744 3354 6131 5397 465 -3651 -4581 -4512 -3471 420 4861 5771 3499
1709C499k700k733l098j001L372M509K202O26j04k992m995k308J219K182K772
$$ 3499 799 -1934 -5032 -6033 -2661 1848 4050 4676 4572 1580 -3415 -5723 -4504 -2322 450
1724D50L818K109k296m286k921j466o70K366M938L156l27j641k420l838k933R68
$$ 450 4268 6377 4081 -205 -3126 -4592 -5262 -2896 2042 5198 4871 3230 810 -3028 -5961 -4993
1740d993L837L282J733J183q88m218m235n55J299J500L115L975O88l187l229k032
$$ -4993 -1156 2126 3859 5042 4154 -64 -4299 -4854 -3555 -2055 1060 5035 5723 2536 -693 -2725
1756b725k010m13L477M496J667l31r05k892m381j765K079L055K259K565J397k438
$$ -2725 -4735 -5148 -1671 2825 4492 4161 3256 364 -4017 -5782 -3703 -648 1611 4176 5573 3135
1772C135m693k457K8J66J747M699L055j335k797j799k755k656J398M441K774P77
$$ 3135 -1558 -4015 -3987 -3821 -2074 2625 5680 4345 1548 -251 -3006 -5662 -4264 177 2951 3728
1788C728M94r58m271l742N5K143J634K690L355N6l836l274j074j185j10L657M506
$$ 3728 4222 3264 -1007 -4749 -4694 -2551 -917 1773 5128 5184 1348 -1926 -3000 -4185 -4295 -638 3868
1805C868N93j354r85k338m303j093L276L066J273K007J049l120m673j261N96M04
$$ 3868 4461 3107 2122 -216 -4519 -5612 -2336 730 2003 4010 5059 1939 -2734 -3995 -3399 -2995
1821b995J974M339K198k036k995j557k088k044J827M607K301j92J79j046m381
$$ -2995 -1021 3318 5516 3480 485 -1072 -3160 -5204 -3377 1230 3531 3339 3518 2472 -1909
1836a909l220J100K514J458K415K863j101m141k494m94q94N95M046L446j29j646
$$ -1909 -5129 -4029 -1515 -57 2358 5221 4120 -21 -2515 -3009 -3903 -3308 738 4184 4055 2409
1852B409j195k499l362j11L477K809Q87J313M13l235m252o38J192N80K121M022
$$ 2409 1214 -1285 -4647 -4758 -1281 1528 2415 3728 4141 906 -3346 -3984 -2792 -2212 -91 3931
1868C931J081k650k611j353j970r46K572L907J475k11k08j994l725j990J434K332
$$ 3931 5012 2362 -249 -1602 -3572 -4518 -1946 1961 3436 3225 3017 1023 -2702 -4692 -3258 -926
1884i26J705K136J759j651l812k097j89l29J102L834K797p18j908j385k309k481
$$ -926 779 2915 4674 3023 -789 -2886 -3075 -3404 -2302 1532 4329 3611 1703 318 -1991 -4472
1900d472N86L430K462P56O39m11l075l374m74J470J426K052K689N60k420l007
$$ -4472 -3886 -456 2006 2762 3401 2990 -85 -3459 -3933 -2463 -1037 1015 3704 4264 1844 -1163
1916a163j276q28j17K209L439J462p77j072j804k825j620J622K667J745J387P44
$$ -1163 -2439 -3267 -3384 -1175 2264 3726 2949 1877 73 -2752 -4372 -2750 -83 1662 3049 3793
1932C793j607l303k161o3Q60J505K822K252n44k494k033j487j258N91L179K689
$$ 3793 2186 -1117 -3278 -3341 -2481 -976 1846 4098 3554 1060 -973 -2460 -3718 -3127 52 2741
1948B741L46m35p69k580k848j17J980J742J505J825K34k569k749r62j82K56K104
$$ 2741 3087 2652 1883 -697 -3545 -3662 -1682 60 1565 3390 3624 1055 -1694 -2656 -2838 -2582 -478
1965d78L161J129j480j365j464k339j366J989L128J314L78O83j520l732j870J037
$$ -478 2683 3812 2332 967 -497 -2836 -4202 -2213 915 2229 2607 3290 1770 -1962 -3832 -2795
1981b795J376J081K494K108j360l079j525n88r71Q08L295K386l78j151o04k140
$$ -2795 -1419 -338 2156 4264 2904 -175 -1700 -2288 -3259 -2451 844 3230 2852 1701 1097 -1043
1997a043k598L68K592J537O36J495L47k843k923k18O12q4J925L305O94k158j605
$$ -1043 -3641 -3273 -681 856 1492 2987 3334 491 -2432 -2650 -2038 -2122 -197 3108 3802 1644 39
2014C9q79k039j063K493L087R75n9nj697l306j354J546J663J026J968J399j747
$$ 39 -840 -2879 -3942 -1449 1638 2613 2554 2549 852 -2454 -3808 -2262 -599 427 2395 3794 2047
2031B047l042j084n7n31J051L213J676j190r52n18k128k022J056K383J049P15
$$ 2047 -995 -2079 -2136 -2667 -1616 1597 3273 2083 1131 613 -1515 -3537 -2481 -98 951 1666
2047A666J301m05k844k266Q8N69L88K148K649nk239j532r06j629k93K860K749
$$ 1666 2967 2562 -282 -2548 -2460 -1891 -1503 645 3294 3289 1050 -482 -1388 -3017 -3310 -450 2299
2064B299K24m04k00j972k942m18K027J438Q75J650N98k080k568n65J09j19J302
$$ 2299 2523 2119 1919 -53 -2995 -3413 -1386 52 927 2577 3175 1095 -1473 -2038 -1929 -2048 -746
2081g46K632J024j026j090q10j643j500J143K269J146N09O51p13k689j862L25
$$ -746 1886 2910 1884 794 -16 -1659 -3159 -2016 253 1399 1908 2559 1846 -843 -2705 -2380
2097b380Q10Q73J979J952n20k220j514r25q07M58K509K139K67q56q49j686j981
$$ -2380 -1570 -697 1282 3234 2714 494 -1020 -1945 -2752 -2294 215 2354 2621 1765 916 -770 -2751
2114b751q3J848J603P61Q22K27j731k249n54L82K90J121K205Q31j085j292q93
$$ -2751 -2834 -986 617 1378 2200 2427 696 -1553 -2107 -1725 -1435 -314 1891 2722 1637 345 -548
2131e48j316q29J051K247J279J36jq49k375j679N00J536J050J335J368m89k482
$$ -548 -1864 -2693 -1642 605 1884 2020 2019 1170 -1205 -2884 -2384 -848 202 1537 2905 2416 -66
2148f6j718k21Q1M02K031K067p8j426r46j050j472q1J926J665M26K14J09j431
$$ -66 -1784 -2005 -1924 -1522 509 2576 2498 1072 126 -924 -2396 -2477 -551 1114 1540 1754 1863 432
2166D32k155n53Q45O70P82J865Q93j410j781o53n79p30J021K501J203o12m48o42
$$ 432 -1723 -2276 -1431 -761 21 1886 2779 1369 -412 -1065 -1644 -2374 -1353 1148 2351 1739 1291 649
2184F49k083j544R89J988Q06P35R64p23k470j328K56L08N21J762J801n71j645
$$ 649 -1434 -2978 -1989 -1 805 1540 2504 1781 -689 -2017 -1761 -1453 -932 830 2631 2060 415
2201D15p08o33j383J45K154J484j36J52J91j633k194Q4J185M53P03J816N25j883
$$ 415 -293 -926 -2309 -2164 -10 1474 1338 1490 1681 48 -2146 -2062 -877 -424 279 2095 2620 737
2219G37j692k09m22n28J404K427O00r63n42o89j862j004J434J871M07M42P89r99
$$ 737 -955 -1164 -1586 -2114 -710 1717 2317 1354 812 123 -1739 -2743 -1309 562 969 1411 2200 1201
2237A201k412q84P91K50L63J883J419j020j642l72o30j211N82K158J153k99or9
$$ 1201 -1211 -2095 -1304 -1054 -691 1192 2611 1591 -51 -423 -1053 -2264 -1682 476 1629 1330 1324 1225
2255A225j668j823L25J352O09P42J315J9j900j377j05j96q7J475J968M7r49n28
$$ 1225 -443 -2266 -1941 -589 20 762 2077 2096 196 -1181 -1286 -1482 -1569 -94 1874 1921 972 444
2273D44q09j580k83J556J426K89M14K99j124k025n14P04M21O67J420R67r32j667
$$ 444 -365 -1945 -2228 -672 754 1043 1457 1756 632 -1393 -1907 -1203 -782 -115 1305 2272 1340 -327
2291c27n67k69o38N35J931J049k67m03m30j510j199M44J297Q06O87O99l45j638
$$ -327 -894 -1163 -1801 -1266 665 1714 1447 1044 614 -896 -2095 -1651 -354 452 1139 1838 1493 -145
2309a45j175r7J90K89J243J475N5j112q12o00r47j43J254J586K68j45kq60j681
$$ -145 -1320 -1417 -1227 -938 305 1780 1835 723 -89 -689 -1636 -1779 -525 1061 1329 1184 1182 322 -1359
2328a359n47Q02Q19P44R10N19r26j500n65k08q6O45J655Q73m38p09n72j049r51
$$ -1359 -1906 -1104 -285 459 1369 1888 962 -538 -1103 -1311 -1397 -752 903 1776 1338 629 57 -992 -1943
2347a943N28J530Q19P9M48j81j566j388K69N97L33R01J410j41j294r60l20m99
$$ -1943 -1415 115 934 1013 1461 1280 -286 -1674 -1405 -808 -475 426 1836 1695 401 -559 -879 -1378
2365a378j41J241J588J26n01j62o91j528m90J173J050L08O47N93j061j783l29
$$ -1378 -1519 -278 1310 1436 935 773 82 -1446 -1936 -763 287 595 1242 1835 774 -1009 -1338
2382a338M52j05M53J610Q91r25r20l41p01q00N82J623O14j09J69k84j437j238
$$ -1338 -886 -991 -538 1072 1963 1038 118 -223 -924 -1724 -1142 481 1095 986 1155 871 -566 -1804
2400a804N17Q83K58P37J158l21j532p85J17m20j11J514J426l80o77p5o97j452
$$ -1804 -1287 -404 -146 591 1749 1428 -104 -889 -772 -1192 -1303 211 1637 1257 580 505 -192 -1644
2418a644r3J407R03j0O18L22j098j618j05N50l5O56J541M22j139q79r5p14p27
$$ -1644 -1737 -330 573 563 1181 1503 405 -1213 -1318 -768 -803 -147 1394 1816 677 -202 -297 -1011 -1738
2437a738J056J615K21l43K21m38j689p39R26Q91J01P57Q36o51j471n17J98k37
$$ -1738 -682 933 1154 811 1032 594 -1095 -1834 -908 -17 84 841 1677 1026 -445 -962 -764 -1001
2455a001J16J280J183m42q55p1o24j118J42J360O58J03L95J11j258j220J16M16
$$ -1001 -885 395 1578 1136 281 210 -414 -1532 -1390 -30 628 731 1126 1237 -21 -1241 -1125 -709
2473g09J88P55J178R4j007r20k26m74j74R57J296K54m73j28n47j159m45Q49Q32
$$ -709 -521 234 1412 1506 499 -421 -647 -1121 -1295 -338 958 1212 739 611 64 -1095 -1540 -691 141
2492A41K51M95M26o69j161m32J15L4L69J083O66l89o47m11n47o51L01J158O95
$$ 141 392 887 1313 644 -517 -949 -834 -800 -431 652 1318 929 282 -129 -676 -1327 -1026 132 827
2511H27Q0J02j36j094j112M4Q27M10M36Q94K0j008j066j21oLR16J034K22o03n04
$$ 827 907 1009 873 -221 -1333 -1289 -462 -52 384 1278 1298 290 -776 -897 -903 -900 16 1050 1272 669 165
2532A65m76o39k68O63Q76L11J45J74m91j100n02L76K98K46Q23P97m25j033l42
$$ 165 -311 -950 -1218 -555 321 632 777 951 460 -640 -1142 -766 -468 -222 601 1398 973 -60 -402
2551d02k21o07K87J226Q38k17k29j92r05r85J81J050N04K94N15n1j077r95R4K74
$$ -402 -623 -1230 -943 283 1121 904 675 483 -422 -1407 -1226 -176 328 622 1137 1086 9 -986 -892 -618
2571f18P3P27R58M1r26m27q3o25l22Q82J018o7q6L67n59j111m06N57L77J20P67
$$ -618 -545 182 1140 1181 255 -172 -255 -880 -1202 -320 698 631 545 912 353 -758 -1164 -607 -230 -110 657
2592F57P65o36j147k63L8l81K42J260P82n13m71j01p29r57N31J168L31k0M64k10
$$ 657 1422 786 -361 -624 -586 -967 -725 535 1317 804 333 232 -497 -1454 -923 245 576 556 1020 810
2612H10j182p63M52K94m5O69R32k07r73k29pn48l16R73R28j06j99K43n19j139
$$ 810 -372 -1135 -683 -389 -434 235 1167 960 -13 -242 -249 -797 -1113 -140 788 682 483 726 207 -932
2632i32k13P74K51J65Q06M67q77r85k1j40k53N72J199L93n38m50k62o24n94O63
$$ -932 -1145 -371 -120 45 851 1318 441 -544 -565 -705 -958 -386 813 1206 668 218 -44 -668 -1262 -599
2652e99R82K60j05K35k53j017n74M41L54J17N45P08l40q26j77j90l61k7R21O69
$$ -599 383 643 538 773 520 -497 -1071 -630 -276 -159 386 1094 754 -72 -249 -439 -800 -827 94 763
2672G63r6j16M1o76r43J2P07M19K39N76J95r00r31j0J31l4N42R84K31o60n09k19
$$ 763 667 551 592 -84 -1027 -1015 -308 111 350 926 1121 221 -710 -720 -589 -623 -81 903 1134 474 -35 -254
2694b54m39l37O74Q03J46l8J09m23p87l49L10L76J91M76M94k74p86l62o8k39J21
$$ -254 -693 -1030 -356 447 593 555 664 241 -546 -895 -585 -209 -18 458 952 678 -108 -470 -538 -777 -656
2715f56Q43O85j20l79j86l27p83l5P94N86O7K62Po68p54j47K85K74M16O78Q2n49
$$ -656 187 872 752 373 187 -140 -923 -958 -164 422 489 751 758 90 -664 -811 -526 -252 164 842 924 375
2737C75o16j91j43k37N24P69L03l02j01j77o83n57M68N69J49K64M51k47r03m40
$$ 375 -241 -432 -575 -812 -288 481 784 482 381 204 -479 -1036 -568 1 150 414 865 618 -285 -725
2757g25J87R4k5P00P48k32o31j91k03n05o2Q77O45j16r1R7n27q50JN77J34K39
$$ -725 -538 -444 -469 231 979 747 116 -75 -278 -783 -845 32 677 561 470 567 40 -810 -809 -232 -98 141
2779A41N58J78p74n43M8q9k16M47R46J06m62j20j03p15l82N77O64M8J09M06l22
$$ 141 699 877 103 -440 -392 -481 -697 -250 696 802 340 220 117 -598 -980 -403 261 309 418 824 502
2800E02j001k72M39K8J9P18N45m57o44m1j55m82J26R26L61k50M6J79p95p03K71
$$ 502 -499 -771 -332 -304 -285 433 978 521 -123 -164 -319 -801 -675 251 612 362 408 587 -208 -911 -640
2821f40N81P0J87N80N9q68n24K02k7k17M99Q84n3n62m1k10o43j58O70O16j04R7
$$ -640 -59 11 198 778 837 -31 -555 -353 -380 -597 -98 786 733 171 130 -80 -723 -881 -211 405 301 398
2843C98K96m61q39n8L72N7R5O65L36m56o09J3j16l62K06Q16L10k24q6j10n55n08
$$ 398 694 233 -606 -664 -292 -235 -140 525 861 405 -204 -191 -307 -669 -463 353 663 439 353 243 -312 -820
2865h20L24M65J86J69M25j84p66k96J31j08Q4N93N18j19m74j12k14m03n2N68M98
$$ -820 -496 -31 155 324 749 565 -201 -497 -366 -474 -390 203 721 602 128 16 -198 -601 -653 -85 413
2886D13p6J06J01m35p23n0L17K53J70M04K62m63n56r4mj71K57O62K49k01j72j67
$$ 413 337 443 544 109 -614 -664 -347 -94 76 480 742 279 -277 -371 -375 -546 -289 373 622 421 249 82
2908H2m87l06K36N93J56N6K51j49o20m59K53J72j6L68N61l7o00l17j5k27p0M69
$$ 82 -405 -711 -475 118 274 330 581 432 -188 -647 -394 -222 -238 130 691 654 54 -263 -278 -505 -575 -106
2930a06O29nj67L5m07m95j14L74L80Q5K51J42l84n80p8Q3k6J95O28K91m82l13
$$ -106 523 518 351 386 -21 -516 -630 -256 124 209 460 602 218 -362 -440 -357 -383 -188 440 731 249 -64
2952f4N6l06m09L39O43J00j32K41o5n93n03K82L83K0J37M60M6o02l81L6n7j66
$$ -64 -8 -314 -723 -384 259 359 227 468 403 -190 -693 -411 -28 -8 129 589 635 33 -348 -312 -369 -535
2974e35N39O26r8l30L1k59o01n3O77K70o3K06J78m62o38J20K29p1Q8O51J73n25
$$ -535 4 630 532 202 233 -26 -627 -680 -3 267 204 410 588 126 -512 -392 -163 -234 -146 505 678 153
2996A53l68J27j19m57L17O54J40k15J25K1o84m35M07L64p2L06M55k52o73j56J19
$$ 153 -215 -88 -207 -664 -347 307 447 232 357 378 -306 -741 -334 30 -42 264 719 467 -206 -362 -243
3017b43j96J6P15L64l76k03L9k40n86J80O68K51j89J37J71n19n81K37K80j01Q8
$$ -243 -439 -423 292 656 280 77 116 -124 -710 -530 138 389 200 337 508 -11 -592 -355 -75 -176 -88
3038h8O31L9n18k06M8k19k87M24N59o6j14O7p0o31k15L50L79L0K52L41l56o50
$$ -88 543 582 64 -142 -94 -313 -600 -176 383 317 203 270 200 -431 -646 -296 83 113 365 706 350 -300
3060c00j71K26j10R8O48K75l47l81M8j83m09K50O03O8l6l2P9m61l31J53K20M9
$$ -300 -471 -245 -355 -257 391 666 319 -62 -14 -197 -606 -356 247 315 279 247 326 -135 -466 -313 -93 -44
3082d4Q6L91J1l64k44Lj67j46L35N28L5j90k3k24m34j49L91L57L8J92J01k74n19
$$ -44 42 433 444 80 -164 -161 -328 -474 -139 389 424 234 211 -13 -447 -596 -205 152 190 382 483 209 -310
3105c10j36J10J86J28K36L72l05l77j16L5k50P7N19K11j43r3J14l13m39J68K59
$$ -310 -446 -336 -150 -22 214 586 281 -96 -212 -177 -427 -350 169 380 237 144 258 -55 -494 -326 -67
3126f7P2l6M98rm60k82k0k4m1K83M88R6l03k19n1k67j91L79M55L2q9J77l15m92
$$ -67 5 -31 467 458 -2 -284 -304 -328 -369 -86 402 498 195 -24 -75 -342 -533 -154 301 333 244 421 106 -386
3150c86q8L54R2K5K97L40m27m51Q8O0k51Q6N00J88k42o2N1j85m67Q6M17N3L0K08
$$ -386 -474 -120 -28 -3 294 634 207 -244 -156 -96 -347 -261 239 427 185 123 174 -11 -478 -392 25 78 108 316
3174C16J59n53l22J17J20j44K96M75N5n11j33K2l03j36N58M05j85r9J79k19n76
$$ 316 475 -78 -400 -283 -163 -307 -11 464 519 8 -125 -103 -406 -542 16 421 236 137 316 97 -479
3195d79NM41J43j78L11L13l98m39Q9J38k56Q2N31J84l35j19J31l10m10L06M18
$$ -479 -474 -33 110 -68 243 556 158 -281 -192 -54 -310 -228 303 487 152 33 164 -146 -556 -250 168
3216A68o2M7K24o2n26k13K08O0o0L38M10j16n18o7J23l42m0N33L34k50r8K16k50
$$ 168 106 153 377 315 -211 -424 -216 -156 -216 122 532 416 -102 -169 -46 -388 -428 105 439 189 91 307 57
3239E7n39J61L45PL6K49J68m55l31J11K7j33J20N07P2l12p6N2k81k90K82M30m1
$$ 57 -482 -321 24 31 67 316 484 29 -302 -191 -164 -297 -177 330 402 90 14 66 -215 -505 -223 207 166
3262A66j8J78n5n01j95K35J18q9L41K95k83l78Q3o8j47RM26K69j92j08P1k32l19
$$ 166 148 326 271 -230 -425 -190 -72 -161 180 475 192 -186 -103 -171 -318 -309 117 386 194 86 157 -75 -394
3285c94J8M03J17lJ21J17l15l68O8M3L9J13L82O3k57j63o0j27j88K55L62N0q3
$$ -394 -376 27 144 141 262 379 64 -304 -236 -193 -154 -41 341 404 147 -16 -76 -203 -391 -136 226 276 193
3308A93qp3l66j34J89J81j0J64K64j03m54j11J12m6K5K37L70j29k45j3n5k95p0
$$ 193 185 112 -254 -388 -199 -18 -28 136 400 297 -157 -268 -156 -202 -177 60 430 301 56 43 -12 -307 -377
3331c77M16K00m7n1J79l05l37%K50K2O5K71N4k91j80N4q9k19K90L82m6j66L7k5
$$ -377 39 239 192 141 320 15 -322 -322 -72 -50 15 286 340 49 -131 -77 -166 -385 -95 287 241 75 112 87
3355H7l75j53L49J79j7qK42n9m53j04K21k8q2L14L36j86l67Q1m1k69lM28J97j42
$$ 87 -288 -441 -92 87 70 62 304 245 -208 -312 -91 -119 -201 113 449 263 -104 -23 -64 -333 -336 92 289 147
3379A47K0Q5l14l17J50K21oL2K99ql23j68J12m4j70J64N22r2l34P7Q5l71k26L44
$$ 147 167 252 -62 -379 -229 -8 -14 18 317 309 -14 -182 -70 -114 -284 -120 402 310 -24 53 138 -233 -459 -115
3403a15K95j12M9K47j77m28o7J84LQ5K98J26l08j35M6p7k81J75L90M0j66M9J19
$$ -115 180 68 117 364 187 -241 -308 -124 -121 -36 262 388 80 -55 -9 -86 -367 -192 198 238 72 121 240
3426B40l12l51K41L08j30j3L58J6n05j01J40l4p7K31L40q7k53m8Q9l38o3L27J73
$$ 240 -72 -423 -182 126 -4 -17 341 357 -148 -249 -109 -143 -220 11 351 264 11 -37 52 -286 -349 -22 151
3449A51j01J28O0j57l12j1J63J8m1L23J65l32j95P3k4k65K15L80O5k26L5rk49
$$ 151 50 178 238 81 -231 -242 -79 -61 -102 221 386 54 -141 -68 -92 -357 -142 238 303 77 112 103 -146
3472a46k26J95K22RO3J27n3l67p7P6R2m3K15K03j27k29L5k4k05L6K37J78j34Q7
$$ -146 -372 -177 45 54 117 244 191 -176 -253 -177 -85 -128 87 290 163 -66 -31 -55 -260 -224 13 191 57 144
3496A44R1j83l00J9J94Jj9K36J01k18k14RJ5j05J01L28J04j54j55Pj50j74J15
$$ 144 235 52 -248 -229 -35 -34 -53 183 284 66 -148 -139 -124 -229 -128 200 304 150 -5 2 -148 -322 -207
3519b07L17R7j06O6lk76k60J95K04j15J80J92j01k38q8J40j59r2L11J86j09r0
$$ -207 110 207 101 167 164 -112 -372 -177 27 -88 92 284 183 -55 -143 -3 -162 -254 57 243 134 44
3541D4R7m0l31l9K61J04j07J70J29j07l59j7J30m9pL39J25k98j14M5j12j89J87
$$ 44 141 101 -230 -269 -8 96 -11 159 288 181 -178 -195 -65 -114 -121 218 343 45 -69 -24 -136 -325 -138
3564a38L32J8j67R3N0l46j27K07J71j16P4K69j51l15K8R1r1p3K59J98j68p8J22
$$ -138 194 212 45 138 188 -158 -285 -78 93 -23 51 320 169 -146 -118 -27 -118 -191 68 266 98 20 142
3587A42p6l72K3L23N8l1J15J44l12l04J30J25j21O8L85Kl24j13Q6o8j72K12L33
$$ 142 66 -306 -283 40 98 67 182 326 14 -290 -160 -35 -156 -88 297 299 -25 -138 -52 -120 -292 -80 253
3610B53j07j21P2L2k67j53K94J16k24J10L10k42k15K1R0j16k9K63J43r0j42J36
$$ 253 146 25 97 129 -138 -291 3 119 -105 5 315 73 -142 -121 -31 -147 -176 87 230 140 -2 134
3632A34q9l14O8L33j0q3J78L6l28j88J20O4J4R1K58o4k67n7O8j19l4K28J27n4
$$ 134 45 -269 -201 132 122 39 217 253 -75 -263 -143 -79 -65 26 284 220 -47 -104 -36 -155 -189 39 166 112
3656A12p4L0k7k63l1K90M4j42N1K54j17k27l8O9j3J0J93J66j97o4k3j07j40L4
$$ 112 38 68 41 -222 -253 37 81 -61 -10 244 127 -100 -138 -69 -82 -72 121 287 90 26 3 -104 -244 -210
3680b10L79K1r2M3Ok22k10J35J72k2L9J59k6k77m1O4Qr7J68J93j14p9Kmj42l4
$$ -210 169 190 98 141 147 -75 -285 -150 22 0 39 198 172 -105 -146 -82 -74 -171 -3 190 76 -3 -1 -5 -147 -181
3706a81J69J71p6L7N3r8k22n5J88m2j6K26K03k56j77K2Lq7k1K91J23k21m1N7q8
$$ -181 -12 159 83 120 173 75 -147 -202 -14 -56 -72 154 357 101 -76 -54 -51 -138 -159 132 255 34 -7 50 -38
3731c8j44K3K13L9MJ14j4k25j88J27M0q0J04K44k2k01K2Lj38q1K49Q9p6OJ86j66
$$ -38 -182 -159 54 93 97 211 197 -28 -216 -89 -49 -129 -25 219 197 -4 18 21 -117 -198 51 140 64 70 256 90
3757I0k96J1J90P2j05J83J55k01k80O9J00j75K3L78M2k06k3L0j05j94J33K37m3
$$ 90 -206 -195 -5 67 -38 145 300 99 -181 -112 -12 -187 -164 214 256 50 27 57 -48 -242 -109 128 85
3780H5l6J51n3k88p0J43N7q8J49K27j81j85M0R3k05j02L24J98k17l4J50m5l88
$$ 85 49 200 147 -141 -211 -68 -11 -99 50 277 96 -89 -49 44 -161 -263 61 259 42 8 158 113 -275
3803b75L0K93L6j18J54J52k94j49J63J7j38J09K02k4j93LJ21k29j04K17J41n8
$$ -275 -245 48 84 -34 120 272 -22 -171 -8 9 -129 -20 182 158 -35 -32 89 -140 -244 -27 114 56
3825E6m4J99q9k77q6K33N6j60J76K30k18k35J56K0j77k4L07J13j41j48J27j44
$$ 56 12 211 122 -155 -241 -8 48 -112 64 294 76 -159 -3 17 -160 -184 123 236 95 -53 74 -70
3847g0q3k1J89Q1k9J02j0k09n0M7K2q3J22J94o1k00N8M5k19q1K70J13o5L1J1k4
$$ -70 -153 -174 15 96 67 169 159 -50 -100 -53 -31 -114 8 202 141 -59 -1 44 -175 -256 14 127 62 93 104 80
3873H0k50k9J47Q8j20J35J53r6j79n0P0n9qJ95O0m4p1pp9j07O4J23K6M4R2l9k02
$$ 80 -170 -199 -52 36 -84 51 204 108 -71 -121 -51 -110 -118 77 137 93 22 15 -64 -171 -107 16 42 86 178 139 -63
3900f3j33J29Q9j33Q2J88jk69kQ3r3p4J16K49Mk10J09lk08o3J63J09J6n8J04m8
$$ -63 -196 -67 22 -111 -29 159 158 -111 -113 -30 -123 -197 -81 168 172 -38 71 68 -140 -203 -40 69 85 27 131 83
3926H3j95LR5j9o5K29O8j00k12J61n1j30M6J68K5o0P4M5k15j72O9K46j45OK07
$$ 83 -112 -109 -14 -33 -98 131 199 99 -113 48 -3 -133 -87 81 106 46 120 165 -50 -222 -153 93 -52 -46 161
3951A61M8k50r8J57r9j30K21J72k2j78OK8j56j17K61O7p0R1J51j43k35l7J64k0
$$ 161 209 -41 -139 18 -81 -211 10 182 160 -18 -12 16 -140 -257 4 71 1 92 243 100 -135 -172 -8 -28
3975b8q1K70O8k09j27J01j4j86P4K89j6j51N0M8j97j31J62K10j69j2K14lk63m5
$$ -28 -109 161 229 20 -107 -6 -20 -206 -132 157 141 -10 40 88 -109 -240 -78 132 -37 -49 165 162 -101 -146
3999a46J53o8j20J76K44o8k48J23%k47M4J97M8q5J08Q2j85k17J08J56r2PK50k3
$$ -146 7 -61 -181 -5 239 171 -77 46 46 -201 -157 40 88 3 111 193 8 -209 -101 55 -37 -30 220 197
4023A97k31j42K16j06j16J49K17kj93N4N1j58j24J53J32j18M1K12j59j77l4J37
$$ 197 -34 -176 40 -66 -182 -33 184 182 -11 43 94 -64 -188 -35 97 -21 20 232 73 -104 -138 -1
4045ao0o0J35J64r3j30K4K5j90MK48Q4j36O1Q4j62k09O6K21pp2J51m7j50k2L1
$$ -1 -61 -121 14 178 85 -45 -21 4 -186 -182 66 150 14 75 159 -3 -212 -146 75 68 -4 147 100 -50 -72 -41
4071d1k5k5kK84j07j42P0Qj32p9J57Q5l3N3O3l0j91q4Q7KL9J21Q2p7p1q1M7r8
$$ -41 -66 -91 -93 191 84 -58 12 20 -112 -191 -34 51 18 71 134 104 -87 -171 -84 -82 -43 78 160 83 12 -69 -22 -120
4099a20L1J42J37q2j03J4o8j05M6J45no2J27M6j73r8R2Q1p8oJ40Q5j80K4k0m2
$$ -120 -89 53 190 108 5 19 -49 -154 -108 37 32 -30 97 143 -30 -128 -36 45 -33 -39 101 186 6 30 10 -32
4125c2j21P0J84l6k5J18q8k00l3J67l1J4O4J30o0j67o3J01r8L4J31J38j07j50
$$ -32 -153 -83 101 65 40 158 70 -130 -163 4 -27 -13 51 181 121 -46 -109 -8 -106 -72 59 197 90 -60
4149f0J12o4j99J22J61K0n6M4K2j62j00J29N1j35N6K35Pj75q0R9j46m7J60J89
$$ -60 52 -12 -211 -89 72 92 36 80 102 -60 -160 -31 20 -115 -59 176 183 8 -72 27 -119 -166 -6 183
4173A83j04j01J16k7j90k8J74mo5J24P7j01k20R8R9j44K5K16K2j65K2N6n7k17
$$ 183 79 -22 94 67 -123 -151 23 19 -46 78 155 54 -166 -68 31 -113 -88 128 150 -15 7 63 6 -211
4197b11J74J26Nj32J11jj03j38J22R0j14K0K62m2k65P0pn5o2J56J28j25k5Q4o2
$$ -211 -37 89 94 -38 73 72 -31 -169 -47 43 -71 -51 211 169 -96 -26 -33 -88 -150 6 134 9 -16 68 6
4222Fj82%K48J8j19R1P9j32j93J66L4q6k3K23j3j60k0R5o2j79J60J58o6JM0l4
$$ 6 -176 -176 72 90 -29 62 141 9 -184 -18 16 -70 -93 130 117 -43 -63 32 -30 -209 -49 109 43 44 84 50
4248E0j41q3J64M4r4O0J40l1j75j0M6o9K9J17P6q9j0M7j17j44N9K59n8q4P0J22
$$ 50 -91 -174 -10 34 -60 0 140 109 -66 -76 -30 -99 -70 47 123 34 24 71 -46 -190 -131 128 70 -14 56 178
4274A78j65j06M4Q2o2k3J43M5o1j28L8Pr6M0J84n4J7o4M8j65p1J45Ok3Q9J16p8
$$ 178 13 -93 -49 33 -29 -52 91 136 75 -53 -15 -8 -104 -64 120 66 83 19 67 -98 -169 -24 -18 -41 48 164 86
4301H6j95QL6J6n9J57J33j42q4j3P3j20p2K03J15j44L9P1m5j92N4J09lj4P2M2
$$ 86 -109 -101 -65 -49 -108 49 182 40 -44 -57 16 -104 -176 27 142 -2 37 108 63 -129 -75 34 31 17 89 131
4327A31j14n8n9Q1n7J04Q0K3j54M6Q9j81o4Q4J08n9l1J94q8j94J8J13l7o5J00
$$ 131 17 -41 -100 -19 -76 28 108 131 -23 23 112 -69 -133 -49 59 0 -31 163 75 -119 -101 12 -25 -90 10
4352A0J74n9j96Q3j6j06k0J60J43j34LO2o2k24J10J95j59K4J19Oj42j03J28N1
$$ 10 184 125 -71 12 -4 -110 -130 30 173 39 42 104 42 -182 -72 123 -36 -12 107 113 -29 -132 -4 47
4376D7j14N4J77o2j40N5Rj20p8J46J82j48r0J98k2j88p4J58P6j64R3J69j15j58
$$ 47 -67 -13 164 102 -38 17 26 -94 -172 -26 156 8 -82 116 94 -94 -168 -10 66 -98 -5 164 49 -109
4400a09N5P5j57j0K55N4j32L0Lq9j71J50J07m0n4J61j4j63n5O5O2j33R7J66r3
$$ -109 -54 21 -136 -146 109 163 31 61 64 -25 -196 -46 61 21 -33 128 114 -49 -104 -39 23 -110 -13 153 60
4425F0j51P8or8j4J71N5r9l1Q0J6j77M8J26n7j0O8J9p4r5P1M5j20M6J21K2r2o
$$ 60 -91 -13 -19 -117 -131 40 95 -4 -35 45 61 -116 -68 58 1 -9 59 78 4 -91 -20 25 -95 -49 72 94 2 -4
4453dP2p8j38R3J29k8n8M1Q3j57r2J04J7p6M7J50j4j05j0M4r0k7Q3J36j33l1O2
$$ -4 68 -10 -148 -55 74 46 -12 29 112 -45 -137 -33 -16 -92 -45 105 91 -14 -24 20 -70 -97 -14 122 -11 -42 20
4480B0Jj45J3Q7N8n5P1N5r3r6P2J8l4pJ27M0j18n2M6n8p9N3J24Mp6J2J18j42j27
$$ 20 21 -124 -111 -24 34 -21 50 105 12 -84 -12 6 -28 -35 92 132 14 -38 8 -50 -129 -76 48 52 -24 -12 106 -36 -163
4509a63O8R4j1p1J56L7j54rL8Qq1J09R5m6q2l7Q5j98J01J19M8o9o2J68r7j13n
$$ -163 -95 -1 -12 -83 73 110 -44 -53 -15 -7 -88 21 116 70 -12 -49 36 -162 -61 58 106 37 -25 143 46 -67 -72
4536g2N3ln5J01Q9o8q6J9J6p3lJ96mp6oL3j09j24J47J44q2J4N2jj63k4O3L2p3
$$ -72 -19 -22 -77 24 113 45 -41 -22 -6 -79 -82 114 110 34 28 61 -48 -172 -25 119 37 51 103 102 -61 -85 -22 10 -63
4565f3Q9J21r5r4Q2K9j89k3K21Qq9M6N9m1j91R0O3q4k9K06J8j59k5P0l7j54J28
$$ -63 26 147 52 -42 40 69 -120 -143 78 86 -3 43 102 61 -130 -40 23 -61 -90 116 134 -25 -50 20 -17 -171 -43
4592d3J35L9j02M7J1j46j05J44O3o6KJ39l9k29N6J22m5l0P2J46j65j02J25rj12
$$ -43 92 131 29 76 87 -59 -164 -20 43 -23 -21 118 79 -150 -94 28 -17 -47 25 171 6 -96 29 20 -92
4617i2J4R8Q3j55J06N6j01j33R6P3j50L5J74K4j16n0O5n3r6J06J55l2j85R2j8
$$ -92 -78 20 103 -52 54 110 9 -124 -28 45 -105 -70 104 128 12 -38 27 -26 -122 -16 139 107 -78 14 -4
4642dp6o7J32P5Mk0L7l5j04j8R7K2j21P9J15n7p4R5jr7l5J11j6j8k9J08j03p3
$$ -4 -80 -147 -15 60 64 44 81 46 -58 -76 21 43 -78 1 116 59 -15 80 79 -18 -53 58 42 24 -5 103 0 -73
4670g3L0P5ro1J10O3j68p2Q4K0m4K4J37k1j12L1K6j03lR2L9m1l1M8%j03k1P0j5
$$ -73 -43 32 23 -38 72 135 -33 -105 -21 -1 -45 -21 116 95 -17 14 40 -63 -66 26 65 24 -7 41 41 -62 -83 -13 -28
4699b8j8M7M3n8o7N8J5p3j4R1J33q3n3Q8q4j21N5Q8R8j48P6P3j52q0J39q6P9j6
$$ -28 -46 1 44 -14 -81 -23 -8 -81 -95 -4 129 46 -7 81 -3 -124 -69 19 117 -31 45 118 -34 -114 25 -61 18 2
4727BJ13J1k15M0R9o9p4J20M8m5j00P1k1r1L6R6K7j30J27O0q8q4P3K9n5p6J91
$$ 2 115 126 -89 -49 50 -19 -93 27 75 30 -70 1 -20 -111 -75 21 48 -82 45 105 17 -67 6 35 -20 -96 95
4754I5M7j11o6Q4J4j90O5J35o3j7Q6l2o3j47J59M1r2K5J36j9j54N8L2m7j14J43
$$ 95 142 31 -35 49 63 -127 -62 73 10 -7 79 47 -16 -163 -4 37 -55 -30 106 87 -67 -9 23 -24 -138 5
4780EN4l4j5Q4j7j83L1J41k4p3M4J13q3r9J5N8o7j2K35qj82JM7m6l6PJ31o5oN6
$$ 5 59 25 10 94 77 -106 -75 66 42 -31 13 126 43 -56 -41 17 -50 -62 173 165 -17 -16 31 -15 -51 -44 87 22 16 72
4810G2%j30j01J81k2n1L5J05o0j28J17mj5r3J17J09j16p5N9N2j41O9N9J3n5Q3
$$ 72 72 -58 -159 22 0 -51 -16 89 29 -99 18 14 -1 -94 23 132 16 -59 0 52 -89 -20 39 52 -3 80
4836H0j4l7j16M6J08j10M8O3L8j29j1L6l9j4O5O8q7J3QK3p5q4J01k3M3K6Q1q1
$$ 80 66 29 -87 -41 67 -43 5 68 106 -23 -34 2 -37 -51 14 82 -5 8 16 39 -36 -120 -19 -42 1 27 108 27
4864B7p6l3N8k6l8J34L1j1j26P0m1p4oJ22K0m7O9l9K3m7pN7kj6L8L1q3Mj7L5o4
$$ 27 -49 -82 -24 -50 -88 46 77 66 -60 10 -31 -105 -111 11 31 -16 53 14 37 -10 -17 40 38 22 60 91 8 12 -5 30 -34
4895c4q0J85J8q5NJ4o0p3O5Q3m9J1N4oj19j4J04M5j71R5Q2mj33O8K1j09K8J18
$$ -34 -114 71 89 4 9 23 -37 -110 -45 38 -11 0 54 48 -71 -85 19 64 -107 -12 70 66 -67 1 22 -87 -59 59
4923E9O6j22M3M3pj79O9P7m7l1J23Or0o9L8O0r1j8J83o3r2K2O7r9j19J59J61j39
$$ 59 125 3 46 89 82 -97 -28 49 2 -29 94 100 10 -59 -21 39 -52 -70 113 50 -42 -20 47 -52 -171 -12 149 10
4951A0n1J49m6j45j9J05j6n4J23M0q7j17J00L7o4l8J32J02j60k8J02l5j49J19
$$ 10 -41 108 62 -83 -102 3 -13 -67 56 96 9 -108 -8 29 -35 -73 59 161 1 -27 75 40 -109 10
4975A0lNm9Q9K9j45M4L4P2j38P4J01m5j65P9M4j37j9J90J00j36k3P3k3j67j0J65
$$ 10 7 12 -37 52 81 -64 -20 14 86 -52 22 123 78 -87 -8 36 -101 -120 70 170 34 11 84 61 -106 -116 49
5002D9q2l8J26J3p7l9N5M5j31L8J79q1j3j11J65j11r8J05M6n6j0R8o4j28M3P5
$$ 49 -33 -71 55 68 -9 -48 7 52 -79 -41 138 57 44 -67 98 -13 -111 -6 40 -16 -26 72 8 -120 -77 -2
5028bk9j4K6J50j18p3Q0Qo2n5J71k7Lm2L0n3p2M7j1O5n2Q6J9q6o5M8L8mj1O1J2
$$ -2 -31 -45 -19 131 13 -60 20 28 -34 -89 82 55 58 16 46 -7 -79 -32 -43 22 -30 56 75 -11 -76 -28 10 6 -5 56 68
5059F8r5MK6p5N5%Q2l8l2O7J1j42l5J06K6om8Q1n6pJ0%pn0J4J58m5j01O4oj17
$$ 68 -27 -23 3 -72 -17 -17 65 27 -5 62 73 -69 -104 2 28 22 -26 55 -1 -8 2 2 -5 -55 -41 117 72 -29 35 29 -88
5090h8J8O0M9m2QL1m6o2nR4l4JP6O3r4p7L4J8q4J27Qoq9L4J7l6o7J01K6p9N1O2
$$ -88 -70 -10 39 -3 5 36 -10 -72 -77 17 -17 -16 60 123 29 -48 -14 4 -80 47 55 49 -40 -6 11 -25 -92 9 35 -44 7 69
5122F9m5l5n5R0j1o2L8J13jj56J02M3j12m7J71n7q0R1pJ1j29M8J06o8n9P0R4j13
$$ 69 24 -11 -66 24 13 -49 -11 102 101 -55 47 90 -22 -69 102 45 -35 56 49 60 -69 -21 85 17 -42 28 122 9
5150In6P4o3%qJ48k4j53O6Q3n3r8M9O1q6jJ29n0n1rP4l2q2J27P0j18r3R0L4r7
$$ 9 -47 27 -36 -36 -44 104 80 -73 -7 76 23 -75 -26 35 -51 -52 77 27 -24 -33 41 9 -73 54 124 6 -87 3 37 -60
$$ [...]
8191E
##END NTUPLES=NMR FID
##END=
