##TITLE=1H_3MBDP1901
 CDCl3
 8 sc, 
 19.1.2023
##JCAMPDX= 6.0         $$ Bruker NMR JCAMP-DX V2.0
##DATA TYPE= NMR FID
##DATA CLASS= NTUPLES
##ORIGIN= UXNMR, Bruker Analytische Messtechnik GmbH
##OWNER= root
$$ XWIN-NMR		Version 3.5
$$ Thu Jan 19 16:39:01 2023 Russian Standard Time (UT+4h)  she@DPX200
##.OBSERVE FREQUENCY= 200.13135
##.OBSERVE NUCLEUS= ^1H
##.DELAY= (6, 6)
##.ACQUISITION MODE= SIMULTANEOUS
##.ACQUISITION SCHEME= undefined
##.AVERAGES= 8
##.DIGITISER RES= 18
##SPECTROMETER/DATA SYSTEM= spect
##.PULSE SEQUENCE= zg30
##.SOLVENT NAME= CDCl3
##.SHIFT REFERENCE= (INTERNAL, CDCl3, 0, 15.7039)
##AUDIT TRAIL= $$ (NUMBER, WHEN, WHO, WHERE, WHAT)
$$ ##TITLE= Audit trail, XWIN-NMR		Version 3.5
$$ ##JCAMPDX= 5.01
$$ ##ORIGIN= Bruker BioSpin GmbH
$$ ##OWNER= she
$$ F:/spectra/data/she/nmr/H-F/1/audita.txt
$$ ##AUDIT TRAIL=  $$ (NUMBER, WHEN, WHO, WHERE, WHAT)
(   1,<2023-01-19 16:38:02.51 +0400>,<she>,<DPX200>,
      <created by zg, POWCHK disabled, PULCHK disabled
       configuration hash MD5:
       00 E9 B6 7A A2 85 ED C7 34 08 36 98 17 FE 4E 26
       data hash MD5: 16K
       23 0F E3 C5 6C FC 17 50 66 F4 C5 59 4F 72 F1 77>)
$$ ##END=
$$ 
$$ hash MD5
$$ CF 88 07 14 41 05 22 D0 44 ED 3E DF 7D 2D 86 22
##$RELAX= 
##$RELAX= 
##$RELAX= 
##$RELAX= 
##$RELAX= 
##$RELAX= 
$$ Bruker specific parameters
$$ --------------------------
##$DU= <F:/spectra>
##$EXPNO= 1
##$NAME= <H-F>
##$PROCNO= 1
##$TYPE= <nmr>
##$USER= <she>
##$AMP= (0..31)
100 100 100 100 100 100 100 100 100 100 100 100 100 100 100 100 100 100 
100 100 100 100 100 100 100 100 100 100 100 100 100 100 
##$AQSEQ= 0
##$AQ_mod= 1
##$AUNM= <au_zg>
##$AUTOPOS= <>
##$BF1= 200.13
##$BF2= 200.13
##$BF3= 200.13
##$BF4= 200.13
##$BF5= 200.13
##$BF6= 200.13
##$BF7= 200.13
##$BF8= 200.13
##$BYTORDA= 1
##$CFDGTYP= 0
##$CFRGTYP= 5
##$CHEMSTR= <none>
##$CNST= (0..31)
1 1 145 1 1 1 1 1 1 1 1 1 1 1 1 1 1 1 1 1 1 1 1 1 1 1 1 1 1 1 1 1 
##$CPDPRG= <>
##$CPDPRG1= <>
##$CPDPRG2= <>
##$CPDPRG3= <>
##$CPDPRG4= <mlev>
##$CPDPRG5= <mlev>
##$CPDPRG6= <mlev>
##$CPDPRG7= <mlev>
##$CPDPRG8= <mlev>
##$CPDPRGB= <>
##$CPDPRGT= <>
##$D= (0..31)
0 1.2 0 0 0 0 0 0 0 0.06 0 0.03 0 0 0 0 0.0002 0 0 0 0 0 0 0 0 0 0 0 0 
0 0 0 
##$DATE= 1674131882
##$DBL= (0..7)
120 120 120 120 120 120 120 120 
##$DBP= (0..7)
150 150 150 150 150 150 150 150 
##$DBP07= 0
##$DBPNAM0= <>
##$DBPNAM1= <>
##$DBPNAM2= <>
##$DBPNAM3= <>
##$DBPNAM4= <>
##$DBPNAM5= <>
##$DBPNAM6= <>
##$DBPNAM7= <>
##$DBPOAL= (0..7)
0.5 0.5 0.5 0.5 0.5 0.5 0.5 0.5 
##$DBPOFFS= (0..7)
0 0 0 0 0 0 0 0 
##$DE= 6
##$DECBNUC= <off>
##$DECIM= 32
##$DECNUC= <off>
##$DECSTAT= 4
##$DIGMOD= 1
##$DIGTYP= 9
##$DL= (0..7)
0 120 120 120 120 120 120 120 
##$DP= (0..7)
150 150 150 150 150 150 150 150 
##$DP07= 0
##$DPNAME0= <>
##$DPNAME1= <>
##$DPNAME2= <>
##$DPNAME3= <>
##$DPNAME4= <>
##$DPNAME5= <>
##$DPNAME6= <>
##$DPNAME7= <>
##$DPOAL= (0..7)
0.5 0.5 0.5 0.5 0.5 0.5 0.5 0.5 
##$DPOFFS= (0..7)
0 0 0 0 0 0 0 0 
##$DQDMODE= 0
##$DR= 18
##$DS= 0
##$DSLIST= <SSSSSSSSSSSSSSS>
$$ [...]
##$SUBNAM2= <"">
##$SUBNAM3= <"">
##$SUBNAM4= <"">
##$SUBNAM5= <"">
##$SUBNAM6= <"">
##$SUBNAM7= <"">
##$SUBNAM8= <"">
##$SUBNAM9= <"">
##$SW= 18.05172834244
##$SWIBOX= (0..15)
0 0 2 0 0 0 0 0 0 0 0 0 0 0 0 0 
##$SW_h= 3612.71676300578
##$TD= 16384
##$TD0= 1
##$TE= 0
##$TE2= 300
##$TE3= 300
##$TEG= 300
##$TL= (0..7)
0 120 120 120 120 120 120 120 
##$TP= (0..7)
150 150 150 150 150 150 150 150 
##$TP07= 0
##$TPNAME0= <>
##$TPNAME1= <>
##$TPNAME2= <>
##$TPNAME3= <>
##$TPNAME4= <>
##$TPNAME5= <>
##$TPNAME6= <>
##$TPNAME7= <>
##$TPOAL= (0..7)
0.5 0.5 0.5 0.5 0.5 0.5 0.5 0.5 
##$TPOFFS= (0..7)
0 0 0 0 0 0 0 0 
##$TUNHIN= 0
##$TUNHOUT= 0
##$TUNXOUT= 0
##$USERA1= <user>
##$USERA2= <user>
##$USERA3= <user>
##$USERA4= <user>
##$USERA5= <user>
##$V9= 5
##$VALIST= <valist>
##$VCLIST= <CCCCCCCCCCCCCCC>
##$VD= 0
##$VDLIST= <DDDDDDDDDDDDDDD>
##$VPLIST= <PPPPPPPPPPPPPPP>
##$VTLIST= <TTTTTTTTTTTTTTT>
##$WBST= 1024
##$WBSW= 4
##$XGAIN= (0..3)
0 0 0 0 
##$XL= 0
##$YL= 0
##$YMAX_a= 1051642
##$YMIN_a= -784878
##$ZGOPTNS= <>
##$ZL1= 120
##$ZL2= 120
##$ZL3= 120
##$ZL4= 120
##$ABSF1= 10
##$ABSF2= 0
##$ABSG= 5
##$ABSL= 3
##$ALPHA= 0
##$AQORDER= 0
##$ASSFAC= 0
##$ASSFACI= 0
##$ASSFACX= 0
##$ASSWID= 0
##$AUNMP= <proc_1d>
##$AZFE= 0.1
##$AZFW= 0.1
##$BCFW= 1
##$BC_mod= 2
##$BYTORDP= 1
##$COROFFS= 0
##$CY= 11.3945322036743
##$DATMOD= 1
##$DC= 2
##$DFILT= <>
##$DTYPP= 0
##$F1P= 2.36226072786647
##$F2P= -0.459571619588291
##$FCOR= 0.5
##$FTSIZE= 0
##$FT_mod= 4
##$GAMMA= 1
##$GB= 0.15
##$INTBC= 1
##$INTSCL= 1
##$ISEN= 128
##$LB= 0.24
##$LEV0= 0
##$LPBIN= 0
##$MAXI= 10000
##$MC2= 0
##$MEAN= 0
##$ME_mod= 0
##$MI= 1.114404
##$NCOEF= 0
##$NC_proc= 0
##$NLEV= 6
##$NOISF1= 3.799351
##$NOISF2= 2.8
##$NSP= 1
##$NTH_PI= 0
##$NZP= 0
##$OFFSET= 15.70392
##$PC= 1
##$PHC0= -19110.26
##$PHC1= 8.800791
##$PH_mod= 1
##$PKNL= yes
##$PPARMOD= 0
##$PSCAL= 0
##$PSIGN= 0
##$REVERSE= no
##$SF= 200.130013532006
##$SI= 16384
##$SIGF1= 3
##$SIGF2= 2
##$SINO= 400
##$SIOLD= 16384
##$SREGLST= <1H.CDCl3>
##$SSB= 0
##$STSI= 0
##$STSR= 0
##$SW_p= 3612.71676300578
##$SYMM= 0
##$S_DEV= 0
##$TDeff= 0
##$TDoff= 0
##$TI= <>
##$TILT= no
##$TM1= 0
##$TM2= 0
##$TOPLEV= 0
##$USERP1= <user>
##$USERP2= <user>
##$USERP3= <user>
##$USERP4= <user>
##$USERP5= <user>
##$WDW= 1
##$XDIM= 8192
##$YMAX_p= 0
##$YMIN_p= 0
$$ End of Bruker specific parameters
$$ ---------------------------------
##NTUPLES= NMR FID
##VAR_NAME=  TIME,          FID/REAL,        FID/IMAG
##SYMBOL=    X,             R,               I
##VAR_TYPE=  INDEPENDENT,   DEPENDENT,       DEPENDENT
##VAR_FORM=  AFFN,          ASDF,            ASDF
##VAR_DIM=   8192,          8192,            8192
##UNITS=     SECONDS,       ARBITRARY UNITS, ARBITRARY UNITS
##FACTOR=    0.0002768,     1,               1
##FIRST=     0,             0,               0
##LAST=      2.2672688,     0,               0
##MIN=       0,             -784878,         0
##MAX=       2.2672688,     1051642,         0
$$ Real data points
##PAGE= N=1
##DATA TABLE= (X++(R..R)), XYDATA
0 0 0 0 0 0 0 0 0 8 -8 8 -16 16 -24 32 -40 48 -64 80 -96 115 -136 165 -194 232 -272 318 -368 426 -492 566
30 566 -646 735 -839 950 -1072 1207 -1356 1521 -1701 1897 -2113 2347 -2603 2888 -3193 3528
46 3528 -3890 4294 -4732 5212 -5740 6323 -6970 7688 -8495 9398 -10428 11606 -12975
59 -12975 14582 -16506 18853 -21792 25600 -30746 38122 -49634 70247 -118635 469322 112761
71 112761 -96675 1051642 38851 -387237 510007 108961 -662086 78355 -19856 -662542
81 -662542 -181861 62208 -468169 -141966 197338 -135663 -72819 241462 -21975 -156464
91 -156464 60197 72816 -110043 -14101 214165 114391 -63905 244069 325373 -69056 145653
102 145653 472646 -84915 -128458 414674 -135679 -562692 131300 -114326 -784878 -82864
112 -82864 136929 -584230 -89367 418753 -252064 -51552 572146 8874 -58129 571744
122 571744 137520 -173586 379613 115608 -343513 120024 101094 -376072 -37411 181995
132 181995 -225508 -127011 172206 -83476 -195577 58252 31199 -149644 -40417 92967
142 92967 -62965 -137348 92061 83636 -139574 77741 264690 -48578 12606 333255 15719
153 15719 -135546 237915 13941 -284774 118171 55099 -357234 2982 126804 -339430
163 -339430 -83015 234435 -200052 -112339 314667 -38458 -152549 287229 72571 -201345
173 -201345 171993 136326 -197169 51427 160811 -150566 -49486 146626 -78199 -114359
183 -114359 103781 14465 -124281 24781 76321 -82391 -61385 76201 -15365 -102143 57032
194 57032 62281 -100214 25673 125529 -85972 -32267 168057 -45947 -111900 162334 19725
205 19725 -175432 106394 87330 -195858 26139 142409 -161224 -44340 172859 -95579
215 -95579 -99634 168019 -22815 -132631 138502 43036 -154877 77881 105058 -139819 -6828
226 -6828 131199 -84263 -78752 108707 -10813 -99560 65662 40479 -95279 21915 85830
237 85830 -66844 -29886 107365 -17917 -84543 89339 47878 -110210 32038 96360 -102702
248 -102702 -40636 118493 -57267 -99708 104071 562 -128153 71272 56462 -126152
258 -126152 34234 105939 -109109 -18605 144771 -58892 -80255 140642 15346 -118088
268 -118088 86462 71401 -118308 16139 93927 -97439 -44916 100724 -54635 -93036 88099
279 88099 6557 -116101 50834 69718 -99271 2790 111281 -56025 -49422 114656 -1802
290 -1802 -90940 81001 51585 -99017 32833 88085 -89198 -26477 101403 -62351 -84718
301 -84718 99374 -2239 -121791 59989 60445 -118384 681 98468 -75519 -42094 114721
312 114721 -17764 -70979 104443 35152 -98582 55978 78933 -95274 -4834 102289 -66181
323 -66181 -66354 89850 -26365 -107911 62701 31014 -110786 25875 82420 -84208 -21117
334 -21117 104428 -42113 -62064 106116 17356 -87540 75564 71737 -95918 6550 94086
345 94086 -71045 -53733 90102 -25337 -86824 66774 15345 -106568 29719 60655 -93441
356 -93441 -10197 100708 -48397 -55280 99165 1697 -86954 68827 52997 -86341 28066
367 28066 90553 -65300 -25737 93865 -33391 -69675 74774 6601 -92154 40889 42412
378 42412 -99701 -11567 69315 -70551 -53792 84949 -4497 -65453 71960 46809 -64524
389 -64524 37799 74690 -56527 -5356 86563 -39584 -58925 70586 -9227 -95607 38480
400 38480 34907 -90821 7649 76184 -60377 -29942 85929 -23954 -63277 69136 15238
411 15238 -74895 40555 44946 -73084 6515 69587 -50762 -25363 84867 -5784 -52982
422 -52982 62955 29906 -68369 11975 40519 -63033 -28431 44468 -39330 -51753 47724 1444
434 1444 -59382 40939 50183 -47537 16722 77877 -30494 -24761 72420 -13632 -65369 47959
446 47959 13969 -80722 19467 43713 -68753 -5998 64505 -44812 -27932 74821 -15273
457 -15273 -54525 60150 14491 -71138 24919 38273 -59727 -3959 51245 -31090 -17537 56069
469 56069 -2524 -30343 44123 20870 -41136 12690 33707 -38306 -25409 31248 -20198 -47543
481 -47543 25088 12355 -48782 13731 44749 -35470 -6578 60620 -17016 -31556 57403 604
493 604 -54592 43838 22967 -68753 19065 48901 -60209 -8757 63980 -35998 -30117 61673
505 61673 -14191 -45897 50353 5185 -58925 29000 26400 -56189 3048 41447 -35102 -17479
517 -17479 42423 -7051 -26167 30898 15432 -26720 9373 27738 -18225 -14003 28133 -3043
529 -3043 -31412 20719 17101 -39921 5388 38893 -37141 -19863 52986 -17947 -44369 48676
541 48676 6143 -57535 34206 27320 -60344 17610 46427 -56763 -4488 63870 -39107 -29837
553 -29837 66303 -11322 -47194 52064 14622 -51065 28363 30271 -44956 3327 34737 -31084
565 -31084 -16869 29512 -13374 -27190 19006 5987 -27616 3691 23055 -16089 -15843 29681
577 29681 7062 -30041 18689 29646 -32035 -1000 43151 -25964 -21651 50311 -13291 -44231
589 -44231 48810 8942 -62640 31846 34544 -65139 5596 51139 -53270 -18680 59204 -31494
601 -31494 -36667 57151 -5074 -45833 44825 18842 -45115 25660 32969 -39034 2594 39378
613 39378 -24471 -20192 31393 -3512 -30816 12273 14249 -24714 -7214 21265 -11223 -21394
625 -21394 22777 7688 -32710 14094 30716 -33361 -5489 48002 -20224 -28161 50097 -1094
637 -1094 -45406 40827 18611 -56827 21046 36628 -55899 -2871 48482 -43503 -23530 53427
649 53427 -22442 -38881 50471 3939 -47616 33343 27516 -41195 9170 35317 -26708 -8776
661 -8776 32622 -11433 -20589 24571 4711 -27312 7978 20449 -20808 -13154 23405 -5038 -28217
674 -28217 16373 13645 -32000 3889 29946 -26040 -10775 41147 -12188 -26023 41996 4486
686 4486 -39153 33377 22062 -48908 13266 38093 -45919 -11965 46503 -27475 -30832 41442
698 41442 -6261 -37094 31889 10721 -38410 19016 25672 -33440 758 33934 -19538 -17085
710 -17085 29481 -461 -23624 17206 14018 -22093 1305 21747 -13790 -13691 21325 -1724 -24858
723 -24858 14226 12775 -28215 2638 26297 -24093 -13221 35413 -8576 -27907 31820 9994
735 9994 -35417 17968 23954 -33101 2821 30733 -27822 -11706 35805 -16135 -25832 32923 893
748 893 -34337 21724 17929 -32099 5646 26544 -22952 -8684 28634 -9105 -19258 22425 4265
761 4265 -23100 11901 15358 -21596 -1979 21464 -13765 -15096 22096 406 -24533 12842 14891
774 14891 -23117 975 23510 -15713 -10630 24890 -6600 -19984 23524 5426 -27905 14378
786 14378 19169 -27486 435 27903 -19174 -13951 28034 -6609 -23076 22645 5373 -28167
798 -28167 12033 16636 -25783 25 24141 -17706 -11810 26603 -4734 -20851 21291 9570
810 9570 -24297 8293 19392 -18992 -5270 21444 -10667 -14907 19634 -519 -20868 14546
822 14546 11563 -23035 3516 22052 -16768 -10423 23695 -5698 -20195 18374 6299 -23510
834 -23510 9322 16252 -21337 -1509 22891 -13581 -12170 24009 -3313 -21170 19405 9007
846 9007 -25522 8163 19767 -21918 -5816 24459 -10648 -15893 21421 267 -20791 15363
858 15363 9766 -22711 6288 18968 -19987 -6742 23718 -9659 -18462 20051 3711 -22488
870 -22488 10934 14609 -20200 78 20574 -13304 -9839 21559 -3484 -17811 17302 7003
882 7003 -22053 8534 17144 -20568 -4287 23253 -11235 -16446 20540 1379 -21753 12501 10927
895 10927 -20737 3366 17667 -17190 -6176 22390 -9049 -16879 20863 4027 -22314 11775
907 11775 15310 -20132 -140 20896 -13268 -10523 21013 -3657 -18005 15814 6452 -21118 7279
920 7279 15176 -19392 -3770 21134 -11636 -14863 20563 642 -21387 12752 12011 -19867 2461
933 2461 17996 -14593 -6393 20429 -6837 -14551 18797 3616 -20363 10566 14174 -19100 -1179
946 -1179 18872 -12113 -11278 17850 -2470 -17277 12866 6942 -18522 5049 14813 -15433 -4316
959 -4316 18785 -8234 -13171 17927 2067 -18914 11243 12527 -18642 448 18733 -12366 -8859
972 -8859 18545 -4383 -15276 15502 3798 -19880 8942 12550 -19118 -964 18892 -12149
984 -12149 -10516 18477 -2119 -15828 13458 6912 -16626 5911 13155 -13770 -3057 15417 -7812
997 -7812 -10541 13750 471 -15046 8668 8998 -15098 91 15100 -9381 -8644 15024 -681
1010 -681 -13592 10546 6313 -14926 4817 12160 -13918 -2575 17125 -8818 -10948 17207 -231
1023 -231 -17125 11398 8135 -17593 3705 13535 -14087 -4359 15245 -8176 -9949 14614 -435
1036 -435 -13220 10791 6630 -13626 4268 12238 -10499 -3895 13577 -3534 -10335 9304 3476
1049 3476 -11471 2845 7488 -9484 -2261 10309 -5572 -7861 11144 581 -12819 7746 8232
1062 8232 -13363 892 13388 -9960 -5916 14545 -4235 -11122 13297 2565 -13943 8880
1074 8880 8383 -14329 2863 12424 -11993 -4017 14201 -6721 -10329 12295 425 -13032 6687
1087 6687 6238 -10732 1415 8883 -7059 -2706 9537 -2957 -6871 7879 2928 -9299 2861
1100 2861 7768 -7531 -3615 9602 -2666 -7995 8391 3054 -10239 4888 7941 -10715 -662
1113 -662 11228 -8241 -6310 12222 -3981 -11447 11078 2651 -14021 6697 8968 -12556 698
1126 698 12022 -8096 -4370 11966 -4087 -7765 10515 564 -10523 6638 5663 -10296 899
1139 899 8887 -6276 -4243 8273 -1287 -7051 5118 3069 -7509 1188 6260 -6095 -3385 7976
1153 7976 -2246 -7226 7673 3170 -9753 4396 8613 -9394 -1437 11409 -5927 -7158 10942
1166 10942 -1213 -10295 8427 3127 -11844 5128 7417 -11390 491 11347 -7848 -5354 11503
1179 11503 -2444 -8810 8751 2613 -9245 4203 6140 -7810 -50 7804 -4862 -4397 7272
1192 7272 -418 -6768 4781 3727 -7492 380 7229 -5060 -4505 7895 -346 -7658 5811 4339
1206 4339 -8364 2236 7501 -7527 -1678 9778 -4990 -6204 10263 -645 -10481 7390 4801
1219 4801 -10998 2651 8160 -9162 -2175 9562 -5343 -5890 8980 -887 -8071 6811 3682
1232 3682 -8106 3107 6637 -6671 -1292 8333 -3355 -5456 6471 1403 -7359 2656 4636
1245 4636 -6167 -1185 6089 -3632 -4235 6480 -434 -7068 4811 4114 -8074 1048 7582 -6066
1259 -6066 -3320 8591 -2466 -6035 7858 1621 -8086 5213 5156 -8458 1314 7538 -6780 -2854
1273 -2854 8350 -3606 -6532 7367 785 -8291 3940 4548 -7258 73 6515 -4373 -2782 6302
1287 6302 -1545 -4985 5253 1945 -6452 2209 5168 -5266 -1436 6392 -2337 -4527 5427 886
1301 886 -6180 3302 3766 -6181 159 6070 -4666 -3158 6800 -1979 -6043 5803 1922 -7280 2995
1316 2995 5297 -6782 -549 7063 -4033 -3717 6508 -950 -5382 5316 1944 -6387 3014 4715
1330 4715 -6013 -312 6434 -3597 -3787 5591 -373 -5417 3727 2323 -5662 1262 4374 -4370 -1617
1345 -1617 5404 -2265 -4243 4656 560 -5545 2951 3483 -5251 -146 5609 -3014 -2844 5925 -193
1360 -193 -4485 4140 2297 -5357 2091 3833 -5195 -719 5539 -3616 -3638 5818 -543 -5520 4133 2690
1376 2690 -5734 1345 4628 -4459 -1206 5438 -2745 -3514 4731 25 -5158 3715 2661 -5034 1268
1391 1268 4569 -3865 -1438 5583 -1288 -3856 4206 1113 -4979 1798 2866 -4667 -316 4137 -3432
1406 -3432 -2448 5013 -756 -4231 4057 2166 -5020 1471 4417 -4392 -1509 4842 -2524 -3362 4523
1421 4523 -79 -4716 3564 2607 -4709 1300 4622 -3865 -1341 5037 -2219 -3983 4271 402 -5303
1436 -5303 2305 2768 -4922 230 4348 -3297 -1623 5134 -1118 -3583 4374 1254 -5102 2018 3346
1451 3346 -4514 -692 4547 -2695 -2755 4673 6 -4110 3517 2298 -4590 1299 3783 -4107 -1341
1466 -1341 4592 -2459 -3585 4322 231 -4802 2701 2860 -4768 472 4637 -3284 -2076 4670 -1143
1481 -1143 -3711 3938 806 -4977 2012 3261 -4531 -325 4864 -2571 -2793 4699 -42 -4023 3274
1496 3274 2224 -4500 1418 3735 -3992 -987 4751 -2410 -3327 4403 143 -4656 3034 2731 -4885
1511 -4885 437 4348 -3331 -2039 4244 -1390 -3354 3749 876 -4126 2392 2803 -3959 143 4249
1526 4249 -2661 -2373 4357 -310 -3891 2880 1967 -4270 627 3415 -3371 -1413 3936 -1938 -3246
1541 -3246 4001 368 -4475 2685 2753 -4253 300 4365 -3106 -1713 4921 -916 -3538 3813 949
1556 949 -4387 2003 2610 -4249 55 3667 -3213 -2194 4187 -1059 -3812 3135 1382 -4161 1129
1571 1129 3091 -3250 -936 3679 -1547 -2564 3369 422 -3357 2175 2424 -3400 338 3921 -2471
1586 -2471 -1890 4146 -690 -3630 2848 1427 -4434 1082 3082 -3890 -787 3969 -2248 -2271 4234 -434
1602 -434 -3801 3528 1619 -4441 1304 3255 -3579 -935 3791 -1983 -2213 3449 -58 -3388 2440
1617 2440 1730 -3276 815 3062 -2606 -1401 3214 -1020 -2777 2638 1107 -3346 1193 2555 -2761
1632 -2761 -705 3282 -1560 -2271 3107 251 -3438 2473 1693 -3810 645 3240 -3143 -1297 4144
1647 4144 -1506 -2935 3469 477 -3622 2488 2042 -3508 922 3177 -2951 -1138 3518 -1435 -2760
1662 -2760 3081 340 -3456 1806 1958 -3005 44 2802 -1803 -1243 2687 -293 -2486 2105 1009
1677 1009 -2782 829 2429 -2427 -586 3050 -1018 -2272 2770 623 -3161 1564 2068 -3198 -76
1692 -76 2940 -2322 -1649 3455 -979 -2979 2983 576 -3249 1826 2456 -3173 97 3289 -2225 -1338
1708 -1338 3138 -662 -2516 2678 870 -2931 1334 1966 -2580 -129 2647 -1673 -1586 2712 -84 -2646
1724 -2646 1590 1314 -2663 288 2469 -1917 -1364 2671 -585 -2169 2416 891 -2824 1280 2182 -2680
1740 -2680 -259 3019 -1691 -1714 3243 -237 -2659 2243 1119 -3044 1147 2442 -2561 -392 2939
1755 2939 -1499 -1811 2793 -309 -2619 1847 1197 -2685 695 2428 -2028 -850 2494 -730 -1936
1770 -1936 2112 313 -2629 1094 1748 -2310 -25 2437 -1587 -1310 2540 -58 -2245 1846 1276 -2567
1786 -2567 731 2262 -2253 -808 2689 -1197 -1883 2412 208 -2539 1813 1456 -2786 501 2547
1801 2547 -2151 -1047 2721 -1062 -1948 2222 309 -2254 1455 1578 -2305 286 2385 -1532 -1216 2353
1817 2353 -625 -2170 1664 782 -2393 816 1749 -1950 -604 2155 -940 -1677 2119 175 -2096 1365
1833 1365 1181 -2283 68 2197 -1576 -944 2529 -604 -2029 2097 774 -2520 1039 1528 -2072 -152
1849 -152 2304 -1361 -1225 2146 -281 -2156 1713 748 -2226 669 1600 -2082 -218 2121 -1103 -1485
1865 -1485 1972 190 -1990 1209 1133 -1967 190 1823 -1314 -884 2031 -486 -1686 1640 684 -1939
1881 -1939 886 1516 -1736 -330 1879 -1028 -1367 1730 -305 -1937 1361 644 -2082 623 1652 -1603
1897 -1603 -519 1962 -948 -1205 1987 271 -2019 1206 1058 -1817 293 1632 -1401 -598 1857 -738
1913 -738 -1325 1535 243 -1915 962 1236 -1654 -48 1737 -1068 -933 1459 -301 -1536 913 593
1929 593 -1800 593 1393 -1219 -512 1704 -548 -972 1784 329 -1734 1085 1016 -1551 81 1522
1945 1522 -1125 -598 1636 -497 -1400 1224 375 -1710 767 968 -1471 -173 1352 -1193 -934 1489
1961 1489 -306 -1459 1300 593 -1366 543 1224 -1183 -148 1587 -700 -852 1402 -38 -1583 1009
1977 1009 757 -1639 60 1357 -1120 -680 1448 -412 -1081 1316 315 -1173 639 798 -1476 -45
1993 -45 1338 -948 -743 1158 -11 -1182 1016 463 -1322 569 1185 -1264 -217 1365 -666 -837
2009 -837 1201 -43 -1368 969 695 -1432 238 1135 -1000 -447 1304 -545 -950 986 335 -1338
2025 -1338 627 657 -1234 133 1140 -855 -655 1260 -26 -1163 987 522 -1235 421 1001 -915
2041 -915 -157 1226 -474 -674 1126 4 -995 768 604 -1139 154 1081 -1037 -355 1209 -480 -1016
2058 -1016 1068 66 -977 605 812 -1019 229 946 -641 -432 1213 -262 -901 1015 614 -996
2074 -996 289 716 -1032 -145 921 -479 -795 1030 -148 -987 582 486 -1056 461 819 -778 -317
2091 -317 1025 -299 -631 1074 252 -945 511 549 -886 -49 1075 -599 -380 1088 -213 -720 768
2108 768 134 -1028 427 775 -875 -177 1042 -589 -766 925 81 -936 842 411 -1020 133 805
2125 805 -887 -407 925 -462 -705 781 113 -842 481 687 -876 87 911 -595 -186 785 -103 -704
2143 -704 549 32 -826 318 553 -906 -253 783 -473 -459 711 -48 -702 480 305 -649 106 685
2161 685 -562 -256 889 -154 -677 726 116 -759 492 611 -927 148 825 -506 -208 897 -169
2178 -169 -619 711 122 -734 324 458 -727 -73 728 -625 -329 939 -20 -796 740 320 -608 346
2196 346 573 -456 -155 786 -200 -222 620 50 -883 253 334 -574 172 668 -641 -382 625 -225 -512
2215 -512 456 192 -664 233 540 -640 -57 732 -346 -341 740 -92 -651 669 252 -646 200 603 -359
2234 -359 -121 659 -312 -424 633 15 -674 315 150 -767 120 482 -446 -223 454 -227 -522 560 -132
2253 -132 -665 313 390 -488 -9 467 -367 -268 555 -145 -591 377 258 -646 192 522 -364 -55 738 -229 -290
2274 -290 674 154 -574 356 276 -602 54 449 -663 -188 569 -304 -353 453 159 -615 467 300 -590 182
2294 182 530 -418 -203 520 -295 -351 614 252 -549 239 365 -661 -12 540 -249 -281 487 -188 -405 243
2314 243 363 -544 77 579 -358 -243 509 -50 -320 428 203 -542 301 444 -521 113 651 -388 -146 643
2334 643 -400 -287 444 20 -617 127 353 -559 -33 438 -298 -273 480 34 -411 345 93 -617 76 303
2354 303 -464 -121 460 -184 -203 557 193 -407 176 394 -397 30 361 -529 -202 368 34 -427 390 -29
2374 -29 -582 19 317 -383 -124 433 -222 -355 537 -76 -430 556 172 -495 -56 458 -470 -227 608 -148
2394 -148 -202 498 178 -425 319 257 -515 -28 419 -365 -150 468 -185 -416 183 106 -439 313 367 -363 82
2415 82 272 -196 -234 280 -56 -299 434 191 -380 38 244 -396 -18 516 -100 -325 456 -47 -239 173 286
2436 286 -300 -42 39 -330 -174 302 -63 -515 330 92 -175 163 280 -305 48 507 -13 -151 499 -8
2456 -8 -335 362 157 -331 76 192 -340 -124 490 -79 -386 296 90 -310 389 251 -429 -52 231 -18 -76
2477 -76 251 -111 -316 273 130 -263 295 255 -282 -75 453 -266 -238 244 -8 -272 414 161 -284 121 273
2498 273 -239 -134 231 -8 -388 151 81 -449 103 163 -248 138 269 -190 -274 323 -74 -314 320 211 -355
2519 -355 -23 229 -244 103 417 -260 -242 383 -30 -331 119 137 -316 74 255 -408 -28 221 -27 -132 176
2540 176 18 -236 176 88 -143 61 181 -263 -41 395 49 -334 147 113 -223 182 281 -125 23 314 -34
2561 -34 -206 204 -124 -209 190 -43 -272 -114 324 -347 -199 178 -60 -160 94 65 -182 120 189 -300 82
2582 82 148 -64 -188 372 116 -212 178 205 -168 35 195 -330 -34 240 -152 -374 223 -54 -296 270 133
2603 133 -387 189 222 -179 0 242 -109 -27 118 145 -96 -75 174 -310 -7 -6 -165 48 312 -81 -112 127
2625 127 24 -203 282 101 -73 -18 98 -69 -130 132 28 -283 194 112 -99 -37 196 -128 -191 77 -81 -216
2647 -216 63 220 -76 160 129 -295 81 264 -55 -16 203 10 -26 223 31 -309 72 116 -97 -83 169 -126
2669 -126 -258 171 -26 -82 212 139 -54 122 6 -131 -6 143 -169 -129 -4 20 -187 18 120 -167 -24
2690 -24 288 23 30 169 -130 -67 -56 -101 -92 -10 195 -55 42 -13 92 -34 10 -15 0 -90 91 3 -4 209 19 -17
2716 -17 53 -124 -178 230 123 -103 79 221 -113 5 -87 -27 -139 12 -34 -103 180 -85 124 41 70 -238 -87
2739 -87 60 60 9 223 64 50 218 123 -40 12 -32 -178 88 87 128 -198 146 -48 -250 25 97 -218 26 56
2763 56 98 -28 170 -43 -216 129 25 -43 83 137 -35 -97 -69 25 -123 32 24 -103 247 42 -57 19 -76 64
2787 64 -29 -49 -76 69 72 -40 8 226 -45 -38 76 -140 -47 -227 -83 -72 -29 58 47 101 -132 126 -15 -101 -72 -26
2813 -26 34 -136 -23 5 101 134 -175 -56 117 -119 -28 92 -8 202 -73 -39 -151 -138 -2 -4 -112 -64 125 -89
2837 -89 -22 125 -130 60 65 -98 89 -72 -83 -66 7 -145 -35 70 108 -113 72 117 -70 -62 -328 77 -92 33
2861 33 74 -51 160 -31 21 -33 -40 27 63 50 56 23 -33 -67 22 189 -91 -45 17 -1 -33 80 59 28 35 7 -56 -100 95
2890 95 -107 -53 -105 30 94 -2 -83 -91 -86 -80 141 20 163 135 -19 44 2 54 -135 9 1 70 88 -62 -89 48 167
2917 167 37 -102 -63 -9 3 100 -7 -2 -16 134 -17 17 76 -109 -15 212 49 59 -150 19 0 35 75 145 -31
2942 -31 -28 59 138 -94 -233 -21 18 189 31 50 -128 -125 -21 -58 -45 54 -51 -58 142 -129 125 126 54 -10 12 -125
2968 -125 3 22 55 -97 2 74 -29 31 33 82 14 -8 144 89 -96 -43 -75 -32 -43 1 -36 49 -29 -167 15 -8 100
2995 100 -200 18 127 -138 -42 -2 4 72 106 -35 75 172 47 22 136 80 -80 190 46 -134 11 -103 -282
3018 -282 -51 -26 -253 -136 96 17 -13 20 58 -32 1 128 -59 -50 124 152 -18 27 133 5 102 22 87 0 43
3043 43 23 -22 38 -34 49 -48 39 -17 -94 -54 -44 -146 45 -69 33 160 69 -56 47 171 -170 25 119 64 -72
3068 -72 25 72 62 -24 -41 18 12 170 68 146 145 -12 -64 -193 44 -61 -27 41 -82 -94 348 23 -118 91 31 7
3094 7 -132 84 -138 -87 214 -136 -150 -18 -116 -3 4 12 -138 39 -35 -127 30 -82 61 -108 152 1 84 97
3118 97 -70 -5 1 -173 -135 -34 10 -167 -14 31 58 -132 12 -93 6 108 7 -36 -15 -19 -77 -120 200 127 -153
3143 -153 -131 128 -18 28 152 -133 -8 99 -155 41 30 -234 -171 -61 62 -118 36 -48 -13 12 -4 47 -140
3166 -140 106 -30 -11 184 -52 85 16 196 23 -93 162 89 -142 166 15 -125 132 -38 19 -6 -83 -39
3188 -39 -91 92 -7 70 45 -61 106 195 185 56 104 104 10 1 -119 -47 -90 -16 102 -77 -129 14 -24 -112 86 -119
3214 -119 -232 -15 -119 -138 -15 29 -59 -17 -100 41 -81 131 195 -1 -69 -25 -12 139 -9 -197 -111 106 27 -40
3238 -40 165 199 56 44 46 -55 -150 95 -15 70 -13 44 -41 275 84 -93 -87 86 -72 -8 101 94 -56 269 -102
3263 -102 -98 -44 -71 82 -55 146 38 21 -33 -85 -62 163 48 -204 -155 164 -96 5 44 -75 -6 138 -92 29
3287 29 99 -91 -229 10 133 -2 -4 -1 14 -114 174 -142 11 -44 -42 -95 24 -64 -129 -69 11 -16 -4 16 -75 -113 78
3314 78 37 -47 120 62 -117 -59 174 37 -170 -10 -36 -84 -138 175 92 -51 112 -17 -1 78 135 -15 -14 80 -97
3339 -97 -105 -53 -229 -38 42 38 5 166 85 -65 -105 186 -4 -135 92 -31 33 168 82 -30 46 113 -22 123 156
3364 156 -57 65 -159 -26 -124 -78 122 -126 -16 -49 -37 21 58 -69 67 8 -5 -86 17 20 59 -79 136 -174
3388 -174 -108 30 -18 -20 99 190 30 46 239 47 -189 104 57 22 -65 -112 114 29 70 -84 -10 -73 -44 -17 190
3413 190 -4 18 23 256 45 50 57 47 29 60 77 112 159 126 24 112 -63 -119 34 34 -136 113 49 -130 16 11 116
3440 116 -85 52 39 171 64 -132 53 -36 162 -3 -185 270 75 -50 206 -10 7 119 -80 -18 29 -8
3462 -8 91 67 -162 -50 -12 -66 -23 -231 44 -260 -20 -1 -24 123 -81 -61 117 -90 18 -110 25 -7 20 102
3486 102 -15 6 205 -85 -101 -10 113 101 66 -141 39 -116 -25 -146 -48 -69 -90 114 -44 -32 17 47 42 132 4
3511 4 -68 -46 158 75 7 15 -2 -9 -33 115 36 6 158 -8 26 -54 18 -9 9 94 -63 -176 174 -24 -222 -41 -78
3538 -78 5 -32 -53 85 -173 173 -46 -13 -95 135 18 87 -28 -165 26 77 26 -27 141 19 247 209 49 -143
3562 -143 -4 -29 52 70 -57 -32 -104 29 -4 -19 79 -133 -176 -28 156 162 -138 257 -80 -49 162 -20 -67 12 42
3587 42 -27 -48 -140 211 -26 -13 -76 -183 -75 -38 -103 -99 -48 -118 -146 12 58 34 -91 -18 59 -97 26 -14 -20 6 -140
3614 -140 -102 111 47 -38 239 48 68 36 164 -7 -81 -78 -120 -143 41 -3 -71 34 -12 112 -14 105 85 -33 5
3639 5 -61 -74 41 -3 -165 -24 26 153 51 16 -124 92 137 54 139 -133 -23 -20 25 -35 40 161 -66 30 -116
3664 -116 59 -96 -62 11 82 17 264 78 -18 -100 86 -37 -71 59 -57 106 28 11 -186 -35 104 117 115 226
3688 226 38 -33 101 141 -242 -103 39 60 22 98 -7 102 -183 -30 15 24 78 -76 139 36 2 -123 17
3711 17 216 -63 -63 -50 -104 116 -110 -88 -43 -78 -94 -14 -87 51 -126 -148 -88 16 -33 -9 -83 -178 -13 -55 39 -71
3737 -71 -115 170 14 138 -39 95 -130 -101 66 134 69 -118 79 24 -82 63 1 59 -23 -11 -19 -123 38 -36
3761 -36 37 -32 153 46 -39 -136 -9 -96 -20 -94 -78 21 -32 136 128 -195 -8 73 -173 -50 -10 52 -135 -13 59 34
3787 34 19 32 38 -15 50 -20 -199 -37 44 -83 -133 18 -170 -41 -41 27 -233 152 -26 -59 -30 -8 -21 -52 136 -140
3813 -140 -14 135 -39 31 -40 96 110 70 -82 82 -182 -61 35 94 -119 27 105 -59 16 -22 -18 168 59 143
3837 143 36 101 164 -28 145 -95 -45 150 127 -110 -40 -169 154 -85 171 -219 16 3 -216 36 27 -4 -47
3860 -47 108 -86 11 -2 6 14 -55 26 -170 -36 18 58 -120 -72 11 106 36 4 -1 9 76 -5 26 67 106 -130 -32 -101 27
3889 27 -76 -100 26 -59 -100 154 9 161 -38 37 103 -9 -138 3 71 -125 -75 -156 182 64 -3 5 55 -1 -36
3914 -36 -81 -66 -39 -145 -90 -107 -22 1 93 -25 91 46 -78 -90 4 -6 -4 -12 52 30 -123 51 140 -65 -10 97 27
3941 27 69 36 129 -207 -8 80 93 96 180 -90 -20 30 69 -32 68 -51 107 17 -7 80 2 15 23 53 52 135 -9 114
3969 114 155 156 38 134 -7 -114 -99 -114 -109 57 -132 101 -38 18 8 -102 -101 -63 -76 -3 106 -56 -96 65 106 75
3995 75 -9 81 96 172 73 61 -24 -71 19 -44 31 103 173 27 28 115 6 -177 56 46 -33 -212 -131 -42 13 -43 48 126
4023 126 -60 -47 -50 155 45 100 -98 -13 72 108 -49 103 59 -6 -32 52 48 94 58 18 -50 39 -79 -100 -75 -159 83
4050 83 129 -207 -39 60 8 52 7 71 -158 7 -91 12 131 104 -95 21 -163 -87 -106 -107 -226 -41 -78 -65 20
4075 20 10 164 67 -6 239 -73 -24 96 24 -35 34 -52 120 -35 -68 204 72 61 -102 166 61 119 -40 47
4099 47 239 64 106 -39 80 85 16 -70 51 -139 -57 139 -13 -65 -91 -43 -70 15 -3 -138 -69 -94 108 -105 -21
4124 -21 -72 -103 151 -95 -106 -2 -62 -104 78 -49 117 -74 86 58 106 -17 43 -39 7 2 -147 -51 69 36 -96
4149 -96 3 -35 -91 -81 -11 -208 -76 -20 72 -94 -100 -28 8 -79 -81 34 -155 -139 49 18 24 98 -5 -60 94 -30 105
4176 105 125 133 25 -207 81 7 103 -18 -187 55 97 -56 -106 -82 53 174 -39 53 215 66 113 72 -3 -165
4200 -165 38 -33 20 62 7 140 -227 -143 -81 48 20 -33 120 -34 41 -80 78 -92 -88 48 -31 -53 -58 -25 152
4225 152 0 79 -27 42 -69 191 -27 19 10 -40 31 -18 -13 -13 58 21 95 -78 -37 78 -33 -95 -42 80 11 -108
4251 -108 106 75 -100 51 81 55 72 -32 28 -155 80 -122 2 35 163 -126 97 106 59 129 67 69 -96 59
4275 59 8 -20 -38 52 -43 189 -94 63 -11 -48 174 -36 84 160 -95 -60 37 3 19 158 -38 141 119 -199 -74
4300 -74 -15 -20 57 -30 77 -56 -134 -32 -37 -54 -11 96 36 142 40 4 177 -82 5 85 32 -50 -71 -111 7 106 -97
4327 -97 -38 28 -91 46 148 -13 -28 -26 -93 122 55 84 -39 -46 -47 109 3 4 -98 2 2 29 -17 137 -89 25
4353 25 214 100 -4 -21 85 -42 -5 33 -132 8 68 -16 51 39 91 134 -41 -34 63 150 -53 -88 -94 -54 25 57 -61
4380 -61 -61 -17 87 -37 -55 0 -22 170 14 -82 -5 40 129 -55 55 -4 241 102 122 51 -40 129 155 195 8 218
4406 218 2 -18 -1 214 199 -92 88 -27 3 -76 -1 16 2 -65 -18 -47 48 -94 -102 -77 116 -104 94 -40 -16
4431 -16 77 89 119 -111 55 67 -65 66 109 -128 -60 265 67 10 19 -52 -108 14 65 -37 -123 58 146 -94 -92 -40
4457 -40 9 84 -100 -18 -31 -53 -33 102 7 14 -9 -33 37 56 89 15 -115 85 23 -55 128 64 171 -17 121 -115
4483 -115 -115 215 71 -17 -27 -112 130 54 148 -67 196 -115 19 304 31 107 -43 17 5 -93 -10 -44 74 194
4507 194 108 -23 -50 21 -119 -41 49 35 85 -92 -8 -159 151 292 -39 32 -65 89 -7 260 -25 -113 28 16
4531 16 -63 -97 -68 105 -151 -17 52 7 34 -6 -56 -35 -4 -1 -97 -5 55 -33 -72 19 186 -116 11 170 64 67 -14
4558 -14 -27 53 -11 -75 -72 -8 -37 67 -51 28 -54 -60 85 -124 25 31 -34 -145 15 -9 147 79 89 -29 -84 22 -47
4585 -47 47 -62 -20 -7 -65 -163 -30 -32 -19 -23 -166 -75 -141 96 61 -16 4 42 -58 -2 -54 2 -62 145 126 -111 169
4612 169 17 -83 -166 34 -24 -89 69 -124 19 23 44 -189 57 -211 11 -83 -47 -98 -75 -148 -21 1 -8 39 -2
4637 -2 -59 169 -36 -19 -89 77 80 -78 -155 67 85 115 11 7 25 -93 -78 102 -51 -68 -40 -27 -66 12 60 -3 31
4664 31 -38 -21 23 34 83 -48 -188 195 117 18 -9 76 277 98 -51 -73 60 -25 -16 14 -84 -44 95 100 -23 -26 98
4691 98 -58 -53 25 34 -173 -67 53 169 17 128 7 -41 -49 211 -2 73 26 87 156 49 -87 -27 -29 110 155 12
4717 12 64 26 -147 -101 -48 -108 68 161 -98 168 -62 -138 80 -116 25 -20 -24 7 31 37 -12 -34 -42 -69 -127 -123 172 -106
4745 -106 85 -30 145 19 -79 98 -13 105 133 -65 93 39 24 -8 143 -78 -99 -33 -60 57 43 -175 150
4768 150 40 -35 -70 -278 202 122 46 18 102 98 60 -64 85 -63 -1 89 145 113 -118 -104 71 80 -160 -117 -53 84
4794 84 11 42 43 44 0 63 -34 -11 -33 -59 -104 -18 -60 -150 47 -9 -69 126 93 -157 115 -11 -84 -19 81 1 -48 50
4822 50 -61 23 73 -114 -76 -55 1 77 102 173 76 -58 80 93 -41 33 140 -85 -22 116 -74 -11 65 14 -77 -126
4848 -126 27 4 -41 51 -26 30 -106 172 30 54 -33 -195 3 44 -84 -162 -49 138 -49 0 166 -19 59 45
4872 45 -136 124 38 -78 -56 146 0 19 1 88 -52 45 105 164 47 72 31 95 198 -49 162 -60 -18 176
4896 176 73 119 -29 33 28 32 25 93 210 21 214 -32 -100 50 105 101 11 77 112 -136 -81 -44 82 60 -24 194 113
4923 113 18 -179 -1 56 -95 130 169 35 7 42 -12 95 76 93 -27 94 148 -14 -155 29 3 -131 52
4946 52 48 19 81 201 -147 84 -44 -6 -36 167 17 -110 -116 130 -134 13 -12 135 178 111 60 42 27 72 68 63 112
4973 112 -182 97 -84 -13 -97 304 -135 -142 15 -56 -113 -25 -25 -34 44 70 -26 60 -79 -14 89 -21 -21 -72 -2 23 166
5000 166 151 -16 -83 141 -80 126 69 26 -15 -147 59 -28 40 64 30 104 -3 -210 18 39 72 26 33 78 5 -45
5026 -45 -32 -161 -98 -37 -134 45 19 -84 -96 123 102 -59 46 -155 -68 -1 -62 32 35 104 31 -33 25 109 -38 24 44
5053 44 -24 67 -98 -105 10 135 -65 4 0 74 57 31 21 22 -39 46 7 -130 97 87 -61 -54 -100 -35 -8 -57 106 -3
5081 -3 -129 214 -64 25 42 40 164 -68 119 -7 34 43 -35 151 -2 -33 -70 -97 93 -37 31 22 106 -26 28 -46
5107 -46 -65 38 -77 169 -73 16 11 -59 255 -105 -153 -138 25 95 38 -14 3 4 95 62 -267 -134 13 15 -19 173
5133 173 294 57 -39 -142 -25 -106 34 34 92 -113 -25 -16 -115 69 40 3 7 58 -83 -12 -92 -73 9 -7 38 -152 -98
5160 -98 65 5 174 80 -64 -82 -51 -22 19 -73 -13 90 -34 23 -13 -47 119 16 99 71 -137 33 -22 -54 -12 2
5186 2 29 50 -53 89 35 -12 -24 148 48 58 -35 -145 77 -92 -63 14 -85 -96 -47 10 -104 -27 -27 46 -56 144
5212 144 30 33 14 -32 186 -84 -172 -48 30 -45 114 37 -9 -24 109 206 -110 -74 -61 45 -24 -172 -68 29 -50
5237 -50 -102 23 110 -167 225 3 93 178 -71 -66 34 -148 -64 83 8 45 -108 16 36 55 70 -65 -28 138 149
5262 149 -9 139 107 60 -46 10 -67 18 37 99 -105 165 139 -21 25 -175 142 -41 50 -92 -6 -8 -7 -101 16
5287 16 191 72 -77 -99 24 10 14 45 136 62 -127 106 -52 55 -20 127 59 -64 69 -6 -97 42 25 -16 33
5312 33 -13 79 -121 -29 -208 36 14 -70 -26 21 88 40 118 37 177 77 31 115 61 -150 83 -44 36 234 93
5337 93 60 67 -9 -19 -102 50 58 -20 208 132 -141 74 -36 -15 79 89 -75 -6 -12 23 66 32 -39 -148 24 52 116 90
5365 90 -30 -3 -11 239 71 -206 70 -34 59 16 104 13 -108 46 -44 23 99 90 -94 -94 -45 77 37 -58 202 4
5391 4 42 -23 -40 -11 147 -56 -229 -22 21 -33 -128 118 -5 34 91 -85 108 -60 44 -3 117 70 19 114 -71
5416 -71 108 -100 -59 22 55 85 -40 85 -54 -39 10 37 33 21 34 -83 -27 -34 27 75 72 -201 -92 35 11 -108 24
5443 24 38 -96 -63 8 28 53 -82 -162 -34 27 -163 -54 -51 -69 -85 -64 -43 149 34 -120 -81 -262 -188 5 -149
5468 -149 -165 89 43 -44 64 1 -211 185 -106 -10 123 87 -45 -69 -21 -201 -9 8 -12 -12 134 -80 -85 -132 -62
5493 -62 -3 -58 123 -84 -60 -105 -39 127 -64 -15 66 -112 41 -16 -28 -1 59 -159 -19 17 -90 -10 79 101 114 86
5519 86 -1 9 -89 31 -43 25 27 96 -43 -110 -88 -17 60 -25 -90 89 -118 108 -133 -152 83 -156 -92 -209 26 115
5545 115 -89 -87 -31 116 87 96 64 132 -79 77 -31 23 -22 -19 29 -35 -8 25 2 92 -44 -36 130 -45 -92 0 44 -62
5573 -62 -52 89 40 87 -44 7 88 164 -85 12 119 125 -112 66 -68 -44 61 -61 27 -18 -25 44 -20 -5 42 -45 -24
5600 -24 15 29 35 -154 -1 62 6 -149 194 75 21 -10 145 -116 -12 11 137 173 -154 74 2 -24 -18 -7 279
5625 279 -107 43 22 -68 -39 -60 -158 122 -97 39 -38 118 -96 84 40 -25 -117 -37 20 -51 234 -58 218 -94
5649 -94 -75 -44 -109 -60 81 75 -36 -51 24 -77 -49 18 32 -151 -67 111 143 -77 150 -52 -103 -38 37 -85 80 -116
5675 -116 -145 -39 -99 34 -24 190 190 9 -155 -116 5 24 30 -84 41 -22 114 90 49 -98 47 -19 -131 -168 25
5700 25 -84 -44 136 97 113 -161 -36 51 63 105 -149 39 -92 -14 -64 74 12 -27 135 -120 41 -62 -8 -38
5724 -38 0 -43 -56 103 -6 -228 80 -18 222 -30 36 51 -190 -124 176 -115 30 73 -54 53 -55 124 34
5747 34 -124 -18 -91 -20 95 -57 -28 -88 -17 64 64 -23 -13 -155 41 -155 -101 5 -8 329 -52 95 42 74 -105
5772 -105 58 -45 131 61 -15 139 12 -73 224 -94 -51 46 22 82 126 34 -56 36 -41 -76 81 -91 222 -80
5796 -80 68 41 -104 -53 -2 97 -178 -152 48 37 20 28 57 14 83 0 124 -139 -4 -70 103 -232 92 -96 9
5821 9 -110 -38 5 -104 -77 -34 19 -198 150 6 -130 111 -93 34 101 3 -24 20 11 -30 9 -19 54 43 73 61 -73
5848 -73 -4 46 69 -36 78 -128 57 -10 -158 -36 -25 -8 18 -47 183 109 73 18 27 43 184 51 69 26 -27 9
5874 9 -42 -108 -5 76 -101 -48 69 211 -94 -40 -11 -39 -14 83 138 -36 25 -73 -34 48 -65 164 42 -225 -59
5899 -59 118 -76 74 22 -4 -67 -130 2 20 46 63 18 37 137 -182 33 182 -86 -75 58 127 -24 84 158
5923 158 92 -47 -108 -121 -98 171 -11 -50 -31 24 -60 -125 96 -15 0 27 -5 -8 -80 12 -35 -212 -4 34 65 7 7
5950 7 171 -7 102 85 -120 74 -49 26 69 -181 80 -50 -160 -52 66 -36 51 108 -53 62 -77 -115 -82
5973 -82 71 -8 -10 -152 29 56 -237 -68 83 60 -95 -144 -68 24 -28 -131 -73 -62 4 43 15 -66 -22 -87 -46 12 51
6000 51 34 78 138 -152 44 18 175 34 244 -18 41 86 -75 70 63 47 24 8 -2 107 -1 -34 -74 68 -54
6025 -54 109 -63 -44 -13 -55 -61 -19 55 87 -146 71 16 79 29 24 131 -273 -61 35 49 -73 -102 -31 59 18 -8 -35
6052 -35 -28 70 42 170 -49 108 225 -111 120 -90 -4 128 12 -121 9 -12 40 27 -50 106 -22 -43 -91 26
6076 26 64 -183 -2 77 21 112 117 47 -144 42 17 17 -65 -156 35 30 -69 20 -2 98 89 -101 75 78 25 111 -113 52
6104 52 19 -6 -94 131 -5 -87 60 143 14 61 -45 33 -140 -49 -161 -57 -91 41 -41 -80 -40 33 103 -17 -83
6129 -83 23 122 -67 -7 -71 71 -181 79 -182 -3 -1 -62 115 -149 -100 163 -96 -177 30 33 -27 -99 -103 -29 185
6154 185 7 73 -10 27 -207 -27 -32 32 -55 115 192 -20 -36 -92 -54 -140 139 18 255 -91 -49 18 -88 -11 119
6179 119 -32 -196 188 -1 3 -24 -47 63 -23 84 35 151 168 -55 10 -13 11 -57 82 -191 122 3 15 -13
6203 -13 200 -186 -39 -124 -77 -18 44 148 35 -66 -147 151 31 119 -30 30 99 -20 -122 -21 -61 -159 -158 -85 -155
6228 -155 68 15 -34 175 56 -118 96 -21 140 133 -55 -26 -74 6 -103 -122 -117 75 -24 -70 64 150 40 60 55
6253 55 148 188 27 -165 -40 34 246 137 27 7 128 -35 0 114 -5 64 -58 9 -216 -34 -27 20 -88 45
6277 45 40 -22 -76 -73 40 -104 -10 -18 -166 -49 -33 -50 23 -62 107 69 95 -74 125 77 79 -151 -31 -19 65 -12 45 -58
6305 -58 -51 4 -44 53 -75 -29 43 -49 89 -3 92 116 -191 -125 55 -96 150 -59 -54 59 -110 130 84 54 99 105 -110
6332 -110 -74 91 -8 -2 64 -24 -59 61 33 3 -73 74 -178 27 24 135 -39 -84 88 9 -9 -42 -44 213 23 -194
6358 -194 107 25 -174 -78 33 47 -95 -21 -19 71 -105 69 -47 -47 -56 -65 185 0 42 60 8 68 41 -131 29 148
6384 148 30 6 130 95 -35 -153 42 57 26 -164 -15 -120 -50 110 0 -98 76 83 84 -92 270 50 -183
6407 -183 -157 -72 -35 -68 31 -20 -68 62 -236 61 -52 -123 108 31 63 -81 -76 12 51 -6 98 20 37 -92 -74 9
6433 9 17 -3 24 -12 37 -23 221 4 29 95 43 78 -18 -46 5 -60 91 27 181 -58 -36 -99 -67 22 83 -8 137 48
6461 48 88 -66 -112 121 -132 -52 126 124 146 -12 -62 -4 -45 6 22 198 34 93 -52 8 62 -40 23 -8 -29 16
6487 16 98 132 129 83 89 -53 -11 4 -23 -37 34 132 -26 -53 -19 -179 2 173 79 -125 61 -62 40 -74 66 30
6513 30 61 1 16 87 -145 125 -113 -30 -84 23 -12 10 29 -98 -56 145 78 -182 91 105 -89 37 31 102 -101
6538 -101 0 15 -128 -129 55 28 58 48 76 -89 6 -19 75 -75 -17 -35 88 8 60 -131 -122 117 -31 65 -53 27
6564 27 49 51 -92 -86 116 18 -126 -25 -76 -9 -107 -43 -3 -61 -1 -22 -98 -45 69 66 -52 -77 27 -7 60 56 -79 61
6592 61 67 3 144 -54 168 -43 11 -128 -10 195 -135 46 -93 -135 59 126 29 31 -182 25 -157 -31 -176
6615 -176 -40 8 -113 116 -100 39 -4 -56 9 -63 11 -99 -1 13 -27 -129 -195 -139 95 -33 -44 -15 139 2
6639 2 124 -43 -22 10 0 -13 -139 20 -3 69 -85 -108 50 -43 135 17 87 -82 86 122 56 135 -184 21 -31
6664 -31 0 2 22 27 25 33 19 60 134 -52 -80 -48 74 104 -2 6 -27 17 -176 -158 90 -19 235 -14 92 133 113 -27
6692 -27 101 180 164 181 -50 -45 -81 100 -118 60 -93 44 28 -47 49 50 -119 -40 -77 -66 40 -82 -151 -93 25 154
6718 154 22 -5 -62 -17 -103 59 59 36 66 146 -31 -42 -48 -24 -7 -16 31 78 -7 65 127 -127 -30 -153 31 -63 29 -19
6746 -19 115 -86 -39 -214 -79 -7 97 113 -170 20 85 122 -48 20 45 -97 29 -135 51 11 36 20 54 32
6770 32 34 -76 -47 38 -102 72 -54 -81 -6 -81 105 43 -33 38 155 0 87 62 -155 116 -112 -97 -106 45 63 -93
6796 -93 -47 -18 -149 143 35 47 80 -157 -54 -136 -65 -111 1 -140 63 3 -116 160 122 95 49 56 6 31 136
6821 136 -50 -146 -100 80 -47 -89 24 -9 -34 60 12 6 164 107 -5 95 -3 -55 137 35 100 123 92 134 61 -21
6847 -21 -76 -2 48 -7 -86 0 1 92 57 -31 6 5 83 32 48 16 97 -25 2 -13 71 -184 87 -145 -63 -124 46 0 -29
6876 -29 -156 91 59 48 73 149 -49 63 89 -73 104 -22 10 45 67 -38 105 17 -75 13 -56 100 -94 -76 59
6901 59 59 51 24 -81 -22 -11 83 32 61 -28 90 -76 -35 84 -255 -66 -141 5 155 1 -40 -122 62 -75 89
6926 89 111 39 -52 61 41 -223 46 76 29 51 85 91 69 -73 -16 -104 -55 46 40 11 -67 -115 52 -19 -57 -113 40 177
6954 177 153 -44 0 -30 72 57 55 20 37 87 -107 131 -30 102 -16 34 -18 6 -114 -106 86 -53 -16 8 91 -19
6980 -19 90 -73 -37 -87 14 18 35 45 -165 -163 -57 22 80 -2 202 -119 -64 41 48 120 -83 -128 44 79 93 -168
7006 -168 -166 -103 59 -136 -4 -8 63 -186 -58 132 -130 -185 -12 57 55 -183 -103 120 192 -10 89 117 -51 -82 48
7031 48 89 88 51 115 -5 103 9 -89 67 -105 37 -45 -130 -70 119 62 17 79 85 56 5 182 3 -43 78 67 87
7058 87 65 -122 151 113 61 141 198 67 32 -80 55 -115 31 -78 -33 -84 54 123 -115 -97 -51 62 55 0 247
7083 247 -131 -33 -121 98 -21 11 23 -79 11 -155 -23 -129 -104 70 31 -80 51 -128 -44 -100 159 -22 -144
7106 -144 103 63 -106 -109 -93 -96 88 -4 -44 -3 -163 48 158 147 125 -146 58 -98 148 35 -28 -38 32 -83 -225
7131 -225 -46 -68 33 44 -34 159 58 61 -117 88 25 36 10 -46 1 -62 -116 -75 55 -77 39 36 8 50 17 -41
7157 -41 -111 -4 -65 -17 -36 60 13 -141 -182 67 58 -97 173 4 87 -14 95 97 -76 59 18 -20 10 92 114 -7
7183 -7 19 59 -99 -58 71 27 -27 -230 -103 25 147 90 -121 -158 -73 -115 5 -63 18 77 78 -68 15 136 -191 -13
7209 -13 -25 -52 -48 34 114 85 -253 20 26 55 29 -75 79 9 -3 -53 -104 -111 102 -9 -210 -14 13 -39 135 -21 93
7236 93 48 159 -20 5 -72 -88 -137 200 -155 -101 -81 -10 -46 2 57 29 166 -98 8 -71 144 8 -120 60 163
7261 163 36 -51 -30 -10 -83 49 2 -7 45 52 -103 -17 -70 -140 11 -51 -59 -151 57 123 -86 -87 10 -82 204 -251 -23
7288 -23 74 27 34 -48 2 83 52 -31 -3 -158 -4 -136 12 202 7 161 -72 -64 -93 29 198 -48 93 20 -61
7313 -61 -76 128 18 0 11 -49 93 32 -10 30 -45 -3 -214 -58 -23 43 153 -188 121 69 -71 -95 5 -69 60
7338 60 128 -40 -74 18 62 -28 22 -56 38 -58 7 82 -27 -108 55 -17 37 97 -44 92 -144 -96 -34 20 120 -10
7364 -10 -31 -34 -19 -25 113 75 -85 13 -11 -73 -163 16 107 -95 53 56 -24 119 133 -73 125 27 -58 -37 77 -8 -74
7391 -74 105 91 81 12 8 65 45 127 84 42 54 299 112 -57 -155 91 5 186 -5 19 72 -169 -16 49 -31 -78
7417 -78 21 -59 -34 29 53 1 43 -22 15 74 191 23 221 -26 -30 37 -98 26 -156 -66 -90 -58 31 -51 -71 -79 66
7444 66 92 30 -106 37 -93 72 74 -16 -12 7 -104 -58 -28 -47 -80 -30 2 -11 16 115 66 -23 -94 14 168 142 109 182
7472 182 -90 51 43 -6 5 38 -49 71 46 103 38 94 -188 -137 -128 82 48 -181 40 109 3 130 -36 -2 -44 16
7498 16 224 -61 -170 163 84 138 5 -7 -77 -34 -33 11 37 -159 -12 -23 31 -22 319 -55 -13 134 -78 11 -145
7523 -145 91 -62 57 29 -28 -17 -33 -96 -93 -207 9 34 8 -215 -148 78 -85 -22 -83 -55 -135 93 90 39 123 103
7549 103 -171 -22 115 -37 92 142 38 51 40 -8 -21 -34 -17 -13 -118 -24 9 -53 70 158 46 -36 -62 -35 74
7574 74 73 -10 -67 -40 -106 27 96 6 17 74 36 104 102 -9 -93 -84 -117 -181 41 147 -109 77 -14 96 94 -9 -30 -98
7602 -98 -100 13 -140 59 159 116 5 88 -210 -3 -47 51 146 -40 140 34 -46 -2 88 -64 -34 68 128 31 27
7627 27 5 38 35 -126 51 -47 128 45 142 -78 -71 -117 116 10 -73 -13 -8 -70 37 52 -162 27 -60 2 16 -172 92
7654 92 0 45 25 122 -12 -86 22 -119 -32 -58 49 -141 -7 44 117 92 -85 124 -71 -39 -71 -104 46 -12 -105
7679 -105 -90 -212 8 -22 26 76 104 -103 54 50 51 -54 -14 -78 109 -48 17 105 157 6 28 26 -30 -17 -40 94 -113
7706 -113 9 79 145 -7 10 0 10 -214 -166 -163 -14 42 43 193 -129 3 -32 -22 82 81 55 22 6 -99 24 55
7732 55 -38 -73 -120 11 -4 100 0 29 -86 6 -6 -125 -234 3 -74 -97 11 -14 10 5 -99 12 -52 169 54
7757 54 -65 2 -150 145 -32 -177 188 -173 -41 16 -97 -53 -40 9 -55 -147 167 80 -109 33 11 31 66 -61
7781 -61 -20 -214 66 184 34 -21 -166 -39 -13 148 -107 -113 83 26 -61 123 -47 54 -230 -102 -101 -26 -110 14
7805 14 -50 77 91 -115 -52 203 -122 -33 -137 -13 145 -48 -142 103 40 99 -106 -56 23 69 -6 -5 -109 53 -11
7830 -11 -66 -50 -70 123 41 -107 -100 4 -58 33 -54 103 -9 1 57 115 43 -28 -85 -111 125 -2 -46 -120 -15 20 107
7857 107 64 13 21 112 171 -47 51 -77 94 -114 48 68 177 62 146 39 50 -133 -76 -70 -45 19 208 79 -64
7882 -64 -80 -6 -81 -22 -154 147 36 -123 76 42 -77 3 -71 -112 -79 163 -95 129 -30 46 63 -35 51 -188 -20
7907 -20 14 -97 47 -36 35 37 73 -7 -72 223 -68 15 53 94 -109 72 39 79 112 -6 -41 -63 -54 -66 64 -103 -26
7934 -26 -78 40 37 -17 111 -163 -196 12 7 14 -144 -54 -32 266 71 -31 45 -145 46 246 125 102 36 -82 36
7959 36 43 -13 -103 2 -138 1 -62 72 -11 -45 -156 206 98 30 -20 -84 -196 5 139 -156 34 -114 -23 -15 -95
7984 -95 29 -14 27 -7 -107 34 -10 -17 -88 66 52 -101 205 -32 -5 -73 42 28 -113 84 80 169 -81 34 204
8009 204 -24 -43 78 -8 70 112 176 -134 -56 -37 -25 -161 149 -76 -150 54 -124 -21 69 72 21 -57 -76 -4 -20 68
8035 68 175 38 -82 -30 93 -133 6 42 -25 87 39 5 -45 39 -13 -111 2 -37 -198 -50 82 147 -18 36
8059 36 -237 129 -69 -122 8 94 -13 -97 148 -73 -123 7 41 1 -5 -145 29 102 27 31 131 60 -22 58 155 66
8085 66 248 -78 -51 -33 -1 1 -115 18 37 38 79 -41 63 87 -137 47 -34 -104 -131 -35 70 1 -188 -61 8 14
8111 14 -29 5 10 -7 20 -28 194 -36 118 6 -96 42 159 153 69 164 -11 -150 -26 -74 41 41 126 -78 70
8136 70 -41 50 175 -23 -91 89 5 45 29 66 70 28 73 164 73 -44 -10 64 57 -44 51 -28 -94 97 -85 199 12
8163 12 31 14 -228 -19 -110 252 94 8 -66 147 46 -32 81 -59 2 35 34 150 64 56 -126 -50 -50 57 62 0 -165
8190 -165 -32
8191c2
$$ Imaginary data points
##PAGE= N=2
##DATA TABLE= (X++(I..I)), XYDATA
0 0 0 0 0 0 0 0 8 -8 0 -8 8 -12 16 -16 16 -24 32 -40 47 -54 64 -76 91 -104 124 -141 164 -189 219 -250 283
31 283 -322 366 -412 465 -521 584 -654 729 -810 900 -999 1107 -1223 1350 -1489 1642 -1813
48 -1813 1993 -2194 2417 -2663 2941 -3245 3594 -3987 4439 -4964 5581 -6322 7220 -8347
62 -8347 9806 -11761 14524 -18711 25745 -39611 76624 -366640 -776651 634716 244470
73 244470 -408182 680785 739894 -190566 409454 645235 -199039 14882 388981 -261457
83 -261457 -245541 173188 -202140 -333668 35170 -133954 -322794 -43661 43782 -146611
93 -146611 -100794 84030 -17786 -240866 -36877 135160 -185119 -75949 388096 56694
103 56694 -98630 532919 297178 -242219 387721 438553 -373387 42868 430592 -430990
113 -430990 -358831 249193 -414084 -570191 171561 -188412 -479162 259399 133002 -306256
123 -306256 287666 335660 -201555 193962 402229 -137884 28848 356029 -86324 -166983
133 -166983 184552 -24309 -228914 48114 89644 -124012 -49959 96500 -48670 -171808
143 -171808 4928 35465 -205508 -94330 139985 -117001 -166874 204480 40650 -186291
153 -186291 214197 201901 -154226 181185 298313 -171996 20735 275939 -209406 -169945
163 -169945 231894 -157184 -284719 185841 -43761 -316217 135053 98408 -262352 78277
173 78277 214211 -157622 5162 234866 -74837 -79119 180427 -6144 -127862 103090
183 103090 66238 -117588 8955 102184 -57406 -73797 74964 15670 -104291 21517 70430
194 70430 -100531 -41840 102464 -71732 -96955 131348 -1146 -142075 124428 90735 -162066
205 -162066 64433 159037 -149156 -24488 186450 -102320 -105519 171919 -39701 -158569
215 -158569 131972 30662 -169675 83477 92498 -156216 24545 144709 -109994 -50247
225 -50247 151186 -37659 -105831 105474 33352 -112909 37087 65848 -93275 -17007 87342
236 87342 -54066 -66990 87489 5364 -99938 59177 76763 -96680 -144 119844 -60101
247 -60101 -63448 126278 -1150 -112061 87845 52846 -128109 31600 91031 -116480 -24255
258 -24255 112091 -89336 -78971 125791 -28691 -124519 105491 53080 -131673 48065 112344
269 112344 -95468 -13003 128325 -47001 -61332 115029 -291 -102011 72563 45067
279 45067 -119113 10711 84062 -93831 -48512 99838 -41014 -92565 86200 23862 -107662
290 -107662 48210 82733 -86833 -226 109928 -54708 -51299 111019 -9737 -91056 92587
301 92587 48766 -115789 31329 91426 -103443 -42523 102407 -55272 -89028 88206 848
312 848 -108409 58906 54058 -106415 17498 105348 -65858 -27460 122447 -16342 -75435
323 -75435 93924 28361 -101858 47094 69936 -99503 -12918 89699 -73656 -70649 85515
334 85515 -24476 -98901 72211 39342 -102571 34291 90615 -82592 -23813 113348 -27489
345 -27489 -64073 99181 25919 -86025 53678 54721 -95376 1736 81346 -74292 -47587
356 -47587 92848 -30577 -93164 68833 21746 -105089 31799 72443 -82392 -11068 97520
367 97520 -45340 -55835 92322 5169 -75321 70979 54571 -75577 29596 79567 -70797
378 -70797 -29629 84048 -41746 -79487 65136 6369 -99769 22082 43351 -83999 -9686
389 -9686 76173 -41218 -28174 94354 2268 -57969 75329 39749 -79755 29071 68509
400 68509 -73779 -22471 79104 -47047 -66323 70158 -2195 -81469 50607 44175 -74735
411 -74735 15221 63360 -64109 -25996 68981 -38046 -56791 67786 9142 -69944 44162
422 44162 54480 -55224 7475 74158 -25184 -24983 62896 -6793 -58850 31837 9595 -77685
434 -77685 -452 39511 -60707 -26441 64763 -20359 -44975 68829 23105 -56406 48458
445 48458 55029 -60742 5567 64497 -53344 -35382 61984 -29879 -56818 60213 5760 -67427
457 -67427 44865 41882 -65445 9761 59214 -47600 -26209 52038 -24159 -45573 38383 1240
469 1240 -48306 26727 32766 -34961 8987 53389 -13250 -19282 44741 6782 -41800 18316 22720
482 22720 -50196 -12806 36837 -36822 -36561 45700 -6393 -47683 44171 24622 -52649 29874
494 29874 48119 -56295 -508 63418 -43961 -33393 64387 -17479 -51862 53119 9551
505 9551 -55196 39059 31662 -54860 16514 47320 -46229 -13730 48360 -26400 -36434 35324
517 35324 -1250 -40679 17298 19448 -30196 -1185 31168 -10621 -17330 27924 9638 -28311
529 -28311 13951 27621 -30900 -7290 41817 -22152 -32484 47737 1884 -52077 35692 28163
541 28163 -57098 14399 45531 -52411 -7436 55914 -42804 -30690 62129 -21858 -53255 54816
553 54816 8325 -61438 34955 34256 -53151 11751 47322 -35611 -8668 47095 -15178 -23273 34932
566 34932 2030 -29703 16278 14377 -27551 -4951 21217 -14517 -24455 18981 9075 -33508 3575
579 3575 31164 -26100 -16373 41783 -10321 -32824 43622 8695 -48065 36118 32918 -56705 14685
592 14685 55029 -50240 -14806 62842 -32945 -39498 58083 -11261 -56342 43414 11658 -60026
604 -60026 23994 31638 -50426 4503 42679 -33090 -12008 45778 -10877 -26393 34135 11439
616 11439 -29254 10862 24074 -18726 -11164 22122 -3759 -24594 14298 12665 -32262 -1095
628 -1095 30798 -27362 -22691 41408 -8138 -41369 38402 17135 -48514 25729 38987 -48116
640 -48116 5157 54544 -38538 -19405 57103 -22559 -40565 49678 -3145 -53792 35405 18719
652 18719 -56011 13643 38060 -41067 -8879 41384 -18879 -21161 33606 -150 -25924 21567
664 21567 14597 -25126 4173 26446 -13098 -15894 23992 5204 -26793 10017 20680 -27506
676 -27506 -8883 28992 -19513 -26320 32071 -3054 -38397 27967 17782 -42052 18146 37352
688 37352 -39759 -634 50653 -28327 -24304 51282 -8141 -42127 35822 10756 -44829 18738
700 18738 23124 -40208 3087 32985 -29206 -13578 35563 -11733 -26901 25996 8120 -27792
712 -27792 10002 20054 -20028 -5256 24292 -6146 -16607 20021 7878 -22991 8864 20450
724 20450 -22834 -6659 27520 -15697 -23343 29513 1143 -35305 20274 19965 -35861 4983 32733
737 32733 -26388 -9835 35890 -15388 -21933 34754 -2308 -33168 26098 13966 -36534 10810
749 10810 27274 -29360 -6852 30549 -16201 -18865 27363 -705 -25285 17286 12351 -23696
761 -23696 5164 21083 -16881 -8085 23396 -5481 -18798 18877 7860 -25192 5680 19770
773 19770 -19887 -8234 23839 -9577 -18872 21458 2362 -24089 16043 14143 -27124 5002
785 5002 25622 -21802 -9817 29797 -10131 -22077 25841 4538 -26465 16583 15832 -27014 3777
798 3777 23627 -20838 -9606 25511 -11003 -20515 22198 2616 -26006 13219 15915 -23989 169
811 169 24294 -13401 -11721 22659 -2176 -18787 16313 7507 -21704 7508 16818 -20337 -4803
824 -4803 23729 -10787 -17150 21915 3031 -22861 13232 14299 -22364 1132 20618 -16920 -10171
837 -10171 23001 -7047 -19183 20075 4651 -23821 12606 16598 -23284 -59 24304 -15700
849 -15700 -13311 24566 -3047 -21728 16871 8389 -22445 8150 16333 -19935 -1645 22625 -13333
862 -13333 -13509 23337 -1308 -22444 15577 11207 -23226 3337 18931 -17464 -8258 21210 -7667
875 -7667 -16561 18459 3518 -20852 11394 13490 -20516 1122 21322 -14678 -10799 23624 -3381
888 -3381 -20531 17114 9638 -22093 6026 17371 -17951 -4120 20303 -11426 -13273 20593 -1968
901 -1968 -21510 15308 10536 -23374 3867 19796 -17097 -8085 22047 -6485 -16228 18791 4162
914 4162 -19946 10994 13751 -19340 900 19796 -14057 -9811 21422 -4444 -19497 16602 7696
927 7696 -22709 5790 16991 -17991 -5390 19730 -9660 -13354 18374 -356 -18710 13806
939 13806 10028 -20376 4170 18973 -15048 -7445 20868 -5157 -15418 16347 4586 -18480
951 -18480 8091 12366 -17186 -1254 17388 -11528 -10727 17565 -2334 -17335 13433 7929 -19594
964 -19594 4644 16846 -15848 -6630 19963 -6580 -14160 16870 2913 -17681 11255 10637 -18449
977 -18449 3077 17328 -14828 -7463 19813 -6551 -16167 15651 3785 -18699 8053 11866 -16009
990 -16009 -395 16120 -10038 -8003 15980 -2213 -13358 11741 5901 -15365 4263 12336 -12898
1003 -12898 -5157 15466 -5346 -12688 12696 4229 -15310 5682 10678 -13490 -897 14489 -9716
1016 -9716 -7937 16495 -3265 -14851 14105 6167 -17911 6729 13905 -15183 -2034 17092 -9398
1029 -9398 -9679 15498 -2687 -14274 11409 4010 -15545 5368 9790 -13589 -1377 13676 -7725
1042 -7725 -7965 13293 942 -11747 7504 7875 -10387 324 10435 -6518 -5275 10232 -2024
1055 -2024 -10252 8455 4216 -13167 3399 10895 -11438 -4362 14052 -5983 -10649 12921 884
1068 884 -14105 9250 7479 -14576 3683 12060 -12142 -2335 14807 -7511 -8112 14653 -1053
1081 -1053 -12691 10321 5726 -13518 3259 9527 -9899 -2865 9845 -5252 -6620 8468 -298
1094 -298 -8654 5758 5348 -8760 304 9181 -5253 -5839 9136 623 -9385 5674 6067 -9829
1108 -9829 844 10155 -7812 -4045 12078 -3566 -9079 11243 1615 -12979 7673 7166 -13993
1121 -13993 1579 11637 -11050 -4990 12911 -5175 -8949 11124 161 -10354 8284 4743
1133 4743 -10740 3646 8868 -9083 -2472 10001 -3980 -6858 7783 1591 -7817 3638 5417
1146 5417 -6611 -813 7470 -3647 -5346 6997 258 -8901 4461 5215 -9629 56 9729 -7260
1160 -7260 -5399 11615 -1773 -9414 9570 3801 -10960 5322 7418 -10896 1059 10228 -9313
1173 -9313 -4116 12016 -4803 -9210 10272 1275 -10928 5979 5801 -9360 1151 8239 -6560
1186 -6560 -3001 8467 -2577 -6239 6652 1985 -7233 3065 5700 -6576 -1890 7523 -2936
1199 -2936 -6204 6548 1999 -8681 3057 6230 -7640 -1362 8512 -5095 -4853 9429 -1381
1212 -1381 -8484 8201 3545 -10870 4380 8327 -9444 -938 10407 -6145 -5666 9821 -2098
1225 -2098 -8612 7408 2220 -9675 3656 5888 -8410 -428 7883 -5412 -4181 8244 -479
1238 -479 -6786 5592 3932 -6904 1206 6489 -4289 -2989 6467 -1321 -5582 5196 1905 -7600
1252 -7600 2380 5738 -7207 -1895 7961 -4198 -6026 7543 59 -8159 5373 4139 -8577 2126
1266 2126 7433 -6961 -1736 9029 -4015 -5144 8406 -216 -7910 5815 3921 -8402 1707
1279 1707 6713 -6228 -2815 6799 -2770 -5256 5538 437 -6146 3626 3469 -6219 350 6035 -4077
1294 -4077 -3434 6338 -477 -5867 4397 3068 -6002 1379 5300 -4904 -1628 6587 -2561 -4941 6163
1309 6163 555 -6725 4010 4299 -7201 487 6409 -5318 -3094 7162 -2182 -5706 5562 1150
1323 1150 -6393 3321 3721 -6381 755 5880 -4560 -2458 6926 -1766 -5313 5009 2059 -5840
1337 -5840 2324 4235 -4984 -499 5422 -2973 -3157 5161 -524 -5052 3581 2426 -5308 978 4471
1352 4471 -4656 -2302 5484 -1840 -4813 4528 1274 -5550 2485 3856 -4671 272 5278 -3488 -2192
1367 -2192 5947 -1402 -4970 4760 1673 -6115 2345 4195 -5115 -1005 5371 -3257 -3018 5177 -692
1382 -692 -4704 3933 1586 -5496 1670 3887 -4883 -1094 5087 -2887 -3369 5093 248 -4539 3332
1397 3332 3003 -4276 743 4375 -3557 -1903 4659 -1731 -3905 3985 527 -5222 2151 3485 -4822
1412 -4822 -208 5160 -2861 -2599 5143 -708 -4347 3607 1447 -5168 1422 3716 -4582 -858 5107
1427 5107 -2711 -2888 5396 71 -4447 3771 2528 -5030 1201 4050 -4211 -1903 4354 -2243 -3656
1442 -3656 4329 229 -4601 2938 2959 -4607 589 4792 -3275 -2394 4670 -1313 -4165 3675 1095 -4889
1458 -4889 1905 3301 -4264 -95 4945 -2521 -2477 4814 -397 -4352 3644 1840 -5245 1102 3872
1473 3872 -4113 -1666 4507 -1979 -3374 4395 484 -4392 2875 2644 -4593 522 4228 -3944 -2210
1488 -2210 4607 -1433 -4402 3817 1293 -4751 1924 3456 -3908 -137 4681 -2571 -2423 4695 -759
1503 -759 -4267 3775 1814 -4880 1562 3742 -4231 -899 4744 -2009 -3143 4237 133 -4285 2384
1518 2384 2106 -4386 515 3530 -3500 -1418 4317 -1304 -3415 3818 1311 -4348 1734 3248 -3544
1533 -3544 -473 4234 -2058 -2447 3938 -396 -4033 2952 1935 -4672 1124 3497 -4010 -1290 4582
1548 4582 -2016 -3595 4344 323 -4477 2862 2914 -4202 830 3981 -3166 -1225 4463 -1727 -3252
1563 -3252 3998 758 -4297 1943 2828 -3847 -421 3560 -2403 -2250 3475 -490 -3458 2388 1534 -3743
1579 -3743 680 3156 -3202 -1106 3763 -1392 -2849 3684 809 -3975 2197 2982 -3703 44 4083
1594 4083 -2795 -2287 3960 -1090 -3484 3431 835 -4343 2129 3084 -4092 -171 4031 -2603 -2264 3989
1610 3989 -584 -3404 2730 1081 -3843 1317 2652 -3125 -429 3409 -1533 -1911 3278 206 -3099
1625 -3099 1841 1989 -3095 -115 3020 -2207 -1696 3139 -484 -2858 2562 1108 -3288 1243 2889
1640 2889 -3139 -560 3926 -2141 -2562 3622 -111 -3834 2606 1668 -3784 1003 2804 -3334 -391
1655 -391 3851 -1574 -2071 3572 -84 -3240 2564 1489 -3348 807 2721 -2604 -1171 3113 -1297
1670 -1297 -2395 2540 424 -2735 1309 1838 -2680 -181 2680 -1606 -1750 2770 -316 -2987 2100
1685 2100 1867 -3049 534 3047 -2449 -988 3384 -1168 -2346 3018 243 -3349 1983 1781 -3774
1700 -3774 598 2885 -2788 -1121 3578 -1205 -2489 3125 406 -3208 1492 1665 -2851 341 2519
1715 2519 -2089 -1149 2835 -670 -1969 2317 923 -2833 1045 2276 -2087 -763 2671 -1086 -2026
1730 -2026 2514 156 -2693 1402 1463 -2847 271 2836 -2075 -1247 2867 -896 -2707 2624 773 -3347
1746 -3347 1403 2288 -2915 -83 2821 -1992 -1297 3063 -640 -2289 2492 788 -2909 1215 2108 -2506
1762 -2506 -248 2570 -1549 -1603 2509 71 -2403 1661 1132 -2433 527 2078 -1983 -990 2333 -816
1778 -816 -2073 2130 630 -2635 1251 2061 -2305 -197 2791 -1282 -1539 2509 -194 -2441 1834 990
1794 990 -2847 763 2348 -2230 -814 2873 -1315 -1737 2595 -10 -2448 1722 1363 -2622 338 2219
1810 2219 -2002 -817 2573 -954 -1752 2147 566 -2097 1333 1556 -2120 91 2251 -1386 -1148 2330
1826 2330 -207 -2092 1415 913 -2192 497 1656 -1951 -590 2318 -907 -1568 2113 79 -2392
1841 -2392 1276 1508 -2314 75 2338 -1637 -876 2298 -503 -1729 2048 379 -2104 1349 1543 -2025
1857 -2025 -89 2194 -1502 -1176 2175 -508 -2141 1555 578 -2141 532 1686 -1693 -477 2071
1872 2071 -905 -1431 1888 105 -1904 1145 1019 -1909 -33 1909 -1310 -1005 1840 -518 -1570 1672
1888 1672 583 -1969 757 1466 -1884 -292 1731 -1105 -1247 1824 -190 -1989 1506 676 -2057 458
1904 458 1581 -1577 -550 1997 -815 -1333 1763 140 -1644 1181 856 -1822 180 1590 -1487 -836
1920 -836 1760 -472 -1342 1411 383 -1684 744 987 -1436 -237 1372 -1062 -980 1648 -292 -1574
1936 -1574 1322 833 -1587 357 1509 -1342 -298 1758 -776 -1265 1372 174 -1568 1030 958 -1358
1952 -1358 365 1524 -1163 -521 1911 -582 -1233 1275 341 -1590 690 1003 -1421 -81 1243 -952
1968 -952 -763 1540 -102 -1246 1224 569 -1347 549 1209 -1192 -415 1442 -611 -898 1438 -14
1984 -14 -1330 944 797 -1371 285 1156 -955 -678 1288 -521 -1153 1112 217 -1480 582 1003 -1344
2001 -1344 -109 1243 -924 -682 1504 -301 -994 1224 584 -1473 416 1078 -980 -187 1373 -869
2017 -869 -750 1214 162 -1174 812 775 -1224 212 1008 -990 -324 1225 -400 -966 996 172 -1224
2034 -1224 557 616 -1103 -97 1240 -913 -514 1328 -340 -908 841 474 -1128 473 945 -1043
2050 -1043 -254 1052 -519 -757 1265 20 -964 564 490 -1052 215 948 -797 -308 1037 -387 -856
2067 -856 988 230 -1112 610 893 -917 31 1167 -536 -355 919 -134 -727 947 196 -1087 457
2084 457 787 -942 -243 940 -564 -476 991 -192 -1070 640 501 -1057 158 894 -840 -378 856
2101 856 -391 -614 1049 158 -923 526 733 -937 -13 988 -568 -507 940 -185 -780 780 345
2118 345 -1000 335 551 -711 -62 994 -531 -570 741 -113 -997 681 337 -975 269 762 -877
2135 -877 -305 859 -552 -666 813 177 -736 634 583 -736 123 745 -701 -214 718 -140 -561 664
2153 664 324 -945 172 633 -769 -151 703 -407 -558 803 -125 -806 456 302 -777 251 679
2170 679 -398 -266 807 -313 -649 707 130 -878 343 473 -739 126 523 -606 -493 667 -295
2187 -295 -535 639 127 -807 290 361 -615 4 620 -388 -203 794 -104 -558 572 309 -707 91 628
2206 628 -524 -209 737 -261 -404 579 65 -658 290 491 -624 -41 559 -527 -275 720 -99 -810 499
2225 499 121 -701 232 392 -742 -27 761 -414 -353 819 -33 -528 714 103 -496 382 567 -512 -1
2244 -1 702 -314 -282 717 -67 -705 493 332 -553 63 329 -458 -118 573 -138 -462 399 161 -592 338
2264 338 504 -536 34 545 -290 -333 731 -76 -397 431 298 -546 140 517 -392 -53 366 -221 -385 517
2284 517 32 -500 507 461 -563 -26 317 -510 -197 491 -46 -279 577 -149 -625 280 257 -423 226 557
2304 557 -342 -305 471 39 -459 396 381 -486 225 156 -501 66 465 -237 -276 421 -43 -607 328 243 -431 170
2326 170 393 -355 -131 724 -188 -366 459 18 -512 385 299 -522 158 481 -393 -101 604 -124 -364 467
2346 467 62 -559 201 372 -400 -220 196 -378 -261 431 11 -347 145 248 -544 143 505 -284 -122 351
2366 351 -103 -327 493 0 -510 113 380 -369 -195 445 -329 -263 272 -69 -528 300 206 -558 266 246 -626
2387 -626 -256 329 -285 -161 557 64 -482 363 242 -615 278 336 -382 -4 467 -137 -161 414 58 -350 295
2408 295 382 -522 -13 552 -314 -231 394 -103 -239 330 71 -278 73 398 -437 81 590 -318 -237 508 40
2429 40 -285 231 243 -427 206 473 -319 -57 288 -136 -388 290 -85 -259 319 42 -331 -15 343 -216 -318
2450 -318 364 -184 -236 297 162 -423 146 253 -424 94 262 -249 -259 342 -98 -335 196 295 -327 15 286
2471 286 -362 -271 422 -82 -306 348 33 -451 110 113 -487 78 254 -269 -161 319 -28 -383 70 171 -335
2492 -335 102 215 -372 -75 191 -179 26 437 -68 -207 194 198 -433 66 262 -286 -98 216 -34 -327 177
2513 177 173 -254 107 336 -288 1 318 -284 8 311 120 -385 338 110 -318 122 342 -396 -87 185 -313
2534 -313 -207 263 -2 -130 191 10 -228 137 161 -321 3 72 -184 -168 433 85 -174 143 150 -387 84 210
2556 210 -258 -35 409 0 -243 296 111 -190 49 73 -315 -50 229 -395 -399 188 1 -281 19 88 -199
2577 -199 -79 5 -104 -116 291 -1 -127 183 47 -207 27 159 -306 -51 492 -213 -81 353 -11 -96 262
2598 262 133 -209 12 94 -346 -46 109 -15 -9 325 146 -312 92 91 -153 82 180 -96 -47 233 -237 -240 220
2621 220 -35 -346 145 187 -141 110 160 -4 -102 127 92 -61 71 -119 -102 19 136 -212 22 247 -49 -264
2643 -264 99 208 -84 177 105 -288 27 82 -173 -54 137 -146 -310 176 10 -75 179 133 -111 12 195
2664 195 -198 -79 140 -43 -89 8 23 58 134 195 56 29 378 30 -342 19 -131 -145 76 63 -144 -278 150
2687 150 -73 -90 151 -222 -134 25 259 -58 -29 -65 -126 -51 67 -28 -46 -30 -54 -84 157 32 -96 -39 14 32 -81
2712 -81 79 24 -27 103 81 -94 -26 33 64 -74 114 -41 -6 57 -180 84 113 19 -212 -5 215 -232 -73 72
2736 72 -141 -29 -21 -144 -54 95 -156 -180 78 51 -31 -86 192 0 -87 -118 -6 124 27 -122 23 -29 66 -89
2760 -89 -73 18 -52 81 -27 -43 -84 -72 20 -84 67 -104 -56 6 141 -24 -10 -153 61 -34 -3 -44 -89 6 140
2785 140 185 -78 61 17 -4 139 58 43 52 3 83 141 -130 -142 -87 -118 -38 -41 -107 0 -49 -156 -22 -9 -23 -19 -72 6
2813 6 -40 -37 -94 200 54 -4 87 36 -33 -54 175 -149 -185 -108 0 27 -53 117 -56 5 131 76 -19 17 32 -68 -19
2840 -19 55 -71 4 -19 108 -133 130 13 -34 23 -109 133 59 48 -21 42 -80 -185 68 138 -54 -107 -30 85
2864 85 -108 -108 -41 14 -218 -16 -15 -46 -77 -143 -32 50 -38 -176 110 139 -36 88 -11 15 68 -172 65 -86 92
2889 92 121 60 -49 -96 -113 133 -20 -209 -124 71 14 41 -81 -137 4 -22 -211 -35 8 -17 -95 -36 -91 103 65
2914 65 -24 40 66 129 -42 -45 28 146 -14 114 -84 55 149 19 14 -144 98 82 -120 29 -41 -150 -1 -20 101
2939 101 14 38 256 -129 32 1 128 79 175 -65 76 182 -258 -34 0 -150 -156 82 61 -13 98 6 -88 -81 -105
2964 -105 58 168 66 -54 42 -135 -54 111 72 -129 -136 -19 135 126 111 -25 228 50 90 5 -25 -25 -64 69 44
2989 44 41 6 84 -102 20 -50 -15 -22 -209 -115 88 -146 -25 51 45 -187 -87 -257 50 -24 -61 -124 -47 13 -40 163
3015 163 157 13 -138 -88 -19 -117 41 -25 -16 26 -5 60 53 -26 135 -40 -48 -51 124 157 155 49 20 -63 -74 47 100 77 -99
3044 -99 -148 79 -41 -97 120 100 -175 170 22 -19 198 42 -73 -132 140 138 -131 304 12 -22 -10 -95 -9 14
3068 14 114 -13 -83 30 -22 -51 43 81 -159 74 60 -159 150 -81 -43 1 101 53 -11 82 -23 -48 -42 -108 -172 15
3094 15 -23 -146 -50 208 -171 -67 111 -70 -70 107 -63 -108 3 142 -80 -49 -156 -171 -46 35 38 -186 -53 228
3118 228 -43 -30 57 -7 -63 7 -44 -99 -59 124 -148 55 64 -101 -88 104 -106 -190 70 60 -145 14 -45 -36 -53 -8
3144 -8 125 -22 -41 -29 -17 114 -107 15 -55 32 -196 11 192 -207 -24 -49 -17 -263 28 -101 -179 32 60 -94
3168 -94 12 138 -165 -161 264 35 -13 44 111 44 -3 153 17 -86 27 62 113 107 -169 -197 118 40 -8 -84 112
3193 112 -45 8 100 -16 -159 68 -8 -13 -126 96 -57 101 -29 -64 -31 50 -60 -103 64 27 -221 58 -131
3216 -131 -176 15 26 49 -44 20 -39 -116 33 114 28 14 162 -6 -41 170 -10 62 162 -111 15 120 51 -21 184
3241 184 42 -83 79 -187 -157 -146 139 88 -201 227 223 13 62 81 -80 -120 -87 -48 -189 -19 104 -88 -37 56
3265 56 53 15 64 -157 -27 229 249 -22 186 -36 -86 -56 -66 -41 -140 114 -148 -80 190 101 -203 -72 81 -185
3289 -185 112 96 -7 21 163 -58 11 22 5 -124 43 82 -111 -145 48 122 -81 144 -64 -40 -84 133 -28
3312 -28 -125 129 -77 -130 -64 -111 -252 41 172 -23 -35 155 22 127 29 86 93 29 -109 -56 0 128 37 63 9
3337 9 -55 -60 39 19 -66 60 -13 -109 32 -48 -174 69 70 -76 -117 117 132 -110 -38 44 -71 36 74 -109 -53 88
3363 88 37 -47 265 208 5 83 81 -103 56 45 -257 72 145 115 -248 120 -58 -96 53 72 -135 -21 -144 135
3387 135 29 96 22 -9 105 158 -112 36 176 -190 46 -88 27 -4 11 6 -145 87 34 -90 74 -91 -16
3410 -16 -111 240 -11 -174 -113 11 -62 8 -80 27 0 94 8 99 -85 70 15 -55 31 118 44 66 -96 -104 181 91
3436 91 -68 60 53 -69 13 73 66 -66 156 -130 -112 -81 3 -29 -67 -37 -227 -85 74 -84 68 -30 49 -101 25
3461 25 -37 -172 45 71 118 95 -157 -9 -85 197 94 -42 -50 74 -49 8 35 -156 90 -52 80 -202 15
3484 15 -90 -126 -46 137 -169 108 49 74 71 128 75 -91 292 -75 59 -72 42 36 86 139 -191 -39 154 57 79
3509 79 126 18 -119 -49 -60 -153 -43 144 54 -169 -48 46 -27 5 170 -170 -20 -68 -91 7 -117 -37 -48 -10 86
3534 86 -75 106 189 -87 16 68 54 173 69 -43 -114 -143 -48 -305 110 -41 69 81 119 -70 139 30 -49
3557 -49 29 23 53 -139 -112 152 -76 -148 -83 -42 62 23 -79 44 4 -173 -40 60 -160 -28 148 -34 -54 -26
3581 -26 64 -110 89 -1 68 16 -90 95 -75 13 154 -40 35 -14 61 -151 -165 215 47 -141 -7 172 -167
3604 -167 -42 -80 -22 253 -14 -83 58 26 -57 68 209 -124 -75 91 112 -82 20 -110 -87 -252 -12 105 43
3627 43 -7 52 -24 -234 -28 -8 -10 181 19 127 1 49 -89 -33 0 82 -149 -9 5 1 78 11 -102 66 133 -228
3653 -228 -19 81 80 87 -63 52 -21 209 -14 -37 100 -168 -178 57 32 -40 -17 64 87 41 51 -241 40 -13 3
3678 3 -92 -56 -73 -100 -34 173 -133 -221 22 -17 -11 -37 -1 -10 60 67 -57 63 33 137 39 231 -63 45 94 -32 -59
3705 -59 -133 -4 -177 58 18 -7 5 -31 4 -109 -38 77 -34 13 68 127 -2 40 120 151 -99 155 -206 -13 101
3730 101 -207 -70 45 -105 6 77 -92 -204 21 42 -20 98 -104 -69 -104 -87 64 48 126 -78 28 -98 51
3753 51 61 -138 175 -37 48 139 104 -68 168 37 88 -16 147 -59 9 -37 -89 92 -120 80 -6 2 26 29 -57
3778 -57 141 191 -8 99 -24 78 -121 9 -107 -32 173 -79 45 -15 95 -10 79 -1 -132 1 10 -155 194
3801 194 91 39 135 -171 35 -105 59 -62 -23 110 90 -17 -120 24 63 0 15 68 3 54 149 -35 6 36
3825 36 -142 -42 -50 100 25 45 -97 -38 72 109 -18 96 -58 -63 -18 35 130 94 147 -37 -35 -3 -68 -133 65 102 162
3852 162 -126 48 65 -47 3 84 125 -15 -39 -36 64 -168 -12 -148 -23 -72 -11 50 -157 12 -41 23 -7 -87 62
3877 62 97 3 246 57 -143 60 46 140 83 -15 -25 -21 50 67 -53 172 -101 -15 36 -63 -50 -60 -4 18 -221 -18
3903 -18 -21 -78 178 -88 -165 90 86 4 71 6 182 33 0 158 -73 117 137 -57 -49 0 13 48 -84 -65 -53 -6 -131
3930 -131 11 174 67 -55 -93 -42 -86 -71 -150 -23 -167 15 92 -95 58 -87 -10 21 -17 46 60 -43 -19 -45
3954 -45 -70 12 -161 145 -133 -79 -2 91 -17 -59 -44 -127 143 -9 85 37 21 92 143 70 -4 91 108 -109 -91 -26 9
3981 9 193 -179 -46 70 13 94 116 -129 18 -68 -136 -72 -2 100 -69 -39 -83 77 -11 32 -4 -70 14 79 43 -71
4007 -71 50 -41 -99 -177 122 -58 -31 28 29 23 -59 48 -145 75 -109 -53 -209 148 -61 28 -113 22 161 45
4031 45 80 -12 145 154 -131 38 -71 38 -177 -7 2 9 19 -89 -53 13 -28 59 7 70 -34 -123 81 73 71 -57 -68
4058 -68 -244 -91 78 -89 19 14 -23 77 106 106 -100 9 125 112 -52 197 237 66 -39 -58 -120 -73 -33 60 64
4083 64 -48 -16 -95 -69 -3 1 -71 -2 -14 -127 -21 82 -31 67 67 12 -105 0 8 72 161 81 61 22 -44 -110 -22 78
4111 78 229 157 40 -68 88 -98 -33 -128 74 -149 -80 115 -4 -136 -31 -35 -77 -106 75 -67 -108 167 96 47
4135 47 -97 -3 93 -17 11 -14 66 130 -56 33 91 -95 -131 47 -7 -59 162 107 -9 33 -71 -49 17 107 71 -158
4161 -158 45 -23 19 22 5 12 131 -74 125 128 -9 -12 41 57 36 133 82 68 116 5 83 -68 -41 -111 10 -164 49
4188 49 -138 2 -44 -58 -30 60 64 129 -102 -26 136 47 -37 -188 19 -70 31 -50 -119 -89 44 -40 13 -26 -177 -22
4214 -22 -78 68 -44 -238 -137 -149 42 -141 -108 -109 -1 91 -38 -31 63 6 -47 112 110 13 9 107 -64 -24 53 -85 -102
4241 -102 -28 -64 -37 40 77 39 117 148 -101 -18 -21 -23 59 -97 -1 -71 -134 -119 -130 -103 190 -44 78 -13 -80 -8 -1 141
4269 141 35 55 -59 -109 117 27 -40 49 97 -141 -3 159 -82 5 58 141 145 -3 163 -77 -57 116 -11 32
4293 32 56 65 -75 34 60 -13 -59 -50 28 77 156 2 91 146 1 -5 118 83 59 125 47 125 -50 37 -42 -59 116 41
4321 41 100 -5 9 -6 27 -112 186 83 96 -10 21 212 -69 -105 -152 9 -13 -20 23 -33 -17 -2 175 120 2 -3
4347 -3 138 38 -102 -101 25 123 -96 31 102 -8 -127 -165 -49 -39 -33 -77 -134 -43 96 2 -3 -86 12 -88 26 13
4373 13 -61 57 124 -156 43 54 -210 -232 47 59 -29 -78 56 -81 -22 -17 43 -45 -32 197 142 -32 236 -52 -15
4398 -15 10 -161 -3 -35 -93 6 -2 64 -52 -10 60 -73 79 -136 -197 202 98 -5 100 174 -175 -223 87 -8 2
4423 2 46 -130 -62 95 32 40 -149 -25 283 94 -113 66 -66 35 10 44 31 15 -73 -38 11 15 -51 32 59 -67
4449 -67 65 -17 -28 -102 -60 99 -46 -152 -178 65 -53 119 -58 -43 -206 -1 -221 61 4 78 -74 62 121
4472 121 -69 -134 -42 48 131 110 26 -146 -34 105 -16 76 36 -48 0 -14 32 -35 -71 103 16 98 -56 99 -47
4497 -47 39 52 39 16 118 -8 -64 96 11 -23 63 80 28 83 17 0 98 -49 19 2 203 -218 -46 -121 63 -9
4523 -9 -51 -1 -20 -160 -4 -79 -11 58 0 34 -42 0 -48 51 37 5 5 -118 -107 27 -21 -242 64 -12 59 117 140 -139
4551 -139 27 -25 14 38 -22 38 -138 129 -141 28 -24 -74 -45 -69 -117 -32 -23 65 -138 -61 -317 -21 -40 -111 -190 -85
4577 -85 92 177 42 -95 50 70 -17 -175 -84 -107 -16 -90 -10 130 -39 -65 113 19 32 3 20 113 -199 -116 -96 -16
4603 -16 -72 -47 -60 -199 -67 21 -120 123 -68 -64 91 -60 -13 -79 25 30 113 16 66 -60 -174 82 -85 53 12
4628 12 14 -173 -87 -119 168 -18 7 27 67 213 -129 -156 -104 -97 -14 -21 -43 -57 12 -69 15 55 -72 95 -178 -104 49
4655 49 -82 74 -103 125 -16 -2 106 -2 -65 4 88 -6 4 109 114 191 7 114 -20 -128 39 -146 80
4678 80 27 66 -38 -205 38 -86 -89 -90 -56 37 -55 178 -210 -10 -70 -134 -55 44 94 -30 -27 35 -37 -8 -104 41 13
4705 13 80 27 -143 -61 -61 27 8 -112 80 43 -66 3 -57 -23 181 -73 49 29 50 38 18 -51 -4 80 6 -55 111
4732 111 -214 14 -34 62 -58 -45 -76 -168 15 -100 57 -3 -141 45 -109 112 -128 -13 6 14 -15 -268 -31
4755 -31 -44 65 14 -116 48 -151 -42 90 -82 -18 152 10 -74 6 -12 -50 -43 -44 -31 -113 1 -40 36 14 8 -151
4781 -151 90 1 36 98 10 -71 -166 103 -45 -52 83 -168 -6 -39 20 -97 107 74 -86 -90 -25 73 -52 98 29
4806 29 161 42 129 69 5 131 82 -70 74 -2 -114 89 -201 186 11 -79 -4 -147 -92 96 -133 -116 139
4829 139 16 102 5 -81 65 3 118 122 -39 79 67 3 -78 -9 89 91 50 21 16 66 138 150 -86 -76 -43 -61 -42 14
4857 14 -78 2 -110 -21 139 -2 93 -106 113 123 -105 183 41 25 -7 -69 66 -47 17 -76 -119 22 78 108 32
4882 32 153 49 -93 25 33 -97 -37 10 -199 0 -146 75 118 30 -16 -50 158 74 25 74 111 -232 69 -73
4906 -73 130 -11 -103 68 144 172 -6 -4 12 -49 -98 -146 65 -115 -112 164 83 88 104 90 67 -79 36 -33 80 70 -160
4933 -160 44 48 -31 65 102 36 87 -72 -149 -125 -1 -44 91 38 100 8 -187 60 1 45 101 -43 -69 -153 46 25
4959 25 -19 -60 -35 -64 44 -62 126 5 -24 -23 -83 -170 77 37 -84 33 10 51 -57 104 34 18 -35 129 -6
4984 -6 152 6 21 -76 121 28 85 233 -29 7 199 -38 -12 -8 -4 93 7 147 -70 48 -100 -21 -82 -203 -70
5009 -70 22 -22 -98 -5 -67 -40 -46 82 10 -82 -210 -125 -35 -65 -29 -54 -52 -179 -83 103 24 -107 -175 -31 -79 168 -15
5036 -15 2 -45 -200 24 -50 -10 -168 -92 54 63 69 26 -26 4 32 45 161 107 154 -117 30 31 99 2 10 -98 -85 62
5064 62 -21 -7 23 111 -15 -33 -25 -143 -7 22 -208 9 -116 18 -84 -42 56 4 101 -85 94 -204 63 -61
5088 -61 -31 -87 -119 -65 -152 -168 117 -82 46 8 -18 -20 -85 -129 -87 -22 21 -41 -94 35 48 70 -136 91 -108 -52 -20
5115 -20 -91 -23 -17 87 57 220 10 -32 -131 60 95 -20 5 92 83 -12 -127 54 -49 44 -87 -22 31 -82 6 134
5141 134 -43 83 133 -29 -33 84 23 -90 147 -86 -103 42 -114 27 -15 32 31 8 34 19 -42 -81 49 38 -52
5166 -52 -11 79 -107 60 93 2 168 1 -10 53 -80 -26 -36 3 -77 -215 -2 13 -91 16 50 23 -68 -94 -54 62
5192 62 -148 133 11 -23 50 30 -49 39 -106 -101 -60 -70 -104 -96 153 -21 -85 -49 117 -83 28 24 24 52 72 64 -87 -157
5220 -157 176 -159 21 -52 -203 49 -90 -164 -33 -71 -40 -61 -228 -53 89 92 22 175 -105 -1 -80 -89 68 -56
5244 -56 -27 26 89 -63 -30 -25 17 118 -215 109 29 -11 -17 12 125 -130 -108 -50 127 -44 46 -24 8 -34 15 156 -108
5271 -108 -57 30 128 -122 -195 2 183 -73 -13 -80 -28 -58 -77 -211 176 1 -16 156 -63 -118 43 -2 48 -45 74
5296 74 -98 -20 -80 -118 37 -83 48 -23 -82 91 -122 11 41 38 153 -29 47 59 100 195 -150 -36 20 -99 47
5321 47 -18 41 100 1 -28 13 127 150 -45 -12 -61 -57 -19 -110 146 165 78 47 -51 -40 -97 -42 37 48 89 57 137 -99 -249
5350 -249 -18 -95 -73 49 2 -10 -2 -68 -105 -57 81 11 -139 11 166 75 -11 51 -15 19 39 42 -35 -116 100 7 186
5377 186 -34 -57 -27 -28 79 -151 0 68 -36 -35 69 -33 -9 39 -34 9 -183 119 8 -56 29 83 43 188 -73
5402 -73 93 -19 -79 -25 61 -122 -45 -67 -33 -29 24 -89 0 59 -11 72 113 -82 -82 -142 -108 11 -73 -40 -48 -29 -114 -18 -3
5431 -3 159 -5 -43 12 -54 -195 -55 26 71 65 96 -99 106 98 21 -115 24 78 -13 -53 97 -66 257 101 89 -62
5457 -62 -140 -36 -42 -120 -68 -21 -35 59 -112 22 -6 -42 -119 -162 -133 -47 -81 104 -33 -147 -60 71 102 10 33 -40 -41 -40
5485 -40 79 -63 7 28 100 102 44 -24 -41 -4 -49 -88 -66 79 -16 -163 -103 -3 -14 -8 161 -6 -75 -205 -232 -105 -66
5512 -66 -51 62 -163 -126 53 126 -17 -10 102 -108 -14 159 -201 -25 60 51 69 -37 75 95 52 12 31 2 -68 -47
5538 -47 125 166 23 -146 0 164 17 -12 -158 -217 114 43 148 45 -25 -162 -66 -124 -113 -105 95 -36 60 60 -141
5563 -141 106 -197 -266 -30 -239 158 -17 -65 122 104 10 -52 143 194 -22 21 134 99 49 -79 62 24 5 -4
5587 -4 -17 104 0 -173 29 120 35 -12 -115 -79 -33 -17 160 84 62 -111 -70 -153 -60 60 18 148 68 64 -109 -144
5613 -144 42 157 -29 -18 46 -24 -109 101 -7 -150 -72 -71 33 47 -14 80 -91 -48 -18 -81 64 -7 -173 -5 -136
5638 -136 -22 -56 91 101 36 36 -54 119 -61 -33 -41 -146 116 -13 68 -20 -36 -43 -46 168 71 171 23 -23 -84 139
5664 139 -20 -135 41 75 -96 64 -154 -76 6 -21 84 -17 16 35 -89 59 73 70 -111 147 156 -127 -81 -81 76
5689 76 47 32 99 -116 -24 141 46 19 -13 36 -89 -7 -38 -171 77 -79 81 107 190 -51 -7 -80 8 35 -11 120
5715 120 -19 -51 -21 115 -32 -22 58 -25 -9 44 142 105 65 -147 -41 -96 -94 -101 164 47 -91 57 -63 -46 33 160
5741 160 -61 225 -60 118 20 -150 -45 68 19 105 53 -50 -107 -68 69 84 -23 -6 85 -119 48 -46 151
5764 151 24 -21 -54 23 -88 -78 -166 -99 92 -103 -49 -58 49 89 -87 52 2 -88 -67 -76 41 -203 51 -19 -79 -19
5790 -19 -80 -10 94 29 117 59 120 71 -72 -143 88 227 127 -10 19 -75 -106 -262 -146 -85 57 -29 -50 0 -14 205
5816 205 -10 -29 -147 -98 -52 -56 22 -176 -72 141 -200 -32 -48 176 89 8 140 33 -11 -13 141 -8 -114 66
5840 66 42 -66 84 5 96 13 7 -129 11 -2 -95 6 34 10 133 -66 -78 59 157 -89 -45 13 112 -71 -13 3
5866 3 -5 -31 -49 -114 98 105 -1 -13 72 97 -27 100 -20 -16 -15 -48 64 -135 15 118 137 65 -60 14 -68 -72 -89 -53
5894 -53 -97 -164 91 -56 -53 -36 195 109 27 -28 27 -28 5 76 -7 -132 -67 58 286 -51 17 -85 10 -81 -15 187
5920 187 -52 -31 -128 103 -115 20 66 -40 -24 -67 -200 108 137 22 57 -96 4 248 13 -79 62 251 210
5943 210 21 63 67 15 39 -37 -28 -4 -170 76 -134 111 -173 6 17 -36 75 -190 16 -1 -22 191 -52 25 45
5968 45 47 -134 -115 -37 116 -75 12 -18 19 -166 -94 -122 -30 -16 -129 30 2 51 58 -81 15 -295 31 45 60 -162
5994 -162 -15 28 64 -26 -26 69 -75 198 17 45 -30 100 31 -73 31 -66 -48 10 38 46 19 49 -207 105 15 23 120
6021 120 -21 83 92 25 -59 92 -2 -61 38 -18 -83 -159 22 -81 -40 -12 6 -4 -218 -59 -19 -63 -18 -48 -68 -44 -192
6048 -192 105 -58 -78 74 -149 197 -118 169 -4 93 97 60 -127 -7 -4 -22 10 122 -26 48 -115 -58 -101 -115
6072 -115 6 -73 -41 -3 -18 -121 -83 -42 -37 -2 -88 -21 66 7 8 77 -117 83 17 65 55 2 189 -74 -57 -54 -48 71
6100 71 49 68 22 -67 228 31 128 -130 44 28 8 107 -54 38 62 20 9 223 -12 -105 175 -145 -171 -127 32
6125 32 -82 -13 -14 -62 123 -22 45 -60 -39 7 -12 -101 96 68 177 -23 -135 -23 -67 -20 -141 17 48 39 17 -139
6151 -139 -32 -54 -99 -142 65 115 -73 -152 149 -85 -50 -131 -96 3 -158 -139 -145 -17 -50 31 140 -110 48 27 -154
6176 -154 90 128 -60 -141 120 200 61 -228 34 101 76 -69 157 42 107 -37 19 51 -190 -171 -202 102 -35
6199 -35 18 69 9 -11 198 158 -25 -134 35 38 17 69 9 106 -37 159 -79 -32 -79 -24 -19 -48 65 63 -2 -7 204 -84
6227 -84 10 106 -55 -68 -38 87 -15 68 -82 69 149 46 -70 43 -33 15 27 37 76 -109 85 -14 -15 -20 167 44
6253 44 -67 94 145 -32 -6 28 -26 -14 10 -154 104 57 25 87 -6 5 48 -136 -65 -59 -77 -38 10 -72 -6 -173 144
6280 144 50 68 -50 92 -277 3 90 17 -65 75 74 -72 -7 -2 95 -260 16 90 -16 -26 59 -225 -133 31 179
6305 179 181 -69 27 -74 -27 15 12 73 -145 103 103 86 -5 -60 28 84 4 101 -45 -57 -19 13 15 139 -42 -35 -10 -79 -10
6334 -10 -93 -28 69 -7 -3 172 44 145 40 109 -7 -84 9 -127 13 -92 80 120 -261 20 194 121 -3 -100
6358 -100 -7 -24 151 104 -36 -15 78 -103 120 -117 17 141 122 34 -42 131 91 69 115 206 -103 -21 -14 -124 -34
6383 -34 139 58 30 -122 -69 60 -3 -36 124 -71 -28 21 -115 27 -134 3 -13 38 -108 -86 -124 64 167 26
6407 26 44 12 130 1 -87 -60 150 14 -23 -215 -66 47 -60 -40 -31 -95 59 -191 -52 -135 -202 59 -118 99
6431 99 91 -67 33 100 -129 147 37 53 -11 -35 77 18 56 -18 -344 15 26 48 88 -19 19 1 28 -119 -66 -12
6457 -12 81 91 178 83 105 -96 88 37 47 151 -118 -37 121 12 -45 -37 -155 140 107 -51 -160 12 -124 -40 7
6482 7 40 -78 -121 -190 -78 44 -159 -136 119 63 7 -6 -80 -109 -25 -150 -14 -32 133 -46 55 -28 -32 50 27 35 -77
6509 -77 2 65 27 44 -12 34 -82 -42 -12 -73 3 -21 75 -87 -182 129 54 45 159 -118 -59 23 122 -101 171 -59 -17
6536 -17 159 64 -74 -71 -49 -173 -34 111 66 -85 38 -53 -82 -193 69 -150 -68 87 108 45 179 -34 -187 -36
6560 -36 -150 -8 64 23 33 -6 37 -87 199 -27 59 5 92 73 -95 138 199 97 124 60 92 -55 27 17 -105
6585 -105 16 -21 92 67 23 -43 -137 -144 -137 -44 -18 -85 -10 -54 -30 -36 -78 -86 74 118 -92 119 139 14 103 -28 104 85
6613 85 -120 -33 -118 -77 -66 -66 56 -85 -32 -6 -40 -133 -202 161 -33 -100 23 15 51 144 48 150 6 4 -48 6 116
6640 116 16 81 -153 49 -14 5 -57 -168 213 2 -126 16 -114 7 51 0 70 -157 106 53 -246 104 122
6663 122 -37 -6 -16 214 -89 5 111 151 7 15 -53 60 -227 -148 -36 -18 -107 -59 43 72 -17 48 23 -49 -74 43
6689 43 -25 -91 27 -82 68 -11 88 -14 -59 -109 6 51 22 -34 -30 -74 -72 161 -167 -2 324 -73 -85 -55 85 79
6715 79 -46 77 -107 -33 -36 137 -16 -18 18 26 133 43 -24 87 -19 6 -19 -12 -9 -132 -164 85 100 -64 -26 -4 -29
6742 -29 -125 -93 -124 -80 6 73 -112 25 -118 54 -67 26 -9 95 -101 -67 191 22 -227 -88 71 -45 -77 -124
6766 -124 -120 -61 127 66 124 2 121 -72 -178 33 136 -64 34 -66 -47 133 -50 -40 -192 51 72 51 86 71
6790 71 105 77 -19 228 -38 133 -47 120 -72 89 -3 26 -70 52 -7 -117 4 126 56 -116 -88 -42 98 -27
6814 -27 79 -151 97 102 -59 -196 29 -5 -111 101 -101 71 -13 -105 -87 68 -60 -18 55 130 67 56 -37 -9 -35
6839 -35 127 175 47 -38 139 160 110 71 13 111 19 -57 -28 -69 195 162 -38 -110 29 67 -23 83 -72 -32 -90 197
6865 197 67 -79 -82 -70 -89 -52 -5 -8 -24 -188 44 -77 260 -34 170 189 -80 -16 54 10 121 32 -19 -36 47 -155
6891 -155 72 -13 -35 -53 -33 -50 -226 50 48 -58 -8 83 -154 -20 -61 6 71 183 -30 -128 127 74 -94 -56 89
6916 89 9 24 -80 -58 54 -110 -100 166 -26 -93 -92 35 -223 77 -43 -41 58 18 5 -57 -11 -208 -9 51 101 88
6942 88 -190 -84 -91 91 -57 46 -99 62 26 99 45 -80 -192 22 -4 -76 169 -188 82 214 73 -85 3
6965 3 133 -131 72 -23 44 153 78 34 98 -117 -96 -29 28 17 40 -180 38 113 -17 -185 100 76 -62 -32 19
6990 19 95 -49 -133 -34 48 -90 -128 -179 -135 67 193 108 -84 -163 14 93 -1 -119 40 40 62 -4 36 73 -191 18
7016 18 -28 -18 17 113 85 -46 -146 -6 -89 107 56 62 136 -90 39 -11 53 -101 165 59 -9 150 267 115 -47
7041 -47 29 -6 -103 50 133 3 -18 -41 -28 3 30 55 -13 -111 -12 109 9 -91 -101 -68 -194 -57 -26 38 -58 -24 68
7068 68 108 -95 -34 -45 -71 -31 -56 42 40 63 -121 134 -100 -6 32 43 60 -197 -106 50 -33 19 -135 87 -1 52 -69
7095 -69 -136 -115 44 75 -8 -77 -91 188 66 70 -120 81 71 -31 -83 146 70 -4 67 -22 -41 72 35 43 5 10 138
7122 138 43 -100 40 -52 -69 151 -7 -113 -33 -21 19 10 -29 124 -105 -16 -6 59 67 -52 50 54 128 -6 97 -63
7148 -63 46 -12 -39 -19 54 -189 -65 79 199 58 -129 -49 39 91 -177 -29 69 -74 103 12 33 -33 -16 -12 105
7173 105 -61 -183 -71 -57 58 -91 -8 -70 -40 -104 123 82 -2 -70 80 165 108 -88 111 39 57 -57 57 -19
7197 -19 33 24 129 -132 53 -19 -89 50 214 -107 -47 -139 -25 -75 55 -113 -56 -68 15 -63 -64 -19 -7 98 28 111
7223 111 -155 213 119 21 5 -29 189 31 -37 8 84 2 132 -82 41 163 -112 110 28 127 23 49 -10 -137
7247 -137 -91 -47 48 -25 -108 -39 75 -39 -145 5 143 -88 -56 69 -64 -36 -34 -8 -98 63 -50 -58 35 -80 44
7272 44 -36 106 51 -120 2 -143 -126 151 76 130 60 130 33 -82 55 -70 43 2 43 -116 33 151 -123 32
7296 32 156 -17 -89 -73 -65 112 -38 18 -66 200 170 -44 -94 262 3 25 -62 -43 61 86 30 -63 67 22 -100
7321 -100 -112 41 54 -44 -36 16 14 -288 39 -150 -87 -24 -35 68 62 -90 119 -52 -135 -22 -61 -110 226 33 4 -161
7347 -161 -52 -16 -34 10 -109 -46 -169 30 -85 26 37 -101 -33 -75 -87 -110 -27 -105 -52 -112 126 -90 2 113 -36
7372 -36 -8 -119 -134 73 -14 -85 -34 -154 35 105 4 -46 -105 -62 -59 72 102 36 -18 -137 -127 13 -36 -27 49 136 -60
7399 -60 43 -141 -7 110 -2 -76 94 -12 24 -23 -72 119 37 54 40 107 -23 85 -40 -62 97 -17 46 -80
7423 -80 146 44 -11 103 51 67 169 -75 -2 -163 71 -76 22 67 -61 -132 9 -34 -114 -9 65 31 46 3 28
7448 28 -122 -72 125 104 138 -126 156 -72 -75 -44 103 -80 -126 -64 99 54 69 134 -25 -35 -62 -56 -165 -22 -7 -19
7474 -19 -95 108 -16 35 82 222 34 -9 -118 1 -155 -83 -54 23 32 63 -135 142 -81 37 -49 22 19 -123 -25
7499 -25 -66 -96 24 -24 25 -43 -34 -3 -65 -163 96 -12 80 139 18 106 97 84 -233 -23 40 10 100 12 -122 131 -99
7526 -99 -164 75 35 66 -49 -29 -128 17 -7 21 -68 -100 83 -7 51 77 -307 -18 44 81 53 -69 116 37 39 16 58
7553 58 39 -21 12 112 -39 171 12 -214 -114 -31 -21 148 -39 54 102 78 -40 6 29 62 35 -88 -65 -10 -126
7578 -126 -32 -72 -46 113 100 7 -122 77 -112 30 15 85 31 -107 -1 -35 82 83 -161 -24 -62 8 119 -30
7602 -30 -59 -120 -42 18 -45 -100 157 89 -79 -40 23 -14 -49 47 47 5 -61 111 20 -87 -50 74 -13 -30 -159 7 -7
7629 -7 169 1 -44 37 -4 141 -112 98 11 61 -80 -5 81 76 -105 153 -147 7 -74 18 79 -59 -28 96 42
7654 42 -70 89 -47 -62 6 36 99 -90 34 101 119 110 22 62 73 0 113 -21 52 -125 -127 25 -149 -101 201 -97
7680 -97 -6 -21 57 -149 -92 -80 -21 221 -33 29 130 -96 -53 -46 31 60 -45 -55 -155 -75 -51 223 -29 134 -9
7705 -9 52 18 104 -20 -49 -14 189 -103 6 -24 67 125 102 -106 -26 110 15 -94 -159 10 -46 44 32 40 104 20 77
7732 77 72 100 117 134 -38 -33 41 -156 34 9 -70 -34 10 38 -138 59 74 -324 -44 67 46 -8 -50 -26 -304 43
7758 43 10 33 -181 -111 2 -113 -37 97 248 -39 -40 -159 -38 -51 -38 -34 38 -27 45 77 22 -52 43 -22 -120 -55 120
7785 120 -72 -94 20 8 -70 148 26 -15 -18 60 28 31 18 4 121 55 -9 -44 99 48 -3 -85 -144 -81 -56 -25 -76 76
7813 76 -22 19 -81 30 30 -134 60 -94 11 -108 -107 159 11 43 98 41 -116 -12 22 112 -23 -20 -114 -45 -61 -23
7839 -23 -50 -19 -84 -15 -26 -54 -54 63 -96 -60 -97 -161 -122 -55 -17 -21 -48 109 69 -37 -158 10 -53 -107 -42 10 -27 -132
7867 -132 81 131 3 -119 87 -48 37 -36 107 42 -51 -62 108 -37 32 -119 -3 7 -69 -110 -5 -23 75 -101
7891 -101 -31 124 53 172 2 103 14 106 -16 43 -1 -126 -101 43 -126 -44 25 158 -194 88 123 241 -65
7914 -65 -75 -54 -16 2 122 91 3 47 -69 -155 114 24 -183 -44 -88 115 108 2 -90 -28 -70 -192 -23 2 175 -78
7940 -78 -60 103 -83 52 -49 -61 102 -69 -9 8 -66 306 54 -155 59 -97 84 -31 -25 128 2 -36 76
7963 76 244 116 84 58 -103 53 95 -107 -10 37 -86 220 -55 -4 -65 -41 9 -68 -37 82 69 -28 -36 56 -36 -18
7989 -18 166 -128 -93 17 162 -17 -64 24 0 36 -55 -68 126 -81 17 -122 -74 -132 81 128 -80 154 -99 14
8013 14 -40 -150 52 -16 71 -46 -4 189 -76 -18 106 -226 -8 -58 89 45 13 -48 -71 -37 37 75 -3 22 98 158
8039 158 -23 -24 -11 71 -236 44 -23 176 12 93 67 -141 -52 89 -9 -91 85 -56 20 11 60 -39 -91 -73 104 9
8065 9 24 3 -48 116 -59 70 -35 -23 -48 -100 3 -94 -81 26 -16 14 -187 -100 -24 50 -148 -135 153 94 -54 64
8091 64 89 38 -140 -32 313 82 -187 -176 127 161 -44 -121 42 134 -51 90 120 57 -29 -114 -44 10 -20 124 42
8116 42 12 118 14 38 -133 68 -115 -6 43 -111 -19 70 -18 -177 -69 -67 100 -46 -103 -36 -133 28 -23 -26 120
8141 120 -16 -123 -164 -123 -33 -147 -120 -4 37 -65 -115 93 30 -18 68 90 136 28 -156 -98 10 43 38 1 -65 208
8167 208 101 81 -59 -9 40 -28 -40 48 102 -32 188 141 -124 -66 -67 142 -9 -41 -3 154 -11 -53 12 9
8191I
##END NTUPLES=NMR FID
##END=
