##TITLE=1H_3MBDP1404
 CDCl3
 8 sc, 
 17.4.2023
##JCAMPDX= 6.0         $$ Bruker NMR JCAMP-DX V2.0
##DATA TYPE= NMR FID
##DATA CLASS= NTUPLES
##ORIGIN= UXNMR, Bruker Analytische Messtechnik GmbH
##OWNER= root
$$ XWIN-NMR		Version 3.5
$$ Mon Apr 17 15:41:45 2023 Russian Standard Time (UT+4h)  she@DPX200
##.OBSERVE FREQUENCY= 200.13135
##.OBSERVE NUCLEUS= ^1H
##.DELAY= (6, 6)
##.ACQUISITION MODE= SIMULTANEOUS
##.ACQUISITION SCHEME= undefined
##.AVERAGES= 8
##.DIGITISER RES= 18
##SPECTROMETER/DATA SYSTEM= spect
##.PULSE SEQUENCE= zg30
##.SOLVENT NAME= CDCl3
##.SHIFT REFERENCE= (INTERNAL, CDCl3, 0, 15.7039)
##AUDIT TRAIL= $$ (NUMBER, WHEN, WHO, WHERE, WHAT)
$$ ##TITLE= Audit trail, XWIN-NMR		Version 3.5
$$ ##JCAMPDX= 5.01
$$ ##ORIGIN= Bruker BioSpin GmbH
$$ ##OWNER= she
$$ F:/spectra/data/she/nmr/H-F/1/audita.txt
$$ ##AUDIT TRAIL=  $$ (NUMBER, WHEN, WHO, WHERE, WHAT)
(   1,<2023-04-17 15:40:45.95 +0400>,<she>,<DPX200>,
      <created by zg, POWCHK disabled, PULCHK disabled
       configuration hash MD5:
       00 E9 B6 7A A2 85 ED C7 34 08 36 98 17 FE 4E 26
       data hash MD5: 16K
       3C 7A 91 7A BA 35 7C 00 D1 AA B7 61 0D C2 BB 08>)
$$ ##END=
$$ 
$$ hash MD5
$$ C0 26 7E 6F D6 DA 60 AF 1D E8 FC 0D 26 6D 59 1A
##$RELAX= 
##$RELAX= 
##$RELAX= 
##$RELAX= 
##$RELAX= 
##$RELAX= 
$$ Bruker specific parameters
$$ --------------------------
##$DU= <F:/spectra>
##$EXPNO= 1
##$NAME= <H-F>
##$PROCNO= 1
##$TYPE= <nmr>
##$USER= <she>
##$AMP= (0..31)
100 100 100 100 100 100 100 100 100 100 100 100 100 100 100 100 100 100 
100 100 100 100 100 100 100 100 100 100 100 100 100 100 
##$AQSEQ= 0
##$AQ_mod= 1
##$AUNM= <au_zg>
##$AUTOPOS= <>
##$BF1= 200.13
##$BF2= 200.13
##$BF3= 200.13
##$BF4= 200.13
##$BF5= 200.13
##$BF6= 200.13
##$BF7= 200.13
##$BF8= 200.13
##$BYTORDA= 1
##$CFDGTYP= 0
##$CFRGTYP= 5
##$CHEMSTR= <none>
##$CNST= (0..31)
1 1 145 1 1 1 1 1 1 1 1 1 1 1 1 1 1 1 1 1 1 1 1 1 1 1 1 1 1 1 1 1 
##$CPDPRG= <>
##$CPDPRG1= <>
##$CPDPRG2= <>
##$CPDPRG3= <>
##$CPDPRG4= <mlev>
##$CPDPRG5= <mlev>
##$CPDPRG6= <mlev>
##$CPDPRG7= <mlev>
##$CPDPRG8= <mlev>
##$CPDPRGB= <>
##$CPDPRGT= <>
##$D= (0..31)
0 1.2 0 0 0 0 0 0 0 0.06 0 0.03 0 0 0 0 0.0002 0 0 0 0 0 0 0 0 0 0 0 0 
0 0 0 
##$DATE= 1681731645
##$DBL= (0..7)
120 120 120 120 120 120 120 120 
##$DBP= (0..7)
150 150 150 150 150 150 150 150 
##$DBP07= 0
##$DBPNAM0= <>
##$DBPNAM1= <>
##$DBPNAM2= <>
##$DBPNAM3= <>
##$DBPNAM4= <>
##$DBPNAM5= <>
##$DBPNAM6= <>
##$DBPNAM7= <>
##$DBPOAL= (0..7)
0.5 0.5 0.5 0.5 0.5 0.5 0.5 0.5 
##$DBPOFFS= (0..7)
0 0 0 0 0 0 0 0 
##$DE= 6
##$DECBNUC= <off>
##$DECIM= 32
##$DECNUC= <off>
##$DECSTAT= 4
##$DIGMOD= 1
##$DIGTYP= 9
##$DL= (0..7)
0 120 120 120 120 120 120 120 
##$DP= (0..7)
150 150 150 150 150 150 150 150 
##$DP07= 0
##$DPNAME0= <>
##$DPNAME1= <>
##$DPNAME2= <>
##$DPNAME3= <>
##$DPNAME4= <>
##$DPNAME5= <>
##$DPNAME6= <>
##$DPNAME7= <>
##$DPOAL= (0..7)
0.5 0.5 0.5 0.5 0.5 0.5 0.5 0.5 
##$DPOFFS= (0..7)
0 0 0 0 0 0 0 0 
##$DQDMODE= 0
##$DR= 18
##$DS= 0
##$DSLIST= <SSSSSSSSSSSSSSS>
$$ [...]
##$SUBNAM2= <"">
##$SUBNAM3= <"">
##$SUBNAM4= <"">
##$SUBNAM5= <"">
##$SUBNAM6= <"">
##$SUBNAM7= <"">
##$SUBNAM8= <"">
##$SUBNAM9= <"">
##$SW= 18.05172834244
##$SWIBOX= (0..15)
0 0 2 0 0 0 0 0 0 0 0 0 0 0 0 0 
##$SW_h= 3612.71676300578
##$TD= 16384
##$TD0= 1
##$TE= 0
##$TE2= 300
##$TE3= 300
##$TEG= 300
##$TL= (0..7)
0 120 120 120 120 120 120 120 
##$TP= (0..7)
150 150 150 150 150 150 150 150 
##$TP07= 0
##$TPNAME0= <>
##$TPNAME1= <>
##$TPNAME2= <>
##$TPNAME3= <>
##$TPNAME4= <>
##$TPNAME5= <>
##$TPNAME6= <>
##$TPNAME7= <>
##$TPOAL= (0..7)
0.5 0.5 0.5 0.5 0.5 0.5 0.5 0.5 
##$TPOFFS= (0..7)
0 0 0 0 0 0 0 0 
##$TUNHIN= 0
##$TUNHOUT= 0
##$TUNXOUT= 0
##$USERA1= <user>
##$USERA2= <user>
##$USERA3= <user>
##$USERA4= <user>
##$USERA5= <user>
##$V9= 5
##$VALIST= <valist>
##$VCLIST= <CCCCCCCCCCCCCCC>
##$VD= 0
##$VDLIST= <DDDDDDDDDDDDDDD>
##$VPLIST= <PPPPPPPPPPPPPPP>
##$VTLIST= <TTTTTTTTTTTTTTT>
##$WBST= 1024
##$WBSW= 4
##$XGAIN= (0..3)
0 0 0 0 
##$XL= 0
##$YL= 0
##$YMAX_a= 330330
##$YMIN_a= -231982
##$ZGOPTNS= <>
##$ZL1= 120
##$ZL2= 120
##$ZL3= 120
##$ZL4= 120
##$ABSF1= 10
##$ABSF2= 0
##$ABSG= 5
##$ABSL= 3
##$ALPHA= 0
##$AQORDER= 0
##$ASSFAC= 0
##$ASSFACI= 0
##$ASSFACX= 0
##$ASSWID= 0
##$AUNMP= <proc_1d>
##$AZFE= 0.1
##$AZFW= 0.1
##$BCFW= 1
##$BC_mod= 2
##$BYTORDP= 1
##$COROFFS= 0
##$CY= 11.3945322036743
##$DATMOD= 1
##$DC= 2
##$DFILT= <>
##$DTYPP= 0
##$F1P= 15.7292609196834
##$F2P= 12.9074282941183
##$FCOR= 0.5
##$FTSIZE= 0
##$FT_mod= 4
##$GAMMA= 1
##$GB= 0.15
##$INTBC= 1
##$INTSCL= 1
##$ISEN= 128
##$LB= 0.24
##$LEV0= 0
##$LPBIN= 0
##$MAXI= 10000
##$MC2= 0
##$MEAN= 0
##$ME_mod= 0
##$MI= 1.114404
##$NCOEF= 0
##$NC_proc= 0
##$NLEV= 6
##$NOISF1= 3.799351
##$NOISF2= 2.8
##$NSP= 1
##$NTH_PI= 0
##$NZP= 0
##$OFFSET= 15.70392
##$PC= 1
##$PHC0= -19829.97
##$PHC1= 10.80081
##$PH_mod= 1
##$PKNL= yes
##$PPARMOD= 0
##$PSCAL= 0
##$PSIGN= 0
##$REVERSE= no
##$SF= 200.130013532006
##$SI= 16384
##$SIGF1= 3
##$SIGF2= 2
##$SINO= 400
##$SIOLD= 16384
##$SREGLST= <1H.CDCl3>
##$SSB= 0
##$STSI= 0
##$STSR= 0
##$SW_p= 3612.71676300578
##$SYMM= 0
##$S_DEV= 0
##$TDeff= 0
##$TDoff= 0
##$TI= <>
##$TILT= no
##$TM1= 0
##$TM2= 0
##$TOPLEV= 0
##$USERP1= <user>
##$USERP2= <user>
##$USERP3= <user>
##$USERP4= <user>
##$USERP5= <user>
##$WDW= 1
##$XDIM= 8192
##$YMAX_p= 0
##$YMIN_p= 0
$$ End of Bruker specific parameters
$$ ---------------------------------
##NTUPLES= NMR FID
##VAR_NAME=  TIME,          FID/REAL,        FID/IMAG
##SYMBOL=    X,             R,               I
##VAR_TYPE=  INDEPENDENT,   DEPENDENT,       DEPENDENT
##VAR_FORM=  AFFN,          ASDF,            ASDF
##VAR_DIM=   8192,          8192,            8192
##UNITS=     SECONDS,       ARBITRARY UNITS, ARBITRARY UNITS
##FACTOR=    0.0002768,     1,               1
##FIRST=     0,             0,               0
##LAST=      2.2672688,     0,               0
##MIN=       0,             -231982,         0
##MAX=       2.2672688,     330330,          0
$$ Real data points
##PAGE= N=1
##DATA TABLE= (X++(R..R)), XYDATA
$$ [...]
$$ plain form
1800 -395 -2853 2324 1216 -2982 582 2629 -2278 -977 2814 -1014 -2165 1926 579 -2396 796
1815 796 1946 -1876 -331 2594 -701 -1963 1893 467 -2600 852 2039 -2182 -599 2810 -1263
1830 -1263 -2148 2600 273 -2911 1757 1853 -3046 167 2846 -2485 -1591 2848 -863 -2594 2643 915
1846 915 -2747 1430 2392 -2423 -75 2998 -1461 -1717 2657 -140 -2512 1771 1268 -2731 391 2015
1862 2015 -1882 -1027 2257 -576 -2070 1520 659 -2503 489 2011 -1719 -711 2549 -469 -1847
1877 -1847 2140 1129 -2244 1206 2297 -2174 -567 2568 -1407 -1854 2399 134 -2484 1694 1635 -2746
1893 -2746 151 2095 -2199 -1245 2408 -948 -2100 2129 750 -2486 1241 1931 -1979 122 2597
1908 2597 -975 -1096 2254 -244 -2345 1190 918 -2449 -205 1857 -1340 -1138 2214 -185 -1662 1931
$$ packed form
1800c95k458N177j108m198L564K047m907J301L791l828j151M091j347k975L192
1815G96J150l822J545K925l295j262L856j426l067L452J187m221J583L409m073
1830a263q85M748k327l184M668R6m899L213K679n331Q94M439l711j731N237j728
1846I15l662M177R62m815K348L073m459k56M374k797k372M283n03l999L122J624
1862B015l897Q55L284k833j494L590q61l162K992J522l730J008L260l018j378
1877a847L987j011l373L450J091m471J607L135l975m47M253k265k618M178n9m381
1893b746K897J944m294R54L653l356j152M229j379l236L727O90l910K101K475
1908B597l572j21L350k498k101L535k72l367K244K062l197K02L352k399j477L593
$$ plain form
1924 1931 973 -1953 425 1806 -1945 -1029 2091 -917 -2035 1870 677 -2115 1188 1884 -1803 -273
1940 -273 2356 -1246 -1619 2035 -300 -2443 1107 986 -2137 427 2191 -1389 -261 2768 -232 -1424
1956 -1424 2080 495 -2352 505 869 -2599 -1037 1433 -1506 -1615 1921 410 -1515 1758 1670 -1751
1972 -1751 377 2091 -1343 -1040 1893 -555 -2079 1431 691 -1977 735 2018 -1229 -208 2357
1987 2357 -519 -1551 1478 127 -2393 292 708 -2323 -368 1741 -1127 -909 2325 326 -1510
2002 -1510 1734 1312 -1639 305 1694 -1748 -1185 1652 -886 -2037 1422 582 -1876 1032 1810 -1313
2018 -1313 -107 2197 -717 -1414 1753 -150 -2415 660 764 -1999 -312 1713 -1153 -638 2079 83
2034 83 -1451 1531 890 -1907 393 1278 -1615 -737 1509 -873 -1530 1651 698 -1601 1156 1499 -1373
$$ packed form
1924A931r58k926K378J381l751R16L120l008j118L905j193k792L303O96l687J530
1940b73K629l602l73L654k335k143L550j21l123K564J764l580J128L029l000j192
1956a424L504j585k847K857L64l468J562K470k939j09L536j511j925L273q8l421
1972a751K128J714l434L03K933k448j524L510p40k668K712J283l247J021K565
1987B357k876j032L029j351k520K685M16l031J955K109k868K18L234j999j836
2002a510L244m22k951J944J389l442N63K837k538j151L459q40k458K908P78l123
2018a313J206K304k914o97L167j903k265L075J04k763J687K025k866N15K717j996
2034H3j534K982o41k797K300Q85k893Q78K246k382o57L181r53k299K757L43k872
$$ plain form
2051 -1373 69 1821 -1088 -1334 1497 -322 -2082 859 830 -1960 47 1863 -1097 -746 1943 -145
2067 -145 -1478 1454 750 -1726 391 1474 -1429 -446 1815 -775 -1077 1657 388 -1763 1056 1382
2083 1382 -1653 -41 1645 -1184 -1109 1552 -431 -1616 1028 679 -1767 300 1545 -1383 -416 1710
2099 1710 -518 -1318 1555 583 -1666 583 1342 -1319 -37 1650 -656 -944 1693 158 -1553 1069
2115 1069 914 -1709 -14 1410 -1259 -950 1638 -385 -1602 1147 488 -1564 470 1171 -1210 -437
2131 -437 1812 -464 -1039 1522 473 -1605 752 1081 -1491 -160 1492 -905 -861 1448 -82 -1342
2147 -1342 943 777 -1505 293 1294 -1131 -575 1512 -441 -1301 1151 223 -1597 523 1106 -1333
2163 -1333 -154 1451 -654 -1067 1168 183 -1496 887 925 -1394 26 1496 -814 -650 1569 -109
$$ packed form
2051a373J442J752k909k46K831j819j760K941k9k790K007J816k960L51K689k088
2067a45j333K932p04k476K117J083k903R83K261k590l02K734j269k151K819L26
2083A382l035J612J686k829P5K661j983j185K644l49k446K067J245k928R67K126
2099A710k228q00K873r72k249K249P59k661J282J687k306k88K637j535j711K622
2115A069j55k623J695J424k669L09K588k023j217K749o59k052K034P01k381P73
2131d37K249k276n75K561j049k078K357L29k572J331J652k397M4K309j530j260
2147a342K285j66k282J798J001k425N56K087j953q60K452r28j820K120N83k439
2163a333J179J605k105m13K235r85j679K383L8k319J420J470k310J64K219j678
$$ plain form
2179 -109 -1198 1063 612 -1468 97 1166 -1269 -597 1452 -665 -1032 1244 240 -1399 824 979
2195 979 -1198 -108 1446 -913 -654 1414 -79 -1245 859 719 -1288 280 1128 -1193 -609 1124
2211 1124 -319 -1227 942 334 -1362 395 892 -1196 -409 1345 -462 -889 1123 207 -1227 629
2227 629 857 -1321 -196 1126 -984 -884 1284 -130 -1151 1178 641 -1249 607 1215 -981 -324
2243 -324 1404 -530 -1072 1308 186 -1356 725 895 -1282 -42 1045 -885 -829 1082 -229 -1291
2259 -1291 822 454 -1116 206 1006 -785 -417 1466 218 -653 1074 501 -1023 199 917 -1130
2275 -1130 -603 928 -494 -1043 999 136 -1390 666 854 -1107 -7 1255 -660 -775 1243 -353
2291 -353 -1441 917 446 -1354 466 1237 -855 -82 1400 -422 -873 1180 -4 -1264 471 654
$$ packed form
2179a09j089K261m51k080J565J069k435O72K049k117l67K276j004j639K223J55
2195I79k177J090J554k359K59K068j493j166K104j40k007J568Q48k321N84J733
2211A124j443r08K169o08j696J757M97k088P87J754j807m27K012r16j434J856
2227F29K28k178J125J322k110J00K168j414j021K329n37j890J856O08k196O57
2243c24J728j934n42K380j122j542K081J70k177J240J087j930N6J911j311j062
2259a291K113l68j570J322Q00j791L68J883j248q71J727n73j524J222P18k047
2275a130N27J531j422n49K042q63j526K056J88j961J100J262j915j15K018j596
2291c53j088K358m71j800J820P71k092P73J482j822m51K053j184j260J735J83
$$ plain form
2307 654 -1098 -211 973 -549 -485 1182 203 -903 660 774 -999 -26 795 -963 -845 649 -340
2324 -340 -1233 592 507 -943 603 1271 -522 -82 1444 -177 -755 1157 194 -1287 381 477 -1301
2341 -1301 -163 1156 -688 -480 1387 -151 -1115 1012 558 -1201 229 789 -1035 -575 973 -481
2357 -481 -719 875 432 -645 732 844 -647 -153 970 -446 -803 616 -204 -1100 150 515 -946
2374 -946 16 957 -302 -410 1090 42 -775 819 415 -1248 -19 938 -988 -553 1019 -608 -981
2391 -981 1011 277 -1007 803 939 -992 214 1122 -715 -492 730 -53 -1016 520 381 -886 254
2408 254 825 -660 -220 877 -68 -698 592 150 -1041 32 402 -804 -205 870 -235 -588 925
2425 925 262 -657 774 695 -811 140 856 -535 -481 981 -119 -853 435 344 -1068 251 974 -915
$$ packed form
2307F54j752Q87J184j522O4J667r79j106J563J14j773R73Q21j758J18J494r89
2324c40q93J825q5j450J546O68j793M40J526j621n78J912r63j481J668R6j778
2341a301J138J319j844K08J867j538r64K127m54j759J430N60j824M60J548j454
2357d81k38J594m43j077J377J12j491M94J123j416l57J419q20q96J250L65j461
2374i46R62R41j259j08J500j048q17J594m04j663J229R57j926M35J572j627l73
2391i81J992p34j284J810J36j931J206R08j837K23J222p83r63J536j39j267J140
2408B54N71j485M40J097r45o30J290m42j191J073L70j206N99J075j105l53J513
2425I25o63r19J431p9j506R51P16j391N4J462j100p34J288r1j412J319P23j889
$$ plain form
2443 -915 -248 1057 -519 -831 920 153 -1011 366 627 -768 -98 757 -581 -491 853 -79 -627 624
2461 624 504 -839 211 690 -372 -237 817 -136 -662 517 127 -959 72 693 -810 -236 837
2478 837 -351 -482 581 43 -1004 521 474 -807 13 873 -428 -525 853 75 -541 878 517 -710
2496 -710 285 850 -629 -214 824 -355 -681 700 132 -816 405 426 -762 -122 817 -484 -591 754
2514 754 20 -794 449 462 -696 131 695 -456 -158 875 7 -658 540 332 -714 108 607 -658
2532 -658 -229 800 -304 -518 623 157 -687 369 552 -795 6 777 -502 -395 809 -156 -717 495
2550 495 448 -732 58 785 -609 -389 830 -277 -475 677 144 -740 244 555 -630 -27 738 -385
2568 -385 -418 727 -1 -678 310 308 -827 -110 457 -506 -434 534 -199 -690 634 413 -695 132 637 -493
$$ packed form
2443i15O67J305j576l12J751p67j164J377K61j395O70Q55j338R0J344r32n48J251
2461F24j20j343J050M79j062J35J054r53n26J179l90j086J031O21j503N74J073
2478H37j188j31J063n38j047J525m7j281Q20Q60j301r7J378p78o16J419l61j227
2496g10R95N65j479M15J038j179l26J381n68r48J221K1j188O40R39j301j07J345
2514G54p34q14J243J3j158Q27N64j151K98J033q68o65J198k08j046Q22M99j265
2532f58M29J029j104k14J141m66q44J056J83j347Q01P71j279J07J204r65n61J212
2550D95m7j180P90P27j394K20J219j107j98J152n33q84R84L11j185O03P65j123
2568c85l3J145p28o77R88kj135P17N67r63P2R68p33m91J324k21j108Q27N05j130
$$ plain form
2588 -493 -41 694 -185 -563 734 209 -680 204 630 -592 -48 876 -394 -558 631 -201 -886 384
2606 384 236 -712 41 681 -713 -302 741 -78 -627 580 272 -863 277 571 -576 9 751 -378
2624 -378 -400 699 50 -602 551 544 -653 -14 521 -418 -356 666 -77 -585 437 323 -598 74 513 -301
2644 -301 -178 714 -72 -610 414 145 -678 67 574 -571 -29 578 -155 -416 924 167 -477 344 514
2663 514 -763 28 512 -612 -426 625 -343 -641 520 213 -548 430 658 -559 -136 708 -269 -468
2681 -468 432 -2 -826 187 275 -626 82 530 -286 -55 599 17 -359 352 378 -665 -178 371 -581 -284
2701 -284 447 -80 -360 483 289 -553 313 368 -448 -73 468 -472 -312 507 -149 -613 414 563 -459 76
2721 76 708 -275 -136 783 -46 -721 382 65 -760 71 323 -664 -244 566 -57 -454 619 -24 -417 466
$$ packed form
2588d93M52P35q79l78J297n25q89Q84M26j222N44R24j270j64J189q32o85J270
2606C84j48r48P53O40j394M11J043q19n49J207l08j135J140K94j147N85P42j129
2624c78k2J099o49o52J153pj197O39N35r39O2J022p43n08J022j14r21O72M39q14
2644c01J23Q92p86n38J024k69q23P45N07j145N42O07p33k61J340p57o44Q21J70
2663E14j277P91M84j124J86J051r68k98J161l07p61R78K28j217M23Q44r77j99
2681d68R00m34q24J013Q8r01P08M48q16K31O54n82l76P11K6j043M87N49r52K97
2701b84P31n27k80Q43j94q42Q66N5q16L75N41r40J60Q19o56m64J027J49j022N35
2721G6O32r83J39R19q29o75J103l17q25Q31K52r87M20Q10o23l97J073o43l93Q83
$$ plain form
2741 466 460 -499 -54 502 -271 -215 386 -25 -593 292 303 -373 42 562 -402 -85 553 -125 -628 521 197
2762 197 -598 114 367 -312 -3 602 -197 -435 596 90 -623 478 343 -684 -143 480 -460 -201 523
2781 523 -82 -389 398 474 -532 172 500 -273 -64 501 -191 -391 408 -40 -529 184 319 -551 -147 423
2801 423 -455 -343 457 -5 -542 377 416 -534 18 568 -370 -221 628 12 -305 433 206 -656 261 416
2821 416 -605 -219 465 -503 -408 563 -85 -668 297 359 -537 118 508 -447 -243 658 3 -389 279 258 -648
2842 -648 91 514 -294 -120 259 -28 -350 373 255 -418 151 334 -415 -19 374 -208 -369 500 72 -444
2862 -444 196 273 -634 -5 300 -444 -274 565 -121 -623 384 188 -580 256 507 -365 -74 480 -120 -279
2882 -279 612 226 -334 275 469 -405 61 438 -176 -424 339 -113 -419 340 179 -578 143 238 -411 -106
$$ packed form
2741D66or59M45N56p73N6O01m11n68Q85J1o76M15N20r64L17O38o78n03J149l24
2762A97p95P12K53o79L09O05p99k38J031n06p13J101j35j027N41O23r40K59P24
2781E23o05l07P87P6j006P04L28p73K09N65o92k00P99m48m89P13J35q70M04N70
2801D23q78J12Q00m62n37R19L9r50N52N50r38J49Q49o16l17P38k27q62R17J55
2821D16j021L86O84r68R5R71o48n83R65O2q96O55L90r55K04R01o55l92O68k1r06
2842f48P39M23q08J74L79k87l22P23j18o73N69J83p49L96L93n82j61Q69m28n16
2862d44O40P7r07O29L05p44J70Q39o86n02J007j96p68Q36K51q72K91N54o00j59
2882b79Q91l86n60O09J94q74M66L77o14k48P63m52l06P59j61p57P21R5o49L05
$$ plain form
2902 -106 459 -194 -307 495 8 -447 55 368 -381 -40 433 -376 -323 441 170 -569 279 308 -438 59 344
2923 344 -147 -283 509 41 -416 220 159 -390 40 225 -479 -238 342 -193 -268 424 111 -505 347 306 -512
2944 -512 -78 478 -219 -164 424 142 -455 319 191 -508 68 374 -333 -301 583 -235 -378 259 50 -540 152
2965 152 183 -401 -2 539 -197 -298 542 30 -426 269 334 -448 16 315 -124 -192 497 -156 -333 265 141
2986 141 -506 54 474 -439 -161 409 -146 -228 303 -68 -294 285 324 -399 -94 419 -241 -267 396 -5 -373
3007 -373 384 231 -298 144 559 -280 -230 517 -130 -205 340 115 -418 75 385 -370 -119 502 -190 -200 291
3028 291 30 -415 103 201 -387 10 492 -152 -214 417 31 -355 182 109 -342 130 321 -282 41 416 -113
3049 -113 -426 307 0 -411 103 227 -415 -101 486 -274 -297 275 110 -251 222 251 -319 103 336 -239 -242
$$ packed form
2902a06N65o53j13Q02m87m55N02L13p49L41M73q09N3P64k71p39Q48K9p46M97K85
2923C44m91j36P92m68m57O36o1n49M30J85p04K41N80n35p5O92l13o16Q52m1q18
2944e12M34N56o97N5N88k82n97P74j28o99N76L06p07L2Q84q18j43O37k09n90O92
2965A52L1n84L99N41p36j01Q40n12m56O95O5p82M64K99m39o8O89o53j77N98j24
2986A41o47N60M20r13K78N70n55q2N31l71k26N79L9p23L05N13o60k6O63m01l68
3007c73P57j53n29M42M15q39N0P47o47p5N45k25n33M93L10p55K51O21o92j0M91
3028B91k61m45N18R8n88L97M82o44o2O31l86l86N37p3m51M72J91o03L23L75n29
3049a13l13P33l07m11N14J24o42L14N87p60k3N72j65l61M73K9n70M22K33n75l
$$ plain form
3070 -242 401 141 -294 161 220 -330 214 340 -58 -46 396 22 -223 411 -11 -273 141 106 -304 181 351
3091 351 -352 -272 332 -225 -334 150 204 -337 1 244 -251 -184 386 -50 -297 461 -17 -310 337 247 -304
3112 -304 -88 395 -222 -244 268 223 -414 174 290 -339 13 178 -339 -191 379 56 -275 211 193 -467 131
3133 131 293 -241 -62 375 2 -151 304 27 -444 279 231 -484 71 420 -165 -157 338 -35 -462 211 135
3154 135 -381 151 284 -369 -269 380 -66 -358 182 24 -375 54 296 -185 79 342 -198 -239 286 185
3174 185 -334 203 179 -360 -112 290 -410 -206 389 -32 -263 168 160 -477 40 161 -352 -107 374 -111 -425
3195 -425 432 115 -268 128 325 -276 -211 395 -82 -233 344 -54 -238 153 143 -269 -91 404 -341 -83 397
3216 397 -17 -308 179 210 -224 136 222 -298 -73 201 -93 -211 259 70 -253 150 203 -377 -18 295 -218
$$ packed form
3070b42O43k60m35M55N9n50N44J26l98J2M42l74k45O34m22k62M14l5m10M85J70
3091C51p03Q0O04n57j09M84N4n41L38K43m95O7N70m36k47P58m78k93O47r0n51
3112c04K16M83o17k2N12m5o37N88J16o29L52J65n17J48N70l23l31M86j8o60N98
3133A31J62n34J79M37l73j53M55k77m71P23m8p15N55L49n85QM95l73m27O73p6
3154A35n16N32J33o53J00O49m46k92N40j58l99M29K42m81K64K63n40m1N25j01
3174A85n19N37k4n39K48M02p00K04N95m21k31M31qo37N17J21n13K45M81m85l14
3195d25Q57l17l83L96J97o01O5O06m77j51N77l98j84L91j0m12J78M95p45K58M80
3216C97m14k91M87L1m34L60Q6n20K25K74k94j18M70j89l23M03N3n80L59L13n13
$$ plain form
3237 -218 -77 310 114 -106 304 9 -349 29 266 -192 -37 438 -221 -441 83 64 -244 30 271 -204
3257 -204 13 418 -313 -67 423 64 -208 140 331 -171 67 309 -187 -63 315 -127 -185 222 28 -290
3277 -290 68 226 -225 -80 295 -406 -179 246 29 -355 204 117 -200 43 315 -170 -196 101 -21 -237 224
3298 224 166 -355 95 331 -253 108 394 -110 -405 258 110 -183 83 272 -443 -111 182 -286 -199 327 -97
3319 -97 -332 234 -46 -277 -22 178 -293 -147 355 67 -158 272 169 -376 79 164 -150 64 185 -139 -101
3340 -101 353 141 -185 -16 365 -327 -48 135 -169 -191 184 -126 -342 143 88 -355 -10 192 -387 -10 396
3361 396 -55 -303 416 77 -437 211 203 -131 -87 299 -175 -113 327 -55 -396 121 99 -239 -21 313 -173 -86
3383 -86 190 -156 -134 138 51 -325 143 189 -202 -83 387 -13 -193 172 108 -272 62 249 -215 -111 298 -108
$$ packed form
3237b18J41L87j96k20M10k95l58L78K37m58J55M75o59k20N24j9l08K74K41m75
3257b04K17M05p31K46M90l59k72L48J91n02K38K42m96J24L78m42n8M07j94l18
3277b90L58J58m51J45L75p01K27M25k17l84N59q7l17K43K72m85k6K97j22k16M61
3298B24n8n21M50K36n84L61K86n04k95O63j48k93K66J89p15L32K93m68Q7N26m24
3319i7k35N66k80k31K55K00m71J46N02k88k25M30j03n45M55Q5l14K14J21l24L8
3340a01M54k12l26J69L81o92K79J83l04k2L75l10k16M85n5m43L45K02n79L77M06
3361C96m51k48P19l39n14O48ql34M4L86m74O2M40l82l41N17k2l38K18L34m86Q7
3383h6K76l46K2K72q7l76M68M6l91J19M70m00j80L65o4l80L34J87m64J04M09m06
$$ plain form
3405 -108 -96 472 -67 -197 162 -12 -162 -164 165 -185 -161 231 32 -310 284 5 -220 102 158 -274 -66 185
3427 185 -1 -267 217 97 -280 121 183 -107 122 156 -123 -52 425 -57 -156 108 107 -187 16 204 -178 -57
3449 -57 265 -4 -293 154 226 -155 88 133 -92 8 156 -245 -17 409 112 -279 155 133 -306 28 206
3470 206 -206 -191 319 -201 -357 50 150 -252 20 163 -222 -73 146 -33 -79 339 63 -284 230 -64 -219
3491 -219 71 211 -144 -218 293 -12 -147 150 3 -289 130 212 -143 -126 358 -171 -206 214 67 -198 50
3512 50 166 -311 -49 245 -98 -398 244 4 -237 96 94 -317 -75 244 -225 110 399 -1 -47 209 152 -96
3534 -96 138 275 -292 -115 172 -131 -200 286 10 -100 179 50 -148 118 245 -216 -15 229 -52 -292 1
3555 1 169 1 54 305 -107 -2 218 -152 -170 139 57 -205 151 167 -18 -78 189 -202 -91 247 -3 -209
$$ packed form
3405a08J2N68n39j30L59j74j50kL29l50K4L92j99l42N94k79k25L22N6m32K08K51
3427A85j86k66M84j20l77M01O2k90K29L4k79P1M77m82r9K64jk94K03J88l82J21
3449e7L22k69k89M47P2l81K43M5k25J00J48m01K28M26k97l91M34k2m39L34J78
3470B06m12J5N10n20j56M07J00m02K72J43l85J49K19j79m6M18k76l47N14k94j55
3491b19K90J40l55p4N11l05j35K97j47k92M19Q2l55J7M84n29l5M20j47k65K48
3512E0J16m77K62K94l43l00O42k40k41L33km11K42L19m69L35K89m00m6K56n7k48
3534i6K34J37n67J77K87l03o9M86k76j10K79j29j98K66J27m61K01K44k81k40K93
3555AJ68j68N3K51m12J05K20l70j8L09q2k62L56J6j85o0K67l91J11L38k50k06
$$ plain form
3577 -209 159 -124 -110 56 366 -255 -2 320 -243 -88 75 125 -327 16 275 -52 -119 338 -11 -82 111
3598 111 52 -111 221 140 -217 -163 182 -26 -179 179 -204 -304 122 -12 -237 126 135 -311 -209 104 -243 -359
3620 -359 131 34 -268 187 215 -281 28 176 -30 91 37 -67 -6 113 185 -247 5 209 -295 -188 92 35
3642 35 -200 213 36 -389 -88 249 -223 -14 259 -267 -255 282 148 -77 142 97 -49 31 302 -199 -125 174
3664 174 20 -121 25 82 -295 79 143 -182 51 165 -27 -216 206 23 -317 104 114 -36 133 266 -75
3685 -75 -44 227 -53 -246 215 44 -319 -45 166 -8 -5 165 -16 -303 132 24 -283 129 123 -49 -24 159
3707 159 122 -199 185 115 -243 192 147 -137 -15 -1 -45 -165 292 -58 -247 114 14 -246 -30 163 -250 -8
3729 -8 288 -33 -141 189 15 -82 223 144 -118 -108 158 17 -110 261 -136 -317 269 73 -225 -16 112 -100
$$ packed form
3577b09L68k83J4J66L10o21K53L22n63J55J63N0m52L43K59l27o7M57l49p1J93
3598A11n9j63L32q1l57N4L45k08j53L58l83j00M26j34k25L63Rm46J02L13l47j16
3620c59M90r7l02M55K8m96L09J48k06J21n4j04O1J19P2m32K52K04n04J07K80n7
3642C5k35M13j77m25L01L37m72K09K73n26J2N37j34k25K19m5j46Q0K71n01P4K99
3664A74j54j41J46N7l77L74O4l25K33J14j92j89M22j83l40M21J0j50J69J33l41
3685g5L1K71k80j93M61j71l63K74K11j74LJ70j81k87M35j08l07M12oj72K5J83
3707A59l7l21L84p0l58M35m5k84J22J4m4j20M57l50j89L61j00k60K16J93m13K42
3729hK96l21j08L30j74r7L05p9k62J0K66j41j27L71l97j81N86j96k98K09J28k12
$$ plain form
3751 -100 -2 227 -23 -131 182 132 -130 193 175 -13 92 72 -77 0 206 -85 -140 156 50 -93 -85 199 -145
3774 -145 -182 174 -15 -292 220 -12 -188 179 142 -40 0 375 -35 -105 243 7 4 -96 202 -185 -94 240
3796 240 -300 -203 266 -25 -195 197 -50 -257 25 105 -109 -137 168 -70 -143 192 55 -142 -78 145 -236 50
3818 50 -21 4 -57 154 150 -75 159 77 -158 -54 399 -64 42 167 -7 -227 100 87 -89 -102 50 -65 -75
3841 -75 119 -3 -127 59 119 -78 77 151 -131 -16 280 -36 30 121 -20 -222 335 -90 -112 199 70 -242
3863 -242 50 200 -105 -159 139 -58 -215 58 130 -140 -89 30 -59 -44 88 60 -60 126 -44 -307 17 48
3885 48 -50 -96 119 46 84 54 -69 -36 -35 132 -87 -93 41 -81 -88 115 -40 -189 81 -11 -192 -94 122 -96 -38
3910 -38 -39 26 -77 53 -25 -283 265 128 -312 5 168 66 -134 125 149 -140 68 -14 -49 40 185 -28 -282
$$ packed form
3751a00R8K29k50j08L13n0k62L23j8j88J05k0j49P7K06k91n5K96j06j43QK84l44
3774a45l7L56j89k77N12k32j76L67l7j82M0L75m10p0L48k36lj00K98l87R1L34
3796B40n40R7M69k91j70L92k47k07K82Q0k14k8L05k38p3L35j37j97O4K23l81K86
3818E0p1K5o1K11mk25K34q2k35J04M53m63J06J25j74k20L27j3j76j3J52j15j0
3841g5J94j22j24J86O0j97J55P4k82J15K96l16O6R1j41k02N57m25k2L11j29l12
3863b42K92J50l05n4K98j97j57K73P2k70N1J19q9J5J32k8j20J86j70k63L24L1
3885D8r8m6K15p3L8l0j23L3JJ67k19oJ34j22pK03j55j49K70r2j81R8K16k18N8
3910c8jO5j03J30p8k58N48j37m40L17J63j02k00K59K4k89K08q2l5Q9J45k13k54
$$ plain form
3933 -282 54 67 -36 74 -78 -184 -30 88 -63 -26 316 -117 -16 72 39 -63 109 86 -164 -39 80 -33
3955 -33 -142 181 -125 -48 92 106 -117 7 140 -186 -254 180 33 -142 2 82 -109 -8 16 -34 12 183 3
3978 3 -102 103 118 -84 34 77 -86 35 -25 52 -45 146 29 -175 38 159 10 195 103 -139 -109 -45 -115 11
4002 11 67 -41 -153 -51 95 -3 5 19 -53 -6 116 39 -178 8 4 -96 56 164 -296 -144 54 -66 -87 177
4026 177 156 -189 163 -74 -55 34 140 -162 -162 109 64 -98 -21 -1 -16 -2 21 6 -26 61 35 101 88 128 -7 -26
4052 -26 115 -169 -71 256 46 -133 141 226 -90 -47 157 -93 4 208 -50 -110 12 -117 -434 25 142 -169
4074 -169 63 96 -69 -44 123 102 -41 138 158 -115 43 60 -163 -10 100 -42 -81 145 205 -190 104 -45
4096 -45 -111 -14 75 23 -86 92 20 -13 90 175 -224 63 183 -228 44 39 50 -158 -58 9 -33 94 139 -72 -150
$$ packed form
3933b82L36J3j03J10j52j06J54J18j51L7L42m33J01Q8l3j02J72k3k50J25J19j13
3955c3j09L23l06P7J40J4k23J24J33l26o8M34j47j75J44Q0j91J01K4n0M6J71j80
3978Cj05K05J5k02J18M3j63J21o0P7r7J91j17k04K13J21j49J85r2k42L0O4p0J26
4002A1N6j08j12J02J46r8QJ4p2M7J22p7k17J86mj00J52J08m60J52J98j20k1K64
4026A77k1l45L52k37J9Q9J06l02%K71m5j62P7K0j5J4K3j5l2Q7k6O6j3M0j35j9
4052b6J41k84R8L27k10j79K74Q5l16M3K04k50R7K04k58o0J22j29l17M59J17l11
4074a69K32L3j65K5J67k1j43J79K0k73J58J7k23J53J10j42l9K26O0l95K94j49
4096d5o6R7Q9n2j09J78p2l3J03Q5l99K87J20m11K72nJ1k08J00O7m2J27M5k11p8
$$ plain form
4121 -150 59 -34 48 80 6 -61 -50 6 -146 38 -23 -90 -221 9 103 -121 50 -113 -57 76 51 -109 -81 292
4145 292 -127 -197 155 -36 -79 22 -20 -85 -35 165 12 -72 50 163 -13 126 100 -137 -25 39 -129 -77 281
4168 281 51 -29 253 82 -49 71 204 -109 -4 118 -11 -92 61 -51 -174 -127 105 -54 -50 40 91 -2 -16
4191 -16 201 -108 72 -37 26 152 43 -247 -40 27 -152 -216 189 -43 -153 -21 159 -86 117 199 -148 140
4213 140 91 -22 -183 471 -51 40 12 122 -131 -184 198 134 -164 41 -50 -148 39 -17 -110 -43 -51 -101 -16 168 78
4238 78 -53 31 129 -89 67 -93 -72 10 202 -90 46 143 76 -153 -21 -31 -133 3 98 188 -206 -1 11 -45
4262 -45 18 207 13 35 199 -74 -132 156 137 -178 118 168 -31 28 128 34 24 166 -79 -257 20 14 19 61 -99
4287 -99 -62 -94 214 -239 -3 104 -65 -106 48 -48 46 83 137 -30 20 162 -87 -81 216 152 -116 128 109 -149
$$ packed form
4121a50K09r3Q2L2p4o7J1N6j52J84o1o7j31K30R4k24J71j63N6J33k5j60K8L73
4145B92m19p0L52j91m3J01m2o5N0K00j53q4J22J13j76J39k6k37J12O4j68N2L58
4168B81k30q0K82j71j31J20J33l13J05J22j29q1J53j12j23M7K32j59MR0N1r3j4
4191a6K17l09J80j09O3J26j09k90K07O7j79o4M05k32j10J32J80k45K03Q2l47K88
4213A40m9j13j61O54n22R1k8J10k53n3L82o4k98K05r1r8J87n6r3O7qn0Q5J84r0
4238G8j31Q4R8k18J56j60K1Q2J92k92J36R7o7k29J32j0j02J36R5R0l94K05J2n6
4262d5O3J89j94K2J64k73n8K88j9l15K96N0j99N9J00r4j0J42k45j78K77oNM2j60
4287i9L7l2L08m53K36J07j69m1J54r6R4L7N4j67N0J42k49OK97o4k68K44j9k58
$$ plain form
4311 -149 -156 45 43 -8 48 42 -146 111 45 -152 -90 -54 -7 -157 -25 -39 -190 164 36 -215 -66 54 -118 179
4335 179 108 -3 -33 -37 -70 -41 94 91 63 42 108 -34 -41 38 87 -146 92 185 -192 19 63 -82 -59 124 2 -37
4361 -37 33 0 -60 45 117 -80 43 129 -47 -16 168 -67 -102 157 136 -12 138 237 -68 -37 -2 -50 -43 9 68 3
4387 3 -80 184 -91 80 -51 127 34 115 15 -296 -15 304 -31 -70 83 -82 -92 74 -190 -269 186 -87 45
4410 45 190 45 -86 45 120 114 -56 -10 148 -132 -92 58 76 82 66 -111 -70 117 -46 -161 107 92 -205 35
4434 35 43 -42 -102 146 49 95 111 -63 44 -34 23 25 -204 30 86 -106 -16 92 -59 10 -100 -39 -43 -16 -3 38 -37
4461 -37 47 31 -70 14 -62 -46 212 32 -53 -39 57 -106 -56 -3 49 55 92 -3 33 307 -7 -56 -23 43 -130 101 141
4488 141 23 -36 122 21 -59 18 -44 -115 104 -78 99 95 267 34 -5 -22 196 -94 129 76 -125 181 110 -165
$$ packed form
4311a49pK01kn1N6oj88K57o6j97O2L6M7j50J32j4j51L54j28k51J49J20j72K97
4335A79p1j11l0ml3K9J35lk8k1O6j42pP9M9k33K38R3l77K11M4j45K3J83j22l9
4361c7P0l3o0J05P2j97J23Q6j76L1J84k35l5K59k1j48J50R9l05L1L5m8PN2N9o5
4387Cq3K64k75J71j31J78r3Q1j00l11K81L19l35l9J53j65j0J66k64p9M55k73J32
4410D5J45j45j31J31P5oj70M6J58k80M0J50J8Oj6j77M1J87j63j15K68j5k97K40
4434C5Qq5o0K48r7M6J6j74J07p8N7Kk29K34N6j92R0J08j51O9j10O1mK7J3M1p5
4461c7Q4j6j01Q4p6J6K58j80q5J4R6j63N0N3N2OL7r5L6K74l14m9L3O6j73K31M0
4488A41j18n9J58j01q0P7o2p1K19j82J77mJ72k33l9j7K18k90K23n3k01L06p1k75
$$ plain form
4512 -165 66 38 -147 -102 -7 -118 -112 22 -141 2 53 4 -120 80 107 42 143 90 -25 -60 13 78 58 -82 25
4537 25 38 53 176 39 -8 41 -40 -106 -166 135 -47 -175 -15 -85 -201 -18 218 -50 -57 67 -202 58 -105 7
4561 7 -7 154 183 -54 37 155 -153 35 250 -188 -139 -87 50 0 -16 6 -124 261 -13 -70 -114 -52 81 -174
4585 -174 111 -3 34 182 12 46 88 227 -69 21 73 -39 -52 -47 160 -142 79 30 30 33 55 -52 0 -30 -39 -201
4611 -201 -81 108 -127 -1 -139 -126 115 179 -91 -204 -46 131 28 3 179 52 -116 -64 83 -193 91
4632 91 -5 -76 84 57 6 -109 95 -79 -13 117 137 -116 -24 -92 -205 37 -64 -95 -74 47 -187 45 50 -43 32
4657 32 -55 108 -72 -53 53 79 -47 -7 148 32 70 82 -44 8 209 26 -84 -92 19 -10 56 25 -19 -67 -15
4682 -15 -75 -7 61 29 -33 72 -44 -238 110 86 -132 -149 150 136 26 197 73 70 102 23 -10 -112 31 -128 150
$$ packed form
4512a65K31k8j85M5R5j11OJ34j63J43N1m9j24K00K7o5J01n3j15l5P3O5k0j40J07
4537B5J3J5J23j37m7M9q1o6o0L01j82j28J60p0j16J83K36k68pJ24k69K60j63J12
4561Gj4J61K9k37R1J18l08J88K15m38M9N2J37n0j6K2j30L85k74n7m4O2J33k55
4585a74K85j14L7J48j70L4M2J39k96R0N2j12j3NK07l02K21m9%LK2j07N2l0rj62
4611b01J20J89k35J26j38J3K41O4k70j13J58J77j03k5J76j27j68N2J47k76K84
4632I1r6p1J60k7n1j15K04j74O6J30K0k53R2o8j13K42j01l1K1J21k34K32Nr3P5
4657C2q7J63j80J9J06K6j26M0J55j16L8J2j26N2K01j83j10qJ11k9O6l1m4m8N2
4682a5o0O8O8l2o2J05j16j94L48k4k18j7K99j4j10J71j24lL2p9l3j02J43j59K78
$$ plain form
4707 150 138 -19 -45 -42 -101 -33 61 -9 18 -111 87 11 66 55 -105 -153 230 96 -40 53 96 -67 -35 78 75 65
4733 65 70 55 -43 -19 112 50 123 -36 -16 -59 82 -11 -165 -6 -20 -144 69 83 -94 -6 98 -37 23 66 179
4758 179 -74 8 65 -86 -47 68 63 -29 121 -134 -151 28 -20 -39 1 -79 11 -85 76 -157 -97 -56 130 -5 -79
4783 -79 48 -70 -92 75 -41 68 71 -15 -36 -86 34 160 188 -111 -32 -53 -89 -6 29 -25 -77 -69 -99 176 123 -156
4809 -156 -153 -90 -35 49 48 28 9 19 -80 -59 6 64 22 -42 24 -56 -11 94 7 83 21 47 20 4 -45 -138 52 63 -42
4838 -42 -18 -12 -138 -14 -37 -27 -131 3 67 -67 19 -129 -34 -6 65 -65 -45 -84 73 -141 92 125 -40 107 -27
4863 -27 -31 -177 31 62 88 -69 -105 -114 124 247 -104 196 85 -85 24 147 126 -118 61 43 -44 60 63 -89
4887 -89 35 54 -30 -218 147 -104 -48 46 -5 -69 -13 97 70 -77 -82 70 -47 -17 99 -157 -119 21 121 -29
$$ packed form
4707A50j2j57k6Ln9O8R4p0K7j29J98p6N5j1j60m8L83j34j36R3M3j63L2J13lj0
4733F5Nj5r8K4J31o2P3j59K0m3J41r3j54J59j4j24K13J4j77Q8J04j35O0M3J13
4758A79k53Q2N7j51L9J15nr2J50k55j7J79m8j9M0q0R0r6J61k33O0M1J86j35p4
4783g9J27j18k2J67j16J09Lq6k1n0J20J26K8k99P9k1l6Q3L5n4n2Ql0K75n3k79
4809a56LO3N5Q4jk0j9J0r9K1O5N8m2o4O6q0M5J05q7P6o2K6k7j6m9r3J90J1j05
4838d2K4Oj26J24k3J0j04J34O4j34Q6j48R5K8P1j30K0l9J57k14K33L3j65J47j34
4863b7mj46K08L1K6j57l6rK38J23l51L00j11j70J09J23k1k44J79j8q7J04Lj52
4887h9J24J9q4j88L65k51N6R4n1o4N6J10k7j47nJ52j17L0J16k56L8J40J00j50
$$ plain form
4911 -29 31 -36 85 -1 -92 -83 7 181 -47 37 8 40 76 60 -102 92 122 86 0 4 3 -1 82 72 18 -98 36 -7 -86
4940 -86 61 49 -25 -36 48 -16 -126 22 76 -166 -24 116 7 59 25 -52 -140 141 -83 -157 -110 -2 7 -12 -17 -61
4966 -61 -7 -78 -44 6 -86 -36 -100 42 34 25 34 -31 -4 -149 -4 50 -36 -154 125 213 -66 142 -88 109 6 -11 -105
4993 -105 101 -11 -100 5 96 64 -27 22 -7 -72 -59 122 45 -58 22 126 -60 143 116 -181 -93 23 -145 48
5017 48 102 47 -162 123 69 87 -50 51 8 -29 24 15 -27 -103 -1 -63 90 -112 24 19 112 -77 -63 -72 26 37 122
5044 122 103 69 98 -29 77 -65 -70 -100 72 146 65 -260 -6 -222 -174 -88 -46 -134 -19 -12 -43 -82 79 -19 -144 51
5070 51 57 -74 63 -50 187 -51 -34 -44 35 44 108 -100 167 -78 -220 122 87 6 38 -55 16 -136 -42 -69 -6 -28
5096 -28 70 -63 7 70 -139 -94 -6 -31 44 61 133 -78 -2 10 145 -45 -47 79 -148 60 47 -141 2 -41 88
$$ packed form
4911b9O0o7J21q6r1RR0J74k28Q4k9L2L6j6j62J94L0l6q6MjmQ3j0n4j16J34m3p9
4940h6J47j2p4j1Q4o4j10J48N4k42J42J40j09N2l4p7q8K81k24p4M7J08Rj9nm4
4966f1N4p1L4N0r2N0o4J42qrRo5K7j45J45N4q6j18K79Q8k79K08k30J97j03j7r4
4993a05K06j12q9J05R1l2r1M9k9o5J3J81p7j03Q0J04j86K03k7k97Q8J16j68J93
5017D8N4n5k09K85n4J8j37J01m3l7N3rm2p6J02o2J53k02J36nR3j89J4rR8J1Q5
5044A22j9l4K9j27J06j42nl0J72P4q1l25K54k16M8Q6M2q8J15Pl1l9J61r8j25J95
5070E1Oj31J37j13K37k38J7j0P9RO4k08K67k45j42L42l5q1L2r3P1j52R4k7O3k2
5096b8R8j33P0O3k09M5Q8k5P5J7P2k11P6J2J35j90kJ26k27K08j3j88J43m3J29
$$ plain form
5121 88 -34 -62 67 -131 74 73 -11 -102 -14 8 96 123 -9 -135 -44 -48 -38 -131 -58 64 35 3 20 -3 4 115 98 32
5149 32 183 -35 -39 82 -143 2 4 14 58 -45 -127 14 49 36 -141 -53 -106 -201 46 33 -18 -83 -7 75 10 53 54
5176 54 -42 -112 -91 128 104 -98 -173 75 -14 -28 -43 -107 169 -143 12 188 77 -104 50 -22 -47 -127 69 -212
5200 -212 162 110 -155 -179 191 -25 66 175 19 72 33 168 84 210 -126 -76 -65 -44 92 -5 119 -40 -104 -122
5224 -122 214 17 61 107 -30 3 -8 43 -54 -94 -8 -48 47 54 63 32 31 -13 47 -17 37 37 -66 103 -136 158 -6 -175
5252 -175 -41 74 68 -101 92 21 -67 -86 179 154 -46 12 98 73 42 18 -101 -56 70 -35 -22 43 -86 -79 57
5277 57 -58 -29 7 -52 97 212 42 15 -197 146 -71 -58 -84 54 -67 -105 -24 -65 -32 -31 0 -18 -73 86 -80
5302 -80 -57 -97 -126 -45 27 55 29 -77 -19 13 -4 69 -89 -249 -179 -18 -38 -22 -60 67 51 24 -95 -105 -49 160 -155
$$ packed form
5121H8j22k8J29j98K05jq4r1Q8K2Q8K7j32j26R1mJ0r3P3J22k9l2J7k3PJ11j7o6
5149C2J51k18mJ21k25J45KJ0M4j03q2J41L5j3j77Q8n3r5K47j3n1o5P6Q2o5M3J
5176E4r6p0K1K19k4k02p5K48q9j4j5o4K76l12J55J76j11j81J54p2k5q0J96k81
5200b12L74n2k65k4L70k16R1J09j56N3l9J35q4J26l36N0J1K1J36r7J24j59o4j8
5224a22L36j97M4M6j37L3j1N1r7m0Q6m0R5PRl1jm4O0o4N4%j03J69k39K94j64j69
5252a75J34J15oj69J93p1q8j9K65k5k00N8Q6k5l1k4j19M5J26j05J3O5j29PJ36
5277E7j15K9L6n9J49J15j70k7k12L43k17J3k6J38j21l8Q1m1L3JL1j8n5J59j66
5302h0K3m0k9Q1P2K8k6j06N8L2j7P3j58j60P0J61k0J6l8J27j6k7j19j0N6K09l15
$$ plain form
5329 -155 -77 36 186 119 75 -23 -75 -76 73 -81 95 32 24 113 71 -98 97 -8 8 -106 89 149 -6 -48 -102
5354 -102 -102 -145 -91 -96 63 59 93 5 -146 28 36 -131 114 -104 13 186 -68 -81 -6 130 15 -57 -108 3 -42 -83
5380 -83 -1 -115 -47 -21 57 -128 30 12 118 100 -16 -3 -62 -111 -136 64 -186 76 -76 40 -12 60 18 -5 37
5405 37 72 52 -48 -67 4 4 47 -220 -22 -105 -158 19 -61 -22 -84 -34 43 -60 -158 47 85 -50 12 -44 -41 -26 -132
5432 -132 -42 111 -134 102 122 -48 136 -50 41 39 64 -80 -222 15 5 -30 -48 -41 -59 -119 29 -113 -202 52 -98
5457 -98 106 23 -62 31 162 89 96 77 -74 -40 79 103 -130 -161 4 -63 26 61 -152 12 -37 51 -40 144 -66 48
5483 48 -99 59 138 -4 -137 -76 26 -143 -39 59 116 74 -72 47 -126 54 -87 -138 -52 37 -28 71 143 81
5507 81 -107 -38 101 80 -7 -130 66 -8 -12 66 -33 80 -34 -55 -52 -53 71 -110 12 -29 -17 245 -64 -44 136 -49
$$ packed form
5329a55P8J13J50o7m4r8n2jJ49j54J76o3qQ9m2j69J95j05J6j14J95O0j55m2n4
5354a02%m3N4nJ59mL4q8j51J74Qj67K45k18J17J73k54j3P5J36j15p2n1J11m5m1
5380h3Q2j14O8K6P8j85J58j8J06j8j16J3n9m9k5K00k50K62j52J16n2P2m2k3M2
5405C7L5k0j00j9P1%M3k67J98q3n3J77q0L9o2N0P7j03r8K05L8j35O2n6LJ5j06
5432a32R0J53k45K36K0j70J84j86R1kK5j44j42K37j0l5j8Pj8o0J48j42q9K54j50
5457i8K04q3q5R3J31p3Pj9j51L4J19K4k33l1J65o7Q9L5k13J64m9Q8r1J84k10J14
5483D8j47J58P9j42j33O1J02j69J04R8N7m2j46J19j73J80j41n1Q6Q9o5R9P2o2
5507H1j88O9J39k1q7j23J96p4mP8r9J13j14k1LjJ24j81J22m1J2K62l09K0J80j85
$$ plain form
5533 -49 94 6 -42 -39 56 -54 -77 95 71 -125 85 72 -177 32 -173 -141 8 24 29 72 -15 38 -26 -130 -137 -19
5559 -19 109 115 -42 164 133 34 41 135 47 -49 42 131 -156 -47 3 -114 11 31 79 -68 1 -66 71 55 -2 -110
5585 -110 -61 28 -96 55 59 160 23 176 47 6 -4 -116 -44 -28 -60 -84 -59 16 74 -88 69 33 21 -158 -23
5610 -23 -20 -76 -76 83 -15 145 0 75 -88 -46 52 -141 -6 102 -66 42 45 -6 22 91 -35 34 15 -12 -129 23
5636 23 -136 9 -5 -19 29 42 -162 -153 13 180 39 -139 -38 -148 115 -28 -32 25 159 -7 69 -80 -144 -76
5660 -76 101 24 -45 -13 -14 156 100 -89 42 17 -14 -49 -21 -126 -70 -41 -98 -36 -44 -43 -141 -61 -88 -8 -22 135 80 -68
5688 -68 73 73 6 50 114 -89 -130 -48 113 -44 8 34 30 -45 27 3 55 -110 12 46 -113 79 -60 45 15 -93
5714 -93 53 4 108 7 35 212 -21 171 -46 36 -12 8 -112 5 -28 43 51 23 -175 76 -153 45 -86 -85
$$ packed form
5533d9J43q8m8LR5j10k3J72k4j96K10j3k49K09k05L2J49J6NM3q7N3o4j04pJ18
5559a9J28Oj57K06l1r9PR4q8r6R1Q9k87J09N0j17J25K0M8j47O9o7J37j6n7j08
5585a10M9Q9j24J51MJ01j37J53j29m1j0j12P2J6l2k4K5P5N8j62J57l6j2j79J35
5610b3Ln6%J59r8J60j45P5j63M2R8j93J35J08j68J08Ln1K8O9j26O9j9k7j17J52
5636B3j59J45j4j4M8J3k04RJ66J67j41j78J01j10K63j43mN7J34j66P6j49o4O8
5660g6J77p7o9L2jJ70n6j89J31k5l1l5K8j05N6K9n7O2qJr8Q0k7Q0j4J57n5j48
5688f8J41%o7M4O4k03m1Q2J61j57N2K6mp5P2k4N2j65J22L4j59J92j39J05l0j08
5714i3J46m9J04j01K8J77k33J92k17Q2m8K0j20J17l3P1Qk8j98K51k29J98j31J
$$ plain form
5738 -85 -28 48 46 104 79 -120 -91 180 -1 -17 -32 -36 -86 4 28 -85 -41 185 11 -86 -53 11 32 -81 -43 12 -114
5765 -114 53 -131 217 47 -82 -39 -131 -132 151 18 -176 -66 44 -101 -8 -20 48 197 -49 92 -46 -78 -136
5788 -136 47 42 -81 42 -85 54 -33 83 22 -60 67 77 1 5 134 111 -33 -10 -60 -137 94 -15 13 -52 -109
5813 -109 70 68 -82 115 -29 39 34 -13 -22 10 141 134 -59 -6 -54 110 -92 44 46 77 -55 -28 -127 -141 61 21 -59
5840 -59 -37 -16 7 -52 117 38 -14 -120 -42 25 117 36 -14 44 -24 31 122 30 -35 24 156 26 -111 115 -29 -20 -145
5867 -145 34 -44 49 67 -93 -23 -132 19 -35 51 -2 33 42 70 -3 88 74 -62 -85 18 25 -61 -105 -105 -113 -18 11 90 105
5896 105 -111 55 -56 -12 -33 -22 -97 9 -22 -8 -4 64 -29 17 -30 -126 -101 45 -40 30 -12 122 2 92 -27 55
5922 55 -61 62 -5 60 72 -201 -46 12 -66 -49 -52 -66 -39 4 -27 92 -93 -203 -108 -72 89 140 -82 1 -98 -45
$$ packed form
5738h5N7P6kN8k5j99K9K71j81j6j5mn0R0K4j13M4K26j74r7L3O4K1j13L8N5j26
5765a14J67j84L48j70j29M3r2jK83j33j94J10J10j45R3j2O8J49k46J41j38l2n8
5788a36J83nj23J23j27J39q7J16o1q2J27J0p6MJ29k3j44K3n0p7K31j09K8o5n7
5813a09J79kj50J97j44O8nm7rL2J31pj93N3m8J64k02J36KL1j32K7r9j4K02m0q0
5840e9K2K1K3n9J69p9n2j06P8O7R2q1n0N8o8N5R1r2o5N9J32j30j37K26j44Rj25
5867a45J79p8R3J8j60P0j09J51n4Q6n3L5RK8p3R1j4j36k3J03Pq6m4%qR5K9P9J5
5896A05k16J66j11M4k1J1p5J06l1J4MO8r3M6m7r6K5J46q5P0m2J34j20R0j19Q2
5922E5j16J23o7O5J2k73J55N8p8J7lj4K7M3l1J19j85j10R5L6J61N1k22Q3r9N3
$$ plain form
5948 -45 -34 -97 173 -29 -102 -29 130 -68 -86 -179 88 146 26 21 37 -51 36 7 -126 168 14 -31 -47 5 -252 82
5974 82 86 -261 68 -112 62 -23 -89 -56 -167 -189 -113 -71 71 -100 58 81 22 -73 115 -35 -219 -125 152 9
5998 9 55 75 63 -124 -1 -15 -40 -36 50 -12 93 -76 -66 93 -59 37 127 -54 -21 -10 -70 -7 104 23 -124 -22
6024 -22 -17 -15 -56 36 52 -31 89 96 -10 71 -111 1 -24 6 -227 16 24 -50 91 24 130 173 66 22 -33 102 -156
6051 -156 -4 60 94 37 -103 187 -35 56 97 -27 -148 59 -93 137 35 -33 132 1 -5 -158 -106 35 33 -126
6075 -126 183 27 57 -97 -16 76 -99 49 40 -98 -189 -204 -175 -55 -115 69 75 -62 -76 17 105 60 -40 -144 25
6100 25 -120 175 138 -78 102 -65 93 2 -28 -34 137 13 10 -8 -47 112 78 -15 -87 170 31 -55 -45 68 110
6125 110 -9 101 -88 -73 -74 -73 -14 -98 -123 -89 4 13 59 52 57 -39 -25 -169 136 54 117 -79 53 -122 83 46 -38 -38
$$ packed form
5948d5J1o3K70k02p3P3J59j98j8r3K67N8j20nJ6q8Q7k9j33K94j54m5j6N2k57L34
5974H2Ml47L29j80J74q5o6L3j11k2P6M2J42j71J58K3n9r5J88j50j84R4K77j43
5998IM6K0j2j87J23j4k5MQ6o2J05j69J0J59j52R6R0j81L3J1o0O3J11q1j47J02
6024b2NKm1R2J6q3J20Pj06Q1j82J12k5L0k33K43Qp4J41o7J06M3j07m4n5J35k58
6051a56J52O4L4n7j40K90k22R1M1j24j21K07j52K30j02o8J65j31oj53N2J41kj59
6075a26L09j56L0j54Q1R2j75J48rj38r1j5K9J20o0J84Oj37j4R3Q8m5j00j04J69
6100B5j45K95l7k16J80j67J58r1l0oJ71j24lj8l9J59l4r3p2K57j39q6J0J13M2
6125A10j19J10j89J5jJN9q4k5L4R3RM6pNr6J4j44L05q2O3j96J32j75K05l7q4%
$$ plain form
6153 -38 162 -84 -48 -55 147 66 -64 -12 -20 66 87 84 132 12 175 53 72 1 60 16 -79 23 101 39 127 -113 20
6180 20 89 1 134 68 -12 -118 260 64 -26 -14 111 -171 67 77 -52 -22 27 -25 62 -37 3 31 33 -144 79 -68
6206 -68 -159 16 56 96 -44 15 8 -11 61 -2 114 40 -67 76 30 -205 77 63 -80 -167 -15 0 -102 27 -117
6231 -117 102 158 -80 -86 83 29 -31 -17 -8 -205 40 124 -52 -95 -130 47 124 -27 79 54 -20 55 -30 -163 -76 54
6257 54 71 -57 138 112 121 -6 11 24 -77 51 -121 -36 12 60 -134 -173 15 67 63 -157 -187 42 -62 9 111
6282 111 110 -99 90 9 51 -52 59 -11 -74 98 -73 4 -87 23 -10 180 -71 -117 92 -113 -7 69 -2 -26
6306 -26 76 69 -60 -191 -33 65 -18 48 -145 154 -181 -26 -43 79 -178 -56 11 -93 -40 -88 43 -93 92
6329 92 41 56 -115 -55 -38 22 -99 -10 -106 122 92 12 -11 -123 -15 -41 109 119 25 -40 -123 103 134 18 33 77
$$ packed form
6153c8K00k46L6pK02q1j30N2qQ6K1lM8j20J63j22J9p1N9m4r5J02P8o2Q8k40J33
6180B0O9q8J33o6q0j06L78j96r0J2J25k82K38J0j29L0M9n2Q7r9M0K8Kj77K23j47
6206f8r1J75M0M0j40N9pj9P2o3J16p4j07J43m6k35K82j4j43q7J52J5j02J29j44
6231a17K19N6k38oJ69n4o0J4Rj97K45Q4j76m3l5J77P7j51J06k5p4P5q5j33Q7J30
6257E4J7j28J95k6Rj27J7J3j01J28j72Q5M8M8j94l9J88N2mk20l0K29j04P1J02
6282A11jk09J89q1M2j03J11p0o3J72j71P7r1J10l3J90k51m6K09k05J06P6p1k4
6306b6J02pj29j31J58R8q3O6j93K99l35J55j7J22k57J22O7j04N3m8J31j36J85
6329I2n1J5j71O0J7O0j21Q9r6K28l0q0k3j12J08k6J50J0r4o5q3K26L1j16J5M4
$$ plain form
6355 77 39 178 -176 76 11 -151 87 -47 -210 -225 -135 -11 -6 -87 -143 -50 30 70 76 140 -120 32 74 24 82 -38
6381 -38 -35 108 -141 -18 96 -44 -10 -67 -10 159 -103 -16 -81 -157 -15 -15 -5 -1 -38 22 -71 55 211 -82 104 38
6407 38 100 85 -41 19 -26 -19 61 -44 115 -91 103 60 -97 138 29 -15 103 11 17 -78 203 26 33 125 -32 20
6433 20 95 -120 -71 14 87 105 -74 -4 -164 -55 28 55 81 15 27 -108 67 -77 -162 -47 76 -147 -13 -21 165
6458 165 -113 115 118 11 -200 204 -1 93 102 -102 -8 53 183 12 60 -149 36 -95 -12 -69 71 60 19 16 185
6483 185 -3 38 -88 53 -35 -226 128 37 -78 -33 99 -23 -12 81 86 -19 23 37 140 -85 -5 58 57 -124 12
6508 12 -31 -36 2 154 63 42 10 27 -46 62 88 12 -117 -16 59 -55 33 56 136 -73 -170 42 18 -66 19 -40 148
6535 148 53 -124 5 -78 -63 22 -61 67 20 -35 -33 19 35 68 -35 -35 -47 -7 -147 48 28 -47 92 73 172 -20 -32
$$ packed form
6355G7l8J39l54K52o5j62K38j34j63j5R0J24Nq1n6R3Q0M0OO4k60J52M2n0N8j20
6381c8LJ43k49J23J14j40L4n7N7J69k62Q7o5p6J42%J0Ml7O0r3J26J56k93J86o6
6407C8O2j5j26O0m5PQ0j05J59k06J94m3j57K35j09m4J18r2Or5K81j77PR2j57N2
6433B0P5k15M9Q5P3J8j79P0j60J09Q3K7K6o6J2j35J75j44q5J15J23k23J34qJ86
6458A65k78K28Lj07k11M04k05R4Rk04R4O1J30j71M8k09J85j31Q3n7J40j1m1lJ69
6483A85j88M1j26J41q8j91L54r1j15M5J32j22J1R3Nj05M2J4J03k25Q0O3jj81J36
6508A2m3nL8J52r1k1l2J7p3J08K6p6j29J01P5j14Q8K3Q0k09r7K12k4q4Q5n9J88
6535A48r5j77J29q3J5Q5q3J28m7n5KN2J6L3j03%j2M0j40J95k0p5J39j9R9j92j2
$$ plain form
6562 -32 21 -111 -33 118 -24 -13 -29 -135 -13 72 22 97 -157 -93 -63 -207 89 172 -31 -7 80 83 33 9 82 40
6588 40 107 -115 106 38 -142 142 55 -207 104 -23 -51 -2 -118 -57 -83 91 94 -53 52 -44 54 -88 -118 -59 9
6613 9 -80 -90 -31 -106 64 -75 -43 77 -107 -160 114 -73 55 26 -8 63 73 10 96 -9 -56 -6 -153 -12 182
6638 182 39 -73 -47 -193 -8 -199 -107 61 -93 83 -57 -60 -133 -13 123 -200 -91 119 87 -31 -151 -6
6660 -6 47 5 32 -44 84 -76 48 -5 144 -115 -114 24 -31 -45 38 -73 -57 70 -130 -27 68 113 136 110 -264 21
6686 21 -10 42 26 10 -75 -53 -69 88 -34 281 -87 25 -119 -17 -22 -44 71 152 -36 48 -100 -117 207 70 47
6711 47 145 -70 -197 -71 -82 0 107 -64 -79 -10 133 90 -32 -87 124 -24 46 69 93 -13 241 -135 -83 -30
6735 -30 -115 -104 23 -33 -33 -120 -13 -49 -102 15 30 92 -53 -49 -1 118 -58 92 7 -206 -180 -90 -34 0 87 83 -126
$$ packed form
6562c2N3j32P8J51j42J1j6j06J22Q5n0P5k54O4L0j44K96Q3k03K4Q7Ln0k4P3m2
6588D0O7k22K21o8j80K84q7k62L11j27k8M9j16O1k6J74Lj47J05r6R8j42l0N9O8
6613Iq9j0N9p5J70j39L2J20j84n3K74j87J28k9l4P1J0o3Q6j05m7N0j47J41J94
6638A82j43j12K6j46J85j91R2J68j54J76j40lp3J20J36l23J09K10l2j18j20J45
6660fN3m2K7p6J28j60J24n3J49k59JJ38n5j4Q3j11J6J27k00J03R5M5K3k6l74K85
6686B1l1N2j6j6q5K2j6J57j22L15l68J12j44J02nk2J15Q1j88Q4j48j7L24j37k3
6711D7R8k15j27J26j1Q2J07j71j5O9J43m3j22n5K11j48P0K3K4j06K54l76N2N3
6735c0q5J1J27n6%q7J07l6n3J17J5O2j45MM8J19j76J50q5k13K6R0N6L4Q7mk09
$$ plain form
6762 -126 -32 -118 -114 14 84 75 -15 -37 -151 -75 62 -70 4 -76 -129 81 -8 28 -10 -111 89 -95 92 69 11 -112
6788 -112 30 -42 -133 18 149 13 -54 9 -113 -42 29 -13 -71 -102 -25 -99 -59 33 86 -2 -31 109 -119 -122 -61 -138 -154
6815 -154 23 -219 137 -27 -19 -37 -28 75 -98 -11 -36 40 -121 25 156 -143 -51 -8 3 -164 -82 108 9 -71 119
6840 119 -151 5 129 -29 101 39 53 30 18 74 -174 -121 -70 107 193 -41 -211 -22 49 -101 106 18 -66 1
6864 1 85 -23 22 27 34 -40 -36 -76 -27 -46 86 21 20 -172 -195 -27 54 166 -98 -101 -13 -83 -19 78 45 -34 -1 92 -4 -170
6894 -170 -9 44 7 23 -48 198 57 63 99 -84 -141 -106 -78 -112 -47 -139 -104 15 -109 -74 -10 258 -24 -72 -16 117
6920 117 51 -45 55 -52 -21 120 -53 -6 -78 72 54 -87 37 66 5 57 -36 -50 14 -71 -1 32 -22 -16 96 15
6946 15 86 6 -161 -17 27 -255 -109 9 -52 -27 74 -11 8 38 47 59 128 71 -97 20 -30 -147 -22 73 -195
$$ packed form
6762a26R4q6MJ28P0rr0k2j14P6J37j32P4q0n3K10q9L6l8j01K00j84J87k3n8j23
6788a12J42p2r1J51J31j36o7O3j22P1P1m2n8l1P7p4M0R2N3q8k9J40k28lO1p7j6
6815a54J77k42L56j64Qj8RJ03j73Q7k5P6j61J46J31k99R2M3J1j67Q2J90r9q0J90
6840A19k70J56J24j58J30o2J4k3j2N6k48N3N1J77Q6k34j70J89P1j50K07q8q4O7
6864AQ4j08M5NPp4Mm0M9j9J32o5jj92k3J68Q1J12k64lQ8p0O4R7l3p9L3R3r6j66
6894a70J61N3l7J6p1K46j41OL6j83n7L5K8l4O5r2L5J19j24L5O4K68k82m8N6J33
6920A17o6r6J00j07L1J41j73M7p2J50j8j41J24K9o1N2r3j4O4q5P0L3n4OJ12q1
6946A5P1q0j67J44M4k82J46J18o1K5J01q5J9L0RJ2O9n7j68J17n0j17J25R5k68
$$ plain form
6971 -195 -74 -131 48 -172 -85 -40 35 63 55 -92 42 -3 -59 257 -88 114 80 44 -19 -89 120 -1 -55 52 -46
6996 -46 61 77 204 13 -105 -14 -10 4 147 121 13 -51 -134 37 182 -206 -8 -87 55 -13 -39 -80 -46 -27 123
7021 123 143 -181 57 111 46 -24 -43 45 -18 0 -37 -30 8 -82 52 18 -152 58 -3 -25 -47 -45 -59 -115 15 40 49 -153
7049 -153 -5 -21 37 -121 -3 -76 -29 50 124 93 -85 -49 110 0 -115 33 9 16 -66 23 137 -66 75 -103
7073 -103 -80 103 -168 -30 -91 -35 -64 38 48 -80 62 -42 12 103 -32 -32 -65 -71 -80 35 77 -168 -19 1 -28 -52
7099 -52 -93 97 -20 -4 -146 25 -75 -86 152 96 30 109 167 56 -40 104 -44 71 117 29 -52 -144 -59 -50 59
7124 59 1 72 -55 -118 -7 73 -11 84 -42 -47 -4 -47 -64 -90 63 -77 -82 125 15 58 144 -54 -27 -59 52 -9 20
7151 20 -66 102 -154 172 46 -10 -13 18 -7 31 -10 -166 82 50 55 -48 -126 82 89 8 68 96 100 104 -73 135 216 -57
$$ packed form
6971a95J21n7J79k20Q7M5P5K8qj47J34m5n6L16l45K02l4l6o3p0K09j21n4J07r8
6996d6J07J6J27j91j18R1MJ4J43k6j08o4q3J71J45l88J98p9J42o8k6m1L4J9J50
7021A23K0l24K38N4o5p0j9Q8o3J8l7PL8r0J34l4j70K10o1k2k2Kj4n6J30K5Rk02
7049a53J48j6N8j58J18p3M7P9P4l1j78L6J59j10j15J48k4Pq2Q9J14k03J41j78
7073a03K3J83k71J38o1N6k9J02J0j28J42j04N4R1j35%l3orJ15M2k45J49K0k9k4
7099e2m1J90j17J6j42J71j00j1K38n6o6P9N8j11r6J44j48J15M6q8q1r2Q5RJ09
7124E9n8P1j27o3J11Q0q4R5j26nM3m3j7k6J53j40nK07j10M3Q6j98K7l2J11o1K9
7151B0q6J68k56L26j26n6lL1k5L8m1j56K48l2Nj03p8K08Pq1O0K8MMj77K08Q1k73
$$ plain form
7179 -57 119 32 -119 69 54 109 38 10 -1 53 18 -129 -84 -103 50 22 18 59 -24 -58 47 6 142 -54 -5 18 4
7206 4 -68 -25 47 -51 6 118 -122 88 172 55 -143 -19 76 156 19 -51 -69 24 -147 152 104 53 -133 -50 157
7231 157 -91 4 -33 -14 -156 -57 76 5 -43 -66 6 -88 57 -33 80 -3 -104 98 113 -81 73 -96 31 -5
7255 -5 62 29 -52 22 102 -138 -190 7 -85 12 -45 -32 -62 -17 10 8 104 39 37 113 -136 -24 101 60 65 10 -3 -46 -36 75
7285 75 105 108 87 -13 171 132 63 30 5 150 52 -50 -26 40 86 1 -76 -81 112 43 -88 -116 88 44 -36 36 62 39
7313 39 38 109 -13 53 86 -32 -28 36 -1 129 84 134 -69 -10 76 -7 -19 18 -58 -85 -106 -85 31 73 -33 -94 71 113
7341 113 216 -62 -149 188 -77 -121 55 -9 33 31 -160 -28 -1 18 19 -8 83 -49 111 -75 126 106 7 -69 -119
7366 -119 135 -105 222 -42 33 129 222 -16 64 -47 -31 207 62 133 3 164 7 -21 14 18 36 9 -187 -55
$$ packed form
7179e7J76q7j51J88j5N5p1k8j1N4l5j47M5j9J53k8mM1q3l4J05m1J36j96M9K3j4
7206Dp2M3P2r8N7J12k40K10Q4j17j98J24R5Q0j37p0j8R3j71K99m8n1j86Q3K07
7231A57k48R5l7J9j42R9J33p1m8k3P2r4J45r0J13q3j01K02J5j94J54j69J27l6
7255eO7l3q1P4Q0k40n2J97r2R7n7J3l0M5K7kR6o5kP6k49J12J25m1Nn5j3m3J0J11
7285G5L0Lk1j00J84l9o9l3k5J45r8j02K4O6M6q5p7nJ93o9j31k8K04m4q0P2K6k3
7313C9jP1j22O6L3j18MO4l7J30m5N0k03N9Q6q3j2L7p6k7k1K1J16M2j06o1J65M2
7341A13J03k78q7L37k65m4J76o4M2kj91J32K7J9Jk7R1j32J60j86K01k0r9p6n0
7366a19K54k40L27k64P5R6R3k38Q0j11J6K38j45P1j30J61j57k8L5MJ8k7j96J32
$$ plain form
7390 -55 157 153 210 146 58 -156 99 -44 75 -36 -82 -155 54 7 -195 64 -69 58 158 12 61 142 21 20
7414 20 67 8 96 157 -121 -30 39 159 139 -106 -48 -55 33 200 -130 -167 -58 36 -118 67 69 -5 -62 -54 29 -58 -3 -39
7442 -39 21 -167 90 -140 -121 132 -138 156 -4 151 5 -64 -78 133 67 -23 156 148 84 -69 50 146 -59 -154
7466 -154 -96 4 46 -148 14 -67 -87 -29 -32 5 78 64 206 -53 -14 31 41 25 153 -79 30 47 29 54 -1 -16
7492 -16 41 111 21 -87 -225 98 16 91 -16 0 -86 17 132 -163 -41 -45 -5 60 83 -173 -79 -69 -65 -74 -72 -153 109
7519 109 -46 16 -40 18 77 81 -106 112 33 -11 75 24 44 76 50 -57 168 16 -47 -51 152 66 159 39 -79 39
7545 39 -198 70 78 5 -62 33 -89 -56 125 28 86 -47 -34 -27 96 -58 -193 47 9 -63 113 14 -60 -58 9 -71 38
7572 38 69 7 -38 39 -83 -43 -110 22 57 70 71 26 118 92 -171 -11 -82 171 -154 -152 142 -87 109 73 27 -184
$$ packed form
7390e5K12mN7o4q8k14K55j43J19j11m6p3K09m7k02K59j33J27J00j46M9Q1j21j
7414B0M7n9Q8O1k78R1O9J20k0k45N8pQ8J67l30l7J09R4j54J85Kp4n7QQ3q7N5l6
7442c9O0j88K57k30J9K53k70K94j60J55j46o9j4K11o6r0J79qo4j53J19R6k05r5
7466a54N8J00M2j94J62q1k0N8lL7P3j4J42k59L9M5J0j6J28k32J09J7j8K5n5j5
7492a6N7P0r0j08j38L23q2P5j07J6q6J03J15k95J22mM0O5K3k56R4J0MrKq1K62
7519A09j55O2n6N8N9Mj87K18p9m4Q6n1K0L2k6j07K25j52o3mK03q6R3j20j18J18
7545C9k37K68Qp3o7R5j22L3J81r7N8j33J3PJ23j54j35K40l8p2J76r9p4KO7q0J09
7572C8L1o2m5P7j22M0o7J32L5J3Jm5R2k6k63J60p1K53l25KK94k29J96l6m6k11
$$ plain form
7598 -184 118 -42 23 -45 67 77 -70 -126 -106 13 -7 28 -16 -28 -69 -123 89 -82 -1 -31 98 -48 64 64 27
7623 27 -82 -100 -17 100 106 83 3 -94 125 -7 134 14 9 -61 -12 -80 35 106 -108 -42 -66 36 67 134 83 -44
7649 -44 -17 56 16 -158 -76 50 -23 123 -62 125 65 -95 76 51 -96 21 -28 13 -108 -175 -120 -41 163 107 -176
7674 -176 -204 107 7 86 7 28 -59 -155 -198 -3 -68 104 -15 60 -52 54 -60 78 107 -76 50 -19 11 -21
7698 -21 24 -6 114 32 -131 -14 66 -43 -66 195 -46 27 49 -27 -218 43 -31 -56 108 138 106 -84 -179 -40 -10
7723 -10 59 -65 30 -24 62 -135 -169 2 216 -54 -80 128 -40 -19 -159 225 112 -130 -136 61 25 -8 -98 -63 -75
7748 -75 4 162 -81 -16 -19 105 -33 -4 -35 94 -29 -90 107 -64 -62 -47 65 -52 -38 107 83 -51 -73 -77 43
7773 43 -97 118 -26 134 19 -35 31 23 33 -116 -34 -59 -99 11 -64 69 -134 -102 102 80 140 81 -34 -132 -38
$$ packed form
7598a84L02j60O5o8J12J0j47n6K0J19k0L5m4j2m1n4K12j71Q1l0J29j46J12%l7
7623B7j09j8Q3J17Ok3q0r7K19j32J41j20np0M9o8J15P1k14O6k4J02L1O7n1j27
7649d4K7P3m0j74Q2J26p3J46j85J87o0j60J71k5j47J17m9M1j21o7N5P9K04n6k83
7674a76k8L11j00P9p9K1q7r6m3J95o5J72j19P5j12J06j14J38K9j83J26o9L0l2
7698b1M5l0J20q2j63J17Q0j09k3K61k41P3K2p6j91K61p4k5J64L0l2j90r5J39L0
7723a0O9j24R5n4Q6j97l4J71K14k70k6K08j68K1j40L84j13k42oJ97l6l3r0L5j2
7748g5P9J58k43O5lJ24j38K9l1J29j23o1J97j71KJ5J12j17J4J45k4j34k2mJ20
7773D3j40K15j44J60j15n4O6qJ0j49Q2k5m0J10p5J33k03L2K04k2O0n9j15r8R4
$$ plain form
7798 -38 -124 11 -122 -68 -45 -3 -103 -109 33 1 -1 61 30 -111 146 -75 162 -16 -33 -38 -140 6 -25 -120 -57 -45
7824 -45 12 -8 13 -34 0 125 54 16 -69 91 -28 104 30 -24 -94 91 101 -70 -77 -32 -39 -7 -30 150 14 89 -47
7851 -47 78 -8 -6 37 -21 -93 -19 -161 -66 -17 -54 -147 -159 -92 0 61 -110 -81 80 19 -95 136 -126 -145 -156 11 -81
7878 -81 57 33 57 -18 -118 -154 172 36 -107 154 -48 -106 137 2 -49 29 103 138 -55 31 -2 164 21 -86
7902 -86 -2 -112 147 -47 12 -58 79 33 -55 65 -186 -42 2 0 -81 55 50 -35 12 71 99 109 -54 -91 -297 -11
7928 -11 3 78 18 -53 -97 -20 10 -86 -132 30 -35 108 60 -57 -87 38 -46 -92 39 -24 -90 116 49 -1 39 33 135
7955 135 132 68 107 29 -30 116 46 56 -129 -74 -156 61 -100 52 -75 -48 163 15 45 87 130 -122 -24 -69 -34 130
7981 130 -101 176 -26 -9 35 -25 -20 -68 38 -82 -87 -188 -8 -106 -142 -15 155 50 -1 -87 19 -100 -85 -89 -84 -37
$$ packed form
7798c8q6J35j33N4K3M2j00oJ42l2kO2l1j41K57k21K37j78j7nj02J46l1r5O3J2
7824d5N7k0K1m7L4J25p1l8q5J60j19J32p4n4p0J85J0j71pM5pL2k3J80j36P5j36
7851d7J25q6KM3n8p2P4j42R5M9l7r3j2O7R2O1j71K9J61o1j14K31k62j9j1J67r2
7878h1J38k4K4p5j00l6L26j36j43K61k02n8K43j35n1P8P4L5j93Q6l3J66j43j07
7902h6Q4j10K59j94N9p0J37m6q8J20k51J44M4kq1J36nq5M7N9K8J0j63l7k06K86
7928a1J4P5o0p1m4P7L0r6m6J62o5J43m8j17l0J25q4m6J31o3o6K06o7n0M0oJ02
7955A35lo4L9p8n9J46p0J0j85N5q2K17j61J52j27K7K11j48L0M2M3k52R8m5L5J64
7981A30k31K77k02J7M4o0Nm8J06j20nj01J80r8l6J27J70j05n1q6J06j19J5mNM7
$$ plain form
8007 -37 22 86 -65 -109 -57 78 23 43 -40 81 -16 70 32 174 174 -115 -29 -151 70 19 2 98 28 41 157 -35
8033 -35 -127 85 2 13 -23 137 -71 -125 101 2 100 10 16 -13 -83 85 0 62 -136 -60 -33 -35 -66 -72 -17 -54 150 -30
8061 -30 82 85 138 71 -174 84 149 -49 66 -47 5 33 -20 129 -6 -156 -25 -11 27 -24 -49 12 -57 -34 88
8086 88 15 100 16 -34 -23 58 72 -116 75 105 14 -120 -46 -2 -65 70 89 14 31 -135 5 -266 -31 102 74 -122
8112 -122 -43 -131 -45 190 -5 -130 156 -131 -36 3 29 75 163 95 -51 144 -208 51 63 63 107 -87 77 10 116
8137 116 120 -51 78 21 8 49 -86 -132 34 -129 -171 152 196 8 22 -172 -72 48 -143 85 -111 -182 117
8160 117 -215 114 63 -33 54 -43 -42 5 105 -25 -99 -17 182 93 -70 139 92 -70 -73 -125 112 -2 123 -200 -13
8185 -13 10 -19 1 53 289 -68
$$ packed form
8007c7N9O4j51m4N2J35n5K0q3J21r7Q6l8J42%k89Q6j22K21n1j7R6p0J3J16j92
8033c5r2K12q3J1l6J60k08n4K26r9R8r0Ok9p0J68q5O2j98P6K7kl1oN5l7K04j80
8061c0J12LN3o7k45K58O5j98J15j13N2K8n3J49j35j50J31J4L8n1k5O1o9K3J22
8086H8p3Q5q4n0J1Q1J4j88J91L0r1j34P4M4o3J35J9p5J7j66J40k71K35J33k8j96
8112a22P9q8Q6K35j95j25K86k87R5L9K6M6Q8o8j46J95l52K59J2%M4j94J64o7J06
8137A16Mj71J29n7j3M1j35m6J66j63m2L23M4j88J4j94J00J20j91K28j96p1K99
8160A17l32L29n1r6Q7r7JM7J00j30p4Q2J99q9j63K09m7j62ln2K37j14J25l23J87
8185a3K3k9K0N2K36l57
8191f8
$$ Imaginary data points
##PAGE= N=2
##DATA TABLE= (X++(I..I)), XYDATA
$$ plain form
0 0 0 0 0 0 0 0 0 0 0 0 0 0 0 -8 8 -8 8 -8 16 -16 16 -24 24 -32 36 -40 48 -56 64 -72 84 -94 108 -122 136
35 136 -153 172 -193 213 -238 265 -293 324 -358 396 -436 483 -531 585 -643 708 -783 862 -953
54 -953 1055 -1171 1304 -1459 1639 -1856 2121 -2452 2881 -3458 4273 -5511 7594 -11710 22729
69 22729 -109034 -231982 204523 92439 -121317 227906 268156 -51926 119731 224883
79 224883 -70257 -50050 97569 -100392 -131360 26388 -61504 -119307 7921 -20689 -85571
90 -85571 -476 28278 -31573 -16533 27065 -1072 -55261 -8864 57171 -14357 -17991 135029
102 135029 84583 -36790 123246 138277 -96734 1983 133185 -121189 -123497 106056 -91365
113 -91365 -211493 50757 -30266 -217375 32182 82361 -122608 60688 188164 -28169
$$ packed form
0@%%%%%%%%%%%%%qJ6j6J6j6K4l2L2m0M8n6O8p6Q8j04J20j36J56j78K02k30K58
35A36k89L25l65M06m51N03n58O17o82P54q32R19j014J116j228J351j491J645j815
54i53K008k226K475k763L098l495L977m573N333o339P731r784J3105j9304L4439
69B2729j31763j22948M36505j12084k13756L49223M0250l20082J71657J05152
79B24883k95140K0207J47619j97961l0968J57748q7892n7803J27228k8610o4882
90h5571Q5095K8754n9851J5040M3598k8137n4189M6397O6035p1528l634J53020
102A35029n0446j21373J60036J5031k35011R8717J31202k54374k308K29553j97421
113i1365j20128K62250q1023j87109K49557N0179k04969J83296J27476k16333
$$ plain form
123 -28169 45710 196501 -11291 -35038 132595 -18705 -109299 59449 -8616 -137678 -35
134 -35 22513 -102008 -25770 55916 -30330 -33217 43987 13546 -40447 -4950 32325 -7941 -26091
147 -26091 46676 50689 -26451 25777 80754 -26351 -22985 82240 -12834 -68066 63733 4454
159 4454 -109994 20551 20708 -127217 -12115 63187 -92728 -22439 111059 -35998 -37998
170 -37998 125280 12652 -63919 96772 42549 -87307 40007 53444 -89920 -13756 57392
181 57392 -60576 -39550 56422 -17502 -45619 38722 12270 -40075 11656 26338 -21082 -9209
193 -9209 27040 4336 -21108 11739 24200 -22766 -12508 36468 -8790 -35333 37268 14857
205 14857 -52305 21676 39912 -57282 -5025 60217 -44062 -33780 70368 -15867 -57305 63677
$$ packed form
123b8169P3879J50791k07792k3747J67633j51300r0594J68748o8065j29062J37643
134c5K2548j24521P6238Q1686q6246k887P7204l0441n3993L5497L7275m0266j8150
147b6091P2767M013p7140N2228N4977j07105L366J05225r5074n5232J31799n9279
159D454j14448J30545J57j47925J15102P5302j55915P0289J33498j47057k000
170c7998J63278j12628p6571J60691n4223j29856J27314J3437j43364P6164P1148
181E7392j17968K1026R5972p3924k8117Q4341k6452n2345N1731J4682m7420J1873
193i209L6249k2704k5444L2847J2461m6966J0258M8976m5258k6543P2601k2411
205A4857o7162P3981J8236r7194N2257O5242j04279J0282J04148q6235m1438J20982
$$ plain form
217 63677 17254 -70741 39060 44151 -71247 4966 60464 -54686 -26379 64607 -25498 -46987
229 -46987 55013 6474 -53885 33386 31906 -46665 6491 44619 -27698 -18922 40828 -4246
241 -4246 -35946 22027 17778 -37163 -3852 32623 -21360 -27122 34862 5613 -40553 21979 33267
254 33267 -39869 -1670 51554 -25332 -28805 53537 -2191 -51378 38372 22427 -61213 11998
266 11998 43566 -54042 -16794 55638 -31474 -40556 55468 1094 -52333 41573 32368 -51400
278 -51400 15046 52453 -37333 -14789 56257 -12766 -38885 40539 10712 -52746 9821 27291
290 27291 -46507 -17842 38739 -20143 -34385 37609 10656 -41328 21204 36174 -34532 -1177
302 -1177 51732 -16217 -26379 47731 4645 -47427 26983 26849 -51791 -633 43970 -39074 -30177
$$ packed form
217F3677m6423q7995J09801N091j15398P6213N5498j15150K8307R0986r0105k1489
229d6987J02000m8539o0359Q7271j480p8571N3156L8128p2317Q776N9750m5074
241d246l1700N7973m249n4941L3311L6475n3983n762O1984k9249m6166O2532J1288
254C3267p3136L8199N3224p6886l473Q2342n5728m9187Q9750j5945q3640P3211
266A1998L1568r7608L7248P2432q7112r082R6024n4374n3427R3906r205q3768
278e1400O6446L7407q9786K2544P1046o9023k6119P9424k9827o3458O2567J7470
290B7291p3798K8665N6581n8882j4242P1994k6953n1984O2532J4970p0706L3355
302a177N2909o7949j0162P4110m3086n2072P4410j34p8640N1158M4603q3044Q897
$$ plain form
315 -30177 46322 -13701 -49322 37123 19339 -49796 17561 44208 -38620 -10318 51583 -16876
327 -16876 -31404 46666 11059 -42019 26127 29312 -45567 -5526 37026 -33691 -29671 39662
339 39662 -6497 -42001 29719 19629 -44373 9157 40576 -29999 -11171 50676 -6285 -30947
351 -30947 39884 15026 -43194 15105 31405 -39509 -12355 37274 -24852 -36547 30148 -2019
363 -2019 -44741 19892 26897 -34239 4906 44197 -18042 -16555 42816 886 -32153 29808 20596
376 20596 -37477 6355 30636 -33998 -19476 33322 -15995 -33233 30960 8723 -37927 16503
388 16503 26006 -35897 -4970 35526 -21284 -21570 37289 769 -31060 27587 21579 -31333 10661
401 10661 35380 -22529 -11508 33903 -12474 -33337 19449 1511 -40356 5325 20798 -28375
$$ packed form
315c0177P6499o0023l5621Q6445j7784o9135O7357K6647q2828K8302O1901o8459
327a6876j4528P8070l5607n3078O8146L185p4879M0041M2552p0717M020O9333
339C9662m6159l5504P1720j0090o4002N3530L1419p0575J8828O1847n6961k4662
351c0947P0831k4858n8220N8299J6300p0914K7154M9629o2126j1695O6695l2167
363b019m2722O4633P005o1136L9145L9291o2239J487N9371m1930l3039O1961r212
376B0596n8073M3832K4281o4634J4522N2798m9317j7238O4193k2237m6650N4430
388A6503R503o1903L0927M0496n6810k86N8859l6520l1829N8647o008n2912M1994
401A0661K4719n7909J1021M5411m6377k0863N2786j7938m1867M5681J5473m9173
$$ plain form
413 -28375 -5402 34785 -8452 -16144 34431 10748 -24168 20975 23052 -28403 -2871 25029
425 25029 -25738 -24662 23488 -8784 -31764 21501 14611 -28871 11713 30311 -22241 -5907
437 -5907 33723 -11825 -23136 26912 2070 -32608 14635 18661 -28511 2696 32173 -15010
449 -15010 -11491 32130 -2522 -26970 17969 7447 -34386 -79 17384 -27333 -13547 25731
461 25731 -8472 -19412 27893 13324 -20050 19283 26973 -20110 -703 28056 -17109 -21936
473 -21936 22245 -5964 -32779 14842 11915 -30567 5310 27669 -20054 -8405 32355 -7201
485 -7201 -22714 24274 5655 -31084 9562 18308 -27059 -4454 27697 -12369 -15229 28786 4441
498 4441 -22746 18130 17065 -25385 269 23129 -19691 -16984 23368 -6049 -26894 18495 11975
$$ packed form
413b8375K2973M0187m3237p692N0575k3683l4916M5143K077n1455K5532K7900
425B5029n0767J076M8150l2272k2980N3265o890m3482M0584J8598n2552J6334
437e907L9630m5548j1311N0048k4842l4678M7243M026m7172L1207K9477m7183
449a5010L519M3621l4652k4448M4939j0522m1833L4307J7463m4717J3786L9278
461B5731l4203j0940M7305j4569l3374L9333P690m7083J9407K8759m5165m827
473b1936M4181k8209k6815M7621k927m2482L5877K2359m7723J1649M0760l9556
485g201j5513M6988j8619l6739M0646Q746m5367K2605L2151m0066k860M4015k4345
498D441k7187M0876j065m2450K5654K2860m2820K707M0352k9417k0845M5389o520
$$ plain form
511 11975 -27448 8190 26694 -20945 -7687 31426 -9763 -23307 25795 4546 -32217 13179
523 13179 19273 -29903 -1501 29650 -18049 -15305 31153 -1946 -25294 22415 12656 -28445 6803
536 6803 22617 -23004 -9437 25418 -10285 -21416 21185 5892 -25080 10420 19661 -20882
548 -20882 -4021 26167 -9746 -17994 23403 4493 -26586 12047 18159 -26424 -4010 26711
560 26711 -16920 -19170 27474 -1345 -28253 20246 15305 -29256 7569 27766 -22774 -7689
572 -7689 32031 -11131 -21119 27475 3193 -28672 16082 16001 -27999 1023 23890 -19320 -13574
585 -13574 23983 -5586 -22972 16054 9006 -23419 3593 19663 -14643 -8990 22984 -15
597 -15 -16893 17418 13835 -19229 4372 22329 -15880 -11787 22870 -6867 -24641 17395 6014
$$ packed form
511A1975l9423L5638J8504m7639J3258L9113m1189j3544M9102k1249l6763M5396
523A3179O094m9176K8402L1151m7699K744M6458l3099k3348M7709r759m1101L5248
536F803J5814m5621J3567L4855l5703j1131M2601j5293l0972L5500R241m0543
548b0882J6861L0188l5913q248M1397j8910l1079L8633O112m4583K2414L0721
560B6711m3631k250M6644k8819k6908M8499m941m4561L6825K0197n0540J5085
572g689L9720m3162r988M8594k4282l1865M4754q1m4000K9022K2867m3210N746
585a3574L7557k9569j7386L9026p048l2425K7012J6070l4306N653L1974k2999
597a5j6878L4311l583l3064K3601J7957l8209M093L4657k9737j7774M2036j1381
$$ plain form
610 6014 -29842 7542 18984 -26272 -4247 28472 -15483 -15886 29910 -1188 -24140 23164 12915
623 12915 -27065 10410 22519 -22633 -4418 25403 -13138 -16842 20690 -987 -22165 10976
635 10976 9922 -19735 -246 15848 -10674 -9211 16032 1482 -13601 9930 12122 -13368 -1179
648 -1179 17324 -8241 -12708 16698 1192 -20873 10323 12024 -22691 -136 21109 -17236 -11170
661 -11170 25544 -5981 -20541 22761 6737 -25196 14006 18052 -23516 2129 24216 -16833
673 -16833 -9869 23750 -7855 -18817 17521 1924 -21994 8679 10254 -19016 -1084 14959
685 14959 -10424 -7922 15300 911 -10945 9927 9943 -9991 -102 13410 -4952 -10498 11060
698 11060 3510 -15970 4084 12109 -15516 -5514 17847 -8542 -14060 18657 1513 -20353 13504
$$ packed form
610F014l5856L7384J1442m5256K2025L2719m3955m03M5796l1098k2952M7304j0249
623A2915l9980L7475J2109m5152J8215K9821l8541l704L7532k1677k1178L3141
635A0976j054k9657J9489J6094k6522J463K5243j4550j5083K3531K192k5490J2189
648a179J8503k5565m467K9406j5506k2065L1196J701l4715K2555K1245l8345O066
661a1170L6714l1525j4560M3302j6024l1933L9202M046m1568K5645K2087m1049
673a6833O964L3619l1605j0962L6338j5597k3918L0673J575k9270J7932J6043
685A4959k5383K502K3222j4389j1856K0872J6j9934R889J3512j8362n546K1558
698A1060p550j9480K0054Q025k7625J0002K3361k6389n518L2717j7144k1866L3857
$$ plain form
711 13504 11144 -22531 4631 19482 -19033 -5211 24317 -11213 -14796 22976 -953 -21424
723 -21424 16515 9386 -22522 6348 16557 -18018 -4378 18861 -9113 -12004 16012 1571
735 1571 -14114 8885 9050 -12023 -838 11693 -6093 -8610 9368 2033 -12611 3219 9193
748 9193 -11210 -4880 13896 -4823 -12515 14297 4670 -17408 8763 13996 -17602 -368 21123
761 21123 -12607 -10674 22605 -4013 -19365 17781 6013 -23700 8593 14850 -21496 -1937
773 -1937 19988 -13953 -10938 20235 -3627 -16506 14944 6424 -17229 6226 13175 -13283 -3526
786 -3526 14802 -5618 -10482 11552 3605 -12685 4558 10929 -9749 -4194 13588 -3315 -11867
799 -11867 10523 5017 -15994 3386 12945 -14166 -5439 17509 -7047 -13472 17263 2899 -18989
$$ packed form
711A3504k360l3675K7162J4851l8515J3822K9528l5530l583L7772k3929k0471
723b1424L7939p129l1908K8870J0209l4575J3640K3239k7974k891K8016j4441
735A571j5685K2999J65k1073J1185J2531j7786k517J7978p335j4644J5830N974
748I193k0403O330J8776j8719p692K6812r627k2078K6171N233l1598J7234K1491
761B1123l3730J933L3279k6618j5352L7146j1768k9713L2293O257l6346J9559
773a937K1925l3941L015L1173k3862j2879L1450q520k3653K3455O949k6458R757
786c526J8328k0420m864K2034p947j6290J7243O371k0678N555J7782j6903q552
799a1867K2390n506k1011J9380R559k7111Q727K2948k4556o425L0735j4364k1888
$$ plain form
812 -18989 11273 11898 -19644 1275 18070 -14979 -8484 20132 -6068 -15492 17239 4710 -18207
825 -18207 9846 13143 -16121 56 16648 -10259 -9308 14908 -2293 -14851 9155 6258 -14522
838 -14522 1473 12492 -9149 -6627 13442 -1103 -12081 9388 7125 -13391 1587 12749
850 12749 -9991 -6852 14594 -2653 -12868 12130 6173 -15314 5389 12939 -13617 -3581 15974
863 15974 -8146 -11250 14957 93 -15941 9829 8487 -16219 2336 14413 -11562 -5858 15754
876 15754 -4153 -12393 12219 3867 -14811 5344 10762 -12253 -2504 13852 -6150 -9446 12272
889 12272 1792 -12595 7063 8803 -11956 -365 12527 -7569 -7411 12223 -626 -11723 8411
902 8411 6012 -13005 2045 10629 -10246 -5192 12341 -4477 -10484 10378 2914 -12550 5504
$$ packed form
812a8989L0262O25l1542K0919J6795l3049O495K8616k6200r424L2731j2529k2917
825a8207K8053L297k9264J6177J6592k6907R51K4216j7201j2558K4006k897k0780
838a4522J5995J1019k1641K522K0069j4545j0978K1469k263k0516J4978J1162
850A2749k2740L139K1446j7247j0215K4998n957k1487K0703P550k6556J0036J9555
863A5974k4120l104K6207j4864j6034K5770j342k4706J8555J2077k5975N704K1612
876A5754j9907q240K4612q352j8678K0155N418k3015R749J6356k0002l296K1718
889A2272j0480j4387J9658J740k0759J1591J2892k0096J58J9634j2849j1097K0134
902H411k399j9017J5050Q584k0875N054J7533j6818o007K0862p464j5464J8054
$$ plain form
915 5504 9501 -10667 -1152 12852 -5863 -7474 12093 947 -11508 7757 7226 -11951 955
928 955 11471 -8577 -6169 12206 -2616 -11707 8866 3969 -13701 2964 9608 -11305 -3402
941 -3402 12678 -5556 -8594 12244 1678 -11302 8322 7956 -10973 2036 11427 -8119 -4668
954 -4668 11307 -3233 -9529 8239 2637 -11214 3266 7183 -9534 -2583 9481 -4657 -7412
967 -7412 8819 1886 -9461 4768 7596 -8773 -1412 10577 -4618 -7221 10308 1748 -10851
980 -10851 6089 7090 -11724 -381 11101 -8185 -6403 12297 -2705 -11023 10070 3744 -12802
993 -12802 5532 9730 -11113 -247 13026 -7240 -6878 12219 -1686 -10905 8675 4319 -11800
1006 -11800 2541 8055 -9584 -3724 9532 -4027 -7571 8314 2856 -8322 3882 7609 -6518
$$ packed form
915E504L997k0168R515J4004j8715j611J9567j1146j2455J9265n31j9177J2906
928I55J0516k0048K408J8375j4822r091K0573m897j7670J6665O644k0913P903
941c402J6080j8234l038K0838j0566j2980J9624l66j8929J3009R391j9546L451
954d668J5975j4540o296J7768n602j3851J4480L917j6717O951J2064j4138k755
967g412J6231o933j1347J4229K828j6369P361J1989j5195k603J7529q560j2599
980a0851J6940J001j8814J1343J1482j9286J782J8700j5002q318K1093o326j6546
993a2802J8334M198k0843J0866J3273k0266L62J9097j3905r219J9580m356j6119
1006a1800J4341N514j7639N860J3256j3559l544J5885n458j1178J2204L727j4127
$$ plain form
1019 -6518 -1775 9606 -1940 -6435 8149 3224 -9480 2741 7429 -9447 -3301 10279 -5151
1032 -5151 -8836 10090 421 -12733 6355 6841 -12726 1366 12219 -9106 -4347 13832 -3679
1045 -3679 -9744 11914 2925 -11942 7236 8360 -11213 496 10688 -8147 -5985 10208 -2528
1058 -2528 -9216 7007 3412 -9665 1688 7111 -6737 -3383 8418 -1271 -6675 6401 4133
1071 4133 -7907 1262 7702 -6000 -4130 9419 -1586 -8825 7312 3832 -11083 2701 8929
1084 8929 -9450 -2884 12224 -4897 -8091 11521 607 -11790 7682 6397 -12230 1879 10151
1097 10151 -9434 -4183 11247 -4424 -8285 9625 1554 -10013 5623 6186 -9037 168 8299
1110 8299 -5652 -4737 8133 -348 -7535 4796 4549 -7129 335 7862 -3915 -4474 7626 433
$$ packed form
1019f518M743J1381j1546m495J4584m925j2704J2221M688j6876O146J3580j5430
1032e151l685J8926r669j3154J9088M86j9567J4092J0853k1325M759J8179j7511
1045c679o065K1658q989j4867J9178J124j9573J1709J0192j8835K162J6193j2736
1058b528o688J6223l595j3077J1353N423j3848L354J1801r689n404J3076k268
1071D133j2040R169O440j3702J870J3549j1005p239J6137l480j4915J3784O228
1084H929j8379O566J5108j7121l194J9612j0914j2397J9472j285j8627J4109Q272
1097A0151j9585N251J5430j5671l861J7910q071j1567J5636N63j5223R205Q131
1110H299j3951R15J2870q481p187J2331k47j1678P464P527j1777n59J2100p193
$$ plain form
1124 433 -7906 4346 4948 -8504 -482 8094 -6076 -5318 8813 -1565 -8650 7558 3790 -9828
1138 -9828 3499 7894 -8978 -1774 10157 -5703 -6241 9922 -283 -8703 7590 4835 -9142
1151 -9142 2956 8222 -6832 -2085 9022 -3412 -6552 6396 436 -8856 2524 4299 -7106
1164 -7106 -1455 6554 -3407 -4799 6174 1184 -6401 3800 5597 -5479 -108 7623 -3180 -4530
1178 -4530 7286 629 -7191 4919 4504 -7979 681 6967 -6787 -4181 7796 -2999 -7469 6837
1192 6837 1691 -8635 3916 5742 -7800 48 8526 -4489 -3749 8645 -503 -6607 5867 2988
1206 2988 -7662 1862 5932 -6204 -2340 6939 -3033 -5973 5350 1311 -7091 2613 4982 -5565
1220 -5565 -974 6989 -2357 -4282 6480 1309 -6196 3643 4492 -6649 -385 6087 -5076 -4457 6252
$$ packed form
1124D33q339J2252O02j3452Q022Q576j4170P58J4131j0378p085J6208l768j3618
1138i828J3327M395j6872P204J1931j5860n38J6163j0205q420J6293k755j3977
1151i142J2098N266j5054M747J1107j2434l140J2948n960r292J1380J775j1405
1164g106N651Q009r961j392J0973m990p585J0201J797j1076N371P731j0803j350
1178d530J1816o657p820J2110m15j2483Q660O286j3754K606J1977j0795m470J4306
1192F837n146j0326J2551J826j3542P848Q478j3015P40J2394r148o104J2474k879
1206B988j0650R524M070j2136L864R279r972k940J1323m039q402R704K369j0547
1220e565M591P963r346j925J0762n171p505R839Q49j1141O264O472j1163O19J0709
$$ plain form
1235 6252 -1608 -7104 5128 2935 -7336 2319 6550 -5608 -1376 8448 -2195 -4949 7338 1584
1249 1584 -7134 3914 4545 -7106 -149 6645 -4719 -4131 6625 -1386 -6630 4443 2586 -7445
1263 -7445 1261 5396 -5809 -2283 6963 -2165 -4987 6492 2392 -6142 3657 6036 -5422 -367
1277 -367 7141 -3301 -4864 6014 -230 -7256 3096 3521 -6966 -312 6083 -4371 -3127 6632
1291 6632 -895 -5696 5251 2706 -6496 2101 5279 -5833 -2035 6542 -2996 -5210 6361 1187
1305 1187 -6613 3792 4875 -6448 -114 6853 -3897 -3972 6856 -463 -6606 4319 3227 -7125
1319 -7125 928 5918 -5001 -2285 6586 -1855 -5288 5217 1171 -6855 2299 4284 -5685 -837
1333 -837 6061 -3226 -3924 5864 583 -5539 4368 4124 -5233 967 6036 -4174 -3361 5877 -1180 -6322
$$ packed form
1235F252p860n496J2232k193j0271R655M231j2158M232R824j0643k754J2287n754
1249A584q718J1048O31j1651O957O794j1364N88J0756q011n244J1073j857j0031
1263g445Q706M135j1205L526R246r128k822J1479m100q534R799K379j1458N055
1277c67P508j0442j563J0878o244p026J0352M25j0487O654O395j0454J244R759
1291F632p527m801J0947k545r202Q597L178j1112L798Q577r538k214J1571n174
1305A187p800J0405J083j1323O334O967j0750p5J0828p319o143J0925j092j0352
1319g125Q053M990j0919K716Q871q441l433J0505m046q026R154J985r969M848
1333h37O898r287o98R788n281o122R907k44r357O200N069j0210Q13R238p057n142
$$ plain form
1349 -6322 4066 2407 -6760 1001 5083 -5347 -2311 6362 -2162 -4938 5683 1717 -6237 2883
1363 2883 4457 -5814 -576 6172 -3348 -3414 6075 -229 -5461 4146 2780 -5877 1014 5015 -4491
1378 -4491 -1978 5716 -1898 -4895 4523 1191 -5695 2208 4099 -4801 -1030 5409 -2537 -3926 5047
1393 5047 448 -5484 3209 3583 -5248 -197 5281 -3490 -3197 5526 -498 -5228 3959 2599 -5648
1408 -5648 1396 4838 -4294 -1623 5847 -1894 -4040 4933 954 -5490 2396 3356 -5300 -528 4891
1423 4891 -3479 -3267 5066 -530 -4829 3778 2617 -5220 1088 4537 -4077 -2064 5213 -1516 -4293
1438 -4293 4473 1529 -4782 2155 4266 -3977 -420 5520 -2173 -3322 4667 -120 -5477 2373 2120
1453 2120 -5642 -296 4104 -3976 -2704 4992 -633 -4000 4306 2367 -4347 1995 4418 -3626 -1163
$$ packed form
1349f322J0388j659r167P761M082j0430L036Q673q524k776J0621l966p954R120
1363B883J574j0271N238O748r520o6R489o304n232R607j366q657O891M001r506
1378d491K513P694p614k997R418l332o886P903J891q900L771O439p946j389Q973
1393E047m599n932Q693L74q831N051N478q771K93Q723o024m730R187j360q247
1408e648P044L442r132K671P470p741k146Q973l979o444P886R60q656M772N419
1423D891q370K12Q333n596m299Q607j161p837O308L449q614K013P277o729k777
1438d293Q766k944o311O937K111q243L557N940p693j149P989m787n357P850k53
1453B120p762N346M400q080J272P696n625l367Q306j939o714O342K423q044K463
$$ plain form
1468 -1163 4908 -1856 -3526 4188 682 -4627 2644 3280 -4425 -193 4399 -3209 -3132 4079 -945 -5196
1484 -5196 2883 1745 -5248 807 4297 -3771 -1153 5752 -1020 -3382 5056 1357 -4795 2215 3250
1499 3250 -4775 -869 4415 -3261 -3424 4263 -438 -4351 3004 2345 -4261 746 4212 -3257 -1958
1514 -1958 4442 -897 -3512 3372 1828 -4064 1446 3821 -3413 -1256 4292 -1682 -3628 3378 634
1529 634 -4937 1763 3112 -4498 -447 5024 -2484 -2343 5453 162 -4142 3852 2724 -4715 1097
1544 1097 3923 -4282 -1846 4624 -2284 -4015 3864 352 -4978 2006 2758 -4608 -482 3725 -2753
1559 -2753 -2446 3915 0 -3337 3061 2816 -2850 1126 4408 -1809 -1482 4042 -346 -4017 2219 1245
1575 1245 -4898 -148 2855 -3955 -2140 4303 -1379 -3695 4248 1738 -4555 2355 3764 -4334 -282
$$ packed form
1468a163O071o764j670P714l506n309P271O36p705M232M592p608P7P211n024m251
1484e196Q079j138o993O055L490q068K618O905o772k362Q438l699o152P010J035
1499C250q025L906N284p676j63P687m701l913P355o59o606N007L466p469J299
1514a958O400n339k615O884j544n892N510K375p234K157N548n974j946P006k744
1529F34n571O700J349p610M051N471p508J41P796n291m304P994j128p439N812
1544A097K826q205K436O470o908j731P879l512n330O984P52p366M126M207o478
1559b753L07O361l915l337O398k45n666L976L282o217L27N524m388l671O236r74
1575A245o143M750L003o810J815O443n682k316P943k510o293O910J409q098M052
$$ plain form
1590 -282 4877 -2859 -2798 4832 -453 -4150 3816 2211 -4433 1685 3616 -3951 -1349 3739 -2495 -3456
1606 -3456 3040 -230 -4039 1813 2173 -2858 451 3884 -888 -1395 3664 535 -3045 1527 1866 -3553
1622 -3553 -960 2705 -2566 -2971 3157 -10 -3670 2557 2763 -3624 1063 4540 -2962 -1538 4822
1637 4822 -1389 -3950 4059 656 -4857 2310 2930 -4322 219 4245 -2941 -2186 3780 -1420 -3964
1652 -3964 2512 485 -4129 1003 2301 -2902 -303 3586 -753 -1377 3526 1364 -1920 1786 2137
1667 2137 -2339 -943 2356 -1544 -2766 1859 279 -3709 787 2212 -3195 -603 3669 -1651 -2338
1682 -2338 3974 55 -3641 2808 2216 -4003 898 3641 -3331 -980 4551 -1670 -2999 3906 363
1697 363 -3817 2389 1878 -3911 292 2789 -2944 -1431 3230 -902 -2391 2415 940 -2512 1125
$$ packed form
1590b82N159p736O1P630n285l697P966j605o644O118J931p567K602N088o234r61
1606c456O496l270l809N852L60n031L309L433m772n07N059l129l580M572L39n419
1622c553K593L665n271m05O128l167l660O227K06o387M687L477p502J424O360
1637D822o211k561Q009l403n513P167O20p252M541M026p186P55N966n200k544
1652c964O476k027m614N132J298n203K599L889m339o24M903k162l284L706L51
1667B137m476J396L299l900j222M625j580l988M496J425n407K592M272n320o87
1682b338O312l919l696O449n92o219M901K743o972K351N531o221j329O905l543
1697C63m180O206n11n789M203K497n733J513M661m132j489M806j475l452L637
$$ plain form
1712 1125 2239 -1842 -707 2483 -849 -2142 1848 765 -2708 468 2157 -2339 -1029 2945 -748
1727 -748 -2348 2831 1151 -3145 1683 2789 -3312 -265 3640 -2199 -2257 3835 -538 -3670 2690 1270
1743 1270 -4014 961 2761 -3523 -758 3651 -2090 -2312 3403 -165 -3078 2255 1526 -2770 843
1758 843 2796 -1741 -623 2797 -398 -1974 1861 977 -2659 403 1945 -1861 -1298 2394 -613 -2507
1774 -2507 1859 1138 -3066 550 2682 -2235 -1064 3138 -1101 -2496 2957 725 -3311 1987 2496
1789 2496 -3164 164 3515 -2413 -1629 3528 -860 -2932 2701 814 -3471 1280 2296 -2906 -377
1804 -377 3044 -1565 -1625 2849 -45 -2509 1400 1439 -2611 111 2093 -1475 -1345 2315 11 -2277
1820 -2277 1622 1587 -2273 244 2486 -1614 -1417 2432 -537 -2549 2084 1212 -2863 692 2690 -2242
$$ packed form
1712A125J114m081J135L190l332j293L990j083l473L176J689m496J310L974l693
1727g48j600N179j680m296M828J106o101L047L905n839n8O092m373l132O360j420
1743A270n284M975J800o284K765M409n741k22N715l568k913N333p29m296L613
1758H43J953m537J118L420l195j576L835q84l636L062J542l806N63L692l007j894
1774b507M366p21m204L616K132m917J171M202m239j395N453k232m036N298N09
1789B496n660L328L351n928P84N157m388k072N633j887m285M751J016n202K529
1804c77L421m609o0M474k894k464L909L9m050K722J982l568J30L660k304k288
1820b277L899l5l860K517K242m100J97L849k969k012M633q72m075L555J998m932
$$ plain form
1836 -2242 -745 3111 -1392 -2377 2711 146 -3197 1672 1508 -3332 -20 2493 -2238 -1366 2943 -448
1852 -448 -2189 2523 897 -2572 1169 2133 -2232 -332 2582 -1015 -1720 2272 337 -2268 1200 1422
1868 1422 -2159 -201 2085 -1610 -1737 2079 -123 -2650 1385 1430 -2462 325 2571 -1522 -1091 2726
1884 2726 -299 -2261 2186 1201 -2597 909 2161 -2311 -509 2705 -1183 -1573 2474 80 -2834
1899 -2834 1405 1167 -2766 -34 2070 -1821 -1085 2317 -314 -1690 2175 1078 -2096 1047 1930 -1626
1915 -1626 -432 2079 -1099 -1857 1756 145 -2421 922 1501 -1761 -65 2423 -856 -1426 2317 -21
1931 -21 -2324 1212 959 -2529 -65 1889 -1614 -929 2339 -234 -1786 1999 1001 -2182 842 1493
1947 1493 -2046 -704 1946 -1546 -1675 1991 261 -1726 1754 1811 -1492 747 2462 -1188 -770 1947
$$ packed form
1836b242J497L856m503r85N088k565l343M869j64m840L312K513m731Q72M309l391
1852d48j741M712j626l469L741R64m365J900K914l597p05L992j935k605L468K22
1868A422l581J958K286l695j27L816k202k527M035M5l892K787K246m093M31L817
1884B726l025j962M447r85l798L506J252m472J802L214l888l90M047k394k914
1899b834M239k38l933K732K104l891P36L402k631j376L865j097l174L143Q83l556
1915a626J194K511l178p58L613j611k566L343N79l262J696K488l279n70L743k338
1931b1k303L536k53l488K464J954l503O85L268k573j552L785r98l183L024O51
1947A493l539J342K650l492j29L666j730j987L480N7l303K239J715l650M18K717
$$ plain form
1963 1947 -538 -2231 985 231 -2806 321 1367 -1787 -451 2487 -277 -1162 2126 591 -1924
1978 -1924 1001 1241 -2186 -447 1738 -1132 -915 2095 206 -1452 1642 1425 -1583 658 1991 -1541
1994 -1541 -1152 1487 -1047 -2198 1184 189 -2298 685 1780 -1519 193 2336 -510 -990 2056 182
2010 182 -2009 937 915 -2255 -322 1613 -1393 -1007 2050 -48 -1277 2011 1043 -1712 657 1522
2026 1522 -1655 -766 1637 -963 -1743 1379 232 -1667 914 1465 -1421 207 1886 -960 -1021 1559
2042 1559 -195 -1870 873 568 -2016 134 1679 -1315 -733 2321 28 -1481 1639 752 -1593 653
2058 653 1340 -1775 -550 1605 -1041 -1571 1539 161 -1708 1055 1249 -1473 245 1750 -1027 -888
2074 -888 1692 -100 -1748 1200 827 -1808 265 1561 -1343 -402 2006 -249 -1154 1506 507 -1744
$$ packed form
1963A947k485j693L216p54l037L127J046l154J336K938k764q85L288j535k515
1978a924K925K40l427J739K185k870K17L010j889j658L094k17l008K241J333l532
1994a541L89K639k534j151L382r95k487K983J095l299J712K143k846m80L046j874
2010A82k191K946k2l170J933J935l006L86L057k098j229L288r68k755K369Q65
2026A522l177Q89K403k600p80L122j147j899K581N51k886J628J679k846o1K580
2042A559j754j675K743l05k584K150J545k994N82L054k293j509L120q87k345K246
2058F53O87l115J225K155k646n30L110j378j869K763J94k722J718J505k777J39
2074h88K580j792j648K948l73k635K073J296k904R41K408k255r05K660r99k251
$$ plain form
2090 -1744 632 1286 -1457 -278 1528 -1082 -1247 1368 -133 -1741 834 885 -1680 59 1473 -1065
2106 -1065 -865 1525 -346 -1398 1256 594 -1548 590 1513 -1275 -362 1788 -409 -978 1571 263
2122 263 -1551 772 1076 -1598 -312 1374 -1099 -1059 1362 -125 -1629 1044 554 -1662 357 1402
2138 1402 -1210 -593 1641 -447 -1361 1286 408 -1543 832 1328 -1302 -278 1513 -805 -1095 1544
2154 1544 37 -1386 861 796 -1465 37 1466 -943 -784 1357 -280 -1511 1057 521 -1406 266
2170 266 1153 -1091 -445 1348 -395 -1097 1353 446 -1128 856 1118 -1000 -17 1589 -742 -864 1438
2187 1438 -185 -1558 874 479 -1423 279 1042 -1049 -573 1446 -480 -1059 1033 260 -1286 514
2203 514 1036 -1161 -122 1381 -408 -730 1502 207 -1225 690 729 -1222 74 1310 -951 -720
$$ packed form
2090a744K376O54k743J179J806k610j65K615j501j608K575N1k565J739J414k538
2106a065K00K390j871j052K654o62k142K138R23k788R13K150k197n69K549j308
2122B63j814K323L04k674J286J686k473M0K421j487j504K673m90k216K019J045
2138A402k612O17K234k088r14K647q78j951K375M96k630J024J791k318k90K639
2154A544j507j423K247o5k261J502J429k409J59K141j637j231K568n36j927J672
2170B66Q87k244O46J793j743p02K450r07j574J984K62k118R83J606k331j22K302
2187A438j623j373K432l95j902J702P63k091M76K019j926n79K092p73j546J800
2203E14N22k197J039J503j789l22K232j295j432J915L9j951J296J236k261K31
$$ plain form
2219 -720 1024 -231 -1155 783 568 -1293 236 1291 -978 -381 1312 -286 -1043 1210 156 -1309
2235 -1309 636 949 -1266 -57 1428 -768 -803 1454 140 -1236 745 690 -1311 198 1130 -935
2251 -935 -380 1329 -369 -1001 1122 452 -1162 515 547 -1152 -367 968 -711 -1101 805 115 -1015
2268 -1015 677 992 -786 193 1249 -492 -608 1354 57 -1249 585 406 -1364 -24 1061 -1039
2284 -1039 -551 1363 -261 -930 1250 310 -1315 552 795 -1392 -191 1119 -1012 -873 1344 -141
2300 -141 -1111 912 623 -903 406 1148 -802 -454 1037 -420 -1185 728 352 -1046 330 963 -645
2317 -645 -84 1227 67 -848 894 278 -1239 339 312 -1189 -492 783 -627 -892 1032 39 -824
2334 -824 1044 877 -885 466 1173 -764 -318 1143 -482 -1312 989 271 -1207 602 837 -887 18
$$ packed form
2219g20J744j255r24J938k15j861J529J055k269N97J693j598p57K253j054j465
2235a309J945L13k215J209J485k196l5K257j314j376J981n5k001J509R32k065
2251i35N55J709j698o32K123o70j614J677L2j699P85J335j679l90J906o90j130
2268a015J692L15j778R79J056j741j16J962j297j306J834j79j770J340J085k100
2284a039M88J914j624o69K180r40j625J867K43k187J201J310k131J39K217j485
2300a41r70K023k89j526J309P42j950L48J491j457p65J913l76j398J376O33j608
2317f45N61J311j160r15J742o16j517J578k7j501O97J275j410k65J924r93q63
2334h24J868j67j762J351P07j937M46J461j625q30K301p18j478J809K35j724R05
$$ plain form
2351 18 1171 -549 -708 874 -192 -1358 507 243 -1166 -176 790 -628 -304 1125 96 -506 1024
2368 1024 473 -894 174 738 -1001 -698 806 -394 -878 690 314 -766 584 1050 -683 2 1132
2385 1132 -639 -780 904 -124 -1241 599 389 -1321 118 938 -892 -310 1220 -215 -635 895
2401 895 296 -1078 398 511 -994 -290 1021 -448 -559 1056 69 -631 468 547 -810 -8 734 -594
2419 -594 -494 675 -237 -898 418 293 -953 223 723 -447 -98 1215 -209 -672 977 226 -916
2436 -916 335 756 -756 -238 1002 -716 -640 910 105 -808 770 465 -939 73 720 -786 -215
2453 -215 681 -372 -757 754 277 -1030 292 505 -665 -154 909 -340 -484 844 179 -674 464
2470 464 395 -771 21 691 -313 -431 894 174 -685 598 432 -826 65 577 -688 -251 727 -487
$$ packed form
2351A8J153j720j59J582j066j166J865k64j409R90R66j418L24J429j029o02J530
2368A024n51j367J068N64j739L03J504j200m84J568l76j080J350M66j733O85J130
2385A132j771j41J684j028j117J840k10j710J439Q20j830N82J530j435m20J530
2401H95n99j374J476J13j505P04J311j469j11J615r87p00J099P9j357Q02P42j328
2419e94J00J169r12o61J316j25j246J176N00j170L49J313j424m63J649p51j142
2436i16J251M21j512N18J240j718P6J550q05r13J578l05j404J012O47j506N71
2453b15Q96j053l85J511m77j307J322K13j170N11J063j249j44J328o65q53J138
2470D64o9j166P92O70j004j18J325p20q59J283j66j258Q91N12j265M37R78j214
$$ plain form
2488 -487 -913 768 165 -974 310 589 -670 154 812 -322 -418 878 136 -512 818 581 -755 63
2506 63 800 -540 -280 714 -85 -569 506 305 -787 215 531 -726 -209 670 -297 -468 591 184
2524 184 -620 497 401 -618 99 820 -263 -213 778 -145 -650 532 353 -773 172 676 -754 -409 894
2543 894 -167 -598 603 263 -899 341 496 -713 -184 724 -351 -540 796 61 -843 340 492
2560 492 -832 -60 620 -643 -188 773 -50 -675 654 539 -708 149 624 -525 -51 730 -352 -370
2578 -370 547 15 -885 234 359 -778 -44 747 -451 -432 663 -111 -651 530 330 -662 -42 842 -467
2597 -467 -293 790 16 -708 715 263 -736 239 455 -676 -334 531 -451 -531 629 50 -722 486 388
2616 388 -810 -34 604 -554 -383 582 -114 -693 553 102 -746 439 595 -455 -17 769 -141 -518
$$ packed form
2488d87m26J681o03j139J284K79j259Q24O58j134r6J296p42o48J330k37j336Q18
2506F3P37j340K60R94p99m84J075k01j092J002L16j257N17Q79r67j71J059m07
2524A84q04J117r6j019P17P21j083N0R91r23n05J182j79j126R45N04j430L45J303
2543H94j061m31J201l40j162J240J55j209N29R08j075j89J336p35r04J183J52
2560D92j324P72O80j263M55R61q23o25J329j15j247Q57M75j149M74P81j082j8
2578c70R17n32r00J119J25j137P34P91j198J9J095p74n40J181k00r92O20Q84j309
2597d67J74J083p74p24J423m52r99R75K16j131L42Q65r82q0J160n79p72J208r8
2616C88j198P76O38j158J71R65o96n79J246m51q48J185J56j050M38P86r10l77
$$ plain form
2634 -518 623 26 -596 139 467 -644 -151 613 -276 -401 531 13 -622 387 405 -554 -73 583 -440
2653 -440 -552 585 -56 -584 508 226 -622 259 567 -475 80 762 -258 -349 666 174 -779 462
2671 462 280 -759 82 694 -366 -220 747 -79 -447 490 313 -691 163 445 -687 -267 402 -292 -420
2690 -420 652 187 -609 288 620 -150 167 623 -142 -385 393 -136 -714 213 384 -626 36 642 -271
2709 -271 -357 782 -78 -559 445 111 -680 125 427 -616 -163 546 -277 -399 693 272 -427 383 479
2728 479 -355 45 486 -477 -310 414 -264 -713 340 142 -482 74 509 -374 -264 640 -96 -180 294 189
2748 189 -590 221 312 -423 6 468 -288 -404 395 196 -537 386 436 -453 70 602 -279 -421 686 -122
2768 -122 -560 523 277 -509 338 495 -377 46 642 -251 -527 377 -48 -780 113 242 -560 -155 505 -341
$$ packed form
2634e18J141n97o22P35L28j111M93P64q89j25R32n18o35J009J8r59M81O56j023
2653d40j12J137o41n28J092k82q48Q81L08j042N55O82j020r1J015m92r53J241
2671D62j82j039Q41O12j060J46R67q26l68R37j77j004Q54K82j132M20O69o94j28
2690d20J072m65p96Q97L32p70L17M56p65k43P78n29n78R27J71j010O62O06r13
2709b71q6J139q60m81J004l34p91Q05L02j043M53P09q23j22J092m21o99Q10R6
2728D79q34M00M41r63J67P24o78m49J053j98o24N56M35q83J10R04p36q4M74j05
2748A89p79Q11R1p35M29M62p56j16P99j99p33R23N0q89N23N32q81j42J107q08
2768a22m38J083k46p86Q47J57q72M23N96q93k76R04m25p32Q93J29q02M05O60q46
$$ plain form
2788 -341 -220 640 -35 -339 269 318 -471 121 385 -231 -126 546 -67 -392 232 161 -804 203 436 -539
2808 -539 -234 355 -289 -484 418 12 -627 337 396 -466 87 658 -364 -322 512 -52 -426 304 364 -574 290
2829 290 368 -662 -213 494 -277 -372 276 130 -589 211 350 -346 4 364 -189 -302 585 -28 -351 160
2849 160 191 -408 -89 472 -124 -290 630 117 -520 407 272 -451 -20 428 -423 -76 511 -456 -467 431 184
2870 184 -529 213 423 -336 41 396 -412 -274 575 -111 -507 537 263 -580 192 500 -304 -30 628 29
2890 29 -372 369 234 -503 210 439 -438 -203 534 -327 -267 358 -113 -324 381 233 -389 4 493 -265 -156
2911 -156 461 -60 -375 296 219 -490 245 379 -432 -58 619 -120 -283 513 50 -344 156 408 -419 -24
2931 -24 475 -320 -79 503 128 -340 241 216 -437 111 501 -219 -156 521 -131 -419 354 341 -422 376 283 -265
$$ packed form
2788c41J21Q60o75l04O08M9p89N92K64o16J05O72o13l25O24p1r65J007K33r75
2808e39L05N89o44j95R02m06o39R64N9q62N53N71j022M2Q34n64l74P30O0r38Q64
2829B90P8j030M49P07p71r5O48j46p19Q00J39o96L50L60n53j13Q87o13l23N11
2849A60L1n99L19N61n96j66R20n13o37R27j35p23M31M48q51L47N87r67j1Q98k47
2870A84p13P42K10p59L77L55q08J38Q49o86l96J044k74q43P72L08q04K74O58n99
2890B9m01P41j35p37P13K29q77K35P37q61O0O25m71k11P05j48o22L93M89p58J09
2911a56O17n21l15O71p7p09P35J34q11L74O77p39j63P96m63l94N00K52q27L95
2931b4M99p95K41N82l75m68N81k5o53N48L90p20O3O77o52k88P73j3p63P98r3n48
$$ plain form
2953 -265 -61 532 -182 -193 438 21 -209 199 243 -360 -147 396 -291 -264 416 -178 -356 378 128 -452 -44
2974 -44 283 -222 -211 564 -147 -531 397 227 -494 181 269 -423 -90 367 -264 -314 501 -39 -333 143 185 -450
2996 -450 93 575 -380 -111 450 -186 -308 421 39 -481 60 207 -468 25 504 -270 -290 427 -50 -259
3016 -259 194 334 -391 -27 418 -260 -201 424 36 -419 239 203 -415 -84 278 -289 -247 296 -87 -348 421
3037 421 93 -489 175 364 -328 178 326 -147 -176 390 73 -296 54 214 -486 -81 272 -351 -207 545
3057 545 6 -377 309 99 -526 48 280 -257 -205 255 -222 -303 360 69 -457 75 242 -409 -163 214 -219
3078 -219 -373 421 96 -347 -11 161 -296 63 443 -245 -159 504 5 -268 409 172 -388 110 262 -417
3098 -417 18 278 -214 -190 394 -23 -371 279 261 -316 123 451 -330 -303 467 112 -256 338 82 -384 25
$$ packed form
2953b65K04N93p14j1O31m17k30M08M4o03K13N43o87K7O80n94j78P34k50n80M08
2974d4L27n05J1P75p11l84R28j70p21O75Q8o92L33M57o31n0Q15n40k94M76M2o35
2996d50N43M82r55K69N61o36j22P29l82n20N41J47o75M93M79p74k0P17m77k09
3016b59M53J40p25L64M45o78N9O25l88m55O58l6o18L31L62n67M2N43l83k61P69
3037D21l28n82O64J89o92N06J48m73k9N66l17l69L50J60p00M05L53o23J44P52
3057E45n39l83O86k10o25N74K32n37N2M60m77q1O63k91n26N32J67o51K46L77m33
3078b19j54P94l25m43L36J72m57L59L80o88Q6O63m99k73O77k37n60M98J52o79
3098d17M35K60m92K4N84m17l48O50j8n77M39L28p81K7P70l55l68N94k56m66M09
$$ plain form
3119 25 274 -382 -103 370 -323 -288 214 -10 -510 289 245 -292 91 531 -269 -282 297 76 -196 243 200 -413
3141 -413 -25 204 -295 -154 305 -129 -121 266 53 -199 159 350 -160 -93 438 -127 -114 477 -40 -203 156
3162 156 133 -467 34 191 -300 -280 218 48 -379 155 100 -259 -148 292 -290 -86 435 -71 -113 186 254 -262
3184 -262 153 241 -214 -7 493 -102 -218 376 19 -241 122 73 -412 16 323 -285 -82 460 -53 -294 251
3205 251 110 -357 258 335 -407 -161 379 -112 -272 415 5 -247 150 155 -350 117 336 -264 63 169 -84
3226 -84 -168 260 -8 -399 44 211 -257 -43 260 -329 -254 433 45 -314 29 217 -232 -102 294 -300 -215
3247 -215 389 -40 -195 374 206 -292 -92 388 -89 -172 319 -55 -224 269 66 -337 -76 384 -336 -144
3267 -144 491 -265 -120 243 -28 -310 226 105 -122 100 297 -164 -150 201 -47 -105 201 160 -158 97 119
$$ packed form
3119B5K49o56K79M73o93L5N02k24n00P99m4n37L83M40q00j3N79k21k72M39m3o13
3141d13L88K29m99J41M59m34QL87k13k52L58J91n10O7N31n65J3N91n17j63L59
3162A56k3o00N01J57m91K0M98j70m27N34n5l59J11M40n82K04N21n06m2K99O8n16
3184b62M15Q8m55K07N00n95j16N94l57k60L63m9m85M28L07o08K03N42n13k41N45
3205B51j41m67O15P7p42K46N40m91j60O87m10k52L97Nn05M67K19o00L27J06k53
3226h4q4M28k68l91M43J67m68K14L03n89P5O87l88l59L43J88m49J30L96n94Q5
3247b15O04m29j55N69j68m98K00M80m77q3M91l74j69M93k03m03K61M60p20J92
3267a44O35p56J45L63k71k82N36j21k27K22J97m61J4L51k48n8L06m1l18K55K2
$$ plain form
3288 119 -231 23 420 3 -304 260 142 -135 115 335 -260 -137 273 -228 -153 302 -43 -322 215 113
3308 113 -236 -68 195 -174 -181 443 50 -273 207 167 -225 31 315 -145 25 316 -273 -246 313 6 -433
3329 -433 78 328 -68 -136 246 -182 17 207 48 -203 257 231 -270 167 375 -146 -40 357 -123 -158 224
3350 224 58 -334 -65 81 -161 26 374 -33 -377 211 54 -205 170 201 -299 9 272 -90 -190 268
3370 268 -110 -194 153 123 -257 107 192 -113 32 317 -109 -88 75 84 -383 236 155 -331 17 378 -111 -211
3392 -211 348 43 -147 117 198 -311 8 113 -117 -54 340 -65 -185 230 163 -210 175 151 -265 -61 251
3413 251 -84 -199 167 -98 -193 138 153 -226 90 225 -231 -282 419 125 -220 110 16 -393 257 202 -333 41
3435 41 260 -61 -188 247 104 -139 289 195 -256 95 267 -51 -119 308 17 -265 94 176 -304 15 159
$$ packed form
3288A19l50K54L97m17l07N64j18k77K50K20n95J23M10n01P5M55l45k79N37j02
3308A13l49J68K63l69pO24l93l23M80m0l92K56K84m60J70K91n89K7N59l07m39
3329d33N11K50l96o8L82m28J99J90j59k51M60k6n01M37K08n21J06L97m80l5L82
3350B24j66l92K69J46k42J87L48m07l44N88j57k59L75L1n00L08K63l62j00M58
3370B68l78q4L47l0l80L64Q5l05J45K85m26K1J63Rm67O19q1m86L48L61m89j00
3392b11N59l05j90K64Q1n09L19J05k30O3L94m05j20M15o7l73L85k4m16K04L12
3413B51l35j15L66k65r5L31J5l79L16J35m56n1P01k94l45L30r4m09O50n5n35L74
3435D1K19l21j27M35j43k43M28r4m51L51J72l18o8M27k91k82L59Q2m80L19J44
$$ plain form
3456 159 -175 -206 97 -102 -206 374 150 -91 -33 247 -264 23 209 -207 -78 286 -188 -268 71 167 -173
3477 -173 121 173 -230 -201 271 -175 -117 15 60 -199 111 157 -265 9 183 -62 -196 369 2 -202 40 108
3499 108 -205 -39 125 -237 -214 285 61 -150 53 155 -65 72 208 -138 1 186 -119 -45 165 40 -172
3520 -172 134 107 -195 -28 249 -150 -176 194 -42 -337 121 136 -181 42 68 -47 -85 313 -114 28 344 187
3542 187 -214 140 363 -148 -71 265 75 -227 252 -87 -257 -38 -57 -130 -128 186 26 -196 355 149 -179 110
3564 110 277 -252 46 197 -268 -66 266 -104 -220 85 18 -198 140 264 -215 69 237 -131 -185 369 113
3585 113 -293 47 37 -169 -79 334 -181 -117 127 -67 -258 87 43 -209 90 185 -96 -136 278 -69 1 226
3607 226 143 -134 107 43 -189 25 246 -107 -179 176 154 -302 101 -21 -357 24 184 -120 -32 202 -24 -179
$$ packed form
3456A59l34l1L03j99j04N80k24k41N8K80n11K87J86m16J29L64m74q0L39R6l40
3477a73K94N2m03K9M72m46N8J32M5k59L10M6m22K74J74k45j34N65l67k04K42O8
3499A08l13J66J64l62K3M99k24k11K03J02k20J37J36l46J39J85l05P4K10j25k12
3520a72L06k7l02J67K77l99k6L70k36k95M58J5l17K23K6j15l8L98m27J42L16j57
3542A87m01L54K23n11P7L36j90l02M79l39j70K19j9p3KL14j60k22N51k06l28K89
3564A10J67n29K98J51m65K02L32l70j16L05o7k16L38J24m79K84J68l68n4N54k56
3585A13m06L40j0k06R0M13n15O4K44j94j91L45m4k52K99R5k81m0M14l47P0K25
3607B26q3k77K41o4k32K14K21l53p2L55k2m56M03j22l36L81J60l04Q8K34k26j55
$$ plain form
3629 -179 218 62 -149 141 232 -140 -96 174 -216 -202 139 -111 -264 131 159 -274 15 151 -273 -138 236
3650 236 -162 -204 270 -54 -216 31 177 -131 -157 151 116 -65 224 156 -241 9 193 -8 113 164 -4 -117
3672 -117 136 29 -250 -3 178 -303 -76 139 -106 -100 219 13 -140 58 37 -206 -66 267 -62 -160 36
3693 36 -84 19 99 95 -327 115 142 -332 158 217 -170 82 210 -70 -161 113 168 -332 -42 174 -109 -16 203
3716 203 -39 -169 296 196 -235 224 217 -48 -148 182 -143 -42 66 -78 -176 118 279 -335 53 128 -139
3737 -139 -206 346 -82 -149 328 9 -111 98 61 -94 47 135 -34 -262 124 -117 -261 116 62 -324 43 41
3759 41 -3 -78 308 116 -174 184 131 72 173 190 -40 -15 173 -11 -140 75 27 -203 -55 114 -144 58 99
3782 99 -103 -112 97 63 -311 171 135 -68 -129 128 -52 13 187 -202 -126 219 -87 -107 135 86 -164 -1 207
$$ packed form
3629a79L97j56k11K90R1l72M4K70l90J4L41k50j53L95K8m33K89J36m24J35L74
3650B36l98m2M74l24j62K47J46l08k6L08l5j81K89o8l97K50J84k01J21N1j68j13
3672a17K53j07k79K47J81m81K27K15k45OL19k06j53J98k1k43J40L33l29r8J96
3693C6j20J03Q0mm22M42K7m74M90N9l87K52J28k80r1K74N5n00K90K16k83R3K19
3716B03k42j30M65j00m31M59pk65j00L30l25J01J08j44r8K94J61o14L88P5k67
3737a39o7N52m28o7M77l19j20K09l7j55J41Q8j69k28L86k41j44L77n4l86L67k
3759D1m4p5L86j92k90L58n3n9J01J7k30K5J88j84j29K15m8k30J48J69k58K02M1
3782I9k02rK09l4l74M82l6k03o1K57j80O5J74l89P6L45l06k0K42m9k50J63K08
$$ plain form
3805 207 3 -20 138 -1 -87 151 91 -168 -134 147 -122 19 177 -30 -46 82 166 -12 126 211 -38 -102 37
3828 37 141 -56 134 129 -309 258 214 -50 -28 303 -267 -187 191 -57 -81 104 68 -207 2 182 -195 51 75
3851 75 103 -162 71 132 -165 160 111 27 -7 4 -192 -38 310 114 -75 181 221 -146 35 54 -150 -39 118
3874 118 151 -157 0 -66 -219 38 28 34 24 122 -143 -230 180 19 -76 -3 77 -158 -79 168 -149 -76 199 40
3898 40 -145 47 16 6 130 149 -119 -72 98 -8 -131 94 28 -200 241 95 13 129 53 -67 -18 209 -58
3921 -58 -288 81 12 -63 39 76 -184 4 276 -73 -130 127 24 -21 42 112 -151 -75 224 53 -81 111 9
3944 9 26 11 233 -122 -13 -13 -95 -119 165 -65 -125 258 66 -241 77 234 39 -199 240 53 -27 86 71 -138
3968 -138 25 -37 -172 -13 69 56 -160 9 -64 -64 73 -65 -190 5 53 -5 73 94 -29 41 2 -68 -143 195 218
$$ packed form
3805B07k04k3J58j39q6K38o0k59L4K81k69J41J58k07j6J28Q4j78J38Q5k49o4J39
3828C7J04j97J90nm38N67m4k64K2L31n70Q0L78k48k4J85l6k75K09J80l77K46K4
3851G5K8k65K33O1k97L25m9q4l4J1j96J54L48j96j89K56M0l67J81J9k04J11J57
3874A18L3l08J57o6j53K57j0Oj0R8k65q7M10j61r5P3Q0k35P9K47l17P3K75j59
3898D0j85J92l1j0J24J9k68M7J70j06j23K25o6k28M41j46q2J16p6j20M9K27k67
3921e8k30L69o9p5J02L7k60J88K72l49n7K57j03m5O3P0k63P6K99j71j34J92j02
3944IJ7j5K22l55J09%q2k4K84k30o0L83j92l07L18J57j95k38M39j87q0J13j5k09
3968a38J63o2j35J59Q2j3k16J69p3%J37j38j25J95M8n8P8K1j23P0l9p0p5L38K3
$$ plain form
3993 218 -122 -94 164 -47 -85 126 48 -220 206 -47 34 125 213 -151 -32 142 95 83 -41 50 36 23 179 -7
4017 -7 -12 308 -9 1 34 49 -167 55 114 -90 -71 48 60 -80 219 149 -86 65 110 -111 -95 53 115 -44 113
4042 113 -18 -207 20 -44 -90 158 -9 20 -49 260 -88 6 281 42 -81 145 166 -119 20 44 -6 -137 153
4065 153 24 -334 53 -7 -5 -34 50 18 -12 168 -174 -44 -26 16 -124 50 98 -128 88 20 -75 158 116 113 -195
4090 -195 199 85 -281 111 110 -50 40 65 164 -77 68 46 -118 205 48 -133 -97 140 -141 -36 122 37 -119
4113 -119 51 -37 -252 -73 195 -59 47 77 -15 -204 185 48 -144 -20 5 22 -83 24 -25 -67 98 5 -170
4136 -170 161 150 -107 -29 145 -55 -54 159 25 -122 87 -2 -73 -64 93 18 -45 149 -149 28 162 35 -170
4159 -170 82 212 -205 -55 245 -4 -181 79 97 -104 42 -68 -52 -56 93 -92 -48 162 -141 -44 50 113 -162
$$ packed form
3993B18l40K8K58k11l8K11p8k68M26k53Q1R1Q8l64J19J74m7j2j24R1j4j3J56j86
4017gnL20l17J0L3J5k16K22N9k04J9J19J2j40K99p0k35J51M5k21J6J48O2j59J57
4042A13j31j89K27o4m6K48j67K9o9L09l48R4K75k39j23K26K1k85J39K4n0j31K90
4065A53j29l58L87o0Kk9Q4l2l0J80l42J30J8M2j40J74M8k26K16o8r5K33m2ll08
4090a95L94j14l66L92jj60R0K5R9k41J45k2j64L23j57j81L6K37k81J05J58q5j56
4113a19J70q8k15J79K68k54J06L0r2j89L89j37j92J24K5J7j05J07m9m2J65r3j75
4136a70L31j1k57P8J74k00JK13j34j47K09q9p1RJ57p5o3J94k98J77J34j27k05
4159a70K52J30m17J50L00k49j77K60J8k01J46j10J6mJ49j85M4K10l03R7R4O3k75
$$ plain form
4182 -162 45 98 -74 -75 29 -93 -44 154 41 -75 216 10 -222 -122 94 69 1 145 -84 -14 4 67 -49
4205 -49 -52 40 -86 -99 108 -8 1 96 -49 14 -45 -102 -115 56 -35 177 6 63 -14 -177 38 -45 -263 -114 102
4230 102 -75 -99 82 50 -185 98 -115 -99 -53 21 -78 -55 34 -184 -9 233 4 -102 88 96 -134 21 2 -148
4254 -148 47 -33 -183 104 134 78 -158 80 85 16 49 202 -10 -141 208 -80 -250 18 37 19 -91 13 -21
4277 -21 -90 62 81 -30 39 -42 97 129 106 -31 -93 142 -38 29 104 111 -221 179 131 -117 62 4 106 -36 51
4302 51 -26 -169 -2 65 -76 110 151 -100 -136 149 105 -19 22 35 -119 -38 1 24 -11 2 53 -33 94 63 -41
4327 -41 126 34 -70 -15 -23 -146 -156 173 -33 -111 74 104 135 -112 -20 -64 -107 128 3 28 144 -66 -95 -32 136
4352 136 122 -70 125 -50 -104 147 -127 -161 -31 125 -185 -52 64 -88 -24 40 -48 -138 194 170 -77 13 87
$$ packed form
4182a62K07N3j72jJ04j22M9J98j13j16K91k06k32J00K16k5o8J44k29P0J8O3j16
4205d9lR2j26j3K07j16RR5j45O3n9n7j3J71r1K12j71N7p7j63K15q3k18J49K16
4230A02j77k4J81l2k35K83k13J6M6P4r9K3Q9k18J75K42k29j06J90Qk30J55j9j50
4254a48J95q0j50K87L0n6k36K38No9L3J53k12j31L49k88j70K68J9j8j10J04l4
4277b1o9J52J9j11O9q1J39L2k3j37o2K35j80O7P5Pl32M00m8k48J79n8J02j42Q7
4302E1p7j43J67O7j41J86M1k51l6K85m4j24M1J3j54Q1L9K3l5J3N1q6J27l1j04
4327d1J67r2j04N5qj23j0L29k06p8J85L0L1k47R2m4m3K35j25K5J16k10k9O3J68
4352A36j4j92J95j75n4K51k74l4J30J56l10J33J16j52O4O4q8r0L32k4k47R0P4
$$ plain form
4375 87 -51 96 194 -46 -52 -61 -9 -231 67 15 -109 -50 3 -274 -39 -149 110 -175 109 87 -172 -46 196 -165
4399 -165 -106 80 -135 -155 70 143 -116 107 124 -40 48 189 -45 54 47 -118 -76 148 -12 -17 66 67 -150 10 -30
4424 -30 -220 -24 -4 31 -162 47 44 -136 -8 -42 103 -29 86 -90 -96 34 -15 6 -19 112 -5 -60 197 -38
4448 -38 91 -3 151 100 35 -23 -226 -13 170 -126 18 33 69 -64 -33 125 -111 40 -8 -158 -155 122 -92 -27
4472 -27 58 39 -62 50 46 -35 68 -163 56 -53 11 55 -28 -41 20 -218 42 137 161 -85 -2 -55 22 179 -45
4497 -45 10 18 120 -177 -30 90 24 -130 128 0 24 -60 38 -65 -14 96 16 -107 17 -12 69 31 145 -53
4521 -53 -21 21 -37 -154 17 -126 -22 -8 -51 -149 -108 88 -72 29 1 161 97 47 141 -248 3 79 -150 112
4545 112 132 -13 -22 159 -31 33 -10 2 -126 -236 25 72 72 115 -95 -42 -120 29 -18 9 38 40 15 41 -47 94 91
$$ packed form
4375H7j38J47R8k40orN2k22K98n2j24N9N3k77K35j10K59k85K84k2k59J26K42l61
4399a65N9J86k15k0K25P3k59K23J7j64Q8J41k34R9pj65M2K24j60nQ3Jk17J60m0
4424c0j90J96K0L5j93K09lj80J28l4J45j32J15j76oJ30m9K1k5J31j17n5K57k35
4448c8J29r4J54n1o5n8k03K13J83k96J44J5L6j33L1J58k36J51m8j50LK77k14O5
4472b7Q5j9j01J12mq1J03k31K19j09O4M4q3j3O1k38K60R5K4k46Q3n3P7J57k24
4497d5N5QJ02k97J47J20o6j54K58j28K4q4R8j03N1J10q0j23J24k9Q1l8J14j98
4521e3L2M2n8j17J71j43J04J4m3r8M1J96j60J01k8J60o4n0R4l89K51P6k29K62
4545A12K0j45rJ81j90O4m3J2j28j10K61M7%M3k10N3p8J49m7K7K9Kk5K6q8J41l
$$ plain form
4572 91 -88 -97 85 -26 35 -117 73 -198 -38 -13 78 106 -6 32 -22 -33 -16 -55 99 -129 -135 -198 111 -93 -126
4597 -126 73 -37 -55 60 106 -137 100 99 2 -59 38 26 39 -78 30 21 38 138 97 -246 39 179 -237 -210 30
4622 30 20 -107 59 -37 22 103 -51 11 -58 44 -53 22 72 -91 -5 -15 24 -229 -5 159 -103 -7 94 9 -186
4647 -186 40 -114 -119 -17 90 -103 -79 -17 33 53 -61 163 -114 158 78 -85 57 -8 -114 85 -70 -39 235
4670 235 117 -74 -150 19 58 -75 -24 27 -116 -103 27 -124 -212 12 136 -160 137 29 -84 -67 150 53 -73
4693 -73 84 45 10 99 -35 -185 -12 59 -21 2 92 42 32 139 29 -222 -45 191 19 -18 156 -92 -1 -26
4717 -26 -67 130 60 -28 -63 -57 -75 -189 94 -8 -12 -150 94 -49 21 123 51 -48 134 186 -63 -157 -75 -68 -40 25 62
4744 62 -84 171 69 2 -73 -44 -12 3 105 -64 55 163 111 -134 -18 53 -30 -132 73 -16 -179 90 53 -93
$$ packed form
4572I1j79rJ82j11O1j52J90k71J60K5R1K8j12L8n4j1J7l9J54k28oo3L09k04l3
4597a26J99j10j8J15M6k43K37jr7o1R7j2J3j17J08rJ7J00m1l43K85J40m16K7K40
4622C0j0j27J66r6N9Q1j54O2o9J02r7P5N0j63Q6j0L9k53K24J64k62R6J01q5j95
4647a86K26j54nJ02J07j93K4O2N0K0j14K24k77K72q0j63J42o5j06J99j55L1K74
4670B35j18j91p6J69L9j33N1N1j43J3J30j51q8K24J24k96K97j08j13J7K17r7j26
4693g3J57l9l5Q9j34j50J73P1q0K3R0n0j0J07j10k51J77K36j72l7J74k48R1k5
4717b6m1J97p0q8l5Oj8j14K83j02mj38K44j43P0J02p2r9J82N2k49r4Q2PK8O5L7
4744F2j46K55j02o7p5K9L2J5J02j69J19J08n2k45J16P1q3j02K05q9j63K69l7j46
$$ plain form
4768 -93 -13 -58 -190 -110 117 -23 29 -112 81 -15 -168 -19 -56 -9 158 -49 -97 146 -117 44 -83 69 -18
4791 -18 -92 125 0 -191 123 110 -194 88 102 -67 -162 102 76 77 68 -25 -131 42 85 -166 27 95 -96 -57 21
4816 21 -7 -58 -74 -124 92 100 174 -1 -30 90 87 -29 -18 63 258 11 25 -3 104 67 -9 -23 -42 -163 -82 -63 51
4843 51 -112 29 127 -168 1 -32 -21 -6 -21 19 59 2 211 52 -5 169 1 -35 195 -14 68 -60 -1 -96 -127
4868 -127 -27 82 42 144 12 45 -71 13 49 -16 9 -26 -43 182 -18 -73 12 73 -152 -9 154 -123 -12 140
4892 140 66 -103 73 -9 14 -179 215 -50 17 197 -60 6 10 39 10 -85 134 -67 -41 34 -42 -65 -96 45 -68
4917 -68 82 -88 -176 45 -66 -26 -45 1 -5 2 114 -124 -101 26 -53 16 143 19 -91 1 -81 -161 -15 -34 20 53
4943 53 93 -79 -130 132 5 -109 -151 -48 128 -34 79 46 -123 40 -37 -98 -115 51 -115 -103 59 -42 -39 -40
$$ packed form
4768i3Q0m5j32Q0K27j40N2j41J93r6j53J49l7M7J67k07m8K43k63J61j27J52q7
4791a8p4K17j25j91L14j3l04K82J4j69r5K64k6Jrr3j06J73M3k51J93O8j91L9P8
4816B1k8n1j6n0K16QP4j75k9J20lj16J1Q1J95k47J4k8J07l7p6j4j9j21Q1J9J14
4843E1j63J41R8k95J69l3J1J5j5M0M0n7K09j59n7J74j68l6K30k09Q2j28N9r5l1
4868a27J00J09m0J02j32L3j16Q4L6o5K5l5j7K25k00n5Q5O1k25J43J63k77J11J52
4892A40p4j69J76q2K3j93L94k65O7J80k57O6MK9k9r5K19k01K6P5p6k3l1J41j13
4917f8J50j70q8K21j11M0j9M6oPJ12k38K3J27p9O9J27j24j10R2q2q0J46j9N4L3
4943E3M0j72n1K62j27j14m2J03J76j62J13l3j69J63p7o1j7J66j66J2J62j01Lj
$$ plain form
4967 -40 42 -40 30 125 -97 0 10 -57 -87 -6 -3 -174 -83 69 -124 -68 71 73 32 69 122 -79 83 34 -17 -87 158
4994 158 30 37 14 146 20 82 67 -47 -9 92 -53 130 13 -33 -144 -72 -75 -74 -105 120 -39 -115 169 50 -33
5019 -33 6 65 -46 177 91 -92 107 140 -72 185 3 -11 -56 -21 58 1 24 161 -85 -118 -62 -100 -7 -52 -2 -155
5045 -155 15 -61 -106 53 -9 123 85 -20 55 64 5 39 -65 48 5 -94 -76 -119 -23 62 46 214 -128 -104 76 -24
5071 -24 70 -67 -121 -170 38 -49 -51 86 84 -195 33 -60 -137 55 284 -51 -68 -37 20 110 -24 3 52 100 7 -35 -134
$$ packed form
4967d0Q2q2P0R5k22R7J0o7l0Q1Lj71R1J52j93N6J39Km1L7N3k01J62m9n1p0K45
4994A58j28Pk3J32j26O2j5j14L8J01j45J83j17m6j11P2lJl1K25j59p6K84j19q3
5019c3L9N9j11K23q6j83J99L3k12K57j82j4m5L5P9n7K3J37k46l3N6l8R3m5N0j53
5045a55J70p6m5J59o2J32l8j05P5Rn9L4j04J13m3r9J8m3R6Q5j6J68l42K4J80j00
5071b4R4j37n4m9K08q7kJ37kk79K28r3p7J92K29l35j7L1N7R0j34K7M9M8r3m2r9
$$ [...]
8191a9
##END NTUPLES=NMR FID
##END=
