##TITLE=1H_3MBDE7-1
 CDCl3
 8 sc, 
 16.12.2022
##JCAMPDX= 6.0         $$ Bruker NMR JCAMP-DX V2.0
##DATA TYPE= NMR FID
##DATA CLASS= NTUPLES
##ORIGIN= UXNMR, Bruker Analytische Messtechnik GmbH
##OWNER= root
$$ XWIN-NMR		Version 3.5
$$ Fri Dec 16 14:22:04 2022 Russian Standard Time (UT+4h)  she@DPX200
##.OBSERVE FREQUENCY= 200.13135
##.OBSERVE NUCLEUS= ^1H
##.DELAY= (6, 6)
##.ACQUISITION MODE= SIMULTANEOUS
##.ACQUISITION SCHEME= undefined
##.AVERAGES= 8
##.DIGITISER RES= 18
##SPECTROMETER/DATA SYSTEM= spect
##.PULSE SEQUENCE= zg30
##.SOLVENT NAME= CDCl3
##.SHIFT REFERENCE= (INTERNAL, CDCl3, 0, 15.7039)
##AUDIT TRAIL= $$ (NUMBER, WHEN, WHO, WHERE, WHAT)
$$ ##TITLE= Audit trail, XWIN-NMR		Version 3.5
$$ ##JCAMPDX= 5.01
$$ ##ORIGIN= Bruker BioSpin GmbH
$$ ##OWNER= she
$$ F:/spectra/data/she/nmr/H-F/1/audita.txt
$$ ##AUDIT TRAIL=  $$ (NUMBER, WHEN, WHO, WHERE, WHAT)
(   1,<2022-12-16 14:20:34.09 +0400>,<she>,<DPX200>,
      <created by zg, POWCHK disabled, PULCHK disabled
       configuration hash MD5:
       00 E9 B6 7A A2 85 ED C7 34 08 36 98 17 FE 4E 26
       data hash MD5: 16K
       65 0D 05 6E 15 28 25 DB 43 C7 97 9D 96 86 BA 1C>)
$$ ##END=
$$ 
$$ hash MD5
$$ 0B B3 D5 83 1C D3 DA 5A B4 F2 B2 00 6D 9D 0F 88
##$RELAX= 
##$RELAX= 
##$RELAX= 
##$RELAX= 
##$RELAX= 
##$RELAX= 
$$ Bruker specific parameters
$$ --------------------------
##$DU= <F:/spectra>
##$EXPNO= 1
##$NAME= <H-F>
##$PROCNO= 1
##$TYPE= <nmr>
##$USER= <she>
##$AMP= (0..31)
100 100 100 100 100 100 100 100 100 100 100 100 100 100 100 100 100 100 
100 100 100 100 100 100 100 100 100 100 100 100 100 100 
##$AQSEQ= 0
##$AQ_mod= 1
##$AUNM= <au_zg>
##$AUTOPOS= <>
##$BF1= 200.13
##$BF2= 200.13
##$BF3= 200.13
##$BF4= 200.13
##$BF5= 200.13
##$BF6= 200.13
##$BF7= 200.13
##$BF8= 200.13
##$BYTORDA= 1
##$CFDGTYP= 0
##$CFRGTYP= 5
##$CHEMSTR= <none>
##$CNST= (0..31)
1 1 145 1 1 1 1 1 1 1 1 1 1 1 1 1 1 1 1 1 1 1 1 1 1 1 1 1 1 1 1 1 
##$CPDPRG= <>
##$CPDPRG1= <>
##$CPDPRG2= <>
##$CPDPRG3= <>
##$CPDPRG4= <mlev>
##$CPDPRG5= <mlev>
##$CPDPRG6= <mlev>
##$CPDPRG7= <mlev>
##$CPDPRG8= <mlev>
##$CPDPRGB= <>
##$CPDPRGT= <>
##$D= (0..31)
0 1.2 0 0 0 0 0 0 0 0.06 0 0.03 0 0 0 0 0.0002 0 0 0 0 0 0 0 0 0 0 0 0 
0 0 0 
##$DATE= 1671186033
##$DBL= (0..7)
120 120 120 120 120 120 120 120 
##$DBP= (0..7)
150 150 150 150 150 150 150 150 
##$DBP07= 0
##$DBPNAM0= <>
##$DBPNAM1= <>
##$DBPNAM2= <>
##$DBPNAM3= <>
##$DBPNAM4= <>
##$DBPNAM5= <>
##$DBPNAM6= <>
##$DBPNAM7= <>
##$DBPOAL= (0..7)
0.5 0.5 0.5 0.5 0.5 0.5 0.5 0.5 
##$DBPOFFS= (0..7)
0 0 0 0 0 0 0 0 
##$DE= 6
##$DECBNUC= <off>
##$DECIM= 32
##$DECNUC= <off>
##$DECSTAT= 4
##$DIGMOD= 1
##$DIGTYP= 9
##$DL= (0..7)
0 120 120 120 120 120 120 120 
##$DP= (0..7)
150 150 150 150 150 150 150 150 
##$DP07= 0
##$DPNAME0= <>
##$DPNAME1= <>
##$DPNAME2= <>
##$DPNAME3= <>
##$DPNAME4= <>
##$DPNAME5= <>
##$DPNAME6= <>
##$DPNAME7= <>
##$DPOAL= (0..7)
0.5 0.5 0.5 0.5 0.5 0.5 0.5 0.5 
##$DPOFFS= (0..7)
0 0 0 0 0 0 0 0 
##$DQDMODE= 0
##$DR= 18
##$DS= 0
##$DSLIST= <SSSSSSSSSSSSSSS>
$$ [...]
##$SUBNAM2= <"">
##$SUBNAM3= <"">
##$SUBNAM4= <"">
##$SUBNAM5= <"">
##$SUBNAM6= <"">
##$SUBNAM7= <"">
##$SUBNAM8= <"">
##$SUBNAM9= <"">
##$SW= 18.05172834244
##$SWIBOX= (0..15)
0 0 2 0 0 0 0 0 0 0 0 0 0 0 0 0 
##$SW_h= 3612.71676300578
##$TD= 16384
##$TD0= 1
##$TE= 0
##$TE2= 300
##$TE3= 300
##$TEG= 300
##$TL= (0..7)
0 120 120 120 120 120 120 120 
##$TP= (0..7)
150 150 150 150 150 150 150 150 
##$TP07= 0
##$TPNAME0= <>
##$TPNAME1= <>
##$TPNAME2= <>
##$TPNAME3= <>
##$TPNAME4= <>
##$TPNAME5= <>
##$TPNAME6= <>
##$TPNAME7= <>
##$TPOAL= (0..7)
0.5 0.5 0.5 0.5 0.5 0.5 0.5 0.5 
##$TPOFFS= (0..7)
0 0 0 0 0 0 0 0 
##$TUNHIN= 0
##$TUNHOUT= 0
##$TUNXOUT= 0
##$USERA1= <user>
##$USERA2= <user>
##$USERA3= <user>
##$USERA4= <user>
##$USERA5= <user>
##$V9= 5
##$VALIST= <valist>
##$VCLIST= <CCCCCCCCCCCCCCC>
##$VD= 0
##$VDLIST= <DDDDDDDDDDDDDDD>
##$VPLIST= <PPPPPPPPPPPPPPP>
##$VTLIST= <TTTTTTTTTTTTTTT>
##$WBST= 1024
##$WBSW= 4
##$XGAIN= (0..3)
0 0 0 0 
##$XL= 0
##$YL= 0
##$YMAX_a= 311678
##$YMIN_a= -525470
##$ZGOPTNS= <>
##$ZL1= 120
##$ZL2= 120
##$ZL3= 120
##$ZL4= 120
##$ABSF1= 10
##$ABSF2= 0
##$ABSG= 5
##$ABSL= 3
##$ALPHA= 0
##$AQORDER= 0
##$ASSFAC= 0
##$ASSFACI= 0
##$ASSFACX= 0
##$ASSWID= 0
##$AUNMP= <proc_1d>
##$AZFE= 0.1
##$AZFW= 0.1
##$BCFW= 1
##$BC_mod= 2
##$BYTORDP= 1
##$COROFFS= 0
##$CY= 11.3945322036743
##$DATMOD= 1
##$DC= 2
##$DFILT= <>
##$DTYPP= 0
##$F1P= 2.36226072786647
##$F2P= -0.459571619588291
##$FCOR= 0.5
##$FTSIZE= 0
##$FT_mod= 4
##$GAMMA= 1
##$GB= 0.15
##$INTBC= 1
##$INTSCL= 1
##$ISEN= 128
##$LB= 0.24
##$LEV0= 0
##$LPBIN= 0
##$MAXI= 10000
##$MC2= 0
##$MEAN= 0
##$ME_mod= 0
##$MI= 1.114404
##$NCOEF= 0
##$NC_proc= 0
##$NLEV= 6
##$NOISF1= 3.799351
##$NOISF2= 2.8
##$NSP= 1
##$NTH_PI= 0
##$NZP= 0
##$OFFSET= 15.70392
##$PC= 1
##$PHC0= -19101.09
##$PHC1= 11.00072
##$PH_mod= 1
##$PKNL= yes
##$PPARMOD= 0
##$PSCAL= 0
##$PSIGN= 0
##$REVERSE= no
##$SF= 200.130013532006
##$SI= 16384
##$SIGF1= 3
##$SIGF2= 2
##$SINO= 400
##$SIOLD= 16384
##$SREGLST= <1H.CDCl3>
##$SSB= 0
##$STSI= 0
##$STSR= 0
##$SW_p= 3612.71676300578
##$SYMM= 0
##$S_DEV= 0
##$TDeff= 0
##$TDoff= 0
##$TI= <>
##$TILT= no
##$TM1= 0
##$TM2= 0
##$TOPLEV= 0
##$USERP1= <user>
##$USERP2= <user>
##$USERP3= <user>
##$USERP4= <user>
##$USERP5= <user>
##$WDW= 1
##$XDIM= 8192
##$YMAX_p= 0
##$YMIN_p= 0
$$ End of Bruker specific parameters
$$ ---------------------------------
##NTUPLES= NMR FID
##VAR_NAME=  TIME,          FID/REAL,        FID/IMAG
##SYMBOL=    X,             R,               I
##VAR_TYPE=  INDEPENDENT,   DEPENDENT,       DEPENDENT
##VAR_FORM=  AFFN,          ASDF,            ASDF
##VAR_DIM=   8192,          8192,            8192
##UNITS=     SECONDS,       ARBITRARY UNITS, ARBITRARY UNITS
##FACTOR=    0.0002768,     1,               1
##FIRST=     0,             0,               0
##LAST=      2.2672688,     0,               0
##MIN=       0,             -525470,         0
##MAX=       2.2672688,     311678,          0
$$ Real data points
##PAGE= N=1
##DATA TABLE= (X++(R..R)), XYDATA
$$ plain form
0 0 0 0 0 0 0 0 0 0 -8 8 -8 8 -16 16 -24 24 -32 40 -48 56 -72 88 -104 120 -140 161 -192 220 -255 291 -333
31 -333 380 -433 489 -552 623 -701 784 -876 977 -1087 1210 -1341 1485 -1643 1814 -2004
47 -2004 2211 -2434 2682 -2954 3254 -3588 3958 -4370 4839 -5370 5977 -6684 7517 -8512
61 -8512 9730 -11257 13240 -15927 19791 -25846 36728 -62307 246756 -39149 -417380 238470
73 238470 -2067 -291623 187926 261546 -229108 -11500 153315 -196269 -123048 256996
83 256996 65002 -145747 -7080 32520 -86374 -29720 79936 79478 -14599 -31979 -19364
94 -19364 -90212 -46311 157182 68507 -117472 41654 78357 -180445 -55700 196740 24652
105 24652 -48468 77822 -107563 -148712 150955 80182 -114028 89676 80070 -189416 -56504
$$ packed form
0@%%%%%%%%qJ6j6J6k4L2m0M8n6P2q8J04j28J60j92K24k60L01l53M12m75N46o24
31c33P13q13R22j041J175j324J485j660J853k064K297k551K826l128L457l818
47b004M215m645N116n636O208o842P546q328R209j0209J1347j2661J4201j6029
61h512J8242k0987K4497k9167L5718m5637O2574r9035L09063k85905l78231O55850
73B38470k40537k89556M79549P3620m90654K17608J64815l49584P3221L80044
83B56996j91994k10749J38667L9600j18894N6654J09656m58r4077j7380J2615
94a9364p0848M3901K03493q8675j85979J59126L6703k58802J24745K52440j72088
105B4652p3120J26290j85385m1149K99667p0773j94210K03704r606k69486J32912
$$ plain form
116 -56504 122237 -7396 18689 70139 -115172 -82592 98637 4796 -44531 75183 17384
127 17384 -55172 -4544 -46669 -19003 115075 26231 -80771 32800 26696 -81783 -881
138 -881 56701 595 29537 7712 -85317 -17231 58133 -819 3587 29645 -25909 -25824 -12520
151 -12520 -30823 48972 73484 -54449 -57724 25312 -11280 4681 58794 -26968 -28390 58255
163 58255 -44622 -80981 92300 62457 -77565 8178 38009 -57051 18404 47282 -75659
174 -75659 1604 103953 -46976 -81631 62041 21668 -47730 31446 15658 -48217 11577
185 11577 17704 -40750 11246 55631 -8529 -48382 -16537 28345 26161 -23530 -9009 41149
197 41149 -15154 -48772 31395 26155 -23879 31009 4948 -75169 29493 80318 -65512 -45613
$$ packed form
116e6504J78741j29633K6085N1450j85311L2580J81229r3841m9327J19714n7799
127A7384p2556N0628m2125K7666J34078q8844j07002J13571o104j08479Q0902
138h81N7582n6106K8942k1825r3029O8086P5364n8952M406K6058n5554Q5J3304
151a2520j8303P9795K4512j27933l275Q3036l6592J5961N4113q5762j422Q6645
163E8255j02877l6359J73281k9843j40022Q5743K9831r5060P5455K8878j22941
174g5659P7263J02349j50929l4655J43672m0373o9398P9176j5788o3875N9794
185A1577O127n8454N1996M4385o4160l9853L1845M4882k184m9691J4521N0158
197D1149n6303l3618Q0167n240n0034N4888k6061q0117J04662N0825j45830J9899
$$ plain form
209 -45613 82831 -4001 -63476 41294 13248 -52449 35619 26017 -69791 11164 71594 -43046
221 -43046 -57659 46044 36633 -24960 -18468 -1432 4021 11963 5483 -4765 -7244 5125 15877
234 15877 -16646 -22749 43054 27161 -58968 -13589 55144 -10437 -28055 29665 -11329 -29247
246 -29247 41273 159 -55667 35851 42839 -64742 -22757 61553 -653 -34416 9572 -4778
258 -4778 -5548 34887 -4029 -42866 15349 38111 -16157 -24622 17328 23400 -11129 -25793 6749
271 6749 27907 1472 -13705 -8102 -11867 12575 31791 -24557 -40413 35367 28638 -45220 -11263
284 -11263 38875 -8310 -25731 10130 1602 59 21757 -12514 -32283 22390 30906 -21247 -17445
297 -17445 19062 10972 -11052 -6996 7586 12781 731 -14289 -11286 8495 22882 1949 -35003
$$ packed form
209d5613J28444q6832n9475J04770k8046o5697Q8068r602r5808Q0955O0430j14640
221d3046j4613J03703r411o1593O492J7036N453P942o480j0248k479J2369J0752
234A5877l2523o103O5803j5893q6129M5379O8733o5581j7618N7720m0994j7918
246b9247P0520m1114n5826R1518O988j07581M1985Q4310o2206l3763M3988j4350
258d778p70M0435l8916l8837N8215K2762n4268q465M1950O072l4529j4664L2542
271F749K1158k6435j5177N603l765K4442J9216n6348j5856P5780o729p3858L3957
284a1263N0138m7185j7421L5861q528j543K1698l4271j9769N4673Q516n2153L802
297a7445L6507q090k2024M056J4582N195j2050j5020L003J9781J4387k0933l6952
$$ plain form
310 -35003 -14182 35907 12618 -35151 -5810 25054 -4896 -14230 5097 -2089 2439 14622 -18971
323 -18971 -24208 34952 32383 -34633 -25232 28729 13207 -16922 1397 7475 -7456 6825 11708
336 11708 -16243 -6213 25708 -4050 -38809 7081 40663 -9870 -33563 9368 15560 -12083
348 -12083 -2423 5901 -9126 3333 11742 -19552 -10832 35464 10562 -41444 -6213 39461 4991
361 4991 -21898 2055 1840 -6955 17038 8334 -26610 3013 33487 -17931 -34279 28081 25489
374 25489 -33387 -17054 21496 2886 -1915 9975 -18142 -17541 26870 9064 -32965 2286 32592
387 32592 -11287 -25052 18740 20959 -13793 -11703 4715 -781 4681 16432 -5234 -20811 11581
400 11581 20249 -22108 -16126 30697 9018 -34143 -4038 23155 -1574 -3517 192 -21111 1460
$$ packed form
310c5003K0821N0089k3289m7769K9341L0864k9950r334J9327p186M528J2183l3593
323a8971n237N9160k569o7016R401N3961j5522l0129J8319O078j4931J4281M883
336A1708k7951J0030L1921k9758l4759M5890L3582n0533k3693M2931O192k7643
348a2083R660Q324j5027J2459Q409l1294Q720M6296k4902n2006L5231M5674l4470
361D991k6889K3953k15q795K3993q704l4944K9623L0474n1418j6348O2360k592
374B5489n8876J6333L8550j8610m801J1890k8117O01M4411j7806m2029L5251L0306
387C2592m3879j3765M3792K219l4752K090J6418n496N462J1751k1666j5577L2392
400A1581Q668m2357N982M6823k1679m3161L0105K7193k4729j943L709k1303K2571
$$ plain form
413 1460 34372 -9653 -36218 16491 25546 -20496 -12165 17794 3779 -6967 1259 -1258 3055
426 3055 12381 -2513 -19045 -3484 21193 14886 -15360 -16309 13727 8354 -18696 -468 19839
439 19839 -4372 -13786 -1246 -5835 7128 23517 -13948 -30656 16262 18971 -21958 -5732 23805
452 23805 2702 -12478 -4190 -2694 7910 14777 -6448 -13431 8207 14614 -3780 -19556 -6146
465 -6146 26626 17359 -23452 -14752 12752 -2514 -6232 12973 -2105 -5970 12501 -17721 -29354
478 -29354 33962 35223 -34088 -22222 21946 -5111 -13659 21415 9982 -11415 5327 -3625 -23776
491 -23776 8998 34075 -1178 -26250 1339 19228 -8322 -20039 13591 21955 -9263 -10908
503 -10908 -1232 -15193 4962 29738 -14257 -23816 32531 4852 -54882 3142 49891 -4231
$$ packed form
413A460L2912m4025k6565N2709R055m6042Q331K9959j4015j0746Q226k517M313
426C055R326j4894j6532J5561K4677o307l0246r49L0036n373k7050J8228K0307
439A9839k4211r414J2540m589J2963J6389l7465j6708M6918K709m0929J6226K9537
452B3805k1103j5180Q288J496J0604O867k1225o983K1638O407j8394j5776J3410
465f146L2772r267m0811Q700K7504j5266l718J9205j5078l865J8471l0222j1633
478b9354O3316J261o9311J1866M4168k7057q548L5074j1433k1397J6742q952k0151
491b3776L2774K5077l5253k5072K7589J7889k7550j1717L3630Q364l1218j645
503a0908R676j3961K0155K4776m3995r559N6347k7679n9734N8024M6749n4122
$$ plain form
515 -4231 -12092 9778 -29266 -15763 45076 6896 -30936 26532 17739 -49780 -12632 41823 7485
528 7485 -7783 10486 -16245 -22352 19340 12206 -19786 7957 27622 -19394 -38594 11754 30139
541 30139 -8549 -10483 15886 -4517 -22839 5972 5536 -8832 27239 22282 -42713 -25188 35092
554 35092 5561 -17306 25460 11467 -28739 -4239 1396 -13793 31000 35091 -38106 -33502 23742
567 23742 5099 -14193 17264 9771 -14700 -1713 -7241 -18714 16430 28100 -11080 -18040 5207
580 5207 1614 -9123 -116 12911 12759 -1183 -14467 -11335 1977 12833 11715 -3023 -4513 5850
594 5850 -8935 -21611 9145 29427 3628 -15271 -14106 -8398 9852 12343 -7412 1179 13405
607 13405 -16438 -22771 12035 14806 2027 6882 -11571 -21225 16410 16977 -21486 -823 28732
$$ packed form
515d231p861K1870l9044J3503O0839l8180l7832N7468q793o7519L7148N4455l4338
528G485j5268J8269k6731o107M1692p134l1992K7743J9665m7016j9200N0348J8385
541C0139l8688j934K6369k0403j8322K8811m36j4368L6071m957o4995J7525O0280
554C5092k9531k2867M2766j3993m0206K4500N635j5189M4793M091p3197M604N7244
567B3742j8643j9292L1457p493k4471J2987n528j1473L5144J1670l9180o960K3247
580E207l593j0737R007J3027j52j3942j3284L132J3312J0856j118j4738j490J0363
594E850j4785j2676L0756K0282k5799j8899J165N708J8250K491j9755Q591J2226
607A3405k9843o333L4806K771j2779M855j8453r654L7635N67l8463K0663K9555
$$ plain form
620 28732 -5361 -20545 4441 1517 149 16779 -1818 -18052 8411 7475 -21332 -1906 27062
633 27062 3887 -18677 -7276 283 -583 6536 5782 -4402 -2238 2513 -9166 -11139 16201 22904
647 22904 -12834 -22190 8127 10794 -5366 4807 4691 -8398 6797 6909 -22561 -2609 33045
660 33045 -3158 -30156 10875 18786 -16834 -7422 10186 -4637 2579 13364 -16431 -19084 19660
673 19660 14267 -18001 -3981 15480 -4255 -13004 4862 8570 853 2992 -2877 -12820 3711
686 3711 20413 -2966 -18885 9314 16810 -17207 -14291 20358 9696 -15343 -2733 3033 -5152
699 -5152 8811 6859 -20281 -6132 24642 230 -22871 3852 14662 -5240 -5186 3825 -1446
712 -1446 3024 5538 -10292 -7246 18699 12235 -17998 -12903 14737 11382 -8597 -5905 5394 1278
$$ packed form
620B8732l4093j5184K4986k924j368J6630j8597j6234K6463r36k8807J9426K8968
633B7062k3175k2564J1401P559q66P119p54j0184K164M751j1679j973K7340O703
647B2904l5738r356L0317K667j6160J0173j16j3089J5195J12k9470J9952L5654
660C3045l6203k6998M1031P911l5620R412J7608j4823P216J0785k9795k653L8744
673A9660n393l2268J4020J9461j9735q749J7866L708p717K139n869r943J6531
686C711J6702k3379j5919K8199P496l4017K916L4649j0662k5039J2610N766q185
699e152J3963j952k7140J4149L0774k4412k3101K6723J0810j9902N4R011n271
712a446M470K514j5830L046K5945o464l0233N095K7640l355j9979K692J1299m116
$$ plain form
726 1278 -3227 -237 -2332 132 8677 -3497 -16064 4635 17264 -7481 -15938 6720 8934 -5435
740 -5435 -1280 2493 -3258 3265 4338 -10129 -2521 17835 3689 -19851 -4290 19668 7619
753 7619 -13599 -7876 7414 5748 -2086 -3195 -1653 1464 4550 -3838 -10494 4852 13607 -7636
767 -7636 -16336 5601 13082 -3049 -7124 -1305 -129 5196 5085 -7904 -4601 12412 2993 -14375
781 -14375 450 15976 -590 -12544 246 7829 1906 -1299 -3211 -4693 3561 6536 -6964
794 -6964 -7353 10599 6178 -14811 -7962 13143 6365 -8710 -4790 -20 1302 8421 1953 -13789
808 -13789 -1876 16810 16 -15592 4674 14888 -6151 -10588 5957 7015 -528 -969 -4739
821 -4739 -4523 8633 7566 -10504 -7680 9744 3458 -10027 -1594 7949 -783 -6099 -1275 782
$$ packed form
726A278m505K990k095K464Q545j2174j2567K0699J2629k4745q457K2658K214j4369
740e435M155L773n751O523J073j4467P608K0356j4146k3540J5561K3958j2049
753G619k1218N723J5290j666p834j109J542L117L086q388o656J5346Q755k1243
767g636q700K1937P481j6131m075N819J176N325j11j2989L303J7013r419j7368
781a4375J4825J5526j6566j1954J2790P583n923l205j912j482Q254K975j3500
794f964l89J7952m421k0989O849K1105o778j5075L920M770J322P119o468j5742
808a3789J1913J8686j6794j5608K0266J0214k1039m437J6545J058p543m41l770
821d739K16J3156j067j8070K824J7424o286j3485Q433R543q732n316M824K057
$$ plain form
835 782 2374 4990 -4443 -9825 5641 11657 -5872 -9697 7971 8125 -7889 -4949 7728 5156
849 5156 -1727 -3907 -4908 2661 11418 -787 -15185 -1137 13765 459 -10711 -445 4471
862 4471 -1284 -2270 -1113 -1042 4233 2997 -9275 -5975 11496 8103 -10448 -7070 8294 5939 -4440
877 -4440 -2183 2735 2150 643 -2082 -2513 5052 6773 -6244 -10028 5772 10129 -4702 -9086 1894
892 1894 4303 -1221 -2114 -1481 35 4627 -713 -10078 -293 13661 1689 -14964 -3031 12609
906 12609 4835 -6983 -4420 2119 5476 3429 -4166 -4831 5210 5786 -6175 -5889 7476 6996 -6718
921 -6718 -7785 2323 5669 1650 -3479 -5809 -164 6194 -661 -8228 2140 9297 -4336 -10190
935 -10190 3662 9223 -196 -4579 -2930 941 6880 3073 -8696 -2309 11702 1723 -11751 -222
$$ packed form
835G82J592K616r433n382J5466O016j7529l825J7668J54j6014K940J2677k572
849E156o883k180j001P569Q757j2205j4398J4048J4902j3306j1170J0266M916
862D471n755r86J157P1N275j236j2272L300J7471l393j8551L378J5364k355j0379
877d440K257M918n85j507k725m31P565J721j3017l784J5800M357j4831m384J0980
892A894K409n524q93O33J516M592n340r365R785J3954j1972j6653J1933J5640
906A2609p774j1818K563O539L357k047p595o65J0041N76j1961K86J3365m80j3714
921f718j067J0108L346m019n129k330N645O358o855p567J0368P157j3633n854
935a0190J3852N561r419m383J649L871N939l807j1769O387J4011r979j3474J1529
$$ plain form
949 -222 10441 392 -6958 -1974 2640 3771 1438 -7534 -7475 7374 10484 -6166 -12350 2652 9127
964 9127 -2758 -6275 3869 5238 -3324 -5143 -1227 3640 7798 757 -10106 -2234 10148 1084
978 1084 -7717 3226 6834 -3371 -4269 -38 123 4501 3423 -8414 -5126 9423 2734 -11281
992 -11281 -3172 9563 3674 -6283 -4824 244 3499 2334 -2040 -1801 4024 4386 -6894 -8604 8293
1007 8293 14534 -4417 -12602 1096 5940 -547 1939 2206 -3826 817 2339 -8357 -2725 12983
1021 12983 3347 -12085 -3228 6074 -726 -3705 418 2197 2927 -794 -7344 -2207 7414 4313 -3611
1036 -3611 -2072 4371 2261 -6290 -4940 7895 9345 -2813 -6248 -2569 -629 4708 5056 -4341 -1834
1051 -1834 6598 -4909 -12877 5427 13272 -1756 -7819 -3040 -1478 3256 4499 -4620 -2911 7345
$$ packed form
949b22J0663j0049p350M984M614J131k333q972N9J4849L110j6650o184J5002O475
964I127j1885l517J0144J369q562j819L916M867M158p041j0863P872J2382r064
978A084q801J0943L608j0205q98M231J61M378j078j1837L288J4549o689j4015
992a1281Q109J2735n889r957J459N068L255j165m374K39N825L62j1280j710J6897
1007H293O241j8951q185J3698M844o487K486K67o032M643J522j0696N632J5708
1021A2983r636j5432Q857R302o800k979M123J779P30l721o550N137R621l101p924
1036c611J539O443k110q551J350J2835J450j2158l435L679J940N337L48r397K507
1051a834Q432j1507p968J8304P845j5028o063M779J562M734J243r119J709J0256
$$ plain form
1065 7345 1804 -10120 -2844 9463 5159 -5245 -2854 4424 338 -5261 886 4796 389 2796
1079 2796 33 -10832 -1641 13198 -862 -10509 7428 5867 -13402 -4895 8913 1722 1494 2669
1093 2669 -11903 -6289 14024 3411 -12293 3673 10872 -6930 -9094 5034 6209 809 -195
1106 -195 -2521 -3034 3393 4980 -4089 -6116 6797 8891 -8098 -10253 6229 5873 -5185 51 2929
1121 2929 -4351 118 1633 -7322 2475 13239 -5379 -13680 6007 8325 -5497 -818 4838 -893
1135 -893 -661 -461 -4013 3231 8770 -2173 -8279 23 6275 3430 -4827 -5755 4631 5962 -5185
1150 -5185 -5312 2977 2203 269 -809 -5231 1523 8601 -5837 -11125 8198 10557 -6944 -6113 3061
1165 3061 1152 2195 2676 -3546 -1086 5422 -1054 -5227 1977 6363 616 -5902 -3862 5276 4805
$$ packed form
1065G345n541j1924P276J2307m304j0404K391P278m086n599O147L910m407K407
1079B796k763j0865R191J4839j4060r647J7937j561j9269Q507J3808p191k28J175
1093B669j4572N614K0313j0613j5704J5966P199j7802k164J4128J175n400j004
1106a95k326n13O427J587r069k027J2913K094j6989k155J6482l56j1058N236K878
1121B929p280M469J515q955R797J0764j8618q301J9687K318j3822M679N656n731
1135h93K32K00l552P244N539j0943o106Q302O252k845q257r28J0386J331j1147
1150e185j27Q289p74j934j078m422O754P078j4438n288J9323K359j7501Q31R174
1165C061j909J043M81o222K460O508o476m173P204M386n747o518K040R138m71
$$ plain form
1180 4805 -5320 -3835 3795 1271 -2118 -1247 -2518 2331 5881 -6630 -7727 9766 6555 -9897
1194 -9897 -3615 5584 1301 1941 750 -7154 889 10352 -2666 -8149 5468 5637 -4893 -3217 1799
1209 1799 2839 2982 -3003 -6274 1439 6286 -423 -5658 -2457 4188 3855 -5550 -4228 7382 2164
1224 2164 -8403 -176 6223 -1088 -268 1483 -4963 1462 8692 -3740 -7587 6614 4939 -6128
1238 -6128 -1866 4054 1501 383 -3101 -4818 4758 6877 -5071 -7262 2196 5294 119 -4517 -2627
1253 -2627 4149 2452 -5009 -1625 3988 885 -1052 -1387 -2378 4257 5770 -5959 -5870 7575 4058
1268 4058 -4981 378 2194 -1513 1943 11 -5018 3364 5889 -7084 -6008 6823 3746 -4950
1282 -4950 -3168 1064 2128 807 -3243 -1576 3460 1102 -3564 -1742 2149 4103 964 -6520 -2320
$$ packed form
1180D805j0125J485P630k524l389Q71j271M849L550j2511j097J7493l211j6452
1194i897O282R199m283O40j191p904Q043R463j3018n483J3617J69j0530J676N016
1209A799J040J43n985l271P713M847o709n235L201O645l33r405J322J1610n218
1224B164j0567Q227O399p311Q20J751o446O425P230j2432l847J4201j675j1067
1238f128M262N920k553j118l484j717R576K119j1948k191R458L098n175m636J890
1253b627O776j697p461L384N613l103j937l35r91O635J513j1729Q9J3445l517
1268D058r039N359J816l707L456j932n029Q382K525j2973J076J2831l077q696
1282d950J782M232J064j321m050J667N036k358m666J822L891J954l139p484M200
$$ plain form
1297 -2320 7901 3640 -6022 -1901 2617 1709 1967 -1721 -4437 3936 4811 -7324 -3752 8066 1741
1312 1741 -6956 -1538 2412 1115 1268 -2364 -3873 2744 3445 -3185 -2576 2916 2639 -1679 -3559 1051
1328 1051 5620 252 -5178 -306 3732 1659 164 -2705 -2024 5014 2696 -7783 -1207 8799 -630
1343 -630 -8829 498 5150 199 -840 -3180 -3936 4747 5721 -5331 -5037 4896 3599 -3712 -2280 2538
1359 2538 2358 -759 -2095 -603 2564 2968 -636 -4930 -405 7023 1008 -7827 -216 7469 -2137
1374 -2137 -6285 2719 3594 -2146 -1105 -1241 -2270 4016 2655 -7121 -3371 6898 2406 -5295 -1012
1389 -1012 3285 1217 -1048 -1415 -439 3522 2719 -4167 -4680 4460 7041 -2686 -7603 1620 6447 -1180
1405 -1180 -3997 145 1126 71 370 -2613 -1648 4631 986 -7532 -1188 7434 387 -5958 634 2878
$$ packed form
1297b320J0221m261r662M121M518r08K58l688k716Q373Q75j2135L572J1818o325
1312A741q697N418L950j297J53l632j509O617P01o630O09N492k77m318j880M610
1328A051M569n368n430M872M038k073j495k869O81P038k318j0479O576J0006r429
1343f30q199R327M652m951j039k340p56Q683R74j1052K94R933j297p311J432M818
1359B538j80l117j336J492L167M04l604m294M525P428o015q835P611P685r606
1374b137m148R004Q75n740J041j36j029O286j361r776L750J0269m492p701M283
1389a012M297k068k265l67R76L961q03o886n13R140K581r727m917R223M827p627
1405a180k817M142R81j055K99k983R65O279l645q518O344Q622p047o345O592K244
$$ plain form
1421 2878 -606 160 115 -1647 1928 3509 -3640 -3444 5386 4623 -5223 -4715 4951 4633 -3604 -3816 1557
1438 1557 1909 339 -1122 -2651 -16 3572 -1157 -5633 1420 6266 -1347 -6303 -168 3892 2011
1453 2011 -787 -2894 -1530 3665 3247 -3419 -2491 4735 2757 -4937 -1850 5027 2135 -3077 -1893
1468 -1893 1167 1146 807 -1046 -2851 1108 3588 -2803 -4913 2774 4511 -3441 -4083 3187 3044 -1794
1484 -1794 -1982 -538 344 3534 2220 -4670 -2819 5985 2758 -5984 -703 6867 -525 -6375 397
1499 397 3127 1047 915 -2080 -5137 1916 5634 -3066 -5335 4122 3187 -4761 -2343 2704 673 -607
1515 -607 360 -1788 -864 3417 26 -4868 1536 6736 -1377 -6196 1709 4659 -1813 -2121 2281 785
1531 785 -713 372 -3456 -1790 6888 3082 -8331 -3034 5653 72 -3523 1580 1231 -1591 599
$$ packed form
1421B878l484P66m5j762L575J581p149J96Q830p63r846N08R666l18q237k12N373
1438A557L52j570j461j529K635L588m729m476P053M846p613m956O135M060j881
1453B011k798k107J364N195m18o666R28P226j978p694L087O877k892n212J184
1468a893L060k1l39j853j805L959K480o391k110P687J737p952o42P270j43m838
1484a794j88J444Q82L190j314o890J851Q804l227q742N281P570p392n850O772
1499C97K730k080j32k995l057P053L718q700k269R457r35p948K418N047k031j280
1515f07R67k148R24M281l391m894O404N200q113m819P905K950o472l08M402j496
1531G85j498J085l828J666Q678l806j1413N297Q687n581l595N103l49k822K190
$$ plain form
1546 599 -1898 -3576 4468 5472 -4926 -4899 4660 3325 -3136 -2094 2348 2692 614 -2060 -2447 683
1562 683 3777 556 -3134 672 3504 -2265 -4811 2117 4730 -1059 -2844 -994 -1224 1182 2475
1577 2475 -2355 -1110 4531 -674 -6584 164 6314 1567 -2802 -2365 -247 3364 1879 -3944 -710
1592 -710 5247 1017 -4503 -1136 2118 1865 135 -2545 -1343 3064 760 -4475 -1650 3611 2632 -1997
1608 -1997 -3905 -971 3199 1825 -2215 -882 2644 318 -3041 -1332 2777 4013 -724 -4086 -249
1623 -249 3193 463 -1911 -85 1652 1394 -1703 -3350 1721 4989 -1897 -4790 1491 2607 -730
1638 -730 -1000 -1934 -1123 4592 1685 -6791 -1675 6153 237 -4580 1071 2572 -200 -684 -1669 -341
1654 -341 4237 1796 -4970 -2084 3920 1983 -2418 -1008 999 1071 -762 -1717 -162 1584 736 -1757
$$ packed form
1546E99k497j678Q044J004j0398K7R559j335o461J042M442L44k078k674l87L130
1562F83L094l221l690L806K832n769k546O928K613n789j785J850k30K406J293
1577B475m830J245N641n205n910O748O150m747m369M37K118L611j485n823L234
1592g10N957m230n520L367L254k53j730k680J202M407k304n235K825N261r79m629
1608a997j908K934M170j374m040J333L526k326l359J709M109J236m737l362L837
1623b49L442k730k374J826J737k58l097j647N071L268o886k893O281J116l337
1638g30k70r34Q11N715k907q476N116P828n916m817N651J501k772m84r85J328
1654c41M578k441o766K886O004j937m401J410K007P2j833r55J555J746q48k493
$$ plain form
1670 -1757 -2952 1350 3741 -1655 -4656 2278 3945 -2350 -2039 2529 590 28 856 -2670 -218 5527
1686 5527 -428 -6865 1623 6665 -1390 -4130 786 1071 55 1456 -1491 -2213 2074 1674 -3446 -2390
1702 -2390 3324 2401 -3053 -3077 2209 2943 -1577 -2187 408 1025 1117 151 -2282 551 3940 -1525 -4189
1719 -4189 3212 4237 -2989 -2175 2057 285 7 1033 -2399 -1316 3696 184 -4563 363 4070
1734 4070 -1031 -4097 -343 2483 1496 -1932 -2641 425 2737 1346 -2337 -2563 2082 3650 -2000 -3571
1750 -3571 3422 2856 -3057 -1347 2351 666 -175 397 -2500 -212 4107 -70 -4630 863 3420 -1705
1766 -1705 -2683 912 1491 -82 -1376 -1807 802 2835 -660 -2932 -528 3204 1673 -2862 -1611 3546
1782 3546 1827 -3290 -1291 3171 1099 -1144 -1044 -1408 1058 3792 -1463 -5237 1525 4582 -1537
$$ packed form
1670a757j195M302K391n396l001O934J667o295L11M568j939n62Q28l526K452N745
1686E527n955o437Q488N042q055k740M916K85j016J401k947p22M287m00n120J056
1702b390N714r23n454k4N286P34m520o10K595O17R2r66k433K833L389n465k664
1719d189P401J025p226Q14M232j772k78J026l432J083N012l512m747M926L707
1734D070n101l066L754K826r87l428p09L066K312j391l683k26M645J568n650j571
1750c571O993n66n913J710L698j685q41N72k897K288M319m177m560N493K557n125
1766a705r78L595N79j573j294m31K609K033l495k272K404L732j531m535J251N157
1782C546j719n117J999M462k072k243J00l64K466K734n255l774O762L057o119
$$ plain form
1797 -1537 -3752 665 1565 -354 -817 -1099 275 2212 -405 -3205 59 3770 592 -3406 -544 3558
1813 3558 942 -2504 -264 1855 136 -407 -339 -862 1326 2520 -2760 -3769 3399 3458 -3598 -2496
1829 -2496 2070 851 -1042 -370 -1362 162 2722 -1098 -4073 2060 4418 -1811 -4207 1010 3810
1844 3810 481 -2297 -924 846 1406 531 -1015 -1305 1598 1837 -2160 -2651 2864 2451 -2992 -2395 1889
1861 1889 1487 -833 -1209 -1151 682 1882 -1376 -2522 2174 2786 -2270 -2534 1975 2694 -595 -1883 -561
1878 -561 1604 2121 -572 -2218 478 2766 363 -2695 -442 2951 697 -3353 -1090 2173 1658 -1055
1894 -1055 -2077 -1355 1764 2593 -2184 -3091 2110 2559 -2510 -1881 2119 1254 -1237 -616 104 770 1042
1911 1042 -496 -1847 625 2584 -277 -2456 232 2212 121 -2184 -81 1953 830 -1698 -1713
$$ packed form
1797a537k215M417R00j919m63k82J374J937k617k800L264L711l178l998K862M102
1813C558k616l446K240K119j719n43O8n23K188J194n280j009P168N9p056J102
1829b496M566j219j893O72r92J524K560l820k975O133K358o229k396N217K800
1844C810l329k778J373J770N60q75j546k90K903K39l997m91N515m13n443N97M284
1861A889m02k320l76N8J833J200l258j146M696O12n056k64M509P19l289j288J322
1878e61K165N17k693j646K696K288k403l058K253L393k254m050K263L263n15k713
1894a055j022P22L119Q29m777r07N201M49n069O29M000q65k491O21P20O66K72
1911A042j538j351K472J959k861k179K688J980k091k305K103K034j123k528j5
$$ plain form
1926 -1713 598 2383 137 -3051 -1197 2683 983 -2463 -1174 1645 795 -869 -895 219 1705 572
1942 572 -2206 -1571 2360 2588 -1315 -2526 846 2206 102 -1313 -821 868 1114 -782 -1843 608
1958 608 1948 -737 -2737 88 2338 -373 -2449 -230 1969 449 -1369 -560 638 1046 322 -1616
1974 -1616 -449 2556 947 -2493 -1607 2239 2024 -946 -1858 -465 1512 1509 -1332 -1757 1322 1981 -2443
1991 -2443 -2761 1703 2681 -1328 -2612 -47 1194 859 -462 -1654 138 2355 247 -2534 -12 2607
2007 2607 411 -1721 -106 1634 324 -698 -791 155 1974 1024 -2514 -1662 2380 1145 -2579 -1108
2023 -1108 2584 667 -2614 -1506 800 1787 749 -1911 -2881 1189 2801 -1060 -2395 1367 2170 -1362
2039 -1362 -1608 639 1440 956 -364 -1751 -283 2586 327 -3112 -294 3114 426 -2870 -1116 1544
$$ packed form
1926a713K311J785k246l188J854L880j700l446J289K819q50j664k6J114J486j133
1942E72k778O35L931K28l903j211L372J360k104j415M92J689K46j896j061K451
1958F08J340k685k000K825K250k711k076K219K199j520j818Q09J198M08p24j938
1974a616J167L005j609l440Q86L846k15k970r12J393J977lk841m25L079O59m424
1991b443l18M464R78m009j284K565J241l35j321j192J792K217k108k781K522K619
2007B607k196k132J615J740j310j022r3R46J819r50l538Q52M042j235l724J471
2023a108L692j917l281J108K306R87j038k660r70M070J612l861j335L762Q03l532
2039a362k46K247Q01m84j320j387J468K869k259l439K818L408k688l296J754K660
$$ plain form
2055 1544 1120 -787 -801 101 604 -338 -1532 -516 2010 1385 -1775 -1764 1110 1620 -446 -800 516 1214
2073 1214 26 -1334 -998 2072 2242 -1438 -3183 485 2588 28 -2367 -520 2222 893 -1682
2088 -1682 -1544 554 1603 167 -1276 -982 1533 932 -2274 -1350 2481 2039 -1643 -1698 874 947 671
2105 671 217 -761 1 1766 -518 -2168 1246 3083 -927 -2959 343 1983 -262 -1365 232 714
2121 714 118 -764 -1188 -153 1917 707 -2688 -1065 2965 1104 -2240 -997 1643 1083 3 -1114
2137 -1114 -1278 1207 2611 -970 -2612 1508 2325 -1499 -1745 1571 1173 -555 -853 -675 415 1352 54
2154 54 -2486 -400 2062 -12 -2256 630 2151 -502 -2045 187 1117 299 88 -624 -995 1409 1685
2171 1685 -1869 -1467 2944 1364 -3054 -827 2093 524 -1145 -864 -539 1016 1442 -1677 -2488 1384
$$ packed form
2055A544m24j907j4R02N03r42j194J016K526o25l160J1K874N10k066l54J316O98
2073A214j188j360L36L070J70l680j745L668K103k560k395J847K742j329k575
2088a682J38K098J049j436j443K94K515o01l206R24L831m42l682n5K572P3k76
2105F71m54r78P62J765k284j650L414J837m010k032L302J640k245j103J597M82
2121G14n96q82m24J035K070j210l395J623M030j861l344J243K640n60j080j117
2137a114j64K485J404l581j642M120Q17l824k46L316l98j728k98J78J090R37j298
2154E4k540K086K462k074k244K886J521k653j543K232R30q18k11p12l71K404K76
2171A685l554M02M411j580m418K227K920j569j669K81L25J555M26l119q11L872
$$ plain form
2187 1384 2517 -1089 -2324 188 1395 -243 -705 -157 614 641 -146 -1261 6 2250 864 -2409
2203 -2409 -519 2288 648 -1569 -31 1333 -18 -734 -449 47 1300 886 -2239 -1181 2197 997
2219 997 -2026 -1225 1320 680 -527 -879 -351 1431 887 -1268 -1306 1664 1811 -932 -1701 346 2418
2236 2418 885 -2097 -1009 1566 1112 -931 -1029 155 1039 122 -1732 -551 1348 319 -1712 -1033
2252 -1033 1083 553 -476 -1000 -348 1136 561 -1260 -551 1557 963 -975 -1341 590 1772 -61 -2085
2269 -2085 0 2341 366 -1689 -687 923 913 -431 -1427 -334 1732 460 -2261 -728 1617 798
2285 798 -1552 -1485 -71 2028 851 -1910 -1200 1504 1181 -1345 -788 1046 1442 -248 -919 30 1650
2302 1650 786 -1445 -948 1385 1115 -810 -1275 555 1322 -589 -1666 302 1298 -333 -1125 -360 140
$$ packed form
2187A384J133l606j235K512J207j638m62N48P71K7p87j115J267K244j386l273
2203b409J890K807j640k217J538J364j351p16K85M96J253m14l125J058L378j200
2219I97l023Q01K545o40j207l52N28J782n44k155l8K970J47k743p69K047K072
2236B418j533k982J088K575m54k043r8J184Q84r17j854J181J899j029k031O79
2252a033K116n30j029n24O52J484n75j821P09K108n94j938l66J931J182j833k024
2269b085K085K341j975k055J002J610j0j344r96J093K066j272k721J533K345q19
2285G98k350O7J414K099j177k761P10K704l23k526N57J834L96j690o71R49J620
2302A650q64k231M97K333k70j925m65J830P67j911j077J968R96j631p92P65N00
$$ plain form
2319 140 1325 126 -2091 -645 2191 850 -1829 -419 1466 904 -796 -1188 591 2042 -45 -2205
2335 -2205 -301 2147 718 -1749 -1051 598 1230 -262 -1072 -556 863 635 -885 -964 238 1009 -729
2352 -729 -1567 352 1571 -165 -1689 260 1268 249 -271 -156 355 1280 129 -1996 46 2366
2368 2366 -56 -2052 -360 1798 340 -979 -772 162 1056 327 -996 -688 890 860 -1026 -1492 889
2385 889 1725 -813 -1847 251 1614 580 -838 -883 259 1901 43 -1818 346 1761 -345 -1540
2401 -1540 596 861 -221 -514 -435 -110 576 116 -1236 -215 1452 314 -1573 -462 1462 468 -1318
2418 -1318 -992 934 1323 -201 -1110 -757 1124 1425 -817 -1855 865 1953 -533 -1609 712 1348
2434 1348 -663 -1243 -86 677 770 -257 -1293 -432 1326 291 -1642 -493 907 747 -996 -720 566
$$ packed form
2319A40J185j199k217J446K836j341k679J410J885n62j700l92J779J451k087k160
2335b205J904K448j429k467O98J649O32j492q10N16J419k28j520p9J202P71j738
2352g29q38J919J219j736j524J949J008j019n20J15N11R25j151k125K042K320
2368B366k422j996J692K158j458j319K07R34Q94p29j323L08J578l0j886m66K381
2385H89Q36k538j034K098J363j034j418m5J142J642j858j861K164J415k106j195
2401a540K136K65j082k93P9L25O86m60j352J021J667j138j887J111J924r94j786
2418a318L26J926L89j524r09L53J881L01k242j038K720J088k486j076K321O36
2434A348k011n80J157P63R3j027j036Q61J758j035j933J149J400j60j743K76J286
$$ plain form
2451 566 791 -488 -732 53 1036 732 -905 -1171 1293 1496 -1230 -1391 1415 1117 -1111 -818 507 705
2469 705 245 -623 -1316 185 1906 -216 -2261 -127 1948 107 -1351 -451 741 541 -436 -1059 -171
2486 -171 1210 602 -1187 -921 1793 982 -1489 -871 1198 983 -599 -302 -232 302 905 -393 -1363 403
2504 403 1328 -882 -1546 1341 1218 -820 -1046 -71 311 470 27 -859 93 1674 -1 -2195 354 2342
2522 2342 424 -1947 -503 1483 627 -299 -647 -183 908 670 -1187 -1108 945 1324 -814 -1180 656
2539 656 941 -384 -992 -168 887 669 -960 -1186 739 1229 -365 -909 658 910 -310 -973 -36 916
2557 916 703 -465 -1140 139 1252 -51 -959 -99 1188 357 -1398 -598 985 940 -300 -1299 22
2574 22 1331 64 -1385 -650 1028 1157 -586 -1125 163 1205 216 -979 -70 1374 255 -812 97
$$ packed form
2451E66K25j279k44P85R83l04j637k66K464K03k726j61K806k98k228K93J325J98
2469G05m60q68o93J501J721k122k045K134K075j841j458R00J192k00r77o23Q88
2486a71J381o08j789K66K714q11k471O18K069k15j582K97P0N34O03j298r70J766
2504D03R25k210o64K887j23k038k26R75L82J59m43q86R52J581j675k194K549J988
2522B342j918k371J444J986q56r26l48M64J091k38j857P9K053L79k138l66J836
2539F56K85j325o08Q24J055k18j629k26J925M90j594n44J567K52j220o63R37R52
2557I16k13j168o75J279J113j303r08Q60J287q31j755Q00J583m5j240r99J321
2574B2J309j267j449P35J678J29j743n39J288J042r89j195R09J444j119j067R09
$$ plain form
2591 97 637 794 112 -735 -239 916 787 -805 -872 944 812 -1059 -1141 788 889 -651 -1083 164 882
2610 882 528 -958 -873 542 1025 -588 -901 810 1166 -241 -860 -117 515 845 -674 -1401 222 1581
2628 1581 52 -1510 49 995 257 -742 -614 232 638 117 -1243 -421 1077 188 -1185 -439 1053
2645 1053 694 -931 -476 338 488 -71 -477 -433 785 566 -328 -743 1123 1139 -817 -1050 731 1074 -39
2664 -39 -351 -578 501 1088 -660 -1832 768 1250 -432 -1168 356 1032 -200 -558 -735 238 1355 -129
2682 -129 -1575 -183 1552 252 -758 46 716 380 -435 -357 191 784 450 -741 -490 643 923 -1245
2700 -1245 -593 954 424 -984 -853 426 328 165 -727 -743 289 920 -528 -1122 450 1136 -474 -749
2718 -749 220 675 376 -616 -875 469 979 -78 -1090 8 1212 537 -1284 -1262 785 1222 -729 -970
$$ packed form
2591I7N40J57o82q47M96J155j29j592o7J816j32j871q2J929J01j540m32J247P18
2610H82l54j486Q5J415M83j613l13J711L56j407o19P43O32L30j519p27J623J359
2628A581j529j562J559R46p38r99J28Q46M06n21j360Q22J498q89j373P46J492
2645A053l59j625M55Q14J50n59m06M4J218k19q94m15J866J6j956k33J781L43j113
2664c9l12k27J079N87j748j172K600M82j682p36J524O76j232l58j77R73J117j484
2682a29j446J392J735j300j010Q04O70l36q15P8N48N93l34j191K51J133K80k168
2700a245O52J547n30j408J31J279r8j63q92j6J032O31j448n94J572O86j610k75
2718g49R69M55k99r92k59J344N10j057j012J098J204o75j821K2K047M37j951k41
$$ plain form
2736 -970 -134 532 83 -612 -91 390 331 -662 -712 328 1041 -229 -904 81 823 136 -416 -357 778 421
2756 421 -282 -614 56 853 70 -1244 -329 1201 461 -1070 -721 698 413 -98 -630 -488 381 578 -695
2775 -695 -807 870 750 -970 -1162 761 1021 166 -549 -103 316 780 60 -576 26 1075 74 -1156
2793 -1156 -113 1103 219 -1117 53 855 274 -500 -350 -291 398 381 -692 -435 1201 590 -1091 -308
2811 -308 981 791 -615 -574 -203 762 660 -393 -1077 692 1248 -461 -1069 437 1049 -319 -775 -16
2829 -16 718 356 -407 -872 -13 764 102 -1011 -419 939 200 -1043 -297 1038 -54 -214 61 -50 452
2848 452 231 -500 -469 663 631 -724 -759 660 651 -369 -800 275 922 -260 -799 -612 375 775 -303
2867 -303 -1166 -169 1270 -7 -1046 -211 884 43 -371 254 457 806 108 -825 -290 1047 973 -862
$$ packed form
2736i70Q36O66m49o95N21M81n9r93n0J040P13j270o75R85P42o87n52N9J135l57
2756D21p03l32O70P97p83j314R15J530p40j531L49J419k85n11n32J42Q69J97j273
2775f95j12J677j20j720j92J923K60q55p15M46M19M64p20o36O02J049j001j230
2793a156J043J216q84j336J170Q02n81p74J50N9O89j7j073K57J636o11j681P83
2811c08J289j90j406M1L71R65j02j053o84J769N56j709o08J506O12j368m56P59
2829a6P34l62p63m65Q59P77o62j113N92J358p39j243P46J335j092j60K75j11N02
2848D52k21p31L1J132l2j355l5J419rj020m31J075O47j182n39J87R87M00j078
2867c03q63R97J439j277j039Q35J095q41m14O25K03L49o98r33N35J337p4j835
$$ plain form
2885 -862 -533 776 499 -377 -397 110 607 -123 -595 -378 556 105 -528 -690 160 910 -230 -950 147
2904 147 904 -74 -514 -98 427 452 -197 -672 291 1201 176 -1183 -293 1060 307 -857 -782 383 449
2923 449 -198 -872 -123 765 218 -692 -808 237 540 -731 -1090 336 794 -22 -483 24 210 601 -147
2942 -147 -550 232 817 67 -1172 80 997 -88 -760 -298 596 417 -193 -412 -25 706 -197 -898 63
2961 63 791 39 -962 -617 268 448 -345 -994 -203 931 457 -736 -683 441 931 -192 -535 234 686
2980 686 52 -328 -331 520 497 -420 -816 411 823 -229 -682 -40 372 44 -612 -392 273 199 -122 -683 59
3001 59 768 309 -511 -163 727 583 -417 -403 372 799 37 -772 -133 915 595 -1094 -551 664 760 -112
3021 -112 -870 328 388 158 -483 -525 102 697 -198 -945 8 680 -12 -638 -105 649 373 -617 -308 32
$$ packed form
2885h62L29J309k77q76k0N07M97p30m72K17R34m51o33j62Q50P50j140p20J097
2904A47P57r78m40M16N25K5o49m75R63R10j025j359Q90J353p53j164P5J165O6
2923D49o47o74P49Q88n47r10j16J045L03j271l59J426M58q16m61N07J86L91p48
2942a47m03P82N85p50j239J252R17j085o72M62Q94j79o10k19L87P31r03p01R61
2961F3P28p52j001L45Q85J80p93o49P91J134m74j193N3J124M90j123l43P69M52
2980F86o34l80lQ51k3r17l96J227M12j052m53O42M12l28o56K20O65p4l21n61P42
3001E9P09m59q20L48Q90j44j000J4P75M27p62q09O39J048l20j689N43J215R6q72
3021a12p58J198O0k30o41m2O27N95q95p47R53O72o92o26N33P54k76r90L09L40
$$ plain form
3041 32 358 139 -330 -10 648 139 -634 -253 635 492 -287 -260 364 380 -408 -290 -22 195 356 -421 -230
3062 -230 263 594 -71 -965 73 559 163 -670 -473 637 445 -272 -457 20 535 419 -529 -424 620
3081 620 248 -735 -469 459 54 -460 -177 6 468 130 -438 -556 209 533 -539 -605 467 667 -625
3100 -625 -374 136 527 261 -458 -466 191 701 -14 -598 383 780 -118 -611 357 653 -204 -510 -180 79 219
3121 219 222 -635 -577 800 511 -833 -381 336 556 -171 -287 70 362 429 -125 -465 302 776 -305 -888
3141 -888 292 883 -79 -537 270 312 -51 -434 -125 229 507 -214 -1179 -28 1066 118 -832 -332 496
3160 496 125 -396 -491 22 353 58 -534 20 765 440 -846 -214 707 723 -405 -420 87 532 251 -468
3180 -468 -473 -30 322 -180 -220 -54 882 -113 -915 -76 536 65 -278 -103 212 131 -66 -492 -1 583 276
$$ packed form
3041C2L26k19m69L20O58n09p73L81Q88j43p79K7O24J6p88J18K68K17J61p77J91
3062b30M93L31o65q94J038M86l96q33J97J110j92p17j85M77N15j16r48J05J044
3081F20l72r83K66R28m05n14K83J83M62l38n68j18P65L24j072o6J072K00j292
3100f25K51N10L91k66p19qO57N10p15n84R81L97q98m93R68K96q57l06L30K59J40
3121B19Lq57N8J377k89j344M52P17K20p27j16L57K92O7n54l40P67M74j081n83
3141h88J180N91r62m58Q07M2l63l83L09L54K78p21r65J151J094r48r50N00Q28
3160D96l71n21r5N13L31k95n92N54P45l25j286O32R21J6j128j5N07M45k81p19
3180d68nM43L52n02m0J66R36r95q02Q39O12m71l43J75L15q1j97m26M91N84l07
$$ plain form
3201 276 -771 -306 852 717 -171 -302 230 579 121 -504 -93 347 658 -404 -549 164 823 -32 -818
3220 -818 64 692 204 -515 -334 225 624 -256 -367 -112 811 290 -548 -266 346 324 -527 -384 349 533
3240 533 22 -384 48 315 322 -247 -254 475 407 -520 -473 213 787 -211 -615 149 361 468 -276 -411 245 803
3262 803 103 -581 134 637 279 -478 -25 438 50 -34 -313 -40 528 202 -427 -723 395 370 -279 -454
3282 -454 111 522 49 -272 -83 332 275 -237 -373 375 315 -419 -482 391 557 -164 -370 -57 509 14 -254
3303 -254 -154 333 347 -105 -807 -37 732 156 -378 -419 160 437 -297 -360 -135 526 -16 -502 -123 579 474
3324 474 -385 -559 430 316 -232 -529 37 242 206 -381 -234 293 298 -51 -167 168 58 181 -298 -92 406
3345 406 312 -279 -157 130 480 -187 -529 203 687 -16 -623 -119 364 463 -204 -312 32 554 38 -302 41
$$ packed form
3201B76j047M65J158j35q88j31N32L49m58o25M11M40L11j062j45P13O59q55p86
3220h18Q82O28m88p19J81N59L99q80j11K55R23n21q38K82O12k2q51J43P33J84
3240E33n11m06M32K67Pn69pP29o8r27M7O86N74r98m04P64K12J07p44j35O56N58
3262H03p00o84P15N03l58p57M53M63l88q4k79K73N68l26o29k96J118k5o49j75
3282d54N65M11m73l21J89M15n7n12j36P48o0p34o3Q73J66p21k06L13N66m95k68
3303b54J00M87J4m52p02P70P69n76n34m1N79K77p34o3K25O61n42m86L79P02j05
3324D74q59j74R89j14n48k97N66K05l6n87J47N27Nl49j16L35j10J23m79K06M98
3345D06r4n91J22K87L50o67l42P32M84p03o07N04M83R9o67j08L44N22n16l40L43
$$ plain form
3366 41 550 320 -514 -327 249 118 -135 -202 -28 436 35 -528 -409 562 297 -315 -499 22 309 -173 -415
3387 -415 -132 277 136 -224 -246 311 141 -44 -264 136 632 -38 -643 108 377 177 -468 -489 61 545 91
3408 91 -423 -570 555 432 -641 -887 413 431 -410 -468 50 315 312 -430 -254 412 436 -144 -481 152 509
3429 509 -173 -357 128 356 296 -162 -111 -12 447 -103 -438 -221 587 105 -488 -70 588 198 -80 -521 125
3450 125 296 -43 -316 -282 250 352 -383 -487 176 667 -116 -722 13 385 376 -232 -226 34 324 199 -147 -160
3472 -160 303 88 -327 -178 355 532 -402 -184 166 251 -78 -89 -108 134 138 -447 -222 375 297 -186 -380 74
3494 74 307 34 -366 -89 181 620 -157 -213 111 222 -14 -409 213 488 -57 -175 -36 275 384 -154 -202
3515 -202 -72 491 121 -271 -209 287 311 -96 -211 441 495 34 -75 -224 120 7 -292 -41 296 251 -62
$$ packed form
3366D1N09k30q34J87N76j31k53o7J74M64m01n63J19R71k65o12j84N21K87m82k42
3387d15K83M09j41l60k2N57j70j85k20M00M96o70o05P51K69k00o45k1N50M84m54
3408I1n14j47J125j23j073k46J300J8q41n8N18K65lp42J76O66K4n80l37O33L57
3429E09o82j84M85K28o0m58N1R9M59n50l35K17Q08m82n93M18O58l90k78m41O46
3450A25J71l39k73L4N32J02p35j04O63M91p83o06P35L72ro08OK60K90j25l46j3
3472a60M63k15m15J49N33J77r34K18L50Q5l29j1j9K42Mn85K25N97p8m83j94M54
3494G4K33k73m00K77K70M39p77n6L24J11k36l95O22K75n45j18J39L11J09n38m8
3515b02J30N63l70l92O2M96K4m07j15O52N4m61j09j49L44j13k99K51L37m5l13
$$ plain form
3536 -62 -306 49 236 -51 -240 -36 229 32 -292 -308 171 270 -142 -271 32 695 95 -416 -234 273 552
3557 552 -150 -157 74 181 28 -222 -186 294 369 -384 -760 429 458 -196 -278 47 331 -109 -235 -131 -66 237
3579 237 -69 -336 37 386 111 -420 62 604 64 117 -337 96 134 99 -240 135 328 460 -627 -336 324
3600 324 240 -138 -81 66 336 -64 -217 -482 320 107 -355 -328 89 164 -69 -438 -84 208 56 -312 -317 297
3622 297 280 182 -301 -19 290 -43 -280 -321 302 220 -281 -340 249 123 -250 -378 -50 238 -91 -460 204 277
3644 277 266 -240 -284 205 459 348 -267 -241 388 194 59 -446 44 501 -36 -353 30 165 323 -273 -192
3665 -192 136 131 -167 -583 136 151 -137 -213 -84 78 127 -137 -436 -74 259 -34 -177 280 -101 461 -97 -129
3687 -129 226 331 7 -106 14 440 205 -501 3 281 182 -337 -156 6 126 -256 -276 -208 118 103 -167
$$ packed form
3536f2k44L55J87k87j89K04K65j97l24j6M79R9m12j29L03O63o00n11J82N07K79
3557E52p02pK31J07j53k50L6M80P5p53l76J189K9o54q2L25K84m40j26J04O5L03
3579B37l06k67L73L49k75n31M82N42n40N3m54M33L8l5l39L75J93J32j087K91O60
3600C24q4l78N7J47K70m00j53k65Q02k13m62K7M17P5k33l69L54K92j52l68nO14
3622B97j7r8m83K82L09l33k37m1O23q2n01n9N89j26l73j28L28K88l29l69O64P3
3644B77j1n06m4M89K54j11o15K6O29j94j35n05M90M57n37l17L83J35J58n96Q1
3665a92L28nk98m16P19J5k88p6J29J62M9k64k99L62L33k93j43M57l81N62n58l2
3687a29L55J05l24j13J20M26k35p06N04K78r9n19J81J62J20l82k0O8L26j5k70
$$ plain form
3708 -167 -415 52 360 -78 -266 28 576 91 -256 -78 283 361 -221 -399 -145 385 151 -136 -156 404 227
3729 227 -145 -329 163 330 23 -342 65 104 -266 -123 -62 256 40 -114 -292 324 26 128 -356 59 282
3750 282 -88 -106 -35 40 380 36 -503 103 439 290 -533 -62 217 405 -362 -29 116 154 -42 -317 -306 335
3772 335 297 -123 -112 -11 411 30 -203 -67 412 125 -174 -166 -66 -6 31 -114 -119 367 -157 -526 10 321 78
3795 78 -543 -25 169 79 43 -262 -30 138 -241 -217 -137 339 460 -372 -144 301 253 -249 -227 -193 86 162 -360
3818 -360 -319 278 291 46 -153 195 281 -173 -225 39 4 10 -339 -165 139 220 32 -273 47 626 210 -356 -209
3841 -209 119 222 -271 -287 -127 361 114 -288 -89 296 287 -251 -338 186 447 5 -327 37 271 238 -56 -358
3863 -358 -129 45 14 -311 -210 70 78 -317 -86 -20 331 -231 -327 75 377 44 -547 -275 186 361 -415 -132
$$ packed form
3708a67k48M67L08m38j88K94N48m85l47J78L61P8n82j78K54N30k34k87k0N60j77
3729B27l72j84M92J67l07l65M07L9l70J43O1L18k16j54j78O16k98J02m84M15K23
3750B82l70j8P1P5L40l44n39O06L36j49q23M71K79J88p67L33J45L8j96k75J1O41
3772C35l8m20J1J01M22l81k33J36M79k87k99QJ00O0L7j45nM86n24l69N36L11k43
3795G8o21N18J94r0l6l05K32J68l79K4Q0M76J21q32K28M45m8n02K2L4K79P6n22
3818c60M1N97J3k45j99L48Q6m54n2K64l5Ol49J74L04Q1j88l05L20N79m16n66J47
3841b09L28J03m93j6J60M88k47m02J99L85rn38q7N24K61m42l32L64K34l3k94l02
3863c58K29J74l1l25J01K80Ql95K31O6L51n62r6M02L02l33n91K72M61J75p76K83
$$ plain form
3885 -132 186 248 -257 -452 191 325 93 -87 -39 100 245 -85 -240 -49 251 -112 -494 -208 340 189 -353
3906 -353 -359 -83 109 -262 -456 -106 313 108 -265 17 290 131 17 -198 -45 237 -86 -305 -78 329 244
3927 244 91 -177 399 339 143 -258 282 248 -105 -145 -203 38 142 -352 -247 76 275 148 -75 -105 198 205
3949 205 -305 43 164 242 -84 -283 -29 359 282 -271 -76 170 179 -375 -227 -38 366 114 -173 -193 193 362
3971 362 -119 -189 -54 257 -60 15 145 494 -40 -221 -227 279 114 -44 -412 340 367 50 -140 -77 111 -102
3993 -102 -62 -440 210 178 -130 -283 346 428 153 -343 219 156 375 -142 -428 36 305 -34 -244 -47 459
4014 459 250 -366 -206 -44 78 -169 66 -45 253 168 -201 -303 -49 175 -176 -466 -24 350 -267 -448
4034 -448 -239 406 -95 -155 -33 342 -65 -179 -67 -48 284 217 -230 -36 254 99 -124 -407 -25 147 19
$$ packed form
3885a32L18O2n05j95O43J34k32j80M8J39J45l30j55J91L00l63l82K86N48j51n42
3906c53oK76J92l71j94L50M19k05l73K82K73j59j14k15J53K82l23k19K27M07q5
3927B44j53k68N76o0j96m01N40l4l53m0n8K41J04m94J05L23J99j27k23l0L03P
3949B05n10L48J21P8l26j99K54L88p7n53J95K46Rn54J48J89M04k52k87k0L86J69
3971C62m81p0J35L11l17P5J30L49n34j81oN06j65j58l68P52K7l17j90O3J88k13
3993a02M0l78O50l2l08j53O29Q2k75m96N62o3K19n17k86M64K69l39k10J97N06
4014D59k09o16J60J62J22k47K35j11K98q5l69j02K54K24l51k90M42L74o17j81
4034d48K09O45n01o0J22L75m07j14J12J9L32o7m47J94K90j55k23k83L82J72j28
$$ plain form
4055 19 -229 -152 66 284 -9 -266 -31 340 -93 -147 -73 307 326 129 -246 75 139 -237 -155 -56 376 192 -83
4078 -83 -68 114 16 -70 42 132 -26 64 -257 -197 145 138 -169 -153 231 143 -251 -397 135 323 -132 -234 -117 36
4102 36 25 -248 -304 126 277 -5 -222 33 233 83 -154 -197 349 172 -59 -343 5 39 137 -356 -207 74
4124 74 -33 -126 -78 60 146 204 -78 96 17 -87 53 -259 376 204 -61 -286 144 221 -7 -243 -39 261
4146 261 47 -138 -181 -5 298 -58 -363 -56 355 50 -318 -223 68 33 -174 -274 -17 199 -45 -338 -138
4167 -138 149 191 -250 44 35 252 -80 124 -96 236 120 -49 -40 -99 282 0 -308 1 234 -77 -300 -36
4189 -36 223 210 -185 -82 80 63 -220 -389 63 280 147 -407 -25 -25 113 -93 -31 -68 -21 299 -376 -116 303
4212 303 129 -22 -51 280 92 -176 -46 -21 50 75 -309 -229 81 -63 -116 -286 210 287 -57 -242 251 417
$$ packed form
4055A9k48P7K18K18k93k57K35L71m33n4P4L80J9j97l75L21O4l76Q2R9M32j84k75
4078h3J5J82r8q6J12R0j58R0l21O0L42pl07J6L84q8l94j46N32J88m55j02J17J53
4102C6j1k73n6M30J51k82k17K55K00j50k37m3N46j77k31k84L48L4R8m93J49K81
4124G4j07r3M8J38Q6N8k82J74p9j04J40l12O35j72k65k25M30P7k28k36K04L00
4146B61k14j85m3J76L03l56l05L07M11l05l68R5K91l5k07j00K57K16k44k93K00
4167a38K87M2m41K94rK17l32K04k20L32j16j69Rn9L81k82l08L09K33l11k23K64
4189c6K59j3l95J03J62j7k83j69M52K17j33n54L82%J38k06O2l7M7L20o75K60M19
4212C03j74j51k9L31j88k68J30K5P1K5l84Q0L10j44n3j70M96P7l44j85M93J66
$$ plain form
4234 417 -65 -206 -92 62 317 -50 -448 -92 402 140 -175 -107 354 232 -212 -439 155 313 21 -238
4254 -238 -66 230 54 263 -224 173 153 -163 -484 -177 430 38 -223 -295 182 93 -63 -150 -136 39 -158 -307
4276 -307 -146 386 333 -230 126 207 -7 -108 -43 -186 -16 198 -308 -369 226 143 -96 -405 -84 544 -17 -277
4298 -277 -218 268 152 -34 2 18 66 49 -237 -60 227 -53 -222 -273 160 150 -180 -236 180 211 12 -90 -14
4321 -14 52 -202 -383 -291 220 107 -24 -191 -19 153 36 -156 -43 451 178 -101 -142 175 302 -136 -282
4342 -282 -1 247 172 -177 -328 165 230 194 -316 -52 124 -15 -195 -77 37 -2 32 -99 131 224 42 -26
4364 -26 -55 -25 194 -30 -169 1 242 -47 -96 -80 269 -16 -90 -239 -55 281 -210 -57 -74 -212 15 -325
4386 -325 -409 126 503 -219 -199 465 306 -111 -312 20 83 -94 -347 -75 22 54 -45 -201 -56 190 -54 -503
$$ packed form
4234D17m82j41J14J54K55l67l98L56M94k62l15O8M61j22m44k27N94J58k92k59
4254b38J72K96j76K09m87L97k0l16l21L07O07l92k61p2M77q9j56q7J4J75j97j49
4276c07J61N32n3n63L56Q1k14j01O5j43J70K14n06o1N95q3k39l09L21O28n61k60
4298b77N9M86j16j86L6J6M8j7k86J77K87k80j69n1M33j0l30n6M16L1j99j02P6
4321a4O6k54j81R2N11j13j31j67J72J72j17j92J13M94k73k79m1L17J27m38j46
4342b82K81K48p5l49j51M93O5l6n10K64J76j39j80J18J14l9L4j31K30R3j82o8
4364b6k9L0K19k24j39J70K41k89m9J6L49k85p4j49J84L36m91J53j7j38K27l40
4386c25q4N35L77p22K0O64j59m17k01L32O3j77k53K72R7L2r9j56J45K46k44m49
$$ plain form
4408 -503 -195 -39 38 -201 -130 137 42 -45 78 -171 187 123 -112 -62 22 387 182 101 -131 142 -140 -134 31
4431 31 366 61 -57 101 518 507 -30 -28 212 275 -79 -214 -157 66 422 -191 -217 65 -11 87 -213 -127 241
4454 241 307 -127 -278 -278 186 -19 -29 15 205 195 -131 1 148 152 68 -153 267 137 -171 -358 29 453 -82
4477 -82 -412 -284 61 217 -97 -215 42 308 -18 -212 -142 467 285 -176 -156 167 -29 -47 -163 -123 309 134
4499 134 -135 -296 -15 349 -71 -288 187 148 36 -196 -163 6 333 -4 -146 107 273 -9 -410 67 409
4520 409 -108 -17 -135 154 159 32 -72 -129 134 -169 -216 -168 316 224 -89 -314 173 146 33 -18 98 60 185
4543 185 -255 -194 3 392 -51 -264 -40 342 87 -330 -100 73 166 -14 -351 -159 147 102 -26 -210 256
4564 256 21 -164 -180 53 212 -152 -192 140 -17 10 -188 -195 -66 145 -96 -359 17 43 121 -351 -157 410
$$ packed form
4408e03L08J56P7k39P1K67r5q7J23k49L58o4k35N0Q4L65k05q1k32K73k82OJ65
4431C1L35l05j18J58M17j1n37KK40O3l54j35N7K23L56o13k6K82p6R8l00Q6L68
4454B41O6m34j51%M64k05j0M4J90j0l26J32J47Mq4k21M20j30l08j87L87M24n35
4477h2l30J28L45J56l14j18K57K66l26j94P0O09j82m61K0L23j96j8j16M0M32j75
4499A34k69j61K81L64m20k17M75l9j12k32L3J69L27l37j42K53J66k82m01M77L42
4520D09n17R1j18K89Nj27j04n7K63l03m7M8M84r2l13k25M87k7j13n1J16l8J25
4543A85m40O1J97L89m43k13K24L82k55m17K30J73R3j80l37J92L06m5j28j84M66
4564B56k35j85j6K33J59l64m0L32j57K7j98pJ29K11k41k63L76K6P8m72J94N67
$$ plain form
4586 410 73 -105 -49 20 379 12 -137 -303 289 143 44 -122 147 366 -46 65 -123 119 -1 315 -182
4607 -182 97 146 36 -231 -28 222 -68 -233 31 -25 -62 -49 -83 20 261 -82 -237 57 99 74 -222 -13
4629 -13 88 173 -261 -318 84 124 -23 -118 -334 26 124 -157 -286 140 107 -173 -211 76 206 33 -95 -299 398
4652 398 -12 -51 -320 37 330 34 -316 109 108 20 -178 84 71 222 -43 -137 225 78 72 -13 308 263 144
4675 144 -115 -181 269 405 -151 -78 -236 143 46 67 -275 230 76 -199 -158 -145 221 -174 -155 -88 223 143 70
4698 70 24 233 96 -81 -234 -211 16 -204 -233 -53 -20 169 -248 -442 -114 -9 -45 -151 48 233 307 -219
4720 -219 -83 228 -24 -185 -184 121 210 193 -378 -32 156 80 90 -28 -109 341 227 -195 -138 335 277 -370 -420
4743 -420 -110 462 -111 -383 -213 195 83 -84 47 57 207 231 -83 -45 3 41 -61 -184 203 162 62 -85
$$ packed form
4586D10l37j78N6O9L59l67j49j66N92j46r9j66K69K19m12J11j88K42j20L16m97
4607a82K79M9j10k67K03K50k90j65K64n6l7J3l4J03K41l43j55K94M2k5k96K09
4629a3J01Q5m34n7M02M0j47r5k16L60R8k81j29M26l3k80l8K87J30j73j28k04O97
4652C98m10l9k69L57K93k96l50M25jq8j98K62j3J51k65r4L62j47oq5L21m5j19
4675A44k59o6M50J36n56P3j58L79r7K1l42N05j54k75M1J3L66l95J9O7L11q0p3
4698G0m6K09j37j77j53K3K27k20k9J80L3J89m17j94L28J05l6j06J99J85P4n26
4720b19J36L11k52j61JL05Q9j7n71L46J88p6J0j18q1M50j14m22N7M73n8o47n0
4743d20L10N72n73k72J70M08j12j67J31J0J50K4l14L8M8L8j02j23L87m1j00j47
$$ plain form
4765 -85 11 -265 -13 -130 -231 40 162 -82 -198 36 -64 -83 -287 -24 283 -162 62 0 163 183 -61 -326
4787 -326 122 373 197 -196 -115 274 314 -121 -271 178 236 -326 -243 0 200 62 -59 20 145 77 50 -31 207
4810 207 153 87 -174 88 216 -121 -275 -62 117 299 285 -68 106 75 -22 -251 41 47 -159 -277 -187 259 82
4833 82 228 -347 -91 433 379 -359 -168 156 207 -41 -292 193 148 -9 -278 -210 -25 81 -67 191 160 406
4855 406 33 171 26 192 228 -37 -65 -51 96 142 -323 25 238 -66 -342 81 148 185 -82 -157 161 -64
4877 -64 -17 -238 -82 294 -45 -222 101 97 267 -242 -185 9 185 93 -127 -200 156 40 -127 56 -10 202 -23
4900 -23 -103 -121 129 43 -86 -210 285 -45 -47 -85 -13 31 -190 -218 -221 158 267 -131 -124 305 99 -8 -135 -53 247
4925 247 113 -213 -136 210 199 -369 -82 70 229 -151 -216 -107 -99 156 -120 -271 3 148 -84 -246 12 -28
$$ packed form
4765h5R6k76K52j17j01K71J22k44j16K34j00j9k04K63L07m45K24o2J63K0k44k65
4787c26M48K51j76l93Q1L89M0m35j50M49N8n62Q3K43K00j38j21P9J25o8k7q1K38
4810B07n4o6k61K62J28l37j54K13J79J82j4l53J74l1r7k29K92Ok06j18R0M46j77
4833H2J46n75K56N24n4p38J91L24N1k48k51M85m5j57k69O8J85J06j48K58l1K46
4855D06l73J38j45J66L6k65k8J4J47M6m65L48K13l04k76M23O7L7k67p5L18k25
4877f4M7k21J56L76l39j77L23mJ70n09N7J94J76r2k20p3L56j16j67J83o6K12k25
4900b3q0j8K50q6j29j24M95l30kl8P2M4k21k8lL79J09l98PM29k06j07j27Q2L00
4925B47j34l26P7L46j1n68K87J52J59l80o5J09QK55k76j51K74J45k32j62K58m0
$$ plain form
4947 -28 34 -68 -250 55 117 100 -234 -306 255 44 -281 -316 49 107 -10 -208 187 15 17 -267 -18 200 253
4970 253 -14 -185 252 -24 -326 -201 123 425 -158 -189 -129 287 180 -56 -12 -271 296 355 -78 63 257
4991 257 -82 -212 -149 115 150 -14 -132 -124 199 205 -82 65 86 262 -144 -344 5 -59 133 3 110 222 -153
5014 -153 102 77 48 259 -68 -294 57 275 98 -162 -162 288 249 -134 -19 -50 408 18 -250 -62 298 149
5036 149 -284 -97 -14 355 111 -222 48 247 14 45 -15 169 151 -53 -158 -136 67 193 -299 -134 157 111
5058 111 -360 -120 -93 -96 45 -237 107 -41 -180 -106 -16 129 -38 -325 -211 52 113 -223 -127 -64 -6 -64 -300
5081 -300 -174 181 97 -181 -226 -169 256 427 -296 -252 -168 159 -117 175 -141 82 -31 -196 -94 -35 251 -140
5103 -140 -144 219 75 -9 6 -106 97 2 -59 -169 97 142 -3 -262 39 -70 -157 -60 -128 228 32 -38 -31 79
$$ packed form
4947b8O2j02j82L05O2j7l34p2N61k11l25l5L65N8j17j98L95j72Kk84K49K18N3
4970B53k67j71M37k76l02J25L24L02n83l1O0M16j07k36M4k59N67N9m33J41J94
4991B57l39j30O3K64L5j64j18QL23Ok87J47K1J76m06k00L49o4J92j30J07J12l75
5014a53K55k5k9K11l27k26L51K18j77k60%M50l9l83J15l1M58l90k68J88L60j49
5036A49m33J87Q3L69k44l33K70J99k33L1o0J84j8k04j05K2K03J26m92J65K91m6
5058A11m71K40K7lJ41k82L44j48j39P4R0J45j67k87J14K63O1l36R6O3N8n8k36
5081c00J26L55q4k78m5N7M25J71p23M4Q4L27k76K92l16K23j13j65J02N9K86l91
5103a40mL63j44q4J5j12K03r5o1j10K66M5j45k59L01j09q7R7o8L56j96p0PJ10
$$ plain form
5127 79 28 -107 19 -203 329 -10 -296 -257 247 -41 -119 -198 42 305 -220 136 -80 169 38 -181 -133 162
5149 162 88 -141 -411 44 380 204 -164 -221 41 -25 -124 -163 -293 202 79 -355 -58 117 402 -305 -132 359
5171 359 245 65 -182 7 -91 138 -11 -132 249 251 -7 -313 119 423 -59 -445 -70 185 95 -146 -110 58
5193 58 99 224 -202 99 146 101 -163 -207 -53 286 -181 66 -173 462 24 -59 186 76 427 -56 44 195
5215 195 210 182 -355 50 251 -24 -10 -218 184 471 -14 -213 -125 373 -31 -34 -243 38 -30 -213 -135 30 314
5238 314 5 -233 -66 398 -112 -95 -82 224 286 48 170 -145 -50 135 -216 -139 180 115 -76 -315 -44 -27
5260 -27 -303 -158 -39 364 -30 -48 -301 270 -122 -249 -74 120 293 296 -236 61 -106 175 -118 -116 356 260
5282 260 92 -161 33 51 429 90 64 39 199 96 -154 -181 256 19 -130 -201 123 199 -33 -117 -485 -19
$$ packed form
5127G9n1j35J26k22N32l39k86L9N04k88p8p9K40K63n25L56k16K49j31k19M8K95
5149A62p4k29k70M55L36j76l68n7K62o6r9l9j30M95j23m34K97J75K85p07J73M91
5171C59j14j80k47J89r8K29j49j21L81Kk58l06M32L04m82l86L75K55r0k41L6J68
5193E8M1J25m26L01M7m5k64m4J54L39m67K47k39O35m38q3K45j10L51m83J00J51
5215A95J5k8n37M05K01k75J4k08M02K87m85j99Q8M98m04lk09K81o8j83P8J65K84
5238C14l09k38J67M64n10J7J3L06O2k38J22l15R5J85l51P7L19o5j91k39K71J7
5260b7k76J45J19M03l94j8k53N71l92j27J75J94J73Ln32K97j67K81k93KM72r6
5282B60j68k53J94J8L78l39k6k5J60j03k50k7M37k37j49p1L24P6k32q4l68M66
$$ plain form
5304 -19 -31 37 136 190 173 -370 5 222 183 85 82 -19 146 -73 -309 14 193 21 -69 -50 239 220 -222 -85
5328 -85 77 188 61 -372 -78 87 211 -176 -260 129 217 -60 -241 -94 220 55 -209 -138 172 165 -133 -18
5350 -18 69 125 -2 -159 -264 -8 145 -65 -230 249 276 -141 -165 -97 25 285 -27 -296 31 255 -63 -39
5372 -39 1 -51 -109 -308 -253 85 199 -163 -207 60 171 105 -178 -342 166 11 -289 -534 -165 251 -99 -200
5394 -200 -195 162 17 -205 -235 -120 4 -223 -256 50 140 155 -154 -68 247 -56 87 -114 105 246 159 -451 -110
5417 -110 242 -42 -137 -273 293 -28 -29 0 84 73 -28 -70 -189 -21 360 -306 -291 -230 140 100 -43 -235 -19
5440 -19 217 183 80 86 71 23 -77 -273 -32 232 -221 -316 252 96 -399 -226 -76 107 -52 -211 -95 110
5462 110 223 -195 -1 235 121 76 28 44 127 -99 -108 -191 177 166 31 -98 -153 285 208 -245 -288 225 357 -94
$$ packed form
5304a9j2O8R9N4j7n43L75K17l9r8lj01J65k19k36L23J79j72r0J9K89j9m42J37
5328h5J62J11j27m33K94J65J24l87q4L89Q8k77j81J47L14j65k64P1L10pk98J15
5350a8Q7N6j27j57j05K56J53k10j65M79K7m17k4O8J22K60l12k69L27K24l18K4
5372c9M0n2n8j99N5L38J14l62m4K67J11o6k83j64N08j55l00k45L69M16l50j01
5394b00NL57j45k22l0J15J24k27l3L06R0J5l09Q6L15l03J43k01K19J41q7o10L41
5417a10L52k84r5j36N66l21jK9Q4j1j01m2j19J68L81o66J5O1L70m0j43j92K16
5440a9K36l4j03Oj5m8j00j96K41K64m53r5N68j56m95J73J50J83j59j59J16K05
5462A10J13m18J94K36j14m5m8J6Q3k26rq3L68j1j35j29n5M38p7m53m3N13J32m51
$$ plain form
5486 -94 -189 183 61 -91 -130 190 160 -10 4 -147 23 256 41 -209 73 -8 110 -327 -161 105 50 -82
5508 -82 31 95 -86 9 -271 -118 146 -73 -292 -155 146 178 -113 17 5 -284 19 48 22 132 58 -300 -94
5531 -94 97 361 84 123 -153 291 92 -69 -66 -74 -40 -23 -261 -66 363 -103 -205 -76 207 -1 -101 103 -63
5554 -63 31 -5 10 -21 232 -52 -341 -178 90 87 -177 -96 9 153 -176 -64 14 295 80 -189 -293 -27 244
5577 244 62 -381 -160 220 389 81 -208 203 294 -23 -128 -264 91 -42 -26 -1 305 162 -122 -227 236
5598 236 113 -61 -51 38 293 264 -74 -243 127 235 -77 -193 99 158 66 -82 -129 134 -61 -1 -129 -122 366
5621 366 -176 -133 150 178 177 -93 -24 -70 46 -76 -141 -320 108 29 -221 -352 280 259 -130 -386 -130 -18 -111
5644 -111 -239 -89 80 -170 -89 -430 182 8 -86 -295 -64 -52 136 -129 -137 66 95 26 58 255 125 30 117
$$ packed form
5486i4r5L72j22j52l9L20l0j70J4j51J70K33k15k50K82q1J18m37J66K66n5j32
5508h2J13O4j81R5k80J53K64k19k19J37L01L2k91J30j2k89L03K9k6J10p4l58K06
5531i4J91K64k77L9k76M44j99j61LqL4J7k38J95M29m66j02J29K83k08j00K04j66
5554f3R4l6J5l1K53k84k89J63K68lk64Q1J05J44l29J12P8K81k15k69j04K66K71
5577B44j82m43K21L80J69l08k89M11R1l17j05j36L55j33J6K5L06j43k84j05M63
5598B36j23j74J0Q9K55k9l38j69L70J08l12j16K92N9r2j48m7K63j95O0j28PM88
5621C66n42M3K83K8jk70O9m6J16j22o5j79M28p9k50j31O32k1l89k56K56J12r3
5644a11j28J50J69k50Q1l41O12j74r4k09K31J2J88k65qK03K9o9L2J97j30r5Q7
$$ plain form
5667 117 -139 268 301 -275 -69 26 92 -38 -259 -84 38 6 69 -128 -29 90 -91 -238 392 199 111 90 -56
5690 -56 99 272 66 -206 234 143 305 -77 177 151 -94 -355 -4 60 207 -180 -247 -105 307 -281 -297 -282
5712 -282 110 -9 -415 -135 156 417 -273 -33 -214 222 141 -461 -123 209 203 478 -222 -238 128 116 -378 -51
5734 -51 265 207 24 -195 60 -49 32 -241 -142 129 -45 32 -18 41 187 -171 -418 -124 196 -7 -13 164 181
5757 181 -55 -217 -179 -28 215 -64 -34 -103 -49 93 -163 -178 99 19 -158 -167 -144 92 -25 -361 -185 -11 -45
5780 -45 -108 63 -188 225 -3 -222 -144 292 -199 -138 104 -195 -153 141 98 23 223 316 -150 188 207 132 3
5803 3 -94 71 181 -181 196 210 116 315 -72 -85 -36 24 -133 -125 -84 274 -105 -309 -14 106 30 -264 5 -65
5827 -65 111 -84 -45 0 -10 -106 -133 -120 -28 150 -7 68 -105 -101 26 97 -218 154 -58 171 77 77 63 18 -355 -55
$$ packed form
5667A17k56M07L3n76K06R5O6j30k21J75J22l2O3j97R9J19j81j47O30j93q8k1j46
5690e6J55J73k06k72M40r1J62l82K54k6k45k61L51O4J47l87o7J42M12n88j6J5
5712b82L92j19m06K80K91K61o90K40j81M36q1o02L38L32oK75p00j6L66j2m94L27
5734e1L16n8j83k19K55j09Q1k73R9K71j74P7n0N9J46l58k47K94L20k03oJ77J7
5757A81k36j62L8J51K43k79L0o9N4J42k56j5K77q0j77rK3K36j17l36J76J74l4
5780d5o3J71k51M13k28k19P8M36m91O1K42k99M2K94m3p5K00R3m66L38J9p5j29
5803Cr7J65J10l62L77J4r4J99l87j3M9O0j57QM1L58l79k04K95J20p6k94K69p0
5827f5J76j95L9M5j0r6k7J3R2J78j57P5j73MJ27P1l15L72k12K29r4%j4m5l73L00
$$ plain form
5853 -55 185 -70 8 -5 54 -75 -389 -81 48 133 101 -249 -40 150 215 -172 -157 119 246 42 -181 113 76
5876 76 12 -242 52 22 132 -167 -504 44 120 78 -231 -57 413 92 -34 -87 -173 -5 -211 98 250 82
5898 82 89 -20 -89 19 11 -147 -123 72 -167 -17 -55 -243 -197 -9 -163 -236 364 258 -199 -289 -20 -58 105 -297
5922 -297 -214 16 16 -114 -220 45 -65 -131 -142 -15 212 -115 -41 -18 41 168 -131 -201 191 -19 -35 47 -286 -83
5946 -83 84 -119 -24 86 21 71 -109 22 154 -40 118 -199 -38 25 -205 -226 -60 213 -127 -61 -191 -5
5968 -5 228 -234 -198 -100 100 -67 -85 174 198 5 -250 -160 169 35 77 -176 -85 301 82 15 -169 -117 115 91
5992 91 108 -80 107 128 -102 -105 127 255 -52 -207 19 59 -13 -21 190 183 4 9 -38 294 12 -198 -67 -19 178
6017 178 -59 -52 -118 260 -161 214 -277 249 103 -145 -110 -38 75 12 -133 -51 106 -183 -67 -63 23 -78 27
$$ packed form
5853e5K40k55P8j3N9j29l14L08J29Q5l2l50K09J90O5l87J5K76J27k04k23K94l7
5876G6o4k54K94l0J10k99l37N48P6m2l09J74M70l21j26n3q6J68k06L09J52j68
5898H2Pj09o9J08qj58K4J95k39J50l8j88M6J88j54p3O00j06m57r0K69l8J63m02
5922b97Q3K30%j30j06K65j10o6j1J27K27l27P4K3N9J27k99p0L92k10j6Q2l33K03
5946h3J67k03R5J10o5N0j80J31J32j94J58l17J61O3k30k1J66K73l40O6j30J86
5968eK33m62L6R8K00j67j8K59K4j93k55R0L29j34M2k53R1L86k19o7j84N2K32k4
5992I1J7j88J87K1k30lK32J28l07j55K26M0p2qK11pj79Nm7L32k82k10J31M8J97
6017A78k37Po6L78m21L75m91N26j46k48L5P2J13o3j45Q2J57k89J16MQ6j01J05
$$ plain form
6040 27 -139 -31 -25 -163 -153 189 -64 82 -137 52 -188 -80 141 -104 -349 151 283 -79 -197 121 -7
6061 -7 -51 -106 -99 94 162 -330 -156 -107 245 -212 -270 -42 -8 118 -327 -170 3 252 40 29 -18 166 47 -23
6085 -23 -30 86 74 -49 -17 228 -14 -96 -139 -33 79 107 -30 -159 130 32 117 -279 -7 238 23 -109 -60 241
6109 241 -119 329 -204 -70 248 108 -71 -65 158 199 -199 -29 108 -130 -6 -146 -62 101 -54 -128 -296 -59
6131 -59 40 150 -5 -119 99 -38 184 -242 163 16 -156 -283 173 174 108 -274 278 95 315 -306 -190 240
6153 240 0 -46 86 84 210 300 -58 -123 23 91 32 -98 148 438 -328 -309 -90 -135 379 -5 -43 202 155 -304
6177 -304 -2 -22 87 -74 -35 38 23 62 14 -200 98 59 -165 -85 -87 380 -162 -109 120 95 -213 -163 -101 -128 27
6202 27 7 -99 75 88 5 19 -146 151 147 -66 49 -261 65 316 -251 -10 82 46 47 -62 38 174 -24 -29
$$ packed form
6040B7j66J08Oj38J0L42k53J46k19J89k40J08K21k45k45N00J32l62j18L18j28
6061gm4n5PJ93O8m92J74M9L52m57n8K28L4J26m45J57J73K49k12j1m7J84j19p0
6085b3pJ16j2j23L2K45k42q2m3J06J12K8j37j29K89r8Q5l96K72K45k15j32M9L01
6109B41l60M48n33J34L18j40j79OK23M1l98J70J37k38J24j40Q4J63j55p4j68K37
6131e9R9J10j55j14K18j37K22m26M05j47j72j27M56Jo6l82N52j83K20o21J16M30
6153B40k40m6J32kJ26R0l58o5J46O8n9j30K46K90p66J9K19m5N14l84l8K45m7m59
6177c04L02k0J09j61L9P3j5L9m8k14K98l9k24Q0kM67n42N3K29k5l08N0O2k7J55
6202B7k0j06J74J3q3J4j65K97mk13J15l10L26K51n67K41R2l6Jj09J00J36j98n
$$ plain form
6226 -29 -144 295 -121 -344 -91 -25 81 100 -183 39 281 -250 -300 -52 34 269 -213 -233 -3 83 81 -149 -205
6249 -205 21 -57 -284 -190 87 56 -37 55 -85 503 180 -375 -156 -10 304 -76 -223 169 135 252 -144 118
6271 118 -149 165 -108 -381 170 139 -2 -93 -54 52 -74 -95 18 163 108 66 -101 48 122 24 -134 -38 -51
6294 -51 -259 -355 -113 143 310 -53 -76 -76 178 -45 -122 -157 188 180 -99 -157 206 25 -109 -223 -304 397 258 -170
6318 -170 114 -68 -101 98 -120 -30 -14 -76 -27 -68 122 42 30 -207 -114 110 52 76 -236 53 46 107 -155 77 138
6343 138 -145 -16 -7 145 180 104 4 215 133 10 -129 147 235 3 -4 -95 95 85 -130 -51 -60 214 62 -124
6367 -124 -170 182 -207 -107 -135 -39 195 -19 74 -56 184 242 -277 -60 115 -20 -120 41 211 95 -67 -272
6389 -272 -53 294 46 -39 -166 185 48 -93 -63 88 252 -145 98 13 56 221 -186 -123 28 -33 -11 -94 -21
$$ packed form
6226b9j15M39m16k23K53O6J06J9k83K22K42n31n0K48Q6K35m82k0K30Q6kk30n6
6249b05K26p8k27R4K77l1r3R2j40N88l23n55K19J46L14l80j47L92l4J17l96K62
6271A18k67L14k73k73N51l1j41r1L9J06j26k1J13J45n5m2j67J49P4r8j58R6j3
6294e1k08r6K42K56J67l63k3%K54k23p7l5L45qk79n8L63j81j34j14q1P01j39m28
6318a70K84j82l3J99k18R0J6o2M9m1J90q0j2k37R3K24n8K4l12K89pO1k62K32O1
6343A38k83J29RJ52L5p6j00K11q2j23j39K76Q8k32pr1J90j0k15P9rK74j52j86
6367a24m6L52l89J00k8R6K34k14R3j30K40N8n19K17J75j35j00J61J70j16j62k05
6389b72K19L47k48q5j27L51j37j41L0J51J64l97K43q5M3J65m07O3J51o1K2q3P3
$$ plain form
6412 -21 149 124 -173 -472 -70 95 -114 -228 59 141 132 -131 -55 271 160 -118 -161 -38 -20 -202 223 116 -37
6435 -37 71 -198 -44 12 -37 -20 105 38 233 -175 103 -248 324 -166 -114 216 177 61 135 16 143 134 -13
6458 -13 -69 -61 51 108 -105 -229 189 42 227 -237 -248 127 350 133 1 23 62 -128 -29 -164 -13 135 -167
6481 -167 -48 8 20 -117 5 -16 90 79 -180 46 10 145 173 -229 67 241 -344 -191 10 121 226 -122
6503 -122 -166 140 156 45 -92 -95 54 130 -252 -50 287 152 -31 -209 80 82 -13 -161 -116 131 131 -148 -93 -116
6527 -116 172 -31 93 0 53 -1 -254 103 130 -36 -240 -311 98 97 -40 -77 -24 2 -148 -324 86 45 191 -48
6551 -48 54 282 70 7 -323 17 -181 350 117 -24 -26 155 166 -406 -88 -131 62 -223 -130 61 40 -24 -122
6574 -122 281 85 87 110 0 50 158 10 85 -3 40 96 -156 -122 39 -152 -132 -21 49 125 -343 -32 232 137
$$ packed form
6412b1J70k5k97k99M02J65k09j14K87Q2rk63P6L26j11k78m3J23J8j82M25j07j53
6435c7J08k69J54N6m9J7J25o7J95m08K78l51N72m90N2L30l9j16P4j19J27rj47
6458a3n6QJ12N7k13j24M18j47J85m64j1L75K23k17j32K2L9j90R9j35J51J48l02
6481a67J19N6J2j37J22k1J06j1k59K26l6J35K8m02K96J74n85J53K01J11J05l48
6503a22m4L06J6j11j37lJ49P6l82K02L37j35j83j78K89Kr5j48M5K47%k79N5k3
6527a16K88k03J24r3N3n4k53L57K7j66k04p1M09jj37l7N3K6j50j76M10m1J46k39
6551d8J02K28k12o3l30L40j98N31k33j41kJ81J1n72L18m3J93k85R3J91k1o4r8
6574a22M03j96KK3j10N0J08j48P5q8M3N6k52L4J61j91K0J11P0P6m68L11K64r5
$$ plain form
6598 137 23 -66 -33 -21 -98 176 -26 261 -60 1 -101 169 343 72 -214 -84 -24 199 -127 -85 -115 183 -247
6621 -247 103 -89 -43 -12 -126 -51 -62 357 -342 128 -113 136 -76 60 5 143 -54 -72 -305 98 373 -68
6643 -68 -3 -128 86 1 87 35 -163 267 63 -93 -94 -69 177 -191 -393 51 -93 64 -358 244 263 -29 -33 -150
6667 -150 172 214 -66 -164 -16 68 17 -141 40 -19 48 -58 6 135 -102 -145 53 63 -39 -14 -324 -201 115
6690 115 241 -68 222 -43 110 -66 -66 -365 115 240 -150 1 161 273 126 -191 -137 -48 -32 -125 -97 -123 355
6713 355 56 -201 257 367 151 -146 -302 240 5 -131 5 132 171 180 -109 18 209 263 -5 9 29 263
6735 263 -11 98 22 2 -138 188 -117 -141 177 29 -80 30 239 83 -95 105 219 4 28 -115 -99 41
6757 41 -117 -264 146 -137 -31 -28 -248 162 -16 -181 -119 -175 344 -26 -357 -111 172 -53 1 146 11 268
$$ packed form
6598A37j14q9L3J2p7K74k02K87l21O1j02K70J74k71k86J30O0K23l26M2l0K98m30
6621b47L50j92M6L1j14P5j1M19o99M70k41K49k12J36n5J38j97j8k33M03K75m41
6643f8O5j25K14q5Q6n2j98M30k04j56jK5K46l68k02M44j44J57m22O02J9k92mj17
6667a50L22M2k80r8J48Q4n1j58J81n9O7j06O4J29k37m3J98J0j02K5l10J23L16
6690A15J26l09K90k65J53j76%k99M80J25l90J51J60J12j47l17N4Q9J6r3K8k6M78
6713C55k99k57M58J10k16k97j56N42k35j36J36J27L9Rk89J27J91N4k68J4K0K34
6735B63k74J09p6k0j40L26l05k4L18j48j09J10K09j56j78K00J14k15K4j43J6J40
6757D1j58j47M10k83J06Lk20M10j78j65O2n6N19l70l31K46K83k25N4J45j35K57
$$ plain form
6779 268 -30 129 -93 286 90 48 -14 111 -216 -286 -199 89 46 -236 -155 -41 -2 218 105 -126 169 126 -100
6802 -100 -198 126 73 137 -33 159 24 265 -9 -311 -136 258 -7 -84 -163 29 111 13 -12 111 20 61 -3 116
6826 116 -76 20 -238 -75 133 123 -194 13 -159 266 -242 -149 159 -132 -54 -366 112 114 120 -5 -97 65 135
6849 135 -8 -125 -18 159 100 120 -88 -79 119 65 -149 -83 260 45 -178 246 158 158 110 -245 76 166 13 -155
6873 -155 42 268 -134 100 -77 -20 145 -199 -218 -95 221 -24 122 -2 99 183 -81 -12 -81 -60 -4 -361
6895 -361 73 62 52 252 -269 -83 160 50 -367 37 122 225 -140 -136 35 101 -214 -107 35 -141 88 127
6917 127 287 56 211 -72 44 91 -72 65 -207 112 191 60 -128 -27 235 -82 -100 -41 -140 -123 152 -198
6939 -198 -173 95 -37 -51 -8 118 -35 -146 -91 89 116 157 11 -326 127 -9 214 19 5 100 -74 -87 -68
$$ packed form
6779B68k98J59k22L79j96m2o2J25l27p0Q7K88m3k82Q1J14L9K20j13k31K95m3k26
6802a00r8L24n3O4j70J92j35K41k74l02J75L94k65p7p9J92Q2r8k5J23r1M1o4J19
6826A16j92R6k58J63K08j0l17K07j72M25n08R3L08k91P8l12M78KOj25r2J62P0
6849A35j43j17J07J77n9K0k08RJ98n4k14O6L43k15k23M24q8%m8l55L21R0j53j68
6873a55J97K26m02K34j77N7J65l44j9J23L16k45J46j24J01Q4k64O9o9K1N6l57
6895c61M34j1j0K00n21J86K43j10m17M04Q5J03l65MJ71O6l15J07J42j76K29L9
6917A27J60k31J55k83J16M7j63J37k72L19P9j31j88J01K62l17j8N9r9J7K75l50
6939a98K5K68j32j4M3J26j53j11N5J80K7M1j46l37M53j36K23j95j4R5j74j3J9
$$ plain form
6962 -68 64 288 -27 -223 -40 249 263 -47 -20 39 19 -106 -80 -59 59 231 98 -27 -162 -57 -32 -127 185
6985 185 132 125 -251 5 -36 138 -8 73 240 -40 69 -283 97 -105 -70 -443 -266 230 -134 -168 92 90 12
7008 12 63 -234 76 150 -80 -34 -149 249 285 -140 62 -76 80 -107 -325 110 353 147 110 96 -1 181 50
7031 50 64 -10 -180 -193 -26 44 106 -127 -27 -28 189 423 -136 -375 -236 212 52 -401 -116 -38 248 -250 -321
7054 -321 -226 120 -151 229 -100 99 23 -115 -92 -68 54 153 -203 -7 277 98 -68 -65 26 140 47 -173 149
7077 149 90 71 -146 13 195 259 47 165 209 192 -184 -7 91 -119 -55 125 -48 75 151 -55 -232 35 61
7100 61 -56 49 -111 41 -167 -57 143 -108 -247 -89 -8 91 16 119 -140 -141 239 92 316 -52 202 214
7122 214 77 -82 16 9 -140 -18 -1 -14 -19 -142 -123 60 62 -288 -131 -194 -112 -259 -216 67 21 79 -13 -192 -231 -80
$$ packed form
6962f8J32K24l15j96J83K89J4l10K7N9k0j25K6K1J18J72j33j25j35J05K5r5L12
6985A85n3pl76K56m1J74j46Q1J67k80J09l52L80k02L5l73J77M96l64l4K60kp8
7008A2N1k97L10P4k30M6j15L98L6m25K02j38J56j87k18M35K43k06l7j4r7J82j31
7031E0J4p4j70j3J67P0O2k33J00jK17K34n59k39J39M48j60m53K85P8K86m98p1
7054c21R5L46k71L80l29J99p6j38K3K4J22R9l56J96K84j79j66LR1J14r3k20L22
7077A49n9j9k17J59J82O4k12J18M4j7l76J77R8k10O4J80j73J23P6k06j77K67K6
7100F1j17J05j60J52k08J10K00k51j39J58Q1R9p5J03k59jL80j47K24l68K54J2
7122B14j37j59R8pj49J22J7j3nj23J9J83Kl50J57o3Q2j47M3K83m6N8r2j79l9J51
$$ plain form
7148 -80 99 -234 -115 71 88 101 145 195 -5 67 71 12 168 99 70 14 -180 304 -111 -142 -118 -121 132 -55 -33 146
7174 146 69 -29 -97 108 119 348 -25 -69 44 288 -269 -182 107 191 -124 -193 58 247 113 -108 -215 -77 -58
7197 -58 -42 -58 167 30 61 -146 -382 218 -75 1 -47 78 297 169 1 47 -49 -58 -132 185 85 9 137 -221
7221 -221 -250 124 44 37 35 163 -58 -103 50 165 -83 -174 113 -20 25 40 -25 33 167 -103 -79 162 157 235 56
7246 56 10 -72 129 0 -154 -163 -312 -15 -5 -155 -156 6 105 -29 -169 -35 -14 115 -51 -453 -2 -120 -203 -16
7270 -16 188 37 -216 -175 19 89 -6 -193 -72 238 -150 -138 -165 74 39 -63 -126 74 -62 16 -181 57 199
7293 199 16 -41 -30 -40 -109 80 -11 -350 -131 -5 -291 196 -83 123 86 -141 -21 -79 63 -52 122 -11
7315 -11 134 -68 -97 -62 -79 -123 -98 -60 188 78 -284 -41 164 16 50 5 -155 148 19 -43 -204 102 38 -303
$$ packed form
7148h0J79l33J19J86J7J3M4N0k00P2Mn9J56o9k9n6j94M84m15l1K4lK53j87K2J79
7174A46p7r8o8K05J1K29l73m4J13K44n57Q7K89Q4l15o9K51J89j34k21j07J38J9
7197e8J6j6K25j37L1k07k36O00k93P6m8J25K19j28j68M6r6rp4L17j00p6J28l58
7221b21k9L74q0pkJ28k21m5J53J15k48r1K87j33M5J5o5N8J34k70K4K41nP8j79
7246E6m6q2K01j29j54rj49K97J0j50jJ62R9j34j40J34K1J29j66m02M51j18q3J87
7270a6K04j51k53M1J94P0r5j87J21L10l88J2k7K39l5j02o3K00j36P8j97K38J42
7293A99j83n7J1j0o9J89r1l39K19J26k86M87k79K06l7k27J20n8J42j15J74j33
7315a1J45k02k9L5j7m4K5L8K48j10l62K43K05j48L4m5j60L03j29o2j61L06o4l41
$$ plain form
7339 -303 -145 161 185 -97 49 -117 195 -51 76 -232 191 -23 112 -175 -123 134 365 -67 -70 -20 214 179
7361 179 -61 166 26 135 -148 -17 -10 -96 89 -26 -12 255 -31 -293 -130 -24 298 76 -272 -89 -102 185
7383 185 -150 90 -100 -32 -213 -27 -56 177 -133 -170 143 212 45 -10 32 66 68 57 0 -17 158 63 -57 168
7407 168 290 -108 -88 142 94 248 55 -71 -14 27 -30 -118 -24 210 130 -85 60 -28 118 -20 28 -304 173
7430 173 -17 -160 133 -33 145 85 21 -96 321 -133 -91 -375 218 121 -133 -254 -223 64 -325 25 -55 240
7452 240 188 -265 -328 -157 277 4 90 79 29 -42 -23 83 220 -257 21 -50 131 358 113 216 -232 150 228
7475 228 20 33 205 173 95 -334 78 292 -71 -309 -258 185 58 47 154 -163 220 55 -104 -156 -203 100
7497 100 -216 -62 81 -9 238 -65 -133 -23 147 87 -76 -29 25 -42 -155 -107 232 108 -136 -109 -15 -141 -42
$$ packed form
7339c03J58L06K4k82J46j66L12k46J27l08M23k14J35k87N2K57K31m32lN0K34l5
7361A79k40K27j40J09k83J31Pq6J85j15J4K67k86k62J63J06L22k22l48J83j3K87
7383A85l35K40j90O8j81J86k9K33l10l7L13O9j67n5M2L4Kj1n7j7J75r5j20K25
7407A68J22l98K0K30m8J54j93j26N7M1n7q8R4K34q0k15J45q8J46j38M8l32M77
7430A73j90j43K93j66J78o0o4j17M17m54M2k84N93r7k54j21L1K87l89L50q0K95
7452B40n2m53o3J71M34k73Q6j1n0p1J9J06J37m77K78p1J81K27k45J03m48L82P8
7475B28k08J3J72l2p8m29M12K14l63k38N1M43j27j1J07l17L83j65j59n2m7L03
7497A00l16J54J43r0K47l03o8J10J70o0j63M7N4o7j13M8L39j24k44K7R4j26R9
$$ plain form
7520 -42 41 128 3 44 -124 -58 -75 46 -56 -132 181 44 26 -160 -158 82 -18 -74 -264 -4 215 -194 15 91
7544 91 15 -363 19 -169 -130 -162 -166 -122 52 144 -25 56 -122 42 -75 -98 -127 -78 24 -133 211 -123 91 68
7568 68 82 -44 -122 -174 -75 -6 428 -63 -175 -117 178 80 -136 38 -179 127 -60 -166 -28 55 -49 91 -60
7591 -60 -24 119 -130 -171 93 -86 285 40 -18 -14 95 -18 -22 -199 97 196 -148 -118 89 -17 -10 185 199 -6
7615 -6 -30 -118 -333 -49 91 -122 -47 -14 58 200 -234 79 49 92 -83 -233 233 63 -100 -105 97 127 124 -97 -131
7640 -131 106 183 249 232 133 -40 21 -129 -262 176 18 -179 -61 -66 44 -136 -23 -43 118 6 -60 -214 -151
7663 -151 -53 -75 -1 -26 -125 -118 -146 -151 203 477 61 -116 -33 40 13 -284 -37 41 -11 -78 -203 -91 47 -31 -274 86
7689 86 185 -82 -23 -87 57 57 -11 -140 86 165 -23 -221 -171 -54 -5 102 -8 123 -184 -108 -14 142 -101 -151
$$ packed form
7520d2Q3Q7j25M1j68O6j7J21j02p6L13j37j8j86KK40j00n6j90K60K19m09K09P6
7544I1p6l78L82j88L9l2mM4J74R2j69Q1j78J64j17k3k9M9J02j57L44l34K14k3
7568F8J4j26p8n2R9O9M34m91j12N8K95r8k16J74k17L06j87j06J38Q3j04J40j51
7591f0L6J43k49m1K64j79L71k45n8MJ09j13mj77K96R9l44L0K07j06PJ95J4k05
7615fk4q8k15K84J40k13P5L3P2J42m34L13l0M3j75j50M66j70j63nK02L0lk21l4
7640a31K37P7O6j7r9j73O1j50j33M38j58j97J18nJ10j80J13k0J61j12o6j54O3
7663a51R8k2P4k5r9Pk8nL54K74m16j77Q3P3k7k97K47P8n2o7j25J12J38p8k43L60
7689H6R9k67N9o4J44%o8j29K26P9j88j98N0J17M9J07j10J31l07P6R4J56k43n0
$$ plain form
7713 -151 -343 190 129 -331 -35 -228 -70 -164 -14 -230 168 15 95 -140 -25 34 353 -99 -301 200 -81
7734 -81 142 -167 101 222 118 97 57 -140 23 -102 52 41 7 -19 -119 303 -3 -56 -57 -40 27 -26 -7 -126
7758 -126 -110 -58 -268 -146 28 74 -25 119 -94 -263 -40 114 -62 -282 -63 -48 26 54 179 208 59 -322 -190
7781 -190 194 -16 121 -23 -24 264 -3 -149 -68 198 101 -89 -243 -135 -3 33 124 36 107 -11 -43 -23 187
7804 187 -27 28 27 123 285 -68 -178 -107 143 272 -222 -142 66 163 58 21 208 103 257 -139 3 286 42
7827 42 8 -64 -98 -177 47 -297 -247 257 -28 -224 10 -17 284 -205 -28 -117 49 -70 -134 -104 13 -343 -133
7850 -133 -101 -32 105 -45 51 -15 -68 45 -244 -221 114 106 -199 238 139 83 57 -80 29 -148 57 -202 -179 -43
7874 -43 35 -80 -107 -293 -219 412 -211 -104 123 19 -95 -106 180 -51 117 -250 56 53 44 222 -153 72 -89
$$ packed form
7713a51j92N33o1m60K96j93J58r4J50k16L98j53Q0k35J15N9L19m52k02N01k81
7734h1K23l09K68J21j04k1m0j97J63j25J54j1l4k6j00M22l06n3jJ7O7n3J9j19
7758a26J6N2k10J22J74M6r9J44k13j69K23J54j76k20K19J5P4K8J25K9j49l81J32
7781a90L84k10J37j44jK88k67j46Q1K66r7j90j54J08J32L6R1q8P1j18l2K0K10
7804A87k14N5jR6J62l53j10P1K50J29m94Q0K08R7j05l7J87j05J54l96J42K83k44
7827D2l4p2l4p9K24l44N0N04k85j96K34k7L01m89J77q9J66j19o4L0J17l56K10
7850a33L2O9J37j50R6o6n3J13k89K3L35ql05M37r9n6k6j37J09j77K05k59K3J36
7874d3P8j15k7j86P4O31o23J07K27j04j14j1K86k31J68l67L06lrJ78l75K25j61
$$ plain form
7897 -89 159 -141 -285 61 -117 133 -16 -203 -154 -189 -1 31 -104 -202 18 -134 -125 -58 229 -255 84 133 39
7920 39 -190 -11 -89 124 -154 -343 233 329 107 23 -176 288 124 -136 24 -47 51 -190 -157 73 42 -99 129
7943 129 -117 179 182 -151 -122 -111 149 -140 98 -302 -46 51 -101 -97 101 241 93 154 -76 116 19 -81 -121
7966 -121 49 111 206 32 207 -33 -172 -396 -29 217 95 -231 -42 76 -148 27 -50 -115 462 246 -235
7987 -235 -397 -80 -50 57 -20 -101 -340 23 40 20 190 30 -142 166 -25 200 73 -77 -1 -44 -32 47 -19
8010 -19 67 -74 133 -164 34 21 -295 -126 1 240 -80 -148 -82 205 112 -116 -99 -33 -67 -51 -116 77 132 150
8034 150 11 -21 13 145 -94 -136 340 -6 -260 -197 -104 77 -70 -42 -49 144 -26 215 -58 -45 140 -89 209
8057 209 -71 -16 18 -40 -71 241 -119 -13 104 -7 -27 244 58 -121 -11 62 259 -244 -61 -226 147 77
$$ packed form
7897h9K48l00j44L46j78K50j49j87M9l5J88L2j35r8K20j52RO7K87m84L39M9r4
7920C9k29J79p8K13k78j89N76R6k22q4j99M64j64k60J60p1R8k41L3K30l1j41K28
7943A29k46K96Ll33K9J1K60k89K38m00K56R7j52MJ98J40j48O1k30J92r7j00m0
7966a21J70O2R5j74J75k40j39k24L67K46j22l26J89J18k24J75p7o5N77k16m81
7987b35j62L17L0J07p7q1k39L63J7k0J70j60j72L08j91K25j27j50P6m3J2P9o6
8010a9Q6j41K07k97J98j3l16J69J27K39l20o8O6K87r3k28J7O6l4J6o5J93N5J8
8034A50j39l2L4J32k39m2M76l46k54O3R3J81j47K8pJ93j70K41k73J3J85k29K98
8057B09k80N5L4n8l1L12l60J06J17j11k0K71j86j79J10P3J97n03J83j65L73p0
$$ plain form
8079 77 -69 -49 342 -162 -252 -28 -23 -1 -1 -33 -126 36 -61 180 -69 -36 -39 35 -234 37 23 -30 -153 -29 135 67
8105 67 77 -55 -70 147 -168 -183 138 119 -129 -181 160 -148 59 136 -107 -93 55 118 -150 197 50 15 -11 -145
8129 -145 271 150 -36 -9 -20 -169 36 -48 83 77 74 49 92 129 -136 99 75 107 38 -21 -81 -149 -170 49 166 -110
8155 -110 -222 -68 -60 -1 -138 175 99 142 -14 -69 120 133 -167 132 314 62 -128 -102 277 2 52 83 62 156
8179 156 43 -58 64 49 109 121 -151 -66 -118 25 6 -58
$$ packed form
8079G7j46K0L91n04r0K24NK2%l2r3J62r7K41k49L3lP4k69K71j4n3j23J24J64o8
8105F7J0j32j5K17l15j5L21j9k48n2L41l08K07P7k43J4J48O3k68L47j47l5k6j34
8129a45M16j21j86K7j1j49K05q4J31olk5M3L7k65K35k4L2o9n9o0o8k1K19J17k76
8155a10j12J54QN9j37L13p6M3j56n5J89J3l00K99J82k52j90K6L79k75N0L1k1R4
8179A56j13j01J22j5O0J2k72Q5n2J43j9o4
8191e8
$$ Imaginary data points
##PAGE= N=2
##DATA TABLE= (X++(I..I)), XYDATA
$$ plain form
0 0 0 0 0 0 0 0 0 0 0 0 0 -4 8 -8 8 -8 8 -8 15 -16 16 -24 24 -32 32 -40 46 -52 60 -68 76 -88 100 -111 124
35 124 -140 156 -174 192 -213 237 -262 288 -319 352 -389 427 -471 517 -571 630 -693 767 -848
54 -848 942 -1046 1170 -1315 1485 -1693 1953 -2288 2729 -3336 4226 -5630 8102 -13272 28119
69 28119 -149404 -525470 149711 196578 -266099 123155 311678 -224100 -141398 195837 -100968
80 -100968 -133686 255184 96688 -211530 -41379 80190 -45565 -17261 93546 56953 -54067
91 -54067 -74389 -18871 -30207 -10579 136154 70160 -146617 -29910 93452 -119245 -65477
102 -65477 211341 47825 -135099 22564 -36823 -122813 148160 137993 -132899 5827 97268
113 97268 -156029 -68962 175241 29372 -52834 40686 -81545 -89468 115720 48702 -73412
$$ packed form
0@%%%%%%%%%%%mJ2j6J6j6J6j6K3l1L2m0M8n6O4p2Q6r8J12j28J44j64J88k11K35
35A24k64K96l30L66m05M50m99N50o07O71p41Q16q98R88j088J201j323J460j615
54h48J790j988K216k485K800l178L646m241N017o065P562r856J3732k1374M1391
69B8119j77523l76066O75181M6867m62677L89254J88523n35778Q2702L37235k96805
80a00968l2718L88870j58496l08218J70151J21569j25755K8304J10807l6593j11020
91e4067k0322N5518j1336J9628J46733o5994k16777J16707J23362k12697N3768
102f5477K76818j63516j82924J57663n9387q5990K70973j0167k70892J38726R1441
113I7268k53297Q7067K44203j45869q2206R3520j22231p923K05188o7018j22114
$$ plain form
124 -73412 39839 23561 -82734 -14023 6091 -7388 91670 29172 -107439 -2370 52072
135 52072 -62755 -7835 81660 1917 -13945 3862 -64313 -11832 83354 13749 -24976 17604
147 17604 -22198 -34153 11067 1065 33221 57004 -57781 -75832 40998 24333 -11075 40792
159 40792 -17971 -55032 40376 -8409 -73732 75093 79256 -90842 -29206 60764 -37950 -10133
171 -10133 61102 -47049 -23310 97070 -25469 -97791 59917 54841 -57089 8547 32385
182 32385 -46121 -1728 36484 -26998 -857 49889 -15191 -55920 -4802 36578 23320 -24280
194 -24280 -21224 30213 -4168 -48685 25174 42087 -30028 1211 16793 -56143 12127 84610
206 84610 -47036 -64944 79548 22679 -76454 26430 41478 -50588 12973 42623 -56420
$$ packed form
124g3412J13251j6278j06295O8711K0114j3479R9058o2498j36611J05069N4442
135E2072j14827N4920Q9495p9743j5862J7807o8175N2481R5186o9605l8725M2580
147A7604l9802j1955M5220j0002L2156K3783j14785j8051J16830j6665l5408N1867
159D0792n8763l7061R5408m8785o5323J48825M163j70098O1636Q9970r8714K7817
171a0133P1235j08151K3739J20380j22539p2322J57708n076j11930O5636K3838
182C2385p8506M4393L8212o3482K6141N0746o5080m0729N1118M1380j3258m7600
194b4280L056N1437l4381m4517P3859J6913p2115L1239J5582p2936O8270P2483
206H4610j31646j7908J44492n6869r9133J02884J5048r2066O3561K9650r9043
$$ plain form
217 -56420 -7928 73559 -30407 -66856 47451 45910 -39392 -28520 9404 9578 8410 579 -10123
230 -10123 -7311 3199 10913 -8431 -19053 30048 27463 -52020 -21439 61611 3760 -42781 23495
243 23495 9923 -31889 29601 17963 -50988 18081 51657 -53453 -34306 65652 8690 -51627
255 -51627 5247 13712 -10231 20285 -448 -42838 9374 41220 -17084 -31394 17440 23290
267 23290 -13891 -22851 10390 29153 -1486 -21464 -3231 3247 11857 24328 -16976 -37379 30378
280 30378 36646 -41679 -21003 42675 -969 -34817 10190 12943 -7432 9260 -7991 -30116
292 -30116 17194 31857 -23306 -25083 20509 14037 -14448 -7330 10148 10897 -2245 -12943 -3770
305 -3770 13945 18447 -2636 -28514 -7869 36732 15285 -36175 -10024 30408 -936 -21289
$$ packed form
217e6420M8492Q1487j03966l6449J14307j541q5302J0872L7924J74j168p831j0702
230a0123K812J0510P714j9344j0622M9101k585p9483L0581Q3050n7851m6541O6276
243B3495j3572m1812O1490j1638o8951O9069L3576j05110J9147R9958n6962o0317
255e1627N6874Q465k3943L0516k0733m2390N2212L1846n8304j4310M8834N850
267B3290l7181q960L3241J8763l0639j9978J8233O478Q610J2471m1304k0403O7757
280C0378O268p8325K0676O3678m3644l3848M5007K753k0375J6692j7251k2125
292c0116M7310J4663n5163j777M5592o472k8485P118J7478P49j3142j0698R173
305c770J7715M502k1083k5878K0645M4601k1447n1460K6151M0432l1344k0353
$$ plain form
317 -21289 5224 4642 -4126 7413 -11371 -20920 26947 28115 -37320 -30919 31757 19347 -22714
330 -22714 -4810 12967 -3939 1224 11275 -10386 -8816 21797 2640 -31251 7551 42021
342 42021 -8106 -38293 9452 24699 -11660 -9491 8704 -5104 -3255 9998 -12253 -12795 26719
355 26719 9810 -40747 -9168 41292 5451 -32025 -1734 12563 -3931 9467 10037 -21267
367 -21267 -2787 31726 -9506 -33830 24626 31539 -31004 -20790 29814 10370 -12402 3390
379 3390 -9978 -16308 22666 13675 -31751 -4430 32773 -8101 -30469 14749 21889 -18247 -17302
392 -17302 9195 6241 1288 10028 -4184 -19080 8860 21813 -15456 -17125 28001 13808 -32892
405 -32892 -5518 30797 1255 -13971 1239 -9528 -542 28694 -5823 -38050 12107 30703
$$ packed form
317b1289K6513n82q768J1539j8784r549M7867J168o5435O401O2676j2410m2061
330b2714J7904J7777j6906N163J0051k1661J570L0613j9157l3891L8802L4470
342D2021n0127l0187M7745J5247l6359K169J8195j3808J849J3253k2251n42L9514
355B6719j6909n0557L1579N0460l5841l7476L0291J4297j6494J3398N70l1304
367b1267J8480L4513m1232k4324N8456O913o2543J0214N0604j9444k2772J5792
379C390j3368o330L8974q991m5426K7321L7203m0874k2368M5218P140m0136R45
392a7302K6497k954m953Q740j4212j4896K7940J2953l7269j669M5126j4193m6700
405c2892K7374L6315k9542j5226J5210j0767Q986K9236l4517l2227N0157J8596
$$ plain form
417 30703 -20281 -19919 19011 6443 -13788 -1047 2441 237 6833 -3709 -15807 1482 22043
430 22043 10351 -17665 -16175 14833 14404 -14900 -3085 20969 -2164 -17886 2468 4967 4062
443 4062 15208 -11792 -29949 14173 25194 -20017 -12646 23077 1989 -20311 -4213 3970 5950
456 5950 9837 -7321 -14756 7732 14293 -5885 -15325 357 24692 13415 -25330 -17470 19344
469 19344 7718 -8291 10042 2365 -12021 6299 -5426 -21668 27196 33798 -37386 -32503 27697
482 27697 7869 -18241 15179 11773 -20109 -4510 2773 -14980 8281 31329 -4826 -30951
494 -30951 873 22845 -3461 -17548 13342 22839 -11953 -18051 4552 -1057 3951 24949 -8396
507 -8396 -29716 21350 13768 -46107 110 56216 -4650 -35020 5146 -11211 -14527 40859 13895
$$ packed form
417C0703n0984L62L8930j2568k0231J2741L488k204O596j0542j2098J7289K0561
430B2043j1692k8016J490L1008m29k9304J1815K4054k3133j5722K0354K499r05
443D062J1146k7000j8157M4122J1021m5211P371L5723k1088k2300J6098Q183J980
456E950L887j7158p435K2488O561k0178r440J5682K4335j1277l8745P860L6814
469A9344j1626j6009J8333p677j4386J8320j1725j6242M8864O602p1184M883O0200
482B7697j9828k6110L3420l406l1882J5599P283j7753K3261K3048l6155k6125
494c0951L1824K1972k6306j4087L0890R497l4792o098K2603n609N008K0998l3345
507h396k1320N1066p582n9875M6217N6106o0866l0370M0166j6357l316N5386k6964
$$ plain form
520 13895 -40407 8136 22872 -40971 -13939 51066 12136 -24950 1613 -5926 -17501 20877
532 20877 21019 -17954 -1625 23038 -15355 -33931 16691 36901 -8918 -21714 10184 280 -22142
545 -22142 5270 16378 -6955 9993 14274 -39188 -27046 41088 17919 -25690 11103 13118
557 13118 -31131 -8183 18272 -2261 17786 26466 -37399 -37344 32870 21883 -17218 9076 12154
570 12154 -19663 -7320 3614 -8586 13884 25096 -15836 -26268 5960 8276 -6983 830
582 830 11499 5528 -8686 -16460 -6435 9722 14241 7019 -7224 -9693 3049 -1952 -12461 12172
596 12172 28831 -2811 -24284 -10046 3264 13066 13658 -7566 -7485 8692 -10696 -19766 15789
609 15789 20837 -5757 -5605 -8981 -17084 13332 20602 -18949 -8819 25817 -3988 -26401 5893
$$ packed form
520A3895n4302M8543J4736o3843K7032O5005l8930l7086K6563p539j1575L8378
532B0877J42l8973J6329K4663l8393j8576N0622K0210m5819j2796L1898r904k2422
545b2142K7412J1108k3333J6948M281n3462J2142O8134k3169m3609L6793K015
557A3118m4249K2948K6455k0533K0047Q680o3865N5P0214j0987l9101K6294L078
570A2154l1817J2343J0934j2200K2470J1212m0932j0432L2228K316j5259P813
582H30J0669n971j4214p774J0025J6157M519p222j4243k469J2742n001j0509K4633
596A2172J6659l1642k1473J4238J3310R802N92k1224Q1J6177j9388r070L5555
609A5789N048k6594J52l376q103L0416P270l9551J0130L4636k9805k2413L2294
$$ plain form
622 5893 12692 -1027 9635 -259 -18613 5152 13980 -13720 -2529 26446 2415 -24304 -6256
635 -6256 9586 3955 4640 3692 -6880 -6207 1361 -4245 -6376 13034 17046 -16102 -24906 9665 17324
650 17324 -6373 -2447 5666 -7556 26 8939 -13637 -4289 30177 787 -32558 7809 25606
663 25606 -14236 -12475 15055 1549 -4465 9068 -10650 -17548 18675 17039 -19808 -9954 15687
676 15687 -1723 -15080 4713 10744 -2480 -3590 -2588 -8126 3436 17800 -2175 -19695 5957
689 5957 18737 -12403 -14923 20358 12962 -18219 -6011 10105 -1060 2848 6798 -14965 -7096
702 -7096 23093 2481 -25255 1552 18773 -5670 -10572 4450 393 -935 3555 -6882 -6661
715 -6661 15263 9606 -18975 -12164 17110 13197 -10960 -8319 7473 3653 -3617 445 1327 676
$$ packed form
622E893O799j3719J0662r894j8354K3765Q828k7700J1191K8975k4031k6719J8048
635f256J5842n631O85r48j0572O73P568n606k131J9410M012l3148q804L4571P659
650A7324k3697L926Q113j3222P582Q913k2576R348L4466k9390l3345M0367J7797
663B5606l9842J761K7530j3506o014J3533j9718o898L6223j636l6847R854K5641
676A5687j7410j3357J9793O031j3224j110J002n538J1562J4364j9975j7520K5652
689E957J2780l1140k520L5281p396l1181J2208J6116j1165L908L950k1763P869
702g096L0189k0612k7736K6807J7221k4443m902J5022m057j328M490j0437K21
715f661K1924n657k8581O811K9274l913k4157K641J5792l820p270M062Q82o51
$$ plain form
729 676 5815 -1765 -12612 3745 16852 -6199 -17450 7097 12189 -6989 -5351 3250 -2083 -376
743 -376 3560 -7088 -4017 14121 2825 -19460 -3679 20681 6547 -16567 -7545 11238 7567
756 7567 -3885 -3772 908 2157 3230 -1878 -7080 4498 12328 -6670 -15767 6454 14817 -5030
770 -5030 -11075 -69 2434 2569 2507 -7215 -5937 9892 3721 -13698 -1163 15466 -304 -14468
784 -14468 1024 10964 1290 -3832 -1754 -1617 3940 6630 -4415 -6511 8526 6918 -13151 -7010
798 -7010 14534 6706 -11814 -6193 4031 2587 3566 -147 -12028 -3063 15122 972 -16745 2217
812 2217 15435 -5838 -12822 6841 9560 -2990 -3635 -1580 -1223 7580 7242 -9157 -7636 10767
826 10767 6481 -9895 -2603 9232 -290 -7558 -103 3226 1016 1317 -4212 -8133 4411 10422
$$ packed form
729F76N139p580j0847J6357J3107k3051j1251K4547N092j9178J638Q601n333J707
743c76L936j0648L071J8138j1296k2285J5781K4360j4134k3114R022J8783l671
756G567j1452J13M680J249J073n108n202J1578P830j8998r097K2221Q363j9847
770e030o045J1006K503J35o2r722J278J5829o171j7419J2535J6629j5770j4164
784a4468J5492R940r674n122K078J37N557K690j1045k096J5037j608k0069O141
798g010K1544p828j8520N621J0224j444R79l713j1881Q965J8185j4150j7717J8962
812B217J3218k1273o984J9663K719j2550o45K055L57Q803l38j6399J521J8403
826A0767m286j6376P292J1835r522p268P455L329k210L01n529l921J2544O011
$$ plain form
840 10422 -6067 -11577 6569 8761 -8414 -6199 8393 5054 -4890 -4230 -1225 4028 9211 -1246
854 -1246 -13136 446 15529 1364 -12046 -308 7542 -503 -3431 28 -7 1937 1530 -7374
868 -7374 -5011 9988 6441 -11826 -8676 9135 6206 -6491 -4175 3211 1926 -644 -1518 -929 4057
883 4057 5360 -5179 -7810 6768 10949 -4826 -9485 3588 6922 -1663 -2808 -213 682 2629
897 2629 -523 -7589 -242 11638 425 -15224 -3254 13640 4067 -10335 -5293 4075 4894 1200
911 1200 -4642 -4022 4782 5764 -5242 -5321 7804 6809 -7126 -7022 5032 7390 -4 -4296 -3389 1386
927 1386 5903 -139 -7410 966 8147 -4289 -10645 4019 9745 -2675 -7746 -1582 2460 4786
941 4786 1333 -7620 -2620 10422 2377 -11541 -436 11696 703 -8335 -448 5331 2928 -309
$$ packed form
840A0422j6489n510J8146K192j7175K215J4592l339r944O60L005N253N183j0457
854a246j1890J3582J5083j4165j3410J1738P850q045k928L459l5J944m07q904
868g374K363J4999l547j8267L150J7811k929j2697K316P386j285k570q74N89M986
883D057J303j0539k631J4578M181j5775m659J3073L334q585j145K595Q95J947
897B629l152p066P347J1880j1213j5649J1970J6894r573j4402N042R368Q19l694
911A200n842O20Q804R82j1006p9J3125r95j3935J04J2054K358p394m292R07M775
927A386M517o042p271Q376P181j2436o356J4664N726j2420n071O164M042K326
941D786l453q953N000J3042q045j3918J1105J2132j0993r038P887N779k403l237
$$ plain form
955 -309 -5505 -4163 7780 9140 -7086 -12647 3862 10906 -2750 -7951 2537 5104 -4288 -5732
969 -5732 929 4273 4058 -1941 -9406 -1846 10654 2295 -8832 1646 7846 -3279 -5338 2493
983 2493 2834 2833 2538 -6342 -4553 9066 4047 -10649 -2940 10610 3068 -8772 -5114 2666 4007
998 4007 817 -2821 -2815 2213 2317 -5624 -6397 8139 12069 -6611 -14541 2419 9939 -91 -1034 1885
1014 1885 -3193 -676 3661 -4021 -1847 11753 3669 -13295 -3429 8981 1305 -4451 854 2451
1028 2451 486 -2552 -6038 -1158 7220 3272 -5931 -3789 3266 1567 -5081 -3175 8043 7592 -5520
1043 -5520 -8383 175 3531 4604 4341 -3960 -3744 5345 -1412 -9543 6060 14145 -3917 -11595 -1195
1058 -1195 2722 3483 3296 -3926 -4552 5439 1266 -9417 -2218 10054 3848 -7340 -4441 4299 1554
$$ packed form
955c09n196J342J1943J360j6226n561J6509P044j3656n201J0488K567r392j444
969e732O661L344k15n999p465P560J2500q359j1127J0478O200j1125k059P831
983B493L41jk95q880J789J3619n019j4696P709J3550p542j1840L658P780J341
998D007l190l638ON028J04p941p73J4536L930j8680p930J6960P520j0030r43K919
1014A885n078K517M337p682K174J3600q084j6964R866J2410p676n756N305J597
1028B451j965l038l486M880Q378l948r203K142P055j699o648J906J1218m51j3112
1043e520k863Q558L356J073k63q301K16R089o757q131J5603Q085j8062p678J0400
1058a195L917P61j87p222o26R991m173j0683P199J2272o206j1188K899Q740k745
$$ plain form
1073 1554 -4797 727 5985 292 -818 -285 -6596 -478 13515 1484 -11816 4222 8118 -10919
1087 -10919 -5434 12445 3560 -4230 -45 -8127 -5667 13327 5507 -13637 -451 10828 -6393
1100 -6393 -10272 6081 7592 -1928 -2996 -2194 -1665 3440 4632 -2924 -4741 5890 7876 -7360 -9787
1115 -9787 7583 9163 -5408 -2389 4005 -3097 -1883 3443 -3561 164 10468 -4776 -14667 5509
1129 5509 11219 -5996 -4783 5161 -794 -3408 118 -1459 2478 6910 -2895 -8601 1442 7702
1143 7702 2361 -4613 -4205 4817 6328 -5068 -5804 4808 4131 -1574 -1481 -3139 487 7222 -3857
1158 -3857 -10470 7065 10852 -8699 -8747 4721 3326 -559 894 -3237 -2313 4890 72 -5204 2302
1173 2302 6221 -730 -5405 -2115 5797 5118 -4875 -4623 4806 2691 -3112 -1018 -220 1415 3935 -4668
$$ packed form
1073A554o351N524N258n693j110N33o311O118J3993j2031j3300J6038L896j9037
1087a0919N485J7879q885p790M185q082K460J8994p820j9144J3186J1279j7221
1100f393l879J6353J511r520j068Q02N29N105J192p556j817J0631J986j5236k427
1115i787J7370J580j4571L019O394p102J214N326p004L725J0304j5244r891K0176
1129E509N710j7215J213R944n955k614L526j577L937M432r805n706J0043O260
1143G702n341o974M08R022J511j1396p36J0612o77n705R3j658L626O735j1079
1158c857o613J7535L787j9551m8J3468j395l885J453m131R24P203m818n276P506
1173B302L919o951m675L290P912o79r993K52R429k115n803K094P98J635K520q603
$$ plain form
1189 -4668 -7185 7971 7183 -10742 -5931 8005 1855 -2381 -61 -5076 -290 9251 -1480 -9354
1203 -9354 4691 7138 -5351 -3922 4280 3198 925 -2372 -4432 2474 6880 -1024 -5989 -1053
1217 -1053 4511 3175 -4633 -4431 6119 3008 -8766 -1845 7226 -849 -3760 1050 -2501 -557 7100
1232 7100 -2439 -8528 5550 6554 -6433 -2780 5833 1779 -1359 -1723 -2257 4608 6238 -4749 -7274
1247 -7274 4076 6451 -998 -4864 -1790 4303 2508 -4699 -2435 4393 320 -3216 -1075 -919 2491
1262 2491 4182 -5576 -6490 7083 5445 -6294 -1562 3979 -1093 28 1234 -2872 2054 5950 -5283
1277 -5283 -5750 7500 4831 -5993 -3234 3084 2207 -217 -2671 -1781 2950 770 -4267 -1783 2451
1292 2451 2520 -915 -5837 -2051 7452 3122 -7134 -2926 4506 1591 6 -1126 -3026 3209 5161
$$ packed form
1189d668k517J5156p88j7925M811J3936o150m236K320n015M786R541j0731p874
1203i354J4045K447j2489J429Q202j082k273l297k060O906M406p904m965M936
1217a053N564j336p808K02J0550l111j1774O921R071q075k911M810l551J944P657
1232G100r539o089J4078J004j2987L653Q613m054l138l64n34O865J630j0987k525
1247g274J1350K375p449l866L074O093j795p207K264O828m073l536K141J56L410
1262B491J691r758r14J3573j638j1739M732N541n072J121J206m106M926L896j1233
1277e283m67J3250k669j0824K759O318q77k424k454Q90M731k180n037K484M234
1292B451O9l435m922L786R503m330j0256M208P432k915j585j132j900O235J952
$$ plain form
1307 5161 -5338 -4150 8072 2798 -7766 -1263 4696 1276 -525 -1989 -2969 2456 3345 -3164 -3322
1322 -3322 2706 2250 -2731 -3255 1165 4768 -431 -5755 -28 4814 1133 -1787 -1535 -870 4356 3132
1338 3132 -6012 -1946 8883 242 -8974 1193 7233 -371 -3094 -1744 -2126 3836 4936 -5598
1352 -5598 -6060 5249 4392 -4521 -3309 2791 1852 -1837 -2437 219 2566 1606 -1608 -3539 346 6213
1368 6213 1429 -7464 -693 8156 -650 -6930 3017 5261 -2802 -2256 540 -791 2745 2638 -5891
1383 -5891 -3686 6895 2582 -6688 -2013 4129 817 -2294 -1556 53 2583 1405 -3950 -3803 4732
1398 4732 6066 -3252 -7037 2452 7298 -1049 -5166 886 2838 -249 -8 -1045 -1240 3601 1342
1413 1342 -6414 -1174 7546 154 -7082 -240 4013 -899 -1271 283 -1296 641 2555 -2660 -3483
$$ packed form
1307E161j0499J188J2222n274j0564O503N959l420j801j464r80N425Q89o509j58
1322c322O028m56m981n24M420L603n199n324N727M842l681k920K52O65N226j224
1338C132r144M066J0829q641r216J0167O040p604k723J350l82N962J100j0534
1352e598m62J1309q57q913J212O100r39l689o00K656K347r60l214j931L885N867
1368F213m784q893O771Q849q806o280R947K244q063N46K796j331L536j07q529
1383e891K205J0581m313r270M675O142l312l111P38J609K530j178n355J47Q535
1398D732J334r318l785R489M846q347m117O052J952l087K41j037j95M841k259
1413A342p756N240Q720p392p236O842M253m912l72J554j579J937J914n215q23
$$ plain form
1428 -3483 4684 4163 -5330 -4479 5536 5275 -4018 -3614 2793 3162 149 -1067 -1530 587 3250 -539
1444 -539 -4943 1204 5702 -1833 -6825 378 5470 793 -2884 -2743 -643 2891 2350 -3534 -3036 4013
1460 4013 2847 -4607 -2065 5338 2393 -3759 -1904 2291 1673 131 -810 -1712 849 3275 -1893 -4427
1476 -4427 2408 4406 -3266 -4604 2812 3439 -2822 -3063 450 1098 1641 608 -4482 -3033 5515 3028
1492 3028 -6100 -1525 6773 -191 -6575 811 5197 763 -763 -1175 -2975 2052 5762 -2512 -5419
1507 -5419 3887 4202 -4582 -2664 3769 1223 -1982 -483 -708 -790 2374 175 -4219 581 5735 -1543
1523 -1543 -6541 1492 5756 -1588 -3007 2678 1307 -1669 128 -950 -651 5721 2588 -7930 -3403
1538 -3403 7377 1770 -4581 971 2061 -2180 -714 -298 -2085 3039 4333 -5538 -5857 4606 4024
$$ packed form
1428c483Q167n21r493Q51J0015k61r293M04O407L69l013j216m63K117K663l789
1444e39m404O147M498p535m992P203N092m677l677J41K100L534n41n884M98P049
1460D013j166p454K542P403k945o152J855M195o18j542r41r02K561K426n168k534
1476d427O835J998p672j338P416O27o261k41L513O48N43j033n090J449Q548k487
1492C028r128M575Q298o964o384P386M386m434j526m12j800N027L710q274k907
1507e419R306L15q784J918O433k546l205J499k25q2L164k199m394M800N154p278
1523a543m998Q033M264p344j419N685j371k976J797j078K99O372l133j0518M527
1538c403J0780n607o351N552J090m241J466M16j787N124J294r871l19J0463n82
$$ plain form
1553 4024 -4066 -2645 2916 2278 -1107 -2480 -1404 1629 3747 40 -3276 397 3249 -1138 -3797
1568 -3797 2786 5353 -1543 -4069 -260 849 1257 1989 -1938 -2180 2935 -268 -6005 206 6680 747
1584 747 -5151 -2387 867 2894 1330 -3627 -1199 4592 926 -5091 -732 3889 1831 -700 -1786
1599 -1786 -767 2837 991 -3631 -975 4369 1791 -3249 -3396 178 3308 1472 -2845 -1573 1949
1614 1949 126 -2708 -1182 2766 2487 -1941 -4164 66 3899 531 -2439 -82 1756 704 -1815
1629 -1815 -2129 2034 4817 -1599 -4651 1817 3773 -1315 -1765 -559 -159 3428 1550 -6326 -2338 6210
1645 6210 836 -5612 212 3078 -1089 -1813 -989 -42 3083 1323 -4893 -2051 5109 2374 -2978 -1325
1661 -1325 1981 1268 -728 -1103 535 1764 611 -1776 -1997 1080 3369 -1578 -4576 1698 4061 -2697
$$ packed form
1553D024q090J421N561o38l385j373J076L033K118l707l316L673K852m387k659
1568c797O583K567o896k526L809J109M08P32l927k42N115l203n737O211O474n933
1584G47n898K764L254K027j564m957K428N791l666o017M359M621k058k531j086
1599a786J019L604j846m622K656N344k578n040j47L574L130j836m317J272L522
1614A949j823k834J526L948k79m428k223M230L833l368k970K357J838j052k519
1629a815l14M163K783o416l052O468J956n088m50J206M00L587j878p876L988Q548
1645F210n374o448N824K866m167p24Q24R47L125j760o216K842P160k735n352J653
1661a325L306p13j996l75J638J229j153k387k21L077K289m947k998O274K363o758
$$ plain form
1677 -2697 -3429 2089 1022 -1166 16 -1399 -629 4217 -38 -6526 1235 7483 -1461 -5490 1398
1692 1398 2625 -227 574 -906 -1755 1866 1988 -2806 -1696 3485 2160 -3310 -2879 2554 2812 -2424
1708 -2424 -2874 627 1243 206 -565 -2060 18 3183 -1104 -4258 2412 4416 -3351 -3229 3213 1533
1724 1533 -1074 800 -991 -1195 3291 857 -4008 335 4550 -951 -4088 421 3212 860 -2398
1739 -2398 -2182 1004 2831 564 -2645 -2236 1903 3195 -2062 -3696 2866 3243 -3284 -2199 3054 986
1755 986 -1268 57 -1050 -230 3610 562 -4195 539 4419 -1266 -2951 1220 1934 -539 -1642 -1019
1771 -1019 1055 1995 -951 -3128 -441 3074 801 -3044 -1979 3116 2065 -3509 -1537 3443 1075
1786 1075 -2286 -573 100 1039 2734 -1140 -4551 1681 5430 -1511 -4030 1291 2575 -423 -1105 -464
$$ packed form
1677b697p32N518j067k188J182j415P70M846m255o488P761O248q944m029O888
1692A398J227k852Q01j480q49L621J22m794J110N181j325n470M31N433K58n236
1708b424m50L501O16j037p71j495K078L165m287l154O670K004p767J22O442j680
1724A533k607J874j791k04M486k434m865M343M215n501l137M509K791k352l258
1739b398K16L186J827k267l209M09M139J292n257j634O562L77o527J085N253k068
1755I86k254J325j107Q20L840l048m757M734L880n685j685M171P14k473j103O23
1771a019K074R40k946k177K687L515k273l845J065N095j051n574J972M980k368
1786A075l361J713O73R39J695l874l411O232L749o941k519N321J284k998o82O41
$$ plain form
1802 -464 236 1701 -499 -3214 -146 3349 -195 -3924 -803 3236 1046 -3035 -771 2361 -45
1817 -45 -1254 5 133 1005 2097 -1750 -2888 3251 3842 -3316 -3127 2948 1842 -1640 -644 -37 363
1834 363 1990 -975 -3498 1296 4172 -2057 -4863 1349 4234 -442 -3251 -845 1697 1222 -397
1849 -397 -1222 -724 1194 1722 -1525 -2283 2515 2718 -2635 -2020 2760 1813 -1544 -1314 -224 823 1211
1866 1211 -1113 -2334 1324 2589 -2302 -2754 1926 2275 -1258 -2291 68 1644 992 -1099 -1790 495
1882 495 2606 223 -2526 -178 2937 809 -2892 -386 2957 1316 -1807 -1538 -131 2132 1923 -2016
1898 -2016 -3292 2368 2933 -2559 -2220 2060 1541 -1958 -1088 747 683 412 -596 -1602 616 2330 -366
1915 -366 -2378 166 2570 3 -1893 -18 2108 816 -2028 -1184 1394 1836 -483 -2853 -721 2814
$$ packed form
1802d64P00J465k200k715L068L495l544l729L121M039k190m081K264L132k406
1817d5j209J259J28Q72J092l847j138O139N91p158J89O075j106l482R96O07M00
1834C63J627k965k523M794K876o229k806O212K885m676k809K406K542m75j619
1849c97q25M98J918N28l247p58M798K03n353O15M780r47l357K30J090J047L88
1866A211k324j221L658J265m891m52M680L49l533j033K359J576o52k091o91K285
1882D95K111k383k749K348L115k128l701K506L343j641l123K69J407K263k09l939
1898b016j276N660N65n492L39M280n19l499Q70J835o4k71j008j006K218J714k696
1915c66k012K544K404k567j896J875K126j292k844Q44K578M42k319k370K132L535
$$ plain form
1931 2814 1088 -2473 -1572 1823 940 -1343 -1090 378 1310 307 -2265 -1320 2330 2259 -2013 -2203 1047
1948 1047 2324 -133 -1717 -179 1382 1060 -650 -1333 651 1839 -508 -2452 321 2673 -284
1963 -284 -2577 -105 2107 125 -1648 -667 580 656 -353 -1499 -416 2157 749 -2633 -1572 2387
1979 2387 2423 -1238 -1848 145 1644 1099 -1060 -1407 1644 1758 -1859 -2173 1816 2679 -1527 -2879 524
1996 524 1661 390 -1103 -1401 134 1597 -281 -2638 -463 2550 386 -2258 -176 1840 8
2011 8 -850 -364 653 1468 434 -2156 -1119 2609 1762 -2544 -1031 2512 467 -2706 -746 1757 1558
2028 1558 162 -1910 -2206 1420 2744 -1376 -2791 1128 2202 -1729 -2111 999 1630 378 -681 -1445
2044 -1445 110 2234 375 -2536 -221 3289 788 -3238 -930 2334 1350 -1224 -838 479 495 -108
$$ packed form
1931B814j726l561R01L395q83k283K53J468R32j003k572R45L650p1m272j90L250
1948A047J277k457j584J538J561l22j710o83J984J188k347j944K773K352k957
1963b84k293K472K212j982j773R81J247P6j009j146J083K573j408l382J061L959
1979B387L6l661o10J993J499n45k159l47L051J14l617l14L989Q63m206j352L403
1996E24J137j271j493k98J535J463j878k357K175L013k164k644K082K016j832
2011Hq58M86J017Q15j034k590J037L728q47m306J513L543k045l173J960K503j99
2028A558j396k072k96L626J324m120j415L919J074l931l82L110O31j252j059p64
2044a445J555K124j859k911K315L510k501m026K308L264r84k574L86J317J6o03
$$ plain form
2060 -108 -1169 -199 1781 790 -2213 -2105 1387 1782 -796 -1405 262 853 -345 -1318 -546 2048 2166
2077 2166 -1538 -2835 985 3167 -188 -2417 69 2188 876 -1921 -1215 1101 1707 -5 -1802
2092 -1802 -642 1240 891 -2143 -1275 2209 1205 -2496 -1843 1107 1219 -31 -379 -851 -170 1407 -174
2109 -174 -1695 951 2864 -1019 -3057 812 2768 -255 -1725 285 941 170 -651 -514 211 1611
$$ packed form
2060a08j061R70J980r91l003J08L492L95k578o09J667N91j198r73P72K594J18
2077B166l704j297L820K182l355k229K486K119j312k797P06K316O06j712j797
2092a802J160J882l49l034Q68L484j004l701O53K950J12j250l48m72O81J577j581
2109a74j521K646J913l883k038L869J956l023j470K010O56p71q21J37P25J400
$$ [...]
8191C0
##END NTUPLES=NMR FID
##END=
