##TITLE=1H_3MBDE1411
 CDCl3
 8 sc, 
 15.11.2022
##JCAMPDX= 6.0         $$ Bruker NMR JCAMP-DX V2.0
##DATA TYPE= NMR FID
##DATA CLASS= NTUPLES
##ORIGIN= UXNMR, Bruker Analytische Messtechnik GmbH
##OWNER= root
$$ XWIN-NMR		Version 3.5
$$ Tue Nov 15 14:14:43 2022 Russian Standard Time (UT+4h)  she@DPX200
##.OBSERVE FREQUENCY= 200.1313499994
##.OBSERVE NUCLEUS= ^1H
##.DELAY= (6, 6)
##.ACQUISITION MODE= SIMULTANEOUS
##.ACQUISITION SCHEME= undefined
##.AVERAGES= 8
##.DIGITISER RES= 18
##SPECTROMETER/DATA SYSTEM= spect
##.PULSE SEQUENCE= zg30
##.SOLVENT NAME= CDCl3
##.SHIFT REFERENCE= (INTERNAL, CDCl3, 0, 15.7039)
##AUDIT TRAIL= $$ (NUMBER, WHEN, WHO, WHERE, WHAT)
$$ ##TITLE= Audit trail, XWIN-NMR		Version 3.5
$$ ##JCAMPDX= 5.01
$$ ##ORIGIN= Bruker BioSpin GmbH
$$ ##OWNER= she
$$ F:/spectra/data/she/nmr/H-F/1/audita.txt
$$ ##AUDIT TRAIL=  $$ (NUMBER, WHEN, WHO, WHERE, WHAT)
(   1,<2022-11-15 14:13:26.09 +0400>,<she>,<DPX200>,
      <created by zg, POWCHK disabled, PULCHK disabled
       configuration hash MD5:
       00 E9 B6 7A A2 85 ED C7 34 08 36 98 17 FE 4E 26
       data hash MD5: 16K
       97 B5 72 6D 8E 4A BD 6F 1D 23 32 36 EB BE 5B 3F>)
$$ ##END=
$$ 
$$ hash MD5
$$ ED 8F EC 80 33 AD C6 1E D7 04 DC 29 AC F8 E7 33
##$RELAX= 
##$RELAX= 
##$RELAX= 
##$RELAX= 
##$RELAX= 
##$RELAX= 
$$ Bruker specific parameters
$$ --------------------------
##$DU= <F:/spectra>
##$EXPNO= 1
##$NAME= <H-F>
##$PROCNO= 1
##$TYPE= <nmr>
##$USER= <she>
##$AMP= (0..31)
100 100 100 100 100 100 100 100 100 100 100 100 100 100 100 100 100 100 
100 100 100 100 100 100 100 100 100 100 100 100 100 100 
##$AQSEQ= 0
##$AQ_mod= 1
##$AUNM= <au_zg>
##$AUTOPOS= <>
##$BF1= 200.13
##$BF2= 200.13
##$BF3= 200.13
##$BF4= 200.13
##$BF5= 200.13
##$BF6= 200.13
##$BF7= 200.13
##$BF8= 200.13
##$BYTORDA= 1
##$CFDGTYP= 0
##$CFRGTYP= 5
##$CHEMSTR= <none>
##$CNST= (0..31)
1 1 145 1 1 1 1 1 1 1 1 1 1 1 1 1 1 1 1 1 1 1 1 1 1 1 1 1 1 1 1 1 
##$CPDPRG= <>
##$CPDPRG1= <>
##$CPDPRG2= <>
##$CPDPRG3= <>
##$CPDPRG4= <mlev>
##$CPDPRG5= <mlev>
##$CPDPRG6= <mlev>
##$CPDPRG7= <mlev>
##$CPDPRG8= <mlev>
##$CPDPRGB= <>
##$CPDPRGT= <>
##$D= (0..31)
0 1.2 0 0 0 0 0 0 0 0.06 0 0.03 0 0 0 0 0.0002 0 0 0 0 0 0 0 0 0 0 0 0 
0 0 0 
##$DATE= 1668507205
##$DBL= (0..7)
120 120 120 120 120 120 120 120 
##$DBP= (0..7)
150 150 150 150 150 150 150 150 
##$DBP07= 0
##$DBPNAM0= <>
##$DBPNAM1= <>
##$DBPNAM2= <>
##$DBPNAM3= <>
##$DBPNAM4= <>
##$DBPNAM5= <>
##$DBPNAM6= <>
##$DBPNAM7= <>
##$DBPOAL= (0..7)
0.5 0.5 0.5 0.5 0.5 0.5 0.5 0.5 
##$DBPOFFS= (0..7)
0 0 0 0 0 0 0 0 
##$DE= 6
##$DECBNUC= <off>
##$DECIM= 32
##$DECNUC= <off>
##$DECSTAT= 4
##$DIGMOD= 1
##$DIGTYP= 9
##$DL= (0..7)
0 120 120 120 120 120 120 120 
##$DP= (0..7)
150 150 150 150 150 150 150 150 
##$DP07= 0
##$DPNAME0= <>
##$DPNAME1= <>
##$DPNAME2= <>
##$DPNAME3= <>
##$DPNAME4= <>
##$DPNAME5= <>
##$DPNAME6= <>
##$DPNAME7= <>
##$DPOAL= (0..7)
0.5 0.5 0.5 0.5 0.5 0.5 0.5 0.5 
##$DPOFFS= (0..7)
0 0 0 0 0 0 0 0 
##$DQDMODE= 0
##$DR= 18
##$DS= 0
##$DSLIST= <SSSSSSSSSSSSSSS>
$$ [...]
##$SUBNAM2= <"">
##$SUBNAM3= <"">
##$SUBNAM4= <"">
##$SUBNAM5= <"">
##$SUBNAM6= <"">
##$SUBNAM7= <"">
##$SUBNAM8= <"">
##$SUBNAM9= <"">
##$SW= 18.0517283424941
##$SWIBOX= (0..15)
0 0 2 0 0 0 0 0 0 0 0 0 0 0 0 0 
##$SW_h= 3612.71676300578
##$TD= 16384
##$TD0= 1
##$TE= 0
##$TE2= 300
##$TE3= 300
##$TEG= 300
##$TL= (0..7)
0 120 120 120 120 120 120 120 
##$TP= (0..7)
150 150 150 150 150 150 150 150 
##$TP07= 0
##$TPNAME0= <>
##$TPNAME1= <>
##$TPNAME2= <>
##$TPNAME3= <>
##$TPNAME4= <>
##$TPNAME5= <>
##$TPNAME6= <>
##$TPNAME7= <>
##$TPOAL= (0..7)
0.5 0.5 0.5 0.5 0.5 0.5 0.5 0.5 
##$TPOFFS= (0..7)
0 0 0 0 0 0 0 0 
##$TUNHIN= 0
##$TUNHOUT= 0
##$TUNXOUT= 0
##$USERA1= <user>
##$USERA2= <user>
##$USERA3= <user>
##$USERA4= <user>
##$USERA5= <user>
##$V9= 5
##$VALIST= <valist>
##$VCLIST= <CCCCCCCCCCCCCCC>
##$VD= 0
##$VDLIST= <DDDDDDDDDDDDDDD>
##$VPLIST= <PPPPPPPPPPPPPPP>
##$VTLIST= <TTTTTTTTTTTTTTT>
##$WBST= 1024
##$WBSW= 4
##$XGAIN= (0..3)
0 0 0 0 
##$XL= 0
##$YL= 0
##$YMAX_a= 215118
##$YMIN_a= -149855
##$ZGOPTNS= <>
##$ZL1= 120
##$ZL2= 120
##$ZL3= 120
##$ZL4= 120
##$ABSF1= 10
##$ABSF2= 0
##$ABSG= 5
##$ABSL= 3
##$ALPHA= 0
##$AQORDER= 0
##$ASSFAC= 0
##$ASSFACI= 0
##$ASSFACX= 0
##$ASSWID= 0
##$AUNMP= <proc_1d>
##$AZFE= 0.1
##$AZFW= 0.1
##$BCFW= 1
##$BC_mod= 2
##$BYTORDP= 1
##$COROFFS= 0
##$CY= 11.3945322036743
##$DATMOD= 1
##$DC= 2
##$DFILT= <>
##$DTYPP= 0
##$F1P= 2.36226072786647
##$F2P= -0.459571619588291
##$FCOR= 0.5
##$FTSIZE= 0
##$FT_mod= 4
##$GAMMA= 1
##$GB= 0.15
##$INTBC= 1
##$INTSCL= 1
##$ISEN= 128
##$LB= 0.24
##$LEV0= 0
##$LPBIN= 0
##$MAXI= 10000
##$MC2= 0
##$MEAN= 0
##$ME_mod= 0
##$MI= 1.114404
##$NCOEF= 0
##$NC_proc= 0
##$NLEV= 6
##$NOISF1= 3.799351
##$NOISF2= 2.8
##$NSP= 1
##$NTH_PI= 0
##$NZP= 0
##$OFFSET= 15.70392
##$PC= 1
##$PHC0= -17934.92
##$PHC1= 3.000696
##$PH_mod= 1
##$PKNL= yes
##$PPARMOD= 0
##$PSCAL= 0
##$PSIGN= 0
##$REVERSE= no
##$SF= 200.130013532006
##$SI= 16384
##$SIGF1= 3
##$SIGF2= 2
##$SINO= 400
##$SIOLD= 16384
##$SREGLST= <1H.CDCl3>
##$SSB= 0
##$STSI= 0
##$STSR= 0
##$SW_p= 3612.71676300578
##$SYMM= 0
##$S_DEV= 0
##$TDeff= 0
##$TDoff= 0
##$TI= <>
##$TILT= no
##$TM1= 0
##$TM2= 0
##$TOPLEV= 0
##$USERP1= <user>
##$USERP2= <user>
##$USERP3= <user>
##$USERP4= <user>
##$USERP5= <user>
##$WDW= 1
##$XDIM= 8192
##$YMAX_p= 0
##$YMIN_p= 0
$$ End of Bruker specific parameters
$$ ---------------------------------
##NTUPLES= NMR FID
##VAR_NAME=  TIME,          FID/REAL,        FID/IMAG
##SYMBOL=    X,             R,               I
##VAR_TYPE=  INDEPENDENT,   DEPENDENT,       DEPENDENT
##VAR_FORM=  AFFN,          ASDF,            ASDF
##VAR_DIM=   8192,          8192,            8192
##UNITS=     SECONDS,       ARBITRARY UNITS, ARBITRARY UNITS
##FACTOR=    0.0002768,     1,               1
##FIRST=     0,             0,               0
##LAST=      2.2672688,     0,               0
##MIN=       0,             -149855,         0
##MAX=       2.2672688,     215118,          0
$$ Real data points
##PAGE= N=1
##DATA TABLE= (X++(R..R)), XYDATA
0 0 0 0 0 0 0 0 0 0 0 0 0 0 0 0 -4 8 -8 8 -8 8 -16 16 -16 24 -24 32 -33 40 -48 52 -60 68 -76 87 -97 108
36 108 -123 138 -152 171 -188 208 -230 255 -280 311 -343 377 -414 457 -501 554 -611 674 -747
55 -747 830 -926 1036 -1166 1322 -1514 1757 -2069 2493 -3096 4020 -5588 8731 -17269 84755
70 84755 215118 -117951 -34414 143688 -121036 -129128 165345 41227 -107082 59794 25598
81 25598 -124484 14828 103620 -11882 -23838 28145 -30681 -63220 13618 67927 11116 -25684
93 -25684 22229 -12789 -82081 24252 83605 -36814 -16743 60294 -63869 -63719 98497 26517
105 26517 -61507 50463 -931 -107448 33674 78670 -40242 15330 45737 -78260 -36059
116 -36059 62300 -4165 -10716 41205 -22464 -41597 18526 10358 6420 21435 -16247 -17433 1533
129 1533 -22343 12006 45421 -14173 -14018 23697 -31700 -28029 45952 8542 -25011 23199 -6159
142 -6159 -39995 20029 24135 -12784 9993 -859 -31822 2141 17101 3782 17695 -847
154 -847 -24278 205 -3044 -6968 27664 2132 -27994 16104 4691 -28721 28692 24435 -41856
167 -41856 4627 27983 -40730 -2048 49509 -23771 -21439 40867 -17639 -38159 36820 10406
179 10406 -33036 22393 16632 -36446 1743 28544 -12271 -9113 15945 -5675 -19148 6020
191 6020 20022 -936 -13021 9628 5306 -24940 5037 30598 -20057 -18076 32053 -9004 -30903
204 -30903 34271 11177 -42656 17417 27235 -39531 1801 40271 -27697 -17566 40098 -10857
216 -10857 -32690 27896 9376 -30241 13359 21512 -22802 -7668 20722 -2727 -12583 10007
228 10007 7197 -14722 -5123 16924 646 -15714 9292 9011 -20945 2507 24090 -16031 -13557
241 -13557 24797 -6372 -22452 23881 7531 -29712 11131 19932 -23516 -649 23932 -15745
253 -15745 -12778 22037 -1162 -16253 11312 5477 -13639 3447 10738 -6962 -6642 6187 2471
266 2471 -5842 1869 8040 -6155 -8894 10455 4112 -13807 4652 10977 -15000 -2555 20084
279 20084 -7716 -14906 15694 1849 -17810 10896 11917 -17329 -1235 15875 -7514 -7376 12185
292 12185 -1950 -12061 7107 7970 -7532 -1012 7496 -4093 -6547 7181 3359 -10541 -624
305 -624 9509 -4805 -4770 11711 -591 -13605 6771 8637 -12335 -699 11937 -8694 -6699
318 -6699 14881 -108 -13125 7199 5459 -11974 3380 12351 -8921 -6480 11961 -746 -10644
331 -10644 7073 4812 -13215 -207 13526 -4265 -7694 10396 1580 -12618 4709 9563 -11367
344 -11367 -5528 11888 -1857 -8174 10117 4000 -12915 1884 10396 -7600 -4373 10786 -2747
357 -2747 -9532 9946 6249 -12488 -202 9409 -8794 -5038 14065 -813 -12591 8531 7601
370 7601 -12397 788 10880 -10606 -7422 13776 149 -10717 8368 5030 -12136 2507 10952
383 10952 -8628 -6171 10726 -379 -8163 8306 5386 -12320 -2004 10532 -4447 -7135 9910
396 9910 2088 -11823 5205 11293 -9805 -5441 10686 -5136 -10286 11679 4497 -12808 4550
409 4550 9390 -10748 -1846 11537 -6561 -7690 11458 1747 -9914 4909 5178 -8848 -297 8644
423 8644 -3917 -7111 4981 4117 -3884 1902 6249 -5265 -8206 4874 4114 -5937 2013 6057
437 6057 -7730 -3779 10316 -260 -7004 5818 442 -10125 4169 8333 -5952 -850 7219
450 7219 -5035 -6311 5925 1734 -4889 3063 4817 -4189 -3936 3793 2428 -3320 1147 4024 -6279
465 -6279 -6422 7601 4306 -5004 4681 2878 -13068 -1404 12360 -3152 -3730 10122 -5317 -13197
479 -13197 10131 8347 -9886 2727 7834 -12666 -5750 14314 1632 -8148 6872 3167 -13372
492 -13372 -1631 12023 -2022 -6229 8905 1022 -14445 2268 12545 -6415 -3198 12310 -7422
505 -7422 -15541 12297 8856 -11475 7075 9621 -19979 -6248 19450 -2924 -8163 15756 -2683
518 -2683 -21310 8558 13999 -10750 1492 12103 -13595 -11376 14374 3798 -8478 8293 4185
531 4185 -15721 -2477 12266 -2831 -4041 11322 -1485 -15554 3617 10153 -6899 1024 12440
544 12440 -8879 -13792 9578 5591 -7142 8286 7020 -15287 -5897 10547 -764 -966 10063
557 10063 -3749 -12779 2735 4996 -2171 5387 4222 -9083 -5231 4236 649 1036 5927 -826
571 -826 -7144 -1657 2115 348 2366 4071 -1280 -5290 -1798 1491 1294 2988 3297 -2401 -5216 -1362
587 -1362 1210 2295 4203 1222 -4423 -4262 -656 1852 3799 2957 -1123 -4114 -3646 568 4136 2180
603 2180 -4 27 -3737 -4453 3698 4786 -2053 393 2532 -5585 -3467 6417 1629 -3599 3786 1050
619 1050 -7802 -103 6022 -1910 -479 5425 -3791 -7008 4292 3046 -3563 3889 3431 -8581 -2829
634 -2829 7585 -743 -3013 6498 -955 -9779 2989 7248 -4474 -425 6681 -4927 -6686 6751
648 6751 2895 -6090 2965 4445 -6989 -1773 7316 -2185 -4760 6230 1039 -8239 2136 5780
662 5780 -5667 -869 8441 -3446 -7774 5873 2558 -7114 3953 6563 -7972 -3153 8106 -2022
676 -2022 -4646 6958 315 -8550 3158 5623 -5205 48 5985 -4564 -4613 6047 900 -5782
690 -5782 2759 3950 -5190 -1151 6070 -1889 -5541 4170 2971 -5910 363 5788 -4026 -3535 6896
705 6896 323 -6709 3283 3207 -6113 1429 6468 -4576 -3192 5710 -1480 -4369 4904 1110 -5937
720 -5937 1755 4084 -3372 -782 3797 -1814 -3178 2630 1734 -2857 -645 2571 -525 -2005 2367
735 2367 1491 -3872 -443 3991 -1571 -2119 3960 -645 -4606 3500 3048 -4897 276 3873 -4113 -1671
751 -1671 5774 -814 -4475 3002 1696 -4021 692 3407 -2415 -2590 2798 1494 -2674 12 2742
766 2742 -1691 -2383 3495 1236 -4331 1111 3600 -3404 -679 4791 -2846 -4024 4903 749 -4639
781 -4639 3405 2432 -5681 864 5074 -3592 -2289 4136 -1700 -3480 3855 1647 -3877 458 2467
796 2467 -2057 -888 2762 -356 -2854 1238 2435 -1829 -905 2786 -1203 -3141 3221 2005 -4262
811 -4262 664 3880 -3448 -1470 5240 -1647 -4830 3723 1742 -4561 1755 3413 -4056 -1186 4305
826 4305 -1114 -2858 2445 531 -2912 1215 2653 -1881 -1627 2043 171 -2106 1416 1912 -2733 -1033
842 -1033 3540 -365 -2726 2500 830 -4168 1191 3811 -3085 -1728 3794 -1291 -2946 3684 1047
857 1047 -4277 1094 2849 -2736 -427 3324 -1672 -2678 2787 1185 -2753 646 2061 -2135 -922
872 -922 3178 -82 -2969 1165 1712 -2343 -48 2865 -1710 -2508 2701 910 -2694 1189 1701 -2997
888 -2997 -384 3314 -1219 -2132 2355 80 -2672 1912 2069 -2927 -559 2895 -1132 -1697 2609 192
904 192 -3118 1182 2528 -2079 -956 2280 -988 -1991 2340 1237 -2637 -129 1806 -1323 -748 2276
920 2276 -331 -2538 968 1650 -1569 -80 2019 -1398 -1906 2388 943 -2450 810 1907 -2340 -496
936 -496 3081 -1098 -2362 2460 743 -2643 1302 1732 -2707 -259 2861 -1159 -1718 1796 -223 -2061
952 -2061 1598 1715 -2045 -945 1610 -451 -1227 1939 1038 -2811 -602 2713 -822 -1680 2765 335
968 335 -3806 1417 3097 -2900 -644 3505 -2009 -2578 3530 215 -3308 2179 1663 -3187 489 2261
984 2261 -2320 -572 2819 -656 -1781 1121 75 -1388 892 1579 -668 -1458 257 747 -573 492
1000 492 1801 -1323 -2188 1630 660 -1639 1878 1075 -3380 240 2537 -2208 -192 3238 -2162 -2318
1016 -2318 3143 -385 -2785 2722 1258 -3069 648 1557 -2168 -37 2256 -310 -764 205 -528 -210
1032 -210 493 802 739 -1113 -1330 892 31 -368 2155 -272 -2917 999 1027 -2046 1752 2174 -3329 -751
1050 -751 2573 -1880 -809 3275 -949 -2351 1932 86 -1894 1570 1120 -1210 253 99 -983 211
1066 211 521 611 664 -1169 -596 804 -1116 339 2768 -1619 -2261 2341 -662 -2300 3670 978 -4432
1083 -4432 1245 2272 -3529 871 3883 -2913 -1792 3114 -1199 -1940 2799 248 -2156 1163 618
1098 618 -1455 281 898 -19 -194 -283 331 -365 -1250 1563 1495 -2370 64 2034 -2803 -649 4277 -1411
1116 -1411 -3093 3269 -188 -3714 3199 2177 -4078 636 2639 -2921 -175 3191 -1553 -1497 1985
1131 1985 -379 -1280 1043 290 -646 66 220 369 -655 -918 1471 294 -1830 1440 934 -3216 910
1148 910 3107 -2760 -670 3411 -2515 -2142 4243 -376 -3233 2980 482 -3676 2258 2262 -3229 323
1164 323 2361 -2230 -582 2366 -822 -1316 1108 332 -699 -232 288 370 -872 -261 1736 -800 -1992
1181 -1992 2033 649 -2550 1669 1696 -3329 250 3086 -2155 -763 3004 -1796 -2011 3015 -82 -2133
1197 -2133 1975 275 -2241 1293 1167 -1561 250 640 -912 249 381 -409 305 -380 -366 1191 -534
1214 -534 -1087 1424 -332 -1492 2055 342 -2554 1392 1268 -2502 1088 2145 -2754 -377 2780 -1573
1230 -1573 -1080 2601 -887 -2073 1837 579 -1555 721 588 -1017 75 542 95 -154 -589 395 681
1247 681 -956 166 1220 -1463 -526 2185 -826 -1526 2050 -300 -2107 2144 876 -2656 916 1500
1263 1500 -2248 352 2174 -1793 -929 1857 -655 -951 1415 -175 -1172 602 385 -329 105 -90 9
1280 9 13 -269 587 246 -1104 469 1001 -1177 144 1460 -1464 -721 2067 -588 -1415 1736 -82 -1906
1298 -1906 1425 979 -1829 328 1119 -1316 -16 1308 -751 -690 710 -127 -280 424 -42 -244 -102
1315 -102 94 512 -137 -492 567 0 -741 897 529 -1378 320 1085 -1160 -4 1462 -1155 -839
1332 -839 1616 -294 -1129 1205 65 -1442 809 792 -1111 78 717 -712 -155 776 -210 -512 171
1349 171 135 -55 9 183 4 -471 33 690 -276 -426 622 -203 -741 876 354 -1158 300 734 -1019
1368 -1019 129 1159 -883 -683 1169 -163 -858 865 214 -1126 274 849 -538 -293 553 -148 -481
1385 -481 429 486 -480 -378 518 113 -544 372 449 -888 -210 1005 -354 -698 790 21 -1020 639 710
1404 710 -948 -94 781 -540 -335 898 -178 -764 509 391 -499 171 455 -480 -223 663 81 -509
1422 -509 180 225 -538 49 750 -379 -686 534 158 -686 438 581 -945 -307 917 -258 -642 730
1440 730 96 -971 351 804 -635 -311 765 -198 -585 630 323 -763 58 740 -356 -347 641 -71
1458 -71 -731 526 601 -683 -154 592 -429 -358 808 25 -891 207 411 -475 88 632 -498 -579 515
1477 515 199 -453 255 289 -648 -149 770 -93 -537 493 169 -781 278 805 -623 -410 867 -154 -819
1496 -819 693 420 -980 195 948 -698 -545 839 -63 -691 662 445 -938 -158 776 -218 -290 716
1514 716 -27 -987 252 831 -453 -242 749 -504 -915 865 593 -951 188 768 -988 -376 1210
1531 1210 -181 -896 794 263 -1136 316 867 -691 -195 938 -349 -808 646 325 -630 389 693
1548 693 -776 -577 737 104 -500 580 339 -1093 -208 946 -180 -396 740 -183 -1104 419 711
1565 711 -635 36 658 -720 -533 810 68 -523 520 221 -716 16 517 -283 -125 617 -49 -615 65
1584 65 365 -185 27 566 -152 -728 106 443 -251 86 535 -518 -703 501 302 -359 348 267 -751 -208
1604 -208 626 -71 -219 436 -69 -561 123 401 -196 -57 343 -126 -383 159 219 -229 50 371 -217 -414
1624 -414 208 153 -208 299 299 -494 -228 345 -50 -8 452 -128 -530 137 276 -174 158 281 -376 -316 341 130
1646 130 -229 115 154 -353 -219 360 22 -382 170 306 -399 -140 437 -191 -303 505 125 -576 140 324
1666 324 -378 33 556 -245 -388 334 102 -263 305 260 -416 -147 357 -45 -127 275 -24 -381 118 313 -218
1687 -218 -108 236 -187 -310 310 91 -446 152 262 -373 -12 400 -275 -313 463 101 -438 216 243 -439 15
1708 15 537 -169 -379 313 89 -340 222 385 -370 -215 406 -29 -332 331 141 -524 67 431 -295 -184
1728 -184 422 -159 -356 441 117 -478 112 309 -365 -21 370 -285 -246 340 32 -241 208 83 -298 57
1748 57 260 -107 -130 118 -17 -157 116 244 -161 -172 190 32 -191 176 147 -309 1 340 -108 -173 256 -58
1770 -58 -237 246 141 -258 23 148 -180 -21 205 -127 -201 70 73 -54 -31 83 -57 -167 135 230 -195 -117
1792 -117 237 -112 -197 350 75 -376 174 256 -283 47 383 -307 -210 434 -23 -305 249 77 -379 125 329
1813 329 -212 -166 220 -29 -204 146 150 -254 -135 217 27 -199 124 116 -306 -1 314 -161 -147 278 -124 -240
1835 -240 341 79 -365 176 219 -319 37 392 -268 -218 343 61 -276 155 136 -249 2 236 -19 -181 71
1856 71 104 -139 -30 239 -74 -314 156 194 -270 62 288 -317 -157 455 -58 -359 281 97 -405 137 316
1877 316 -297 -131 267 -98 -187 213 63 -228 18 193 -36 -56 138 -7 -124 87 158 -150 -82 180 -79
1898 -79 -141 263 20 -354 159 255 -315 3 300 -276 -233 348 17 -352 141 144 -329 3 318 -163 -163 205 -1
1921 -1 -189 145 136 -165 -72 211 40 -142 126 118 -212 -21 269 -77 -213 226 73 -250 128 207 -277 -83 287
1944 287 -72 -169 197 -8 -256 57 151 -108 -66 63 -79 -95 125 37 -154 -4 109 -81 -46 200 6 -216
1966 -216 64 192 -156 -1 268 -127 -224 273 96 -276 78 209 -224 -8 246 -119 -209 231 58 -201 118
1987 118 114 -247 28 263 -91 -129 168 -24 -236 181 176 -210 -89 199 -65 -145 187 63 -243 46 157 -125
2009 -125 -47 177 -89 -157 174 63 -178 102 117 -179 -1 167 -115 -116 148 21 -136 84 100 -163 0 180
2031 180 -17 -81 56 -22 -99 82 90 -79 -70 -11 -46 11 113 -17 -63 18 -22 -54 51 73 -84 -51 76 30 -50 39
2057 39 81 -60 -10 96 -14 -51 25 101 -14 -21 35 -51 -48 61 38 -9 -7 -53 -60 20 30 -9 -74 -77 -57 12 -8 43 47 -133
2087 -133 -37 83 -12 -62 101 -4 -130 73 77 -119 -4 102 -44 2 103 -59 -60 60 19 -4 74 -36 -100 26
2111 26 81 -58 17 29 -106 -55 86 66 -113 -36 92 -55 -89 139 19 -185 24 108 -136 -35 157 -107 -96
2134 -96 195 4 -192 116 80 -166 79 171 -134 -63 164 -42 -101 174 61 -105 39 86 -54 -7 61 -41 -82
2157 -82 10 56 -39 -22 78 -7 -60 77 -3 -163 32 101 -140 -40 144 -180 -125 217 12 -201 131 95 -207 46
2181 46 186 -103 -59 136 -60 -71 140 29 -83 39 33 -51 14 65 2 -75 27 67 -53 -35 92 -18 -99 117
2205 117 94 -130 -1 113 -116 -46 120 -81 -104 93 19 -88 74 6 -99 50 51 -88 3 20 -49 6 70 6
2229 6 -10 -9 6 47 0 -29 55 -22 -85 73 51 -79 13 75 -108 -24 104 -86 -52 83 -33 -92 56 -33 -106 32 10
2256 10 -36 -7 38 -49 3 43 16 -39 -41 41 26 -52 37 59 -87 -27 145 -13 -73 113 13 -110 100 67 -112 37
2282 37 93 -61 -8 105 -43 -56 79 1 -61 29 15 -89 -41 20 20 -41 -28 29 -17 -69 29 33 -84 -19 61 -41 -22 63
2310 63 -35 -45 78 6 -53 86 -7 -84 73 42 -51 27 22 -55 10 70 -12 -56 31 -7 -25 -8 16 -22 -38 -30 16 -41 -77 29
2340 29 -19 -67 30 15 -56 23 25 -73 -6 80 -42 -58 54 -9 -17 74 28 -62 4 50 -28 24 36 11 -13 -4 30 41 15 -30 12
2371 12 -10 -21 16 -29 -7 29 -32 -50 6 -34 -54 25 -14 -73 -16 33 -53 -9 60 -32 -42 40 1 -3 12 10 -23 27 27 10 40 22
2403 22 -27 10 27 9 2 1 23 10 -33 9 29 -48 -30 39 -11 -23 23 -7 -45 23 10 -62 -4 -21 -11 19 24 -46 2 31 -15 5
2435 5 1 -6 -29 20 19 19 -3 18 24 -4 6 39 29 -33 23 -3 -31 17 23 0 8 26 -35 -11 11 -6 -35 47 -40 -55 7 -2 -48 -3 18
2470 18 -26 -37 13 -4 -7 22 34 4 -11 4 21 2 -16 29 -7 14 16 -31 0 15 20 -12 26 29 0 2 29 1 -12 23 -25 -29 17
2503 17 -1 -10 -16 16 -26 30 -13 -11 -42 -23 -11 -28 -2 28 -42 -19 10 14 1 46 51 -33 -5 14 2 6 42 23 -20 26 35 -21 11 64
2537 64 21 -32 40 18 -5 29 32 -28 -9 20 -7 -17 26 -9 -40 6 15 -39 -17 15 -3 -45 11 20 -16 4 8 -7 -48 31 -1 -15
2569 -15 20 11 -22 -21 27 -20 9 -1 -23 -14 26 16 -50 21 33 -27 -11 31 -17 -20 7 19 -25 -12 22 -49 -1 8 11 -33 -20 6 -34
2602 -34 -16 11 -11 -16 14 16 6 9 10 3 -8 49 23 -1 59 51 -23 9 22 7 -1 41 21 -22 -19 5 -19 -8 14 -44 -42 4 0 -20 14
2637 14 8 -43 -2 -22 -31 -48 11 8 -63 1 22 -2 -1 35 -13 -29 22 5 -30 5 46 13 17 55 -13 0 35 52 17 11 20 -10 -9 36
2671 36 6 -23 -11 13 -24 1 21 0 -30 27 34 -27 36 28 -38 -22 50 -44 -51 24 2 -36 -7 36 -6 1 40 17 -24 13 8 -46 20
2704 20 36 -26 -30 38 30 -32 51 4 6 -14 46 -4 -20 22 -3 -40 31 19 -26 8 8 -29 3 -4 -28 -12 -16 -29 -19 -4 -17 4 2 4
2738 4 10 -23 46 8 -32 8 39 -16 -19 18 15 -12 44 41 8 4 31 31 2 36 25 -15 23 9 -17 -10 -3 13 -10 5 -4 -33 -12 16 -11
2773 -11 -13 9 2 -7 37 65 10 -11 27 21 -2 38 49 6 25 -5 -3 31 36 5 21 14 -4 -11 23 -7 1 4 20 -24 1 32 -31 -9 -25
2808 -25 6 5 -13 14 8 -39 -13 -2 -35 0 46 -27 -21 17 -32 -22 16 16 -58 40 65 -49 16 53 -22 19 16 32 -5 28 39 2
2840 2 -24 31 2 -22 21 23 -11 -18 26 -8 -22 26 -12 -25 37 -14 -28 -16 9 -46 -33 46 -10 -61 8 29 -41 7 23 -16 17 43
2872 43 7 -14 21 22 31 36 55 9 -7 27 41 -12 21 44 -42 -2 43 -9 -52 12 18 -63 5 51 -36 -32 7 -32 -52 21 -17 -32 19
2905 19 11 0 20 7 7 8 17 37 -2 16 48 23 -12 47 26 -54 4 71 -47 -6 75 20 -30 73 55 -58 -18 19 -42 -6 51
2936 51 -36 -39 19 -3 -23 34 -4 -48 -1 29 17 -50 33 32 -38 4 38 -29 -53 73 42 -51 31 82 -34 -6 72 24 -33 34
2966 34 49 -48 38 64 -13 -7 52 -20 -39 56 36 -50 12 11 -25 -26 46 33 -76 7 61 -64 -40 59 -2 -38 43 8 -71 14 52
2997 52 -43 -4 41 -55 -17 90 12 -29 70 21 -75 24 63 1 -21 85 -14 -40 30 29 -90 1 65 -26 -65 18 20 -93 8
3026 8 21 -75 -34 41 -16 -47 53 -26 -106 2 59 -67 12 60 -11 -67 76 36 -14 3 33 25 -38 49 54 12 8 19 20 -15 -7
3057 -7 23 6 -12 19 -30 -8 3 -34 10 32 2 -38 12 8 -29 22 34 -54 -54 22 26 -27 21 37 -31 -18 27 13 -27 13 31 -29
3089 -29 -5 57 4 -21 56 14 -46 38 59 -42 11 71 -45 -50 98 30 -67 48 62 -95 -20 21 -19 -45 43 43 -51 -12 28
3118 28 -65 5 43 -16 -37 24 18 -44 34 83 -61 -20 103 -9 -32 77 35 -49 45 50 -35 -25 89 -13 -38 41 15 -63
3146 -63 36 61 -37 -3 8 -70 -24 62 25 -52 50 15 -79 -16 57 -44 -29 42 2 -59 11 29 -39 4 68 10 -31 44 16
3175 16 -8 37 16 -62 29 24 -11 -6 40 -31 -36 49 32 -43 5 14 -35 -33 22 23 -46 -31 27 -22 -11 32 -21 1 -5 2 -18 18 -2 -31
3209 -31 18 -6 -30 4 24 -16 -36 32 49 -27 -22 62 19 -13 17 61 -56 -18 65 26 -17 47 1 -30 3 45 -5 14 9 -19 -11
3240 -11 28 0 -51 -13 38 -25 -45 17 9 -61 -25 52 -52 -69 21 22 -81 2 52 -13 8 41 5 -28 61 -2 -32 68 38 -13
3270 -13 59 20 -32 12 53 -36 -49 65 21 -59 1 74 -84 -40 61 -13 -98 9 37 -66 -15 55 -42 -43 66 -17 -57 66
3298 66 58 -76 13 59 -45 -38 54 -7 -57 64 74 -30 10 73 -12 -41 57 38 -25 2 18 -17 -47 33 -6 -67 30 53 -37
3327 -37 -18 40 -34 -21 62 -21 -74 50 50 -85 35 47 -60 -49 82 29 -53 32 37 -53 -22 30 -17 -40 30 25 -41 6 49
3356 49 -22 13 95 14 -48 58 40 -68 16 70 -62 -42 83 -39 -86 36 24 -62 -35 22 -70 -55 35 -3 -58 -8 29
3383 29 -43 -5 63 -20 -6 48 37 -51 33 58 -13 -7 79 22 -35 71 39 -81 35 54 -50 -43 72 14 -70 23 12 -28 -23
3412 -23 48 -29 -39 17 -24 -17 -36 14 -48 -33 34 -38 -16 30 -11 -63 23 66 -48 -7 76 13 -62 89 71 -55 37 59 -69
3441 -69 -37 39 -14 -27 56 21 -32 28 32 -25 -28 30 -12 -37 19 34 -65 -32 77 -16 -74 33 37 -77 -29 64 -48 -53 49 -10
3471 -10 -14 75 2 -48 42 8 4 22 49 -13 30 61 -8 13 45 41 -22 9 37 0 -62 42 62 -22 -7 25 -19 -42 33 -1 -29
3502 -29 2 2 -61 -12 32 -9 27 19 -29 -25 5 -18 -10 18 21 -7 -3 32 8 -19 22 45 -22 -25 35 47 2 0 59 8 -5 23 12 -13
3536 -13 12 -2 -38 6 -16 -43 -3 28 -40 -12 24 -45 -57 37 27 -43 7 63 -36 -21 59 45 -31 42 43 -21 10 69 36 -17 17
3567 17 25 -35 35 18 -36 1 46 -26 -51 93 4 -38 57 52 -22 -17 39 -13 -65 32 6 -74 -18 23 -25 -7 43 -12 -33 5 32
3598 32 -36 20 43 -42 12 54 -5 -39 63 38 -57 -4 74 -28 -22 88 13 -48 20 37 -11 -10 39 0 -17 8 -10 -19 30 3
3628 3 -48 20 44 -8 -26 62 -26 -86 25 25 -65 -22 53 -13 -58 61 27 -37 29 48 -54 -3 84 -2 2 77 30 -28 15 39
3658 39 -66 9 49 -21 -66 26 4 -43 13 49 -68 -79 34 -5 -66 22 3 -59 -45 28 -7 -26 27 -2 -29 14 27 -19 -9
3687 -9 37 -21 -10 56 -4 -32 0 13 14 26 33 4 -16 48 22 -24 -16 60 4 -41 52 -6 -49 -15 36 -30 -47 57 -12 -69 20 17
3719 17 -37 -8 29 -34 -20 56 14 -60 46 69 -85 -8 85 -25 -59 64 32 -63 5 65 -22 6 39 -10 -7 40 -1 -13 38
3748 38 -7 -39 5 40 -62 -11 63 -11 -76 13 61 -71 -37 62 -27 -56 48 4 -77 -18 55 -53 -36 59 8 -40 23 21 -18
3777 -18 26 54 -8 8 74 22 -33 43 22 -35 18 61 -32 -35 71 32 -55 19 47 -31 -31 45 7 -35 -23 -20 -41 8 53 -25 -1
3808 -1 3 -19 -22 46 21 -42 10 35 -24 12 49 -2 -4 53 20 3 -3 44 11 -9 26 41 -3 1 39 -20 -28 28 -4 -24 10 20 -32 10
3842 10 7 -30 -2 32 -27 -38 10 -2 -51 -28 29 -27 -11 44 10 -38 14 34 -38 -11 55 4 -7 29 25 -36 41 32 -29 18 19 -13
3874 -13 7 60 4 -48 19 44 -46 -15 21 7 4 11 -5 -28 -10 14 -30 -5 -1 -1 -1 6 -1 -11 15 27 -27 -21 20 12 -41 28 14 -25 16
3909 16 78 -4 7 49 49 -7 23 10 16 17 28 0 8 38 -10 -33 -6 8 -33 -14 10 -23 -25 -1 -18 -28 11 0 -5 -18 5 4 -59 8
3943 8 32 -27 26 30 -26 -14 25 17 8 11 -14 -3 -15 6 -11 22 11 15 7 9 -8 -25 -3 38 -16 -41 13 -35 -32 -1 -12 -46 -15 28 -16
3978 -16 -37 12 -8 -42 22 20 -15 -2 19 -44 -30 38 9 -8 5 34 -23 4 19 11 -20 25 24 0 11 71 -5 -29 24 11 -25 15
4010 15 -5 -25 -2 1 -35 -49 23 -36 -31 15 -22 -55 -8 -4 -60 -29 14 -21 -52 12 23 -28 9 27 30 -15 35 17 -12 27 34 36 17
4043 17 50 15 -46 35 0 6 28 13 -25 -19 30 -5 -41 -3 9 -76 15 5 -25 -32 7 1 -41 8 2 -2 0 29 -6 -13 15 -7 -4 -23 39
4078 39 -45 -21 39 16 -39 76 39 -59 24 46 -6 -17 30 8 -19 19 50 -24 14 22 -28 -19 5 -34 -30 -20 12 -36 -6 17 -50
4109 -50 -14 22 -1 -38 4 29 -39 18 67 -34 -73 30 1 -65 14 49 -37 2 49 -9 -30 26 27 -36 14 50 -26 3 33 15
4139 15 -23 25 5 -56 -30 8 -38 -38 9 -10 -68 -8 30 -35 -36 21 6 -32 23 19 -21 -24 14 -26 -13 21 -22 8 28 9 5 28 33
4172 33 -3 1 31 10 -30 29 -2 -30 -5 7 -20 -14 -8 -19 -53 -12 5 -39 22 2 -38 -12 5 -3 -19 6 8 -37 -12 -2 9 1 -18
4205 -18 3 5 -26 31 13 -13 11 10 37 6 33 15 -32 1 -20 -30 5 21 17 -11 14 7 -2 -35 37 -47 -14 -8 4 -5 2 5 -27 23 -27
4240 -27 -21 1 17 -7 -8 -6 -7 -50 7 11 -17 1 43 -9 9 46 7 -2 17 23 -11 13 40 13 -14 31 -19 -18 3 5 -26 -14 5 -25 -26
4275 -26 27 -4 -27 -2 -2 -14 -25 6 0 -5 -11 -4 -17 27 15 -32 20 32 4 8 3 -9 -17 10 7 18 18 26 -25 8 25 -24 -14 6 -8 10
4311 10 -6 7 32 3 -9 -9 -24 0 -43 -39 -14 -1 -23 1 -33 2 -9 13 20 -11 1 14 -7 26 13 -4 -20 22 27 0 23 26 6
4344 6 17 20 24 36 -4 16 7 4 8 20 -5 15 8 -24 0 18 -5 -51 12 5 -34 -21 -20 -18 -6 -10 0 -24 6 10 -15 -13 -4 -14 -16 7 0 15
4382 15 24 -8 -7 22 17 15 21 20 8 16 8 16 7 10 10 -14 -6 -8 -8 -17 14 -13 -25 -14 15 -41 -32 19 9 -22 15 -5 -32 -5 -10 12 -14 1 11
4421 11 0 21 24 11 7 26 24 -6 23 19 1 10 21 -4 -32 23 6 -2 28 13 -34 19 5 -19 -12 0 -20 -22 -25 -19 -32 -5 -2 -24 -7 9
4457 9 -17 -20 -8 -3 -11 6 35 1 -27 12 27 -17 1 41 -3 1 36 2 -23 16 0 1 -5 30 -9 22 -16 -20 -18 1 28 -11 -7 9 -14
4492 -14 -6 31 -1 -10 -15 -22 -20 -13 29 -19 -11 21 0 -8 -43 -13 0 24 12 31 -37 21 -4 5 -7 34 5 19 37 19 -10 13 15 -6 0 5
4528 5 4 20 0 -39 -10 -27 2 -40 -4 5 -17 -16 11 43 -11 3 36 -4 -11 29 -15 3 25 -1 -13 16 16 -6 -9 30 -16 -30 37 5
4562 5 -13 33 10 -4 23 19 22 -24 -15 9 -39 -13 0 -21 -48 -21 -2 -51 9 -3 0 -15 -9 -4 -16 13 -14 28 23 13 9 -11 -9 10 -19
4597 -19 17 -11 23 32 27 19 2 5 -20 4 -12 17 7 20 -10 15 17 -24 4 -22 3 8 -12 -39 9 17 -6 -49 -5 -20 -29 10 7 -2 -15
4632 -15 4 12 4 15 34 2 -12 14 -16 8 29 17 28 24 10 4 5 8 2 -6 26 2 5 10 18 -8 27 17 -13 3 10 -4 -6 33 4 -12 -8
4669 -8 -16 -28 18 -22 -34 -22 -1 -9 8 17 10 2 5 26 -12 30 58 41 3 7 10 -12 29 30 17 6 17 -8 1 35 15 -38 -6 -19 -14 9
4705 9 4 4 13 -16 22 -14 -2 7 -4 13 21 16 4 24 12 -15 12 12 -3 25 4 11 2 43 -2 25 3 27 24 25 12 4 28 8 14 -4 5 -16
4743 -16 5 24 7 8 15 -6 -1 -17 -22 -24 2 -8 6 -30 -27 -9 -22 0 22 -17 8 19 22 -18 15 21 16 17 29 9 0 37 23 14 -5 -10 24
4780 24 40 7 4 25 34 17 3 11 14 -30 -11 10 7 -20 -10 -24 -21 -23 -29 11 -14 -7 0 22 15 4 -6 7 4 11 21 5 -2 1 -6 24 10 -2
4818 -2 11 52 2 29 35 -5 -4 -3 27 3 0 -19 -12 8 -20 26 -27 2 3 -29 3 29 -32 -34 -16 -11 -6 2 6 -16 -9 5 15 -19 2 23 -24
4855 -24 16 26 5 -4 26 17 31 19 9 9 17 26 3 2 -2 14 -11 -8 34 -8 -18 6 15 -16 11 -34 -21 3 -8 -4 -19 -23 5 -2 -8 -11 -34
4892 -34 5 18 -9 -1 -1 20 -2 12 19 11 12 18 9 -13 26 8 32 24 23 -7 14 24 15 -7 9 12 -12 -20 3 10 -31 5 28 -11 -12 -11 -16 -11 -9
4931 -9 -40 -2 4 6 0 -9 -7 -8 13 -1 9 0 7 27 15 13 9 10 10 12 26 -2 -5 16 5 2 21 23 29 15 15 4 -16 -28 -3 -7 -10 -7 -11 -3 -28 -9
4973 -9 -11 12 -18 14 2 18 -11 0 22 -1 5 21 24 0 36 37 -10 11 19 -8 27 32 26 24 24 -1 23 14 -6 22 16 -21 16 13 14 -24 -10
5010 -10 -29 -14 3 -30 4 -14 -11 -5 22 -25 3 6 19 14 -8 2 7 -6 20 21 -16 24 -6 15 2 10 30 17 1 7 -12 3 -7 -18
5044 -18 2 4 -29 7 18 -4 8 -5 -29 -19 -6 1 2 4 8 -15 -23 -8 -17 -32 -37 3 3 -19 7 14 17 17 23 19 22 10 26 11 14 21 -4 9 11
5083 11 -10 12 -23 15 -5 -14 24 -5 19 -28 -8 2 -11 -20 -11 10 -30 4 -4 -27 -13 -3 -23 -22 -24 3 -17 3 11 27 10 -14 6 24
5117 24 12 30 13 11 36 5 24 2 2 -16 9 4 20 -15 4 -9 -15 34 -31 21 -20 17 -16 1 34 -28 -12 4 -14 -7 16 6 1
5150 1 5 26 -8 -18 12 5 17 19 0 34 -5 32 10 -11 0 20 8 45 12 16 -4 -3 -4 -10 12 -15 20 -22 -2 -22 -3 3 -12 -21 -29 -54
5186 -54 -29 -29 0 -8 10 -26 -9 -21 -12 -5 -7 8 -4 35 15 12 -2 29 22 35 21 7 31 31 -7 21 14 29 9 -15 -10 14 -8 4 9 -31
5222 -31 11 -2 14 -7 -8 -38 6 -25 -3 -41 -4 0 -14 -1 -10 24 12 18 20 42 16 -1 5 12 10 -2 20 25 14 0 1 22 -22 7 10 16
5258 16 6 1 6 -21 -20 -5 5 1 11 -1 -32 -5 -12 7 -1 -4 -25 -15 7 -21 5 2 3 0 33 -4 -8 18 24 40 -5 26 23 2 20 11 23
5295 23 20 -10 1 4 12 -4 -8 -21 -3 14 -10 -5 -19 15 -7 -21 -7 -4 5 8 -25 -9 -29 -22 -38 -43 3 -7 2 -7 -3 -7 -29 11 -2 9 -9
5332 -9 8 2 35 -23 14 1 9 10 -6 14 -11 -15 -25 21 -14 -11 -8 -25 -2 -23 -11 -12 -29 12 -46 -2 7 -14 -8 -7 -8 14 0 8 -16 27 0
5369 0 -1 9 7 -11 27 -1 -17 32 15 36 12 12 -22 14 22 -23 -6 27 -11 2 -13 -14 11 14 21 -13 4 -19 -6 -18 -24 -29 0 -14 -11 -7
5405 -7 -29 7 -5 18 1 3 3 25 0 -2 9 -17 18 12 2 19 13 -9 11 -6 14 6 -11 6 12 19 -7 12 -11 -16 0 -14 -10 -7 2 -10 9
5442 9 -13 -23 0 -9 -9 -2 2 -6 -25 -18 14 9 8 4 -5 -4 41 24 -13 35 -8 6 16 12 21 -9 8 3 -1 12 37 -7 3 -6 -17 13 -26 -1 -15
5481 -15 2 29 -25 -3 -10 3 -11 -11 -10 -40 -15 -14 -23 17 14 -2 -6 15 0 10 -29 14 15 19 28 18 18 -9 26 25 14 3 5 -8 7 22 5
5518 5 6 9 -19 -36 -25 14 -2 -8 3 -42 -33 -6 4 -16 -7 1 -4 -7 -2 10 -5 4 -12 13 36 -15 0 12 -17 22 48 41 11 28 27 4 21
5555 21 2 16 19 15 -1 -5 12 -9 -17 -1 8 3 -4 -18 5 -15 -4 -18 -37 -26 16 -22 15 -13 -20 -9 -13 9 8 22 -13 15 -5 -1 20 24
5591 24 0 13 16 7 -9 15 22 4 21 7 21 11 8 -3 11 9 3 -8 -27 -3 -8 -13 -10 -28 -11 -18 18 -1 -14 -20 11 -15 -16 1 1 -6 -11 11
5629 11 16 13 7 7 32 39 4 4 23 22 8 6 19 5 16 10 20 14 -12 -2 -10 -1 -6 20 13 -2 9 -19 -30 -23 -11 -11 -18 -18 -12 -9 -8 21 33 17 9
5670 9 21 3 -5 15 19 12 27 25 -20 2 24 36 47 14 13 -3 17 -2 -21 24 -21 -7 20 -8 -28 -4 -3 -15 5 23 11 12 10 15 -3
5705 -3 23 -9 -10 -15 -13 -8 -14 -1 19 11 -11 6 18 8 11 27 33 10 -5 19 17 9 -6 34 -12 14 22 0 17 1 6 -26 -3 -11 -10 -6 -1 -24 15
5744 15 -23 -39 -2 4 -25 0 -4 -3 8 10 -10 28 13 -20 27 -1 2 12 5 18 6 27 32 30 36 23 31 21 3 -7 19 -6 9 30 2
5779 2 12 16 6 9 32 -13 2 2 -32 0 11 -40 29 11 -28 1 -10 16 41 9 -1 5 2 -8 27 8 34 18 2 17 2 27 29 -1
5813 -1 30 26 38 22 12 28 6 16 -15 2 -6 8 7 -2 -1 -15 -5 -9 -14 10 -29 -17 -41 17 -10 -10 -13 44 1 3 5 18 -1 23 33 23
5849 23 37 -2 36 12 -3 3 -1 9 -8 -8 11 32 37 13 21 8 5 -13 0 37 -32 24 -21 2 -8 -6 -8 -22 -10 8 -6 -38 -3 3 -16
5884 -16 -7 -20 7 2 13 18 12 10 28 3 3 21 30 21 16 12 13 16 10 20 -4 3 4 14 32 -25 -19 11 -14 6 -19 -6 -20 -10 3 4 4 -6 -7 -11
5924 -11 -18 1 -11 9 0 -5 18 13 38 16 24 19 23 2 -5 1 14 -23 11 -13 0 23 1 7 1 -10 8 8 5 5 -24 -36 14 -26 -18 -4 15 6
5962 6 6 11 -13 15 7 -8 10 26 16 0 21 -6 12 29 40 26 18 16 8 30 39 36 14 16 25 21 13 49 5 11 4 27 -10 4 -10 -8 -7 -11 -15 -16
6002 -16 -12 -15 5 -17 3 5 9 -18 -14 10 20 -16 24 19 4 30 17 8 -3 49 6 6 14 13 5 2 9 -12 18 37 -23 22 28 17 8 26 8 9
6040 9 12 6 -43 -6 -4 7 -14 19 0 -11 -18 -29 -11 -13 10 3 11 -5 -7 -3 3 17 11 19 4 37 35 13 -5 19 16 35 1 5 -5 14 7 24 13
6079 13 15 4 -19 -14 -15 -2 6 9 -6 1 -1 5 -31 5 -8 -27 -8 -13 -1 -5 5 -6 18 7 -5 30 34 25 41 4 17 40 31 30 23 28 8 26
6117 26 2 4 10 9 35 -7 13 5 -23 -2 -28 -14 14 -11 30 24 -14 -3 11 10 -10 4 18 8 -10 3 10 4 8 -3 4 45 13 4 44 23
6153 23 27 0 18 23 19 11 -1 19 36 4 26 -5 12 9 6 -31 -4 -2 -3 -23 -20 -11 0 -27 -3 -3 16 -10 19 -1 -5 -2 5 -15 -13 9 5 10 25
6192 25 20 6 -10 25 0 12 -3 41 19 -1 14 -10 21 8 26 -9 -10 3 0 -12 5 7 -1 -26 -5 21 -5 -15 3 -25 -2 -8 -15 12
6226 12 15 26 -5 14 13 34 8 -1 1 6 15 2 -1 34 29 21 31 7 11 -3 25 6 26 17 0 7 -36 5 16 4 -4 -16 -19 -5 -3 -41 -18 -26
6264 -26 -16 -24 -3 -14 -21 5 -12 0 0 -22 -16 25 16 -2 -4 -10 20 19 20 21 22 13 -9 10 23 22 2 3 3 6 -27 -2 21 13 0 1 -10 4 -5 -12
6304 -12 -4 -3 -3 14 -24 13 31 4 -12 -3 -11 6 -16 25 27 2 9 -2 37 9 7 43 34 23 -1 47 16 -9 35 1 23 -27 15 18 -9
6339 -9 19 3 19 29 -1 17 14 -1 -15 -14 -38 -12 17 -14 0 6 20 25 -9 3 6 14 6 2 -6 23 40 15 11 41 40 33 22 12 8 14 34 28
6377 28 -20 -1 4 -17 33 -8 -17 -1 -7 -6 -9 -25 -25 11 10 -29 -8 5 -17 -19 7 -11 33 8 26 -10 -15 -9 18 7 19 -1 -12 40 20
6412 20 26 20 10 -18 16 2 28 19 -3 8 22 -7 -3 -4 -29 -39 -25 -19 -5 -10 9 1 7 -23 -5 -3 9 6 -10 26 -6 2 19 -7 21 26 -7
6449 -7 10 -7 14 5 9 24 31 36 4 26 18 -10 9 34 26 -2 9 -17 -2 14 12 19 -5 9 -1 -16 1 -28 5 -5 -16 1 2 -7 -24 14
6485 14 -14 2 12 23 23 22 21 -3 39 12 -3 23 -13 2 -12 12 -10 37 25 16 -6 -3 9 7 -4 -3 -32 -21 48 -19 3 11 -5 1 -9
6520 -9 -18 15 10 -15 -15 -21 -13 -17 -9 -2 16 -21 2 7 28 -3 18 -3 29 0 -7 36 -4 34 -1 10 1 26 6 23 38 -11 -12 -11 -17 2 18 -43
6558 -43 -5 -14 5 15 -12 -8 9 -12 -20 -11 7 8 -22 -16 -25 8 -4 14 22 9 37 22 -3 16 20 38 -7 13 22 9 21 13 33 15 16 27
6594 27 -1 35 4 -7 -14 9 -12 -21 21 7 -16 -11 -20 -33 -33 -23 -1 -15 -12 10 -5 -19 18 -8 -6 15 16 -3 8 37 15 8 18 -6 -2
6629 -2 26 36 7 29 1 -25 6 10 -2 4 -12 3 -3 -17 15 12 -10 -9 -4 -12 3 -5 -7 -24 3 -17 -21 16 -2 3 0 -4 -26 9 29 12 -10
6666 -10 10 23 13 2 8 21 17 10 13 9 10 12 7 20 16 13 12 5 -17 -6 -17 -24 -12 -3 4 -11 -6 -21 -34 -14 -35 -21 -16 -7 26 2 4 -3 -4 -11 2
6707 2 11 31 14 25 41 54 11 26 30 16 3 6 -16 12 20 13 35 -8 29 8 6 -3 -14 -6 9 -12 5 -21 -23 -17 -23 20 -29 -10 5 -7
6743 -7 -10 -17 -14 -14 -3 -17 -2 -3 27 18 17 25 -2 24 26 9 37 18 -27 -20 3 31 15 3 19 2 -7 2 1 -3 -2 -6 -22 -29 -13 -3 -9 -12 17 -8
6783 -8 -30 2 -19 1 1 -5 1 -1 8 8 7 -3 17 15 -6 16 15 24 -24 14 -1 15 17 16 14 -7 2 7 4 -21 -25 -29 -2 4 -4 -26 -51 -17 -6 21 -7
6824 -7 -11 -6 -25 19 -13 -11 -10 4 13 24 1 4 9 -6 -3 -4 3 9 25 -2 16 8 23 37 5 4 22 12 11 -1 15 10 4 9 -10 12 -8 -32 2
6863 2 -8 -6 -12 -11 -9 -12 -14 11 19 4 -6 0 8 -25 18 37 14 21 30 14 10 9 11 13 34 15 15 15 35 23 1 -7 -1 25 -22 -10 -15 -16 -3 13 5 -2
6905 -2 -27 -37 -34 -13 -8 20 -3 -18 -39 10 -6 1 10 7 -4 -21 19 18 0 16 36 4 7 16 28 6 19 7 11 14 22 -8 -10 25 1 -6 10
6942 10 7 -9 -19 -3 -26 9 -4 19 6 -7 -13 -18 5 -23 -13 -29 -12 -17 15 16 19 0 13 11 -2 2 30 26 16 11 41 19 34 28 7 35
6978 35 24 12 12 -1 14 30 -19 6 -7 -10 -8 -15 -4 10 -26 -11 1 14 -6 4 2 16 -17 -17 -9 29 -2 1 11 0 1 15 12 -12 -18 7
7014 7 33 20 41 47 20 3 5 41 48 21 6 24 28 40 -12 -20 11 -25 12 22 -48 -21 -4 -18 -9 22 -15 4 -22 -13 21 -18 19 -17
7048 -17 7 17 13 9 -3 19 8 22 24 24 -9 11 -7 2 35 18 9 10 20 19 35 12 1 -26 -17 -7 -36 -2 -22 7 -17 22 -20 -33 -1
7083 -1 -9 -1 5 -16 -11 -16 -20 20 -33 -11 19 5 -4 18 14 16 19 30 5 -2 4 6 3 -3 18 17 1 1 -4 27 -13 15 28 -9 -10 6 -17 -3 6 -13 -2
7124 -2 -26 -1 11 -18 -21 -3 -16 22 9 -10 -16 7 17 -18 22 23 40 34 28 2 24 16 18 25 26 1 20 9 -8 26 10 18 2 17 -7 -37
7160 -37 5 9 -1 2 11 -10 -3 0 -9 -9 25 7 7 -10 8 11 -9 32 24 -5 5 -8 -4 15 1 28 16 38 26 20 8 47 24 34 24 -10
7196 -10 2 32 8 -12 -8 9 -4 -17 -9 -20 -30 17 -6 -2 17 11 -10 11 -3 -9 -2 -1 -8 24 20 10 9 -7 -2 -13 -4 56 11 -2 19 1
7232 1 21 -14 11 2 11 35 13 17 26 15 -11 34 1 -7 11 3 -6 2 10 -3 -26 -2 0 -1 5 16 8 -27 -9 -31 -1 2 24 0 -10 19 31 -2
7270 -2 34 20 -4 34 29 -14 44 -1 -5 24 11 7 13 -4 -13 -18 -8 -5 -3 -1 14 -14 -20 -5 -41 -1 -11 -25 -41 -8 -8 -30 10 18 -1 -3 7
7307 7 16 21 29 -17 2 25 53 6 35 3 44 9 -5 10 11 14 -5 29 43 -14 13 18 21 15 0 19 -2 -11 -18 -20 -9 11 -26 8 -6 -2 -1
7344 -1 9 1 -2 -7 27 -6 4 -1 -7 -15 8 44 -11 11 6 5 -1 30 42 12 34 5 17 -11 15 -1 -3 10 -2 -24 23 -3 -15 -19 26 6
7380 6 -12 -18 19 -13 -6 -9 -2 -14 -13 15 -3 -13 2 -8 9 10 15 13 -26 12 6 17 31 15 25 24 3 24 32 4 11 -20 7 14 11 6 1 -6 -37
7419 -37 11 -3 -22 -14 -22 -19 -1 -22 6 -1 -10 -11 -16 -13 -11 -4 -5 37 -14 -8 11 19 3 25 -4 4 9 -13 7 14 38 14 29 -11 -1 10 4 9 1 8
7459 8 9 -28 2 -26 -29 -15 -27 -11 -22 -16 -33 -27 -25 6 -5 -27 -2 -14 6 12 12 13 -13 6 -12 -17 -29 7 1 24 20 5 -14 37 16 -13
7495 -13 42 14 2 25 10 12 -7 -21 -13 5 -17 3 9 -15 -2 -11 -4 -23 -17 -13 -1 0 0 -35 12 3 2 -16 10 -3 6 0 -14 19 3 4 34
7532 34 22 8 -3 24 18 -11 0 -3 -7 -10 0 -2 -10 -3 2 0 28 12 0 -24 -17 -8 -26 -11 14 -8 -14 -4 -12 -15 -18 -2 7 -3 7 29 21 -4 -26
7571 -26 1 36 17 -4 -14 -4 24 9 4 7 -9 1 10 -2 1 20 20 -13 -32 -12 -37 -12 -13 -15 -34 1 6 -4 -8 -9 24 -34 -2 1 1 -11
7607 -11 10 -11 -5 22 15 8 17 -5 21 6 5 15 13 32 34 12 -10 28 25 16 21 -6 -23 -8 3 -2 -10 -35 -5 -19 -32 6 -5 9 -52 -37
7643 -37 0 0 -7 -32 1 16 8 -4 6 22 35 -6 0 14 8 -14 15 32 10 -15 17 -8 4 23 8 -8 37 9 21 26 6 6 -12 6
7677 6 5 6 -41 -12 -14 -25 3 -36 -30 -2 -17 -11 9 -4 -8 16 20 20 14 7 -2 -2 28 3 -4 -13 10 -5 31 18 -17 22 -20 22 15 3 19 16 11
7716 11 -9 12 -14 15 -1 -10 -11 -5 2 -20 -7 -27 -3 13 -8 -4 -8 -26 16 4 7 -11 -11 28 -6 28 28 14 19 10 16 -6 28 38 4 8 18
7753 18 12 16 6 9 9 -11 16 -5 11 16 -2 21 1 -7 -32 -17 -8 11 -16 -21 -17 11 -23 -8 -15 29 17 13 0 2 34 20 23 30 -3 -5 13 13
7791 13 3 21 4 -9 -5 21 32 -3 -15 2 -20 -1 -2 -17 -1 9 -20 -13 5 -26 -5 -5 14 -10 6 -17 13 -23 -15 3 -11 -20 -7
7824 -7 -7 10 -3 -18 -14 12 1 6 25 50 36 21 36 50 11 11 26 -23 -1 -11 -8 -4 -5 -27 20 -4 -13 9 6 7 -15 -39 -23 -21 -19 14 10
7861 10 -6 -7 -1 1 5 -7 -10 5 -8 32 -18 -29 -11 -26 3 0 20 15 -8 28 0 11 19 0 15 5 -8 -11 24 14 -12 -1 -3 -10 -7 -18
7897 -18 -44 -21 -31 -24 -40 -14 -23 -8 2 14 -24 16 -6 -20 21 20 26 -18 17 28 19 36 0 -13 24 8 1 40 15 7 -24 3 1 -56
7931 -56 -25 10 -3 7 -14 -3 7 0 -2 -23 -8 -7 -4 -6 -15 -10 -25 -27 -3 -33 -24 1 0 18 10 -13 3 5 -1 -1 30 14 2 18 -37 -3 13
7968 13 -17 22 -5 -32 19 11 -25 -1 -19 -6 -28 -3 14 -22 -18 -9 3 6 -29 -17 -9 -44 -1 -11 -17 -10 -18 2 -9 -2 -7 -3 -12 -3 10 -8 -1
8005 -1 32 5 -2 -18 9 7 -2 8 -2 26 1 6 3 -16 -7 -10 -9 4 -38 -10 -29 -24 -27 -12 -14 6 -5 3 -38 2 -11 11 0 -12 -42 17 -1
8042 -1 -12 16 8 -9 21 4 -23 -6 7 10 18 -1 23 5 6 3 1 26 38 2 -17 -4 -9 -1 -33 -10 -30 -17 -33 -32 -11 -5 -6 -4 -9 -3 -7 -22
8080 -22 5 1 0 -27 18 12 11 -11 19 33 0 -7 -1 24 -17 38 34 64 7 -14 9 -9 15 -6 22 19 6 -15 -16 -21 4 -14 -11 -14 -21 -14 2
8117 2 -9 -8 -21 -24 -6 8 1 -10 3 15 -5 -18 -15 -6 12 18 9 26 18 35 -2 18 18 8 12 -1 8 5 24 1 -6 -18 -9 21 -7 -6 8 -33
8155 -33 -20 -48 -13 -8 6 -38 -7 -27 -14 6 -20 -2 10 0 4 0 10 24 1 22 8 1 32 -8 15 13 27 6 -9 30 12 17 -14
8188 -14 1 14 -2
8191b
$$ Imaginary data points
##PAGE= N=2
##DATA TABLE= (X++(I..I)), XYDATA
0 0 0 0 0 0 0 0 0 0 0 0 0 0 -8 8 -8 8 -16 16 -24 24 -32 35 -40 48 -56 72 -80 96 -105 121 -142 160 -184 208
34 208 -232 264 -296 333 -371 414 -461 513 -569 631 -698 770 -850 938 -1033 1138 -1254 1382
52 1382 -1522 1680 -1855 2054 -2278 2535 -2832 3182 -3600 4109 -4745 5569 -6675 8256 -10696
67 -10696 15008 -24826 93639 -68592 -149688 145630 -63217 -138421 152487 95391 -149855
78 -149855 13615 60366 -98317 -748 127415 -16693 -64297 14118 -10219 -47401 30112
89 30112 70598 3845 -51611 -1799 2017 -53988 20353 94315 -28236 -54823 49131 -24935
101 -24935 -66129 90374 50642 -87681 8806 28867 -87068 22356 105426 -37447 -33670
112 -33670 43680 -55619 -44167 79054 18539 -37329 25430 -11053 -47481 23976 27675 -6953
124 -6953 7674 -15060 -25055 11245 313 7804 40634 -12710 -35074 18035 -10856 -28358 43928
137 43928 21290 -38640 7542 8845 -34943 16378 36112 -18404 -7627 5153 -24895 2943
149 2943 28842 935 636 -3445 -26390 -487 13226 -3306 18110 7111 -31066 6324 18595
162 18595 -24452 12137 29022 -39311 -12686 37778 -23544 -14898 50787 -10741 -38539 34429
174 34429 1072 -42803 30433 26551 -37426 6935 25512 -32635 -7031 34732 -8219 -19263
186 -19263 14470 94 -17602 7431 20229 -2925 -17401 3219 9107 -17422 -547 30165
198 30165 -11809 -26253 27492 5708 -33704 22809 22885 -41550 2687 37441 -30479 -13331 43297
211 43297 -15797 -30880 36323 2849 -38951 21213 21929 -31041 2807 26578 -20240 -14876 22760
224 22760 1866 -16755 6849 9473 -12415 -5815 16325 3653 -16902 3664 13068 -15484 -3711
237 -3711 24222 -9230 -20281 21666 4309 -25101 16158 16079 -28912 1750 26245 -19062 -11133
250 -11133 25023 -8743 -19466 20518 5838 -20111 7356 11231 -13253 -405 12558 -6012
262 -6012 -8816 6731 4481 -5672 -221 6945 -3809 -8784 8489 7416 -12428 -48 13228
275 13228 -10153 -7535 18346 -2898 -19130 11997 8781 -17744 5093 15916 -14969 -6637 17687
288 17687 -3663 -12335 10261 2266 -12786 5141 10537 -7488 -4307 7768 -1626 -6979 5936
301 5936 5226 -8993 -2105 10566 -1855 -7629 8204 1894 -13756 3405 11718 -9982 -4855 13111
315 13111 -3931 -9707 12532 3281 -15173 3623 9656 -10034 -727 13081 -6372 -9738 11015
328 11015 2970 -11810 4101 8076 -10350 -2199 14306 -1904 -11142 7287 4433 -12353 1386
341 1386 11490 -8361 -7691 12525 2237 -10349 6160 5991 -12584 -1454 12067 -4953 -7564
354 -7564 9861 1181 -10335 6827 8275 -11904 -3611 11424 -4231 -7215 12316 2456 -13975
367 -13975 4752 10463 -11247 -3825 12087 -6037 -9448 13128 4127 -12926 4172 7897 -11196
380 -11196 -1511 12064 -5909 -8793 10481 3288 -9649 4514 6680 -11076 -4006 11915 -1013
393 -1013 -8873 7702 5083 -11088 1681 12139 -7953 -9156 10523 181 -10947 9082 7981
406 7981 -13014 -145 11535 -8376 -6119 11838 -2515 -9990 9791 4907 -11373 1669 7618
419 7618 -7493 -2757 9121 -1955 -7791 5102 6203 -4092 -1095 4738 -4124 -7753 5149 6771
433 6771 -5296 -1158 6193 -5137 -5238 9605 1957 -9426 2900 3718 -8481 2253 10114 -5327
447 -5327 -5015 6595 -2780 -7271 6030 4461 -5208 1131 4993 -3855 -4354 4190 3378 -3464 -945
462 -945 3376 -3850 -5335 7581 6296 -6535 -328 3724 -9637 -2340 13964 -381 -8671 6518
476 6518 -1303 -12679 8212 11611 -10560 -3231 8925 -8265 -6651 14949 4406 -11554 2416
489 2416 5171 -10870 -2278 13663 316 -9300 5254 3374 -12195 807 14675 -4004 -8540
502 -8540 9228 -2545 -14915 10577 13497 -12472 -1630 10376 -14889 -8430 21641 2597 -14349
515 -14349 9617 2276 -20034 6253 19212 -9926 -6609 11489 -8655 -12243 15505 8664 -11528
528 -11528 2308 5913 -13167 -3419 15100 317 -8332 6949 559 -14582 2636 13982 -4900
541 -4900 -4716 9662 -5778 -14109 10040 10962 -8289 1340 6762 -13235 -6939 14250 3360 -5560
555 -5560 5725 -2227 -12638 3735 10030 -2030 548 2943 -8567 -5370 7233 3517 -1189 2853
569 2853 -1626 -7531 -644 5091 1626 656 1822 -2534 -5441 -500 3850 2213 1145 901 -3318 -4831
585 -4831 635 3984 2578 1952 -807 -5131 -3236 2120 3665 2860 653 -3134 -4282 -1497 2677 4615
601 4615 1284 -2470 -1760 -2320 -2518 4074 5298 -2845 -2668 1990 -3363 -3105 6729 3203 -5125 974
617 974 2164 -6307 -504 7688 -623 -3366 3701 -2128 -6712 4498 5748 -3824 386 3392 -6881
632 -6881 -3432 8696 1349 -5606 3484 672 -8822 2096 9245 -3617 -3998 5633 -2624 -7127 6310
647 6310 5237 -6577 71 5358 -5358 -3255 7686 -17 -6222 4373 2967 -7641 583 7510
661 7510 -3898 -3504 7202 -1627 -8791 4768 5491 -6681 794 7150 -6419 -5204 8561 674
675 674 -6692 4726 2444 -8347 1606 7673 -4306 -2813 5908 -2541 -5551 5775 3032 -6062
689 -6062 1084 5012 -4204 -2708 5728 -492 -6117 3009 4396 -5223 -1381 6139 -2205 -4907 5696
704 5696 1949 -7353 1426 5231 -4903 -847 6765 -3191 -5126 5547 944 -5255 3528 2905 -5717
719 -5717 499 5361 -2720 -2479 3692 -735 -3660 2317 2462 -2809 -1173 2753 121 -2300 1317 1647
735 1647 -3336 -1201 4093 -437 -3255 2856 858 -4527 2216 4188 -4408 -1464 4692 -2240 -2804
750 -2804 5359 439 -5421 2006 3144 -3736 -427 3848 -1697 -3016 2723 2035 -2803 -842 2609
765 2609 -900 -2738 2534 1928 -4086 -142 4247 -2311 -2344 4274 -1134 -4709 4188 2677 -5019 1426
781 1426 3764 -4877 -791 5767 -2397 -3849 4154 274 -3950 3084 2623 -4149 -630 3140 -1441
796 -1441 -1711 2449 219 -2869 862 2782 -1543 -1796 2300 -115 -3081 2283 2809 -3858 -764 4370
812 4370 -2055 -2814 4598 -65 -5302 2870 3528 -4358 43 4187 -3151 -2422 4422 -103 -3822 1899
828 1899 1667 -2800 469 2852 -1715 -2249 1943 900 -2075 616 2084 -2088 -1519 3364 503 -3272
844 -3272 1455 1942 -3479 216 4274 -2250 -2925 3643 230 -3599 2610 2047 -4270 0 3730 -2052
860 -2052 -1735 3145 -779 -3227 2289 1953 -2950 -285 2487 -1445 -1486 2804 463 -3163 647 2531
876 2531 -1708 -881 2746 -845 -2820 2337 1875 -2795 129 2279 -2233 -1095 3313 -438 -2912 1807
892 1807 1080 -2705 917 2431 -2620 -1422 3046 -268 -2350 1996 953 -2982 572 3001 -1716
907 -1716 -1841 2273 21 -2161 1825 1687 -2600 -710 2343 -585 -1293 1873 162 -2605 633 2173
923 2173 -1344 -946 1786 -720 -2061 1986 1539 -2539 -93 2309 -1648 -1275 2854 -279 -2904 1870
939 1870 1682 -2680 334 2352 -2103 -971 2997 -476 -2402 1549 720 -2006 1020 1899 -2004 -1443
955 -1443 1869 286 -1430 1184 1080 -2507 -927 2875 -12 -2295 1812 1051 -3450 587 3715 -2174
971 -2174 -1958 3402 -725 -3207 3059 1546 -3607 1087 2595 -2948 -635 2884 -1551 -1454 2759 -142
987 -142 -2470 903 887 -1274 513 1452 -922 -1634 383 1178 -235 -147 1192 -969 -2154 1599 1689 -1625
1005 -1625 613 1455 -2852 -511 3238 -1217 -1470 2938 -1061 -3059 2844 1093 -3116 1710 2073 -3224
1021 -3224 -388 2427 -1574 -749 2392 -321 -1608 255 5 -131 755 495 84 -1000 -1234 1094 924
1038 924 -631 1139 51 -2820 611 2250 -1495 396 2290 -2806 -1653 3197 -634 -1817 2834
1053 2834 -175 -3140 1556 1265 -2061 952 1575 -1614 -405 652 -746 209 914 118 147 -961 -819
1070 -819 1136 -76 -224 2121 -988 -2814 2097 1023 -2482 2297 1737 -4488 -1 3612 -2513 -695
1086 -695 4043 -2085 -3133 3216 255 -2648 2266 1109 -2690 553 1407 -1404 -27 1275 -185
1101 -185 -445 -158 186 132 -720 943 1553 -2085 -962 2327 -1481 -1485 3819 -332 -4062 2443 1559 -3787
1119 -3787 1860 3133 -4019 -819 3538 -1997 -1440 3323 -815 -2460 1940 510 -1686 938 811
1134 811 -911 21 343 102 -326 -718 1074 805 -1773 486 1564 -2478 -91 3444 -1927 -2168 3240
1151 3240 -991 -3036 3676 920 -4078 1781 1980 -3622 1039 3237 -2992 -935 2974 -1468 -1474 2519
1167 2519 -207 -1908 1124 772 -914 -149 432 321 -444 -412 1326 -200 -2035 1394 1501 -2466 449
1184 449 2291 -2712 -833 3496 -1258 -2060 2810 -587 -2719 2669 1034 -2772 1157 1273 -2304 670
1200 670 1854 -1586 -360 1214 -728 -117 737 -492 0 74 -511 829 -13 -1322 1013 476 -1616
1217 -1616 1248 1055 -2518 516 2103 -2094 -123 2552 -2082 -1341 3041 -639 -2052 2304 74
1232 74 -2484 1591 1384 -1840 158 1083 -1010 -198 818 -59 -333 -352 172 742 -693 -391 1158 -873
1250 -873 -1044 1946 -120 -2061 1513 684 -2230 1327 1641 -2571 65 2281 -1704 -571 2384 -1156
1266 -1156 -1625 2006 86 -1470 1173 354 -1400 499 817 -547 -105 66 -144 124 -166 240 288 -951
1284 -951 7 1153 -838 -484 1452 -838 -1196 1904 108 -1887 1231 712 -1965 850 1566 -1768
1300 -1768 -311 1605 -904 -562 1449 -438 -1051 820 238 -537 309 65 -363 -20 108 301 -31 -554
1318 -554 296 328 -712 448 728 -1239 -130 1351 -789 -590 1468 -589 -1222 1507 321 -1495 784
1335 784 637 -1447 423 1187 -1093 -384 970 -501 -471 828 -54 -714 224 323 -97 -44 96 -2 -325
1354 -325 7 650 -123 -610 511 199 -676 627 628 -1135 -41 1020 -705 -338 1174 -550 -999 1106
1372 1106 293 -1101 517 536 -1090 63 1023 -487 -613 544 2 -522 344 479 -469 -427 520 334
1390 334 -510 120 543 -610 -345 996 -24 -905 571 379 -935 365 915 -880 -416 935 -237
1407 -237 -611 770 31 -903 358 580 -541 -107 465 -367 -341 620 193 -601 9 398 -348 -105 671
1426 671 -214 -763 466 474 -629 150 678 -697 -488 984 54 -811 493 363 -889 131 929 -536
1444 -536 -597 713 67 -674 482 499 -749 -163 802 -209 -560 523 163 -695 321 714 -612 -390
1462 -390 685 -134 -463 634 178 -929 60 650 -349 -168 523 -331 -628 531 409 -513 25 386 -495
1481 -495 -222 768 37 -681 303 389 -620 124 852 -472 -637 814 169 -911 451 645 -883 -124
1499 -124 985 -493 -795 761 253 -786 372 583 -876 -335 895 -20 -579 453 147 -890 140
1516 140 997 -322 -561 647 -135 -892 690 857 -918 -240 870 -585 -593 1196 125 -1121 532
1533 532 599 -1001 43 1054 -552 -553 841 -134 -969 526 608 -660 76 693 -662 -661 816 393 -600
1552 -600 238 411 -919 -299 1120 75 -717 475 96 -992 348 1001 -537 -375 615 -422 -637
1569 -637 811 319 -684 259 382 -685 -79 709 -125 -324 469 -4 -633 43 498 -77 -118 379 -123
1588 -123 -711 155 642 -173 -182 405 -359 -695 543 541 -443 2 321 -637 -271 738 94 -430 257 24 -533
1609 -533 130 509 -142 -219 281 -53 -363 148 362 -172 -100 325 -120 -452 179 325 -191 58 230 -442 -282
1630 -282 445 87 -219 241 -90 -563 131 419 -164 -64 218 -283 -342 348 227 -274 -18 205 -262 -213 383
1651 383 148 -386 93 353 -338 -225 459 -15 -360 376 243 -573 -25 444 -278 -143 477 -193 -515 280
1671 280 252 -330 99 243 -417 -205 435 45 -249 159 79 -378 45 381 -151 -200 236 -24 -280 264 186
1692 186 -403 39 357 -279 -166 416 -136 -389 413 217 -468 69 332 -362 -107 510 -110 -481 277 210
1712 210 -351 104 382 -301 -327 423 99 -368 200 227 -426 -36 517 -187 -375 392 -16 -435 288 275 -492
1733 -492 22 416 -267 -158 418 -137 -347 327 123 -275 88 168 -250 -16 307 -22 -220 97 93 -133 47
1754 47 197 -173 -247 161 116 -202 54 177 -265 -108 340 -77 -258 185 14 -277 184 205 -281 -106 202
1775 202 -98 -59 199 -25 -186 105 136 -46 -29 63 -23 -137 117 202 -139 -162 240 10 -237 252 161 -413 52
1798 52 359 -265 -110 368 -198 -322 368 82 -393 165 203 -319 40 356 -161 -275 232 27 -220 116 157
1819 157 -193 -150 197 72 -220 43 154 -227 -56 318 -93 -253 254 48 -286 265 178 -401 25 336 -248
1840 -248 -88 358 -176 -321 343 142 -333 90 195 -255 -54 239 -32 -244 11 143 -116 -71 226 -38
1860 -38 -280 119 246 -252 -82 279 -175 -217 405 99 -399 209 255 -316 32 408 -217 -205 318 8 -262
1881 -262 159 149 -262 -20 207 -55 -127 73 22 -118 59 161 -148 -148 147 -3 -204 175 85 -339 55 332
1903 332 -187 -132 343 -130 -298 347 154 -385 94 261 -281 -57 358 -106 -248 213 99 -176 65 166
1923 166 -157 -112 176 52 -185 22 133 -185 -83 247 -38 -267 153 146 -240 16 249 -220 -174 298 10
1944 10 -247 128 84 -214 52 209 -120 -93 96 -51 -93 133 54 -151 -57 136 -18 -87 143 46 -199 53 194
1967 194 -128 -104 227 -48 -240 183 177 -295 6 228 -156 -142 242 -66 -251 207 104 -250 32 144 -192
1988 -192 -35 229 -57 -219 133 56 -189 124 221 -205 -141 218 3 -153 163 111 -230 7 265 -88 -54 172
2010 172 -30 -158 137 121 -168 15 140 -165 -77 180 -75 -173 129 80 -201 31 107 -134 -68 217 28 -143
2032 -143 15 24 -78 73 141 -71 -78 50 -23 12 96 -16 -93 32 78 -40 45 66 -74 -70 75 32 -55 19 84 -45
2058 -45 -48 75 28 -101 24 109 -40 -63 22 -72 -72 55 17 -20 -27 -14 -40 35 66 -5 -32 -36 -5 45 13 -12 8 -65 -10 82
2088 82 24 -86 68 18 -99 47 108 -97 -66 117 -32 -48 76 -7 -74 78 46 -52 17 3 -114 33 64 -52
2112 -52 -45 44 -41 -74 75 81 -113 -42 114 -8 -95 85 87 -139 3 149 -57 -75 168 -32 -138 162 78 -219 71
2137 71 154 -150 4 216 -92 -133 185 11 -114 91 53 -162 -8 124 -22 -62 55 -14 -92 12 70 -43 -47
2160 -47 49 1 -76 70 58 -126 25 149 -101 -55 185 -47 -145 186 67 -202 74 119 -167 -31 194 -119 -131
2183 -131 109 -7 -106 116 44 -110 -15 61 -71 -24 45 -28 -90 41 60 -46 -70 59 7 -112 45 86 -125 -19
2207 -19 165 -57 -89 131 -12 -145 112 69 -116 21 31 -99 19 120 -70 -22 60 -56 -49 48 9 -26 2 4 28
2232 28 -33 -21 28 1 -100 51 89 -93 -36 87 -54 -53 114 -23 -66 92 24 -57 33 24 -68 19 66 -48 -2 49 -36
2259 -36 26 31 5 -21 -25 48 19 -43 34 83 -64 -63 108 -7 -126 66 64 -120 15 84 -123 -23 101 -73 -60 89
2285 89 -35 -105 66 21 -78 34 29 -24 -44 72 13 -16 -13 53 -15 -25 27 55 -49 0 87 -41 -28 59 -8 -68 57 27
2313 27 -67 27 16 -71 34 45 -79 -31 44 -59 -54 42 -13 -77 21 18 -41 1 -24 6 -50 13 18 2 0 21 0 -30 23 33 -61
2344 -61 -19 69 -31 -16 87 -21 -52 55 57 -35 20 52 -78 -31 68 -33 -4 17 25 -11 19 -13 -1 9 -18 8 7 4 -4 9
2374 9 -7 37 4 -23 33 -7 -40 40 53 -57 2 55 -12 -22 66 14 -26 67 33 -18 5 20 -15 7 14 -11 -20 20 -5 -31 -6
2405 -6 -8 -43 -38 -4 -5 -29 -8 16 -34 -35 28 -14 -59 28 20 -44 -7 16 -16 -28 21 18 15 -18 -4 -19 39 6 -10 32 6 -4 14 46
2439 46 33 9 11 0 -22 10 43 13 -10 -5 -5 -15 -34 27 -43 -42 4 6 -13 25 10 -27 9 28 -56 2 10 -3 -14 42 -15 -48 34
2472 34 38 -22 -5 25 7 5 26 19 3 -5 -1 4 -18 28 -11 -13 1 -12 -35 7 17 -41 0 14 -20 -28 22 1 -26 17 11 -31 -1 10 -14
2507 -14 -41 -19 20 25 10 5 -5 -2 7 -8 -30 28 5 -2 36 15 -19 -6 36 15 -19 22 6 -35 -6 36 -10 -11 24 -2 -36 6 30
2540 30 -16 -1 -14 -39 -27 29 9 -31 -4 -3 -64 4 33 14 -19 9 -3 -24 21 30 -6 8 35 -1 -10 60 22 -27 1 20 -15 -19
2572 -19 16 6 -1 35 -7 -22 6 29 -44 -23 12 -19 -42 30 -3 -30 4 30 -54 -33 17 3 -8 31 12 -21 5 19 -27 -2 29
2603 29 -12 -18 -5 18 2 27 20 -21 -22 4 18 -18 -1 -11 -6 -9 28 12 -29 39 13 -22 -5 19 -13 -3 -16 9 -62 9 14 -10 26
2636 26 38 -24 -10 33 31 -34 9 2 -14 -17 35 -17 5 29 18 -32 24 35 -53 10 41 1 -29 48 1 -25 0 37 -47 -49 7 24
2668 24 -19 25 -20 -55 -12 -4 -26 -12 26 -16 -33 14 -14 -32 9 30 -37 -22 49 -13 -11 17 17 -26 6 40 -12 -7 33 2 -26 2
2700 2 -17 -12 -8 35 -21 -44 17 -24 -26 17 -9 -20 -24 59 -19 -52 -1 6 -58 -26 -4 -35 -17 13 -16 -5 19 19 -36 -5 25 -21 0 -21
2734 -21 -11 -21 18 12 -16 38 13 -17 9 17 -46 -36 -14 15 -20 11 16 1 -38 21 7 -29 -17 1 -39 -14 41 -22 2 6 -11 -2 3
2767 3 7 -21 7 31 5 -8 4 15 -35 -13 28 -25 -53 16 -9 4 4 42 -28 -19 12 -25 18 3 -22 6 7 -27 -15 -2 11 -19 5
2800 5 0 -22 -23 -7 13 -27 -15 29 -44 -35 -12 14 -39 7 20 -19 2 42 -19 -26 35 -3 -25 28 42 -28 6 29 -14 -2 43 11 -64
2833 -64 7 27 -31 -36 -12 -36 -41 -26 4 -32 -9 -1 -4 -12 2 12 -4 10 15 -20 12 26 -54 7 46 -7 -5 66 -19 -35 -3 39 -42 -14
2867 -14 23 -29 -3 33 1 -53 12 11 -8 -2 23 -12 -2 -6 3 -32 -15 35 -22 -9 13 -7 -56 -6 18 -70 6 46 -34 -52 56 15
2899 15 -29 -12 7 -26 17 8 -7 -33 6 14 -4 9 6 -15 -11 16 -18 -44 33 47 -48 3 40 -23 -28 51 9 -63 49 34 -27 -26 34
2932 34 -26 -22 64 -42 -39 29 2 -44 32 12 -42 -5 43 21 -32 23 44 -47 -9 56 -22 -58 48 35 -50 8 52 -49 -41 78
2962 78 8 -53 5 36 -67 27 45 -90 -26 28 -33 -61 47 -1 -53 3 51 -44 -25 46 11 -67 -1 47 -11 -63 87 42
2990 42 -60 38 49 -30 -17 63 2 -30 51 -27 -46 81 -16 -106 21 22 -108 26 65 -24 -68 69 33 -63 42 60 -57
3017 -57 -56 58 -27 -66 29 45 -72 -17 70 -25 -58 35 16 -70 38 38 -73 37 56 -50 1 89 13 -43 30 42 -4 -9 34
3046 34 -6 -31 30 16 -22 -21 14 21 -47 6 20 -7 1 -4 -24 -16 -19 -15 -14 34 -30 -37 35 23 -42 0 64 -13 -35 42 53 -34 -2 33 -4
3081 -4 -16 20 55 0 -30 15 -25 -33 44 12 -60 20 7 -61 28 60 -36 -28 54 -13 -71 28 10 -66 28 83 -46 -42 63 9 -50
3112 -50 14 37 -12 -24 38 0 1 43 0 -57 32 38 -30 46 43 -28 -45 61 15 -45 62 58 -61 -8 61 -43 -37 62 4 -57 18
3143 18 15 -40 2 69 -51 -19 10 -26 -23 55 17 -75 30 39 -56 3 70 -3 -72 29 42 -56 5 69 -27 -21 72 23 -30 41 58
3174 58 -38 20 47 -58 -5 29 12 1 33 14 -29 6 39 -40 -37 13 -25 -46 13 20 -26 -38 25 -13 -23 14 -11 -24 6 -5 7
3205 7 -11 3 -25 39 23 -3 -2 42 16 -3 0 40 -12 -27 18 0 -27 -22 16 -47 -45 39 -14 -60 -8 -11 -49 -14 14 -1 -32 -5 4 -8
3239 -8 19 19 -12 -16 41 -11 -12 23 26 -49 -1 62 -5 -47 57 18 -54 2 55 -44 -26 85 -24 -46 13 8 -44 6 43 -20 -5 34
3271 34 -49 -22 51 -20 -64 16 35 -36 16 63 -27 -67 46 45 -53 10 67 -56 -26 49 7 -71 41 39 -49 31 37 -64 -5 63
3301 63 -14 -37 74 -2 -64 35 62 -33 -8 57 -32 -49 24 36 -57 -18 24 13 -64 11 13 -62 -3 63 -66 -35 51 -42 -48 64
3331 64 18 -61 38 43 -70 28 51 -22 -70 48 48 -64 26 41 -29 -28 71 3 -72 -10 69 -45 13 70 -39 -49 32 -5 -49
3360 -49 33 52 -60 -20 56 -31 -64 71 2 -90 47 53 -58 12 91 -34 -30 44 20 -36 -3 63 -11 -59 59 -20 -30 16
3388 16 24 -29 -27 40 -17 -45 46 4 -72 23 47 -55 -11 60 -19 -61 36 23 -52 14 41 -22 -22 44 -26 -30 24 8 -9 16 7 -12
3420 -12 -22 19 -16 -53 27 32 -75 12 75 -23 -24 88 -15 -88 19 48 -74 -19 57 -54 -51 31 -1 -80 25 27 -54 -15 32
3449 32 -44 -68 51 21 -72 -21 66 -25 -42 59 5 -66 58 70 -51 -17 57 -53 -70 49 24 -43 28 34 -30 11 51 -41
3477 -41 -9 18 -24 -34 21 -11 -73 10 33 -41 -19 0 -33 -62 -6 28 -50 -7 38 -9 -38 46 50 -61 -10 49 -41 4 20 1
3507 1 -32 37 31 -12 46 7 -42 -11 38 -10 -26 22 8 -21 -4 17 -22 -47 3 20 -16 -5 29 -6 -21 20 14 -35 -7 -2 -34 8
3539 8 -6 -53 8 29 -17 -19 49 -13 -51 40 34 -43 -14 38 -31 -6 36 42 -16 -5 41 11 -27 15 14 -32 -5 36 -38 11 42 -31 -42
3572 -42 46 -15 -57 35 -3 -59 -17 67 -65 -35 32 16 -63 6 22 -60 -33 40 -31 -22 2 17 -58 17 55 -36 -2 35 -34 -35 78
3603 78 -20 -23 -1 34 -73 -16 47 -6 -75 52 33 -71 19 45 -53 -16 28 -14 -49 8 -1 -18 -4 5 -55 -20 41 -16 -6 57
3633 57 -8 -76 17 59 -32 -20 72 0 -60 50 44 -41 -1 85 -8 -48 50 -5 -44 44 25 -61 -6 39 -46 -35 43 -18 -69 3
3663 3 21 -55 -29 41 -31 -54 12 24 -64 18 31 -12 -39 56 -4 -38 34 41 -31 -16 25 -10 11 40 8 -6 32 13 -32 36 27 -49
3695 -49 -7 32 -20 -53 51 32 -76 -31 25 -34 -47 34 3 -75 -28 39 -23 -34 53 -10 -31 19 37 -12 -2 51 1 -34 72
3724 72 21 -51 35 52 -26 -22 66 -6 -59 41 24 -55 1 68 -26 -55 44 -19 -18 25 46 -49 -5 25 -46 -30 41 -31 -77 18 -3
3755 -3 -64 19 64 -21 -36 37 -6 -68 45 59 -47 -25 34 -32 -49 40 31 -80 19 27 -47 -20 34 -9 -41 42 -9 -43 11 30
3785 30 -91 -6 61 -7 -56 18 22 -64 2 37 -37 -90 14 20 -37 6 38 -39 -6 45 -13 -24 14 3 -28 27 10 -20 12 29
3815 29 -6 -27 36 39 -12 -1 33 -26 -35 27 16 -30 13 20 -32 -5 32 7 -19 -7 9 -20 -3 9 -44 -20 7 -37 28 58 -7 -47
3847 -47 -8 31 -29 28 28 -9 20 27 27 -35 19 31 -16 6 48 -6 -36 -5 8 -38 -1 21 -4 -32 15 -8 -46 48 13 -45 16 18
3879 18 -47 -29 7 -8 -29 18 12 0 -28 9 22 -15 32 17 -16 5 -18 12 -18 24 -16 -32 33 22 -18 7 23 -30 -7 64 -14
3910 -14 -32 34 1 -30 11 30 -22 11 2 -6 -38 31 0 -44 -4 -3 -29 -10 20 -23 -26 28 25 -6 -7 48 -4 -10 28 21 -48 8 47 -13
3944 -13 37 42 -1 3 42 13 -28 8 -6 -27 0 -12 -12 -21 8 -20 4 21 -17 -41 -44 4 -27 -29 12 10 -41 7 -9 -41 -20 42 -6 -20
3978 -20 53 10 4 11 1 -30 -17 29 1 12 26 5 -29 21 30 -35 -3 24 -24 -34 -26 21 -22 23 -5 14 -44 17 0 -18 11 14 -9
4011 -9 -11 13 -26 -21 12 -22 -35 22 18 -21 15 43 -15 -11 23 3 -13 1 22 -18 2 32 -3 1 -5 3 -46 10 9 -3 -6 45 -4 -16 7
4046 7 -9 -26 6 7 -18 -5 32 -14 -27 14 -17 -65 -6 19 1 -38 -1 18 -35 -19 13 -18 15 21 9 -31 8 28 1 8 45 -20
4078 -20 -46 37 32 -22 8 2 -36 -26 55 -8 -51 28 5 -60 -7 29 -41 -8 41 -24 -22 7 31 -30 -9 39 -30 -24 26 12 -12 36
4110 36 -20 -46 6 35 19 -3 33 -17 -49 27 43 -29 -6 35 -52 -42 35 26 -52 29 7 -28 4 34 -18 -11 22 -14 -63 -4 39
4141 39 -4 -30 41 8 -36 25 18 -31 -4 63 -23 -14 34 5 -14 15 38 -13 -29 -9 0 -4 5 1 11 5 4 -12 0 6 -31 -18 22 -8 -32
4176 -32 2 26 -41 -19 23 -10 -15 -28 5 -4 6 23 -13 -32 12 11 -12 20 6 -4 -8 -17 -4 21 14 4 -20 6 6 26 1 27 -24 -21
4210 -21 6 -12 -23 -13 24 -38 -36 -5 -9 -30 7 10 -18 -32 -5 -4 -18 19 -16 -39 -3 8 -24 29 7 -1 -11 37 22 -13 1 23 11
4243 11 -38 32 20 0 7 36 -24 -27 8 8 -10 21 -7 -26 -2 -20 -25 3 -13 -13 -19 3 -15 17 4 -12 -10 -2 2 -24 15 21 10 -12 3
4278 3 13 7 -17 22 -7 1 -1 -4 -34 9 6 -9 14 -9 -28 -5 48 -25 -25 6 18 -25 -14 10 -13 -9 -9 -7 -30 -25 -19 -23 2 -3 -8 0 3 -10 -22
4317 -22 10 0 -8 -5 -22 7 0 3 -32 -27 9 21 16 2 8 0 -20 29 16 -17 11 10 10 -20 -2 -27 4 19 -2 -23 4 2 3 -19 36 -8
4353 -8 -31 -12 -17 -21 -7 -6 -4 -4 4 23 -21 -4 8 17 -23 10 10 -14 41 7 2 21 4 16 -8 -5 3 13 16 -23 -8 -1 0 -4 -21 -28 -14 10 9
4392 9 5 -16 -3 1 -17 -10 -19 -5 -34 -2 -19 -20 4 12 -5 -37 21 -7 6 30 13 4 25 6 6 -29 5 22 -9 6 -6 31 -1 -14 -7
4427 -7 -6 -22 12 -13 -15 -5 19 -13 -4 -12 -25 11 -36 -27 13 11 -14 -8 45 -15 -11 32 -10 -14 0 16 -22 17 3 -19 -24 33 7 -7 13 18
4463 18 -21 -10 6 33 -33 7 13 10 5 8 2 -52 -15 27 -37 -10 12 -34 -22 -7 -8 -22 25 -11 -43 13 5 -3 -28 1 37 -12 33 16
4497 16 -15 12 11 16 -15 -8 5 -41 -15 29 -2 -13 0 23 -24 18 14 -4 4 -4 -33 -17 -6 7 5 -4 8 -19 -13 -1 -2 -11 1 20 -38 -15
4533 -15 18 -4 -26 10 -16 -32 9 -5 -22 -3 28 22 -26 20 23 -39 14 4 -31 25 47 1 3 6 1 -32 40 15 -33 4 -2 3 -16 11
4567 11 -27 -2 -13 35 -20 -17 13 -16 -3 5 21 12 14 6 -1 3 21 -1 -18 25 27 -7 13 -6 -9 2 17 11 21 -17 -12 -26 16 7 5 -24 -23
4604 -23 -8 4 9 -21 -23 -4 -15 -19 -13 0 -13 -3 -6 2 -16 14 6 -9 -14 -5 17 15 -15 10 11 3 17 7 -1 -20 14 28 -19 1 25 -5 -18
4641 -18 9 -7 -2 22 10 -19 9 8 -27 -11 -19 -20 -16 28 21 -13 -17 -10 38 -25 10 1 2 9 -41 -12 15 11 -22 3 12 -14 10 18 8 17 23 4
4679 4 6 27 40 -1 3 26 -12 -8 15 -4 12 12 -9 -20 -4 4 -20 -22 -11 6 -14 -4 -6 -33 -11 1 -16 -33 -13 -9 7 -11 -16 4 -6
4714 -6 12 4 6 2 13 4 4 4 10 -7 8 -19 31 -14 6 0 5 7 -23 13 -29 -4 -18 -13 -6 -17 -20 -14 -8 4 18 -7 15 -2 6 -4 9 -1 26
4753 26 1 -5 9 2 -13 15 1 34 3 -8 -7 -22 16 -7 20 -11 -13 4 -2 -8 -2 5 -4 -3 19 6 -20 -22 -2 -41 -2 0 -17 -21 -27 -10 -29
4790 -29 -1 -6 -12 -4 -17 -1 -3 26 10 1 3 22 0 -1 -1 16 -25 -9 -3 23 8 -2 -6 -31 -27 -25 -19 0 -5 -20 -21 19 3 -19 -8 7 -3 22
4828 22 19 -30 -32 -1 4 -21 2 12 1 -5 4 32 -28 5 -3 -8 20 28 -5 -15 13 7 18 -18 2 -12 -2 5 6 -10 15 4 -37 22 1 4
4864 4 7 -6 9 -11 -14 6 -1 11 -22 -6 6 3 0 -2 10 -26 -1 11 25 -11 17 18 24 -1 1 38 -12 1 9 -4 27 22 -15 20 0 24
4900 24 7 -8 -14 -17 -4 10 -3 -4 -2 -3 -23 -7 1 6 -6 -2 2 17 -9 -11 7 7 -5 -2 -4 13 3 18 29 28 36 10 -10 17 -20 -18 22 10
4938 10 26 14 10 -7 6 14 -16 0 -13 -14 3 -29 30 -6 -16 -1 -23 1 12 9 -22 -5 -14 -51 -18 8 17 -6 21 -12 -13 10 2 -1 -2
4973 -2 7 -20 -4 20 4 -1 -7 5 10 28 12 2 6 -4 22 -5 -11 -6 -8 -2 -7 0 -6 -14 3 2 4 -26 -8 -10 -10 -9 -15 18 1 -3 8 14 6 0 -9 21 -15
5016 -15 17 15 -7 -6 22 11 17 19 6 -11 2 -5 8 -14 -8 -11 17 -8 -8 -10 -12 -16 -15 -22 0 1 -27 1 -8 -5 9 34 -3 -31 10 11 14 -44 -30
5055 -30 39 -4 25 -16 -2 -14 23 13 14 2 -17 -23 -11 6 -25 8 42 -6 16 1 -12 12 -1 11 -24 -7 2 7 -35 7 6 -11 12
5088 12 9 6 -1 -24 -5 -8 8 -20 11 2 15 9 27 -2 -14 18 0 -5 8 0 8 14 28 13 7 10 9 1 5 14 -20 0 -20 5 -21 0 -9 4 -13
5127 -13 -12 16 -35 13 -1 -7 -4 -1 -24 22 -5 0 -7 12 7 3 0 3 7 15 -1 -6 20 0 -16 -12 9 -12 16 -12 -15 6 17 -18 11 -18 1 -27
5165 -27 -4 1 -1 -11 -16 -26 -5 -6 -22 -20 -3 -8 -25 5 -11 8 -19 13 3 7 37 10 2 -4 40 4 -7 17 13 -6 -13 5 -30 -14 -10 -4 23
5202 23 15 10 20 -19 7 -3 -11 4 -21 13 1 -10 -10 2 -13 -5 7 8 -7 -10 -7 31 -6 28 26 -12 -19 13 -10 4 12 4 -16 21 8 28
5238 28 20 6 -4 -3 16 -6 -8 6 -12 -8 11 -25 -27 3 -13 0 20 8 -2 -23 -9 -26 -2 -19 6 -9 -1 6 -17 -8 22 5 5 12 -18
5273 -18 -18 24 6 -19 7 -14 17 2 -17 10 12 -4 7 -16 -4 -13 -13 -12 3 29 -19 12 -20 -22 -18 0 5 4 -8 -22 15 16 -51 -31 7
5308 7 8 19 12 -1 27 -7 5 -6 -1 -18 5 12 -18 6 6 10 -22 7 -13 32 4 -26 -1 18 18 9 2 3 -5 -5 -6 -5 1 -6 23 -24 18 -9 -11
5347 -11 -6 -15 -8 12 -5 2 -10 10 8 -21 4 -1 -9 21 -2 -5 12 5 2 20 12 -11 -3 -9 5 -1 2 -6 -6 -11 -22 1 -23 -11 -22 -23 -2 18 26 7
5387 7 -5 -18 -1 -2 31 -6 8 -8 -5 -26 11 -6 -20 -14 -2 14 4 28 20 15 3 20 0 -12 -9 25 2 9 19 11 1 3 12 4 -14 7
5423 7 -26 23 -3 -38 -22 -11 -17 -10 2 7 13 -27 -21 2 -6 -3 23 0 5 1 -14 1 24 11 3 22 7 -4 12 26 12 13 12 -4 -2 -7 -3 -29
5461 -29 9 0 5 9 19 10 27 13 9 -2 -12 -29 6 -18 -5 15 -8 19 -18 -5 10 -4 21 15 0 -9 -7 -3 -4 24 2 5 8 0 38 5 25
5498 25 17 -16 5 -3 6 8 -3 -12 -20 -9 -13 -10 -2 -5 -25 -13 -5 -5 -17 -24 6 7 26 -19 -7 15 1 -4 18 -16 10 -6 10 -4 -2 7 15 14 -12 -7
5538 -7 23 -7 2 -10 21 3 3 11 24 8 15 33 7 3 4 -9 1 -2 -25 -5 -1 20 1 -4 -8 8 21 -5 19 -12 -19 -23 7 -7 -3 15 -1
5575 -1 32 17 5 -4 35 -6 28 5 -8 26 19 -3 19 -5 -4 -18 3 -24 2 21 11 7 -14 11 8 -2 2 -4 5 2 -12 -20 -10 6 11 30
5611 30 11 0 16 -8 -3 -30 15 -6 19 2 11 3 10 33 25 -6 21 20 -24 15 -11 -11 -12 9 -16 -3 -20 -29 33 -10 -2 1 -5 -12 -28 -7 -12
5648 -12 -9 12 -10 -9 -25 -19 -14 -15 -20 -21 -9 8 -19 4 -6 8 29 1 -2 10 17 10 -2 22 9 12 -2 6 4 -11 -16 11 3 -11 -11 5 -4 -13 -5 -20
5688 -20 -1 2 -5 25 -24 14 2 0 6 -20 0 -17 -2 25 -32 -1 15 -21 -1 10 23 -6 0 12 -3 37 2 23 -7 16 -19 -3 26
5721 26 2 -7 -6 -5 -19 0 -12 -8 -21 -10 -35 -3 5 -14 -28 -23 6 -7 7 -9 -13 -27 8 11 27 21 8 -3 6 6 -25 -3 -17 -5 -4 0 -4
5758 -4 -2 9 -9 -4 5 14 2 -15 16 14 8 3 -12 -13 -48 18 -22 -10 -12 5 7 -4 -4 -11 -23 11 -14 -31 2 -12 -1 -6 2 25 -8 -9 -8 25 23
5797 23 -25 32 -9 -5 3 7 7 -12 -29 14 -4 -5 -10 9 -5 -2 -33 -52 -13 15 -6 -8 2 -32 5 -50 -28 -2 12 -30 -7 3 -8 0 -3
5832 -3 32 8 7 6 -17 6 -5 -13 32 13 12 12 -16 3 -8 3 2 2 -7 -12 21 -29 -31 0 4 -4 -11 -13 -4 -12 7 -6 6 -17 -17 -21 0 -13 22 14
5872 14 5 -18 -15 3 14 -8 -3 9 -11 3 1 -1 -3 21 7 4 -25 17 -27 -9 10 4 -9 4 25 17 -52 -3 -1 -6 23 -15 -3 -14 6 -20
5908 -20 -7 11 -24 1 -10 37 -9 12 17 -28 -18 0 6 -9 -2 3 8 18 -12 9 7 13 22 -16 -9 -12 6 18 10 -12 1 3 -2 9 -22 -8 -12
5945 -12 15 -17 -19 -22 -11 -36 -12 -26 9 -20 -7 15 19 -4 17 6 31 -7 4 4 -13 0 -36 -7 11 -13 18 4 -17 -14 -6 14 21 -3
5979 -3 -1 -20 -33 -1 24 -6 -24 2 -4 0 -7 -26 -20 28 -12 -23 16 -5 7 4 -8 14 -6 6 12 6 -6 26 -13 1 -3 -9 12 -7 4 4
6015 4 -26 19 7 -26 5 11 9 -11 6 3 1 10 -44 -29 19 -25 -13 -23 20 -5 -25 -15 8 -16 -48 -8 1 -9 9 -14 4 15 -28 -3
6049 -3 14 -11 9 41 -1 -27 -15 6 -10 21 5 -13 -14 1 -5 7 -8 -8 -13 -15 10 -4 -14 -24 16 -11 -7 12 -1 -17 2 -9 19 15
6083 15 36 17 1 11 -12 -5 13 -5 -9 4 9 -3 4 -7 17 3 0 15 7 6 -4 26 17 -24 3 6 -10 6 20 -6 -9 -27 -6 14 -11
6118 -11 -2 -22 -8 1 8 30 8 -7 -18 -5 -29 -15 -28 -21 12 14 -4 12 -16 18 31 21 -18 -13 9 7 3 18 5 -9 2 2 -19 -6 -10
6153 -10 7 1 -15 5 -2 -7 -9 -16 15 -30 -17 -18 -15 -31 -26 -13 -13 14 18 -2 -10 -12 -6 23 -8 4 2 -13 2 9 4 28 -3 -25 16 8 15 21 8 -9
6193 -9 -7 3 14 8 -11 14 6 -30 -11 5 -3 -22 -36 -21 -13 -22 -35 15 -2 -20 4 -15 -6 -10 24 -5 9 -5 13 7 4 10 18 9 -6 -15 -10 -12 12
6232 12 -9 32 -20 10 3 14 -10 10 -6 -17 -9 -13 4 3 -13 -13 -1 -11 -9 13 -23 -21 9 -15 -16 -16 -17 14 -22 7 19 -3 -1 22 2 3
6268 3 23 21 -6 -6 26 8 -8 11 4 -25 -10 6 -10 -24 -15 -16 -16 8 -9 -4 -8 -24 9 20 24 8 -13 -15 3 -14 -3 17 -2 -17 18 0
6304 0 -13 -1 7 -15 4 18 -25 -6 -5 2 -34 6 7 12 12 11 -19 -4 16 -8 -7 6 -5 -4 -18 -15 -38 -21 15 -6 -6 -5 -3 -9 -9 9 -23 -20 5
6343 5 6 4 -7 3 -8 8 4 -4 -1 9 -5 -20 0 -8 -4 13 -8 -14 7 -7 -27 9 -23 -23 -14 24 12 -10 1 -10 -15 1 14 -28 8 -14
6379 -14 -2 -17 -3 -15 -16 8 16 -13 -2 -7 -22 -5 -20 -20 16 12 -6 11 33 4 -23 14 8 7 17 14 9 8 -17 0 13 14 16 15 34 -23 -11
6416 -11 -36 -37 -5 2 5 -2 -2 6 -26 -7 -12 6 5 -17 -18 9 1 27 -8 27 11 15 26 11 -5 25 -2 -12 24 -10 17 -1 7 -21 -13 10 -4
6453 -4 15 1 -4 11 7 -14 -10 -8 14 -4 -9 14 -19 -9 0 3 11 3 0 -3 14 8 12 -19 -6 -2 -2 -6 -14 7 13 46 -1 6 24 23 11 6 3 -19 0 7
6495 7 12 -10 5 11 -5 -2 5 9 -5 -19 16 8 6 -6 -22 10 -11 1 -8 -21 -8 -23 8 18 12 19 7 -44 -3 -5 11 -12 -1 32 -4 9
6531 9 -5 2 2 -19 -11 -8 5 -1 16 14 -11 3 -15 10 -18 -4 2 -35 -23 -32 0 -28 -12 4 17 -3 -2 -23 11 -2 8 0 32 -44 -24 14
6567 14 7 -6 -6 -9 -7 5 4 17 -17 9 -5 25 -5 32 14 -26 -23 3 -13 12 33 -27 -7 11 -14 1 -23 -3 -10 23 -4 2 24 6
6601 6 12 18 -17 1 -2 0 -6 -11 20 -11 5 12 25 5 25 12 -5 -13 -2 -3 3 2 -3 33 8 -3 2 -2 13 10 10 -7 -25 -6 -20 4 -15 -19 5
6640 5 -36 32 14 -4 -36 -5 -27 -7 -1 -32 -23 -15 7 -4 -6 9 3 -7 11 -4 -7 -27 -6 9 -9 -9 -15 2 -3 15 -20 -16 23 -21 1 2
6676 2 -17 -6 -8 -17 -9 -28 -10 21 30 3 -20 -4 1 -7 -4 -24 5 0 20 -9 2 3 1 -11 4 15 11 37 36 5 14 20 10 -11 8 4 -9 -22
6714 -22 -16 -8 -15 0 -2 -7 -26 11 0 14 -5 -36 -9 -8 -18 15 4 -5 -29 0 -6 -29 -2 -13 -35 -20 -10 -24 8 -2 6 -7 -15 -4 21
6749 21 15 -14 -14 3 1 -24 16 -11 10 -21 -16 7 -11 -8 -7 -29 -24 3 -20 -14 -38 2 -10 11 -31 14 23 17 9 9 13 -17 6 -6 3 14 -8
6786 -8 35 9 -2 2 9 15 -24 20 -13 8 7 0 13 8 -20 -7 -3 5 2 13 38 5 7 -26 -33 4 3 0 -23 -2 -4 -6 -36 13 24 -6 5 10 -1
6825 -1 3 6 24 -9 -6 14 18 -11 31 -12 -12 -4 -3 -2 -12 2 13 -17 4 15 12 29 -1 2 6 -8 1 1 6 -9 3 11 -14 17 13 4 9 16 2 -18
6865 -18 13 11 6 25 -10 33 20 -6 -8 20 -9 -19 15 -2 23 8 6 -31 19 -2 0 -8 -1 -12 11 -8 -12 14 -3 -5 4 -9 -28 1 -6 0
6901 0 -8 7 -17 -24 -1 -2 5 11 -2 6 -1 -6 3 -11 5 3 -8 -7 -9 -9 6 9 1 17 21 -12 47 -15 -6 1 11 0 -7 -13 0 -10 -4 -12 -22 19 -21 -6
6943 -6 -8 -13 -13 -16 -26 -3 -17 -12 18 -12 10 -16 10 4 32 1 3 19 -7 -16 18 5 -4 13 7 -7 -14 -9 6 -5 15 16 -2 -27 -12 -9 -36 9
6981 9 10 -29 2 -17 -36 -15 0 -1 -19 -7 10 -8 -3 41 -19 -43 -5 -23 -7 17 9 5 1 -9 -14 3 -8 13 9 8 6 -13 -3 -23 1 -9
7017 -9 -17 -4 -18 -7 -14 -25 -14 29 -3 9 -13 -18 -14 -12 -5 -6 11 4 13 -6 -22 -10 -9 -21 -6 0 18 -2 14 11 -9 -9 -1 12 6 8 -5 -2 11
7056 11 -6 -3 1 0 19 -6 14 -22 -4 6 -9 3 4 -18 -4 -20 12 19 -3 2 -13 8 -6 1 -1 -2 23 -4 1 19 17 15 7 -4 -8 11 -13
7093 -13 5 0 19 10 -19 9 -15 -8 -36 -6 -3 -19 -5 -9 -22 17 -16 -13 5 26 -17 -9 -15 3 8 -12 -11 8 17 -19 4 -21 9 29 10 6
7129 6 -15 2 18 -16 4 -11 9 22 25 22 13 -6 13 -6 -19 31 -25 12 -33 4 -5 -16 11 17 1 1 -16 -12 20 -21 -7 23 3 -23
7163 -23 -8 7 13 8 11 8 -2 -4 -5 0 7 5 -30 -7 -4 4 -18 -18 0 3 7 14 10 2 17 -24 -6 -8 -11 -9 27 -23 3 12 7 2 10 11 31 -6 29 1 -20
7206 -20 -4 1 6 -3 -13 -8 -8 17 19 10 22 14 -13 8 -11 1 1 24 -2 4 0 9 -15 8 4 -8 -1 9 30 -24 -8 4 -9 23 8 5 -17 3
7244 3 -9 15 -19 -5 11 -21 15 -25 1 5 5 0 14 20 -24 4 11 -27 -17 8 -19 -11 -19 5 13 7 20 8 0 0 -18 -38 -35 -25 4 9 31
7281 31 -21 3 -6 0 -5 21 -11 10 -6 19 -3 7 7 -6 50 -14 7 8 10 -12 -8 1 -26 12 31 -9 -30 7 0 2 -17 28 1 -21 -10
7316 -10 10 -19 -30 29 9 23 -11 -6 -20 -13 4 -3 -9 -13 -18 -24 0 -10 -16 0 -30 -28 19 -7 2 -24 -15 -15 -10 5 7 0 7 1 0 -24 15 8 5 17
7356 17 5 -15 10 -1 3 -16 15 0 2 14 -10 -16 -7 -14 4 -5 6 21 8 8 -6 -5 7 -18 9 1 -4 22 -4 2 -13 4 -24 -5 -9 38
7392 38 11 -4 -26 18 -18 33 23 -17 -9 9 -10 -13 17 -16 -8 -19 11 8 3 15 12 -31 -7 -25 -20 -13 1 -7 -5 13 0 2 -18 1 -10 -20
7428 -20 12 -6 15 -1 -2 10 11 31 -11 -11 3 -4 -4 11 -3 3 -6 -7 -3 0 -13 -7 0 -11 30 -18 -20 -21 -7 -1 8 6 -9 14 -5 -4 5 -9 6 0
7468 0 5 17 -19 -2 15 21 28 6 5 -7 10 13 -1 -29 0 -37 -26 -4 5 17 13 9 -18 -11 -27 13 6 -1 16 29 18 -3 -12 -17 7 -15 1
7505 1 4 3 11 -36 2 3 -7 -12 -9 -3 15 -3 10 9 42 11 18 7 -21 -14 -20 6 -19 8 -5 3 17 1 -36 -1 1 -5 -5 -15 -2 -17 8 -15
7543 -15 0 -7 12 -15 1 -7 -9 -17 -8 12 -6 11 -8 11 -41 -10 2 -18 -19 -9 8 3 7 -6 15 -7 -1 -15 -12 -4 -5 19 -9 14 -3 14
7579 14 -16 -22 12 -19 -7 -9 -11 1 -25 13 -8 -16 -15 -12 0 -10 -11 7 10 8 -4 13 4 1 -15 -2 -25 -25 5 16 37 -19 17 -13 2 -36
7615 -36 7 -6 0 -27 -8 -17 6 -3 -7 -20 -2 -35 1 1 6 -15 -24 -1 7 14 15 -8 -17 -6 1 5 -13 -34 24 12 3 28 -1 -4 -9 9 2 -29 -36
7654 -36 -7 -14 21 -28 14 8 -11 -9 4 17 -22 -22 8 -14 -26 23 -16 0 8 6 -29 -9 -19 -18 16 -12 8 -11 8 -14 13 19 10 5 8 31
7690 31 9 21 5 10 -3 17 -1 8 -8 1 13 3 9 -27 0 13 -23 3 22 6 -8 -12 -17 -7 -18 -15 -8 0 -26 -18 -9 -1 -24 7 11 1 -4
7727 -4 6 -9 -4 -10 17 21 -20 17 -1 1 -21 -15 7 -14 9 -13 10 -25 -1 -1 2 -34 -4 0 17 -21 2 -2 -2 -3 -7 0 -5 -19 -29 -10 -4 -7 15
7766 15 5 9 -20 -1 20 9 2 -6 -6 1 0 9 9 11 10 3 -2 -3 6 -20 -4 -18 -24 -18 -10 -8 -20 -15 -8 -29 8 -19 -25 30 -6 -3 -16 2 -35 5 14 -4
7808 -4 17 -5 29 1 -20 0 7 -11 12 0 -10 -25 7 0 11 -1 2 8 9 25 14 -24 -7 1 21 13 7 15 2 30 8 -15 -2 10 -11
7843 -11 -6 11 10 6 -13 6 3 25 21 -38 -1 -6 3 6 13 -5 11 5 15 23 -15 0 2 8 -9 12 -2 6 -5 -1 0 23 25 -11 -4 29 30 -8 2 -22
7883 -22 -14 12 -23 -1 41 1 -15 13 -21 -4 -33 -19 -9 -16 20 -7 9 -11 9 -14 4 -23 -7 1 17 -6 15 6 -1 -2 -24 -6 -10 -24
7917 -24 16 15 20 -11 -21 -14 -9 -2 0 13 -30 11 2 17 11 6 4 4 -14 0 -7 -5 11 1 -1 -3 1 -13 10 -7 -8 -33 23 -3 -2 17 -18 -19 1 5
7957 5 2 -8 11 1 1 -2 3 -12 -8 -5 4 3 -12 -2 2 15 -7 -8 -4 28 24 -10 13 13 33 -19 3 -12 -2 -3 2 -2 -22 -7 -9 0 12 -3 3 21
7997 21 -24 2 -14 30 10 -1 -6 3 3 28 -24 28 3 18 -3 20 4 4 -6 -15 5 -13 7 -25 16 1 -12 2 -16 8 -45 -6 15
8030 15 -16 -15 -1 -11 -23 1 13 -3 5 22 10 -8 8 -6 13 -13 4 17 -8 15 26 13 -16 -1 12 -24 -12 -5 -22 3 9 6 -6
8063 -6 2 9 12 -2 -17 -5 -1 32 -4 8 -3 11 -5 9 27 -4 3 -13 13 7 -3 -7 15 -2 0 -19 8 17 -4 12 -15 26 -31 10 14 0
8099 0 9 -7 -22 -1 -12 -14 6 -7 18 5 -18 -5 15 -1 0 -3 -29 6 0 -13 1 23 4 -6 4 5 28 23 10 8 20 21 -8 7 -3
8134 -3 6 -7 -8 -32 -13 4 -23 21 -15 -11 0 -11 -1 19 4 0 2 -21 15 -6 -10 27 -10 -17 12 9 -6 28 -26 1 12 -13 16 4 6
8169 6 11 6 -9 4 -10 10 -3 27 -17 3 6 -25 -33 -27 -24 -9 -33 -3 -2 -4 21 -12
8191a2
##END NTUPLES=NMR FID
##END=
