##TITLE=1H_3MBDE-4
 CDCl3
 8 sc, 
 22.11.2022
##JCAMPDX= 6.0         $$ Bruker NMR JCAMP-DX V2.0
##DATA TYPE= NMR FID
##DATA CLASS= NTUPLES
##ORIGIN= UXNMR, Bruker Analytische Messtechnik GmbH
##OWNER= root
$$ XWIN-NMR		Version 3.5
$$ Tue Nov 22 15:27:34 2022 Russian Standard Time (UT+4h)  she@DPX200
##.OBSERVE FREQUENCY= 200.1313499994
##.OBSERVE NUCLEUS= ^1H
##.DELAY= (6, 6)
##.ACQUISITION MODE= SIMULTANEOUS
##.ACQUISITION SCHEME= undefined
##.AVERAGES= 8
##.DIGITISER RES= 18
##SPECTROMETER/DATA SYSTEM= spect
##.PULSE SEQUENCE= zg30
##.SOLVENT NAME= CDCl3
##.SHIFT REFERENCE= (INTERNAL, CDCl3, 0, 15.7039)
##AUDIT TRAIL= $$ (NUMBER, WHEN, WHO, WHERE, WHAT)
$$ ##TITLE= Audit trail, XWIN-NMR		Version 3.5
$$ ##JCAMPDX= 5.01
$$ ##ORIGIN= Bruker BioSpin GmbH
$$ ##OWNER= she
$$ F:/spectra/data/she/nmr/H-F/1/audita.txt
$$ ##AUDIT TRAIL=  $$ (NUMBER, WHEN, WHO, WHERE, WHAT)
(   1,<2022-11-22 15:26:19.75 +0400>,<she>,<DPX200>,
      <created by zg, POWCHK disabled, PULCHK disabled
       configuration hash MD5:
       00 E9 B6 7A A2 85 ED C7 34 08 36 98 17 FE 4E 26
       data hash MD5: 16K
       A7 2E 19 60 3E 56 D2 7B 25 52 81 66 04 EC 84 80>)
$$ ##END=
$$ 
$$ hash MD5
$$ 16 7D 36 5F 92 A6 E7 23 E9 0A 6B B4 EA BB 36 12
##$RELAX= 
##$RELAX= 
##$RELAX= 
##$RELAX= 
##$RELAX= 
##$RELAX= 
$$ Bruker specific parameters
$$ --------------------------
##$DU= <F:/spectra>
##$EXPNO= 1
##$NAME= <H-F>
##$PROCNO= 1
##$TYPE= <nmr>
##$USER= <she>
##$AMP= (0..31)
100 100 100 100 100 100 100 100 100 100 100 100 100 100 100 100 100 100 
100 100 100 100 100 100 100 100 100 100 100 100 100 100 
##$AQSEQ= 0
##$AQ_mod= 1
##$AUNM= <au_zg>
##$AUTOPOS= <>
##$BF1= 200.13
##$BF2= 200.13
##$BF3= 200.13
##$BF4= 200.13
##$BF5= 200.13
##$BF6= 200.13
##$BF7= 200.13
##$BF8= 200.13
##$BYTORDA= 1
##$CFDGTYP= 0
##$CFRGTYP= 5
##$CHEMSTR= <none>
##$CNST= (0..31)
1 1 145 1 1 1 1 1 1 1 1 1 1 1 1 1 1 1 1 1 1 1 1 1 1 1 1 1 1 1 1 1 
##$CPDPRG= <>
##$CPDPRG1= <>
##$CPDPRG2= <>
##$CPDPRG3= <>
##$CPDPRG4= <mlev>
##$CPDPRG5= <mlev>
##$CPDPRG6= <mlev>
##$CPDPRG7= <mlev>
##$CPDPRG8= <mlev>
##$CPDPRGB= <>
##$CPDPRGT= <>
##$D= (0..31)
0 1.2 0 0 0 0 0 0 0 0.06 0 0.03 0 0 0 0 0.0002 0 0 0 0 0 0 0 0 0 0 0 0 
0 0 0 
##$DATE= 1669116379
##$DBL= (0..7)
120 120 120 120 120 120 120 120 
##$DBP= (0..7)
150 150 150 150 150 150 150 150 
##$DBP07= 0
##$DBPNAM0= <>
##$DBPNAM1= <>
##$DBPNAM2= <>
##$DBPNAM3= <>
##$DBPNAM4= <>
##$DBPNAM5= <>
##$DBPNAM6= <>
##$DBPNAM7= <>
##$DBPOAL= (0..7)
0.5 0.5 0.5 0.5 0.5 0.5 0.5 0.5 
##$DBPOFFS= (0..7)
0 0 0 0 0 0 0 0 
##$DE= 6
##$DECBNUC= <off>
##$DECIM= 32
##$DECNUC= <off>
##$DECSTAT= 4
##$DIGMOD= 1
##$DIGTYP= 9
##$DL= (0..7)
0 120 120 120 120 120 120 120 
##$DP= (0..7)
150 150 150 150 150 150 150 150 
##$DP07= 0
##$DPNAME0= <>
##$DPNAME1= <>
##$DPNAME2= <>
##$DPNAME3= <>
##$DPNAME4= <>
##$DPNAME5= <>
##$DPNAME6= <>
##$DPNAME7= <>
##$DPOAL= (0..7)
0.5 0.5 0.5 0.5 0.5 0.5 0.5 0.5 
##$DPOFFS= (0..7)
0 0 0 0 0 0 0 0 
##$DQDMODE= 0
##$DR= 18
##$DS= 0
##$DSLIST= <SSSSSSSSSSSSSSS>
$$ [...]
##$SUBNAM2= <"">
##$SUBNAM3= <"">
##$SUBNAM4= <"">
##$SUBNAM5= <"">
##$SUBNAM6= <"">
##$SUBNAM7= <"">
##$SUBNAM8= <"">
##$SUBNAM9= <"">
##$SW= 18.0517283424941
##$SWIBOX= (0..15)
0 0 2 0 0 0 0 0 0 0 0 0 0 0 0 0 
##$SW_h= 3612.71676300578
##$TD= 16384
##$TD0= 1
##$TE= 0
##$TE2= 300
##$TE3= 300
##$TEG= 300
##$TL= (0..7)
0 120 120 120 120 120 120 120 
##$TP= (0..7)
150 150 150 150 150 150 150 150 
##$TP07= 0
##$TPNAME0= <>
##$TPNAME1= <>
##$TPNAME2= <>
##$TPNAME3= <>
##$TPNAME4= <>
##$TPNAME5= <>
##$TPNAME6= <>
##$TPNAME7= <>
##$TPOAL= (0..7)
0.5 0.5 0.5 0.5 0.5 0.5 0.5 0.5 
##$TPOFFS= (0..7)
0 0 0 0 0 0 0 0 
##$TUNHIN= 0
##$TUNHOUT= 0
##$TUNXOUT= 0
##$USERA1= <user>
##$USERA2= <user>
##$USERA3= <user>
##$USERA4= <user>
##$USERA5= <user>
##$V9= 5
##$VALIST= <valist>
##$VCLIST= <CCCCCCCCCCCCCCC>
##$VD= 0
##$VDLIST= <DDDDDDDDDDDDDDD>
##$VPLIST= <PPPPPPPPPPPPPPP>
##$VTLIST= <TTTTTTTTTTTTTTT>
##$WBST= 1024
##$WBSW= 4
##$XGAIN= (0..3)
0 0 0 0 
##$XL= 0
##$YL= 0
##$YMAX_a= 32847
##$YMIN_a= -58258
##$ZGOPTNS= <>
##$ZL1= 120
##$ZL2= 120
##$ZL3= 120
##$ZL4= 120
##$ABSF1= 10
##$ABSF2= 0
##$ABSG= 5
##$ABSL= 3
##$ALPHA= 0
##$AQORDER= 0
##$ASSFAC= 0
##$ASSFACI= 0
##$ASSFACX= 0
##$ASSWID= 0
##$AUNMP= <proc_1d>
##$AZFE= 0.1
##$AZFW= 0.1
##$BCFW= 1
##$BC_mod= 2
##$BYTORDP= 1
##$COROFFS= 0
##$CY= 11.3945322036743
##$DATMOD= 1
##$DC= 2
##$DFILT= <>
##$DTYPP= 0
##$F1P= 2.36226072786647
##$F2P= -0.459571619588291
##$FCOR= 0.5
##$FTSIZE= 0
##$FT_mod= 4
##$GAMMA= 1
##$GB= 0.15
##$INTBC= 1
##$INTSCL= 1
##$ISEN= 128
##$LB= 0.24
##$LEV0= 0
##$LPBIN= 0
##$MAXI= 10000
##$MC2= 0
##$MEAN= 0
##$ME_mod= 0
##$MI= 1.114404
##$NCOEF= 0
##$NC_proc= 0
##$NLEV= 6
##$NOISF1= 3.799351
##$NOISF2= 2.8
##$NSP= 1
##$NTH_PI= 0
##$NZP= 0
##$OFFSET= 15.70392
##$PC= 1
##$PHC0= -18031.47
##$PHC1= 14.00071
##$PH_mod= 1
##$PKNL= yes
##$PPARMOD= 0
##$PSCAL= 0
##$PSIGN= 0
##$REVERSE= no
##$SF= 200.130013532006
##$SI= 16384
##$SIGF1= 3
##$SIGF2= 2
##$SINO= 400
##$SIOLD= 16384
##$SREGLST= <1H.CDCl3>
##$SSB= 0
##$STSI= 0
##$STSR= 0
##$SW_p= 3612.71676300578
##$SYMM= 0
##$S_DEV= 0
##$TDeff= 0
##$TDoff= 0
##$TI= <>
##$TILT= no
##$TM1= 0
##$TM2= 0
##$TOPLEV= 0
##$USERP1= <user>
##$USERP2= <user>
##$USERP3= <user>
##$USERP4= <user>
##$USERP5= <user>
##$WDW= 1
##$XDIM= 8192
##$YMAX_p= 0
##$YMIN_p= 0
$$ End of Bruker specific parameters
$$ ---------------------------------
##NTUPLES= NMR FID
##VAR_NAME=  TIME,          FID/REAL,        FID/IMAG
##SYMBOL=    X,             R,               I
##VAR_TYPE=  INDEPENDENT,   DEPENDENT,       DEPENDENT
##VAR_FORM=  AFFN,          ASDF,            ASDF
##VAR_DIM=   8192,          8192,            8192
##UNITS=     SECONDS,       ARBITRARY UNITS, ARBITRARY UNITS
##FACTOR=    0.0002768,     1,               1
##FIRST=     0,             0,               0
##LAST=      2.2672688,     0,               0
##MIN=       0,             -58258,          0
##MAX=       2.2672688,     32847,           0
$$ Real data points
##PAGE= N=1
##DATA TABLE= (X++(R..R)), XYDATA
0@%%%%%%%%%%%%%%%%%Qj6J6j6J6k0K8l2L3m1M8n6O5p3Q7r8J08j22J38j56J77j99
39a05K22k46K73l03L36l73M12m54N02n54O11o74P40q14Q99r92J097j218J354j510
59g97J693j912K175k498K910l459M230n389P366j1634M0162m1059l1958P0521
73C0351l2742k3867N0305N24n2748K6311J8535l3134O030L1751k1781j3923J8509
86D121r96j5379J0250R566q061o663J0385L021j4999n65J9837m555j3826J3233
100E369K550k1202J0555J9146j5890m119J4842j4929r600K1249j793j3707J4345
113F816j27k0159R041J2218j1884J857Q530j1534j576J0502n012k598Q004m544
127d66k556P484n669m449J0658o16q006O264K086p979L390M183n059J724L740
$$ y = [0, 0, 0, 0, 0, 0, 0, 0, 0, 0, 0, 0, 0, 0, 0, 0, 0, 0, 8, -8, 8, -8, 8, -12, 16, -16, 17, -24, 24, -32, 33, -40, 47, -51, 57, -65, 73, -83, 94, -105, 117, -129, 144, -159, 177, -196, 216, -238, 264, -290, 321, -353, 387, -427, 472, -520, 577, -641, 713, -797, 896, -1016, 1159, -1339, 1571, -1888, 2342, -3047, 4319, -7315, 32847, -8212, -40170, 30351, -2391, -26258, 24047, 24571, -28177, -1866, 16669, -16465, -10435, 21316, -465, -14388, 4121, 3125, -12254, -2004, 7562, -499, -7162, 3223, 6244, -8755, -9320, 10517, 5962, -7864, 5369, 7919, -13283, -2728, 16418, 528, -3591, 11251, -3678, -13278, 7971, 6178, -7529, 6816, 6689, -13470, -4429, 7789, -4095, -2238, 6292, -5242, -6818, 3684, -1328, -3926, 4078, -466, -3022, 4462, -1207, -5656, 5002, 4386, -3620, 2644, 4730, -3249, 141, 4324, -735, 989, 4729]
142D729n798k784L338O29M82J194k339j598j146K20M615k54m475L764Q68p495
158f050M394Q068p904k350R520n014o857J0860J144j1195N587O468q998J025P993
173F691q129l913J0093j405p931M781K311o760K192N564l965l799L451J438l168
188b549R60M211j479m923K360M122k812p55M958l360m626N815K551n747J617L555
204C898n597k33O762l876m991N197O83n058K427L088l958j436L265p48j016J643
220E0K39k198J88K014J292j011j228Q24L16j03J511K75k930J088K281k483r18
237g93L465j452l717K817J540l413O63K280k851j350L194n5j955P12L21j158Q81
254h71J846r83j102J021Q84n36Q4J077o10j174J136J179j788l31K490j570k496
$$ y = [4729, -1069, -3853, -515, 114, 596, 1790, -549, -2147, -3293, -3073, 1542, 1288, -3187, 577, 1445, -6050, -1656, 6412, -1492, -3842, 5678, 664, -6193, 4667, 5811, -5384, 203, 6671, -2327, -1302, 6691, -1438, -5351, 4742, 3337, -4594, 187, 2498, -4262, -2070, 3494, -471, -4270, -819, 619, -2549, -1589, 2622, 1143, -3780, -1420, 2702, -110, -865, 4093, 733, -3893, 1922, 4473, -1274, 343, 3898, -1699, -1932, 4830, 954, -4037, 1160, 1843, -3215, -788, 2300, -1658, -3094, 171, -577, -1593, 50, 289, -1909, -1721, 293, 1585, 574, -654, 170, 486, 383, 1894, 2169, -761, 327, 2608, 125, -793, 2672, 1220, -2497, 320, 1860, -1553, -890, 1390, -1461, -2811, 383, 328, -1627, -915, -594, -1752, -871, 975, -8, -1110, -89, 795, 259, 343, 1420, 810, -364, 772, 1951, 163, -168, 2322, 752, -1744]
271a744K321J322k447k15J103j699j14K397j358j896J757P08j697N77J437r69
287e17n53J389m8n40R85M18j082n66J491J033j272n78P23m66p47J230M37j754
305d17r6P59o46m16J348r22j683R81J500j144j19Q92j078o70J700Q01j089K41
323e8M91p65J41J889O7j958J42J226n14j90Q24q74j403J075R63j472j45J165j312
342g08j189J821M03j587L08R18j418K99K041o63j729J168J114j333N04J639j286
359C02j037J723N94j415M94N52j349k33J727l70k054R71O94j420q9J409p04j348
377a553Q45N10j160P87R43j087p57J214J041r58O5P65m06m34J127O34j517L37
395C96R46j020o11J477p5j418J63O43j074P7J392j359j157J000J072j246k60J030
$$ y = [-1744, 577, 1899, -548, -763, 340, -1359, -1473, 924, -434, -2330, -573, 135, -1562, -985, 452, -517, -1070, 319, 271, -269, 716, 1134, 52, -514, 977, 2010, 738, 160, 883, 417, -330, 900, 1337, -417, -513, 246, -400, -816, 532, -390, -2073, -1092, 408, -736, -855, 37, -1041, -1711, -11, 790, -299, -58, 433, -332, -191, 1698, 1765, -193, -51, 1175, 661, 471, 1295, 421, -982, 93, 1056, -416, -561, 604, -708, -1897, -76, 327, -1260, -952, -34, -1452, -1153, 888, 225, -1504, -336, 778, -555, -51, 1588, 302, -735, 988, 1582, 167, 661, 1213, -136, -369, 1358, 988, -1066, -95, 599, -821, -910, 499, -205, -1553, -708, -198, -1358, -571, 372, -715, -1472, -258, 783, -175, -110, 655, 249, -185, 942, 1576, 59, 396, 1342, 322, -289, 1188, 1113, -305, -142, 501, -573, -496, 896, -463, -1620, -620, 452, -794, -1054, -24]
413b4o60n43J252P94j332n2J450o47p10J486N56j920K61J500q94o50J919q29k391
432a434J544J469j869n43J587j334j254K185K48k420P49J314j392l25K017k96
448B46j418P39R13p63L00J454q05j366J070J169r87m32J020p06r43J246N98j873
466e38j66J619j059r60J194K11j704O03Q92q60k38J383l63j413Q04J146m27m01
484b77N29J11m90N84Q46r68o66J312J50j534O64J329j696r88J830j34j830J386
502A58N38k339L56K108r28j289J452j49j370R11J682j437q13J553K69j097P52
519C57Q33j384j14J638l82j357J170Q46k051j52J808q59j081J113j8j934J008
536e59J524j623j033J483K54j085J010L12j433L98J378n42m35R67J38j077L80
$$ y = [-24, -684, -1227, 25, 819, -513, -565, 885, 238, -472, 1014, 1570, -350, -89, 1411, 517, -133, 1786, 957, -1434, 110, 1579, -290, -833, 754, -580, -1834, 351, 599, -1821, -1072, 242, -1150, -1475, 542, 246, -1172, -433, 480, -283, 17, 1471, 666, -700, 370, 1539, 552, 120, 1140, 434, -509, 737, 1335, -538, -704, 915, -144, -1104, 90, 301, -1403, -800, 92, -768, -1006, 377, 14, -1399, -595, 551, 124, -277, 252, 363, -127, 457, 1303, 335, -331, 981, 1131, -403, 261, 1590, -106, -1094, 736, 602, -1228, 158, 696, -1643, -1287, 821, -107, -1396, 56, -93, -1463, -552, 1130, -307, -1120, 433, 702, -395, 357, 1190, -194, -308, 1330, 948, -409, 761, 1607, -444, -596, 1212, 353, -728, 385, 367, -1567, -559, 965, -658, -1691, -208, 46, -1039, -29, 283, -1150, -752, 626, 84, -351, 616, 754, -323, 57]
553E7J017k56p53N92R6q46K07J029n64j428P23Q63r71k91Q67q31q19J279L98j384
573a015k2J100m13o94J154O9q67P17P57j253J59J657j84j644N47J152n89m08O32
592H55m75j034R07P09j369o18J481l83j394J059N87j339rJ244j059l45J720Q7
610F24j839O44J607j061j59J130o54j031J428P61j355l15J069k58r26O45M40q57
628a07p9N68p16n44J116m8j155J41Q46m47k98Q55m80p91R37R92j020l16J246k40
648D60o62O74N22p96j39P48m35k22K84L11o15l55L72J03n66J73j01n24J98Q43
668B73n83p16N04N18n76K92O78o30l68J252l9r90N24O99o53k88J057l00o22N44
688E76j20q71N10Q55p06q16M67K5o33N38N51j166k21J072j18p78M50N59p20qQ17
$$ y = [57, 1074, 818, 65, 657, 753, -93, 114, 1143, 579, -849, -126, 737, -234, -525, 342, -489, -1308, -29, 369, -1015, -1037, 63, -350, -1044, 110, 179, -688, 29, 786, -467, -308, 1349, 1165, -479, 68, 1220, 631, 223, 855, 380, -654, 253, 962, -407, -1025, 456, 73, -1321, -262, 325, -1014, -1023, 221, -838, -1183, 537, 624, -1215, -571, 1036, -25, -184, 946, 292, -739, 689, 1450, 95, -220, 849, 591, -335, 310, 750, -107, -186, 382, -334, -878, 238, 190, -965, -824, 22, -425, -723, 132, -348, -1139, -202, 790, -230, -546, 700, 460, -202, 472, 994, 198, 59, 807, 372, 150, 434, 745, 130, -225, 147, 250, -316, -143, -244, -768, -570, 273, -310, -1026, -522, -4, -580, -288, 390, -240, -608, 644, 605, -385, 139, 838, 185, -103, 954, 654, 32, 576, 456, -415, 95, 950, 244, -572, -105, -80, -713, -175, 376, -790, -1011, 61, -57, -835, -385, 174, -546, -554, 263]
709B63J5o37Q01L2o12K07Q64k77m50K26Q2l02M03o1q06L6N40j15l80k14K86k68
731c67q3J8pj43L66K57m38k33P83L05o50n7M40O8Q6M15k12n64M80M06n67k12K13
754C04r4j23l4N8l02O8J68n38j93N22L02p66j12L96jl29O71L1o68N27P63n15l22
777a87O74j48l74P21j41l21K62L42q02m07R16j90p78K51J62o59O09L55o53o31
797i99P08M10o41N9L15j41j8N34l1m63M34K88l74r0P96k30o30N10j2l85K50M16
819G06n56n55O67m2l00L4j79k33J59K67j63k75Q1O7m3j0K67K08l09J65P6p6J98
842A54M39l33l20M52J51k21J01k04p4k35K96L3m98oL32k07k25J14M8j27q1K68
864a43k87M8L66p2l28K39L58q9j59M75k27k45O49L7m96R1L40l78j87N06j55m25
$$ y = [263, 278, -359, 442, 474, -138, 69, 933, 656, 206, 432, 514, 212, 615, 554, -252, -216, 324, 209, -171, -385, -99, -367, -450, -432, -439, -582, -216, 41, -397, -630, 153, 458, -192, -249, 191, 259, 345, 760, 548, -16, 464, 870, 303, 91, 304, 210, 87, 53, 111, -191, -123, 45, -493, -686, -164, 138, -628, -740, -344, -345, -674, -3, 28, -640, -113, 650, 135, -187, 487, 339, -35, 686, 545, 224, 486, 828, 26, -381, 535, 345, -433, -182, -20, -679, -70, 285, -368, -999, -291, 119, -522, -463, -148, -289, -307, 227, 196, -267, 167, 455, 81, -9, 787, 557, -73, 437, 425, 40, 290, 706, 150, -405, 262, 220, -80, -46, -225, -458, -299, -32, -195, -470, -389, -322, -365, -375, -108, 100, -209, -44, 32, -44, 154, 593, 260, -60, 392, 543, 322, 423, 219, 145, -90, 206, 239, -259, -265, 67, -140, -365, -251, -203, -330, -411, -143, -430, -382, -16, -88, -416, -177, 181, 92, -67, 408, 181, -64, 585, 622, 126, 217, 557, 179, -8, 498, 343, -82]
886h2J23J83o05M4M92k25m90K54J79k85J64J69l19j30N90K02m93J32L69k67K27
907B32L49j71n53N20L66o27j94P68l56m23N9K18l93K02J21n80q6M01Q4l51N0K16
929a48l32L29P6J4l20L44K39k39m8M78N0m95J56N45m66lM13l50m06K49M57p49
951b06j16M98m39N8M50n51l80N57K24o36j05O79j46n62P05J19l04o8O47k16m19
972b11O71K54p71n2O55k37k53M04j13n92L51L12n94j88O23m24m86L75K52o22K52
993c94N01m73l98O77J27k44k25P80j82k42N32k8n48J61O17k63n30O12j15m94L55
1014B26K05n85k65N91k44n14L28L77m47k03N42j02m39N79P8m87p9O85j87l80M14
1035I3M11n78K93N73n36l92M47R0o51L24O28o96l59M85k62n54P35%o01m8P76l18
$$ y = [-82, 41, 224, -381, -337, 155, -70, -560, -306, -127, -412, -248, -79, -398, -528, 62, 264, -229, -97, 272, 5, 232, 581, 410, -143, 377, 743, 116, -78, 690, 334, -89, -30, 188, -205, -3, 118, -462, -548, -147, -63, -414, -364, -148, -480, -151, -75, -61, -381, -37, 202, -37, -85, 393, 443, -52, 104, 649, 183, 180, 593, 243, -163, 86, 543, -206, -322, 176, -263, -205, 245, -306, -686, -129, 95, -541, -646, 33, -113, -675, 30, 149, -155, -223, 424, 208, -211, 460, 714, -57, -109, 546, 309, 56, 460, 347, -245, 106, 418, -176, -364, 259, -165, -651, -276, -24, -646, -394, 107, -366, -764, -87, 40, -204, -429, 351, 169, -73, 459, 431, -117, 44, 661, 398, -132, 480, 365, -129, 226, 431, -154, -419, 172, -72, -586, -258, 119, -328, -531, 11, -91, -530, 49, 127, -360, -439, 246, 59, -321, 93, 504, -74, 219, 792, 256, -136, 311, 401, -250, 74, 702, 6, -353, 132, -130, -684, 51, 51, -550, -598, 178, -140]
1057a40k57L39j2l52K1Q27m81m00N68L45p18L55M67k83k87M58J8o45M24M55q24
1078a22j86O93k38m72L44J36o07J80M44n29m94O34J73m79J75L36k59r6M70J04
1098B07l27K38K47l19j45N21r5l79J96L76m68p6M95k47o99N71R6l10k27L14j62
1119a93k59L27J06m64O2L11j32j84L91K59k19R8K60k50j93N72M7p14L7P36m45
1140A53j95L09L3n48L77K62o61j62O23k29m80L30K76m99J8M00l98o0O66K9n66
1161c22L58M20l95q7K27K13n64M64J76l56l7M70m1p79N42m5m60J83J98m51k04
1182d90N41j76k05M2J37l11J98L75j11m13L39L66k92m2L88r1l95L91J32l44R3
1203A32M43m37p5K31j55m07K60J13k69p7L83k02m78K09M26l40l0J40m1j66K83
$$ y = [-140, -397, -58, -70, -422, -401, 426, -55, -455, 113, 458, -260, 95, 562, 279, -8, 450, 468, -177, 247, 702, -122, -308, 385, 147, -325, 19, 155, -452, -272, 172, -357, -851, -217, -44, -523, -348, -12, -271, -367, 103, 207, -120, 118, 365, 46, -99, 422, 327, -52, 144, 520, 52, -24, 471, 224, -475, 96, 192, -118, -345, -31, -193, -452, -125, -19, -483, -421, -110, -242, -426, -35, 224, 5, 103, 363, 113, -80, 492, 539, -175, -138, 598, 153, -42, 267, 300, -248, 129, 391, -270, -432, 191, -38, -518, -188, 88, -411, -393, 7, -391, -451, 215, 244, -322, 36, 456, 61, -26, 201, 414, -150, 314, 490, 134, 97, 567, 526, -253, 289, 244, -216, -33, 165, -286, -490, 51, -125, -330, -288, -151, -462, -264, 111, 0, -413, -74, 292, 0, -42, 346, 255, -140, 251, 383, 39, 132, 575, 138, 63, 294, 139, -268, -8, 105, -164, -241, 142, -60, -538, -329, 97, -243, -273, -133, -174, -340, -57]
1224e7J15j35P0K94q3l03L14M17m51j58K08K8k00M70k58m46K51K26l71j83L13
1245F1j17j33m3K35m40J06K81Ml81K21L60k81M6J53m8j03M14m6k64Q9K96j11k77
1268B2K10k4l31M65j88k61Q1K49l91k89L07J29k89O1jp1J32p9K20k25R9M42l04
1291c6ON0J47j47J69J21j77n4M36j25m88K77J38k20m0K14l19j87L36o5m77K55
1313a86O5R7j96J47o2j59K14J91k52j64M42k2j87K84J76j90QJ59j49k01L47J77
1335E39o58L13K5k23j1R7j54k53K27R3k10o5N%n4L10j01k4J87m2j36K1L87k20
1359E3q4rN40k25p9R1ql21K38Q7k88j08J60Q0k67P7Mj29j2J54l15J3K01J07l62
1384d02K56L4p4J91K11k84n5K51J76j92n4J76Lk00K22O4k22q3J98j17l13K81K01
$$ y = [-57, 58, -77, -7, 287, 204, -99, 215, 632, 181, 23, 231, 259, 59, 529, 271, -175, 76, 302, -69, -252, 61, -56, -189, -232, 3, -437, -331, -50, -46, -427, -206, 154, -127, -81, 72, 24, -79, 335, 289, 25, 114, 410, 299, 22, 232, 208, -123, 342, 154, -107, -26, 223, -168, -457, -150, -21, -310, -249, -250, -321, -189, -268, -48, -273, -174, 268, -36, -30, 20, 167, 20, 189, 310, 133, 79, 515, 390, -98, 179, 317, 97, 57, 271, -48, -235, 101, 36, -441, -186, -121, -24, -220, -73, -135, -294, -80, 111, -141, -305, 137, 115, -72, 212, 388, 198, 206, 365, 216, 15, 362, 539, -119, 194, 219, -4, -15, 82, -72, -325, -98, -5, -215, -280, -275, -275, -329, -19, -120, -144, 43, 1, -135, -114, 273, 53, -31, -40, 500, 275, 196, 287, 279, -42, 196, 283, -5, -113, 47, 127, -140, -63, -59, -188, -200, -46, -361, -348, -147, -40, -402, -146, -112, -186, 5, 216, -68, -123, 128, 304, 112, 58, 234, 237, 37, 259, 323, 101, 18, 216, 99, -214, 67, 268]
1407B68n02J23J31k32k7K34m7l32L26J74j28r9J88J5j28K36R6k95P5R2M6k54M27
1430C87n9k76m8K15o4j59Q6ql95J66L78l60j65J74r0p1K69K7k36J9L65J7l68K99
1454A03J09k22R9J69o7k53L25j1k62k1L89k39l62L64M0l46Q1Q1k20m8L17j23k46
1477c43J23O7q2m6K27j26Q0M1K13k58P4N07m46n3J17K21k04L0Mp4j15K58k3l03
1501a11K03J60k48k25K92j07l00L91Jm95K88J99j19j02R7r3N1RL90k97k51N25
1523B58k9Nj52K68k32n8K79j68l04J66K38l36k85M67k63l29M22m7j53Q0K43j67
1545i7k51K30K06j65M0J76l3jl8k7k4J45J20j78p9J68l7k93M66k37k10j37J93
1568f3k5m00N22r7p9j13Q6K02l22L14L2l79L10J78j69j75K40Mo9J80M1j23p3K49
$$ y = [268, -234, -111, 20, -212, -239, -5, -52, -384, -58, 116, -12, -111, 77, 92, -36, 200, 296, 1, 76, 168, 214, -40, 387, 328, 52, 4, 219, 155, -4, 82, 74, -321, -155, 223, -137, -302, -128, -218, -289, -20, 7, -229, -210, 155, 172, -196, 103, 212, -10, 89, 258, 191, -62, 263, 252, -10, -31, 358, 119, -243, 121, 161, -185, -104, -23, -243, -291, 26, -97, -343, -220, -153, -235, -281, -54, -180, -100, -59, 154, -104, -30, 477, 31, -22, 95, 316, 112, 142, 146, 72, -43, 215, 192, -111, 92, 252, 4, -221, 71, -36, -336, 55, 56, -439, -151, 48, -71, -173, -76, -169, -118, -109, 281, -16, -267, 258, 229, 234, 82, 350, 118, 60, 339, 171, -133, 33, 271, -65, -350, 117, -146, -475, -53, -100, -253, -173, 70, -97, -348, -118, 88, -77, -37, 139, 106, 105, 67, 40, 16, 161, 281, 103, 24, 192, 155, -138, 328, 91, -119, -256, -63, -88, -488, 34, -63, -142, -255, -169, 33, -289, 25, 57, -322, -12, 166, -3, -178, 62, 66, -3, 177, 218, 95, 22, 271]
1592B71j38l33L09K75n44J89N8k31n5O9M0j95J75J59k29j52K80j65k3R7K93k38
1614h8j6K68r5j14P9K74j07n4N4kl02K68O8l96KJ99nk29J21J62k47M7J05j33j81
1639c22K40o5kr5L40q4l0M9k6%J53O5k45o9K71pj13l9J06k69J70K58j46l58K71
1664E3J03m50J99Q6N0j80J43ol74K75K06j62q8L40o5j3l8L3k3Q5J22k18q4j6L31
1689C09l13q3J91m3jr7j2k56K78k8j26l3K86l89N0J78o2n8O2L74j23k45J81R8
1713A38k87K04M5L6j57K23J17k85Q3J26k39N4J11J0j94j38K01k67R2N9j28j9J48
1736f7o4j4O7J10r8p4R1J99k98Q1K29M4q9j0J15j35m0J32j24p2J58q0j75N5M9
1761a0q9j24J05o3p4J85O3l72K34J04j15l6K64J4j35J26K76m61R0J57lo4J43p5
$$ y = [271, 133, -200, 109, 384, -160, 29, 87, -144, -199, -130, -90, -285, -110, 49, -180, -332, -52, -217, -240, -143, 150, -88, -104, 164, 69, -45, 34, 308, 201, 147, 201, 199, -103, 165, 233, -163, -161, 38, 33, -196, -75, 87, -160, -113, -8, -141, -322, -82, -147, -149, -244, 96, 12, -18, 31, 5, 5, 158, 223, -22, -91, 180, 173, 60, 21, 127, -142, 28, 286, 140, -218, 53, 156, -294, -95, -9, 41, -139, 4, -2, -376, -101, 105, -57, -145, 195, 130, 117, 79, 112, 89, 174, 296, 78, -6, -22, 309, -4, -87, 104, 61, 60, -37, -49, -305, -27, -55, -181, -214, 72, -317, -267, -89, -151, -209, -147, 227, 104, -141, 40, 138, -149, 55, 100, 136, -21, 202, 319, 34, 117, 243, 4, 58, 169, 179, -15, -153, 48, -219, -127, -68, -196, -215, -67, -131, -145, -78, 32, -66, -140, -49, 150, -148, -67, 162, 206, 117, 107, 222, 87, 47, 179, 55, -17, 141, 61, -114, -59, -10, -99, -223, -118, -181, -255, -70, -7, -379, -145, -41, -156, -192, 72, 86, -49, 77, 353, -108, -18, 139, 136, 72, 215, 140]
1785A40K9K1n1n6j14JJ00j57o4K48r6k21P4M0k47J93M4j72J17J98m5nj5QP2oJ27
1812A63q0o4J23K09l83OM35l89k43K56m0j27J13rj70J22NL7j59J38kj61j4J61
1836g3o3K1J53N4o2m5K02j78k4K71j65J1j17J16o6q4J37J33k15q8P0P4k93J66
1860f5pn2J20qq3j7p8j3J83J05m7l47L69J2O0k60K51J04j00k3L0j2l6O9j88o6
1886i9L13k41J51j06j56o9J28kP2j76Q9L9M1k67J86K14l48K57Pj34Q3J71K6j66
1910A3J50K4j58J41J12J4k72R7J44l35M0j2P8l3j14l7j1L9j37k4O5K52q8k2k3
1935i7J8J2p6J82P3r0m9L58j65k64K85r6j73J31K0k6r2J00j45k3J75q2j90Q6M1
1960h7J2n1J63k30J22K5J04L6j16k1O3j3n5K31j09pK06j48n2Q2k4j53M4j0j47
$$ y = [140, 169, 190, 139, 83, -31, -30, 70, -87, -151, 97, 1, -220, -146, -106, -353, -160, -116, -288, -171, 27, -18, -23, -38, -30, 42, 36, 163, 83, 19, 142, 351, -32, -26, 409, 20, -223, 33, -7, -134, -21, -30, -200, -78, -73, -36, -195, -57, -59, -220, -234, -73, -136, -115, 38, 92, 30, -15, 187, 9, -15, 256, 91, 102, -15, 101, 35, -49, 88, 221, 6, -82, -12, 62, -231, -65, -72, -124, -4, -12, -95, -112, -190, -203, -20, 85, 38, -309, 60, 72, 132, -128, 123, 227, 127, 104, 134, 122, 86, 155, -33, -99, 214, -27, 124, 18, -138, -207, -79, -81, -9, -185, -96, -57, -16, -283, -97, 117, -231, 26, 33, -101, -18, 153, 179, 13, 163, 187, 29, 170, 282, 296, 24, 121, 265, -70, -30, -42, 36, 3, -111, -148, -159, -120, -257, -281, -216, 36, -52, -74, -97, -79, -67, -143, 39, 112, 22, -27, 331, 166, -98, 187, 91, -82, 49, 69, 43, -49, 51, -94, -117, 58, -24, -214, -128, -87, -75, -126, 37, -193, -71, -46, 58, 94, -22, -43, 20, 7, -48, 183, 74, 67, 273, 125, 73, 155, 131, -22, 22, 12, -135]
1985a35P7J12j21k07J39J44j06j10o6K95k56K73J7k0j6jjj01O2K46j81r3J57j30
2009b2N5J27j7j32L2Q5J95n21L80k02p2Q5l6k8M6k2k45J38J45p2m3J22k9N1K0
2034D0pq1R7J15j6O1l05K02Q1j59M4J19j88j36L93k82j60N0k4J72j35KJ53l0o3
2059e7N8j72J07J60j24j15J4J49q2J93J46q8m5R1Q6l10LJ65j43N5j30j0N1m4K45
2084B03k49k60K23Q0j6J17j02j65jJ84J2j04R4J05k60J97K8j60l5K51o4j01J57
2107A34k7M6p9m0m8m8J10J38o3j7j36j27M7N9J48l52J48J18m7m9M4L7j48K53n4
2132D7K2q8L0K62k05J06l7l0M8k2j7j78J05Oq9OR0k6k10LJ47j03q%O7j08K2J05
2160e5O3l1m7mR3J59ql58K35N5k1K6q0J27j31N0L2J3j92J28Pp2j65J51j90Lj9
$$ y = [-135, -58, 54, -67, -274, -135, 9, -97, -207, -273, 22, -234, 39, 56, 36, 20, 19, 18, -83, -21, 225, 44, -49, 108, -22, 33, 160, 143, 11, 43, 128, 323, -198, 182, -20, -92, -7, -43, -71, -25, -47, -292, -154, -9, -81, -124, -2, -31, 20, 40, 33, -48, 49, 164, 148, 209, -96, 106, 187, 28, 72, 191, 3, -133, 260, -22, -182, -132, -156, 16, -119, -117, 36, 6, -57, 1, -171, -64, 96, -28, -143, -129, 20, -62, 131, 277, 189, 144, 235, 321, 11, 14, 179, 36, 91, -39, -49, 2, -42, 203, -46, -306, -83, -3, -19, 98, -4, -169, -170, 14, 26, -78, 16, 121, -139, 58, 86, -74, -109, 142, 78, -23, 134, 107, 153, 74, 34, -14, -62, 48, 186, 123, 106, -30, -157, -110, -51, 97, -255, -107, 11, -36, -85, -41, -4, -152, 101, 47, 69, -19, 11, 273, 68, 174, 137, 107, 155, 133, 116, -62, 43, 49, -40, -34, 56, 30, -180, -177, -30, -133, -141, -141, -74, -182, -160, -55, 8, -23, -70, -74, 19, 178, 170, -188, 47, 102, 81, 107, 27, 154, 23, 73, 105, 118, -74, 54, 61, -11, -176, -25, -215, -212, -231]
2187b31J42k3L3M4r0l5J48m9j00J75J19J7p2J86k23O7N7N9j96J00j08J91j45l8
2211B8N4k21J66j31n5J30j4j09N8L9Q8j72J14N7j13Q7L6o7Q2l5P7k86L31m9j12
2236a7J28R6q6k25L1J59j24J5J88k86M7J19l0j1j40p7L2J7K14k19J51rn5R9k09
2261a92K99J15j15j08lQ8j03K15j27j72L13k23J00Lk2j6j32P6n7M9oo4Q7j71J14
2286e2k4J09j16n3P3J23J31m9j51K1J39j74Lj67K10L2R6p5j98K01q5N2j68P5J12
2311F5l07L43o2j72m9J14q5J08l9m4jJ08j3M0j2K65m5j02l5k30J52L3J5j9m7O4
2337D5k6M8o4Q4K8l67K40J7j84O5Q5J18j80qJ2J03J32j67L3k11J92k8l7L07j7
2362B20k52L2k6Q5k9NQ3L7k65J34Nj61J15o8j8N8K3r1j20J91J38k30j1J61j60
$$ y = [-231, -89, -112, -79, -35, -125, -160, -12, -61, -161, 14, 133, 150, 78, 264, 41, 108, 165, 224, 28, 128, 20, 211, 66, 28, 82, -139, 27, -104, -159, -29, -43, -152, -94, -55, 33, -139, -25, 32, -81, 6, 42, -25, 57, 22, 99, -187, 144, 95, -17, 111, 207, 121, -104, -73, 86, -38, -23, 165, -121, -74, 45, 15, 4, -136, -213, -181, -164, 50, -169, -18, -27, -82, 17, -192, 107, 222, 107, -1, -4, 84, -19, 196, 69, -103, 210, -13, 87, 90, 68, 52, -80, -4, -61, -12, -18, -82, 5, -166, -52, -76, 33, -83, -136, -63, 60, 191, 142, -9, 12, 151, -23, -20, -187, 23, 55, 151, 76, -122, 79, -6, 46, -122, -47, 65, -242, 101, 39, -133, -182, -68, -153, -45, -84, -128, -129, -21, -34, 6, -6, 259, 214, 112, 77, -153, -1, 32, 47, 28, -19, 45, 19, 67, 3, 87, 115, -252, -12, 5, -179, -114, -29, 89, -91, -99, -87, 16, 148, -19, 14, -197, -5, -33, -70, 237, 220, -32, 0, -26, 59, 30, 35, 118, 155, -110, 24, 29, -132, -17, -85, -103, -45, -22, -113, -233, -42, 96, -134, -145, 16, -144]
2387a44n6J40J43q9N6J8Ql4N2kK2p0j9O1r6J50k0k31J19R2j02k27K51j85kP5o
2414i6m9j8K16k13K8J62K2n0P8j25J31o4J8o5rJ30j3j40J83J6j24p8N7J13j14
2439do2M9R1j47o5o1N0J7l5P4KJ7J09j49M1J25j55j9K64j34m2K21M1p6j35J98
2465B15j79J10k14J31k01P6K07l9j73J44j82J5J14q1k5n7J00L7r0K3J12L6J0k1
2489F8L9j58J68m4r5J58m7po7J20n0j39j02J56q9nM8Qj66LJ63r0K37k43m3J01
2515g6J09R4q7j06R4KN6l2k0o8N9P8Rl9k1mk12K9K02m2O9m3j65J98q2p5p8N2N2
2544d7nj16N4J65j02KkJ22k16K26j44J98N0k16p5K73K1k58Q2K02j71r9J49j08
2568a5J17k13J06j4k68K93l2j59P2k3J70o8M6p8j78K21M2J36j59M3J27p6r4j7
$$ y = [-144, -200, -60, 83, -6, 50, 68, 76, 42, 94, 92, 114, 44, 25, 86, -10, 140, 120, -111, 8, 100, -2, -229, 22, -163, -165, -90, -96, -145, -163, 53, -160, -132, 30, 52, 2, 80, -45, 86, 22, 40, -25, -34, 96, 83, -57, 126, 142, 18, -60, -3, 110, -4, -66, -17, 74, -73, -138, -199, -149, -132, -167, -93, -91, -74, 35, -114, -73, 52, -103, -122, 142, 8, -34, 187, 228, 152, 17, 215, 36, 146, -68, 63, -138, -62, 145, 106, -67, 77, -105, -90, 24, -57, -82, -139, -39, -2, -92, -69, 43, 79, 89, 68, 107, -51, 117, 73, -22, 136, 89, 82, 15, 135, 85, -54, -156, 0, -89, -94, -46, -38, -204, -201, -38, -128, 109, -134, -177, -76, 33, 127, 40, -66, 28, 30, 86, 54, 34, -34, 25, 103, 112, 73, 52, 48, -164, -135, 67, 25, 94, 51, -114, 84, 2, -73, -151, -99, -47, -52, -168, -114, 51, -51, -49, -51, 71, -145, 81, -63, 135, 185, -31, -106, 167, 188, -70, 12, 214, 43, -56, 93, -15, 102, -111, -5, -19, -287, 6, -26, -185, -113, -136, 34, -34, 12, -66, -244, -23, 19, 155, -4, 39, 166, 90, -4, -21]
2592b1J39j51lJ66j55N1O9r7m1nM7J4l09L96j29k14K39R6k15O0j4N3L2p2J79N2
2618A67k1l19J20J69Lkl1q5J06J02j70m1M6m2L9%j1J5p4o9j9p3M1RP5M0L9m1p5
2647a02M9J2m3O5P9j47J88j94M09j33j67O2J23j29N9n6Oj66n6O5K24j43r6j4J22
2672A7q8oMJ5r6KJ36k2L5j6M3l8L8J85p1%J9k02NK72m5k01J79k52k1n5J59l5P5
2701C6j2j16j45O2J93L2j86Q4k6J91l19K9J83r1J58K9r4Q4l1K6J7R8j12j76L20
2726B34k84N9p4N0l0p6O0J35k4j28P5n9k62M44j81m0L0L8j5k0n2P8j00L6K25k20
2752a01J57j6J57k14J14m5j07n4J59j39N4MK0j13K16k68P9nK37k32k7J56p2P9
2776C9q6J13o8N5J5J5q8J13J19j98j5j9K09k54m3K56l09J79j01P3j00J28n0Qj77
$$ y = [-21, 118, -33, -36, 130, -25, 26, 95, -2, -43, -48, -1, 13, -296, 100, -29, -243, -4, 92, -123, -63, -77, -24, 8, -64, 115, 167, 146, -173, -53, 116, 119, 117, 86, 1, 107, 209, 39, -2, 44, 2, 41, 41, 30, 45, -29, -98, -117, -190, -149, -140, -65, -25, 14, -27, -102, -53, -41, -84, -19, 60, -87, 101, -93, 316, 183, 16, 78, 201, 72, 131, 75, 81, -85, -141, -76, 148, 5, -91, -105, 17, -71, -77, -73, -58, -154, -152, -16, -38, -3, -19, 24, -14, 24, 209, 138, 138, 157, -45, -40, 232, 187, -14, 165, -87, -108, -163, -4, -39, 36, 24, -92, -237, -175, 18, 50, -136, -52, -78, 113, -206, -177, 6, -85, 73, 102, 8, 92, 61, 87, 104, 202, 90, -86, 234, -50, 9, -65, -15, -45, -121, -61, 74, 50, -78, -3, -62, -324, 120, -61, -101, -71, -33, -48, -68, -120, -42, -142, -106, 119, -101, 56, 40, 197, -17, 97, 52, -55, -109, 50, -89, -35, -31, -11, -124, 92, -176, -97, -102, 135, -97, -124, 32, -40, 39, -47, 66, -2, 53, 68, 83, -5, 108, 227, 29, 14, -5, 204, -50, -93, 163, -146, 33, -68, 5, -95, 33, -17, -9, -186]
2801a86P7P5k4R6r1L5o2J93k12J05j36J71J25j49J5J30j19N2J7m2r2P6o5j5j15
2826a41K25j34K0m0R9l4Jn4j0R0o1j8R4p1J06n4j4J84k48L8K16j02k4r9J50j35
2852a6R3J20l07J35m0mN5K6n0j68M6N3o1J20k53J57Q7q6J43olk19J96q4r5L11
2878A50k9J7n1P3j48P1o1o9j18J45P6O4l1q6P3l5J3j66J61j24M3o0K27j87l4P0
2904a6P5q1r2Q1m2K48k03J45n2K2p5O2j53K30j87j06K12P3q3M0o2R6j94L6pM9
2930A6L6r8r8P5R5p3J51k50J64j03J27L5j6J00j19n8N9r6J09L1j27Q4O8j10PK1
2956C0r7n3j9J59l5k8noJ52j36l3J14j22J04Kl7J19j08P0j34J69j01J5M6m6J08
2982A28k51L04k58l1Q1J5j05K67k40J28j05K0n8Q7M1m1k4ok0L1P3j0J09k79K14
$$ y = [-186, -109, -34, -58, 38, -53, -18, -80, 113, -99, 6, -130, 41, 166, 17, 32, 162, 43, 95, 112, 70, -22, 54, -11, -26, -141, 84, -50, -30, -70, 29, -5, -4, -58, -68, 22, -39, -57, 37, -34, 72, 18, 4, 188, -60, -22, 194, 92, 68, -31, 119, -16, 77, 197, -110, 25, -15, -19, 36, 62, 12, -156, -110, -57, -118, 2, -251, -94, -7, -93, 50, 44, 41, -178, 18, -66, -161, 150, 121, 138, 87, 160, 12, 83, 22, -47, -165, -20, 56, 120, 89, 3, 76, 41, 54, -112, 49, -75, -32, -92, 135, -52, -86, -16, 59, -22, -114, -33, -75, 173, -30, 115, 63, 85, 10, 72, -81, 149, -38, -144, 68, 141, 58, 98, 36, 132, -62, -26, -33, 16, 52, -46, -144, -69, 26, -47, 104, -146, 18, -85, 42, 77, 61, 161, 42, -16, 43, -53, 56, 87, -40, 44, 112, 2, 9, 30, -67, -120, -139, 20, -15, -43, -48, -54, 98, -38, -71, 43, -79, 25, 27, -10, 109, 1, 71, -63, 106, 5, 20, 66, 20, 128, -123, 181, -77, -108, -27, -12, -117, 150, -90, 38, -67, -47, -105, -18, 23, -18, -42, -48, -68, -37, 36, 26, 135, -144, 70]
3007G0j56J16j10K35j97J59j83N4j49K63p3p8M3j4j7P2P3l38K01R2M3q7p6J91
3031A34k22p9L02j77m0Q7oj6J2moL9K88l60Q4Q0k4j23r4K37M3k46L1Lj5n3m2K23
3059E6p6n3qJ51l68L19J05k29N1J19j22K05j77M5R8j30j1J20lj08P1Lp9m3o4K10
3085H2j69L8J05j11lO4j10M0JmO2j38J7N5M3l3J76mm9n4J60j36N5j20J55k88K12
3112D6j31K65k15J31j25j8l7No2O2J7k81M10j13M7j04o1J58rK1ML2pj39Q9M5l0
3139@O2n8n2O8j01O9l7L7p0J1L26k24j7M0j60k4N1O7p4O8j72K78J0j96j9J11m8
3166e4j16K03L6j53l8J75j01J47l2j33J61m0m0m3L9q0k9J63N6J6j56j6j6L1K3
3191Cj13J34j81MJ13k2Q0j02J93j1J5q2Mo5N7k4P6p2J66j4j17q6J4r2P3M3k1o1
$$ y = [70, -86, 30, -80, 155, -42, 117, -66, -12, -161, 102, 29, -49, -6, -20, -37, 35, 108, -230, -29, 63, 106, 19, -57, 134, -88, -167, 135, -42, -82, 5, -1, -17, -5, -9, -15, 24, 312, -48, 36, 116, 92, -31, -125, 112, 155, -91, -60, -57, -72, -125, -167, 56, -20, -73, -81, 70, -298, 21, 126, -103, -52, 67, -55, 150, -27, 18, 116, -14, -25, 95, 92, -16, 55, 58, -21, -64, -128, 82, -87, -49, 56, -55, -58, 6, -104, -64, -63, -67, -5, -143, -126, -71, -28, -61, 115, 111, 62, 8, 168, 32, 87, -33, 122, -166, 46, -85, 180, -35, 96, -29, -47, -84, -79, -141, -79, -62, -343, 67, -46, 1, -103, -164, -6, -15, 6, 10, 42, 35, -104, -15, 30, 0, 62, 4, -48, 20, -81, -12, -49, -12, -82, -71, 255, 31, 14, 54, -106, -130, -79, -12, -86, -18, -190, 88, 98, -98, -117, -6, -54, -170, 33, 69, -84, -122, 53, -48, 99, 67, -66, 95, 55, 15, -28, 11, -69, -98, 65, 121, 137, -19, -35, -51, -20, 3, -110, 24, -157, -153, -40, -62, 18, -84, 109, 98, 113, 31, 35, -30, 27, 3, 79, 7, 173, 159, 42, -44, -30, -122, -49, -6, -27, -88]
3219h8j56J07J18O2j52L9J24j96K03j39O1J7J11L0o4j16J3O2k8Q6j69L05k04J47
3243A73j71J08r9j04J55r9N8l1k6j3J16m7j05m8O8J22l4K8n9l3J60j51l9N8lK9
3269A3Qrj1Q0pq8j22M3M3%Q3l3L4m2N0l5pj06O2L2qj16J38O2p4N5k38L13l14J01
3299i3N0Q6J1pJ30j40M2p4L1m4k2j13J75r8J01n8M3o5R7j44K2J93k55qJ5j5Q5
3326e5k2q4K73j07k0rn9J74Q3l15K59n9L7q1K5M7j58J40j13n9J47l8Q2j60P6j33
3352a29J75J27l4M7k94N7J20K6j95P9k4q9K07J53k26R4J1Qj29j2J31j1K0j64j25
3377a77J36J34k58L30k82J10J03o3q8o3qM8N8m1N2M5K8j26K00m3N2j67J48n7j53
3402h2J7K3j7N6J04rj48Q5k03J12j36K33p9J83l4j13k3P6K8j95K48L0j21q2l3
$$ y = [-88, -244, -137, -19, 43, -109, -70, 54, -142, 61, -78, -17, 0, 111, 141, 77, -39, -26, 36, 8, 94, -75, 230, 26, 173, 2, 110, 11, -93, 62, -37, 21, -10, -36, -49, 67, 20, -85, -133, -65, 57, 23, 51, -8, -41, 119, -32, -71, -13, -16, 13, 21, 12, 1, 81, 74, -14, -136, -93, -50, -50, 33, 0, 34, -8, 42, 7, 0, -106, -44, -12, -20, -136, 2, 64, -10, 45, -193, 120, -194, -93, -43, 43, 54, 47, 177, 37, 79, 5, 36, -8, -30, -143, 32, -66, 35, -23, 20, -45, 52, -92, -70, 123, -132, -140, -125, -140, -55, -77, -161, 112, 5, -15, -24, -83, 91, 174, -141, 118, 59, 96, 15, 40, 87, -71, 69, -44, -103, 44, 6, 88, -72, 4, -129, 46, 173, 139, 186, -108, -51, 69, 95, -100, -21, -45, -134, 73, 226, 0, 94, 105, 113, -16, -28, 103, 92, 112, -52, -177, -41, 93, -165, 165, -117, -7, 96, 33, -55, -118, -126, -78, -20, -61, -9, 36, 64, -62, 138, 95, 147, -20, 128, 71, -82, -65, -42, -59, -3, 101, 92, -56, 29, -174, -62, -198, 35, -44, 139, 105, -8, -31, 45, 73, -122, 126, 156, 35, -47, -80]
3427h0J72K6k31NM2J16j3J99r2l15K43P3l74K66JpM6m2j44J33P9k22Q5j16J73
3452B3kk38L08j95J56rj82K12j57J50O5o7k6M7j01J90k80J65j13p5O8M9J49j93
3476e6%R4q7k8J53J1j67J44p5o0M9j0Q6M5j32Q4n3j3O2m2Q6o6j28R7j7mk4n1K29
3505A27k11M8M3J18k37R0M4j21R6%O1J1j64K70k34J65j23N1K7k12K97j62m6Q0
3529A8K2j41j4J71q8M7J58k51J08j12JO3k7r7J32K7J13j89R5j94K24p3o4n5P0
3554e6R3j03o1J47J00r2l7O5o5r9J02l4P9p4J64j39mk3j3l0l2k7K01j04LJ11j4
3581E8j28K28j65n4j9R0j9j23J04k1p0K22j68k15J59J93o9R0j21J0J10k8j64j06
3605b06J6K93k31K00K0r3m0j14J13r3J01m8J78j69K13j40L7N5k07J77r6q0K83
$$ y = [-80, 92, 118, -113, -108, -66, 50, 37, 236, 144, -171, 72, 145, -229, 37, 38, 31, 77, 35, -109, 24, 103, -119, -34, -150, 23, 21, -217, 91, -104, 52, 43, -139, 73, -84, 66, 131, 64, 38, 85, -16, 174, -106, 59, -54, -129, -61, -12, 137, -56, -56, 38, -49, -77, 76, 87, -80, 64, -11, -71, -22, -32, 54, 99, -33, 51, -2, -15, 47, 5, 91, 25, -103, -6, -23, -27, -51, -102, 127, -84, -36, 7, 125, -112, -22, 22, -99, -3, -3, 58, 69, -95, 175, -59, 106, -17, 34, 61, -151, 146, -16, -62, 18, 40, -101, -115, 56, -32, 15, 173, -78, 30, -82, -81, -18, -45, -142, -10, 17, 130, -59, 36, -158, 66, -7, -71, -126, -56, 37, -66, -127, 20, 120, 28, -9, 56, -9, -108, -6, -40, 39, -35, 129, -10, -14, -37, -50, -80, -112, -139, 62, -42, -39, 72, 58, -70, 158, -7, -61, -80, 10, -9, -132, -28, -49, -119, 103, -65, -280, -121, 72, 3, 93, -28, -18, 92, 64, -100, -206, -190, 103, -128, 72, 92, -1, -41, -155, -42, -135, -34, -82, 96, -73, 140, 0, 37, 92, -115, 62, -34, -114, 169]
3628A69p5j76K02j19K8l7R7j93J55k0M9p5M0j76Q3J6J9q2k7J07kR5j19J21nk82
3654b07J90J45j60kj4J45K1k28m3K40j76J74k64J23o6L9J81j63j5R7J6m4n8J28
3678E9J9p9J31j80%J83k73J16J44q7q9P7l7M3k05K32m5M5j09J39o0P8p0O2j26
3703c2K4q5K4J45q2r6k5R3J0N0j00P8j8J8K1l3p2J4M3J26r9j34M6J04r5R9r5Q5
3731A4N7j42J98k69K01j3j30M4P4K4M3j28o7M1J12j0q4N5j98J81R8p6R8j51J77
3756A49j05O3j41p9N1l3J05J08j65K0l7R4M7nm0L8m6k8r7j33K40q6m7K30J34k29
3782Ho3O6J00J32j13q7K3l0k25R6J37q5P7j40J56L0r3r1O3p9M7j7P6K7j40J87
3808F2m6R4j6o7o3P3n8M6k4K9q3J57k6m2j28J09J15m9j03J86r3o2jJ60m7j58J34
$$ y = [169, 94, -82, 120, 1, 29, -8, 89, -104, 51, 31, 80, 5, 45, -131, -48, -32, -13, -95, -122, -15, -17, 78, -41, 80, 75, -207, -17, 128, -32, -34, -48, 97, 118, -110, -153, 87, -89, 85, -179, -56, -122, -83, 98, -65, -80, 17, 33, -11, -69, 59, 78, -1, 130, -50, -50, 133, -140, -24, 120, 33, -56, 21, -16, 27, -178, 54, 9, 54, -55, 84, 24, 102, 32, 94, -32, -8, -93, -69, 76, -6, -102, -127, -34, -24, 26, -74, 4, -14, 4, 25, -8, -80, -66, -23, 103, 4, -130, -84, 20, -75, 24, -71, 14, 71, -71, 127, -142, 59, 46, -84, -40, 34, 58, 101, -27, -94, -53, 59, 49, -35, 20, -178, 3, 101, 25, 123, -28, 149, 44, 107, -34, -113, -62, -95, 10, 118, -47, -27, -64, 30, 77, 72, 32, 70, 24, -4, -101, -234, 6, -80, -127, 103, 237, 8, -55, 11, 111, 243, 130, 43, 66, 36, -189, -93, 44, -41, 36, -104, 52, 82, -11, -102, -39, -118, -71, -88, -12, 15, -125, 62, 16, 110, 94, 27, -36, 37, -21, 25, 1, 30, -53, 104, 78, 36, -92, 17, 132, 83, -20, 166, 73, 11, 10, 170, 123, -35, 99]
3835I9k6q1L6r8nJ11r7mj8r%J40q6j84K7M03k96K05N2j78M0PR7j05j8r2J89m8
3863F1j33P1l0O1O7j06J9R8j02R4k65J44j7J17Pj93K71Q9k68j7N5K3j77M0R3J43
3889A45j29J22l4j43J47j82Q1O2j23R1j45K7M0mN5Lm8l2L2O6j52N6R0K36j87j40
3915f6j8K01r5k8j33L2j18K68m8m2N0R6j20J9M5J1L6o0p3L6R9j14p2P7O5K0J4
3942H2j8o7JJ22Nq1j80J34K8j1j41J04N7p1M3R1j5p2J2l9m5P0R0K7j40J15j47
3969d6Q6m2O9j1j78R4M2Rm9R8j2P5j76n4M9K4J10k66K23p0J1j96J82j29J44p5
3995h8M1p1JR2J06j79R3J53l56K07K0j22Q4N8q6M7J08l63L17M9j12n1K3O0J35
4020A66j58j4J9Q3j99M7m5m5K63m7j1Jk33Q5M9n0J02J94q4j12Rk5J7J6J72k57
$$ y = [99, 73, -8, 28, -70, -75, 36, -61, -65, -83, -92, -92, 48, -38, -222, -195, 208, -88, 117, 169, -9, 31, 38, 135, 30, 12, -80, 109, 61, -72, -1, -31, 30, 97, -9, 10, 108, 6, 100, -165, -21, -38, 79, 86, -107, 164, 253, -15, -32, 23, 46, -131, -91, 2, 145, 16, 138, 104, -39, 108, -74, 7, 69, -54, 37, -108, -81, -41, -45, 10, 13, -35, -67, -35, 31, -121, -65, 25, 261, 74, -66, -84, 117, 22, -6, -139, -107, -225, 43, -5, -47, 3, 99, -21, -2, 43, 54, 90, 30, -43, -7, 92, -22, -94, -17, 48, 68, 82, 64, -3, -2, 120, 125, 44, -136, -2, 26, 15, -126, -22, 35, -36, 7, 98, 83, 11, 23, -16, -61, 9, 99, 126, -14, 101, -46, 40, -2, 67, 56, -122, -28, 14, 23, -26, 72, 60, 135, -41, -95, -46, -22, 88, -178, 45, -25, -14, -210, -28, -157, -13, -88, -47, -118, -117, -25, 81, -98, -5, 148, -208, -1, 19, -103, -19, 39, -47, 0, 108, -255, 62, 111, -1, -52, -29, 31, 166, 8, -6, 13, 96, -103, -56, -101, -146, 117, 70, 59, 60, -173, -88, -39, -89, 13, 207, 123, 11, 20, -5, 12, 28, 200, -57]
4046e7J76j36J63p1j44O2j95K72j68J03R0k97K42k49J63M6n5J16n9R8j13j0j00
4069a23K86j67J42n2K3j09L6J8k3k4J79k10M8p2J08j59k1J71n3J62k90rJ69n7
4093b7J7q1l4J49R3k63K58r6j2Q9rk3j69L8k6J09k09J80K4J3m0P5J9p5Q5n3K8
4120F0k7J7N7l0K5j07j15J07Q6P9k24R0m5k6j06J16%J23jK5lj8j73J21p8K41j44
4147E0P5m2j19j82J10J05J9j13J15o3P2k0j8l9J03K9j29J60k35J67o2J06l4K1
4171G6Oj45R5j23K1j01K75r8j87J84M4J8p7Kr3J46j01Q7J00j04j71Q8Q4O7p4m8
4197b9M9k0J08M3j56j2J58q8l8k6o8P6J05l67K31J56j41j12LJ00r3j02J35n8K22
4222G6j02m9J08N2j63M5n1K17j43L8o3J27o2j45QJ39j10P5o3PO0l2j1O1M9j36
$$ y = [-57, 119, -17, 146, 75, -69, -7, -202, 70, -98, 5, 95, -202, 40, -209, -46, 0, -55, 61, 2, 100, -13, -23, -123, 163, -4, 138, 86, 109, 0, 36, 54, 31, 7, 186, -24, 24, -48, 60, -99, -120, 51, -2, 160, -130, -139, 30, -27, -10, -91, -125, 24, 117, -146, 112, 16, 4, 93, 84, 61, -108, -70, -96, 13, -196, -16, 8, 21, -19, 56, 75, 0, 85, 32, 60, 33, 50, 107, 77, 102, -5, -120, -13, 73, 152, -72, 18, -27, -53, -159, -43, -43, 80, 79, 104, 101, 83, -90, 31, -47, 194, 50, 125, 83, -36, -218, -108, -3, 16, -97, 18, -45, 27, 7, -11, -50, 53, 82, -47, 113, -122, 45, -17, 89, 55, 76, 82, -63, 32, -91, -70, -171, 104, 6, -181, 3, 47, 65, -12, -10, -103, 43, -58, 29, 129, 25, -146, -58, 26, 93, 19, -29, 20, 0, 108, 151, -5, -17, 141, 53, 15, -11, -79, -3, 102, -265, -34, 122, -19, -131, -128, -28, -121, -223, -88, -146, 76, -26, -75, 33, 85, -78, -33, -84, 133, -10, 28, -35, 92, 30, -115, -107, 32, -78, -3, -66, -59, 1, -31, -42, 19, 68, -68]
4248f8K10j7j01J0q7l2K77j37j73R9L3j43L6J65q9J5j7K4k55K83%n0J39j29J01
4273I4j45j31J77J96k58k3j9K64k86R6L3Q0oN1K4Jp7k57J23J11k45K31n3N1j29
4298i7L1J08k34J68J17p4rP8Q1j18l4J66k28q4J30j1j4j25K03j01n1J26N9r7n8
4323f8l6K34j38l5Q0q5J69o9l2o4OO2r1M9P6R7j01m6q5J7q2J38L1L8j41m9J14
4350a1P1L9j07R5j22p2J21r5J86o9j28R6L2n5p5J09Kj44J08L3q9J94J9j96QR7
4376D7j50R1P9P8j77l5O9o1O4j22O1J26n6n3K6J32j83J25q1J3L4l2N4J13j04j43
4402h5K11o7r4l4J8M2J3q5J05j09O2J73j56r4M5j13J23k8J19o8J5L5n9J33j43
4427d1J72n9N5N6j87J4J1m2J73j15j27PK39n1j39K0O7o0o4N2K17k44R0k21L36
$$ y = [-68, 142, 125, 24, 34, -53, -85, 192, 55, -118, -19, 14, -129, -93, 72, -17, -2, -19, 5, -250, 33, 33, -17, 122, -7, 94, -51, -182, -5, 191, -67, -90, -109, 155, -131, -35, -2, 78, 72, 123, 147, 148, 71, -186, -63, 48, -197, 34, -19, 32, -97, -66, 42, -192, -24, 93, 19, 10, 88, 169, 51, 17, 183, -45, -129, 1, -10, -24, -149, 54, -47, -98, 28, 87, -10, -68, -104, 130, -8, -43, 37, -48, 121, 52, 20, -44, -38, 24, -67, -18, 58, 155, 54, 8, -77, -60, -142, -4, 27, 65, -76, -125, -11, 60, 99, -8, 87, -35, -107, 14, -81, 105, 36, -92, 4, 36, -19, -94, 15, 17, -127, -19, 14, -75, 119, 138, -58, -50, 47, -103, -12, 67, 145, -32, -67, 2, -59, 5, -117, -56, 70, 14, -39, -13, 119, -64, 61, -20, -7, 27, -5, 49, 162, 58, -85, 126, 59, -35, -69, -51, -9, 4, -81, 24, -85, -23, 150, -6, -100, -55, -168, -45, -73, 46, -22, -7, 28, -31, 102, -41, 131, 72, 127, 183, -4, 10, 21, -21, 152, 37, -90, -83, 156, 105, -34, -14, 53, -7, -71, -19, 198, -46, 44, -177, 159]
4452A59l3j14N0M1k3p1Q1n4o8k9L6jJ35k26M6J41j28m4J73j30oR2M1o5n7L1P6
4479E3j46o1K05r6p6J68P8j14j53P6M4k9P1%J2M2j39M8J57k80N6J09J32n9j61
4504f3J73j15M0L0j38J20J02k46j66K71m8k7N0m6J81o5J16k45Kj00Q0J03nP4j54
4529g6R5r9R6L5m8L3j02J57j00N5O6j19J29q8K1Kj01L1j03R8R2j71P6J63r7q5
4555d0P2j72J54o7M8j24J39j29K03J7K1j26R8l7q2m2M4L3K0j04P8j03J35n3J10
4580I3k04L1J64rj38J07j09M4N5N3k6Qon1J34m7q7%Q4n9J67k29J46k67J53j15
4606a08P7j0M8J14j71Q5P9q4K3K4k85J89j03Q7J7r8J65p5j0K08j57J3lr2j01J37
4632c1M6l3R3j48J89o6r4m9K14j21N5l8j78J63j47J65R5l02M2K11Q3j26j5q3J00
$$ y = [159, 126, 12, 62, 103, 80, 9, 90, 36, -32, -61, -25, -26, 109, -117, -71, 70, -58, -102, 71, -59, -65, 27, 68, 3, -54, -23, 53, -93, -154, 51, -45, -121, 47, 125, 11, -142, -66, -22, -51, 20, 20, 32, 74, -65, -17, 140, -140, -84, 25, 157, 98, -63, 110, -5, 35, 65, -73, 47, 149, -97, -263, 8, -40, -67, -17, -63, 118, 53, 169, -76, -74, -174, -94, 9, 4, 78, -76, 19, -80, 16, 51, 3, 36, -66, 91, -9, 46, 112, -7, 122, 34, 55, 57, -44, -13, -116, -18, 74, -97, -21, 142, 45, -40, 32, -140, 14, -53, -5, -129, 10, -119, 84, 101, 122, -4, 94, 57, -25, -67, -23, 10, 30, -74, 4, -99, 36, -17, 93, -111, -80, 84, 75, -63, 44, -65, -21, 34, 87, 61, 69, 63, 12, 146, 99, 12, 12, 96, 37, 204, -25, 121, -146, 7, -108, -31, -41, 7, 121, -50, 35, 114, 30, 53, 77, -208, -19, -122, -35, -18, -116, 49, -26, -36, 172, 15, 28, 25, -67, -168, -31, 15, -18, 75, -73, 116, 50, -44, -93, 121, 0, 55, 17, -161, 2, -145, 20, 115, -187, -145, 66, 149, 23, 8, -75, 25]
4657B5o0Mj0J9m2J45j86J38j5p7J03K3n4J57k88J10Q7p8nj8KJ7j48J77m2O1j4
4684C1n8J50j20J22q4R4p4P0j45J82j91K2J8M4P2k25M4J72r4k82J87K5Q8k35J50
4709c7o9K54r9k1j62K53L4k97N5j1Q6k9J03m3o2j4L2J27m7k3q0J83j88M8Q7q9
4735il6M5o1Q6k3L0m3N9m8Njl7J49j42q3J16J0n0Q0qj3q7K38k04J59k86N7O6n
4764c6R4j72L15k55J11L7j05m2L7p0J26j5K8k2m9pN0nl1J5J22K8j63R6p4r6J50
4791F7j22J46k6r3O9p4n3J08L9qo2Rj09J33pJ4Nj65K70r7oQ1k24J87p4O2j10J49
4819A09j99J99j81J57j47o3K14r3p3J16KMRn8j05K48j72L4m9J12o1rJ16k02L6
4844e6J6K1k5K4j8O1l3J87l03P0L5k8p0J54r1J2K11k06nR4K7j36N3k7J18j04O0
$$ y = [25, -35, -31, -41, -22, -64, 81, -105, 33, 18, -59, 44, 67, 13, 170, -118, -8, 79, 1, -4, -22, -20, -3, -151, 26, -16, 45, 31, -27, 123, 3, 125, 41, 135, 61, 131, -14, 168, -23, -1, 17, 61, 133, -92, -48, 124, 30, -252, -65, -40, 48, -187, -37, -106, 148, 49, 28, -134, 119, 153, -144, -89, -100, -14, -43, 60, 17, -45, -59, -27, 100, 53, 30, -50, 133, -55, -7, 80, -9, -45, 0, -61, 25, 2, 32, -11, 48, 0, 5, 4, -33, 116, -26, -109, 7, 17, -33, 47, 39, 26, -61, 177, -27, 132, -154, -97, -31, -36, 58, -114, 201, -54, 57, 94, -11, -53, -16, -86, 40, 25, 53, 31, -18, -25, 25, 20, -11, 4, 126, 154, -9, 87, 13, -83, 67, -55, 91, 65, -28, 41, -33, -86, 22, 61, 53, -9, 0, -109, 24, 17, 31, 36, -129, 141, 44, 38, 119, -105, 82, 8, 70, -40, 109, -90, 109, -72, 85, -62, -125, 89, -4, -77, 39, 41, 45, 54, -4, -109, 139, -33, 1, -48, 64, 3, -6, 110, -92, -56, -40, -19, -44, -20, -38, 23, -10, 177, -126, -56, -21, -49, -119, 35, -56, -44, 167, -39, -44, 50, 77, -59, -6, -33, 85, -19, 41]
4871D1j07r2J80L9ok1O2j3j84J17l2K0O9j92k2J52P2J2j20P6j7o9j28J94O3j69
4897g5M4k4J0R7J7o4L9k2K6k2n9O2J08k27QN0N2j16K22j05Q4j36k68L34j68J67
4923C4K5p1O2j62J19p0l0J16j38J2K26j47N5l2j9m9L8l2L6K9N0N8j4p9m5Q7J0
4950F9k00R7K46j62M3j35o2R9j56K05K2K5j52r3J38k7J29j54J44J38j10k40J59
4973B3l5j1j23J13J3J01j28RM9Q8k8j18J64n7j21J8J45j24k4O5k58J06J85j02
4997e0J5J97k14k1j18J58N2q4O6J14j27j9J2J81m1j38K6Q8l2L1r0j93K66j73P5
5022a9K7j19J37L6j04nJ19j38M6O1l4M1j1j61J12k0J03j13P1p6P1j5J2p8p4J82
5048E1J58m25J33J5JK15j67J01j61K17j28k5j28J47n1j1j22O2K71p2P5q1m6O9
$$ y = [41, -66, -158, 22, 61, 55, 34, 96, 83, -101, 16, -16, 4, 73, -119, -141, 11, 83, 95, -25, 51, 34, -35, -163, 31, 94, -75, -31, -55, -45, 52, 69, 5, 44, 22, 48, 26, -33, 29, 137, -90, -82, -32, 20, -96, 126, 21, 105, -31, -299, 35, -133, 34, 59, -12, 50, -112, 7, -63, -93, 23, -115, -103, 123, -24, 31, -1, -20, -69, -31, -63, -27, 2, 52, 110, 96, 17, -28, 59, 69, -131, -34, 212, 50, 93, -42, -104, -5, -161, 44, 66, 91, -61, -154, -16, -43, 86, -68, 76, 214, 104, -136, 23, -12, -23, -146, -33, -20, 81, -47, -38, 11, 99, 71, -47, 117, 60, -61, -43, 102, -22, -46, 19, -239, -133, 52, -50, -35, 162, -52, -73, -191, -33, 19, -65, 1, 115, -12, -31, -19, 162, 121, -17, 9, 97, 65, 96, 6, -187, 79, -94, -19, 8, -111, 26, 62, -42, -47, 72, -66, -20, 41, 7, 48, 37, -124, -12, -32, 71, -42, 29, -47, 24, 9, 21, -57, -131, 51, 209, -216, -83, -68, -67, 148, -19, 82, -79, 138, 10, -15, -143, 4, -47, -58, -180, -118, 153, 81, 156, 75, 29, 98]
5072I8k22K12j9k3j11K07j65q8K60k04K03j41l7O9j70J41Pk6QQ2j19J17Rn3j91
5097a56j43L06N2K5n3n3mjj04%K12N3j86Q7m4K5j1R9n6M3k06OJ18J53j83K5k9
5124b5R4N5q4K5j66K22k6k58J37J11N5j35j2J5l0k0J28J3n9R0l5j53K07k34J38
5149E3q6J40k11P5J69r6j07J24O5j62M5K4l3J9J71k08m7J48r3RJ0jK4j49m2K03
5175D4K6o6l3p3l8R5J85j48K3j28K3R9m0L4n2mn2K22j91K13o0j40R7o9p5J49m3
5202bOO4j24K53k07r7J15pn3O3O8j3O6m8j48O4j10J45k15J20j3J41n4ok06O2N7
5229g9J74oj0o8Jn8j00P4J5O5oQ0k60K65J2L1j0q9k27K60k05M0O0j10J89J4J4
5256F6j94J34q0J07n1j03Q3J08J30j65j46K3%J25j90K01J6r3N8p3LO3K8J5q9j04
$$ y = [98, -124, 88, 69, 46, -65, 142, -23, -111, 149, -55, 148, 7, -30, 39, -131, 10, 17, -9, -1, 81, -38, 79, 88, 35, -156, -299, 7, 59, 84, 31, -22, -26, -27, -131, -131, 81, 134, -52, 35, -9, 16, 5, 104, 48, 91, -115, -109, 9, 162, -21, 4, -25, 69, 124, 40, 65, -101, 121, 95, -163, -26, 85, 140, 5, -7, 8, -22, -42, 86, 99, 40, 130, 95, -58, 149, -85, 53, -33, 107, -104, -29, 140, 44, -63, 61, 126, -36, 9, 33, 0, 19, 190, -18, -65, 83, -10, -1, 9, 8, 32, -117, -159, 44, 70, 4, -29, -102, -140, -45, 140, -8, 15, -113, -90, 9, -31, 3, -49, -53, -105, 117, -74, 139, 79, -61, 36, -33, -108, 41, -2, 4, 68, -56, 197, -10, -107, 8, 1, -52, 11, 79, 66, 132, 84, -64, 0, -110, 35, -180, -60, -73, 68, 14, 8, -198, -136, -79, 95, 89, 79, 11, 12, -46, -146, -72, -57, 8, 2, 82, -178, 87, 99, 130, 120, 31, -196, 64, -141, -101, -41, -151, 38, 52, 66, -128, 6, -74, 33, -18, -121, -38, 70, 200, 35, -111, -88, -88, 37, -153, 48, 64, -29, 29, -44, -41, 22, 50, 65, -24, -128]
5282a28Q5J24j87J42j84K48j42R7j2Q0pj44L49k65P0q9j7j35J47L0o6J65j55o0
5306e4J1o3O4o0K16J2k03L9o3L8q4M4R3L5l3J7j66M9M8J07Jj58J22N1k50L16j61
5333c2q6K44j04j60K42q8J5l5m3j7M1J16j59P5Q5j20rR9O5q0n2Jj6J77k50K09
5359A18j33R3J08j97o0K8O7j21M7M2K29l10J05NJ7K8n1J1j28J24k6J07k17L6Q1
5384CLL9o6J7lR7j00J68p0j59K1J58m1j98N5J88m2r8M7oJ09j61N0r5J65L3j25
5411a1N5MJ05j99j1j37K31pj52n5M7J55N7k03J37O1n5j35j4M8J37o9p5J32O7j33
5437b0P3P2j94J91j08O1J4m6P5n4K1j08Q8p7J04n5k9L5N0j90O7O5N7j42m1N2l0
5464f9j5J37k0K7J2m2Nj64R4J31j19qM7k13L2K58j08K2l8J83k79J71k7l3J4l8
$$ y = [-128, -43, 81, -106, 36, -148, 100, -42, 55, 43, 123, 116, -28, 321, 56, 126, 37, 20, -115, 32, 62, -4, 161, 6, -54, -43, -106, -42, -102, 114, 126, -77, -38, -101, -63, -147, -103, -10, 25, -8, 9, -157, -108, -60, 47, 48, -110, 12, 63, -187, 129, -32, -118, 126, 22, -138, 104, 16, 31, -4, -47, -64, -23, 93, -66, 9, 94, -26, -35, 64, 129, 49, -3, -2, -18, 159, -91, 118, -15, 78, 186, -11, -71, -43, 24, -97, -50, -8, 221, -89, 16, 21, 38, 66, 15, 26, -102, 22, -4, 103, -114, -78, 3, 6, 45, -21, -4, -7, 90, -10, 158, 88, -71, -50, 108, 67, -131, -76, 112, 70, -28, 19, 13, 122, -39, 11, -84, 81, 114, -11, 44, 48, 153, -46, -57, -194, 37, 30, -122, -177, -130, 25, 82, -121, 16, 77, 22, -113, -127, -79, 58, -11, -86, 46, 113, -20, 53, 125, -69, 122, 14, 75, 89, 43, 118, 64, 85, -23, 65, -12, 92, 37, 8, 43, 93, -97, -30, 35, 92, -50, -91, -39, -69, -84, 53, 33, 60, 72, 30, 35, -129, -35, 96, -23, -31, 16, -197, -165, 93, -15, 7, -31, 152, -127, 44, 17, -16, -2, -40]
5490d0L4O5m5n4O1p8Q2o2J24k36K31nj50m8J38l5n9J56n6Qp9J51k03O7M7j9OP6
5518G7l5p7q2J09mp2K55j55ML9j15j1q0J23r0QQ9j69R8R8p0OK2k2J51j29J43J17
5546B28j91O1m0rO0k91OK6J25J02n6p5M9o7m4Q7N4n7M7j27K65j8j00j3o3R4j03
5573e0P2j11M5K17k58L3mL7M1m0J30j61O5K4r7K3J42j46J25j04Q1q7p8J68j5o5
5599a3n1JJ28nl9K5p1J60j58n6J12p9o7n9J75o8rO0R7k29J29J71p3j9K10k43q7
5626e8o4J93q1j1qj24Q1J95l4j53j1M1J66k64J92m0L0j33k4L5Q0N8J2j51q4K11
5652E4k11J44O2j73K84j26k9K16j20Kp6j88P5K44r0j12j2R3mn3J07l1j86K5k9
5677a34K36m3M2o7qo0K2m2R9j47K8J7jL0K34j9j16n2p3l0J48r4jJ39j11j23r9
$$ y = [-40, -6, 59, 14, -40, 21, -57, 25, -37, 87, -149, 82, 77, -73, -121, 17, -18, -77, 79, 23, 31, -48, 103, -100, -33, 14, -5, 1, 77, 42, -35, -117, -8, -12, -84, 171, 16, 20, 59, -56, -67, -147, -24, -114, -106, -17, -186, -88, 10, -60, -54, -32, -54, 97, -32, 111, 228, 37, 98, 58, 49, 109, -182, -176, -150, -25, 77, 21, -54, -5, -72, -116, -29, 25, -32, 15, -112, 153, 135, 35, 22, -41, 53, -50, 22, -89, -44, 173, -85, -52, -56, -19, 22, -18, 112, -49, 16, 40, -57, -34, 108, -38, 87, -17, 64, -23, -101, 67, 52, -13, -64, -63, 65, 60, 21, 46, -25, 135, -23, -79, 33, -46, -113, -172, 3, -65, -74, -14, 83, -146, -17, 154, 81, 62, 272, 29, -58, -122, 71, -10, -21, -29, -153, -72, 123, 89, -64, -75, -34, 132, -132, 60, 20, 50, -83, -107, -72, 8, 66, 78, -73, -157, 54, -157, -13, 49, -124, 160, 34, 5, 221, 101, 103, 27, -161, -86, 158, 68, -44, -56, 37, 33, -20, 87, 56, -130, -105, -134, 102, 59, 101, 34, 26, -34, -12, -54, 45, -102, -74, -57, -58, -28, 206, 187, 71, 19, -54, -84, 64, -30, -31, 108, -3, -126, -225]
5704b25K63J5p9J39j04J15m6L5k13M3O8q2k3K1J02r4J61kK2j86K17j25k4K00k40
5729d2J72j08j3L7m0J58k22L7R6l3Q3j23P4n3n9N8j48K34q4LK5P0k5J6j45j7r4
5756a43J91j55J5km5K39k21m6K05L0M6j01J05j19N3o3M7O3j01O5nl0O1o2o3M3
5782Gr9J56j14P9Q8k14J69j22K9J31j48J28Qj81l0J03R9p0j16k8j54K03K2RK2
5807b3mK00l4j74NJ21q2k4O6J4n1mj9J33pj55J2M1on7K19j57Lm5j91K03O3m3n0
5836d6K0J13j07j09L9oP7n0j0J39o3j96K79P9k72O3M7J8j2p8K0J13o9R7m8j26
5862h8J81j77j1K5RJ94o4o4j45J55m1j4P7j79J44j5J10Lm4k4p2R9l4k4n1R9J2
5889F1j25J14q9M6O0J01j20j45J76l9m3k9J83p7n8j33N9q4M9J54%l8n1Q6%j78
$$ y = [-225, 38, 53, -26, 113, 9, 124, 78, 113, -100, -57, 11, -71, -94, -73, 29, -65, 96, 94, 116, -70, 147, 22, -2, 198, -42, 130, 22, 9, 46, 6, 164, -58, -21, 75, 42, 125, 2, 76, 23, -36, 22, -126, 108, 24, 27, 52, 122, 97, 113, -32, -49, -143, 48, -107, -92, -94, -139, 100, -121, -167, 38, 68, 114, 13, 118, -1, 52, -11, 36, 99, -2, 63, 58, 28, 89, 27, -36, 7, -92, 64, -50, 29, 117, -97, 72, -50, -21, 110, -38, 90, 98, -83, -113, -10, 89, 19, -97, -125, -279, -76, -54, -45, -23, -27, 173, 139, -35, -30, 91, 9, -15, 51, 65, 14, 10, -9, 124, 117, -38, -26, 15, 9, -48, 171, 14, 17, -28, -219, -16, 47, 4, -46, -26, 87, -20, -129, -90, -96, -19, -69, -79, 60, -3, -199, 80, 159, -113, -50, -3, 15, 3, -75, -55, 58, -11, 86, 38, -88, 93, -84, -95, -70, -61, 133, 69, 5, -140, 15, -26, -40, 37, -142, 2, -13, 97, 100, 56, 32, -40, 59, 25, 1, -50, 49, 61, -64, 50, -39, 7, 67, 168, 48, -97, 79, 40, -3, -32, 151, 74, 16, -117, -58, -142, -93, 61, 61, 23, -28, 58, 58, -120]
5915a20M9LJ47j07J0m1J32n9J88l25J84j18l1J26J8j68K52k13L2m0J62q4JQ2j31
5940e1Q5M2k24P5J59o8o6O1j5lJ07mj63J4J5Q5n2K2p4o6J64j1J82j23j32P6m8
5967a3J00L5j00j11J30K2o8R4j59O3J34j48l6O4p1R8N8j08p0J00j3J3J6n0J11
5992I1j89o5J16J45j82J73q4j7O3l7Rl9O7l7j18MM2l7J07n0jl3J9J05p2J13n0
6019D3k02R3M9j6N0ljJ1N1p2n8J29j84J80l7p5o2J57j43K06k9o1n9R9j65O7J38
6046A06j39L5Q9j58J67j01J2N1Pj51R6J7k1qj77J24RO5o5J8O0JM2n9j04K1O3P4
6074G4Pk2j40M8j35L21n4p1K6J8j10J35k90K22o0q0k3K90mk27Q1Q5j50l1L3J80
6100A23j10p2J38j66M6j9J27k3N7k39RJ07j28J35q0J07pr5O9J33r2j3mp6oK3j43
$$ y = [-120, -71, -68, 79, -28, -18, -59, 73, 14, 202, -123, 61, -57, -88, 38, 56, -112, 140, -73, -41, -81, 81, -3, -2, 80, -51, 34, 76, -148, -73, 86, 18, -48, 13, -2, -5, 102, 98, -65, -51, -36, 49, -3, 19, -55, -121, 43, 32, 214, 91, -41, 35, -13, 87, 122, 22, -89, 41, 63, -5, 89, -70, -7, 127, -21, -57, 7, -64, 34, 92, -16, -86, 14, 1, 14, 30, -20, 91, -98, -163, -47, 98, -84, 89, 5, -12, 51, 14, 23, -16, 51, 14, -104, -100, -58, -95, 12, -38, -39, -72, -53, 52, -20, 93, 43, -159, -66, -17, -33, 17, 14, 13, 24, 75, 3, -55, 74, -110, 70, 33, -42, -104, 53, -90, 116, 87, 26, -33, 66, -99, -32, 106, -33, 2, 91, -67, 100, -1, 11, 62, 69, -82, 14, 31, 10, 2, -175, -51, -42, 23, -42, -24, 36, 37, 79, 20, -84, -63, 0, 74, 81, 59, -81, -33, -168, 153, 99, 28, 54, 72, -38, 97, -193, 29, -31, -111, -134, 156, 152, -75, 6, 91, -59, -90, -57, 123, 13, -59, 79, -87, -41, -60, 67, 44, 101, -138, -129, -22, -150, -15, -95, 12, 5, -90, -21, 112, 20, 7, 3, -73, -79, -56, -199]
6127a99J38J43nM5mj20J4K8k4k5N4L5j19j34J63l5J66k61qL3J53l9j83K20r0r
6153f3m9R1P8o1M8L4j00l0K45j15j26k4J00q4M0L8N5p1J4M2O3k11J09j8q4K00
6179A21j47p0O8l9J07Q3j98J08N4k7M4l7j06j29K37o3l6R4j21M5p3kQ8j18R8N5
6205C6j09k5M4Q5j11J69j99J45Qmp7N9j13O1Q6q8J00o9m6J72j20m6j9M3j30K36
6231H8P2j47N0j37j03J11p3K17R7j22J2J6R1m9k02J2j7M4Q6o2J91j17J9k71J37
6256e7j03k2J36N8L7j16J09k37J76J16n1O6k66J42Kl3J8m5Mk8L05k73Q9m2r3R5
6282a3J15j23j25J50p7J50j67R9j89N7J37r8N2r9K9R6j5J34j48J3J11j73K9O8
6306A3j48J47Q0R6l12L48k3p9j96O5j2r7K23k51J81j19J9N2M4P8j14j3j1j09J53
$$ y = [-199, -61, 82, 77, 122, 118, -2, 12, 40, 16, -9, 45, 80, -39, -173, -10, -45, 121, -140, -148, -115, 38, -1, -184, 36, -54, -63, -112, -21, 57, -4, 44, 78, -22, -52, 193, 78, -48, -72, 28, -56, -16, 22, 77, 6, 20, 62, 125, -86, 23, 5, -79, 121, -26, -96, -28, -67, 40, 123, -75, 33, 87, 60, 104, 67, -39, -168, 69, 6, -30, 64, -57, -12, -85, -87, 1, -117, -19, 36, -73, -98, -54, 31, -80, 89, -110, 35, 43, 39, -38, 21, -92, -31, 55, -33, 67, -2, -48, 124, 4, -42, -61, -18, -148, 88, 160, 13, 63, -74, -177, -66, -139, 78, 175, 53, 65, 81, 172, 123, -79, -67, -84, -40, 46, -16, 175, 58, 77, -194, -57, -160, -182, -46, 12, 49, -67, 42, -195, -19, 97, 46, 112, -154, -12, -10, -43, -25, -70, -66, -94, 211, -62, 27, -15, -108, -13, 102, -21, -146, 4, -73, 77, -90, 9, -180, -123, 14, -84, -32, -131, -102, -6, -21, 113, -35, -22, 89, -84, -55, 13, -135, 12, 92, 188, -124, 224, 201, 122, -74, -9, -21, -118, 105, -146, 35, -84, -65, -13, 31, 109, -5, -18, -29, -138, 15]
6331A5j16j8J71n3K2j32K75j62j09M9J40j94R4R8k23K34k22K8R5K0j96L01j49
6354c2K8L4k07K08rj16J08Mj04J7NJ06J21k68J55l0l0MQ2j18J30J06k46J06M2
6379I6j58n1K35k04L7p5K7n8J82R1p7L7n1n1j62K04k44K97k42J92J05j80K30l69
6403a89Q4L05k33Q1r1J21J07j01j94K21o5Jr3J5O7p7RJ01r0J5K32l60O2K3N2J23
6429A26j67j38J78r6J39L9j46J08Rj29Q1K7L4L9L4k19Rl1O0J43j0L3r1m7q2J50
6455E3j16O6QK4J2q8j03K28j75PJ27n4J02Rj28J4J28j39O3pJ13j17k9l2j10K6
6481a18R7Rj14J59n8K2j09qO5M3j16K07o5N3j04j3P8o5n7K48k99K98l8Rj14j55
6507a45K77j77P1j45J81r8J04M7Pj59J58j45J18K6q6O7j20m3m6J60j65R6J01j55
$$ y = [15, -101, -119, 52, -1, 21, -111, 164, 2, -107, -58, 82, -112, -18, 80, -143, 91, -131, -103, -8, 12, -184, 117, -32, -4, 30, -177, 31, 22, -94, 14, 18, -86, -69, -64, 42, 163, -105, 50, 20, -10, -6, 76, -42, 88, 194, -52, 54, 96, -62, -113, 122, -82, -45, -120, -93, -151, 31, 122, 45, 82, 31, -20, -182, 22, -222, 75, -167, 25, 130, -50, 180, -189, -105, 200, -33, 48, -43, 78, 185, 84, -110, 111, 46, 47, -46, -31, 36, -41, -32, 69, -21, -6, 226, -134, -72, -49, 3, 126, -41, -179, -1, -97, 42, 81, -65, 43, 52, -77, 4, 31, 65, 104, 138, -81, -72, -103, -43, 100, 90, 123, 32, -15, -97, 53, -63, 3, 11, 35, 47, -41, -144, 84, -91, -84, 43, -11, 91, 100, -28, -14, 114, -25, 38, 31, 144, 27, -2, -34, -144, -118, -21, -12, -126, 33, -25, -3, -112, -120, -55, -12, -128, 79, 14, 67, -37, -50, 28, -37, -94, 154, -145, 153, 115, 124, 10, -145, 132, -45, 26, -119, 62, -36, 68, 115, 122, -37, 121, -24, 94, 120, 34, 101, -19, -62, -108, 52, -113, -17, 84, -71]
6531g1M4j4Ll2Q8j01M9nJ78j23O1j55Q4M0R6r3r7l8J6J11M9j54N4k8J22j90J04
6558bL3n9J64K2k12R9q3q9K36k07K08q2p2o7P5m0RP3Pj5m1kO8q4j1M0J3P5j33
6587g7Q4O6j51J44o8j14l8L47l05K9Q6r3R0n6J18qj04J17p1K5l2m0J05m9M5k32
6613a82K90j96K92k73M7N3o3R5k8k3NQ6j29P3j50J65j3j17J09p6l2J82n6q6J6
6638a1J62k04NQ1p5o2Q2K48k06o3k9O6K2q7J04k7n4%L6K4p4J46j3q8k28L66j23
6665bO8j25Q8k28K41k7M1q8J22Q8l67K69j11j6J34j01J4m5j51J64K8k0J03L2q1
6690C0n7l2J9J22j80P1P2j12m8l7J92j0j06rL5J56j73K26K8j82j07J66k8m6j49
6715a59J51J75j72J80M5j01k64K1L2O4K0n6K24j77j01K93j05j19l1J91j96M8L5
$$ y = [-71, -27, -41, -38, -70, 18, -83, -34, -39, 139, 16, 77, -78, 6, 46, 142, 49, -48, -86, -70, 41, 90, -64, -10, -38, 84, -106, -2, 31, -28, 136, 158, -54, 45, -38, -127, 109, -98, 110, 28, -44, -111, -36, -76, -67, 6, 13, -2, -43, -45, 23, -61, -72, -32, -19, 56, -77, 7, 73, -78, 66, -2, -116, -154, 193, -112, -83, 3, -90, 0, -56, 62, 54, -50, 67, -4, 21, -11, -51, 54, 5, 50, -182, 108, -88, 204, -69, -22, 31, -32, 63, 35, 12, 17, 103, -26, 47, -103, 62, 49, -68, 41, -35, -67, 115, 59, -27, -11, 151, -53, -48, 33, -42, -104, -22, 226, 20, -43, -72, -6, 16, -71, 33, 6, -48, -48, -12, 12, -62, 84, 71, -17, -245, 121, -2, 66, -59, 29, -199, 42, 15, 56, -32, 90, 178, -189, 80, -31, -47, 87, -14, 0, -45, -196, -32, -4, -24, 79, 111, 30, -27, -59, -40, 82, -98, -27, 45, -67, -115, -152, 40, 30, -76, -85, -50, 106, -67, 159, 187, 5, -102, 64, 36, -10, -159, -8, 167, -5, 175, 220, 119, -145, -124, -92, -28, -8, -64, 160, -17, -118, 175, 70, -49, -80, 111, -85, -37, -2]
6738bp4O2NJ57o3%j18J43j48j25K65j16N2j00J06j48n4Q0Q1R1j19J8JJ34l4M8
6764A42j53p1k0K7J75k7J9r3n9O8N7l4j51J75m5K3n6O4l1q4J5P1o4K1m3n2J40
6791A4k8R7P7k03o6P0M4o2J27o1j16j00J98L8J12j44q0J03q2M4J4l7k7N6j19J28
6817cq5M8J54k11R5k00K93j01L4n3L3M9r6P2m3J2Q9k9p1O2j30%J53k72L40k00
6843f0nL3l2J14j4Q1j6j43L0m7j03K04k19J56K7q4K15r5M6K0r9M4k1N0k2m5l2
6870a7J2n4K3j4o4J38q8M1m1J11J09k5j18J27k66J14J0k38K94M7j55J61p5P8j11
6895aJ1L0j23j5O7j2L4O7j57RR2L6n5r1J01q3m5Q6p0J30q9J7K2J15K8k23O2J19
6923F2o4J6K8Q0j23q9J32n8J32o0L0q2j29K26j51M4Q9jn7J40j89Om8J5k3mL7J02
$$ y = [-2, -76, -14, -9, 148, 85, 85, -33, 110, -38, -163, 102, -14, 38, -62, 44, -104, -158, -78, 3, 94, -25, -7, -6, 128, 94, 142, -11, -82, -102, -75, 100, 73, 92, -1, -60, 8, 65, 31, -120, 55, 10, 33, -23, 41, 10, -74, -59, 12, -52, -31, -74, -126, 14, -14, 83, 160, -43, -109, -39, 5, -57, 70, 9, -107, -207, -9, 29, 141, -3, -83, 20, -62, -18, -4, -41, -68, -12, -131, -3, -88, -40, 114, -97, -2, -202, 91, -10, 24, -29, 4, 53, -43, 29, -14, -2, 87, 58, -13, 49, -81, -81, 72, -200, 140, -60, -65, -32, -64, 50, 36, 117, 101, -42, -12, -59, -162, 42, -177, -21, 6, -78, 137, 42, 88, 108, 9, 53, 32, 82, 60, 15, -17, -5, -59, -36, -50, -114, 24, -64, -23, -64, 47, 156, 131, 13, 140, -126, -12, -2, -240, 54, 101, -54, 107, 32, 110, -1, 10, 40, -83, -98, -31, -43, -9, 58, -99, -90, 2, 38, -17, -108, -7, -90, -135, -49, -119, 11, -78, -61, -39, 76, 104, -119, -57, 62, -2, 14, 42, 122, -1, -90, 42, -16, 116, 56, 86, 4, -125, 101, -50, -6, 83, 82, 25, 165, -24, -18, -66, -51, -74, -78, -41, 61]
6951F1j57N7qJ07qj04J00n6j1oq8R6K3l2O3m2p7J31k13P3J37J21k34Q4J3r9J5
6978e4p6N0L6K33k05N4N7m8j30J33L2j83m3J66n8K5J06j68J19O1j28j6j0K2j63
7003a88J66J40l08J28l1J24p5J81k86J86j80K25j06p4J6k9K17P3j69m8M5J04n9
7026E2j20p3J79j9j48J79j46J29n8k4J27j66J93j66KR6j72K11Nm8j6J29Oj89j40
7051a77K52j21R8r3N6L1J14j81Q3j34J5L6J8j29O3n4K54j52j57K05q0N6M2r2o7
7076a14R0m7NR5k2j55J68P9j94J00q7p7K17M6j96j0J60j29J55J21k15r0J8o1J34
7101ioK11k39Pr5P3O6j09L2n2J64j23J65m1K0L7k40Q5O6P1r2J65j70K09k15Q7
7127F7Q7j70J16p1j43Q9J93j57p1K00k09J7P6q6N3l3N5k6K6KJ03j75j58K24J61
$$ y = [61, -96, -39, -47, 60, 52, -52, 48, -8, -19, -25, -113, -17, 6, -26, 37, -5, -82, 49, -164, -91, 46, 167, -67, 17, 30, -69, -54, -130, -80, -44, 189, -16, 38, 95, 47, -83, 50, 82, -101, -144, 22, -36, -11, 95, -73, 46, 107, -21, -37, -47, -25, -188, -22, 118, -190, -62, -93, 31, -44, 137, -149, 37, -143, 82, -24, -98, -82, -111, 106, 179, 10, -38, 7, 111, 52, -68, -141, 38, 19, -129, 50, -96, 33, -25, -49, 78, -88, 105, -61, -59, 37, -135, 76, 81, 33, 17, 146, 152, -37, -177, 75, -46, 52, -41, 15, 46, 160, -21, 62, -72, -57, -21, -3, -132, -69, -123, 131, -21, -178, 27, -53, 3, 45, -47, -114, -24, -71, -66, 29, 7, -148, 20, 99, -95, 5, -82, -159, 58, 104, -92, -102, 58, -71, 84, 205, -10, -100, -82, -143, -9, -15, 196, -43, -36, -131, -58, 8, -101, -69, -121, 43, -80, 85, 44, 64, 101, -139, -54, 12, 83, -9, 156, -14, 195, -20, 67, 154, -16, 100, 29, -114, -25, 168, 11, -60, 140, -69, -52, 24, -62, -9, -42, 13, -13, 13, 15, 118, -57, -215, 9, 170]
7152A70k1j39r6K46j71n7K00j29kk6l5j18L24k60N0mp4J33Kp8Q9j06J9K77k86
7177i2L1N8K46j97o6J5q7J04j52J41Oj27J84j38O9N6q7n0J83j68p0l4R1J18Rj39
7203i6J5J91k45J59j98J00J71j86J46j98K49j11o5Q6j27L59k91j39J77j59K65
7224A03j77J67M7j18j14kK34k19m7O9K03p2j87J20j14J96q1P9m5K0l1o7Q5N3m4
7249E8k04J3J47RJ40k33J38q9K12j48nj63J13j48J71P9j39M4k15K34p0l2K4P4
7273A0r2J16j7J87j20q0K2K2j05JP0J41j90j57K81k19R0nj49K01m3j05J43pP4
7298F9j6N0j26m9P5P4k94J58n5J05k5L5K0l6l2R8l5j2Pn1k4J97o6j37qM0J2JK15
7327A90j54q7N9O1n1p4J40j04J8Q9j63J1P3j48%Q7O6M5j19R4P8q6j9J42j68N6
$$ y = [170, 149, 10, -86, 160, -11, -68, 132, 3, 1, -25, -60, -178, 146, -114, -64, -68, -142, -9, -7, -85, 4, -102, -83, 194, -92, -61, -3, 243, 46, -20, -5, -92, 12, -140, 1, 7, -120, 64, -74, -5, 51, -36, -86, 97, -71, -141, -175, -84, 34, 43, -96, -81, 110, -135, 24, -174, -74, 97, -89, 57, -141, 108, -3, -68, 18, -109, 250, -41, -180, -3, -162, 103, -74, 93, 140, 22, -92, -94, 140, -79, -126, -57, 146, 74, -113, 7, -107, 89, 8, 87, 42, 62, 31, -36, 49, 102, 58, -146, -133, 14, 23, 163, -70, 68, -21, 191, 43, 38, -125, -12, -160, 11, 90, -49, -5, -220, 14, -56, -88, -64, 10, -82, 34, 17, 204, 84, 4, 26, 48, -57, -56, 14, 155, -35, -192, 89, -130, -40, -45, -194, 7, -36, -141, 2, -5, 69, 53, 103, -23, -72, 3, 77, -217, -59, -114, -9, -34, 1, 21, -15, -47, 51, 16, 4, 11, -40, -64, 133, 67, -70, -78, -38, -26, -25, 190, 36, -51, 8, 69, 18, -56, 84, -20, -2, 87, -76, -65, 8, -140, -140, -53, 13, 58, -61, 33, 111, 25, 6, 148, -20, 36]
7353C6j7J11oo0j18j10K80m8j0O0jm6p6k7O7j44%J71r0K8j24J21K2M7M8j97J19
7380C6K09l48J09q4n5M4m4K2K82j08j45K34q7q4Jn8J31r8K8n8J17m7N2OK7q9O6
7407E9j4%p0N1q5O8J6O7k25R5R4L1K2k61R7J29k15J85jm8o7K4r5N2J48Q0r1P9
7435A25p1n5Q0qj11R6P6m7J5l8P3j64M6J9j0J9j03o6M6J60j45j17J99p1J72j96
7461g6J61P6j51Qj73K09p5q9L18j94J03j3j09M6O4l7J7p5J39j75o8M6Q6r7%J4
7487d5J64j33o4P3j39J7j2O8O6L8j99J39RN5j17J29l4P1j07J17j57N2J77j92J37
7512A13j92J48q5j12K18j66R9O9j10l3Q2PMN2j04R2p0J5j03K2k7J51q6q3J84l9
7538D6J95k27P2j01l9J11k12o1J27KJ73j42J33O0j43j22J37q3L8j4K3QP0P6l28
$$ y = [36, 19, 130, 124, 64, -54, -164, 116, 68, 58, 118, 117, 71, -5, -32, 35, -109, -109, 62, -28, 0, -124, -3, 19, 66, 114, -83, 36, 245, -103, 6, -78, -133, -89, -133, -111, 171, 63, -82, 152, 65, -19, -18, -76, 55, -43, -15, -73, 44, -3, 49, 55, 82, -7, 59, 45, 45, -25, 26, -59, 9, 25, 92, -133, -38, 56, 87, 109, -152, -55, 74, -141, 44, 43, -5, -72, -48, -143, -91, 57, 137, 46, 125, 54, -1, 79, 71, -40, 56, 132, 85, 100, 62, 135, -29, 17, 36, 26, 45, -58, -124, -78, 82, -63, -180, 19, -52, 120, -76, 85, 161, 10, 18, -155, 54, -21, -110, 208, 14, 117, 104, -5, 41, 105, 68, 85, 10, 149, -26, -94, -48, 38, -59, -59, -45, 119, -14, -78, -5, -144, -127, -139, -71, -5, 33, -166, -27, -18, 37, -80, 49, 15, 86, -21, 96, -61, -9, 168, -24, 113, -79, 69, -16, -128, 90, -76, 23, 92, -18, -51, 31, 38, 42, 94, -10, 82, 12, 27, -76, -54, -81, 70, -16, -99, 85, 46, 241, 14, 86, -15, -54, 57, -155, -216, -89, -87, 86, -56, 77, 137, -6, -128, 9, -74, -36, -50, -27, -19, 51, 127, -201]
7563b01J88Q8q8N1o6m9p3J16Q9N7j26KK3J67l16M3J72j79J3R2r1L6M8R0j51l0
7589i5J18l4K3L3K4j29J3l3Q1LK7J8k9n9l6K0pJ5j0K46k35M1j30M2J25n6K3M1
7617D0j0K0j27N9J52j13N8j92rJ56N0M8m2l08J13l9K07l2m7L2J05k33K44K5k12
7642e5K3J11O9m7j56n5J42n9Q1k6K9r6q2P0L3P8l4j13J36J38k74L0K2rp1M3NJ07
7670D0j06J07k9J29j71n1J59j27P6j84K56J06k90J12j26L6N0M4j52Q0J58j94K18
7693A41j87K4k1J31N0r8r2j05J64J61j33k4l2J8L3Qr9O1K16k09O5n7k8l2q1J95
7719F9n2j02N0o0O2P4k36K89k02R7J02j24J03o6K8p4j0J20oL2n5j46N2m5K42j74
7745c2j5p1J5K37j02j4L6j80J02j34p3K7K33L6j65P4K1m1M9k3J06m4l2K4p3r7
$$ y = [-201, -13, 75, -13, 38, -28, -77, -150, -34, 55, 112, -14, -12, 11, 178, -138, -95, 77, -102, -89, 3, -88, -52, -4, 86, -65, -95, 23, -11, 12, 45, 69, -60, -47, -80, 1, 4, 31, 49, 20, -39, -75, -55, -62, -47, -57, 189, -46, -5, -135, -93, 32, -24, -1, 40, 30, 50, -77, -18, 134, 21, 79, -113, -122, 34, 84, 132, 90, -218, -105, -144, 63, 31, -16, 16, 121, -112, 132, 157, -55, -32, 79, 148, 101, -55, -110, 32, -27, 54, 28, 57, -39, -121, -51, -18, 60, 26, -87, 49, 187, -87, -57, -35, -44, -115, -72, -67, 40, -66, 41, 12, 141, -30, -81, 78, -49, 27, -157, 99, 205, -85, 27, -99, -63, -13, 31, -121, -41, 117, -77, 141, -46, -22, -43, 88, 138, 40, -52, -157, 7, 168, 35, 11, -21, -3, 30, 38, -61, 0, 216, 7, 72, 15, -13, -45, -126, 69, 17, -85, -35, -95, -33, 41, -195, 94, -108, -11, 91, -33, 70, 4, 32, -42, -52, 68, 62, 94, 39, -107, -55, -100, 142, -32, -47, -118, -103, 134, 32, 18, 54, -126, -24, -158, -231, -204, 29, 65, -100, -26, -5, -46, 3, -20, 86, 42, 10, 34, -39, -136]
7771a36K26p4j28J45n2L7K7LJ8p8O2J67j87n6O8j48J69j7j6k00K65L0j70m9l3
7796a27J80r2J19k29J98J6M8r0p2l0M9K6K08j96l8j32K02k23J58O7k30K48j35
7819g5L0k9Q5O8o9n4N4L7j42Q0o1J50r2j24K28L8j61Q0n6J03L0Nj39l4J98j89
7845c9k3m2J30N1m1l7j17J21j46J04J0j77J32J65o0OJ49j70m4K6M6ML3L0j41j11
7871a41R8J78r8j04J28p1L4O8j53j44J75jq3j0K7J55j33P3M2Nr8J02j56Q3j05
7896a29R6j09J63QQ6K9j96Q7k32J91J2J19j70J5K06k72k5K55j8n5k43J54J23j91
7920i6J13J9P1j20l4J0Q0n4l6QO5k2jp5Q4n4K6Q9o8p6K74k29r5Jj61J75J64j14
7948e6J15j05J5J42p0j44J69nj64N3R0P2j02J15q5O4j6k13K40j37P5j29P1j12
$$ y = [-136, 90, 16, -112, 33, -19, 18, 45, 48, 66, -12, 50, 217, 30, -26, 42, -106, 63, 46, 30, -170, 95, 125, -45, -94, -127, 53, -39, 80, -149, 49, 65, 113, 23, -49, -79, -30, -4, 204, 8, -30, -162, 40, -183, -25, 42, -188, 60, -75, -45, -74, 11, 79, 10, -44, 10, 47, -95, -15, -76, 74, -18, -142, 86, 124, -37, 43, -13, 90, 120, 125, -14, -48, 150, -39, -62, -104, 26, 77, 36, -1, -118, 3, -143, -39, -29, -206, -74, 91, 31, 37, 186, 16, -28, -2, 44, 48, 81, 111, -30, -141, -43, 135, 37, -67, 61, -10, 24, 92, -61, -205, -30, -31, -114, -124, -97, 58, -75, -2, 40, 45, -53, 49, -107, -24, -129, -33, -142, 21, 29, 115, 144, -52, 35, -197, -6, 6, 125, -45, -30, 176, -96, -121, 134, 116, 61, -182, -28, 95, -96, 17, 36, 107, -13, -47, -37, 43, -11, -47, -39, 26, 4, 3, -72, 12, -42, -16, 73, 5, -71, 203, -26, -121, -120, -281, -106, 58, -56, 59, -46, -31, 111, 41, -103, 66, 61, -103, -50, 40, 112, 10, 125, 40, 104, 88, -125, 115, -22, 53, -76, -5, -117]
7972a17J79o4K6n1M9J0r4N9j5P6j56j1m6R4K48l40K76j65J05k36l8L3J51N6n1
7997b2Q6m7J33j32n8mR4j03J71j30o1Q2J75q0j22L2K1J16j9j69K01k12J15M6k01
8022h8O3k0j8Q7J27k84Q1P9j00N9q6J20N6o2N2j70R4O5r6J86j97J51j72n7K78
8047A48k2n4n3l6R4k11J18N6J34N7n2l10J68K9o6M9J09j35J1j31J8J13j74J56
8071A6m2M7q2n5K62j59J7LO2j84J64j17M4K18j71p1O3rK1j23J62O7o3k79P9K58
8097A28j45j0M7O1p3k17L44k42O2O0j1k8r5J88p3P9j86M1J9m6J54j8j08KO7N3
8123E3j9n5J83j12j35R1J1j9j00J7J63j64rL08j26k1k12K99j71n8LkJ28n6L0j02
8149g5P4K0q5L5k3O4r6J24pq7K3P6K4O4j22K4R5j53k6J77k06P6M7r7M3P2Rj04
$$ y = [-117, 62, -2, 24, -27, 22, 32, -62, -3, -18, 58, -98, -109, -155, -61, 187, -153, 123, -42, 63, -173, -211, -178, -27, 29, -22, 64, 17, 150, 18, -40, -44, 50, -53, 118, -12, -73, 9, 184, 104, -18, 14, 35, 151, 132, -37, 164, -48, 67, 113, -88, -25, -45, -63, 24, 151, -133, -52, 27, -73, -14, -100, 20, 76, 14, 66, -104, -10, 55, -41, 145, -52, 99, -73, -130, 148, 126, 72, 19, -17, 77, -134, -16, 40, 174, 231, 179, -131, 37, 66, 0, 49, 158, 23, 34, -97, -79, 34, -140, 16, -26, 21, -61, -116, 146, -13, 4, 7, 69, -115, 49, -68, -24, 194, 23, -48, 15, 6, 27, -96, 66, 133, 70, -209, -130, 128, -17, -27, 20, 81, 8, -209, 135, -107, -45, 15, 4, -24, -119, 69, -4, 75, -111, -70, -51, -97, 57, 39, -69, -67, 0, 53, 34, -21, 162, 50, -85, 6, 17, -2, -102, -85, 78, -86, -95, 213, 87, 66, -146, 153, -18, -76, -73, -75, 53, -3, 27, -75, -1, 19, -66, -31, -54, 10, -86, 38, 31, -56, -33, 43, 67, 131, 9, 33, 128, -25, -51, 126, -80, -4, 43, -54, -11, 61, 70, -34]
8177c4J45n4q6K4R7M2k49Q6J23Rn5j21Q8j76
$$ y = [-34, 111, 57, -29, -5, 92, 134, -115, -29, 94, 103, 48, -73, 15, -161]
8191a61
$$ Imaginary data points
##PAGE= N=2
##DATA TABLE= (X++(I..I)), XYDATA
0@%%%%%%%%%%%%%%%%%%%%Kj0J6j6J6j6J6j7K5l2L2l7M5m8N4o2O9p7Q5r4J04j17
42f2J31j46J62j78J95k14K37k60K84l14L46l83M24m69N22n81O51p36Q37r62J122
63F06j331J619k045K732m016P176k7923l5076Q0763n264m3851M3304J3521n7259
77b7044J5768L5742l0315n810L4613j6784k3528K0173O036j7452O946J1735r615
90D65q717Q359M007j2083j933J8231j521j7920Q656Q996j7581N080K1973j3581
104B431j2631J6141n891j2472K0342M514j8947Q675O820j9089N528J7208j1455
117A174n524J0437q247n694J2260k326p074P418j772o108O557j713o352R039K252
132D327r900M033N263p398J344P042m393r91M566l964l316N220J875j418M7k256
$$ y = [0, 0, 0, 0, 0, 0, 0, 0, 0, 0, 0, 0, 0, 0, 0, 0, 0, 0, 0, 0, 0, 2, -8, 8, -8, 8, -8, 8, -9, 16, -16, 16, -21, 24, -24, 30, -32, 37, -40, 45, -49, 55, -62, 69, -77, 85, -93, 102, -112, 125, -135, 149, -165, 181, -202, 222, -247, 275, -306, 345, -391, 446, -516, 606, -725, 894, -1151, 1581, -2435, 4741, -23182, -58258, 22505, 17241, -26610, 16694, 30215, -27044, -11276, 24466, -5849, -11659, 22954, 6170, -17358, 2815, 8851, -8601, -1655, 10080, 465, -8252, 107, 4114, -7969, -9902, 8329, 6808, -11112, -2456, 6540, -11041, -5961, 16012, 2431, -10200, 5941, 50, -12422, 7920, 12434, -6513, 2162, 8982, -10107, -4579, 12629, 1174, -4350, 6087, -2160, -7854, 4406, 2080, -4994, 2424, 652, -5456, 1101, -612, -6964, 2075, 4327, -5573, -1540, 3723, -3675, -2331, 4711, 318, -673, 3893, -71, -3387, 1833, 3708, 2290, 2337, 81]
148H1j714N99R37K784mn446J574K673o018J731Q444o512n850R233j289q856Q854
165A221M733j1605K532R626p780k368R137m783o290J0148J076r273L226N122o060
180a338N1O195l648n180L729K434l429m22L541j554m998J946N077k622k509L877
196A150j300m739M918L942n701k45M886l493j571O520j787o073M791K881n376
211a197R44M099l962k315L810Q5k578J303K13k452K27J863P54j597j477P36J194
228c50m51Q29O47k413O59K953j496j536L246j78l530K117K910l415l10K829k002
245E09k292L408M95l161K83J069j339J78J594j234j589R71Q98n90k89Q10l04r07
263a490J097J722j488n52K411p94k366K294K229k662r09K109r52q42K045p57k625
$$ y = [81, -1633, -1034, -97, 2687, 2683, -2763, -1189, 1484, -4534, -2803, 5641, -871, -6721, 2512, 1223, -7633, 1221, 5954, -5651, -3119, 6507, -1273, -3641, 5496, 713, -5577, 4571, 5647, -3626, -400, 4722, -1338, -1287, 4908, 1260, -3920, -191, 2243, -1186, -1608, 1933, 379, -4619, -2673, 2404, -218, -2727, 1150, -150, -4889, 29, 3971, -1730, -1975, 2911, -582, -2153, 4367, 2580, -3493, 1298, 4179, -1197, -253, 3846, -116, -2431, 1379, 1464, -1114, 189, 402, -2050, -1823, 40, 794, -803, -2280, -1544, -350, -801, 28, 675, -1738, -1079, 1874, 378, -1158, 2088, 1910, -1620, 497, 3407, -8, -318, 2511, 509, -1783, 1625, 2120, -1041, -758, 311, -1028, -850, 744, -490, -2079, -1108, -210, -800, -1089, -279, -583, -1490, -393, 1329, -159, -711, 1700, 906, -1460, 834, 3063, 401, -508, 1601, 649, -193, 1852, 1095, -1530]
280a530J505J405k201j33J234r75r60J167K46p96N35L00j132k58J606Q98j166
297b55o04R13N88o40R32P35j343n45J518k00p72R50m66j593Q26J365j099j230
315i20Q15n01r51J440P03j723k54R58m97j61J478L13j981J53J653O1m50O83j43
334F76j219J181J344j497n59J320o21j275J669M37j974k09J346r90n46J630o02
351A11k172R46J539j336l39J556o70j522J847J045j350q8J039o63j77J696p6j983
369e97P51J270j177m9J356o15j503M66P19q64N9P57j258j020J086J017j242l56
387a200R00k41m69P73P58j144J0J339n75m31J348L62j543j0J403o95k99J213p84
406G15j668J180J008j088o90O30j14j013R39O00j686k90J434k20j162J294O52
$$ y = [-1530, -25, 1380, -821, -954, 280, -695, -1655, -488, -242, -1038, -503, -203, -1335, -1593, 13, 911, -255, -859, 54, 642, 2, 934, 1669, 326, -219, 1299, 1099, 327, 1277, 811, -782, 44, 1409, 310, -920, -105, -606, -1557, -117, 586, -1137, -1391, -433, -930, -1091, 387, 700, -1281, -1128, 525, 586, 136, 819, 676, -543, 638, 1982, 485, -74, 1246, 625, -650, 1019, 1456, -518, -727, 619, -371, -917, 713, 111, -2061, -1115, 424, -912, -1251, 305, -365, -1887, -40, 1005, -345, -433, 606, -57, -234, 1462, 1386, -597, 154, 1424, 247, 198, 1554, 939, -564, -98, 621, -243, -184, 573, -685, -1705, -619, 398, -844, -1200, -300, -541, -1010, -237, 521, -623, -613, 726, 151, -280, 1068, 1430, -113, -123, 1280, 585, 286, 1499, 715, -953, 227, 1235, 147, -543, 87, -27, -1040, -101, 499, -1187, -1477, -43, -263, -1425, -131, 521]
423E21j581k74J894k18r17J576m2k168J410J868j589j085J996o90j380J873M54
440A648k319R1J695j324q98J652j8k088L79J290o33l60R23l99j349R81J591q90
458b8o67R06K08q61J144J046j893l75J992m97j499J417K22j739L56J166q10n76
476d88J048m87j441M80J137m95q60N11M60p69K75Q69n46q22J346P23j321K11J622
495A453j152j054K011K10j810P20J279k080k33K337r25j893J213M22j748P44J337
512H31j348j325J636M02j097Q5R19r10k39J720k01j448Q37J665j639o11K213l66
530A124j691J209P37j714M84J537j303j648J776L80j575K69P12j230r1J364n82
547b42q54O57L31r49K68J153j79p74M34M62o21K68J061k72j205N83J082n34n87
$$ y = [521, -1060, -1334, 560, 342, -575, 1001, 959, -1209, 201, 2069, 480, -605, 1391, 701, -679, 1194, 1648, -671, -580, 1115, -209, -1107, 545, 527, -1561, -1182, 108, -525, -885, 38, -361, -1710, -729, 862, -28, -695, 211, 419, -442, 702, 1748, -145, -520, 1472, 975, -524, 893, 1115, -624, -268, 898, 88, -488, 560, 73, -1368, -888, 249, -246, -1106, -595, -135, -904, -629, 240, -306, -1128, 218, 941, -380, -169, 1453, 301, -753, 1258, 1468, -342, 378, 1657, -423, -656, 1681, 756, -1137, 76, 498, -1250, -506, 831, -517, -1842, -206, 196, -901, -816, 103, -807, -1046, 674, 473, -975, -138, 1527, -112, -723, 1490, 1124, -567, 642, 1379, -335, 149, 1686, 383, -1265, 511, 891, -684, -415, 297, -933, -1024, 340, -242, -1096, -439, -108, -1057, -789, 364, 185, -589, -155, 307, -314, -46, 1015, 743, -462, 121, 1203, 669, 82]
566H2P15k25r50J004K54j355j45J052m40j022R60J07r35J44P80p69k36J409j28
585C02j491K80J753o04p41R05J42r42O60J248j302o21J503j3j437O52P85j197
603a18m68J173q44p65J430J02k071N54J465q17q83R91J70j182J001J157j248n06
621h59J489j30q82O91P38p55k91Q35k31o00N59L45j069k49R05l79l32K07l32p61
641a101P27R35j210n06R57L4p13M83M96m07j52P58k13j99N11M40o53l64Q70J05
661G98m40N9K4n29K71P55n86q75L87M67p00o7O78p48o80J092K60j150K80J087
681C83o88n17J075K15o16L01L76p61L16R50o00m92L31O40p11J5M70p65l22Q82
701D82K2j147J64Q07r79j91P00Q4q41M91M06n51j67R76j29p06N09M53k60K09J31
$$ y = [82, 797, 572, -378, 626, 880, -475, -620, 432, -8, -1030, -70, 37, -898, -754, 26, -743, -979, 430, 302, -1189, -909, 844, 240, -501, 404, 546, -396, 264, 1512, 210, -411, 1092, 1079, -358, 294, 1079, -118, -586, 587, -257, -1022, 408, 510, -1561, -1007, 458, -359, -1242, -251, -81, -1263, -262, 895, -353, -859, 630, 500, -382, 309, 1047, 292, 1, 836, 605, 5, 564, 909, -160, -409, 496, 117, -215, -8, -340, -1101, -374, 561, -649, -1155, -198, -164, -877, -394, 102, -305, -457, 301, 88, -111, 400, 840, 187, -177, 693, 798, 358, 417, 441, -88, 183, 938, 352, -523, -136, 331, -369, -436, 242, -506, -1186, -94, 166, -984, -704, 383, -305, -822, 253, 468, -148, 153, 529, -232, 84, 1034, 434, -58, 273, 913, 202, 217, 687, -78, -400, 482, 504, -643, -479, 328, -651, -842, -142, -58, -899, -408, -2, -553, -720, 256, 127, -579, -70, 383, 123, 332, 463]
722D63m74J2Q07j95m01K2J97j43j95J37J05m30%J65m54l14N02L47q54r9O22k8
744b08j31J35j82j21L82N00l81j31L68K63l89L70N7l14J99K85l51k77K47L14p06
765g1k97M78j98k69L30K5p62K67O06m71j71L03j0l02N66J85o25N42M57o33k71
786c21R94k4n51K56L26l85%L77n22n92M94O32p34l74M05k01k56L35l8n54L35L33
808f5m49n8P28j9n78L36K90l42J73O46m53k60O93J39l83k46L06q8k15K52k26k36
830e5N6n7K8j57M4p7j80p4M5K4p9N47l34k40M06L14M0l38K61J01k15M72o4l87
854H1J69L37m12j38K64Ol12J17L1k75j15K15j13m86K25L59l44j26L35j85j96N44
876a9L82o43j5N93o7j79K83R1m95K02M12m44J85L39k53m55K48K72l81j36K36n48
$$ y = [463, -11, 1, 808, 613, 212, 234, 431, 288, 93, 230, 335, -95, -95, 70, -384, -698, -196, 151, -703, -802, -180, -208, -339, -204, -386, -507, -125, 375, -6, -137, 231, 494, 105, 475, 532, 218, 417, 702, 351, 74, 321, 635, -71, -368, 110, -88, -357, -27, -2, -764, -497, 109, -362, -533, -230, -240, -542, 24, 209, -416, 126, 583, -50, -321, 673, 649, 98, 354, 680, 295, 295, 672, 150, -442, 52, 684, -50, -424, -19, -220, -476, -141, -179, -733, -398, -65, -514, -572, 156, 137, -441, -105, 185, -157, 16, 662, 209, -51, 642, 781, 398, 152, 458, 370, 155, 407, 181, -55, 1, -56, -28, -185, -141, -218, -398, -472, -427, -403, -482, 65, -269, -509, -103, 211, 251, -87, 174, 275, 60, 532, 468, 81, 250, 587, 175, 37, 301, 307, -5, 112, 143, -132, -247, -32, -145, -631, -406, -47, -391, -517, -182, -367, -563, -19, 363, -280, -295, 298, 231, 52, 335, 426, -69, 133, 545, 101, 286, 625, 372, -83, 165, 437, 56, -80, 156, -392]
898c92j22N02j5m91o7K93m3j29M68j68l25M41M61n12PN23P2n16L07K49l29o0K84
921D38j71l17M04J3l86q8J77k18k03L23j89l41K48K59l90q2L71J45n34K75L86
942A20j55k15M71p9l63O34L94p88K4N18j36j64L85l54m70L18L34m82m44O06m0
963A14o96J55M25k65k70M17r5l80N07N04p38j50O65j8l18M38om12L19N53o43k06
985a00O48j77o22M91K37p05N6M03k02l60K56J39n01rL06ol14K21K22m43K17M97
1007B54j29o19O06K93l99K18L62m47j89N80j18m32L35J28k08n13L14J71n04J19
1027a78K06m17l6N13j15p18N06M00o35J22O08k13m85N22M03q09K19R30n17n84
1047b78O48J16n42L86K58p66k31P37M9p44K19L91m78KM19n45k48M71J92o23J28
$$ y = [-392, -514, -12, -27, -518, -585, -292, -335, -464, 4, -164, -489, -48, 413, -99, -92, 431, 503, -13, 294, 543, 214, 154, 438, 267, -50, 354, 367, -19, -107, 70, -148, -351, -28, -217, -558, -310, -51, -441, -523, -152, -7, -541, -266, 120, -35, -250, 221, 142, -221, 413, 807, 19, 43, 561, 425, 261, 646, 292, -178, 140, 474, -8, -452, 154, 114, -582, -427, -2, -267, -537, -120, -215, -595, -88, 416, -322, -472, 193, 175, -143, 295, 289, -123, 196, 749, 106, -100, 548, 371, -251, 240, 477, -228, -172, 231, 29, -331, -75, 64, -437, -446, -140, -146, -460, -239, -17, -460, -243, 254, 125, -494, 112, 405, 6, 224, 586, 139, -50, 530, 412, -20, 315, 443, 235, -278, 36, 207, -297, -178, 28, -389, -425, 88, -27, -745, -239, 161, -474, -352, 256, 43, -442, 80, 483, -326, -107, 823, 306, -278, 370, 486, -56, 330, 588, -178, -409, 328, 377, -367, -148, 243, -235, -233, 186, -359, -607, -136, 56, -567, -439]
1068d39N94k26l08N13J85n14J23N94n87k09Q47J0o99M92J92m85j31O57l65n55
1088c11L84J11o33J58L79l46j38L03Jm11J12M32l63k68O55P5m76L04N42m05k09
1109a04N33p2n94M41N04n83o1L72j39l72K66j11l72J30L32l91k03K01K15l39j14
1130d61M32j48j69N34j25l49J39N80k62l73M28J94o05L72L43l92k64O12j50n09
1150a73K97K11l72r8L62m79j21M03J30o80N7N35m80j48L74K45m69K46M97m79q5
1171b27O53j69k99L03J70l25J04L11m09nL67k85m63J64L67k62l19K99l5k83Q3
1192b60K64m84j6M57J09l42K37K77m41J12K66k07k00M19R9j41r9L67k00J7J30
1213C64j21k67J83K51l33l30K82n9k79Q3L37l27k76K99J46m73L70L12l02k20L59
$$ y = [-439, 155, -71, -379, 134, 319, -195, -72, 522, -65, -274, 573, 583, -116, 376, 568, 83, -48, 609, 244, -311, 73, 184, -449, -291, 88, -258, -396, -93, -92, -503, -391, 41, -322, -590, 65, 140, -336, -32, 510, 105, -104, 429, 357, -237, 204, 708, 125, 64, 436, 297, -75, 191, 80, -292, -162, 170, -221, -424, -223, -8, -347, -461, -29, -177, -346, 188, 63, -286, -147, 433, 171, -202, 226, 420, -185, 187, 530, 138, -126, 486, 336, -173, 124, 335, -37, -135, 227, -252, -373, 30, 160, -520, -463, 72, -408, -556, -182, 63, -406, -160, 337, -142, -227, 426, 257, -42, 261, 431, 106, 210, 521, 112, 107, 474, 189, -274, -110, 257, -5, -324, -25, -60, -343, -260, 4, -480, -496, -39, 70, -272, -35, 242, -199, -87, 179, -28, -228, 191, 290, 149, 50, 417, 217, 234, 364, 243, -24, 159, 410, 77, -253, 29, -30, -309, -226, 111, -216, -492, -193, -47, -520, -150, 162, -140, -360, -1]
1234aL1Q4k6R0j92K1M70l32m8K4K31j57J4J05l06oK05r8m27J86J34k54j69K55
1258a66j8j88M45k59p5n6N26k57j39L44q4j71M07O1l92J07L40q7m96M74Q3m51
1280e2j07K61j24n3J60j28l19N0K70k7j16R9j46mJ39J27j21k0K71M6m76M25J14
1303B69k27L4J08J28l01K99k6j82j55M12k72k53J49o6k2j16K21j97q9J70P9k04
1325b41P6J39k19MJ59L3K3K77K7n67K59L52m0k01K51k44Q1oj71j4m8K52j38l05
1349b61J24N7q3l6J7J20j68K80j56l52P7N13j78j7K12J53l29J17J62r6k39K71
1371A88K18l72K67o1j16k61L35j05j77J6j32j03J37J35j19j24N1j8r9J48J53j70
1393b09r3O8L14j11Q5J73k13M6K61j06j87R2J08j33j46L11k87J01q3j06m1N6J67
$$ y = [-1, 30, 114, 88, 178, -14, 7, 477, 145, 97, 121, 352, 195, 209, 314, 8, 2, 207, 109, -318, -132, 2, -252, -421, -166, -184, -372, 73, -186, -261, -317, 209, -48, -187, 157, 73, -98, 309, 370, -22, 85, 425, 338, -158, 316, 399, -52, -159, 102, -22, -75, 85, -43, -362, -312, -42, -69, -185, -86, -232, -236, -97, 30, -91, -111, 160, 206, -270, 155, 269, 42, 76, 184, 312, 11, 310, 284, 102, -53, 359, 87, -166, -17, -83, -105, -221, 0, -197, -286, -116, -37, -241, -165, -26, -245, -241, -82, -49, -26, 251, 278, -289, -30, 322, 282, 81, 332, 88, 169, 163, -8, -22, -70, 182, 44, -261, -137, -80, -163, -199, -182, -62, -230, 50, -106, -458, -381, 132, -46, -63, 149, 302, -27, 90, 252, 156, -83, 188, 406, 34, 301, 240, 124, -137, 198, 93, -84, -68, -200, -303, -166, -31, -150, -274, -223, -241, -340, -192, -39, -209, -302, -234, 80, -31, 54, 227, 14, 60, 321, 215, 28, 120, 228, 95, -51, 260, -27, 74, -9, -115, -156, -100, 67]
1416F7k31l50K92K43m18J78J00k73J67L38j05q6J4J82Mp5K62k22j14L00L9j98
1438A14K7K56m60l05N48j06k26K23j12k46J52J16p6j08K3J87j38k63M59k06KJ53
1460A4M8j95J34L04o6k99J60K62k54J85P8k92j65K80mm01K34J10l98K39j20M6
1482a00k60K57Q6m17K32J49o6j63J88K28l23J43K97p9k24L58l5m00K02L42k85
1503A30j30J34K3m28L14J70m14lK73j50l65M09k5j73N7J57j26q1J79J53l28N3
1525a71L64k45O6K55J9l34K19K48l95%R5Nj21K0J35l03K0J78j31j59J50L01l95
1548a79r3K37o6k16J92J23j68J3K98l1l44L41J70k94O6K04po2O4j30j24p5N02
1571D21k36l42L24j31k29K33J38m03k0K13j80NO0P4j56O0J78j1q4J27K13l25J25
$$ y = [67, -164, -514, -222, 21, -397, -219, -119, -392, -225, 113, 8, -78, -64, 118, 122, 47, 309, 87, -27, 273, 312, 114, 141, 397, -63, -368, 180, 74, -152, 71, -41, -287, -135, -19, -95, -203, -180, 7, -131, -394, 65, -141, -139, 14, 62, -133, 1, 305, 239, -60, 100, 362, 108, 293, 371, 79, -86, 194, 190, -211, 23, 133, -265, -26, -146, -100, -360, -103, -17, -434, -202, -53, -119, -282, -94, 134, -189, -46, 251, 172, -52, 306, 271, -129, 73, 415, 130, 0, 134, 157, -271, 43, 213, -201, -204, 69, -81, -446, -37, -62, -235, -178, -21, -147, -228, -49, 104, -224, -171, 193, -52, 14, 269, 288, -46, 173, 421, 26, 26, 121, 126, 5, 25, 160, -143, -123, 55, -76, -235, -85, 216, -179, -272, -35, -101, -317, -125, -2, -170, -157, 141, 110, -234, 107, 277, -17, 49, 253, 246, 184, 248, 118, -6, -81, 421, 185, -157, 167, 36, -193, 40, 178, -225, -245, -32, -212, -207, -147, -73, -229, -169, 9, -2, -86, 41, 254, -71, 54]
1594E4L91m21J94M0q2j00M8J08l44K18p1J45l32J2K56l21n2L20l19j5L65k40k66
1617d12K48K58k67N0J35Q6k74K57L73m27j10L98k5m14K94J38k17mJ29j30m2OJ14
1640A64l62M2K28j60j97J80O9l78K43pN5j10L07j1k86J43L49k95p6K87q5k42L79
1663B37l4k21L2L13l04M9j62J43n5l6Q5k94R9O0j15N2j12L04j60j4qJ71r0kK93
1688B31j94JJ18J64j76J93n7l38P5K12o5m9j09R1j57k9J50l09L65j03l8j50J83
1711Iq2l7j5Q0p0M8J32P0n1mR1P3j42N4L1j04K21q8r7N7M8j65j54l8J35O5l24
1738b57K36r3j7J39k28O9j87L13p3j8j7J85qj31K24m9k0oJ87k14J9K15l7j97N0
1763H5J26k54K15n7l15J45p7J25k2q4P1j6r5J24j51j28M18k5k11J26J58j6j21
$$ y = [54, 445, 24, 218, 258, 176, 76, 124, 232, -112, 106, 35, 180, -152, -140, 116, -205, -257, 63, -256, -271, 94, -146, -412, -164, 94, -173, -123, 12, 98, -176, 81, 454, 27, -83, 315, 290, -124, 170, 308, 91, 87, 216, 86, 44, 50, 164, -198, -156, 72, -88, -285, -105, -36, -414, -171, -178, -123, -233, 74, 63, -223, -80, 269, -26, -102, 185, 100, -142, 237, 203, -18, 14, 327, 23, 72, -90, 53, -2, -38, 47, -247, -148, -88, -203, -151, -263, 41, -119, -133, -141, 30, -60, -62, 231, 37, 38, 156, 320, 144, 337, 280, -58, 17, 229, 164, 115, 6, 97, -60, -89, 61, -248, 117, 14, -24, -174, 9, -73, -110, -125, -45, -115, -67, 65, 135, 84, 80, 171, 244, 102, 156, 187, 83, 304, 216, 119, 176, 224, 59, -95, -133, 2, 67, -257, -21, -114, -131, 8, -220, -151, -338, -25, -98, -116, -133, 52, 44, -87, 137, 88, 68, 62, 249, 35, 54, 269, 232, 35, 85, 211, -43, 172, 115, -200, -55, -132, -7, -29, -113, -42, -58, -153, -29, -180, -308, 110, 85, -126, 0, 158, 142, 21]
1786B1J15k25O5L16M3m18R2J79j05o5K76j79Q7k48J26k02l0J34J9j15J6n0ol3
1810a87n7n7K66n1J22k0n2L03j66L6j6K16l48Q6J20j90q3L54r4j93j9J42q7k31
1834b06J47o4j21J82R5p0p7J76k92J23K87l49j6J07J22P3q3J03J0M0q7n3l3O4
1858G8O8N0k04N4L4q8l3K7P0k07R0J43k01j5l9J25k34J25J4K7K16k15J93j22Q
1883c6P2K1Q3n5L3q4J70Rj08j29J58m2o6J59k27r8j08L6J30lR1p4j17K18M6k28
1909a49K6J05J04n8jR2k03J59Jp3J42J26kj27j09J92k48J16J67l57j63R6J97k20
1933a87J36j9j1l9l8L6r2J01j9j64J69K93jk05J16r7J30l8p4J16j2J03J5k32J04
1958I1j75J05j8j67J09Q7l4j27M6o2RJ50j31l8J42j39j83L35R8k00Q0R0j03K82
$$ y = [21, 136, -89, -24, 292, 335, -83, 9, 188, 83, 18, 294, 115, 202, -46, 80, -122, -152, -18, 1, -114, -98, -148, -154, -187, -244, -301, -35, -86, 36, 16, -36, 267, 101, 137, 121, 337, -11, 75, 195, 5, -78, 276, 182, -11, -30, 112, 25, -206, -59, -123, -244, -62, 33, -37, -114, 62, -230, -107, 180, -169, -185, -78, 44, 117, 34, 137, 147, 187, 100, 47, 14, 78, 146, 196, -8, 46, 80, -8, -41, -14, 56, -151, -61, 82, -119, -134, -173, -48, -282, -157, -143, -116, 100, -115, 78, -44, -36, 36, 57, 140, 85, 118, 34, 204, 213, 105, -24, 134, 92, 26, 185, -42, -140, -248, -212, -82, -85, 6, -68, -185, 33, 79, -149, -123, -18, 86, 28, 27, 119, -84, 75, 76, 3, 145, 271, 269, 142, 33, 225, -23, 93, 260, -97, -260, -164, 33, -187, -51, -70, -81, -120, -158, -122, -214, -113, -132, -296, -127, 166, 165, -40, 76, -21, 109, 71, -3, 113, 101, 204, 219, -13, 91, -84, 21, 3, -164, -55, 32, -2, -129, -83, -145, -136, 14, -117, -155, -13, -152, -335, 0, 98, -102, -22, 68, -35, 247]
1982B47n9j9j90J83k3j67K22m7l3l54L10o3Qp3J29j34j58K59j65k07K21O1j4o6
2006a32r2L35j52j8LK03k41L10j13j15K40K7k62R2R1j57m3J39o4r7kK18m28O6
2030a92L04l16J84j67J23k1Q6j09N5J65kk0rk4N7p0N4J05n2k27O2J71o4p0J98
2055B21k60p5J67j61Ml3J57n8j60O9N0k7kK9O7q6O2K2Kj02K16j0Q1k1Kj62K01
2082A93P8l07M7J40J15l47J60N1k61K2J69j4k88J34N2Q4l10L10j57j9K9J47j50
2105a22R2O0j7j30Q7L06l00K8J63j31O0l2m7o9J57j29J4j55K57q7j16J13j57q9
2129b44K1J79r3o3K06L5r1J0J69k13K41lj28ko8K38j64JK16j04j48J47J19l28
2153f7J22J36r9j46P7L1j81K12j54O5p3J15j23k2m2R7L8M6N2n2j21K53K9k57L25
$$ y = [247, 188, 169, -21, 162, 139, -28, 194, 147, 114, -240, 70, 7, 15, -58, 71, -63, -221, 38, -127, -334, -113, -52, -66, -132, -224, 111, -41, -59, -56, 147, -94, 216, 103, -12, 228, 255, -7, 85, 176, 19, -24, 115, 51, -46, -48, 170, -258, -192, 112, -204, -20, -187, -64, -85, 1, -108, -53, 112, 110, 90, 81, 57, 114, 44, 98, 203, 151, -76, -14, 157, 93, 23, 221, -39, -114, 53, -108, -104, -137, 20, -38, -198, -129, -79, -106, -108, -79, -12, -98, -36, -14, -12, -114, 102, 92, 173, 152, 154, -8, 193, 271, -36, 11, 151, 266, -81, 79, 130, -131, -109, 60, 46, -242, -108, -56, 28, -282, 28, -129, -148, -119, 28, -122, -30, 30, 13, -117, -30, 276, -24, 4, 167, 36, 96, 64, 17, -52, 105, -24, -10, -165, 92, 5, -111, 2, -155, -244, -223, -44, -137, -200, 6, 41, -50, -40, 129, -84, 157, 154, 26, 24, -44, 194, 30, 31, 247, 143, -5, 142, 261, -67, 55, 191, 92, -54, 23, 54, -127, 85, -69, -4, -77, 38, -85, -107, -149, -52, -14, 32, 84, 32, -89, 164, 193, -64, 261]
2178B61j69m1j1oJ08j67L9J81k68j4J81k6l41J50R7L8q3n3Q4j14J70qL0j44R9
2203goo4L0J34j71J58j9J65j61Q3l3r3p5j9L03l08J94j97n2n8K14k28J32Q0k0
2228a8Rj6J85j24Q5q7j3m1m2J31p6M3K6m9n0j2J14k5k2J45p9j75J79p7N2j59K00
2255A04n6Qo8j99L2mP3lJ26k9j21Q4J30m9k4l4K61j57n9K74j88N0q8l2J8Q1m3
2282H7M8k51K70o6l0oo4k0j11j08J01J48KO7q3j96P1K43L8k4q3JM3j7J00j18J00
2309A42ok2j27J03K1j5m3k8k12K47j07j69J50J57j97j67J86Q9j18l4K97m3j56
2332e2M4P3o1L1O6J43j43J49k03j31J70m7j0j14J64o1r2O9L4k05p7J69O2n0J39
2357F7j38N1j3R0J2r8R9Pk47J63Q4q0K2L9L4N9j27p9J07j43J46J40k18j13K84
$$ y = [261, 92, 51, 40, 34, 142, -25, 14, 195, -73, -87, 94, 68, -273, -123, -26, 12, -71, -124, -40, -154, 16, 8, 38, -106, -7, -13, -77, -47, 87, -84, 74, 55, 220, 59, 142, 109, 16, -59, -78, 225, -83, 111, -86, -138, -196, 18, -210, -78, 2, -18, -9, -25, 160, 36, 121, 34, 21, -20, -62, 69, -7, 36, 62, 13, -37, -49, 65, 40, 18, 163, 84, -91, 88, 11, 63, -96, 104, 48, 56, -12, -211, -179, -183, -110, -113, 13, -16, -137, -53, 77, 28, 4, -30, 231, 74, 15, 289, 101, 151, 63, 31, 49, 130, 87, 135, -116, 154, 88, 58, 52, -12, -32, -143, -251, -150, -2, 0, 67, -16, -212, -141, 102, 140, 116, 33, 34, 77, 60, 160, 42, 142, 136, 114, -13, 90, 111, 96, 53, 25, -187, 60, -47, -216, -66, 91, -106, -273, -87, 2, -116, -150, 147, 104, -52, -8, 65, 4, 35, 101, 244, 101, 250, 47, -84, 86, 39, 29, -85, 79, 18, -74, -5, 29, -176, -253, -84, -22, -72, 67, -71, -20, -33, 57, 69, -29, 70, 77, -170, -7, 77, -3, 19, 58, 92, 151, 24, -55, 52, -91, 55, 195, -23, -136, 148]
2382A48j52rj7n7L5p2N0n3jR3J67j83K01j09q3nJ06O2p7J32j03k0n9J92l7m1O7
2409A75Q0j02j10m8J5p3J46j23L6j88k2R5Q3N0p2r3K8M8QK7P3J04j02rj3J72n6
2436A29Qk90K19o3KK5KN0kj25Q9j7j82O2J44j85KN4j1O4J4K7r3QQJ94q0m4jl4
2466b6P6J50k20K35l5j00o4mQ3j96J16N8k25J33J78j03r9O4r0J24j20K5j16J7
2490a39J38o7M2L6K1j42K29j81J81k05K16o8L8P0k22J05j23n6k5J11n6J9O5lj13
2515a29K3K3J10o1J25j24j22J95k10J86j0o3m9P1J17o3j02J35P7o0N9K1k7p6K9
2540G5k19J89p7L1j03J67j87O5L9P0j07J36j39K08k36J63j66Q8J4J7Pj2N2M6j6
2565A05k09K07k1O0J4m7q3j00j7K06k08KL6Q4k03J08J04mj26J01n8n4N2m8J97
$$ y = [148, -4, -13, -30, -87, -52, -124, -74, -127, -128, -35, 132, -51, 150, 41, -42, -47, 59, 121, 44, 176, 73, 53, -6, 186, 149, 108, 175, 255, 153, 43, -5, 10, -63, 83, -40, -4, -192, -214, -119, -36, 14, -58, -151, -123, -75, -67, -40, 33, 137, 35, 26, 13, 185, 129, 137, -153, 66, 3, 5, 30, 32, 82, 80, -45, 44, 27, -155, -93, 51, -134, -132, -78, -89, -25, -11, 16, -77, -69, -61, 133, 53, 9, 8, -26, 50, 200, -20, 215, 180, 80, 16, 12, 95, -101, 15, 73, -152, -19, 159, 56, -43, 21, -69, 55, -65, -40, -156, -139, -1, -68, -26, 10, 31, -111, 118, -63, 118, -87, 129, 61, 99, 169, -53, 52, -71, -127, -152, -41, -97, -78, -13, -16, -129, -106, -83, 27, -34, 91, -33, -155, 40, -170, 16, 6, -57, -106, -35, 82, 19, -83, 52, 129, 69, 128, 149, 122, 46, 75, -144, 45, -32, -1, -104, 63, -124, -59, -20, 50, -57, 79, -60, 148, -88, 75, -91, -3, 11, 28, 35, 23, 75, 121, 105, -104, 103, 82, 142, 156, 109, 26, -74, -91, 115, -93, -91, -55, 29, -174, -66, 38, 34, -92, 9, -49, -103, -51, -99, 98]
2590I8j06R3K1q2N8K1r2Rk6n6J86j60J07j49K15l47K84k32J23k8P1K1q7O0j68
2615a66J97L6l4r4J67j71J54j29j37K22O3j14j7l0J88j31J9j1J16n7J36l56K2
2638a27J24n0q5K08j38L5n3N3M4j81J07n6Q5J14j36L9j37J77Q5m3j6J21n1m9j71
2663a01L21k07K28j64J07l14J62l6j44J78n3j09l7J06j8n7J30rq2P2j35Q9M2m1
2687g2R3O6j54JN1k2J24J70k43J4P6M0L5k45K0j86L18j73L1J14Rn4m6K1m3Oj69
2714b18J34p9K02l5P0j5j44O0J95j17m1J99k17K0K15k62qj4M2R0Mj99J91j6j0
2739D7n0j08m8J82r9j7N3j29K17j55J50k4J10r4j19P0p1R0P9j34pQ5j34K39j14
2764A9LM3J7m2k0J10k24J15j97JJ57K4J6J88k68o2J6%QJ38jk5J9l1j2j21K55j12
$$ y = [98, -8, 85, 106, 24, 82, 103, 11, 20, -6, -62, 124, -36, 71, -78, 137, -210, 74, -158, -35, -63, 8, 29, -58, 2, -166, 31, 67, 33, -61, 106, -65, 89, -40, -177, 45, 108, -6, -23, -53, 135, 4, 23, 12, 128, 71, 207, -149, -127, -3, -53, -138, 70, -68, -33, -86, -33, 11, -170, -63, -119, -34, 80, -56, -17, -154, 23, 108, 65, 49, 170, 119, 70, -101, 220, 13, 241, 77, 184, -130, 32, -4, -148, 30, -23, -132, -169, -63, -81, -138, -8, -17, -99, -27, -162, -73, -31, -72, 21, 87, -67, -66, -15, -37, 87, 257, 14, 28, 104, 144, 179, -66, -46, -232, 86, -87, -56, 58, 67, 13, -33, -12, -55, -49, -218, -84, -163, 39, 4, 74, 59, -85, -25, 170, 53, 12, 211, -6, 14, 229, -33, -41, -55, -13, 77, 81, -118, 73, 57, 47, -3, -111, -159, 23, -76, -93, -40, -169, 48, -107, 43, 19, 129, 35, -84, -14, -85, 5, 84, -50, -57, 28, -106, 133, 19, 22, 65, 82, 40, 20, 130, -94, 21, -176, -175, -18, 6, 22, 210, -58, -120, -104, -104, -96, 42, 41, 16, 35, 4, -8, -129, 126, 14]
2792A4J14m9o1j5k4K01k13P9J45k76K2j4J37J01k23J32k2Q2k76J50l8o7M5J1M4
2817aM3J48j10j0mj3J2N4r2M4n3j27n1K62q3j2l8J15j38k4L9l1j8N6j2l6P5K0
2845A5m0r3Q9J08j47J32n6J2k2p0J61nl7N9k03J87J52l33P7J04n9m5j76R2K11
2870A13k33J11l1Qn2L0M4j33J05K4K2j50J30Q9Q5j32K9K8jl2M2k9o2J86j34r5
2896c8J57j27j05o2O7k7k3K29k69J57m5R8m4k8J46k07j35K47O8k44K11J22m3M2
2920A47p4k4m3O3o5J07r7P9Pj56k2L8oJ46j67R7o5m4n3J39Qj23L3q3L60l02o5
2947a65J12J92j90J4K64j27k72K08o9J08j36J71j23R2j24J0K2m2J32r8j8L3k1
2970b7Pj26K4P7j45K56J16k18m1P9l1q1K71r5N6r6P9j93K35J0l1%k21L7K14k45
$$ y = [14, 128, 79, 18, 3, -21, 180, -33, 46, 191, -85, -63, -77, 60, 161, -62, 70, 48, 130, -146, 4, -34, -101, -56, -45, -1, 42, 190, 80, 70, 66, 53, 65, 119, 27, 71, 18, -109, -160, 102, 19, 7, -31, 84, -54, -78, -39, -70, -88, -32, -44, -80, -5, 15, -25, -118, -29, 79, -68, 64, 8, 20, -2, -72, 89, 84, 47, 106, -97, 90, 242, -91, -14, 90, 31, -14, -190, -98, 113, -120, -9, -40, -32, -84, -54, -10, -143, -38, -14, 8, -142, -12, 77, 162, 30, 59, 87, 86, 54, 96, 67, 5, 191, 57, -38, 119, -8, -113, -175, -108, -135, -158, 71, -198, -41, -86, 12, -32, -60, 86, -121, -256, -9, 59, -185, 26, 148, 105, 147, 73, 49, 6, 69, 4, 111, 14, 93, 100, -56, -78, -40, -46, 100, -67, 30, -35, -79, -132, 7, 15, -108, -75, -158, 202, -100, -165, -53, 139, -51, -37, 227, 100, -172, 36, -33, 75, -61, 110, -13, 79, -45, -35, -13, -55, 77, -21, -39, -6, -27, -20, -146, -122, -45, -190, 66, 182, -36, -77, 2, -29, -110, 161, 66, 122, 26, 105, -88, 147, 157, 126, 126, -95, -58, 156, -89]
2996h9J07p9n3J15k25K40r6N8j59o2J96N5n0q1J81rj04J30J41k78P0M4J5o3L2
3021C6M0K9pl5k49J88J32l9q0lj85J68k6l3P7%k7M0n5l4L6J01r6n3M6n5K67r8
3049H5Pj25K0N9L1j50K49O2k80J41j09k7J01mj07J06k61J49j2k0J24m6n0p3M9
3074h1O7o9K35j00j33K75j84Q3j33J42j17J9R9J02j24Jk06J26j30K24j54J9m3
3097h2l9K2L9P9O9j34j18K11r5K25j43Q7p7k0j55K36M3q8r2pJP6m3p0K1N6N2p1
3125a7L4ln7Rp7PJ49k37L87k41j6R4Jk57K37J56j47K47k67L1J6o4N6K9J49k82
3151f3J8M3j0k7k8J42p5r5J04j41Q6J61r3l6Nk8O3L9j40J79j79K6P6L4QJ08j94
3178a7K0O7m6R4J52k06L2l2r0N3M1l18J56J74k2J4j01J49k14J31k0rj30N0R6q6
$$ y = [-89, 18, -61, -114, 1, -224, 16, -80, -22, -181, -243, -47, 8, -42, -123, 58, 49, -55, 75, 216, -62, 8, 52, 67, 4, 36, 76, 105, 98, 63, -186, 2, 134, 95, 15, 12, -173, -5, -31, -64, 13, 13, -14, 26, -29, -63, -27, 74, -22, -75, -29, -84, 183, 85, 92, -33, -13, 46, 77, -73, 176, 238, -42, 99, -10, -37, 64, 60, -47, 59, -202, -53, -65, -85, 39, -7, -57, -130, -81, -14, -83, 152, 52, -81, 194, 10, 93, -40, 102, -15, 4, 103, 205, 81, 82, -124, 2, -128, 96, -58, -39, -82, -121, -99, -60, 19, 88, -46, -164, 47, -48, 177, 34, 121, 44, 24, -131, 105, 148, 60, -32, -39, -38, 38, -5, -75, -54, 2, 54, -17, 17, 14, -43, -34, -111, -104, 45, -192, 195, -46, -62, 32, 33, -224, 13, 169, 22, 269, 2, 33, 49, -15, 41, 70, 219, -63, -45, -2, -12, -39, -67, 75, 0, -95, 9, -132, -46, 115, 22, -14, -9, -37, 26, 65, -75, 104, -75, -49, 27, 61, 69, 177, -17, 3, 70, 24, 118, 270, 64, 96, 64, -26, 27, 68, -250, -94, 80, 58, 72, -29, 120, -94, 37, 17, 8, -122, -72, 24, -62]
3204f2M9J57j42J03p8J20p5P3j17L5m5R2k23J41n9L9J19j99J57j03N8j37K1o7
3228a43K44j20r1n9K2K06M5Rp4kJ3m2N8j00L8R7n2M7j26J66k83K51M2nj13m3J10
3255I5j34R8L1j72j39K91j79J03J6J05j96L5Q9M1o6O5q1J3n1q7K00J05o9k3p7
3280A3j65M9J37N0n8j23M8pR5j39J32m1k4n1L2j8J73k01L4J0N7n2O3j34J18J42
3306A40L6k82J12K2jn7p7J27J46k48Q6n8Q3m1n0J56n3j5q5r7K12k9j54NJ20j45
3332a47l1J25K14j02k27K43L4j90J13R7j47K22j78p5O2nj38n4L30p6j13L6K66
3355B59n14K35l6J25p6o9PP7J7j7L9m4J01j29J23l6j67P4L6O1o4P6j38J01J4q
3381D7m0j86K37j81J91j71J29kk9r7J16k5j56l7K66j61J19J34j33k2K4o0J16N5
$$ y = [-62, -13, 144, 2, 105, 27, 147, 72, 145, 28, 63, 18, 110, -113, 28, -31, 8, 127, -72, 85, -18, 40, -97, -76, -143, 101, -19, -110, -169, -147, 59, 104, 113, 39, 37, 50, 8, 66, -34, 4, 101, 49, 96, -30, 136, -147, 104, 146, 141, 28, -15, 95, -39, 59, 90, -82, -221, 70, -109, -6, 10, 115, -81, -46, 43, 84, 18, 83, 2, 15, -36, -123, 77, 182, 113, 90, 13, -152, -103, 34, 84, 26, -97, -49, -56, 39, -100, 32, -9, -33, -84, -52, -70, 103, -98, -64, -54, 3, -49, 14, -120, -2, 140, 176, -106, 6, 28, 27, -30, -107, 20, 166, -82, 4, -54, 29, -12, -62, 94, 41, 26, -59, -156, 56, 27, -127, -122, -2, -147, -178, -53, 161, 59, -168, 75, 109, -81, 32, 129, -18, 204, 26, -49, 13, 8, -130, -184, 146, 70, -43, -7, 259, -255, -20, -56, 69, -7, -76, -69, 8, 25, 8, 47, 3, 104, -25, 98, 62, -105, -31, 5, 66, 2, 78, -60, 41, 55, 47, 7, -179, 58, -123, 68, -103, 26, 24, -5, -102, 14, -11, -167, -204, 62, -99, 20, 154, 21, -1, 23, -37, 79, 134]
3405A34j25P1j75N6K22k18j23J37P3j44j3J53j58J7J88J6r9r2k0K3K3K1N8J5o0
3430b0j8j9M1p4P6jl3P5j5Q7n2K1p0p7J81k15K25l7k5j48Q8R2L9j19n5j10Q8o0
3458a35M8Q1J39k32K0Q3j36J48J41M9k16R0O5j87P0J24j43k08J93m7k1R3mK0o3
3483b8m9K28k54O2r7J49n8N7l5J11n6l6N0q0l1J57k05J86q8q8R9J12j25j1K24
3508A94k18J13j33J08mQ0Qr6%L8jj34r0L09j30k4J09k42K03r6K3J45j01n4K0J70
3534A97r6q3J79j84j25K94l38J68m3J34j21j35Q2l1J28rl6j17K92j47J00q2Q7
3557A14j89K4Q5l1p9mN9P0n8K5p6J00k16J78r6L0N0J66j95j0J47p6J37k42J47
3582F0j24n7K11P4j66o8j8J87r4n8m6J16J57j62J29J5j65J12j46P9l9Pk0J27j43
$$ y = [134, 9, 80, -95, -39, 183, -35, -158, -21, 52, -92, -105, 48, -110, -93, 95, 111, 12, -80, -100, -77, -54, -33, 25, 40, -20, -38, -57, -16, -90, -14, -15, -48, 27, 12, 99, 47, 68, -2, -79, 102, -113, 112, 75, 50, -98, -10, 82, 121, 2, -53, -163, -75, -135, -87, -6, 133, -99, -79, 4, -132, 16, 157, 206, -10, 80, 145, -42, 28, 152, 9, -199, -6, -53, -74, 19, 15, 35, -28, -77, 151, -103, -41, -138, 11, -47, 10, -25, 86, 30, -6, 44, -36, -67, 90, -115, 71, -17, -105, -6, 106, -19, -30, 194, -24, 89, -44, 64, 60, 140, 148, 52, 52, 90, 89, -45, -135, 174, 44, 20, 129, -113, 90, -6, 17, 162, 61, 7, 27, 197, 101, 18, 197, 13, -112, 182, -156, 12, -31, 103, -18, -153, -71, -102, 26, 17, -19, -136, 156, 9, 109, 27, 114, -75, -51, 34, 3, -76, -80, -21, 49, -9, 16, -60, 40, -176, 2, -94, -64, -14, 152, -43, -53, 94, 18, 155, -87, 60, -64, -121, 90, 164, -2, -70, -88, 99, 5, -53, -99, 17, 174, 12, 141, 156, -9, 103, -43, 36, -3, 4, -16, 111, -32]
3607c2j8J43n1k46J14J56l1J34j92J08j56J67j28J3P6j39R6p3M3R4j39K18k50
3630i3%J19N3Rq4R3j05Q1j36P0j72J46J3j12P5o5J15l0M4m6j64J53j03J80l0n7
3656d6J87k56K59j69J58j62R4L0j97L4R3Q5j87M1R8p5J1J03o3r3qOJ09q7P0l0
3682EM7l0M4r3Q1R0j45R9k28J79m4J00qo8L5K8k17l4J68k3K0j23P4Q2l4Q3l70
3709b82K03J37q2O1k07J08J31k2mp6J67r0k4j8k1L2lk4N3k18L07l9l0P5j14L1
3735E1J9O0j72j20K18J06k46nn2R2K3J08j85J27P7j24J7J54j89R6J14k39j01K87
3759A16r5O9r3J82q5nj25J08p8j1rp3J99k04Q1M9j51R5J10j50Q0J6J2O9J1j59
3785d1J40j04Q1k8j05O5J24k40J87j71L4J37j15J27nj00j18L05k52M5j9K37k91
$$ y = [-32, -50, 93, 42, -204, -90, 66, 35, 169, -23, 85, -71, 96, -32, -19, 57, -82, 14, -59, -16, 78, -61, 157, -93, -93, 26, 79, 88, 4, 97, -8, 73, -63, 7, -165, -19, -6, -118, -43, -108, 7, -23, 21, -25, -189, -36, -139, 41, 11, -46, 141, -115, 144, -25, 133, -29, 65, 95, -102, -68, 25, 110, -77, -36, 62, -13, -2, 101, 38, -55, -63, -57, 52, -35, 35, 5, 52, 22, 66, -27, 54, 144, -1, 98, -130, 49, 5, 105, 97, 29, 64, 92, -125, -159, 9, -14, 6, -117, -43, 39, 5, 88, -282, -79, 58, -24, 37, -170, -62, 69, 47, 43, -33, 134, 44, 20, 2, -19, 13, 10, -14, 39, -179, 128, 89, 59, 134, 20, 51, 70, 130, -42, -162, 56, 162, -84, -89, -141, -49, -26, 82, -103, 24, 101, -23, -6, 148, -41, 55, 169, -70, -171, 116, 21, 90, -3, 179, 94, 89, -36, 72, -6, -17, -26, -99, 100, -104, -23, 26, -125, -30, 80, -70, 10, 26, 38, 107, 118, -41, 99, -5, 76, 48, -57, 8, 132, -108, 79, -92, -58, 79, -36, 91, 86, -14, -132, 173, -79, -34, -53, 184, -107]
3808a07j5M6J01J7l4o2P2J51k56K1J86j76k6Rq8J88q0J85j47J04k0K5j71J02Q
3833C3p2O3r5j5o8J25j00J1O9qo5O8r2J87L3p3k7m6P8O9P6j34k2j05J88Pj4k0
3861E1j04P7J6J1L6kqM1j59M4N1j56M2Q6K3q6K80l19J00J06j40q3M5J37j08J8
3887al6lM7m4J63j24OJ74j84m9%J19N7k49J58m2o3J51j08P9p7Rn0J08m0r3P8J85
3915A71j14j93Q6R3p7M0q4N3J23j23O7p6PNN1rr6NK64k44m5J32j99J75j16J4J36
3942D6r9N1q1O9%M9j06O5j6J8M8j37K30j24O9n4L0K24l67R5j03M9r0J07o7QQ8
3969BrM9j02l8O1nn0J66j23L6Jq4J19p0N1kJ48j41j21O8J17o4R9q5q6J20L1j2
3997G6j73J56J24k41J00k0l7nM1o1K02q4j24J68k06RJ06M1p3m8R5K06j81P5j73
$$ y = [-107, -122, -76, 25, 42, 8, -54, 18, 169, -87, -66, 120, -56, -82, -73, -161, 27, -53, 132, -15, 89, 69, 94, -77, 25, 33, -39, 24, -71, -86, -154, -29, -129, -118, -49, -57, -122, -54, -146, 41, 74, 1, -26, -72, 6, 75, 151, 17, -5, -110, 78, 85, 71, 51, -53, 24, 40, 51, 87, 85, 77, 118, -41, 3, 54, -102, -60, 26, 49, -37, 243, -76, 24, 130, -10, -93, -48, 89, -19, -1, -37, -40, 7, -37, 126, 2, 8, 182, -2, -51, -51, 68, 125, -124, 34, -8, -71, 80, -28, 51, -26, -17, -67, 41, 1, -92, -14, 171, 57, -136, -50, 43, -34, 6, -78, -25, 98, -25, 42, -34, -27, -22, 29, 20, -76, -71, 193, -51, -96, 36, -163, 12, -104, -90, 46, -53, -2, -83, -14, -14, 35, -71, -6, -22, -4, 44, -93, 137, 13, 82, 28, 58, 282, -85, 10, -93, -44, -134, -27, -94, -86, 2, -7, 42, -60, -98, -37, -42, -92, 74, -49, -13, -12, -96, 23, -47, 4, 2, 150, 9, -112, -44, 73, 9, 108, 23, -63, 57, 88, 76, -97, 59, 183, -58, 42, 22, -15, -20, 21, -40, 162, 78, -46, 122, -84, -75, 31, 72, -1, -49, 46, 252, 71, 146, -27]
4022b7J12J1j93Q2o6N9o4N8J35j42o7J63j09JM2mR6j33j7k18K00R3K2P3j12J4
4048IM0m2m5oj04Q4J9J01L3M2q6L3j37k5J27m7l3J61k02O8LJ3o1J73j94J65j82
4075i3l9J09q6J57Ro7O2j3K0j03l2O8j1j3J44q2J8j02L1N9LR8J13j93m5K3j38
4102a03J31n2R0p0l8N0rK8ln8J64k30K14q0j87L22j50n2p3l7R0M4j8N7K7Q7j18
4129B6K5n7p7N7n7K76j29Lj09J31k57L08r9p1OL2M3q8P9l2J45j55k7m9K1L0P4
4156D9j02K50j72k4N5q2L4K67k90R3k55J07J67j50n4J55M0L2N3j51K07o0k76J00
4180gK4r0K3r5J80j15P1q4J66o5j31M7J20o0kRJ00q3Mp4K1P3r9J15n3P8j72J62
4208F3j73K71j50nj2j1J5K09j17j17Q2l4M0n6J11j21R2mj14J44j05j0r6J94j24
$$ y = [-27, 85, 96, -97, -15, -81, -22, -86, -28, 107, -35, -102, 61, -48, -47, -5, -9, 87, -46, -63, -281, -81, 12, 34, 107, -5, 9, 49, 7, -38, -44, -148, -64, -45, 56, 89, 131, 45, 78, -59, -84, 43, -4, -37, 124, -78, -10, -7, 6, -55, 118, -76, 89, -93, -132, -23, -109, 48, 57, -10, 52, 39, 59, -44, -76, -8, -19, -32, 112, 30, 48, -54, -23, 36, 39, 137, 250, 57, 12, 35, -103, 28, -24, 66, -4, -42, 8, -1, 27, 24, -34, 130, -100, 114, 34, -153, 169, 19, -33, -106, -143, -53, -9, -27, 30, 57, 144, 26, 51, -6, -83, -26, -83, 193, 64, 67, -42, 89, -168, 140, 41, -30, -24, 8, 51, -37, 42, 10, 155, 0, -27, -76, -55, -25, 49, -53, 197, 25, 1, 56, -26, 8, 275, -15, 78, -177, -70, 97, -53, -107, 48, 88, 120, 173, 22, 229, 169, -107, -7, 17, -73, -50, -145, 35, -80, -9, -93, 73, 8, -123, -76, 44, -16, -18, -9, 91, 8, 12, -62, -41, 32, -67, 48, -5, 73, -99, 63, -110, 161, 11, 6, -6, -17, -2, 207, 90, -27, 55, 21, 61, 5, 116, -5, 87, 83, -31, 113, 8, -2, -98, 96, -28]
4233b8L3p3O3o8m7K87k99J44k5N8m9p5J61l9R5j39O3K0m1j5q3M4k6R8j00p0J02
4260il5L8O6N2j77J31n6J5jj52J79j11l9Q5M5M7j00J58r7o6l2J45m9J2l8l2K9
4287HJ5j50J28N2o0o9N7J63j43l7J4l6nR1m0J6n2m5R8%M3O7J5k27J88q2m4Q4K2
4316G1J08k14jJ35l9j38P6J5q0n8K84j42j42J11r3J49n8J93j68J12K6j82P1l0
4340FN7j0r4P1k4J31j27JJ24k08K26j4j28n0m4J08L8J5l6m2k0n%Q4j81J01j16
4367a37J52K7j43J69r9J89k76K05k1K3j17J4j43K53L8j10Q8o4m3r4lK6M0QL9r1
4393g0j76M2J71o2M5O3r1Q8N4p6M6n2P4m9k3J00J9j86J0K10j05j08J04q1J70j38
4419b1OQ1j90K1R1O9j10%j9K75k37o1J03R1J22l57J70M0j07N0M2j41P1Q3j21J72
$$ y = [-28, 5, -68, -5, -73, -120, 167, -132, 12, -13, 45, -4, -79, 82, 43, 138, -1, 62, 82, 41, 26, -57, -13, -39, 59, -41, -111, -9, -44, -6, 60, 112, -65, 66, 10, 25, 24, -128, 51, -60, -99, -14, 31, 78, -22, 136, 39, -27, -59, 86, 37, 49, 11, -21, 8, 23, -127, 1, 53, -7, -76, -19, 144, 1, -36, -22, -58, -63, 28, -12, 4, -48, -93, 5, 5, 48, 115, 130, -97, 91, 9, -35, 49, 71, 179, -35, -36, 99, 60, -78, -2, 13, -67, -125, 159, 17, -125, -14, -107, 42, -16, 177, 9, 121, 147, -35, 36, 6, 63, 53, -41, 30, 6, 137, 10, 11, 135, -73, 153, 139, 11, -39, -83, 25, 63, 78, 42, 0, -20, -25, -25, 59, -122, -21, -137, 15, 42, -101, 68, -31, 158, -118, 87, 66, 89, -28, -14, -157, 96, 134, 24, 112, 48, 5, -89, -92, -66, -26, -18, 21, -70, -246, -204, -33, -95, -50, 13, -78, 10, 64, -12, 34, -18, 56, 7, -16, 84, 103, -83, -73, 137, 32, -76, 28, -53, 117, -21, -15, 66, -124, -103, -12, 57, -53, -53, -72, 203, -34, -95, 8, 99, 221, -136, 34, 74, -33, 17, 59, -82, -11, 72, -49, 123]
4445A23j38R6O1j49O8j26j31K27r9N9j09Q1m9J21j09M3k1J79j70L3J8q7N3jJ11
4470H4k01J61j2p1l2l3J23J01j7M6j67QJ74M0k09j11J90j70K01j43J5o3L08k23
4494aj7k8j07J99q0J46m1P7k16M7n3J95r4k6Q4j72J31N8o3j52K44k61J50j35R4
4519b1j0R2j34J15j83q4M06k24J72j69oN4K1Pj88J34J17K7O8j10j72J53k9q2j
4544d7k8J96k07K69k00M3Jj27J8P9L0l8J29j6q2mOj8J70j13j22N5Q7N5j8q4j8
4571A6q9J74k21J73K18j57j55j11J38q3L1J10P1j17L9j16p0J80K9P9p7m3q2N1
4595a2r7J69l7LJ6j42K34o5r1Q2P1j28P7k5p5P0Rk03K25m9k3k1m6p9J71k15J73
4622hm8J36j76Ll2j15K12j17K55r1L1j23J30jj02K5K95k39j54J62j4l1P0PQq5
$$ y = [123, -15, 81, 142, -7, 61, -65, -196, 31, -68, -9, -118, -37, -86, 35, -74, -31, -52, 127, -43, -10, 8, -79, -26, -27, 84, -117, 44, 32, -39, -71, -104, 19, 120, 103, 149, -18, -10, 164, 204, -5, -116, 74, -96, 105, -38, -23, -86, 222, -1, -18, -46, -153, 46, -34, 112, 71, 148, -68, -21, -74, 121, 27, 1, 85, -87, 44, 102, 39, -113, 131, -130, 20, -115, -21, -31, 61, -73, 42, -141, -225, 181, -43, 129, -40, -46, 8, 29, 36, -152, -18, 99, 126, 194, 84, -88, 65, 36, -46, -47, -75, 121, -86, 183, -17, 26, 27, -100, -82, -3, 27, -11, 118, 102, 20, 16, 22, 4, 174, 61, -61, -6, 81, 136, 118, 34, 16, -73, 101, -120, 53, 271, 114, -41, -152, -14, -97, -66, 44, 115, -2, 37, -79, -149, 31, 60, 139, 62, 19, -63, -12, -109, 60, 23, 26, 42, -100, 134, 69, -22, 60, 131, 3, 80, 55, -20, 50, 59, -144, 81, 32, 9, -12, -58, -137, 34, -181, -8, -56, 80, -96, -93, -125, -240, -28, -145, 110, 19, 50, -73, 57, 56, -46, -21, 274, 35, -119, 43, 29, -2, 68, 75, 83, -2]
4648bk1Q5m7J69q6j21n0L4J4R0k7l7L8J9j71J05k1Q0j99J25J3K1q1K2Q4j56J52
4675C2r8J90l17K78j57J12j00K10k39J22K7j14J72j05p2K13j51PJ17L6j09L3J7
4698A04j06j06O7m1J4o0RQ5r0R5L9p1k2J70J2k68P4J64j30R4r0K7r8R6L0m6ll2
4726h3K5k7k4O7Mj9J38j23P4r7J41j56Q8K7o6O1J5J28j58R0j77m8L8N5M3M8k53
4753a89J42j16J94o7p4P2M4J24l04M6J66n1J60k9k08R5Q6j57k8J75L6q1j39J25
4777B2O2o4l7J2O0j21J77j25ok5k3J30k34L50k37J03M6j69J00P9k38k4J26j9J8
4802c7j62L14j28j88K70j86J02M3J44j84J36j50Q5j01n0P9j0K33k67O2J2OK3n0
4826dRL7j21J03l3o2j9R6q2M1M9m9j0J3j07K16n7m4Q8j25K53j92O5O7j93J38J81
$$ y = [-2, -23, 62, 15, 184, 98, -23, -73, -39, -25, 65, 38, 1, 39, 58, -113, -8, -29, 51, -148, -23, -10, 11, -70, -48, 36, -120, 32, -66, 124, -193, 85, -72, 40, -60, 150, -89, 33, 60, -54, 118, 13, -59, 154, 3, 10, 127, 163, 54, 87, 104, -2, -108, -41, -82, -68, -128, -119, -34, -124, -29, 10, -61, -83, 87, 99, -169, -95, 69, -61, 33, -57, -30, -128, -32, -2, -48, -51, -83, -58, -85, -109, -42, -38, -57, 81, -42, 32, -65, 76, -80, 8, 35, -31, 30, 45, 173, 15, 105, -72, -120, -82, -27, 16, 64, -189, -47, -163, 31, -36, -110, -38, 6, 130, -174, -128, 38, -13, 147, 118, -90, 5, 91, -66, -94, 81, 117, 36, -103, 22, 84, 20, -17, -5, 55, -66, 111, -14, -20, -45, -68, 62, -172, 178, -59, 44, 90, -79, 21, 100, -138, -162, -36, -55, -37, -199, 115, -13, -201, 69, -117, -15, 28, 172, -12, 124, -26, 59, -42, -92, -13, -23, 210, -57, 5, 17, 23, 46, -4, 5, 42, -79, 24, -9, -71, -90, 6, -76, -35, 14, -35, -45, -32, -139, 77, 20, -24, 64, -61, 192, 0, 65, 132, -61, 77, 258]
4853B58l83J55M7k2K4N3k4o0l2J3K0pj74J49p0m9J07j9n2O2K10j44m5J4L5p2j54
4880a60pJ38r6M9N2j58J03K36j61R0j82P7J05j54N0P4m6K9q6J17p2k6n4J68J5
4905A01j67P3j12J67N1k36R4R1Rk00K71k28R7j07K7Q8k5o3M4j02J67lj43R1N7
4930D2n3J63q3j5np0K0j9rn4jj31K50K1m3J02l46J50J81j53J50k16Q3N8P1j39
4956d6J34j78J78j20J5o5K64q1K0p5P5M4l19J66r1J6J08j5o4M9k21J29n0J56j8
4981A1L6n5k6j9J96j06j6j23R7j0k8PJ05P8j75O5r6k6j9J28j5o1mNN6l9k8J90
5009A28k72K45q5k9m7K0K6k1Q1qR3j44L9k3r2o8K16J10L7j81O6J63k99M3J55j35
5035A8j13Q5m2J14L4j89O0m9K46j58J06j93p2L17j86M7n0M8P0m2o9n0N3L2N3L4
$$ y = [258, -125, 30, 77, 55, 79, 132, 108, 48, 16, 29, 49, 42, -132, 17, -53, -102, 5, -14, -66, -4, 206, 62, 17, 31, 66, -6, -160, -167, -29, -125, -76, -24, -182, -79, 157, -4, 86, -96, -19, 86, -68, -18, 56, 10, 39, -47, 70, -2, -28, -82, 86, 101, -66, 7, -105, 62, 113, -123, -29, 62, 71, -129, 142, -86, 11, -96, -69, 19, -6, -69, -25, -127, 40, 37, -106, -15, 42, -11, 152, 69, 54, 49, -21, -1, -20, -29, -83, -84, -215, 35, 56, 13, 115, -231, -81, 100, -53, 97, -119, -36, 22, 93, -46, 88, -90, 88, -32, -17, -82, 182, 101, 121, 46, 121, 165, -154, 12, -79, -63, 45, 30, -34, 15, -206, -77, -127, 29, 11, 47, -8, -34, -53, 143, 37, 21, -102, -5, -15, -43, -36, 69, 147, -28, 37, -59, -85, -104, 24, 9, -52, -56, -51, 5, -34, -62, 128, -144, 101, 16, -13, -60, -40, -14, -35, 46, 38, 131, -13, 26, 3, -89, -157, 59, 169, 206, 25, 91, 254, -45, -2, 153, 18, -95, -10, -52, 62, 96, -93, -33, -82, 164, 6, 112, -81, -153, 164, -22, 25, -25, 23, 93, 51, -18, -68, -15, 17, 70, 104]
5061A04k04R3n3R4p5J12q5l2K8N7K0N0m6j17R6lo5J45j10k3n9K66k04J32k24R6
$$ y = [104, -100, -7, -60, 34, -41, 71, -14, -46, -18, 39, 59, 109, 63, -54, 42, 39, -26, 119, 9, -14, -73, 193, -11, 121, -103, -7]
$$ [...]
8191H3
##END NTUPLES=NMR FID
##END=
