##TITLE=1H_3MBDE-3
 CDCl3
 8 sc, 
 22.11.2022
##JCAMPDX= 6.0         $$ Bruker NMR JCAMP-DX V2.0
##DATA TYPE= NMR FID
##DATA CLASS= NTUPLES
##ORIGIN= UXNMR, Bruker Analytische Messtechnik GmbH
##OWNER= root
$$ XWIN-NMR		Version 3.5
$$ Tue Nov 22 14:06:52 2022 Russian Standard Time (UT+4h)  she@DPX200
##.OBSERVE FREQUENCY= 200.1313499994
##.OBSERVE NUCLEUS= ^1H
##.DELAY= (6, 6)
##.ACQUISITION MODE= SIMULTANEOUS
##.ACQUISITION SCHEME= undefined
##.AVERAGES= 8
##.DIGITISER RES= 18
##SPECTROMETER/DATA SYSTEM= spect
##.PULSE SEQUENCE= zg30
##.SOLVENT NAME= CDCl3
##.SHIFT REFERENCE= (INTERNAL, CDCl3, 0, 15.7039)
##AUDIT TRAIL= $$ (NUMBER, WHEN, WHO, WHERE, WHAT)
$$ ##TITLE= Audit trail, XWIN-NMR		Version 3.5
$$ ##JCAMPDX= 5.01
$$ ##ORIGIN= Bruker BioSpin GmbH
$$ ##OWNER= she
$$ F:/spectra/data/she/nmr/H-F/1/audita.txt
$$ ##AUDIT TRAIL=  $$ (NUMBER, WHEN, WHO, WHERE, WHAT)
(   1,<2022-11-22 14:05:46.56 +0400>,<she>,<DPX200>,
      <created by zg, POWCHK disabled, PULCHK disabled
       configuration hash MD5:
       00 E9 B6 7A A2 85 ED C7 34 08 36 98 17 FE 4E 26
       data hash MD5: 16K
       04 98 59 29 B5 C0 CE A2 1E 16 86 F2 1C EB 36 D2>)
$$ ##END=
$$ 
$$ hash MD5
$$ 91 CE CE 5A 89 71 46 A2 2C D2 1E 8D A9 05 88 B6
##$RELAX= 
##$RELAX= 
##$RELAX= 
##$RELAX= 
##$RELAX= 
##$RELAX= 
$$ Bruker specific parameters
$$ --------------------------
##$DU= <F:/spectra>
##$EXPNO= 1
##$NAME= <H-F>
##$PROCNO= 1
##$TYPE= <nmr>
##$USER= <she>
##$AMP= (0..31)
100 100 100 100 100 100 100 100 100 100 100 100 100 100 100 100 100 100 
100 100 100 100 100 100 100 100 100 100 100 100 100 100 
##$AQSEQ= 0
##$AQ_mod= 1
##$AUNM= <au_zg>
##$AUTOPOS= <>
##$BF1= 200.13
##$BF2= 200.13
##$BF3= 200.13
##$BF4= 200.13
##$BF5= 200.13
##$BF6= 200.13
##$BF7= 200.13
##$BF8= 200.13
##$BYTORDA= 1
##$CFDGTYP= 0
##$CFRGTYP= 5
##$CHEMSTR= <none>
##$CNST= (0..31)
1 1 145 1 1 1 1 1 1 1 1 1 1 1 1 1 1 1 1 1 1 1 1 1 1 1 1 1 1 1 1 1 
##$CPDPRG= <>
##$CPDPRG1= <>
##$CPDPRG2= <>
##$CPDPRG3= <>
##$CPDPRG4= <mlev>
##$CPDPRG5= <mlev>
##$CPDPRG6= <mlev>
##$CPDPRG7= <mlev>
##$CPDPRG8= <mlev>
##$CPDPRGB= <>
##$CPDPRGT= <>
##$D= (0..31)
0 1.2 0 0 0 0 0 0 0 0.06 0 0.03 0 0 0 0 0.0002 0 0 0 0 0 0 0 0 0 0 0 0 
0 0 0 
##$DATE= 1669111545
##$DBL= (0..7)
120 120 120 120 120 120 120 120 
##$DBP= (0..7)
150 150 150 150 150 150 150 150 
##$DBP07= 0
##$DBPNAM0= <>
##$DBPNAM1= <>
##$DBPNAM2= <>
##$DBPNAM3= <>
##$DBPNAM4= <>
##$DBPNAM5= <>
##$DBPNAM6= <>
##$DBPNAM7= <>
##$DBPOAL= (0..7)
0.5 0.5 0.5 0.5 0.5 0.5 0.5 0.5 
##$DBPOFFS= (0..7)
0 0 0 0 0 0 0 0 
##$DE= 6
##$DECBNUC= <off>
##$DECIM= 32
##$DECNUC= <off>
##$DECSTAT= 4
##$DIGMOD= 1
##$DIGTYP= 9
##$DL= (0..7)
0 120 120 120 120 120 120 120 
##$DP= (0..7)
150 150 150 150 150 150 150 150 
##$DP07= 0
##$DPNAME0= <>
##$DPNAME1= <>
##$DPNAME2= <>
##$DPNAME3= <>
##$DPNAME4= <>
##$DPNAME5= <>
##$DPNAME6= <>
##$DPNAME7= <>
##$DPOAL= (0..7)
0.5 0.5 0.5 0.5 0.5 0.5 0.5 0.5 
##$DPOFFS= (0..7)
0 0 0 0 0 0 0 0 
##$DQDMODE= 0
##$DR= 18
##$DS= 0
##$DSLIST= <SSSSSSSSSSSSSSS>
$$ [...]
##$SUBNAM2= <"">
##$SUBNAM3= <"">
##$SUBNAM4= <"">
##$SUBNAM5= <"">
##$SUBNAM6= <"">
##$SUBNAM7= <"">
##$SUBNAM8= <"">
##$SUBNAM9= <"">
##$SW= 18.0517283424941
##$SWIBOX= (0..15)
0 0 2 0 0 0 0 0 0 0 0 0 0 0 0 0 
##$SW_h= 3612.71676300578
##$TD= 16384
##$TD0= 1
##$TE= 0
##$TE2= 300
##$TE3= 300
##$TEG= 300
##$TL= (0..7)
0 120 120 120 120 120 120 120 
##$TP= (0..7)
150 150 150 150 150 150 150 150 
##$TP07= 0
##$TPNAME0= <>
##$TPNAME1= <>
##$TPNAME2= <>
##$TPNAME3= <>
##$TPNAME4= <>
##$TPNAME5= <>
##$TPNAME6= <>
##$TPNAME7= <>
##$TPOAL= (0..7)
0.5 0.5 0.5 0.5 0.5 0.5 0.5 0.5 
##$TPOFFS= (0..7)
0 0 0 0 0 0 0 0 
##$TUNHIN= 0
##$TUNHOUT= 0
##$TUNXOUT= 0
##$USERA1= <user>
##$USERA2= <user>
##$USERA3= <user>
##$USERA4= <user>
##$USERA5= <user>
##$V9= 5
##$VALIST= <valist>
##$VCLIST= <CCCCCCCCCCCCCCC>
##$VD= 0
##$VDLIST= <DDDDDDDDDDDDDDD>
##$VPLIST= <PPPPPPPPPPPPPPP>
##$VTLIST= <TTTTTTTTTTTTTTT>
##$WBST= 1024
##$WBSW= 4
##$XGAIN= (0..3)
0 0 0 0 
##$XL= 0
##$YL= 0
##$YMAX_a= 595165
##$YMIN_a= -848108
##$ZGOPTNS= <>
##$ZL1= 120
##$ZL2= 120
##$ZL3= 120
##$ZL4= 120
##$ABSF1= 10
##$ABSF2= 0
##$ABSG= 5
##$ABSL= 3
##$ALPHA= 0
##$AQORDER= 0
##$ASSFAC= 0
##$ASSFACI= 0
##$ASSFACX= 0
##$ASSWID= 0
##$AUNMP= <proc_1d>
##$AZFE= 0.1
##$AZFW= 0.1
##$BCFW= 1
##$BC_mod= 2
##$BYTORDP= 1
##$COROFFS= 0
##$CY= 11.3945322036743
##$DATMOD= 1
##$DC= 2
##$DFILT= <>
##$DTYPP= 0
##$F1P= 2.36226072786647
##$F2P= -0.459571619588291
##$FCOR= 0.5
##$FTSIZE= 0
##$FT_mod= 4
##$GAMMA= 1
##$GB= 0.15
##$INTBC= 1
##$INTSCL= 1
##$ISEN= 128
##$LB= 0.24
##$LEV0= 0
##$LPBIN= 0
##$MAXI= 10000
##$MC2= 0
##$MEAN= 0
##$ME_mod= 0
##$MI= 1.114404
##$NCOEF= 0
##$NC_proc= 0
##$NLEV= 6
##$NOISF1= 3.799351
##$NOISF2= 2.8
##$NSP= 1
##$NTH_PI= 0
##$NZP= 0
##$OFFSET= 15.70392
##$PC= 1
##$PHC0= -18033.49
##$PHC1= 15.20071
##$PH_mod= 1
##$PKNL= yes
##$PPARMOD= 0
##$PSCAL= 0
##$PSIGN= 0
##$REVERSE= no
##$SF= 200.130013532006
##$SI= 16384
##$SIGF1= 3
##$SIGF2= 2
##$SINO= 400
##$SIOLD= 16384
##$SREGLST= <1H.CDCl3>
##$SSB= 0
##$STSI= 0
##$STSR= 0
##$SW_p= 3612.71676300578
##$SYMM= 0
##$S_DEV= 0
##$TDeff= 0
##$TDoff= 0
##$TI= <>
##$TILT= no
##$TM1= 0
##$TM2= 0
##$TOPLEV= 0
##$USERP1= <user>
##$USERP2= <user>
##$USERP3= <user>
##$USERP4= <user>
##$USERP5= <user>
##$WDW= 1
##$XDIM= 8192
##$YMAX_p= 0
##$YMIN_p= 0
$$ End of Bruker specific parameters
$$ ---------------------------------
##NTUPLES= NMR FID
##VAR_NAME=  TIME,          FID/REAL,        FID/IMAG
##SYMBOL=    X,             R,               I
##VAR_TYPE=  INDEPENDENT,   DEPENDENT,       DEPENDENT
##VAR_FORM=  AFFN,          ASDF,            ASDF
##VAR_DIM=   8192,          8192,            8192
##UNITS=     SECONDS,       ARBITRARY UNITS, ARBITRARY UNITS
##FACTOR=    0.0002768,     1,               1
##FIRST=     0,             0,               0
##LAST=      2.2672688,     0,               0
##MIN=       0,             -848108,         0
##MAX=       2.2672688,     595165,          0
$$ Real data points
##PAGE= N=1
##DATA TABLE= (X++(R..R)), XYDATA
0@%%%%%%%Qj6J6j6K4m0M9n7P2r6J20j44J76k15K61l10L67m31N02n83O79p86R01
$$ 0 0 0 0 0 0 0 0 8 -8 8 -8 16 -24 25 -32 40 -56 64 -80 96 -119 142 -168 199 -232 270 -313 366 -420 481
30D81j031J180j347J525j722J945k190K459k751L070l424L810m232M693n192N739
$$ 481 -550 630 -717 808 -914 1031 -1159 1300 -1451 1619 -1805 2005 -2227 2466 -2726 3013
46C013o337O991p708Q490r353J0305j1356J2522j3821J5282j6932J8816k0990
$$ 3013 -3324 3667 -4041 4449 -4904 5401 -5955 6567 -7254 8028 -8904 9912 -11078
59a1078K3525k6534L0171l4667M0399m7992N8580p4476J01287j57845M78603o05843
$$ -11078 12447 -14087 16084 -18583 21816 -26176 32404 -42072 59215 -98630 379973 -225870
71b25870l93092J178040o85195m74649J030967O2055r72075M01250L46397n40368
$$ -225870 -618962 559078 -126117 -600766 430201 492256 -479819 -78569 267828 -272540
81b72540J31812N57192l52708k71525K39747m1493k21783K31461K52568j50729
$$ -272540 -140728 416464 63756 -207769 31978 -9515 -231298 163 252731 102002
91A02002k39654J42282O2218l05743R7189M93896k40933l83695L82497K3843m99847
$$ 102002 -137652 4630 66848 -238895 -141706 352190 111257 -272438 110059 133902 -365945
102c65945L63140M22779m98134q8555L75289l57063j42440N39259r2885l12589
$$ -365945 -2805 419974 -78160 -166715 208574 -148489 -290929 248330 155445 -157144
112a57144L12136r5035l99900L38447K36985l33254Q5713J97705k99706o2997
$$ -157144 154992 59957 -339943 -1496 235489 -97765 -12052 185653 -114053 -177050
122a77050K50451j9291l7172L7632r3680J6669J3296j22423J63012J62798k47461
$$ -177050 73401 54110 16938 54570 -39110 -22441 -9145 -131568 31444 194242 -53219
133e3219k6165K11132j92457j08996K86440j6855j75590J22836k4900j51837J35531
$$ -53219 -79384 131748 -60709 -169705 116735 99880 -75710 47126 22226 -129611 5920
144E920O0332r6566R5758o700j81812O8175J08394o8768M2657M1454r8188L119
$$ 5920 66252 -30314 65444 58744 -123068 -54893 53501 -15267 27390 68844 -29344 -26225
156b6225n96m1212J42510J0032j92883J12347J05654k43015O5929K68151k11895
$$ -26225 -26821 -68033 74477 84509 -108374 3973 109627 -133388 -67459 200692 -11203
167a1203j26792K61474r7608j96424K39172K8715k15660J59715P4252k46012R0600
$$ -11203 -137995 123479 25871 -170553 68619 97334 -118326 41389 115641 -130371 -39771
178c9771J71305k05087n771K25068j35315j58042J80033N1292j46459L6908J09591
$$ -39771 131534 -73553 -79324 145744 10429 -147613 32420 83712 -62747 -25839 83752
189H3752o6346j07240N2869J12997n8634q8038J15116K4748j69174O7521J49695
$$ 83752 17406 -89834 -36965 76032 17398 -70640 44476 69224 -99950 -32429 117266
200A17266j50439l5776J73067j18803j03751K18628m2933k00514J97247P3104
$$ 117266 -33173 -68949 104118 -14685 -118436 100192 57259 -143255 53992 127096
210A27096k73025R7131K20425k32170p7798K70074p2988k01695J65820P8846j78889
$$ 127096 -145929 -48798 171627 -60543 -138341 131733 58745 -142950 22870 101716 -77173
221g7173K5713J32633p0067o6738O4730J5625m7831J4070M7010k9749m8968N0842
$$ -77173 -51460 81173 11106 -55632 9098 24723 -23108 -9038 37972 8223 -40745 10097
233A0097K3399p8031L9862Q6489j17930m5956J67747m7706j54133J51667P2555
$$ 10097 33496 -44535 -4673 81816 -36114 -82070 85677 37971 -116162 35505 108060
244A08060k10580M2912J86135j40122r0800J72358k4558j31651J02162M9289j11905
$$ 108060 -102520 -59608 126527 -13595 -104395 67963 43405 -88246 13916 63205 -48700
255d8700K9924O4427o8497K523O4568m8744l6631O1842Q399n4635J1708N1839
$$ -48700 -18776 45651 -22846 -20323 44245 -4499 -41130 20712 29111 -25524 -13816 38023
267C8023k7517o1405M9064O6390q0736m6617J10023n828j18706P2741R0538j21467
$$ 38023 10506 -50899 -1835 64555 -16181 -62798 47225 41397 -77309 -4568 85970 -35497
279c5497l0494J23894l9995q0500Q6383J3913q6457M3776M6302o6724J2502N5562
$$ -35497 -65991 57903 17908 -62592 23791 37704 -48753 -4977 41325 -25399 -12897 42665
291D2665o0531k3654P9488j0791o9575L9127M8503n9576k6895P4818P252q5640
$$ 42665 -17866 -41520 37968 27177 -42398 -3271 45232 -14344 -41239 33579 40831 -44809
303d4809J3415Q2489m2110o0536P3290K2250q9717K0730P5135n4871l2923O3362
$$ -44809 -31394 51095 8985 -51551 21739 43989 -45728 -24998 50137 -4734 -37657 25705
315B5705k0868m3738O2342M117o8012M2636L9450p7243P899Q7294n4205p0057
$$ 25705 4837 -38901 23441 27558 -40454 2182 41632 -35611 -27712 59582 5377 -64680
327f4680Q5090L3629r4460J2583Q7257n3476o8644P7192L8813q3599j375P1307
$$ -64680 20410 54039 -40421 -27838 59419 5943 -62701 14491 53304 -30295 -31670 39637
339C9637l3924m6353N7428J3969o0476J7324L7352m2538J249N1470l8574l7929
$$ 39637 5713 -40640 16788 30757 -29719 -12395 24957 -17581 -16332 35138 -3436 -41365
351d1365O5285N477p1895L6968N9919p5592l2484R6893l720r2109M3376O6595
$$ -41365 23920 29397 -42498 -5530 54389 -21203 -53687 43206 39486 -52623 -9247 57348
363E7348p4959k9580Q8029j1492p6891M2630M3228n7605J710N1430l9816k5435
$$ 57348 -17611 -47191 40838 29346 -47545 -4915 38313 -19292 -17582 33848 -5968 -31403
375c1403N3933j2693m3807M8554J4449o9386K1285O9397n0899m6220P0190J1171
$$ -31403 22530 9837 -33970 14584 29033 -40353 -19068 50329 -570 -46790 23400 34571
387C4571p8451K4041P4806m9552n7146O5755K7476p0969R437O3848m2943m3405
$$ 34571 -43880 -19839 54967 5415 -51731 14024 41500 -29469 -20032 43816 873 -42532
399d2532N9282Q915n2963L0062K5168n5782J3862N3617n1177k3869P0003k3326
$$ -42532 16750 25665 -27298 2764 27932 -27850 -13988 39629 -11548 -35417 34586 11260
411A1260o3967O5925L7206q5259M46P9100l4299n4731N5395K5633o1143l310N6572
$$ 11260 -52707 13218 50424 -34835 -34389 44711 10412 -44319 11076 36709 -24434 -27744 28828
424B8828r505m2412K0948K4183l3076o299L9190j2400l0854K8253L654l5092L1886
$$ 28828 19323 -23089 -2141 22042 -11034 -17333 21857 9457 -21397 6856 10510 -24582 7304
437G304K6263n9139J171O1883m1053m1656P4052O106q1881L1092O3468n6829k7973
$$ 7304 33567 -25572 -24401 37482 -3571 -45227 28825 34931 -46950 -15858 47610 -9219 -37192
450c7192O2797m669n1121K4378L2276k8417j4733K3776L482j6420N336R433j5662
$$ -37192 25605 20936 -30185 -5807 26469 -1948 -16681 7095 10577 -5843 -507 8926 -6736
463f736l494K3076q457j8423K7910o75m8459K8415N0918n5731k5839P2096j9593
$$ -6736 -10230 12846 4389 -14034 13876 13201 -35258 -6843 44075 -11656 -37495 34601 15008
476A5008p1214O1566M9646p8860r643O8543l1056m2817N3821J4465m8585R224
$$ 15008 -56206 5360 55006 -23854 -33497 35046 3990 -38827 14994 29459 -19126 -9902
488i902K7366k2809n791K5654q277k0100J9240R895l0861J158L8678j7516l7189
$$ -9902 17464 -5345 -11136 14518 6241 -13859 5381 15276 -15585 -14427 24251 6735 -30454
501c0454M2926K1872o9494L535P7083l7210n5468P0597J3451q6539K8975O9938
$$ -30454 12472 34344 -35150 -31615 45468 8258 -47210 23387 36838 -49701 -20726 49212
513D9212n4565k3693O0391k7289m4958N4894J2044m8646K9380K2803n8667O227
$$ 49212 -5353 -29046 31345 4056 -40902 13992 26036 -22610 6770 29573 -29094 -22867
525b2867O0392l3127l7191N3830P445o5381J6235O1003l5451m3161N3816J8068
$$ -22867 37525 4398 -32793 21037 28482 -36899 -20664 40339 4888 -38273 15543 33611
537C3611o5395P135N9193l2601l4992N4564K863n7526K4193L3757m1496Q947M5075
$$ 33611 -31784 -24649 34544 1943 -33049 21515 24378 -33148 -8955 24802 -16694 -7747 37328
550C7328m3462k7685N3709r255m2202M9097K1643o7657J643N5637k5716k8690
$$ 37328 -6134 -33819 19890 10635 -31567 17530 39173 -28484 -26841 28796 3080 -25610
562b5610M4123O421m7334L232L4261r158j7965J5766R108j9283o450J5643o3p697
$$ -25610 18513 24934 -22400 -19168 15093 5935 -12030 3736 12844 -6439 -12889 2754 2691 -5006
576e006J0130J255j4561P792P031j9735Q773K7784k1658k2045L1204Q22l7307
$$ -5006 5124 6379 -8182 -390 6641 -13094 -4321 23463 1805 -20240 10964 11786 -25521
589b5521K2294L7532l3282k6048L2415L871k9410J4716K7745k0832k3077J6599
$$ -25521 -3227 34305 1023 -25025 7390 11261 -18149 -3433 24312 3480 -19597 -2998
601b998J0606j3480L234J4666j2417j2099J4246J079j1891J5860O100k6817O944
$$ -2998 7608 -5872 -2638 12028 -389 -12488 1758 2837 -9054 6806 12906 -13911 -6967
614f967K7261k5771j7564M2247M76m4656K1830L3414m3062j5317N1415m232m2530
$$ -6967 20294 -5477 -23041 19206 19682 -24974 -3144 30270 -12792 -28109 23306 19074 -23456
627b3456K1889K1958l4943j497L4977j2306k0860J9173j380k0719J9218J6355
$$ -23456 -1567 20391 -14552 -16049 18928 6622 -14238 4935 3555 -17164 2054 18409
639A8409k7768o10K6385k0295j9535L7947Q250m4073R444L8771k8143k5724M2012
$$ 18409 -9359 -9969 16416 -3879 -23414 14533 22783 -21290 -11846 26925 -1218 -26942 15070
652A5070P207m4330J2105L5935k7418j9662L2656K1k8136J7411J4781k6952J300
$$ 15070 22277 -22053 -9948 25987 -1431 -21093 11563 11584 -16552 859 15640 -11312 -10012
665a0012K4088j7619r619K9338j0010l2101K7142K2164l7423q36L9332k1141l3138
$$ -10012 14076 -3543 -13162 16176 6166 -25935 1207 23371 -14052 -14888 24444 3303 -29835
678b9835L6731J9866m1577k66L6795j8642k5319K9585J1683l0282K926K2382j5582
$$ -29835 6896 26762 -14815 -15081 21714 3072 -22247 7338 19021 -11261 -8335 14047 -1535
691a535j0258K2460m898k0931J7611J0978k6354N618K6914k4121j9110L7695L446
$$ -1535 -11793 10667 5769 -15162 2449 13427 -12927 -7309 19605 -4516 -23626 14069 17515
704A7515m1009J6391L2619l3020j5341M2261m078l8636J9232K3822k5651m433
$$ 17515 -23494 -7103 25516 -7504 -22845 19416 15338 -23298 -4066 19756 -5895 -10328
716a0328K4764j0660j7275J6748N012j4200P006O727j6392J746J9470r993j6868
$$ -10328 14436 3776 -13499 3249 8261 -5939 1067 7794 -8598 -6852 12618 2625 -14243
729a4243J7941Q474k5755K997L0067j5764k7043K6894J5893l3014J257L2477j7928
$$ -14243 3698 12172 -13583 -10586 19481 3717 -23326 3568 19461 -13553 -12296 20181 2253
742B253k3512K7818Q862k6501P144J6352j7961k185J9345r286j2194J5790l70
$$ 2253 -21259 6559 15421 -11080 -3936 12416 -5545 -7730 11615 2329 -9865 5925 5555
755E555j7225J2376J3612j9771p884K2300l17k2720J0219K0806k0427j6182K8031
$$ 5555 -11670 706 14318 -5453 -13337 8963 8646 -14074 -3855 16951 -3476 -19658 8373
768H373P274k9917O385K4579j9597j2960K7339j298k3535J3028J0116j6827O252
$$ 8373 15647 -14270 -7885 16694 -2903 -15863 11476 10178 -13357 -329 9787 -7040 -788
781g88J2715j8118j584J9983j1506j3456K2579R62k6814J0157K2836j7877j4832
$$ -788 11927 -6191 -7775 12208 702 -12754 9825 10787 -16027 -5870 16966 -911 -15743
794a5743K2840L718k3822N162K2648j2208j7720J6706Q972j7891K334J5479j1679
$$ -15743 7097 10815 -13007 -7845 14803 2595 -15125 1581 10553 -7338 -5004 10475 -1204
807a204q236J5785k636j1223J3415J217j9749J2033J6200k1812m621K4972j0311
$$ -1204 -9440 6345 3709 -7514 5901 7118 -12631 -598 15602 -6210 -10831 14141 3830
820C830k2087K2114J3435k6667k759K3009o484j6440J2503R882j5366m234J3832
$$ 3830 -18257 3857 17292 -9375 -12134 10875 4391 -12049 454 10336 -5030 -9264 4568
833D568L06r662L925M064o677K039O951o892j792J0229p591r451J7587L799k3338
$$ 4568 4874 -4788 -863 3201 -3476 -1437 5514 -1378 -3170 7059 -532 -9983 7604 11403 -11935
848a1935O056K1220j6874j2912K4593J292k6190Q821K0163j4873j0412J6324o08
$$ -11935 -5879 15341 -1533 -14445 10148 11440 -14750 -5929 14234 -639 -11051 5273 4665
861D665j3390P185P867q329r14N420n105o19R337m021r449R253N568j4017K029
$$ 4665 -8725 -1540 6327 -2002 -2916 2504 -2601 -3220 6117 2096 -7353 1900 7468 -6549 -4520
876d520J7114j0233j6921J7174J1518k1025j388K0207q941j6745J6348R175j7758
$$ -4520 12594 2361 -14560 2614 14132 -6893 -8281 11926 2985 -13760 2588 11763 -5995
889e995p95J3357p064n669J0524k301q571P531K029r305P184P815j4427l259J8265
$$ -5995 -6790 6567 -497 -6166 4358 2057 -6514 1017 3046 -6259 925 8740 -5687 -8946 9319
904I319l901j6504J1931J1548j8621m026K0963k515j9521Q983J3102j2991n650
$$ 9319 5418 -11086 845 12393 -6228 -10254 10709 8194 -11327 -2344 10758 -2233 -7883
917g883J4378j170j2496N074O750o823P58N115p060j092R663n115p068J1709J027
$$ -7883 6495 5325 -7171 -2097 4653 -2170 -1412 3703 -3357 -4449 5214 99 -6969 4740 5767
932E767j6955P326J7916j5145j1866K0225K093k1128R104J7088j5857r821J6875
$$ 5767 -11188 -3862 14054 -1091 -12957 7268 9361 -11767 -2663 14425 -1432 -11253 5622
945E622P08j2232N532O050r014M1O997l588k481N208l525n796Q461M587j1431
$$ 5622 6330 -5902 -370 5680 -3334 -3293 3704 116 -2365 2843 -682 -6478 1983 6570 -4861
960d861j767J3546m341j3370J2152J1520j9296n813K2789l259j9675J3394J1778
$$ -4861 -6628 6918 2577 -10793 1359 12879 -6417 -12230 10559 7300 -12375 1019 12797
973A2797j9160j657J7725o163j0401R926J8q639Q061J826r487M956N780j0326
$$ 12797 -6363 -8020 9705 3542 -6859 3067 3085 -5554 2507 4333 -5154 -198 5582 -4744
987d744k74J2534n392j1528Q488R296j0872n551J2934J542j5721M090J7110r925
$$ -4744 -5018 7516 2124 -9404 -916 8380 -2492 -8043 4891 6433 -9288 -5198 11912 1987
1001A987j3154J4872M601j6570O328J3025j3578m147J3249o631o000J3689m783
$$ 1987 -11167 3705 8306 -8264 -1936 11089 -2489 -6636 6613 -18 -6018 7671 2888
1014B888j2955J3504M535j7002N585J5055j3979r157J6532K733j5551K471J2675
$$ 2888 -10067 3437 7972 -9030 -3445 11610 -2369 -11526 5006 7739 -7812 -5341 7334
1027G334n183j0457P919R409j1015p110J3985J883j3386O383Q010j2815R90J2401
$$ 7334 2151 -8306 -387 9022 -1993 -9103 4882 6765 -6621 -238 7772 -5043 -4053 8348
1041H348r180m411J3789r043j0917J9066Q19k0972J1999J3347k1022k201K2167
$$ 8348 -832 -5243 8546 -497 -11414 7652 8471 -12501 -502 12845 -8177 -10378 11789
1054A1789p735j6531J3097P540j2730n61R490j588o990J881O629k703n600M801
$$ 11789 4054 -12477 620 8160 -4570 -5131 4359 2771 -4219 -2338 4291 1588 -4012 789
1068G89K155o329M223N007j0103J918J0662j1961l930J9252p421j9628J8649R439
$$ 789 2944 -3385 838 5845 -4258 -2340 8322 -3639 -7569 11683 4262 -15366 3283 12722
1082A2722k4292N524K1199j7432j1701K1012n74j5149Q434O055r734J665N464
$$ 12722 -11570 -6046 15153 -2279 -13980 7032 6458 -8691 -257 5798 -3936 -2271 3193
1095C193l700m02K794k576p25L053Q04k594l025N165L039r418J856J2349j1341
$$ 3193 -507 -909 1885 -691 -1416 1637 2441 -153 -3178 1987 5026 -4392 -2536 9813 -1528
1110a528j0430J9391K110k1689R718J5166j9406l349K0588p747j3018J2949J125
$$ -1528 -11958 7433 9543 -12146 -2428 12738 -6668 -10017 10571 2824 -10194 2755 3880
1123C880j0442P886K818q964M816M198q258K877P147o429l865N872J850l266k921
$$ 3880 -6562 1324 4142 -4822 -6 4192 -4066 -1189 5958 -471 -4336 1536 3386 120 -2801
1138b801L522M228p838k983J3542k988j5498J0759J0503j6618J25J5980j1208
$$ -2801 721 4949 -2889 -5872 7670 4682 -10816 -57 10446 -6172 -6047 9933 -1275
1151a275p943J4699k778r727J0710n27j1191R543N229j3340M710J0091j0965l428
$$ -1275 -9218 5481 2703 -7024 3686 3159 -8032 1511 6740 -6600 -1890 8201 -2764 -6192
1165f192J1785j091r057K375O183j866n935K301P542n566q758J0939N318j4480
$$ -6192 5593 4502 -4555 -2180 4003 2137 -3798 -1497 6045 479 -8279 2660 7978 -6502
1179f502K818J1920j0808m313J3198n274p622J0723l247q936J3010Q94j5394R474
$$ -6502 -3684 8236 -2572 -6885 6313 1039 -6583 4140 893 -8043 4967 5861 -9533 -59
1193e9R401j5402N27J5481r080r521J1744K592q797J478M208j517k603k95M132
$$ -59 9342 -6060 -5533 9948 868 -8653 3091 5683 -3114 -1636 2572 1055 -1548 -1843 2289
1208B289M43o123J395N305m495j183N528n157j730P822n206m216J1270l884j1984
$$ 2289 2732 -3391 -1996 3309 -1186 -2369 3159 -1998 -3728 4094 -1112 -5328 5942 2058 -9926
1223i926J2868O136j7075M265J4200j2481o690J4741q42j0789N259M551n533n6
$$ -9926 2942 9078 -7997 -3732 10468 -2013 -8703 6038 5196 -5593 -334 4217 -1316 -1372
1237a372K940m28o17j820m65L737j437j872J534j694Q97L020m409o95P463o115
$$ -1372 1568 1140 523 -1297 -1762 1975 538 -1334 200 -1494 -597 2423 -1986 -2681 4782 -1333
1253a333o327J2914P67j5024P615J1227j4541k111J5536o297j0454J0322K423
$$ -1333 -7660 5254 6021 -9003 -1388 9839 -4702 -6813 8723 2426 -8028 2294 4717
1266D717q239M088K649o004K358L746n406J124M108m086k438M692J318l931k034
$$ 4717 -3522 566 3215 -2789 -431 3315 -2091 -967 3141 -945 -3383 1309 2627 -1304 -3338
1281c338M278K254o741j83R846m287j0405R980O130j2763J291J1921q507o184
$$ -3338 940 3194 -3547 -3730 6116 1829 -8576 1404 7534 -5229 -3938 7983 -524 -6708
1295f708J1302j106p936O029J241p029N441L492q464K171O488p115k239Q244j127
$$ -6708 4594 3488 -4448 1581 2822 -4207 1234 4726 -3738 -1567 4921 -2194 -4433 3811 2684
1310B684p736L044N611k954m634L747M564o576l120R026N19r882M068P256p679
$$ 2684 -5052 -2008 3603 649 -3985 -238 4326 -2250 -5370 3656 4175 -5707 -1639 5617 -2062
1325b062j669Q886m131n633P547p39o274O558J314r004M314P228r041j779J0247
$$ -2062 -3731 5155 1024 -4609 2938 2199 -4075 2483 3797 -5207 -893 6335 -2706 -4485 5762
1340E762l891q798O970N627p723k426O980j38o669K563O392m443n200O202K082
$$ 5762 1871 -6927 43 5670 -2053 -4479 2501 2363 -4306 -1743 4649 206 -4994 1208 3290
1355C290n815J851M474n452l95N723l902k786P326k951p612Q642M004j1255J107
$$ 3290 -2525 -674 3800 -1652 -2047 3676 -226 -3012 4314 1363 -6249 2393 6397 -4858 -3751
1370c751J0524p297o595J0756J697j0914K171Q174m881m184N533J367n489Q94
$$ -3751 6773 -524 -7119 3637 5334 -5580 -3409 4765 -116 -4300 1233 2600 -2889 -1995
1384a995M391k018k177K553O9k829L119J513m795J354M454m876k761Q148p58r028
$$ -1995 2396 378 -1799 754 823 -2006 1113 2626 -2169 -815 3639 -1237 -3998 4150 3392 -5636
1400e636M818O983q144k875R345j990q255N384M913o063j279N113j768l575L847
$$ -5636 -818 6165 -1979 -4854 4491 2501 -5754 -370 4543 -1520 -2799 2314 546 -3029 818
1415H18R64l423J027K228l370P73M356k801m139M866K574o727Q78O975m468o299
$$ 818 1782 -1641 -614 1614 -1756 -983 3373 572 -3567 1299 3873 -2854 -1976 4999 531 -5768
1431e768P754L318q890O15P579m268n339O779J844o874J242M764l241j692L847
$$ -5768 1986 5304 -3586 -2971 4608 340 -4999 1780 3624 -3250 -2008 2756 -485 -2177 1670
1446A670j285l258L127J603m069K258K871m460j662O712r27o669M464M484o650
$$ 1670 385 -2873 254 1857 -2212 46 2917 -1543 -3205 3507 2580 -4089 375 4859 -1791
1461a791j675P321j206p236M306M162n627q20N403j931m194L517J430l204J256
$$ -1791 -3466 3855 2649 -4587 -281 3881 -1746 -2566 2837 906 -3288 229 1659 -1545 -289
1476b89J887l476L9M382k052l532M183J682o143J737O396m782m739P033K021p709
$$ -289 1598 -1878 -1839 2543 491 -3041 1142 2824 -3319 -1582 4814 32 -4707 2326 4347 -3362
1492c362K149O167n445l393O235N89n665K158K928l973J4L813k270k130L381p59
$$ -3362 -1213 4954 -491 -3884 2351 2940 -2725 -567 2361 -1612 -1598 2215 -55 -2185 1196 437
1508D37l322L251K476m820o56N344j684m805M369L419o227o57O812k021n792M629
$$ 437 -2885 366 2842 -1978 -2634 2710 1026 -3779 590 4009 -2218 -2875 3937 1916 -3876 753
1524G53K639n885O39N470l088k976L823q56k730L375O80m253J676L114l642j216
$$ 753 3392 -2493 -1854 3616 528 -2448 1375 519 -2211 1164 1844 -2409 -733 2381 -1261 -2477
1540b477N042j411m808L360L103l954j511M621k55m774K657L951l738k602M475
$$ -2477 2565 1154 -3654 -294 2809 -1145 -2656 1965 1710 -3064 -407 3544 -194 -2796 1679
1555A679K75m050K320K305l837j51L536k179j574L634j571l383L962J335m779
$$ 1679 1954 -2096 224 2529 -1308 -1459 2077 -102 -1676 1958 387 -2996 966 2301 -2478
1570b478J309M521m140l025N566Q49n417J380M327k919k673L699J368l991P0L649
$$ -2478 -1169 3352 -788 -3813 1753 2602 -2815 -1435 2892 -27 -2700 999 2367 -1624 -1554 2095
1586B095j345k322K592K99k835J916J572l272O02K839l140j704M943m61n250K989
$$ 2095 750 -1572 1020 1319 -1516 400 1972 -1300 -698 2141 -999 -2703 2240 1779 -3471 -482
1602d82L620n440j35N437k228m187L550K031l337k23L172j440j898K035R36j563
$$ -482 3138 -2302 -2437 3000 772 -3415 135 2166 -1171 -1394 1778 338 -1560 475 1411 -152
1618a52p7J131j053p53K424p53k597K037J687l873P58M286k896l950M849J863
$$ -152 -229 902 -151 -904 1520 767 -1830 207 1894 -1979 -1221 3065 169 -3781 1068 2931
1634B931n965J546M409l642l029N548O49n270J717L113k737q98L559j234k487
$$ 2931 -3034 -1488 2921 -721 -3750 1798 2447 -2823 -1106 2007 -730 -1628 1931 697 -1790
1649a790K164J032k711J548J818k718j352L923k06m138K358K965m576q76N199
$$ -1790 374 1406 -1305 243 2061 -657 -2009 1914 1708 -2430 -72 2893 -1683 -2559 2640
1664B640r80n259L263L176m767m7M775k432l189L703L66l224K239J624l205L40
$$ 2640 1660 -3599 -336 2840 -1927 -1974 2801 369 -2820 883 1249 -1975 264 1888 -1317 -977
1680i77L397k340j717L133m0l679J930L533l586j972L680O78m399J596L610l240
$$ -977 2420 80 -1637 1496 1456 -2223 -293 3240 -346 -2318 1362 2040 -2359 -763 2847 -393
1696c93k744M450Q57m563J755K947l597q67L779j014k614K673N61l221J911K462
$$ -393 -3137 1313 2170 -2393 -638 2309 -1288 -2155 1624 610 -2004 669 1230 -1991 -80 2382
1712B382l266n83L386j132l099L409J733m427k69M085j056l614L103J530l631
$$ 2382 -884 -1467 1919 787 -2312 1097 2830 -1597 -1866 2219 1163 -2451 652 2182 -1449
1727a449o44L865j136l001K692R39k871Q11K527k105j163K522r26j947K682R03
$$ -1449 -2093 1772 636 -2365 327 1266 -1605 -794 1733 -372 -1535 987 61 -1886 796 1699
1743A699l390O41L682k590k489M131J92m361J776L971l828j572L920n50l207J874
$$ 1699 -1691 -1050 2632 42 -2447 1684 1876 -2485 -709 3262 -566 -2138 1782 1232 -1975 -101
1759a01J958k727q72K838r67j783K362L11k379P98J745j707o38K942j147k753
$$ -101 1857 -870 -1742 1096 129 -1654 708 1019 -1360 -562 1183 -524 -1162 1780 633 -2120
1775b120K319K013l360m34M057j818k893L286J558l926K46K967j487k103K690
$$ -2120 199 2212 -1148 -1582 2475 657 -2236 1050 2608 -1318 -1072 1895 408 -1695 995
1790I95K76l054J334J975k219l98K121j190j707K527N39k712Q44K589k413j798
$$ 995 1271 -1783 -449 1526 -693 -1091 1030 -160 -1867 660 1199 -1513 -669 1920 -493 -2291
1806b291L567J06l301J225K597k147j137K851r4l049J330K011k134l74K010j084
$$ -2291 1276 1382 -1919 -694 1903 -244 -1381 1470 1376 -1673 -343 1668 -466 -840 1170 86
1822H6j303J921q3k081J409J216k616N19K671j814k054K884O51l033J259K171
$$ 86 -1217 704 621 -1460 -51 1165 -1451 -932 1739 -75 -2129 755 1406 -1627 -368 1803
1838A803j867j804K604R47k487N3K102j417q80J698K70j782N83J120j348o5J662
$$ 1803 -64 -1868 736 1683 -804 -751 1351 -66 -946 752 1022 -760 -177 943 -405 -470 1192
1855A192j268j464J948O22k693J299K046k576r35K898j78k787J619J598k000k27
$$ 1192 -76 -1540 408 1030 -1663 -364 1682 -894 -1829 1069 891 -1896 -277 1321 -679 -906
1871i06K015k99j855J130R86j178M5R85n69r55J295j65j102P17J008k019j26K019
$$ -906 1109 810 -1045 85 1071 -107 -62 923 354 -601 694 529 -573 144 1152 -867 -993 1026
1889A026p40j750K001M95k684O24K703j536k008K291P03k371O17K077j814q82
$$ 1026 286 -1464 537 1032 -1652 -1028 1675 139 -1869 422 1125 -1246 -629 1448 -366 -1248
1905a248J971K03j367J063L9j531P91J381j712m77J746k99k039J675J322k094
$$ -1248 723 926 -441 622 661 -870 -79 1302 -410 -887 859 560 -1479 196 1518 -576
1921e76o18K081m58j765J155J669k575k52K413m59j907J338J033k159P12J415
$$ -576 -1194 887 429 -1336 -181 1488 -1087 -1339 1074 615 -1292 46 1079 -1080 -368 1047
1937A047j179l93J558p89j472K186K4k112Q37J751j845r02K414J1k609P65K149
$$ 1047 -132 -525 1033 244 -1228 958 982 -1130 -293 1458 -387 -1289 1125 1136 -1473 -708 1441
1954A441j595j105J728K54k020R49J519j717n49J648l67r12J085R9j636J006J460
$$ 1441 -154 -1259 469 723 -1297 -348 1171 -546 -1095 553 186 -726 359 458 -1178 -172 1288
1971A288j861k37K215q94j902J645J199k466J48K388j350j621J779Q77k028K34
$$ 1288 -573 -810 1405 511 -1391 254 1453 -1013 -865 1523 173 -1448 331 1208 -820 -586
1987e86J354r08j024J484K10j365M62N78p72j8J217j017k59J164K70j587O61J462
$$ -586 768 -140 -1164 320 530 -835 -373 205 -567 -585 632 -385 -644 520 790 -797 -136 1326
2005A326j641n84K060mk272J133J599j924n50J526j31j647P90J016j196m0O64
$$ 1326 -315 -899 1161 1157 -1115 18 1617 -307 -857 669 538 -1109 -319 697 -499 -539 125
2022A25l43o56J046J04j117Q13N89j147P2J524p43j407J429O40j498J4J595q12
$$ 125 -218 -874 172 276 -841 -28 561 -586 -514 1010 267 -1140 289 929 -569 -555 1040 228
2040B28j386J536P57j715J23J269l25j440J200N44j486N45N40j022j95J410m70
$$ 228 -1158 378 1135 -580 -457 812 487 -953 247 791 -695 -150 390 -632 -827 583 113
2057A13j081J306L29j372M60J632j459j168J691L47j725O43J692j542r02J798
$$ 113 -968 338 667 -705 -245 1387 -72 -1240 451 798 -927 -284 1408 -134 -1036 762
2073G62O2j791L84J301o96m13P52k8j060P57L81j018J94J374j506m03J673m86
$$ 762 824 -967 -583 718 22 -391 361 333 -727 30 411 -607 -413 961 -545 -948 725 239
2091B39j390J135J126k027j05K200r39j616K096K55j913O28J606j167r78J198
$$ 239 -1151 -16 1110 -917 -1022 1178 239 -1377 719 974 -939 -311 1295 128 -850 348
2107C48J25p93M65L45r37M2Q54l86r03J255j02j434P57J280j243q70K071l97j748
$$ 348 473 -320 145 490 -447 -405 449 63 -840 415 313 -1121 -364 916 -327 -1197 874 477 -1271
2126a271J366J357k037k27J718l22j340J076L79j140L78P28o89J35J35l49k39
$$ -1271 95 1452 -585 -812 906 584 -756 320 699 -441 -63 665 -24 111 246 -103 -342
2143c42R99p08m73L65O09q10j61P69J12j089L14R15n12r01J176K69j352K71J021
$$ -342 657 -51 -524 -159 450 -360 -521 248 360 -729 -415 500 -12 -913 263 532 -820 -549 472
2162D72k46p72Q84j28n17M85J18l82K86J63n99O1P94m52o47N49j76q4k3O24l81
$$ 472 226 -546 338 210 -307 178 296 -86 200 363 -236 -175 619 167 -480 69 -107 -191 -214 410 29
2183B9n33J91Q41m70p67Q34K23q81K68J061q24m18R09j79o61O25L49j188P25K51
$$ 29 -504 -313 528 58 -709 125 348 -533 -265 796 -28 -446 463 284 -377 248 597 -591 134 385
2203C85m84j48J279j254n12R44L5p48J66J051j045k57P44M34j099j43J200o13
$$ 385 -99 -247 1032 -222 -734 210 245 -503 -337 714 -331 -588 156 590 -509 -652 548 -65
2221f5o74Q47M02p40k31P83m52m0N13l98o26J360m33q87J178K93j269L3J175o10
$$ -65 -739 108 510 -230 -461 322 -130 -170 343 -55 -681 679 246 -641 537 830 -439 -406 769 159
2241A59j026R09N36j446M00Q42n50n12O29J23j70j15K99p5p7R7K74n48L85K61
$$ 159 -867 42 578 -868 -468 374 -176 -688 -59 64 -106 -221 78 3 -74 23 297 -251 134 395
2261C95o89N8Q37m88o48J158j97j261O35J129j130o19J427q8j295P06L19p12J84
$$ 395 -294 -236 601 113 -535 623 426 -835 -200 929 -201 -820 607 519 -776 -70 249 -463 -279
2280b79L39l75K22L36l16j40K38J71n01K74K33j65j34J59N26p95r1J134m25q88
$$ -279 60 -315 -93 243 -73 -213 25 196 -305 -31 202 37 -97 62 588 -207 -298 836 411 -477
2300d77Q47J46j012K10J103q48m68L99L60p62N29J04n65L36M1m96L19O35o31j44
$$ -477 370 516 -496 -286 817 -31 -499 -100 260 -502 27 131 -434 -98 -57 -553 -234 401 -230 -374
2320c74P52Rp36K06O46l58n34L05O72l21q74O00L62p36M40P40q09m99P62Qp65
$$ -374 378 387 -349 -143 503 145 -389 -84 588 267 -607 -7 355 -381 59 799 -10 -509 253 261 -504
2341e04N68j40j74n0M15l36r6P89n21o08Q82K30p27K41O61n41n67Q41M5m52j97
$$ -504 64 -76 -250 -300 115 -221 -317 472 -49 -657 225 455 -272 -31 630 89 -478 363 408 -44 -241
2362b41R04l37n33P5M10m64JN92l49m17N69J3n10L43L8n14K12O39p30k03R12j72
$$ -241 663 326 -207 -132 278 -186 -185 407 58 -359 210 223 -287 56 94 -420 -208 431 -299 -502 410 238
2384B38q87P24N06o14m04J007q9n62J90N21n76j80J02L24m49J69K23m29OM29m76
$$ 238 -649 75 581 -33 -437 570 481 -81 109 630 54 -126 -24 300 -149 20 243 -186 -180 249 -227
2405b27Q3M46k34n59O24j7n07j5Q12n76m47P95m2n04rQ63o77J61J73J40m41l4
$$ -227 -144 302 68 -491 133 116 -391 -406 406 -170 -617 178 136 -368 -377 486 -191 -30 143 283 -158 -192
2427a92K66J62j45m5j81K0M11j99k62K28K5l18J22L22j29m36L19J88n20j74R24
$$ -192 74 236 91 46 -135 -115 296 97 -165 63 88 -230 -108 214 85 -351 -32 156 -364 -538 386
2448C86k00n47K05L02l33j01L78K30l39N8k8L01j34m25J39J6K2r8J02l3K27l03
$$ 386 186 -361 -156 146 -187 -288 90 320 -19 39 11 312 178 -247 -108 -92 -70 -168 -66 -99 128 -175
2470a75j50M59l41j39L86O9l96m9O97m11m60N51Lq1k13M18m25M54n5o9M6p0L5
$$ -175 -325 134 -207 -346 40 109 -287 -336 361 -50 -510 41 44 -37 -250 168 -257 197 142 73 119 49 84
2493H4l5O8J97k67K3K70n72K11j37L13m31j08N83j69n81M51L27l66n1L20K1m12
$$ 84 49 117 314 47 70 340 -232 -21 -158 155 -276 -384 199 30 -551 -100 227 -139 -190 130 151 -261
2515b61J28K74j78J79j50N2J8L19l79k00K59J45l87n9N64k88j09K18J54n94r2
$$ -261 -133 141 -37 142 -8 44 62 381 2 -198 61 206 -181 -240 324 36 -73 145 299 -295 -387
2536c87N07n8m18L32J78p59M80O3J50l81L39p2RL1j15J80k4K43k31J04Lk39l20
$$ -387 120 62 -356 -24 154 -605 -125 -62 88 -293 46 -26 -17 14 -101 79 55 298 67 171 174 -65 -385
2559c85O71k00l55K73M02l77l96P49l10j01k37N29n65J40K00k2j63K75J9l26L41
$$ -385 286 86 -269 4 406 29 -367 382 72 -29 -266 263 -302 -162 38 16 -147 128 147 -179 162
2580A62K16o77K43O25n15j76L72K65n54j96N07m29j30K96k15j9J4M22k57m67M59
$$ 162 378 -299 -56 569 54 -122 250 515 -39 -235 272 -157 -287 9 -206 -225 -211 211 -46 -513 -54
2601e4K2n4j69l9J12rJ75O0k92K09K19m82K02M38k47l52N43n2j91J18K68o47J08
$$ -54 -32 -86 -255 -294 -182 -191 -16 44 -248 -39 180 -302 -100 338 91 -261 282 230 39 157 425 -222 -114
2624a14P5K82k65j38K73j63k62J82j63j19L90j89j1K16o4J10o1P2q2o0K21J04
$$ -114 -39 243 -22 -160 113 -50 -312 -130 -293 -412 -22 -211 -222 -6 -70 40 -21 51 -31 -91 130 234
2646B34k87l28M92K2m56L62K19j15j32K24k56l45L61J44k33j70M86m49J67J64
$$ 234 -53 -381 111 133 -323 39 258 143 11 235 -21 -366 -5 139 -94 -264 222 -227 -60 104
2666A04j10k25K31o4r5M96l34l24j2N06J59k83J81j5k37j66L00R8k67N4L77n37
$$ 104 -6 -231 0 -64 -159 337 3 -321 -333 173 332 49 230 215 -22 -188 112 210 -57 -3 374 -163
2688a63J17L07j10j85K96l43k4J10R9k31j94L68j87j28K86P1m62J38L15j7k19
$$ -163 -46 261 151 -34 262 -81 -105 5 104 -127 -321 47 -140 -268 18 89 -373 -235 80 63 -156
2709a56L03q1l26R4J87m7j08N3O2q6J37J55k59l6J02L8j33J4K07m18K02K76k77
$$ -156 147 66 -260 -166 21 -26 -134 -81 -19 -105 32 187 -72 -108 -6 32 -101 -87 120 -298 -96 180 -97
2732i7j49L49k75k03K15K58l8k19K85J30m29m3N80l08K48q2k10L4K82l23k34K11
$$ -97 -246 103 -172 -375 -160 98 60 -159 126 256 -173 -216 364 56 304 222 12 46 328 5 -229 -18
2754a8J32K2k46K49j60r6J30K40l75J01J39l77LR4J22%j19L18q0l09L80O1k59
$$ -18 114 136 -110 139 -21 -117 13 253 -122 -21 118 -259 -256 -162 -40 -40 -159 159 79 -230 150 211 -48
2777d8J37n6N3J09J06m17R2J70J24l37P0K94l29k67K92J39L5k33J07j18l77N61
$$ -48 89 33 86 195 301 -116 -24 146 270 -67 3 297 -32 -299 -7 132 167 -66 41 -77 -454 107
2799A07M2k12j5J80o8J65J1m73L56J48j46n9J46k1k86J25K45l05J46Nn8j14J58
$$ 107 149 -63 -78 102 34 199 210 -263 93 241 95 36 182 161 -125 0 245 -60 86 91 33 -81 77
2822G7n4K56l34J1Q2k58k71L99l5q2L20j43P7j8J8p0k6L13k93K63j25j48k10L70
$$ 77 23 279 -55 -44 38 -220 -491 -92 -127 -209 111 -32 45 27 45 -25 -51 262 -31 232 107 -41 -251 119
2846A19L3j44k28L88J02l02k9J32q6L51l96q1J32k88K23J90q8ok57Q8L72j81J1
$$ 119 152 8 -220 168 270 -32 -61 71 -15 336 -60 -141 -9 -297 -74 116 28 22 -235 -147 225 44 55
2869E5J15k14q8K15L17l24l4L72k66l08N7J50L1j05j26K64k57N1J39j54o8M43
$$ 55 170 -44 -132 83 400 76 42 414 148 -160 -103 47 78 -27 -153 111 -146 -95 44 -110 -178 265
2891B65l53m5j61K55k80M17j83j60N6P5q6n1L36O7k06O8J37l1k31K30Jq2J7j02
$$ 265 -88 -133 -294 -39 -319 98 -85 -245 -189 -114 -200 -251 85 152 -54 14 151 120 -111 119 120 38 55 -47
2915d7M1N8j05L7j12n2J27p1Q9jJ29m23J93j21K76j97K60k58q2O26k87j76r5L01
$$ -47 -6 52 -53 -16 -128 -180 -53 -124 -35 -36 93 -330 -137 -258 18 -179 81 -177 -259 367 80 -96 -191 110
2939A10j51P7j44P0j31L07O3j91j66J35J2K83m17J46j92L3K08k62N4M53l25r7
$$ 110 -41 36 -108 -38 -169 138 201 10 -156 -21 -9 274 -143 3 -189 -156 52 -210 -156 297 -28 -125
2961a25R2R2j35j06K84K7k95J28J50j32P3J17K00j57k87J78p4k12K82J17p1j75
$$ -125 -33 59 -76 -182 102 129 -166 -38 112 -20 53 170 370 213 -74 104 30 -182 100 217 146 -29
2983b9K07p8P1k40P7k91O09j52l22J49n4j52M7J14j59o6L63R6k84J60j35L65j14
$$ -29 178 100 171 -69 8 -283 326 174 -148 1 -53 -205 -158 -44 -203 -269 94 190 -94 66 -69 296 182
3006A82Nk08m3J38p2j04L49j81L1l00K42O9n36O26k07j92J37K73l37Q2R5o5O4
$$ 182 187 -21 -64 74 2 -102 247 66 97 -203 39 108 -428 198 -9 -201 -64 209 -128 -46 49 -16 48
3029D8j32J02j43k9L22L9p8k09K56r0n8L0N6j53J88K7k35J80K42k29Q4k59K94
$$ 48 -84 18 -125 -154 168 207 129 -80 176 86 28 58 114 -39 149 176 -59 121 363 134 218 -41 253
3052B53m02j15J88j42J11J60j21m7J54J21m5j71K88k31j53R3J66k60K99Pl49N5
$$ 253 -149 -264 -76 -218 -107 53 -68 -115 39 160 115 -56 232 1 -152 -59 107 -153 146 153 -196 -141
3074a41L02j28n6K44k11j42K30m4j79pR9J67k66n3L85j25l23R3J47J43k68J10
$$ -141 161 33 -23 221 10 -132 98 54 -125 -132 -33 134 -132 -185 200 75 -248 -155 -8 135 -133 -23
3096b3K7L2N7J02k15K38j63j74R6J60k46P0K83m4j33n3M1j76q2N2J66k48J95k8
$$ -23 4 36 93 195 -20 218 55 -119 -23 137 -109 -39 244 200 67 14 55 -121 -203 -151 15 -233 -38 -66
3120f6K12k45J17K21k09j8j1j9M4Kl7J4J85k76j83L29J50m7m0R0j77k18K73j79
$$ -66 146 -99 18 239 30 12 1 -18 26 28 -9 5 190 -86 -269 60 210 163 123 213 36 -182 91 -88
3144h8p5J43j78K51j31R9k5J15o6M5mk30J34j35J04K88k04r9J22J68k32J38m9
$$ -88 -163 -20 -198 53 -78 21 -4 111 45 90 86 -144 -10 -145 -41 247 43 -56 66 234 2 140 91
3167I1N4K0Q0j02k40M9J41m7K28m22K59O0j79p9j63L40m7j03K61k38P2o0k7Nj41
$$ 91 145 165 245 143 -97 -48 93 46 274 -148 111 171 -8 -87 -250 90 43 -60 201 -37 35 -25 -52 -47 -188
3192a88P1J83O3k48J42m2J49l5j68N2K0m4J81o3j08P2J14l06K4J89k6n8J21l06
$$ -188 -117 66 129 -119 23 -19 130 95 -73 -21 -1 -45 136 73 -35 37 151 -155 -131 58 32 -26 95 -211
3216b11J36L06l51P2J33K3l67K31m3K11m72M13J41j06k69K06j7j47J2N5R8J67
$$ -211 -75 231 -120 -48 85 108 -259 -28 -71 140 -332 81 222 116 -153 53 36 -111 -99 -44 54 221
3238B21p8j03o9J46j91j00Q9J45m22M37L3l88j72L88k9k18M10O3j75j98J83k8
$$ 221 143 40 -29 117 -74 -174 -85 60 -362 75 108 -280 -452 -64 -93 -311 99 162 -13 -211 -28 -56
3260e6J27J36k17m3k92K65K11j10r9J23j2J30k09R9r1o1J70r6l0j26k12K24J03
$$ -56 71 207 -10 -53 -345 -80 131 21 -78 45 33 163 -46 53 -38 -99 71 -25 -55 -181 -393 -169 -66
3283f6j6J09j37JLR8J11J92j94j97K44p8lK1N9j40Qj32R9J78n2k97J27L59k94
$$ -66 -82 27 -110 -109 -106 -8 103 295 101 -96 148 70 67 88 147 7 15 -117 -18 160 108 -189 -62 297 3
3308Ckj1K08m83K95J1k8j2j09L46j18m13M04k25K3K80j65m7J62q3O2j00J10n3
$$ 3 1 -10 198 -285 10 21 -7 -19 -128 218 100 -313 91 -134 -111 169 4 -43 119 36 98 -2 108 55
3332E5q2j9R6R6k94J80m9P4L3J64m31m7L59k62j12J65k1O4L0P1k55q1K03J16R
$$ 55 -27 -46 50 146 -148 32 -17 57 90 254 -177 -224 135 -127 -239 -74 -95 -31 -1 70 -185 -266 -63 53 62
3357F2j24j24K78q9j66J94Q2j40K7j38M01j41m92K87K09j9J19q7l42k13K75R7
$$ 62 -62 -186 92 3 -163 31 113 -27 0 -138 263 122 -370 -83 126 107 226 139 -203 -416 -141 -44
3379d4J81q8ML63k15k41J97k36K89n9j14L21l2k64k01L47Ml09j50N39k06j22J05
$$ -44 137 49 53 416 201 -40 157 -79 210 151 37 358 326 62 -139 208 212 -97 -247 292 86 -36 69
3402F9j1j99J28K86k85M3j86L21n9l29L17j43N6j60K26r1J75J23l38J1j17O2k16
$$ 69 58 -141 -13 273 -12 31 -155 166 107 -222 95 -48 8 -152 74 -17 158 281 -57 -46 -163 -101 -317
3425c17M19j09k02K49Q6k19P0J01l1j38nK81j16J08k13K0j06J70O3k40Q3j74K95
$$ -317 102 -7 -209 40 126 -93 -23 78 47 -91 -96 185 69 177 -36 -16 -122 48 111 -129 -46 -220 75
3448G5k02J38l1n3n4L66m30K02k7mk96L72pj77J33K20k78K54k39J01j22n1P9J35
$$ 75 -127 11 -20 -73 -127 239 -191 11 -16 -20 -316 56 49 -128 5 225 -53 201 -38 63 -59 -110 -31 104
3472A04K0k09K07j79rJ70R8l72L41l74P1K7K79m14L19P1q8J6j95K28j17j65L26
$$ 104 124 -85 122 -57 -66 104 202 -170 171 -203 -132 -105 174 -240 79 150 62 78 -117 111 -6 -171 155
3495A55j92l58M92J82k17j02O9k4k50M20k28j50K10Q1k08K15O2k30J75L5j32j57
$$ 155 -37 -395 97 279 62 -40 29 5 -245 175 -53 -203 7 88 -120 95 157 -73 102 137 5 -152
3517a52J14M07l73NO1J05o3M6r0Q1k17L67l68kL46m18J54R3k47R3J37k41L4m5
$$ -152 -38 369 -4 1 62 167 104 150 60 141 -76 291 -77 -79 267 -151 3 96 -151 -58 79 -162 -128 -173
3541a73M17m72Q6J58l7jn6J88nq5jp2K00m03L66j2Q7p9m12L0N16k20Q4j63jr4
$$ -173 244 -228 -142 16 -21 -22 -78 110 105 20 19 -53 147 -256 110 98 185 106 -306 -276 240 20 104 -59 -60 -154
3567a54O4J62p2m6O4j32j19J18L04J7k55J10Lk24j59M00Mm1J4K68l23Km0P0J98
$$ -154 -90 72 0 -46 18 -114 -233 -115 189 206 -49 61 64 -160 -319 81 85 44 58 326 3 5 -35 35 233
3592B33k10N1j67j9R2K2Q0J11k90J13J00k23j2j11L41j92J68k76K03r1K7k6o7
$$ 233 23 74 -93 -112 -20 2 82 193 -97 16 116 -107 -119 -230 111 -81 87 -189 14 -77 -50 -76 -143
3615a43K89j57j5J40k19J48j95J72N4l05K05m6K13l18J91L8j34q4L05j0m31J25
$$ -143 146 -11 -26 114 -105 43 -152 20 74 -231 -26 -72 141 -177 14 52 -82 -166 139 129 -302 -177
3637a77R0K30k73J53n3r3n9K26l17M12p2j63lK88l0K6l05L53j17Q1k4l2k63K02
$$ -177 -87 143 -130 23 -30 -123 -182 44 -273 139 67 -96 -99 189 159 185 -120 233 116 197 173 141 -122 80
3661H0K39j21j66N5k2k57J20K33l76K00J24j06l9nJ02l88L00O8k01K24j27Pm4
$$ 80 319 198 32 87 65 -192 -72 161 -215 -15 109 3 -36 -41 61 -327 -27 41 -160 64 -63 -56 -100
3684a00J08K8j42n8J89k84K90j2j9pj9K65m32K07J6Q5j83R7p6po8mJ15K1o6n5
$$ -100 8 36 -106 -164 25 -259 31 19 0 -7 -26 239 -193 14 30 115 -68 29 -47 -54 -122 -126 -11 10 -56 -111
3710a11J05K1K13n1m29K49rRq9J77p1J41J22k32p2K10k74L18l09Ll73M21j45L14
$$ -111 -6 15 228 177 -252 -3 -12 -3 -92 85 14 155 277 45 -27 183 -91 227 -82 -79 -452 -31 -176 138
3734A38k11J38J2J32k27J06j5j32O2k32J72l5K44k59K4J61j15J91l7J61k75p7
$$ 138 -73 65 77 209 -18 88 73 -59 3 -229 -57 -92 152 -107 -83 78 -37 154 117 278 3 -74
3756g4J35j38L5L5j28Q9J94j56k5J90k60L6j24J12RN4j09J3K55k78R8L9J60k08
$$ -74 61 -77 -42 -7 -135 -46 148 -8 -33 157 -103 -67 -191 -79 -70 -16 -125 -112 143 -135 -37 2 162 -46
3780d6J96m4l23J39J55J23k70J18L1j56L1J14o5k22N5J23J82k75K90Mj72J15j17
$$ -46 150 106 -217 -78 77 200 -70 48 79 -77 -46 68 3 -219 -164 -41 141 -134 156 160 -12 103 -14
3803a4L87l73J68j22J09o2K5J27l99J84k19j1k4R3Q9l8P4J28l19k1Q3LK76j00
$$ -14 373 0 168 46 155 93 118 245 -154 30 -189 -200 -224 -131 -42 -80 -6 122 -197 -218 -135 -132 144 44
3827D4j3Q2l5k06L33j47Jj71K77l94K62M2j82N0M7Q9mQ6m9J26k45k44K97n2o3
$$ 44 31 113 78 -128 205 58 59 -112 165 -229 33 75 -107 -57 -10 79 75 161 112 238 -7 -251 46 -6 -69
3852f9O9OQ2j7k94L69k21K3L8L0m4L5M8k33J46j38K00j02l5L10l1k44J57Q3j35
$$ -69 0 6 88 71 -223 146 -75 -52 -14 16 -28 7 55 -178 -32 -170 30 -72 -107 203 172 -72 85 168 33
3877C3K72k70K56j12l0k8k06R6j13P7J47k15J61k09R3K17k05N5N1J66n50J34L03
$$ 33 305 35 291 179 149 121 -85 11 -102 -25 122 -93 68 -141 -48 169 -36 19 70 236 -314 -180 123
3900A23m5k01N6K13j59j15J40J96l78M31l93M0P4K06j19K29k44o7m0P8J17L6m1
$$ 123 78 -123 -67 146 -13 -128 12 208 -170 261 -132 -92 -18 188 69 298 54 -13 -53 25 142 178 137
3923A37L7k72PJ06l1r8j14L05k74J91O4n2Oj9J26J54l60K86j62j03N4m9J86k19
$$ 137 174 -98 -91 15 -16 -114 -228 77 -197 -6 58 6 12 -7 119 273 -87 199 37 -66 -12 -61 125 -94
3947i4N6O0M4M2j41j66N22j76k59J43J75l67K90k41P7r7O4L09k46k14K61Q3k61
$$ -94 -38 22 66 108 -33 -199 323 147 -112 31 206 -161 129 -112 -35 -132 -68 241 -5 -219 42 125 -136
3970a36K01k00Q0Qp5n2K18p2j15K77r6j38K25o1l0J11j96k06J50K27k10J11%n3
$$ -136 65 -135 -55 -47 -122 -174 44 -28 -143 134 38 -100 125 64 34 145 -51 -257 -107 120 -90 21 21 -32
3994c2J7o9j45O4K42j8K25k78K6J55Q4k42J27Q5l56O0l98O05l66J85o9J37l8p
$$ -32 -15 -84 -229 -165 77 59 284 6 32 187 271 29 156 241 -115 -55 -453 152 -214 -29 -98 39 1 -6
4018fm1J59j31j37J55l4K97k42J8o0K17l19R0J35k47K68m23L61m8o9P6J87r2m2
$$ -6 -47 112 -19 -156 -1 -35 262 20 38 -22 195 -124 -34 101 -146 122 -301 60 12 -57 19 206 114 72
4042G2r0l9J55j72Mj92K86L4O8J6k3k17k6L4j66J35J38l9L74l56j07K6K4J14j27
$$ 72 -18 -57 98 -74 -70 -262 24 58 126 142 119 -98 -124 -90 -256 -121 17 -22 352 -4 -111 -85 -61 53 -74
4067g4j3j26M24j02k92K69o7J69j82j79M30n09M9J52J0n9J4J36J42q7o9J3j00
$$ -74 -87 -213 211 109 -183 86 19 188 6 -173 257 -252 -203 -51 -41 -100 -86 50 192 105 36 49 -51
4090e1J22j37L1J43r0j23K63j03k39K11J04j62P9j63J2j20K72n9N0O1k87K59j12
$$ -51 71 -66 -35 108 18 -105 158 55 -184 27 131 -31 48 -115 -103 -223 49 -10 40 101 -186 73 -39
4113c9J27k59J69J53n5n8j33K26p6R9o9j55j39K39j79J76K25k41l1k2p9Q2K16
$$ -39 88 -171 -2 151 96 38 -95 131 55 154 85 -70 -209 30 -149 27 252 11 -20 -42 -121 -39 177
4136A77l93L39p8m9K24m60O9M11k30N9J03k39j28Q3K11l76K85Q3j3q6l4k41J51
$$ 177 -216 123 45 -4 220 -240 -171 240 10 69 172 -67 -195 -112 99 -277 8 91 78 -8 -42 -283 -132
4159a32N8r9l6L36O4l46K13j6o6k3L74l57k16K89k16K32j89K78l09K20n6K34l85
$$ -132 -74 -173 -209 127 191 -155 58 42 -24 -47 327 -30 -246 43 -173 59 -130 148 -161 59 3 237 -148
4182a48p7J72J44j28n9j07O2K20r4k32J91j1lpP1p6p3J29j94J61J40n2l2k5K33
$$ -148 -225 -53 91 -37 -96 -203 -141 79 -15 -247 -56 -67 -70 -77 -6 -82 -155 -26 -220 -59 81 29 -3 -28 205
4207B05j99O2k0k67J40K12K2k90K7JJ30R4j52J35K6n6k35jO8o4K15K1m1k41K91
$$ 205 6 68 48 -219 -79 133 155 -135 -108 -107 23 117 -35 100 126 70 -165 -166 -98 -162 53 74 33 -208 83
4232H3j82J39J85k12O0k22n8Q6L9K19k87K70Q5j75j38m6J83J50J5j83r7N5J22
$$ 83 -99 40 225 13 73 -149 -207 -121 -82 137 -150 120 205 30 -108 -154 29 179 194 11 -86 -31 91
4255I1j92KK29k82O8J45Q8k44K98j99K02o3K9l15n3K33J7j70K41P8p4k30N8r6
$$ 91 -101 -99 130 -152 -84 61 149 -95 203 4 206 143 172 -143 -196 37 54 -116 125 203 129 -101 -43 -139
4279a39K6L19l35K53l14J37O0K27k89o1J43m0J3j37O9O4O7l12O06k73p7k99K33
$$ -139 -113 206 -129 124 -190 -53 7 234 -55 -116 27 -13 0 -137 -68 -4 63 -249 357 84 7 -292 -59
4302e9q7J9J41L76m05k06J77Mj36K55l15K15J71j22j40J76J05l28J80O4l1j02
$$ -59 -146 -127 14 390 -15 -221 -44 -40 -176 79 -236 -21 150 28 -112 64 169 -159 21 85 54 -48
4324d8k61N37m70M21j9j23j87K05j7m51J48K11J12%M8k45K96j91J21m0L1K8n2
$$ -48 -309 228 -242 179 160 37 -150 55 38 -413 -265 -54 58 58 106 -139 157 -34 87 47 78 106 54
4347E4k44J03K8J1j03L1j21Q3J31l0RK1N1P2k68L0J28K4p3N4K9K4j84N6p1P3L7
$$ 54 -190 -87 -59 -48 -151 -120 -241 -158 -27 -57 -48 -27 24 96 -172 -142 -14 10 -63 -9 20 44 -140 -84 -155 -82 -45
4374d5o2Q6J72j16j01K6R9p9q2J3J26J37l82P6L89l37K55k76O7n4R9J22k53j69
$$ -45 -107 -21 151 35 -66 -40 59 -20 -102 -89 37 174 -208 -132 257 -80 175 -101 -34 -88 11 133 -120 -289
4398b89K98J41q7j31R5j68Q8k2r8K36l4Q3P3l84P5R6R1j65P2Q2Kj13L6L39j86
$$ -289 9 150 63 -68 27 -141 -53 -75 -173 63 29 112 185 -199 -124 -28 63 -102 -30 52 54 -59 -23 316 130
4423A30n9j14k8K14o4j8l0M5j09j04L23k19p1J23J48l36J22K46l10L4J78q6m9
$$ 130 71 -43 -71 143 79 61 31 76 -33 -137 186 -33 -104 19 167 -169 -47 199 -111 -77 101 15 -34
4446c4o4l7P9J24n3q0N9j25K6J20J45k80J92o7j7N2n8P2j56l8J26P1K7m4O8l58
$$ -34 -98 -135 -56 68 15 -65 -6 -131 -105 15 160 -120 72 5 -12 40 -18 54 -102 -140 -14 57 84 40 108 -250
4472b50K31K5L3j86L31l19m3k31M05N3L30k91j77L2l6P8m4J20j03m9J14j26J63
$$ -250 -19 6 39 -147 184 -135 -178 -409 -4 49 379 88 -89 -57 -93 -15 -59 61 -42 -91 23 -103 60
4495F0J26l75L15l7Kk35K26j26Q3j99J66L4j20r6K50j03p4J57nJ12p8k57p6J51
$$ 60 186 -189 126 89 91 -144 82 -44 39 -160 6 40 -80 -176 74 -29 -103 54 49 161 83 -174 -250 -99
4519i9J87j13J68J8Q3k16O1L7j48J67p9k2J23k10j77L6L39l3Oj02j40L27J07j66
$$ -99 88 -25 143 161 244 28 89 126 -22 145 66 44 167 -43 -220 -184 155 122 128 26 -114 213 320 154
4543A54l8k48J18l2J15n1k8O5q7m6J41k35l0L32k95N4N6q1J91l9k51J16K98j53
$$ 154 116 -132 -14 -46 69 18 -10 55 -32 -78 63 -172 -202 130 -165 -111 -55 -136 55 16 -235 -119 179 26
4567B6j41J60j9L6K7k67J26J39j85j2MN5j34m2J06q2L42j67n7L61n7j70j32P2
$$ 26 -115 45 26 62 89 -178 -52 87 -98 -110 -106 -51 -185 -227 -121 -203 139 -28 -85 276 219 49 -83 -11
4591a1K69k18O3R9k14J51k29j10J96j26k0K76O9k1j79n8L6Nj35L34k48l8O0Q8
$$ -11 258 40 103 202 -12 139 -90 -200 -4 -130 -150 126 195 174 -5 -63 -27 -22 -157 177 -71 -109 -49 39
4615C9K8q3M2J62k43K2K33l14mP2R1j69n3K58l05J75lL35j06k14J77j61m7Q5r7
$$ 39 67 -16 26 188 -55 -33 200 -114 -118 -46 45 -124 -177 81 -224 -49 -52 283 177 -37 140 -21 -68 17 -80
4640h0J50K4j00J33o5K3%q4J01j20J17l9k00j03J79J02J84k65lK9J1J47m3j36
$$ -80 70 94 -6 127 62 85 85 1 102 -18 99 60 -140 -243 -64 38 222 -43 -46 -17 -6 141 98 -38
4664c8l4q2M4J16m3r7M57j19l23N8j69K51m9m1J01K51j68J11j63o6J4o4j00L0
$$ -38 -72 -154 -110 6 -37 -134 323 204 -119 -61 -230 21 -28 -69 32 283 115 226 63 -3 11 -53 -153 -123
4688a23J11M6q7K8j12J61K4j73K39m16R9K32j38J99k28J50r9m3L4P5K1o7M06n54
$$ -123 -12 34 -53 -25 -137 24 48 -125 114 -302 -203 29 -109 90 -138 12 -87 -130 -96 -21 0 -67 339 -215
4712b15J77k34L40j12K07n50L95j54K96k54q9L24k03p6J76j99J22K31J73n67R9
$$ -215 -38 -272 68 -44 163 -387 8 -146 150 -104 -193 131 -72 -148 28 -171 -49 182 355 -212 -113
4733a13J32n3k55L83J19o47M61j14K53l40J8J33k42M86K5j14l51M08j86j10j9
$$ -113 19 -34 -289 94 213 -434 27 -87 166 -174 -156 -23 -265 221 246 132 -219 189 3 -107 -126
4754a26m0r1K85j66J48o5K68l10o5pO1o9J08j07J74p5Q7m7o0J55q3O1j44q2LM8
$$ -126 -166 -257 28 -138 10 -55 213 -97 -162 -169 -108 -177 -69 -176 -2 -77 10 -37 -97 58 -25 36 -108 -190 -187 -139
4780a39K54m54K27L1J47nj44J14k44L65K5o5l10J77J06j20p8J37j68l2K97l71
$$ -139 115 -339 -112 -81 66 61 -83 31 -213 152 177 112 -198 -21 85 -35 -113 24 -144 -176 121 -250
4802b50K14o9K19k26M9J33j16K50l07J29m1J00M2j21n3n4J08p1J69k2J49l40L57
$$ -250 -36 -105 114 -112 -63 70 -46 204 -103 26 -15 85 127 6 -47 -101 7 -64 105 83 232 -108 249
4825B49n18K37K89k3j49m60L83n5J82k87j40L24J7p4J26J5r8M3R2j97K3K77l69
$$ 249 -269 -32 257 234 85 -375 8 -47 135 -152 -292 32 49 -25 101 116 18 61 153 -44 -21 256 -113
4848a13K03L37n32J31j4q3J39J44k64K38k56M2O6K36l67J57j65K05r5R1q1l6Q9
$$ -113 90 427 -105 26 12 -71 68 212 -52 186 -70 -28 38 274 -93 64 -101 104 9 100 19 -17 72
4871G2r9K23j27l9j97J74P2k8k36K17m6l6J92k01Q1j96J68j96P7L65j9l01J70
$$ 72 -27 196 69 30 -167 7 79 51 -185 32 -14 -50 142 -59 22 -174 -6 -202 -125 240 221 -80 90
4894I0r2J93J41n58J60j27M15j67j77P2j18N5M0K00j00M6l00M09m22r0N40m48
$$ 90 -2 191 332 -226 -66 -193 222 55 -122 -50 -168 -113 -73 127 27 73 -227 182 -240 -330 210 -238
4916b38K3J93l6J36k4k21J22J56Kj74l5K7o4n1K67m9l46K65K1L4k15j5J57L1J39
$$ -238 -215 -22 -58 78 54 -167 -45 111 113 -61 -96 -69 -133 -184 83 34 -312 -47 -26 8 -207 -222 -65 -34 105
4941A05K6k09J28l0l0J03L3q9n7N5k3K5Q6L9j02r3k1K72j79J07k12J7L0k10K98
$$ 105 131 -78 50 20 -10 93 126 37 -20 35 12 37 123 162 60 -33 -54 218 39 146 -66 -49 -19 -229 69
4966F9k63J95m4K45j90j01J18k16L9J60k25K87j51K43j29k5K4JJ62k23J43o6j41
$$ 69 -194 1 -43 202 12 -89 29 -187 -148 12 -213 74 -77 166 37 12 36 37 199 -24 119 53 -88
4989h8K0J69k59J61j11l0q1m6L59k6j7Q7N6k59J6K28l86J76j03J3L4J94l7j80
$$ -88 -68 101 -158 3 -108 -138 -219 -265 94 68 51 138 194 -65 -49 179 -207 -31 -134 -121 -87 107 70 -110
5013a10J96l0n3N8j34k53K84q8R1j43K05J90m62J09J87N5r6J79k07J69k27K71
$$ -110 86 56 3 61 -73 -326 -42 -130 -39 -182 23 213 -249 -140 47 102 6 185 -22 147 -80 191
5035A91k43j0J53p5j57P6mn3L56k54j66K25j70J09o4j15J61J09j01MK23k60J04
$$ 191 -52 -62 91 16 -141 -65 -69 -122 234 -20 -186 39 -131 -22 -86 -201 -40 69 -32 -28 195 -65 39
5058C9Q6l88J78j77J28P2L4K59m57k7N18l36J14J1j45L2K59j58q0K27P4k27L7
$$ 39 125 -263 -85 -262 -134 -62 -28 231 -226 -253 265 -71 43 54 -91 -59 200 42 -38 189 263 36 73
5081G3K1mr4p8K10n1k94M03k21J10jj58r1QK14r4p9J73L5m91M35OJ37j94P4j13
$$ 73 94 90 -4 -82 128 77 -217 186 -35 75 74 -84 -175 -167 47 -47 -126 47 82 -409 26 32 169 -25 49 -64
5107f4L29j91k10P0p2L85k38kj92J12Q3J76j11k35K71j51j37O3J76K5l0j80K15
$$ -64 265 74 -136 -66 -138 247 9 7 -185 -73 10 186 75 -160 111 -40 -177 -114 62 87 57 -123 92
5130I2K3k6k13P9J60j39lrM0K5lR0L1j51l0L9J16O7l42L22l03J55j18Q3J14k69
$$ 92 115 89 -124 -45 115 -24 -27 -36 4 29 26 116 147 -4 -34 5 121 188 -154 168 -135 20 -98 -15 99 -170
5156a70Q7L21m22L58j49m7q1K74l92J87K57L1k97l2oK28j7l64L51j47k1l7j8J58
$$ -170 -83 238 -184 174 25 -22 -103 171 -221 -34 223 254 -43 -75 -81 147 130 -234 117 -30 -51 -88 -106 52
5180E2l3K35n10K34J69l76J21J65r3j6N2J21l2o6l5r3K8L13j92q1J05j24J4K4
$$ 52 19 254 -256 -22 147 -229 -108 57 -36 -52 0 121 89 23 -12 -105 -77 236 44 -37 68 -56 -42 -18
5204a8J45k63m1M32m1j85Q0l40J48J08J2k90M58l99J23K91m50Q7r2K08J48L5p4
$$ -18 127 -136 -177 255 214 29 109 -231 -83 25 37 -253 205 -194 -71 220 -230 -143 -235 -27 121 156 82
5227H2ql87K90J69j50J7M2J31l70O4J22oJ77j90J77k10R1J93l0n3J87k68k72J56
$$ 82 74 -313 -23 146 -4 13 55 186 -184 -120 2 -4 173 -17 160 -50 41 234 204 151 338 70 -202 -46
5251d6K02l8j46j9J60o3k06L00j86J15K4j78N7J98j91K9N2j33J12o4K4Q5j9k7
$$ -46 156 118 -28 -47 113 50 -156 144 -42 73 97 -81 -24 174 -17 12 64 -69 43 -21 3 88 69 42
5275D2Q7l98J13O2J48j54J96k72J97p5J0j8k5J44k9j18J12K12j20p7n6l0l4K3
$$ 42 129 -269 -156 -94 54 -100 96 -176 21 -54 -44 -62 -87 57 28 -90 22 234 114 37 -19 -49 -83 -60
5299f0n4l1J10J32k69kM08n05J04Q5J13j41N4k81L98k20J19Q7k20O7K38r1J41
$$ -60 -114 -145 -35 97 -172 -174 234 -271 -167 -82 31 -110 -56 -337 61 -159 -40 47 -173 -106 132 41 182
5322A82j49j50K08m4J98k90L31j6l32k0K20j23j4k34K05J78nj05J91k28j60J72
$$ 182 33 -117 91 47 245 -45 286 270 -62 -82 138 15 1 -233 -28 150 145 40 231 3 -157 15
5344A5J04k18k87K56O8J51N6n9j78L39j95r4j50M22l49L61l11j43J61L53r1k51
$$ 15 119 -99 -386 -130 -62 89 145 86 -92 247 52 -42 -192 230 -119 242 -69 -212 -51 302 211 -40
5366d0J60l4R4m6q4J2J09j38K0K3N3k12J31k68Q4K45p9k1Q8j76J56K05l7r1r7
$$ -40 120 86 180 134 50 62 171 33 53 76 129 -83 48 -220 -136 109 30 9 97 -79 77 282 245 154 57
5391E7P6J6j35m76N25K31n50L12K41m2k11O8j41J9J3p7r9J44o9J51K0l43K83J74
$$ 57 133 149 14 -462 63 294 -256 56 297 255 44 112 -29 -10 3 -74 -173 -29 -98 53 73 -270 13 187
5415A87q0j48L58j64j25j15P8J42r7j86J45j0L2K67j94K0j69K25k29J75j12j09
$$ 187 107 -41 317 153 28 -87 -9 133 36 -150 -5 -15 17 284 90 110 -59 166 -63 112 0 -109
5437a09j2o6L45n1k92O2L22j59n7r0J40R2j85R4N8j58K21k79K04o3m4n4q1L61
$$ -109 -121 -187 158 107 -185 -123 199 40 -17 -107 33 125 -60 34 92 -66 155 -124 80 17 -27 -81 -162 199
5461A99k98K24j80J24j21J11K09j87j04o1P9J45Kk79J91j5j26j05L35l07K1J54
$$ 199 -99 125 -55 69 -52 59 268 81 -23 -84 -5 140 142 -137 54 39 -87 -192 143 -164 -143 11
5483A1J83j20k17J83K29l6J17m13j02J07O3N9k2J17j69Kj86M6K44j28j85K52k84
$$ 11 194 74 -143 40 269 233 350 -63 -165 -58 5 64 42 159 -10 -8 -194 -148 96 -32 -217 35 -249
5506b49M1L54P4j60J18k88J21k6j47L19j30jJ5n8O0j4j8JR3k00jK8j0j31n7J17
$$ -249 -208 146 220 60 178 -110 11 -15 -162 157 27 26 41 -17 43 29 11 12 105 -95 -96 -68 -78 -209 -266 -149
5532a49J45P6P8j32p8k42L58l8p8L06m27J10J71k16K49k43J43P2m98M35j87J27
$$ -149 -4 72 150 18 -60 -302 56 18 -60 246 -181 -71 100 -116 133 -110 33 105 -393 42 -145 -18
5554a8kp8o6K58p3R8j69j56L86NK6k93k2J17P8k09N8J29J20j91j59R0J85k80J51
$$ -18 -20 -98 -164 94 21 119 -50 -206 180 185 211 -82 -104 13 91 -118 -60 69 189 -2 -161 -71 114 -166 -15
5579a5P8k00pJ97j45J4K60j4m14K61J75l37K37J7k67K42J02j9k5Q5l6k43n5K96
$$ -15 63 -137 -144 53 -92 -78 182 168 -246 15 190 -147 90 107 -160 82 184 165 140 225 189 -54 -109 187
5603A87j51k81M05o9m58K21L5K36r4ok42K84O6l02J21jk3L9J02Nk30K96r2k74
$$ 187 36 -245 160 91 -367 -146 -111 125 31 25 -217 67 133 -169 -48 -49 -72 -33 69 74 -156 140 48 -226
5627b26L10L9o8l4j2p8K88j55j62J27j35K87l32J30PK1n5J12l7j53J86%j10P5
$$ -226 84 123 55 21 9 -69 219 64 -98 29 -106 181 -151 -21 -14 7 -48 64 27 -126 60 60 -50 25
5651B5lq7m9Q2J05K13m28L55j95j11J24j65K74l8q4j6O0l3k07R1L08k50j36J86
$$ 25 22 -65 -114 -32 73 286 -142 213 18 -93 31 -134 140 102 18 2 62 29 -178 -87 221 -29 -165 21
5675B1j56J5M0K32k35J59n7m7J01JJ9l6l9N5j72N7O9l28K29J39l07K48k06K39
$$ 21 -135 -120 -80 152 -83 76 19 -28 73 74 93 57 18 73 -99 -42 27 -301 -72 67 -240 8 -198 41
5699D1K24j32l0k30K64j50P3j5k02j4q4R3N0K84n7j22K08O0k41J7j15J0Q7J64
$$ 41 265 133 103 -127 137 -13 60 45 -157 -171 -255 -162 -112 172 115 -7 201 261 20 37 -78 -68 19 183
5723A83J02r8k46N1Q2k79L67l61R2N4J89P3l75K60j93n0P2K73j25m3p9r0j8p8
$$ 183 285 187 -59 -8 74 -205 162 -199 -107 -53 136 209 -166 94 -99 -149 -77 196 71 28 -51 -141 -159 -237
5747b37L26q5r7L3R1L5q6Q7M2k49K2o8K41n1q4L6J9J09m0l4j21K14j09J70j17
$$ -237 89 4 -93 -60 31 66 -20 67 109 -140 -118 -186 55 4 -80 -44 -25 84 44 10 -111 103 -6 164 47
5772D7K5m3R3q7k40J63k51K33K25l16J44P1n5J7k38K19L46p9k13j05Nj9j24K74
$$ 47 72 29 122 35 -205 -42 -293 -60 165 -151 -7 64 9 26 -212 7 353 274 61 -44 -39 -58 -182 92
5796I2k41P4K06k70J95j11J26j50o1p8L84l40K71Pk87L69m0k09O6K4Oj37L50k04
$$ 92 -149 -75 131 -139 56 -55 71 -79 -140 -218 166 -174 97 104 -183 186 146 -63 3 27 33 -104 246 42
5820D2j60N04l51k39K11o3p1m7K88r3j15J20m5J38n0j61L31l85L17k9l10J35l4
$$ 42 -118 386 35 -204 7 -56 -127 -174 114 21 -94 26 -19 119 69 -92 239 -146 171 142 -168 -33 -67
5843f7K03k25J07j96O3M3J79p4J04j88J38l4J96j68j93J73j79J13j12J05j5j28
$$ -67 136 -89 18 -178 -115 -72 107 33 137 -51 87 53 249 81 -112 61 -118 -5 -117 -12 -27 -155
5865a55J89Kj5Jl5k41K28r3K46L8n09L23L2M8j67L35m07J82M8O9p0j81K14l98
$$ -155 34 36 21 22 -13 -254 -26 -119 127 165 -344 -21 11 59 -108 227 -180 2 50 119 49 -132 82 -316
5889c16K66J65j37n8r0K33j02J5m4j90L79n6j81K44o2j92J76J9j89j37J91J03
$$ -316 -50 115 -22 -80 -170 63 -39 -24 -68 -258 121 65 -116 128 66 -126 50 69 -120 -257 -66 37
5911C7J07K7j13j3j8k47L05j2j37K70mj06l95Q2J58J5O5k1k2M8p2NR2j66l2P3
$$ 37 144 171 58 45 27 -220 85 73 -64 206 202 96 -299 -217 -59 -44 21 0 -22 26 -46 -41 51 -115 -147 -74
5937g4M1M0j63K83j75M0j16J96O9k28J95j37J41r0O2l5J09j88J30q7j22j43K85
$$ -74 -33 7 -156 127 -48 -8 -124 72 141 -87 108 -29 112 22 84 49 158 -30 100 13 -109 -252 33
5960C3n6J23n4KQ2Kp2j46J50N9k5j07O4j63J3R0k08K36j72J57J11J12l41J93J12
$$ 33 -23 100 46 48 130 132 60 -86 64 123 98 -9 55 -108 -95 -5 -213 23 -149 8 119 231 -110 83 195
5985A95kk29J01O7k09J21k6p9Pr7Q4o9M16n64J76K55J62l95J02L1J28l10L39r3
$$ 195 193 -36 65 132 -77 44 18 -61 -54 -151 -67 -136 280 -284 -108 147 309 -86 16 47 175 -135 204 111
6009A11k15K13k22K03q0m5L70m43j21J19J9L24l96J42j9j38N9R2m5q9k7J10J41
$$ 111 -104 109 -113 90 10 -35 335 -108 -229 -110 -91 233 -163 -21 -40 -178 -119 -27 -72 -161 -188 -78 63
6032F3q2j0m6J49k47P0L6J54l6r8j35J94J6l1L8Q0k85K53q9J8o3J41m7p8K49l10
$$ 63 -19 -29 -75 74 -173 -103 -67 87 51 -47 -182 12 28 -3 35 115 -170 83 -6 12 -51 90 43 -35 214 -96
6058i6n3K52l0j99J05j61K89N3j80n8L65l76j19qL71Q8l39J11qJ2J8k6K06k20
$$ -96 -149 103 73 -126 -21 -182 107 160 -20 -78 287 -89 -208 -216 155 243 -96 15 7 19 37 11 217 -3
6082cJ23j56J18p7k67Q7J33N9p4K07l32M6Q0M9j93K11j13J60j29o7J65j83J43
$$ -3 120 -36 82 5 -262 -175 -42 17 -57 150 -182 -136 -56 -7 -200 11 -102 58 -71 -138 27 -156 -13
6105a3oL7K9O6l96J83j02J28M66k92j29J67k7k0J55q9l60J72J84p4k45O6MJ38
$$ -13 -19 18 47 113 -283 -100 -202 -74 392 100 -29 138 111 91 246 157 -203 -31 153 79 -166 -100 -96 42
6129D2l0k02j75L55L31j63j84j9P0l1k0r8J01K30k86L06j39k32J86j26j89P8m7
$$ 42 12 -190 -365 -10 321 158 -26 -45 25 -6 -26 -124 -23 207 -79 227 88 -144 42 -84 -273 -195 -242
6152b42K96j44Lj33M7J62j48J69n1JM4P3K3j46L2k25L77Rm05M24nl97L37k6J34
$$ -242 54 -90 -87 -220 -173 -11 -159 10 -41 -40 4 77 100 -46 -14 -239 138 147 -258 166 161 -236 101 75 209
6177B09l09O9j52p1N25l4j09l56L32j31l53L79j33r0Q1J39j61J93k04N2J29J05
$$ 209 -100 -31 -183 -254 271 237 128 -228 104 -27 -380 -1 -134 -224 -143 -4 -165 28 -176 -124 5 110
6199A10k22N8K77l32K74k83K74J29Nj08j47o9K39k88N1J02o8J19l15K10J33n15
$$ 110 -112 -54 223 -109 165 -118 156 285 290 182 35 -34 205 -83 -32 70 2 121 -194 16 149 -366
6221c66M87k42J88n0j43J09J72o9m7j49j57L66J57k40K0j73J56J97j95J12j76
$$ -366 121 -121 67 17 -126 -17 155 86 39 -110 -267 99 256 16 36 -137 19 216 21 133 -43
6242d3K06k48j1j25M40l55J11j74K1J38n1j80L23M9l04J14K06q7p6Q5j04j13K96
$$ -43 163 -85 -96 -221 219 -136 -25 -199 -178 -40 -91 -271 52 101 -203 -89 117 30 -46 39 -65 -178 118
6265A18K28m62j22K29j71j3K01k9L6K33j25R0j23Q1j78N7j22j46K24K12j05k33
$$ 118 346 -116 -238 -9 -180 -193 8 -21 15 248 123 213 90 171 -7 50 -72 -218 6 218 113 -120
6287a20J93j72K44j95M3J9M6l9K01j33J08j57l46J39L17k42J48j42J03o6J73j70
$$ -120 73 -99 145 -50 -7 12 58 19 220 87 195 38 -308 -169 148 -94 54 -88 15 -51 122 -48
6309d8J33R3l60K41k09K12k28L75k22j46J70J0j82Q8Q4j63Q6O2j7N0l25L79j1
$$ -48 85 178 -182 59 -150 62 -166 209 -13 -159 11 21 -161 -73 11 -152 -66 -4 -21 29 -296 83 72
6332G2p0J37m9k63Q2r8O7P6n4P1K1o8j56M30m12L47j39N1N6J9k1n8R5j30Q7j7
$$ 72 2 139 90 -173 -91 -189 -122 -46 -100 -29 -8 -76 -232 198 -214 133 -6 45 101 120 99 41 136 6 93 76
6358G6k91J93L3L5K64k26q7j21J71j96L25m18M6J98o1Lj15R0N7K01o4l89J51L43
$$ 76 -215 -22 11 46 310 84 -3 -124 47 -149 176 -242 -196 2 -59 -56 -171 -81 -24 177 113 -276 -125 218
6382B18j74m0k14J92j53J54N2Q0k03K59p7k3k01K19J67j99p7k3M5P1m2J04k51
$$ 218 44 4 -210 -18 -171 -17 35 115 -88 171 94 71 -130 89 256 57 -20 -43 2 73 31 135 -116
6405a16K4J38j85J69m6O7J57o1k45J44j00j8n6J99r0l8P8M2j14O3m9r4o4J80J09
$$ -116 -92 46 -139 30 -16 51 208 147 -98 46 -54 -72 -128 71 -19 -57 21 63 -51 12 -37 -131 -195 -15 94
6430I4%r3J08j67J62k84J26N3k3JJ08M9l00J44P5Qj65J74j5l9q8Q3K00l26o6L06
$$ 94 94 1 109 -58 104 -180 -54 -1 -24 -23 85 134 -166 -22 53 61 -104 70 55 16 -72 11 211 -115 -181 125
6456A25J2l21L08k89J00p9M3K16j67M09m09r4rK54k33K0O2q9J70m4k2P2J64k85
$$ 125 137 -184 124 -165 -65 -144 -101 115 -52 357 -52 -146 -155 99 -134 -114 -52 -141 29 -15 -37 35 199 -86
6480h6K0L2J53K01k44j38k76K68N8Q6l6K8J61j84kp3K14l65J48J94k75L02j34
$$ -86 -66 -34 119 320 76 -62 -338 -70 -12 74 38 66 227 43 41 -32 182 -183 -35 159 -116 186 52
6503E2k79L14J12j65m7K01k82j1M5R2Q7q6k2j06L9r4J55O8J86l41K42o3j09j5
$$ 52 -227 87 199 34 -13 188 -94 -105 -60 32 119 33 11 -95 -56 -150 5 73 259 -82 160 97 -12 -27
6527b7j16j8K32J04l32J76K19j71q2nq8K91m51K53j92M49l14O5J13j62j46Q5P8
$$ -27 -143 -161 71 175 -157 19 238 67 -15 -20 -108 183 -268 -15 -207 242 -72 -7 106 -56 -202 -117 -39
6550c9O4k58M06l21K04j36J61K36j08p8j48L18l24L08j36j37j90m8M73j45l1O5
$$ -39 25 -233 173 -148 56 -80 81 317 209 131 -17 301 -23 285 149 12 -178 -226 247 102 71 136
6572A36j46K6j37K1J40n7J36k29M77m56j34J54N9Q4J58n8K4M5k57k2J33Qj27J87
$$ 136 -10 16 -121 -100 40 -17 119 -110 367 -89 -223 -69 -10 74 232 174 198 243 -14 -36 97 105 -22 165
6596A65j26k5J27k83K04k69J03K53k43J77J4k03J78p0P4Q5j34N1n4j17J61n9j49
$$ 165 39 14 141 -142 62 -207 -104 149 -94 83 97 -106 72 2 76 161 27 78 24 -93 68 9 -140
6619a40k8M14k59K59j09l48L05K03j92m00N1K55j52q3J55K06m03L12k27L0P7J98
$$ -140 -168 246 -13 246 137 -211 94 297 105 -295 -244 11 -141 -224 -69 137 -266 46 -181 -151 -74 124
6641A24j19jK7j57K60k14j26Q7K22p0J21l28O3J04j82J15J42P6O5k25O1n1n8J50
$$ 124 5 4 31 -126 134 -80 -206 -119 103 33 154 -174 -111 -7 -189 -74 68 144 209 -16 45 -6 -64 86
6665H6N2j42q0M3J45j08J16k5K24k05o5Q6j62pr8M6L02k88K68k20K80n75K68L24
$$ 86 138 -4 -84 -41 104 -4 112 87 311 106 41 127 -35 -42 -140 -94 208 -80 188 -32 248 -327 -59 265
6689B65l26P8J1l24L50O0l08K94N4m00K14OR6k35P3J66j27L53m51K29p6j41L7
$$ 265 -61 17 28 -296 54 114 -194 100 154 -246 -32 -26 70 -165 -92 74 -53 300 -151 78 2 -139 -102
6712a02J94j89K20j53L22j64l22K38L0K42m01K70j08j20j18K48j53mJ93J20j46
$$ -102 92 -97 123 -30 292 128 -194 44 74 316 -85 185 77 -43 -161 87 -66 -70 123 243 97
6733I7J61o1j08K2K2R2o9k82J53j41P8j58L91j83n2J68k06J32n1qJ32j83j67L12
$$ 97 258 197 89 111 133 225 156 -126 27 -114 -36 -194 197 14 -38 130 -76 56 5 -3 129 -54 -221 91
6757I1K25l34K1L36k79J02rJ9k11Qj00J23o0L2j21Q6Q7k1J60j65q2J40j31o2K80
$$ 91 316 -18 3 339 60 162 153 172 -39 -31 -131 -8 -68 -36 -157 -71 16 -5 155 -10 -92 48 -83 -145 135
6782A35l74O0L15k12K36j1N8l65J71J84k92o9K09Mm5J14q3j24N1P3l8Q8j64J25
$$ 135 -239 -179 136 -76 160 149 207 -158 13 197 -95 -164 45 49 4 118 35 -89 -38 35 -3 85 -79 46
6806D6K8o3OJ90j01k42J89P0k39M74l27L25l91j02J30J74j94j25P8J21q2N7j9
$$ 46 74 11 17 207 106 -136 53 123 -116 358 31 356 -35 -137 -7 167 -27 -152 -74 47 -35 22 3
6829CJ41l9n9K3k66P1K94o1L4j64L1K2j63K00j10K5J47M1k99M05m47L40j39P3
$$ 3 144 105 46 69 -197 -126 168 107 141 -23 8 30 -133 67 -43 -18 129 170 -129 276 -171 169 30 103
6853A03k37J89K58j72l12K74j15M7j74R7K81j58p1k1R1R4k06o4Q5J40N8q8j09
$$ 103 -134 55 313 141 -171 103 -12 35 -139 -42 239 81 10 -11 80 174 -32 -96 -11 129 187 99 -10
6876a0N3j34L44k60K5j35J81j27%J42n6n4J05l2J12M5l01J86k51L56k92J3J88
$$ -10 43 -91 253 -7 18 -117 64 -63 -63 79 23 -31 74 42 154 199 -102 84 -167 189 -103 -90 98
6899I8j98J62j46J05L3L3N2n5o2K00k47j04J18P4j19J44k62J52J92l89J4K09o4
$$ 98 -100 62 -84 21 54 87 139 84 22 222 -25 -129 -11 63 -56 88 -174 -22 170 -219 -205 4 -60
6922f0j83J38L07k13o1l6J65J24p7J75m01K15k03Q6m9P8o0K29j25j48K56k76L0
$$ -60 -243 -105 202 -11 -72 -108 57 181 104 279 -122 93 -110 -24 -73 5 -55 174 49 -99 157 -119 -89
6945h9k3J06q4J03j35l9O4L9J81o4L8q4l1R2k1J80k1n21N04l69NJ06j73J88r6
$$ -89 -112 -6 -90 13 -122 -161 -97 -58 123 59 97 13 -18 74 53 233 212 -309 195 -174 -169 -63 -236 -48 -144
6970a44J57j52j9J14q5J98j20J53j09m4r0J63n3j9N2L6r7o8K03%j44J27j41K56
$$ -144 13 -139 -158 -44 -129 69 -51 102 -7 -51 -141 22 -31 -50 2 38 -59 -127 76 76 -68 59 -82 174
6994A74O3j65r8kJ56J15j24q9j90N8M4M0o9J68L0n2M4m07L97Kj15j34J41M1l4
$$ 174 237 72 -26 -28 128 243 119 30 -160 -102 -58 -18 -87 81 111 59 103 -304 93 95 -20 -154 -13 28 -6
7019fk21k0K17%J2Lj2j54L7J59p6K28j78J54j77K0j67K38j57K80k31MK74o8k17
$$ -6 -227 -247 -30 -30 -18 -15 -27 -181 -144 15 -61 167 -11 143 -34 -14 -181 57 -100 180 -51 -47 227 159 -58
7044e8J57l64M79q7k25J14j29j02M4J39m4J13k6J14k28L2kK17k44R2L52m58m1
$$ -58 99 -265 214 127 -98 16 -113 -215 -171 -32 -76 37 11 125 -103 -71 -73 144 -100 -8 344 -114 -155
7067a55K27Q3k95J19R9P0k22J07O7m72L05j19Q9K37k43J39j59m4J79P9l31L00
$$ -155 72 155 -140 -21 78 148 -74 33 100 -372 -67 -186 -97 140 -103 36 -123 -167 12 91 -240 60
7089F0r3q5J85l4J03j75n1K78j06j17M8r4O3l0K28n1L1o1j2j76M21k33j20J46
$$ 60 -33 -118 67 33 136 -39 -90 188 82 -35 13 -81 -18 -48 180 129 160 99 87 -89 332 99 -21 125
7113A25r8q1p3J56o5On7o6L86k59L5n9K01l05J33K09j03k49J02J16R7l45L4J48
$$ 125 27 -54 -127 29 -36 -30 -87 -153 233 -26 9 -50 151 -154 -21 188 85 -164 -62 54 151 -194 -160 -12
7137a2j16J43J51l5k27K99k98n0L61l59o3K11j59R9k3O1j0J95k42R1j24Q0k15
$$ -12 -128 15 166 131 -96 203 -95 -145 216 -143 -206 5 -154 -55 -78 -17 -27 168 -74 17 -107 -27 -242
7160b42J43n8j31J78J11Q9r8k6O4m3j0O0J07j4l8o4J22o3j44K89j9o9L7l10l6
$$ -242 -99 -157 -288 -110 1 90 -8 -34 30 -13 -23 37 144 130 92 28 150 87 -57 232 213 144 181 -129 -165
7185a65l2O9N56k77j72J8J18p2J87K3k38K5j94L69k26j45J91j52K83j5k59K40
$$ -165 -197 -128 428 151 -21 -3 115 43 230 253 15 40 -154 215 -11 -156 35 -117 166 151 -108 132
7207A32j98K00n3p0j00j8l5L70j03L1N9j39q1K15k12R0rq0J16j37K51l36nJ79
$$ 132 -66 134 81 11 -89 -107 -142 228 125 156 215 76 -5 210 -2 88 79 -1 115 -22 229 -107 -112 67
7231F7j01k70N02l57K03L6k83rJ68r5J84j95O7j82J80L28j01L2k18N1j55J94Q9
$$ 67 -34 -304 198 -159 44 80 -203 -212 -44 -139 45 -150 -83 -265 -85 243 142 174 -44 7 -148 46 135
7254A35j78Q2QM4j20N3j9k32J67K95k26j33L54l18K35k86n6J1J76K04k29J6k0
$$ 135 -43 39 47 91 -29 24 5 -227 -60 235 9 -124 230 -88 147 -139 -195 -184 -8 196 -33 -17 -37
7277c7J52l91L9J57J20J65j86q5j74L85k91K28rj5Ok50m5k4K04K12j72J1l13L14
$$ -37 115 -276 -237 -80 40 205 19 -66 -240 145 -146 82 73 58 64 -186 -231 -255 -51 161 -11 0 -313 1
7301An3K34p6j88P3R3o2J25k80j57K88k1j62L12j7j4j04k73J45J32Kl5m04N37
$$ 1 -52 182 106 -82 -9 84 22 147 -133 -290 -2 -23 -185 127 110 96 -8 -281 -136 -4 -2 -37 -441 96
7325I6j60J39j08K1J68k32J38j86K05J97l57L94m58N5J90o4J5j89m0K89R8j68
$$ 96 -64 75 -33 -12 156 -76 62 -124 81 278 -79 315 -143 -88 102 38 53 -136 -176 113 211 43
7347D3Q2j41K30j33J92r9k96j20j9L69j71q2K02j3l20K17P8j61J97k14K65Q9l63
$$ 43 125 -16 214 81 273 174 -122 -242 -261 108 -63 -145 57 44 -276 -59 19 -142 55 -159 106 195 -168
7370a68K48O6j43O3p6j5N7J%p7k5n7J62J24k32K00l03K92j1k87J94j77L84m9l07
$$ -168 80 146 3 66 -10 -25 32 33 33 -44 -69 -126 36 160 -72 128 -175 117 106 -181 13 -164 220 171 -136
7395a36J68r3J6m9j5N8O1J65j62N0K5n1j06Q4j3M03l51r1QM6j04K62m8No3J35
$$ -136 32 -61 -45 -94 -109 -51 10 175 13 63 88 37 -69 15 2 405 54 -37 -29 17 -87 175 127 132 69 204
7421B04k13o8L47m15K63k40L8P9J27k30J84lk8R4m7j23K64o17N36P4k04n3j75
$$ 204 -9 -77 270 -145 118 -122 -84 -5 122 -108 76 73 45 139 92 -31 233 -384 152 226 22 -31 -206
7444b06J55j07J80j3l04M24k1n9j63Q1K44l39O4L3K6k9J49r3r0K4K05m7k94K46
$$ -206 -51 -158 22 9 -295 129 108 49 -114 -33 211 -128 -64 -31 -5 -34 115 22 -68 -44 161 114 -180 66
7468F6j88J12m8J93l14K71n0K10k33J77l20j21K30J20j59n5J47k01P2J15P4J4
$$ 66 -122 -10 -58 135 -179 92 42 252 19 196 -124 -245 -15 105 -54 -109 38 -163 -91 24 98 112
7490A12o9q6K00kL6k69nj8J93k40K02M0k63O0J45j05K68k73J12K78k88p1j3j78
$$ 112 43 -43 157 155 191 -78 -83 -101 92 -148 54 94 -169 -109 36 -69 199 -74 38 316 28 -43 -56 -234
7514b34J19J38Mk06N0K36l62L17j62J07j88J75m2Lj48L91m53J37L05m37M99k74
$$ -234 -115 23 27 -179 -129 107 -255 62 -100 7 -181 -6 -48 -45 -193 198 -255 -118 187 -250 249 -25
7536b5O0k84J45M5j02nK87l12L91k16l6p2j17L50j90N5K7J91N3j81m9N0j46J02
$$ -25 35 -249 -104 -59 -161 -166 121 -191 200 -16 -52 -124 -241 109 -81 -26 1 192 245 64 15 65 -81 21
7560B1l6n0K0N3P7j16P1j55rJ84N0l08K24o6J06k13J38J10k09M1K84j18l25J34
$$ 21 -15 -65 -45 8 85 -31 40 -115 -124 60 110 -198 26 -40 66 -147 -9 101 -108 -67 217 99 -226 -92
7584i2J91j90j58N53o00M77o5j76J20K21k35j46O4j17L7J78n0L8k91L53n2r6Q0
$$ -92 99 -91 -249 304 -296 181 116 -60 60 281 46 -100 -36 -153 -116 62 12 50 -241 112 60 -36 44
7607D4k04MK31j80J90k06q9J76k12M38k25K1k75L38k76K09O6r0O8q6j4M0o4r5
$$ 44 -160 -156 75 -105 85 -121 -210 -34 -246 192 -33 -12 -287 51 -225 -16 50 -40 28 -58 -72 -32 -96 -191
7631a91J74J56p8j95J85j21l2P5j20L42k16p2O9j5oJ61j57K17p6k45N72j02k32
$$ -191 -17 139 61 -134 51 -70 -102 -27 -147 195 -21 -93 -24 -39 -45 116 -41 176 100 -145 427 325 93
7654I3j10K8j64K31mk7J7l50L14L0j44M39l55q0J65j36M7R8j15L4q7O7J73r8L
$$ 93 -17 11 -153 78 74 47 64 -286 28 58 -86 353 -2 -82 83 -53 -6 92 -23 11 -76 -9 164 66 69
7679F9j19l1o8O3K50m75N52l31J26j36J5j27K25j8O2P1O1j13m8J0JN9k02P8K22
$$ 69 -50 -81 -149 -86 164 -311 241 -90 36 -100 -85 -212 13 -5 57 128 189 76 28 38 39 98 -104 -26 196
7704A96l49K78K42m34J31L2k11NM7P9k7J81l3R6j12j51R2o3J52o6k26J98K0L3
$$ 196 -153 125 367 -67 64 96 -115 -110 -63 16 -11 170 137 233 121 -30 62 -1 151 85 -141 57 77 110
7728A10L3k97N3O1oj78J87K56k11K12k62Rj26J67k27L23Q6k56J19r8J81k10J54
$$ 110 143 -154 -101 -40 -46 -224 -37 219 8 220 -42 -33 -159 8 -219 104 190 -66 53 -45 136 -74 80
7751H0p9Q8K5J39m45J28qK91l06k3j6K01j40Q1K18l54J46J37Q4l03k09K96o5j11
$$ 80 1 89 114 253 -192 -64 -72 219 -87 -110 -126 75 -65 16 234 -120 26 163 247 -56 -265 31 -34 -145
7775a45L04k70M67j52l54k46K89L57j67j00J7Q2J97k37r5K21j04k17Q7j30J01
$$ -145 159 -111 356 204 -150 -396 -107 250 83 -17 0 82 279 42 -53 168 64 -153 -66 -196 -95
7796i5Q9k42M09r3kK28k58k64J93K8J11O9j17R5m98L47N0k04J60J71k43r7J87
$$ -95 -6 -248 161 68 66 294 36 -228 -35 -7 104 173 56 151 -347 0 50 -154 6 177 -66 -163 24
7819B4l07K62J98O3L4k07Kk17J62n3P1Ql36M76j99l30K85l3J78J4j84J9L3J43
$$ 24 -283 -21 177 240 274 67 69 -148 14 -39 32 40 -296 180 -19 -349 -64 -97 81 95 -89 -70 -37 106
7843A06j21o0N3K8M3l61L68J90k04k31O1Q3Q2k1j09J25nN0n0K34j91n2K4p8Q0
$$ 106 -15 -75 -22 6 49 -312 56 246 42 -189 -128 -45 37 16 -93 32 27 77 27 261 70 18 42 -36 44
7868D4K32j22j78K75k79n9K00n6M5%k38K12l02j61K27K52J4j32q1J14%J31k55
$$ 44 276 154 -24 251 -28 -87 113 57 102 102 -136 76 -226 -387 -160 92 106 -26 -107 7 7 138 -117
7891a17J29M6k65L34l76J37M8k6P6J25k57K71l00J03j9J18L23o25J63j00K94k11
$$ -117 12 58 -207 127 -249 -112 -64 -90 -14 111 -146 125 -175 -72 -91 27 350 -275 -112 -212 82 -129
7913a29K08j65J51J47k89J91jN0j54J02j54O0M8k15O9L7L03o39M24j79K62k57
$$ -129 79 -86 65 212 -77 114 113 163 9 111 -43 17 65 -150 -81 -44 259 -380 44 -135 127 -130
7935a30L06r8k3j23J98p9l05L18J6J70l96P5j50K71K9j58j46J52n8K61m06L73
$$ -130 176 78 55 -68 130 51 -254 64 80 250 -146 -71 -221 50 79 -79 -225 -73 -131 130 -276 97
7957I7j51p7K35o2K65j95j34l0Q1k6p7J1l86N49j14L1J54k06L55m08J06j6JM7
$$ 97 -54 -131 104 42 307 112 -22 -52 29 3 -74 -63 -449 100 -14 17 171 -35 320 -88 18 2 3 50
7981E0k15l4J72o2kq0J42R8k4K69j49Q2m66K64l63L73j10Mp5J36J53k98k3L3m2
$$ 50 -165 -199 -27 -89 -91 -171 -29 69 45 314 165 247 -219 45 -318 55 -55 -51 -126 10 163 -135 -158 -125 -167
8006a67J56o6J04n0j42j11J07K56mj50K44j22lk6J3k15N1nK09n7j33j53K91J27
$$ -167 -11 -77 27 -23 -165 -276 -169 87 83 -67 177 55 52 26 39 -176 -125 -130 79 22 -111 -264 27 154
8030A54l15J58R2J40m34L68k05P7J51j50R1j33q2K12Ml2j8j88K28j02o6J77j99
$$ 154 -161 -3 89 229 -205 163 -42 35 186 36 127 -6 -88 124 128 96 78 -110 118 16 -50 127 -72
8053g2J10m02K78oJ64l2n2K15j24L3j82K02r3k7n8L39k53l34J21J56RKJ68k92
$$ -72 38 -364 -86 -92 72 40 -12 203 79 112 -70 132 39 12 -46 293 40 -294 -173 -17 -8 -6 162 -130
8077a30J09P8p3K25j24j28K34l77M88k39j16J63j06j37l3L80m73R0L73k86M4j8
$$ -130 -21 57 -16 209 85 -43 191 -186 302 63 -53 110 4 -133 -166 214 -259 -169 204 -82 -38 -56
8099e6J34j08J40j60k33M25l74M31k51J40l95K95N3J39l25J10rj5J8j15L81j85
$$ -56 78 -30 110 -50 -283 142 -232 199 -52 88 -307 -12 41 180 -145 -35 -44 -59 -41 -156 225 40
8121D0P6l93L90j20n6L7p3k5J82n5r8M56j31j26j50J11l8L9j94K07L9J20o5j92
$$ 40 116 -277 113 -7 -63 -26 -99 -124 58 3 -95 361 230 104 -46 65 27 66 -128 79 118 238 173 -19
8145a9K38q8j85J68k93K18n7K19k55J43j00j44J51J65l37K19K1PM2j15j68K17
$$ -19 219 131 -54 114 -179 39 -18 201 -54 89 -11 -155 -4 161 -176 43 64 71 113 -2 -170 47
8167D7j49J34J19j17k32J05N0k15L31j58P5Q4Nl14K06L52j49J40j19k42K44k18
$$ 47 -102 32 151 34 -198 -93 -43 -258 73 -85 -10 74 79 -235 -29 323 174 314 195 -47 197 -21
8189b1K2R6
$$ -21 1 97
8191I7
$$ Imaginary data points
##PAGE= N=2
##DATA TABLE= (X++(I..I)), XYDATA
0@%%%%%%Qq%%Qj6J6k0K8l8M6n6O8p9R7j18J36j58J86k16K50k90L33l80M34m94
$$ 0 0 0 0 0 0 0 8 0 0 0 8 -8 8 -12 16 -22 24 -32 36 -43 54 -64 72 -86 100 -116 134 -156 177 -203 231 -263
32b63N60o29P09p99Q93r97J113j240J379j531J697j876K071k289K524k778L059
$$ -263 297 -332 377 -422 471 -526 587 -653 726 -805 892 -984 1087 -1202 1322 -1456 1603
49A603l367L709m090M512m978N503o104O791p582Q510r619J0963j2629J4762j7594
$$ 1603 -1764 1945 -2145 2367 -2611 2892 -3212 3579 -4003 4507 -5112 5851 -6778 7984 -9610
64i610K1536k7396L6962n5039R9963l95115n19409J296857k19040q02862Q93526
$$ -9610 11926 -15470 21492 -33547 66416 -328699 -848108 448749 229709 -573153 320373
75C20373K74792j095979K06104O72612m84782q5380N86655k98208m32077L03106
$$ 320373 595165 -500814 -294710 377902 -106880 -192260 394395 96187 -335890 -32784
85c2784J14549k18577J74870K30196k04711k70689J25806J58149k01665K2003
$$ -32784 81765 -136812 38058 268254 63543 -207146 -81340 76809 -124856 -102853
95a02853M24441j72105m78957L07911K25885m55215J88303M92395m67643k86491
$$ -102853 321588 149483 -329474 -21563 204322 -250893 -62590 429805 -37838 -324329
105c24329M62987j42667k61049M99849K5367m70503K08806J05623l83308K48747
$$ -324329 138658 -4009 -265058 234791 260158 -210345 -1539 104084 -279224 -30477
115c0477L49850l62497p9901K71222k21575j25361L07689J3741j49276L6645n2935
$$ -30477 319373 -43124 -123025 148197 -73378 -198739 108950 122691 -26585 10060 -42875
126d2875k0048P7383o7956P6919J60831k22456j15393K41379q6094j64997K65891
$$ -42875 -62923 14460 -53496 23423 184254 -38202 -153595 87784 1690 -163307 102584
137A02584M7529k52922P6389P5072j50676R9541J20783j32398J7210M4625j56739
$$ 102584 150113 -102809 -26420 48652 -102024 -2483 118300 -14098 3112 47737 -109002
148a09002M5517J63836p5002l1653N6825r1251k1174O3841k6864P5969L7528j84318
$$ -109002 -63485 100351 25349 -6304 50521 -40730 -61904 1937 -24927 51042 88570 -95748
160i5748M3461J64948j83872k3778K75611j48188k16344K51556J4788k42781J87729
$$ -95748 -52287 112661 -71211 -94989 180622 32434 -183910 67646 82434 -160347 27382
171B7382J22730k46994P0363J53910k22161J0569K26815j57834r2986K27563p4412
$$ 27382 150112 -96882 -26519 127391 -94770 -84201 142614 -15220 -108206 119357 44945
182D4945k00511J70253J05295j68966k183J24007o0152j04486O1768J12149m9255
$$ 44945 -155566 14687 119982 -48984 -51167 72840 12688 -91798 -30030 82119 32864
193C2864j05416Q2278O1175j47289J9777J71733j12881j02621J72212m1903j49644
$$ 32864 -72552 9726 70901 -76388 -56611 115122 2241 -100380 71832 29929 -119715
204a19715J81039L7120k25598J25214J47153k49676J1553K61553j73932j55703
$$ -119715 61324 98444 -127154 -1940 145213 -104463 -92910 168643 -5289 -160992
214a60992K64993j704k47556J28566J42046j82162k0424J60380n5990r9599P1715
$$ -160992 104001 102297 -145259 -16693 125353 -56809 -77233 83147 27157 -72442 -727
225g27L8296n4817K022M5254k2222m9431L9513M1176o4509M685Q7109p9516p3746
$$ -727 37569 -17248 -15226 30028 7806 -41625 -2112 39064 -25445 -20760 66349 -13167 -86913
238h6913J49530M355j70173J01884J20553j90130j6257K08884r7658j44896J65377
$$ -86913 62617 66972 -103201 -1317 119236 -70894 -87151 121733 24075 -120821 44556
249D4556L1667j60457P0685R2397j15517o626R3156n5030l0657P0934k9572n1656
$$ 44556 76223 -84234 -13549 78848 -36669 -43295 49861 -5169 -35826 35108 5536 -46120
261d6120N9064K2418n8974K658N2147j9289n5678L7511O5961o3620o0680R7025
$$ -46120 12944 35362 -23612 -20954 31193 11904 -43774 -6263 59698 -3922 -64602 32423
273C2423K3700j18369L9554J09302j01978o3878J28573n776j06955O7188M8351
$$ 32423 56123 -62246 -22692 86610 -15368 -79246 49327 43551 -63404 3784 52135
284E2135r2469J7532P0265o0342j7330O5057l9752m0723P4304O119p6845K6446
$$ 52135 -40334 -22802 47463 -12879 -30209 34848 -4904 -45627 28677 34796 -42049 -15603
296a5603N9806n0174l6649O7738J7180q1204K552Q6279k6762p3744N8049M2931
$$ -15603 44203 -5971 -42620 25118 42298 -38906 -36354 49925 23163 -50581 7468 50399
308E0399q4817o41Q6152m0187n7151O2589N494n6843M5011K5676p0501J9147N7397
$$ 50399 -34418 -35059 51093 10906 -46245 16344 21838 -35005 10006 35682 -34819 -15672 41725
321D1725o2687j6979Q6155l1903q2019P2770N3971r2162j0536R2831l4140p9527
$$ 41725 -20962 -37941 48214 16311 -65708 7062 61033 -31129 -41665 51166 17026 -62501
333f2501O8221N4872q2557k0283P9529j6563o0697M7302L0691o2716K187N1226
$$ -62501 5720 60592 -21965 -42248 37281 20718 -39979 7323 38014 -24702 -22515 28711
345B8711l1330j8777M9245k0934m7956N3726K3638p1491J5635O7887n7834m7092
$$ 28711 -2619 -21396 27849 6915 -41041 12685 36323 -35168 -19533 48354 -9480 -56572
357e6572Q8852J5486r6976K3525Q1732o0372m9097Q4664Q830q5401K9347O2176
$$ -56572 32280 47766 -49210 -25685 56047 -4325 -53422 31242 40072 -45329 -15982 46194
369D6194n2677k0855N6825k2825m1270M9738P220n1723L1430L0860o1504K978
$$ 46194 -6483 -27338 29487 6662 -34608 15130 22350 -29373 2057 32917 -28587 -25609
381b5609P2287l7276o0521O1596K9341p5775P407P8422l7693o7566N9284M3568
$$ -25609 46678 9402 -51119 10477 39818 -35957 -28550 49872 12179 -55387 3897 47465
393D7465o9374r452O9030k6837n5158N3689K7728n8801J0992M1195m5933o055
$$ 47465 -21909 -31361 37669 10832 -44326 9363 37091 -21710 -10718 30477 -15456 -21511
405b1511N7707l3749m2034O3487Q17p0040M6328N2609p9104j9263Q4799j8630
$$ -21511 36196 2447 -39587 23900 24717 -45323 1005 53614 -25490 -44753 40046 21416
417B1416o8210M6685L9857n9748j3299O0495l595n0283J5111L4003k7128j4984
$$ 21416 -46794 -109 39748 -20000 -33299 27196 23601 -26682 -11571 22432 -4696 -19680
429a9680L8054l216l7445K1467J9253l3263J4233L2498m7960j4895O3428k0470
$$ -19680 18374 15158 -22287 -820 18433 -14830 -597 31901 -16059 -30954 32474 12004
441A2004n4512N9536K4940q2209J3340P5414m6769m6386O2253J0557n9025J7056
$$ 12004 -42508 17028 41968 -40241 -26901 48513 1744 -44642 17611 28168 -30857 -13801
453a3801M2084k7856k2572K7008Q602j9821P11J2754j0041o521K0642j221k2391
$$ -13801 28283 427 -22145 4863 13465 -6356 -5645 7109 -2932 -9453 11189 9968 -12423
466a2423J7290J0204l9412J3819N2790m2939m1869O5421M430p4660M2398O3467
$$ -12423 4867 15071 -24341 -10522 42268 -671 -42540 22881 27311 -47349 -4951 58516
478E8516p4280l1743P6764j1707n6872M5504K8564n3732k031L9102j7102j5734
$$ 58516 -15764 -47507 29257 17550 -39322 6182 34746 -18986 -21017 18085 983 -14751
490a4751K6074k003k4027J4344J5685k5115m733L5948q296l9487K9014L1165n7644
$$ -14751 11323 9320 -14707 -363 15322 -9793 -14526 21422 13126 -26361 2653 33818 -23826
503b3826j0352P6569j9966p0268N5017L5218q1783Q889Q2726m4459n0025O0747
$$ -23826 -34178 42391 22425 -47843 7174 42392 -39391 -30502 52224 7765 -42260 18487
515A8487l411n5218M5411L0301n5293R295L6838m6784p591O3496k0091n0364M3803
$$ 18487 15076 -40142 5269 35570 -19723 -10428 26410 -20374 -27965 35531 15440 -34924 8879
528H879K2712o1383N375O5347k6415n3429M5173L0313o1000n461O4631k0288m9170
$$ 8879 31591 -29792 -24417 40930 14515 -38914 6259 36572 -24428 -29889 34742 14454 -34716
541c4716M4911J8628n9597J1536M9344l4489j2780M5485k8944l9110N2083J1135
$$ -34716 10195 28823 -30774 -19238 30106 -4383 -17163 28322 -622 -39732 12351 23486
553B3486m9727L0775L2348o2009r832O5083j3548m2547L5949J6335m8308k46M2245
$$ 23486 -26241 4534 36882 -25127 -34959 30124 16576 -25971 9978 26313 -21995 -22241 20004
566B0004o268k5571J2420J1978j8496p592J7574L746j1563M955M511j4218L060
$$ 20004 13736 -11835 585 12563 -5933 -13525 4049 7795 -3768 1187 5698 -8520 -5460
579e460J2106j3427Q09K4756j5421k7472K7223J2968l4318J1643L8512k9324l3496
$$ -5460 6646 -6781 -5972 18784 3363 -24109 3114 16082 -18236 -6593 31919 2595 -30901
592c0901L3782J5617l0312O355K8838j9474k6378J9134J7480j4679l564J3965
$$ -30901 2881 18498 -11814 -5459 23379 3905 -22473 -3339 14141 -538 -4102 9863
604I863r335j4485J4340P465j3567P149R399k2343m96K8342j6107k3034L5151
$$ 9863 528 -13957 383 7848 -5719 1430 10829 -11514 -12010 16332 225 -22809 12342
617A2342J0062m5097J0055M0733l3101k4358M9068N429m8700J3812L2915k9472
$$ 12342 22404 -22693 -12638 28095 -5006 -29364 19704 25133 -23567 -9755 23160 -6312
629f312j1422L6632o365k9326J5906J0320k1117J1395J8961k4905r339K8005j0262
$$ -6312 -17734 18898 12533 -16793 -887 9433 -11684 -289 18672 -6233 -15572 12433 2171
642B171k3423L0180J4667m2601j62M2806j8965l2570L5953J7146m4282K623M1148
$$ 2171 -21252 8928 23595 -19006 -19168 23638 4673 -27897 8056 25202 -19080 -16457 24691
655B4691k0062k8583L1926R988l1559Q866K2298k3752o878K7145r984j7910K3897
$$ 24691 4629 -23954 7972 17960 -13599 -4733 17565 -6187 -13065 14080 4096 -13814 10083
668A0083j62l2178J9077K8371l2968j2578L8980j0106l7622L0597K7269m0790
$$ 10083 9921 -22257 -3180 25191 -7777 -20355 18625 8519 -29103 1494 28763 -12027
680a2027j0036M0375r644l1491K5576J9039l1363m270K7717j0078j6587J9941
$$ -12027 -22063 18312 8668 -22823 2753 21792 -9571 -13841 13876 3798 -12789 7152
692G152L104k3093J1589J6974k3026l201K7799j5450k4164L1840J1837m1072O197
$$ 7152 10256 -12837 -1248 15726 -7300 -10501 17298 1848 -22316 9524 21361 -19711 -13514
705a3514L8628k5557k5313L8978N457m1709J2450L2370k3674j3765K6513m211
$$ -13514 25114 -443 -25756 13222 18679 -23030 -10580 21790 -1884 -15649 10864 6653
717F653k1473J5024J1481j5916J063J1132j2553k448J8798n807j9015J3583J3299
$$ 6653 -14820 204 11685 -4231 -3168 7964 -4589 -7037 11761 5954 -13061 522 13821
730A3821k2104l184K8357r319k9728K1473K2510l1035q022L4332j0397k9196K4419
$$ 13821 -8283 -11467 16890 7571 -22157 -684 21826 -9209 -17231 17101 6704 -22492 1927
743A927J6665k8792m40K2412j2968r506K0023l648j6558J3105O243j6690O681
$$ 1927 18592 -10200 -10640 11772 -1196 -10702 9321 5673 -10885 2220 8463 -8227 -1546
756a546J5641j6443j1386K1616L892k3112N306K1786j5604j9100K4786J2415l0456
$$ -1546 14095 -2348 -13734 7882 11774 -11338 -6032 15754 150 -18950 5836 18251 -12205
769a2205n02K7649j3149j9138K4429N697k6402P539J7661j5719j564J5881j3190
$$ -12205 -12707 14942 1793 -17345 7084 12781 -13621 -6082 11579 -4140 -5704 10177 -3013
782c013p736K0939m956j7718J7806P394k5347M628K5963j4671j9253K0211R117
$$ -3013 -10749 10190 5234 -12484 5322 12716 -12631 -8003 17960 3289 -15964 4247 13364
795A3364k3236P24K3484r080k0997J4822J3874j7835l781J7440p708j2375J4932
$$ 13364 -9872 -9148 14336 5256 -15741 -919 12955 -4880 -8661 8779 1071 -11304 3628
808C628L011j4620Q630O986j7524N682J9250j7572j0833K4534k903k4861J7631
$$ 3628 6639 -7981 649 7635 -9889 -4207 15043 -2529 -13362 11172 8269 -16592 1039
821A039J8180k5550q360K5402k030j9864J0289J2412j4607o763J4364K474j1795
$$ 1039 19219 -6331 -14691 10711 8681 -11183 -894 11518 -3089 -9852 4512 6986 -4809
834d809J386P003n745q75P177m484n278R402k317j0342J2877P121k0922Q93K3373
$$ -4809 -3423 3580 -2165 -3040 4137 -347 -5625 3777 1460 -8882 3995 11116 -9806 -8913 14460
849A4460j1638j7752K1532P408k6408M086K4220j2700j5784J6216M500j5400M308
$$ 14460 2822 -14930 6602 14010 -12398 -8312 15908 3208 -12576 3640 8140 -7260 -2952
862b952J0747q321m499O847k147l234P628j637r810O497Q191j1679k087J5798
$$ -2952 7795 -526 -5025 1822 -325 -3559 4069 2432 -7378 -881 7310 -4369 -6456 9342
876I342n827j7498J4176J4808j9322p184K1628m122j8697J3349J3236j8310m678
$$ 9342 3515 -13983 193 15001 -4321 -11505 10123 6001 -12696 653 13889 -4421 -9099
889i099J6530l906r864R345J360j0264N260N681r057K597Q847j1540n580J6877
$$ -9099 7431 3525 -6339 3006 4366 -5898 -638 5043 -4014 -1417 7430 -4110 -9690 7187
903G187oj7922P878J4478j5611p909K0440J057k0868O240J6482j0869r620J4266
$$ 7187 7181 -10741 -2863 11615 -3996 -11905 8535 9592 -11276 -5036 11446 577 -9043 5223
917E223J996j3947L476J0155o140l577O217m412l010Q498j903r293Q410M732j5286
$$ 5223 7219 -6728 -3252 6903 763 -2814 3403 -1009 -4019 4479 2576 -6717 1693 6425 -8861
932h861L123J8453j1683j5652J8337P333k1281L682J9864j2845j3606J6893N402
$$ -8861 -5738 12715 1032 -14620 3717 11050 -10231 -6549 13315 470 -13136 3757 9159
945I159j4882K812R455p656k939Q421k130m954M649p14n660O066N355j0326l774
$$ 9159 -5723 -2911 6544 -1112 -4051 4370 2240 -2714 1935 1221 -4439 1627 6982 -3344 -7118
960g118J2650j029j3865Q147J3017j6007r333K1789J387k1899Q503J6180j6871
$$ -7118 5532 4503 -9362 -1215 11802 -4205 -13538 8251 9638 -12261 -3758 12422 -4449
973d449o717J9722k537j4630Q823N207r772M543N859r772J552Q685q350l191J1810
$$ -4449 -11166 8556 6019 -8611 212 5419 -4353 190 6049 -3723 -2171 6514 -1836 -5027 6783
988F783l239j2064O883J0572j0087p158J1542L609j4513J239J6728p076j5568
$$ 6783 3544 -8520 -1637 8935 -1152 -8310 3232 6841 -7672 -6433 10295 3219 -12349
1001a2349J2527R659j6420J008J5582j0715r063J4552p92j0255J0947P86j4460
$$ -12349 178 9837 -6583 -5575 10007 -708 -9771 4781 3989 -6266 4681 5467 -8993
1014h993R301R886j6095N14J6607j0181j2660J5545N708j6249K85J3578l825j1554
$$ -8993 308 10194 -5901 -5387 11220 1039 -11621 3924 9632 -6617 -6332 7246 3421 -8133
1028h133O374R725r001q725J2885M849j4418K203J1677j0151l855J4009n683r008
$$ -8133 -1759 7966 -1035 -9760 3125 7974 -6444 -4241 7436 -2715 -6570 7439 1756 -7252
1042g252J2500k521j2811J5037O560k1510N744J7905j7534q188K3001l227k0050
$$ -7252 5248 2727 -10084 4953 11513 -9997 -4253 13652 -3882 -12070 10931 7704 -12346
1055a2346J0956J1459j2977l699J1178j055q201J755O656k121n985L353M170n503
$$ -12346 -1390 10069 -2908 -6607 4571 3516 -4685 -2930 3726 1605 -4380 -1027 3143 -2360
1069b360R52O236p364k303J1655o541q586J6415j117k0758J3456J5707k2480k290
$$ -2360 -1408 4828 -2536 -4839 6816 275 -8311 8104 6987 -13771 -315 15392 -7088 -9378
1083i378K3853j2542j7175K0352N583j9150N061J0757j0141j678Q221l602k867
$$ -9378 14475 1933 -15242 5110 10693 -8457 -3396 7361 -2780 -4458 3763 161 -2706
1096b706L369j354r02K709N02k742j736L509L634p409p02J1214o008j2248J5463
$$ -2706 663 -691 -1593 1116 1618 -1124 -2860 649 4283 -3126 -3828 7386 1378 -10870 4593
1111D593P239k1674L958J9308j5235r717K0956k636j7665J1028P267j2928M156
$$ 4593 11832 -9842 -5884 13424 -1811 -11528 9428 6792 -10873 155 7422 -5506 -1350
1124a350O954r795J320P597p166p90P775m752n363O438K863m221k537L045L974
$$ -1350 5604 -4191 -2871 4726 -2440 -3230 4545 -207 -5570 868 3731 -490 -3027 18 3992
1139C992n364l896J0819N39j5259O858J3988j4390n313J6861n961j3277J4058
$$ 3992 -1372 -5268 5551 6090 -9169 -2311 11677 -2713 -8026 8835 2874 -10403 3655
1152C655K941j3477P556M618j2030N441Q973j2754K8J2339q430o718J2104P76
$$ 3655 6596 -6881 675 5293 -6737 -1296 7677 -5077 -5049 7290 -1140 -7858 4246 5022
1166E022j0577K454P293k024n346J782O313l499q467Q166P838j3176j460J3746
$$ 5022 -5555 -3101 4192 2168 -3178 -1396 4917 1418 -7049 1117 8955 -4221 -5681 8065
1180H065p467q352J2835q48j1375Q792K413j0915Q418N768j5412M276J3432j3059
$$ 8065 598 -7754 5081 4233 -7142 1650 4063 -6852 1566 7334 -8078 -3802 9630 -3429
1194c429m711J6112n093j2857J1214N698j0148j67O508j800l060J032K824M65
$$ -3429 -8140 7972 2879 -9978 1236 6934 -3214 -3381 3127 1327 -1733 -701 2123 2588
1208B588m803k72O328l168l317N423k329m420P135j516o915Q871K4j2645Q973
$$ 2588 -2215 -2487 3841 673 -2644 2779 450 -3970 3165 1649 -5266 3605 3629 -9016 -43
1223d3R735j5612j383J6571q515j1277J4602L206j3742L614Q017n918j547L901
$$ -43 9692 -5920 -7303 9268 753 -10524 4078 7284 -6458 -2844 5173 -745 -2292 1609
1237A609l14j423n25j5K650k42l345J746N20j204K530k443k528O367k840p206
$$ 1609 1295 -128 -653 -668 1982 1740 -1605 141 661 -543 1987 -456 -2984 3383 543 -6663
1253f663R614M017j5064L358J4267j1656o799J5714k575j3514R440O402j0181
$$ -6663 2951 6968 -8096 -4738 9529 -2127 -8926 6788 4213 -9301 139 6541 -3640
1266c640J673O030o258M02N788m364j660N074k880l086M329J942m375j828L897
$$ -3640 -1967 4063 -2195 -1793 3995 -369 -2029 3045 165 -2921 1408 3350 -1025 -2853 1044
1281A044K409n704j490Q456k176j0528P223Q962j1838k854J2905m979r354J0785
$$ 1044 3453 -2251 -3741 4715 2539 -7989 -766 8196 -3642 -6496 6409 1430 -7924 2861
1295B861K426j0184L901M808o891K711N761p475r80P799m631m435P985L46q336
$$ 2861 5287 -4897 -996 3812 -3079 -368 5393 -2082 -3062 4737 106 -4329 3656 4002 -4334
1310d334J949O812k803n665L758M601n393m028P843K246j0209J255R380o026m590
$$ -4334 -2385 4427 1624 -4041 -283 4318 -1075 -5103 2740 4986 -5223 -3968 5412 -614 -5204
1325e204Q824j136p388N632K757p007L648M342q208J376Q541o737m345R483p58
$$ -5204 3620 2484 -4904 728 3485 -3522 126 4468 -3740 -2364 6177 -560 -4905 4578 3820
1340C820r999N569P254p759l849P728O08p118J555O433l700n381M910L773o183
$$ 3820 -6179 -610 6644 -1115 -4964 2764 3372 -3746 -2191 4242 542 -4839 71 3844 -2339
1355b339o0N465l776k664O396j731n196O100K99p814N729O391j0173j428J1219
$$ -2339 -2399 3066 -710 -3374 3022 1291 -3905 2195 2494 -5320 409 6800 -3373 -4801 6418
1370F418m603q792R495M017j1132L68R550l539o417N218K968n720m40M892j430
$$ 6418 1815 -6977 2518 6535 -4597 -4229 5321 1782 -4635 583 3551 -2169 -2609 2283 853
1385H53l372K237J368k653J193K473l749l86N121k850m403P106J278r069K937
$$ 853 -2519 -282 1086 -1567 -374 2099 -1650 -2036 3085 235 -4168 2938 4216 -4853 -1916
1400a916Q443o605n260R141M1q831L740O803o009l349N864m36m525K906K204l702
$$ -1916 6527 -78 -5338 3803 3844 -4987 -1247 5556 -453 -3802 2062 1626 -2899 7 2211 -1491
1416a491L2K923k111r75L748j469m475L909L492n680q65P104l092o268O391M869
$$ -1491 -1459 1464 -647 -1622 2126 657 -3818 91 3583 -2097 -2962 4142 1050 -5218 1173 6042
1432F042q647j226Q377k773o396N576L632o859l81N730k582l143L792J1l802K742
$$ 6042 -2605 -3831 4546 1773 -4623 953 4585 -2274 -2655 3075 493 -2650 1142 1153 -2649 93
1448I3J934l816K88L789l425k278N784M07o520K586N636n458l115P473K04p850
$$ 93 2027 -1789 -1501 2288 -1137 -3415 2369 2776 -3744 -1158 4478 -980 -4095 3378 3582 -4268
1464d268L002N529m611k586N689q91m829K717K812l450l38L000k544j272M131
$$ -4268 -1266 4263 -348 -2934 2755 1864 -2965 -248 2564 -886 -1224 1776 -768 -2040 2091
1479B091q69m511L285K656n441L14O425l116o160O302L430p545N33P193l936n354
$$ 2091 1222 -3289 -4 2652 -2789 -2475 3950 834 -5326 976 4406 -3139 -2606 4587 651 -4703
1495d703O095K332o010Q53M568l531j263L758q63l228K619R72l638J832L029m093
$$ -4703 1392 3724 -2286 -1433 3135 -396 -1659 2099 1236 -1992 627 1599 -2039 -207 2822 -1271
1511a271j860N460m03n439L232L990n416k340O896n00o351L427M234n498q48O047
$$ -1271 -3131 2329 1926 -3513 -281 3709 -1707 -4047 2849 2349 -4002 -575 3659 -1839 -2687 3360
1527C360k023m369L629J293l553K068K088m322O30M052k968k371M256j49m681
$$ 3360 1337 -3032 597 1890 -1663 405 2493 -1829 -1199 2853 -115 -2486 1770 1621 -3060
1542c060K315M305m036k829M616O51m930J340M788l246l249M111J800m546J047
$$ -3060 -745 3560 -476 -3305 1311 1962 -2968 -1628 3160 -86 -3335 776 2576 -1970 -923
1557i23L359k980j185L824j297k288K817Ql925L169K555m842J09M517k554l875
$$ -923 2436 -544 -1729 2095 798 -1490 1327 1335 -2590 579 3134 -1708 -1599 2918 364 -3511
1573c511M638K207n711j5M938k038l598L387K035m368j62M269r40l465K331J271
$$ -3511 1127 3334 -2377 -2392 2546 508 -3090 297 2332 -2036 -2198 2071 1131 -2334 -3 1268
1589A268k558J135K546k889q54L226j716k604M604N06n568K232M267m406j869
$$ 1268 -1290 -155 2391 -498 -1352 1874 158 -2446 2158 2664 -2904 -672 3595 -811 -2680
1604b680N321j059m764K790L143l662j291L512o31k680J709J379j919l05J688
$$ -2680 2641 1582 -3182 -392 2751 -911 -2202 1310 679 -2001 -292 1087 -832 -1137 551
1619E51l99j090J694K87k632J419K407l107m94M102j875m247M023L056n686l03
$$ 551 152 -938 756 1043 -1589 -170 2237 -870 -1364 2738 863 -3384 639 3695 -1991 -2294
1635b294N481k642m339M937J987n673O43M285k874j707L457k48l192J940J687
$$ -2294 3187 545 -3794 1143 3130 -2543 -1900 2385 -489 -2196 1261 1013 -2179 -239 1448
1650A448k401rK855k185j911L514Q00m195J437L692l615j930N109K8n631K127
$$ 1448 -953 -962 1893 -292 -2203 1311 2111 -2084 -647 3045 -570 -2500 2609 2637 -2994 -867
1666h67M141m189j677N114j467m191L316J862l667R82K198k427j148L551j099
$$ -867 3274 -915 -2592 2522 1055 -3136 180 2042 -1625 -643 1555 -872 -2020 1531 432
1681D32k484K500J241l701J014L764k816k618L779J520m263M18M274k513l427
$$ 432 -2052 448 1689 -2012 -998 2766 -50 -2668 1111 2631 -1632 -1214 3060 547 -2880
1696b880L778J990m813M98L836k488k360L749n7l400J836J552k725P67K964k933
$$ -2880 898 2888 -1925 -1427 2409 -79 -2439 1310 1253 -2147 -311 1241 -1484 -717 2247 -686
1712f86j631L735k23l562K609K578l980q85M238o29l526J904K747l432j032L622
$$ -686 -2317 1418 1195 -2367 242 2820 -1160 -2045 2193 1564 -1962 -58 2689 -743 -1775 1847
1728A847l62l296J630J827k428p9K367j521j624K278N2k470J683J679l207l9M109
$$ 1847 1485 -1811 -181 1646 -782 -861 1506 -15 -1639 639 691 -1779 -96 1583 -1624 -1663 2446
1745B446j990l064L504J320m496Q42M453k646l048L769Q15l856J672K748k505
$$ 2446 456 -2608 896 2216 -2280 -1438 3015 369 -2679 1090 1905 -1951 -279 2469 -36
1760c6j500K656k02k062J326J224k613K91K420j637j946K890Q6k945K039K222
$$ -36 -1536 1120 918 -1144 182 1406 -1207 -916 1504 -133 -2079 811 897 -2048 -9 2213
1776B213l192j245L672k70l537K438K553l784q05L849o11l069K295J226k704L86
$$ 2213 -979 -2224 1448 1178 -2359 79 2632 -1152 -1957 1892 1281 -1788 507 1733 -971 -585
1792e85K113j599j045K219o82j966K034Q24k571j78L030j837j709K803N53l349
$$ -585 1528 -71 -1116 1103 421 -1545 489 1313 -1258 -1436 1594 -243 -1952 851 1404 -1945
1808a945P39L395k286j880K614Q71l116Q73K820j976j439K642p19j472J513O55
$$ -1945 -1206 2189 -97 -1977 637 1508 -1608 -735 2085 109 -1330 1312 593 -879 634 1289
1824A289k498R21J567j897m51K687r65k713K240J546l204J88K877j484k198K153
$$ 1289 -1209 -288 1279 -618 -1069 1618 653 -2060 180 1726 -1478 -1290 1587 103 -2095 58
1840E8J468k372k37J748k50j490J736M15j674J36J522r17o05J452m70j595J666
$$ 58 1526 -846 -1083 665 415 -1075 661 1076 -598 -462 1060 143 -462 990 520 -1075 591
1857E91P09j939m1K254j696j519K735O2k559N78K107j738p71J940J4k347R87J203
$$ 591 1300 -639 -680 1574 -122 -1641 1094 1156 -1403 -825 1282 -456 -1227 713 727 -1620 -633 570
1875E70r24l65J221j51j143Q34K96o81K73J223j432l65J635l98j616J223J271
$$ 570 -354 -719 502 351 -792 42 338 -343 -70 1153 -279 -644 991 593 -1023 200 1471
1892A471k428j67K886q76k578J880J116k168l9K157j574j075J668N89j791P77
$$ 1471 -957 -1124 1762 886 -1692 188 1304 -864 -903 1254 -320 -1395 273 862 -929 -152
1908a52O96j271K74J568o48j545J865K36j929P72J861j903j258K491J58k400R95
$$ -152 544 -727 -453 1115 467 -1078 787 1023 -906 -134 1727 -176 -1434 1057 1215 -1185 -190
1925a90J785j913j062K303j87j982Q08J598j975q9J684r83r80J658k73j518J635
$$ -190 1595 -318 -1380 923 736 -1246 -438 1160 -815 -904 780 -203 -1183 475 202 -1316 319
1942C19Q45j925j4K292j253j263J891L07k363N34K421j326j532J654M37k101L89
$$ 319 1164 -761 -775 1517 264 -999 892 1199 -1164 -630 1791 465 -1067 587 1024 -1077 -688
1959f88J829j154j038J597j42j464J386K20j408J84J502j021r70K202o72k114
$$ -688 1141 -13 -1051 546 404 -1060 326 546 -862 -678 824 -197 -1167 1035 363 -1751
1975a751J802J440k193n63K533q96j765J891J365k265m97J940p49j093J126L54
$$ -1751 51 1491 -702 -1265 1268 372 -1393 498 1863 -402 -899 1041 292 -801 325 679
1991F79j193J91P42n83k02Q23n74j159J483L54j581K16J976j492j021K064K13
$$ 679 -514 -323 419 -164 -366 457 -117 -1276 207 561 -1020 -804 1172 -320 -1341 723 936
2008I36j610oK006j353j148J926K84j760M69J295p24j074J203l63o99O78J60p44
$$ 936 -674 -680 1326 -27 -1175 751 1035 -725 -256 1039 315 -759 444 81 -618 60 220 -524
2026e24K26O75r12p5J326l86j432P12J471j762k58J858m76j827J226J338j369
$$ -524 -298 377 -535 -610 716 330 -1102 -390 1081 -681 -939 919 443 -1384 -158 1180 -189
2043a89p33J727k4j677Q86J308j449o15J524o45q49J286j46j285R19N02j128j40
$$ -189 -922 805 781 -896 -10 1298 -151 -766 758 113 -736 550 404 -881 38 540 -588 -728
2061g28J752r50j517J927N79k064K85J796q93j424J663Q29j782L4J665p61r93
$$ -728 1024 74 -1443 484 1063 -1001 -716 1080 187 -1237 426 1255 -527 -493 1172 411 -582
2078e82J162K84j397K42J090j010k43J176r00n87J390o5j633Q81J121j504p43
$$ -582 580 864 -533 -291 799 -211 -454 722 -178 -765 625 560 -1073 -192 929 -575 -1318
2095a318K321q30j464J355Q53j642j00J898r21j197J340N99j244J40P92m21n95
$$ -1318 1003 173 -1291 64 917 -725 -825 1073 152 -1045 295 894 -350 -210 582 161 -434
2112d34Q21Q4r54P83N69j637J45J635j162j345J801N10j973P10J650j819n73J944
$$ -434 387 471 -483 300 869 -768 -623 1012 -150 -1495 306 816 -1157 -447 1203 -616 -1189 755
2130G55l82j304P58R27j160J82R63o11m02K29K09l12M57J42r27N02M81m22o17
$$ 755 373 -931 -173 754 -406 -224 739 128 -274 -45 164 -148 309 451 -476 26 507 85 -532
2149e32R91j34p45m1J168m64j061Q29P64j371r7J265p6j344P90P07j086L63K52
$$ -532 459 325 -420 -461 707 243 -818 11 775 -596 -693 572 496 -848 -58 649 -437 -74 178
2168A78k97Q1M06l48J37M26m79m58M18M83m48l23M99J03q27L66O18o84n27N72
$$ 178 -119 -38 368 20 157 583 104 -354 64 547 99 -224 275 378 -449 -83 535 -149 -676 -104
2188a04O29j152j36R98k41r74J007K96r57N37M09k89j40N71o56j39P70m65n89
$$ -104 525 -627 -763 235 -6 -980 27 323 -634 -97 312 23 -117 454 -202 -341 429 -36 -625
2207f25J071K75j167M03Q05p11m76Q16J98o75k88P40M2r62O05L79r02j51Q07L6
$$ -625 446 721 -446 -43 762 51 -425 391 589 -86 -374 366 408 -554 51 430 -472 -623 184 220
2227B20n50N45j56p55Q36K77q33N02M82r02l50J399m76r78Q79P79j160r2Q69n33
$$ 220 -330 215 59 -696 140 417 -416 86 568 -334 -684 715 239 -739 140 919 -241 -333 536 3
2247Cl86N47K82o09M8J17O3j53RN9j27j20L00j10r0J007p17r02Q46P34j470K42
$$ 3 -383 164 446 -163 -115 2 65 -88 -79 -20 -147 -267 33 -77 -167 840 123 -779 67 801 -669 -427
2269d27J439j022q58J331M40j293L23P25o99l05Q43l34n71O64m04J37J69j0o29
$$ -427 1012 -10 -868 463 903 -390 -67 658 -41 -346 497 163 -408 256 -148 -11 158 148 -481
2288d81K86K55l57j17K56M10o18K4R31m92o02K24P86n48l26P62r6q23M82M86p50
$$ -481 -195 60 -297 -414 -158 252 -366 -342 589 97 -505 -281 505 -43 -369 393 297 -526 -44 442 -308
2309c08L5P59o52j23M83j04q0o8K19o94O42J76r03L17M32k76l54K79P51l02p73
$$ -308 -273 486 -166 -289 194 90 10 -58 161 -533 109 285 -618 -301 131 -145 -499 -220 531 229 -544
2330e44O94L04q58K24P30j32r79P84L30q33K13L72n93M33M3m00l23O29j6n12O24
$$ -544 150 454 -404 -180 550 418 -561 223 553 -280 -67 305 -288 145 188 -212 -535 94 78 -434 190
2351A90k73k90k64R53m40k25K91M28o29j45P39K1n94K53O48n65l16N72l8n38K40
$$ 190 -83 -373 -637 316 -124 -349 -58 370 -259 -404 335 356 -238 15 663 98 -218 354 316 -222 18
2372A8K06l95M73J42o92K06P60r27m26R17n0q88N23N73p23m23Q70j25m64M27L50
$$ 18 224 -171 302 444 -248 -42 718 -209 -635 282 232 -656 -133 440 -283 -706 164 39 -425 2 352
$$ [...]
8191e6
##END NTUPLES=NMR FID
##END=
