##TITLE=1H_3MBDE-2
 CDCl3
 8 sc, 
 22.11.2022
##JCAMPDX= 6.0         $$ Bruker NMR JCAMP-DX V2.0
##DATA TYPE= NMR FID
##DATA CLASS= NTUPLES
##ORIGIN= UXNMR, Bruker Analytische Messtechnik GmbH
##OWNER= root
$$ XWIN-NMR		Version 3.5
$$ Tue Nov 22 15:40:16 2022 Russian Standard Time (UT+4h)  she@DPX200
##.OBSERVE FREQUENCY= 200.1313499994
##.OBSERVE NUCLEUS= ^1H
##.DELAY= (6, 6)
##.ACQUISITION MODE= SIMULTANEOUS
##.ACQUISITION SCHEME= undefined
##.AVERAGES= 8
##.DIGITISER RES= 18
##SPECTROMETER/DATA SYSTEM= spect
##.PULSE SEQUENCE= zg30
##.SOLVENT NAME= CDCl3
##.SHIFT REFERENCE= (INTERNAL, CDCl3, 0, 15.7039)
##AUDIT TRAIL= $$ (NUMBER, WHEN, WHO, WHERE, WHAT)
$$ ##TITLE= Audit trail, XWIN-NMR		Version 3.5
$$ ##JCAMPDX= 5.01
$$ ##ORIGIN= Bruker BioSpin GmbH
$$ ##OWNER= she
$$ F:/spectra/data/she/nmr/H-F/1/audita.txt
$$ ##AUDIT TRAIL=  $$ (NUMBER, WHEN, WHO, WHERE, WHAT)
(   1,<2022-11-22 15:39:10.51 +0400>,<she>,<DPX200>,
      <created by zg, POWCHK disabled, PULCHK disabled
       configuration hash MD5:
       00 E9 B6 7A A2 85 ED C7 34 08 36 98 17 FE 4E 26
       data hash MD5: 16K
       82 2D 91 A4 33 31 DE E3 56 CD AF 03 E3 95 EA EA>)
$$ ##END=
$$ 
$$ hash MD5
$$ 9B 5B 53 AD 76 26 09 B0 E1 B9 16 C3 C3 D6 D0 12
##$RELAX= 
##$RELAX= 
##$RELAX= 
##$RELAX= 
##$RELAX= 
##$RELAX= 
$$ Bruker specific parameters
$$ --------------------------
##$DU= <F:/spectra>
##$EXPNO= 1
##$NAME= <H-F>
##$PROCNO= 1
##$TYPE= <nmr>
##$USER= <she>
##$AMP= (0..31)
100 100 100 100 100 100 100 100 100 100 100 100 100 100 100 100 100 100 
100 100 100 100 100 100 100 100 100 100 100 100 100 100 
##$AQSEQ= 0
##$AQ_mod= 1
##$AUNM= <au_zg>
##$AUTOPOS= <>
##$BF1= 200.13
##$BF2= 200.13
##$BF3= 200.13
##$BF4= 200.13
##$BF5= 200.13
##$BF6= 200.13
##$BF7= 200.13
##$BF8= 200.13
##$BYTORDA= 1
##$CFDGTYP= 0
##$CFRGTYP= 5
##$CHEMSTR= <none>
##$CNST= (0..31)
1 1 145 1 1 1 1 1 1 1 1 1 1 1 1 1 1 1 1 1 1 1 1 1 1 1 1 1 1 1 1 1 
##$CPDPRG= <>
##$CPDPRG1= <>
##$CPDPRG2= <>
##$CPDPRG3= <>
##$CPDPRG4= <mlev>
##$CPDPRG5= <mlev>
##$CPDPRG6= <mlev>
##$CPDPRG7= <mlev>
##$CPDPRG8= <mlev>
##$CPDPRGB= <>
##$CPDPRGT= <>
##$D= (0..31)
0 1.2 0 0 0 0 0 0 0 0.06 0 0.03 0 0 0 0 0.0002 0 0 0 0 0 0 0 0 0 0 0 0 
0 0 0 
##$DATE= 1669117149
##$DBL= (0..7)
120 120 120 120 120 120 120 120 
##$DBP= (0..7)
150 150 150 150 150 150 150 150 
##$DBP07= 0
##$DBPNAM0= <>
##$DBPNAM1= <>
##$DBPNAM2= <>
##$DBPNAM3= <>
##$DBPNAM4= <>
##$DBPNAM5= <>
##$DBPNAM6= <>
##$DBPNAM7= <>
##$DBPOAL= (0..7)
0.5 0.5 0.5 0.5 0.5 0.5 0.5 0.5 
##$DBPOFFS= (0..7)
0 0 0 0 0 0 0 0 
##$DE= 6
##$DECBNUC= <off>
##$DECIM= 32
##$DECNUC= <off>
##$DECSTAT= 4
##$DIGMOD= 1
##$DIGTYP= 9
##$DL= (0..7)
0 120 120 120 120 120 120 120 
##$DP= (0..7)
150 150 150 150 150 150 150 150 
##$DP07= 0
##$DPNAME0= <>
##$DPNAME1= <>
##$DPNAME2= <>
##$DPNAME3= <>
##$DPNAME4= <>
##$DPNAME5= <>
##$DPNAME6= <>
##$DPNAME7= <>
##$DPOAL= (0..7)
0.5 0.5 0.5 0.5 0.5 0.5 0.5 0.5 
##$DPOFFS= (0..7)
0 0 0 0 0 0 0 0 
##$DQDMODE= 0
##$DR= 18
##$DS= 0
##$DSLIST= <SSSSSSSSSSSSSSS>
$$ [...]
##$SUBNAM2= <"">
##$SUBNAM3= <"">
##$SUBNAM4= <"">
##$SUBNAM5= <"">
##$SUBNAM6= <"">
##$SUBNAM7= <"">
##$SUBNAM8= <"">
##$SUBNAM9= <"">
##$SW= 18.0517283424941
##$SWIBOX= (0..15)
0 0 2 0 0 0 0 0 0 0 0 0 0 0 0 0 
##$SW_h= 3612.71676300578
##$TD= 16384
##$TD0= 1
##$TE= 0
##$TE2= 300
##$TE3= 300
##$TEG= 300
##$TL= (0..7)
0 120 120 120 120 120 120 120 
##$TP= (0..7)
150 150 150 150 150 150 150 150 
##$TP07= 0
##$TPNAME0= <>
##$TPNAME1= <>
##$TPNAME2= <>
##$TPNAME3= <>
##$TPNAME4= <>
##$TPNAME5= <>
##$TPNAME6= <>
##$TPNAME7= <>
##$TPOAL= (0..7)
0.5 0.5 0.5 0.5 0.5 0.5 0.5 0.5 
##$TPOFFS= (0..7)
0 0 0 0 0 0 0 0 
##$TUNHIN= 0
##$TUNHOUT= 0
##$TUNXOUT= 0
##$USERA1= <user>
##$USERA2= <user>
##$USERA3= <user>
##$USERA4= <user>
##$USERA5= <user>
##$V9= 5
##$VALIST= <valist>
##$VCLIST= <CCCCCCCCCCCCCCC>
##$VD= 0
##$VDLIST= <DDDDDDDDDDDDDDD>
##$VPLIST= <PPPPPPPPPPPPPPP>
##$VTLIST= <TTTTTTTTTTTTTTT>
##$WBST= 1024
##$WBSW= 4
##$XGAIN= (0..3)
0 0 0 0 
##$XL= 0
##$YL= 0
##$YMAX_a= 200974
##$YMIN_a= -248202
##$ZGOPTNS= <>
##$ZL1= 120
##$ZL2= 120
##$ZL3= 120
##$ZL4= 120
##$ABSF1= 10
##$ABSF2= 0
##$ABSG= 5
##$ABSL= 3
##$ALPHA= 0
##$AQORDER= 0
##$ASSFAC= 0
##$ASSFACI= 0
##$ASSFACX= 0
##$ASSWID= 0
##$AUNMP= <proc_1d>
##$AZFE= 0.1
##$AZFW= 0.1
##$BCFW= 1
##$BC_mod= 2
##$BYTORDP= 1
##$COROFFS= 0
##$CY= 11.3945322036743
##$DATMOD= 1
##$DC= 2
##$DFILT= <>
##$DTYPP= 0
##$F1P= 2.36226072786647
##$F2P= -0.459571619588291
##$FCOR= 0.5
##$FTSIZE= 0
##$FT_mod= 4
##$GAMMA= 1
##$GB= 0.15
##$INTBC= 1
##$INTSCL= 1
##$ISEN= 128
##$LB= 0.24
##$LEV0= 0
##$LPBIN= 0
##$MAXI= 10000
##$MC2= 0
##$MEAN= 0
##$ME_mod= 0
##$MI= 1.114404
##$NCOEF= 0
##$NC_proc= 0
##$NLEV= 6
##$NOISF1= 3.799351
##$NOISF2= 2.8
##$NSP= 1
##$NTH_PI= 0
##$NZP= 0
##$OFFSET= 15.70392
##$PC= 1
##$PHC0= -18048.46
##$PHC1= 33.40071
##$PH_mod= 1
##$PKNL= yes
##$PPARMOD= 0
##$PSCAL= 0
##$PSIGN= 0
##$REVERSE= no
##$SF= 200.130013532006
##$SI= 16384
##$SIGF1= 3
##$SIGF2= 2
##$SINO= 400
##$SIOLD= 16384
##$SREGLST= <1H.CDCl3>
##$SSB= 0
##$STSI= 0
##$STSR= 0
##$SW_p= 3612.71676300578
##$SYMM= 0
##$S_DEV= 0
##$TDeff= 0
##$TDoff= 0
##$TI= <>
##$TILT= no
##$TM1= 0
##$TM2= 0
##$TOPLEV= 0
##$USERP1= <user>
##$USERP2= <user>
##$USERP3= <user>
##$USERP4= <user>
##$USERP5= <user>
##$WDW= 1
##$XDIM= 8192
##$YMAX_p= 0
##$YMIN_p= 0
$$ End of Bruker specific parameters
$$ ---------------------------------
##NTUPLES= NMR FID
##VAR_NAME=  TIME,          FID/REAL,        FID/IMAG
##SYMBOL=    X,             R,               I
##VAR_TYPE=  INDEPENDENT,   DEPENDENT,       DEPENDENT
##VAR_FORM=  AFFN,          ASDF,            ASDF
##VAR_DIM=   8192,          8192,            8192
##UNITS=     SECONDS,       ARBITRARY UNITS, ARBITRARY UNITS
##FACTOR=    0.0002768,     1,               1
##FIRST=     0,             0,               0
##LAST=      2.2672688,     0,               0
##MIN=       0,             -248202,         0
##MAX=       2.2672688,     200974,          0
$$ Real data points
##PAGE= N=1
##DATA TABLE= (X++(R..R)), XYDATA
$$ plain form
0 0 0 0 0 0 0 0 0 0 0 0 0 8 -8 8 -8 16 -16 23 -24 32 -34 40 -49 62 -72 81 -96 112 -128 146 -169 193 -218
33 -218 248 -281 315 -354 399 -446 496 -553 617 -682 756 -837 924 -1020 1126 -1239 1365
50 1365 -1503 1657 -1825 2014 -2223 2462 -2732 3039 -3395 3817 -4317 4928 -5692 6680 -8010
65 -8010 9908 -12850 18052 -29985 118434 -79907 -176337 200974 -16719 -170877 119440
76 119440 110455 -154828 13258 96611 -94913 -41140 109285 -23552 -62793 46301 14169
87 14169 -58038 2424 34148 942 -22013 4933 21849 -22049 -33962 43778 26129 -44631
99 -44631 13701 38208 -56102 -13745 66499 -17501 -34199 53904 -4995 -53373 38154 24537
111 24537 -42739 22285 29601 -45520 -5249 30246 -25113 -6843 28004 -16560 -13464 15081
$$ packed form
0@%%%%%%%%%%%Qj6J6j6K4l2L9m7N6o6P4q9J11j34J53j77K08k40K74l15L62m11
33b18M66n29N96o69P53q45R42j049J170j299J438j593J761j944K146k365K604
50A365k868L160l482L839m237M685n194N771o434P212q134R245j0620J2372j4690
65h010J7918k2758L0902m8037J48419j98341r6430L77311k17693j54158K90317
76A19440q985k65283J68086Q3353j91524N3773J50425j32837l9241J09094l2132
87A4169p2207O0462L1724l3206k2955K6946J6916m3898j1913P7740j7649p0760
99d4631N8332K4507r4310M2357Q0244q4000j6698Q8103n8899m8378R1527j3617
111B4537o7276O5024P316p5121M0271L5495n5359J8270L4847m4564L096K8545
$$ plain form
123 15081 -15871 -5857 22920 -14392 -8648 26756 -17645 -23752 35535 5867 -30707 22450
135 22450 17084 -32811 7090 31244 -17449 -7615 26797 -8600 -21345 15589 8207 -17281 2280
148 2280 14119 -11997 -18881 8452 11468 -16858 -6767 22122 -5956 -26279 18080 18558 -26537
161 -26537 2393 30227 -22188 -19140 34414 -549 -28755 24914 14978 -35026 7190 30927
173 30927 -23581 -12720 32602 -4912 -26377 19103 12331 -24675 1009 20238 -12845 -15028
185 -15028 13149 1576 -18015 2189 12400 -9621 -8967 11323 798 -12661 8018 11863 -10869
198 -10869 -2427 15985 -2894 -10389 12520 5718 -12130 4173 11349 -7973 -5845 8335 -443
211 -443 -6742 2114 1866 -4987 -2971 897 381 -2418 -2622 1477 -588 -5548 1506 5723 -4887 -2802
$$ packed form
123A5081l0952J0014K8777l7312N744L5404m4401o107N9287k9668l6574N3157
135B2450n366m9895L9901K4154m8693R834L4412l5397j2745L6934p382k5488J9561
148B280J1839k6116o884K7333L016k8326J0091K8889k8078k0323M4359M78m5095
161b6537K8930K7834n2415L048N3554l4963k8206N3669r936n0004M2216K3737
173C0927n4508J0861M5322l7514k1465M5480o772l7006K5684J9229l3083k183
185a5028K8177j1573j9591K0204J0211k2021O54K0290j0525j3459K0679L845k2732
198a0869Q442J8412j8879p495K2909o802j7848J6303P176j9322K128J4180q778
211d43o299Q856k48o853K016L868n16k799k04M099k065m960P054M217j0610K085
$$ plain form
227 -2802 7931 -1648 -6178 9619 4811 -10757 3665 12314 -7016 -5257 13395 -285 -11811
240 -11811 6998 7608 -10997 -2231 10291 -5155 -9343 7505 2159 -10740 1406 7020 -8416
253 -8416 -5316 9280 -1644 -10738 6183 7638 -9659 -1453 11823 -2797 -7227 10755 5165
266 5165 -10027 3479 10814 -5901 -3941 10038 -1785 -8699 6089 3688 -9133 202 5990
279 5990 -7321 -4987 6211 -1437 -7675 2893 2577 -6100 -469 4906 -1401 -3287 2956 2031 -1494
294 -1494 885 2815 657 6 1249 999 159 297 1546 1027 -830 -308 1073 -599 -1706 724 13
311 13 -3948 -1643 1932 -1995 -3918 2002 496 -5314 -18 4809 -2432 -3071 4770 972 -4972 3710
327 3710 5744 -3968 -827 7017 -1162 -3928 6042 2219 -6179 2156 5835 -5461 -3103 6472 -1765
$$ packed form
227b802J0733r579m530J5797m808j5568J4422Q649j9330J759J8652j3680j1526
240a1811J8809O10j8605Q766J2522j5446m188J6848n346j2899J2146N614j5436
253h416L100J4596j0924r094J6921J455j7297Q206J3276j4620m430J7982n590
266E165j5192J3506P335j6715J960J3979j1823o914J4788k401j2821R335N788
279E990j3311K334J1198p648o238J0568l16q677N631N375o307j886O243r25l525
294a494K379J930k158o51J243k50q40J38J249n19j857N22J381j672j107K430p11
311A3l961K305L575l927j923N920j506n810N296M827p241o39P841l798n944Q682
327C710K034r712L141P844q179k766R970l823q398Q335L679j1296K358R575q237
$$ plain form
342 -1765 -7503 3854 2840 -7510 -657 5720 -4670 -5414 5612 309 -6993 2874 4917 -5204
356 -5204 -1027 6525 -1655 -3413 6333 2749 -5046 2732 4986 -3378 -44 6168 -1401 -4539 3790
371 3790 1483 -4568 505 2459 -3774 -2576 1611 -1356 -2645 717 197 -3057 -330 967 -919
386 -919 -280 1362 85 -246 1642 1177 307 931 1145 942 858 335 690 1572 344 -1058 390 827 -1444
405 -1444 -574 1339 -2102 -2873 1138 -233 -3951 177 1415 -3366 -1290 2900 -1505 -2415 3501 980
421 980 -3551 2566 4315 -2284 157 4977 -966 -2694 4821 2287 -3942 1480 4070 -3410 -1844
436 -1844 4058 -1225 -4488 2212 901 -5480 -89 3520 -3903 -3010 3821 -1204 -4774 3088 2504 -4364
452 -4364 536 4618 -2360 -1985 5128 1194 -2473 2847 2872 -2787 1063 3994 -1575 -1827 2507 89
$$ packed form
342a765n738J1357j014j0350O853O377j0390p44J1026n303p302R867K043j0121
356e204M177P552q180j758R746l584p795P778K254q364L334O212p569l138Q329
371C790k307o051N073J954o233J198M187k967j289L362n20l254K727J297j886
386i19O39J642j277l31J888m65q70O24K14k03q4n23L55Q82j228j402J448M37k271
405a444Q70J913l441p71M011j371l718M128J238m781K076M190m405r10N916k521
421I80m531O117J749o599K441M820n943j728P515k534o229N422K590p480J566
436a844N902n283l263O700j311o381N391L609p423Q93O831n025l570P862n84o868
452d364M900M082o978L75P113l934l667N320K5n659L850K931n569k52M334k418
$$ plain form
468 89 -2560 1022 799 -2604 -829 1232 -1559 -1878 937 27 -2275 -987 161 -544 -327 741 411
485 411 -169 485 811 725 942 1059 840 1298 144 91 1307 968 -963 622 387 -1848 -182 1620 -2023
504 -2023 -2264 1710 -993 -3240 1134 990 -4072 -152 3081 -2496 -1942 3843 -268 -3363 2870 2484
520 2484 -2635 1855 3807 -1882 -1377 4096 860 -2400 2530 1957 -2805 -855 2605 -1298 -2319 1983
536 1983 467 -3626 -818 1337 -1879 -1705 2228 -821 -3101 1372 1298 -2460 188 2573 -1275 -1162
552 -1162 2988 475 -1225 2116 1458 -1563 1169 2476 -678 10 1369 -1082 -630 1423 -548 -1716
568 -1716 606 -859 -2399 42 301 -1354 -289 455 -1518 -1233 665 -53 -346 1073 191 -844 900
585 900 1268 -115 476 2396 255 -781 1765 1244 -736 754 1879 -1709 -1467 1738 -357 -2459
$$ packed form
468H9k649L582k23l403J775K061k791l19K815r10k302J288J148p05K17J068l30
485D11n80O54L26q6K17J17k19M58j154n3J216l39j931J585k35k235J666J802l643
504b023k41L974k703k247M374j44n062L920L233n577N54N785m111l095O233l86
520B484n119M490J952n689N05N473l236l260M930n73m762J950L460l903j021M302
536A983j516m093K808K155l216J74L933l049k280M473p4l758K648K385l848J13
552a162M150k513j700L341o58l021K732J307l154O88J359k451M52K053j971j168
568a716K322j465j540K441K59j655J065P44j973K85J898p18k93J419q82j035J744
585I00L68j383N91J920k141j036K546n21j980J490J125l588K42L205k095k102
$$ plain form
601 -2459 537 893 -2380 -439 1058 -2319 -1658 1671 -758 -1904 1429 864 -2265 651 1853 -841
617 -841 211 2839 558 -1335 1337 1193 -348 1160 1294 -531 -84 733 -998 -926 1224 -284 -1576
634 -1576 -374 -247 -2021 -317 1016 -1304 -1439 851 -607 -1221 873 763 -964 941 1432 -950
650 -950 266 2478 -428 -522 2103 634 -1460 1695 1766 -1572 -546 1774 -571 -1543 750 -270 -1894
667 -1894 -86 418 -1888 -961 1272 -1197 -1719 1296 315 -1878 958 2048 -1472 -623 3012 334
683 334 -1513 2318 1770 -1446 978 2031 -1103 -182 2327 -619 -1556 1523 213 -2037 336 136
699 136 -2567 -442 1403 -1110 -1573 585 -258 -1427 109 654 -124 91 442 42 491 784 1027 674
717 674 561 642 158 458 1310 353 -383 406 268 -1154 -92 239 -485 -645 -221 -948 -787 -105 -807 -631
$$ packed form
601b459K996L56l273J941J497l377O61L329k429j146L333n65l129K916J202k694
617h41J052K628k281j893K672j44j541J508J34j825M47Q17j731P2K150j508j292
634a576J202J27j774J704J333k320j35K290j458o14K094j10j727J905M91k382
650i50J216K212k906r4K625j469k094L155P1l338J026K320k345r72K293j020j624
667a894J808N04k306R27K233k469n22L015r81k193K836J090l520Q49L635k678
683C34j847L831n48l216K424J053l134R21K509k946r37L079j310k250K373k00
699A36k703K125J845k513m63K158q43j169J536N45p78K15L51m00M49K93K43l53
717F74j13Q1m84L00Q52r57p36P89j38j422J062L31p24j60M24p27J61O82p02J76
$$ plain form
737 -631 211 -940 -560 1411 -180 -1159 756 1080 -611 777 1438 -243 270 1467 -91 -28 1532
754 1532 717 -935 554 510 -1104 233 1305 -906 -1858 448 -321 -1936 -119 626 -1100 -928 541
771 541 -540 -1204 935 1121 -923 -192 1556 -404 -380 2212 397 -1407 1438 1733 -1342 -3 2401
788 2401 -704 -1628 1145 215 -1941 423 676 -1648 -873 869 -475 -1316 257 -346 -1283 62 787
805 787 -431 -711 1234 117 -684 681 1175 369 241 1327 374 -382 791 843 -207 -252 343 133 -321
824 -321 -256 -346 -345 -491 -820 -423 -598 -650 80 -181 -1160 -427 416 -442 -333 991 -205 -479 1201 1097 -789
845 -789 837 1860 -389 -606 1403 496 -846 685 926 -1301 -588 1157 -221 -1404 -14 -273 -1936
862 -1936 -420 820 -1341 -977 830 -580 -1605 744 1228 -1204 -164 1333 -440 -723 1616 831
$$ packed form
737f31Q42j151L80J971j591r79J915L24j691J388O61j681N13J197j558O3J560
754A532q15j652J489m4j614J337J072k211r52K306p69j615J817P45j726J72J469
771E41j081o64K139J86k044P31J748j960K4K592j815j804K845K95l075J339K404
788B401l105r24K773r30k156K364K53k324P75J742j344q41J573o03r37J345P25
805G87j218k80J945j117q01J365M94q06j28J086r53p56J173N2j050m5N95k10m54
824c21O5r0Jj46l29L97j75n2P30k61r79P33Q43q58J09J324j196k74J680j04j886
845g89J626J023k249k17K009r07j342J531K41k227P13J745j378j183J390k59j663
862a936J516J240k161L64J807j410j025K349M84k432J040J497j773k83K339p85
$$ plain form
878 831 -721 839 1562 -432 158 1105 -160 -159 725 -1 -894 191 321 -906 -738 -127 -589 -526 -3
897 -3 -254 -902 -497 -2 11 -41 185 172 193 314 402 738 581 645 517 199 287 642 354 45 -102 -145 159 -241
921 -241 -324 -200 -158 -503 -124 -562 -1142 -103 213 -1010 -692 653 -456 -720 1174 259 -776 796 1142
940 1142 -563 535 1477 -122 -361 1364 261 -736 1099 642 -785 -517 719 -399 -766 349 -405
957 -405 -1013 -252 63 -742 -833 248 -300 -724 -62 357 -424 -60 1078 -49 -463 1425 772 -537 674
976 674 1119 -161 349 1042 -28 -180 1039 172 -1128 112 281 -994 -403 5 -1091 -681 317 -297
994 -297 -784 -381 -326 -505 -176 -126 243 522 -280 234 584 210 384 1076 223 -97 646 456 50 505 608
1015 608 -308 -382 271 -114 -637 -210 -24 -820 -1037 -71 -309 -927 -279 438 -893 -784 1072 530 -1078
$$ packed form
878H31j552J560P23j994N90R47j265JQ84p26q93J085J30j227J68O11m62O3N23
897ck51o48M05M95J3n2K26j3K1J21Q8L36j57O4j28l18Q8L55k88l09j47m3L04m00
921b41q3J24M2l45L79m38n80J039L16j223L18J345j109k64J894r15j035J572L46
940A142j705J098R42j599k39J725j103r97J835m57j427K68J236j118l67J115p54
957d05o08P61L15q05r1J081n48m24O62M19p81L64J138j127m14J888o53j309J211
976F74M45j280N10O93j070j52J219q67j300J240J69j275N91M08j096M10R98o14
994b97m87M03N5j79L29N0L69K79q02N14L50l74J74O92q53l20P43j90m06M55J03
1015F08r16p4O53l85n23M27J86p96k17R66k38o18O48P17j331J09J856n42j608
$$ plain form
1034 -1078 692 1087 -693 236 1802 -118 -463 1594 377 -854 992 1103 -981 -99 760 -695
1050 -695 -862 756 167 -1444 -174 345 -942 -912 584 -194 -1181 89 186 -636 -91 911 -103 -490
1068 -490 735 666 -241 821 879 -365 199 1497 438 -456 569 369 -676 -235 536 -225 -432 -224
1086 -224 -454 -723 -539 -21 20 -558 -296 -16 -163 -503 338 415 -355 127 572 -408 35 828 277 -334 741
1107 741 626 -211 145 648 -362 -720 183 522 -760 -615 309 -394 -1041 30 97 -1249 -243 453 -946
1126 -946 -643 822 -1 -650 714 588 -794 397 1589 121 -5 1453 490 -750 606 927 -217
1143 -217 -9 754 -62 -895 389 -76 -608 -343 70 -445 -839 71 -80 -1007 22 629 -700 -491 935
1162 935 188 -875 617 640 -446 592 709 -134 -97 928 263 275 556 71 -265 169 -32 -598 195
$$ packed form
1034a078J770L95j780R29J566j920l45K057j217j231J846J11k084Q82Q59j455
1050f95j67J618n89j611J270N19j287L0J496p78r87J270R7q22N45J002j014l87
1068d90J225o9r07J062N8j244N64J298j059q94J025k00j045M41P71p61k07K08
1086b24k30k69J84N18M1n78K62K80j47l40Q41P7p70M82M45r80M43P93n51o11J075
1107G41j15q37L56N03j010l58R03L39j282J45R24p03o47J071O7j346J006O96j399
1126i46L03J465q23o49J364j26j382J191J192j468j26J458r63j240J356L21j144
1143b17K08P63q16q33J284m65n32K65M13n15l94R10j51r27J029O07j329K09J426
1162I35p47j063J492K3j086J038J17q43L7J025o65J2K81m85l36M34k01n66P93
$$ plain form
1181 195 225 -354 -471 -507 -369 -411 -157 -224 -445 -552 -435 272 16 -49 294 610 -85 184 622 376 127 615
1203 615 174 331 374 290 -27 -54 -104 -188 36 164 -359 -762 -428 -196 -10 -642 -243 70 -591 -791 395
1224 395 186 -686 539 379 -276 -172 634 316 -3 647 -188 -622 850 330 -717 533 739 -410
1242 -410 -287 349 -264 -853 -1 -45 -756 -394 238 -452 -776 -274 63 -400 -244 259 -4 9 498 47 -381
1263 -381 550 802 -53 74 603 169 -200 873 199 -209 -61 338 -171 -270 55 -11 -167 -322 -421 -231 -159
1284 -159 -562 -175 -256 -493 29 188 79 15 137 315 410 443 117 74 539 325 -339 325 677 251 -278 342
1306 342 59 -418 -137 348 -274 -676 -80 -133 -533 -558 125 -495 -479 -141 -379 -640 132 248 -669 87 435
1327 435 -63 -64 763 441 -362 490 1000 -402 -74 654 122 -160 312 -123 -249 -134 -129 -599 -366 -166 -291
$$ packed form
1181A95L0n79j17l6J38m2K54o7k21j07J17P07k56o5L43L16o95K69M38k46k49M88
1203F15m41J57M3q4l17k7n0q4K24J28n23m03L34K32J86o32L99L13o61k00J186
1224C95k09q72J225j60o55J04Q06l18l19O50q35m34J472n20j047J250K06j149
1242d10J23O36o13n89Q52m4p11L62O32o90l24N02L37m63J56N03k63J3M89m51m28
1263c81R31K52q55J27N29m34l69J073o74m08J48L99n09r9L25o6j56j55r9J90P2
1284a59m03L87q1k37N22J59j09o4J22J78R5L3l26m3M65k14o64O64L52m26n29O20
1306C42k83m77K81M85o22m02N96n3m00k5O83o20J6L38k38k61P72J16r17P56L48
1327D35m98jQ27l22q03Q52N10j402L28P28n32k82M72m35j26J15Nm70K33K00j25
$$ plain form
1348 -291 -255 42 -253 -572 129 46 -159 -185 324 245 -55 230 157 393 98 179 524 133 383 233 236 -10 -572
1371 -572 97 360 -47 -428 113 -332 -333 -368 -164 -348 -17 33 -558 -169 -37 -131 -239 438 294 -204 216 669
1393 669 -3 158 660 406 232 300 435 80 161 -41 -241 -56 112 -28 -344 -129 -607 -501 -399 -16 -411
1414 -411 -390 238 -76 -291 180 378 8 -51 101 -109 224 507 328 360 147 371 -187 315 46 -10 124
1435 124 167 -258 -295 -57 114 -209 -316 -171 -213 -214 -15 -336 -443 -12 157 168 -47 184 -67 -4 306 221 121
1458 121 618 370 206 256 413 183 115 373 415 -192 16 241 8 -124 -157 -273 -300 -406 -699 -128 -147 -486
1480 -486 -391 -42 -63 -190 193 -98 289 -39 150 41 398 410 140 245 375 21 -54 473 129 -111 111
1501 111 263 -93 -258 64 -113 -317 -80 -221 -273 -120 -345 9 -127 -31 43 -94 256 295 -44 162 314
$$ packed form
1348b91L6K97k95l19P01q3k05k6N09p9l00K85p3K36k95Q1L45l91K50j50Lk46n62
1371e72O69K63m07l81N41m45jl5K04j84L31N0n91L89J32r4j08O77j44m98M20M53
1393F69o72J61N02k54j74O8J35l55Q1k02k00J85J68j40l16K15m78J06J02L83l95
1414d11K1O28l14k15M71J98l70n9J52k10L33K83j79L2k13K24n58N02k69n6J34
1435A24M3m25l7K38J71l23j07J45m2jJ99l21j07M31J69J1k15K31k51O3L10q5j00
1458A21M97k48j64N0J57k30o8K58M2o07K08K25k33j32l3j16k7j06k93N71j9l39
1480d86R5L49k1j27L83k91L87l28J89j09L57J2k70J05J30l54p5N27l44k40K22
1501A11J52l56j65L22j77k04K37j41n2J53k25L54j36R6P4j37L50L9l39K06J52
$$ plain form
1522 314 466 -86 120 557 238 211 457 277 -153 182 226 -222 -157 -83 105 -316 -194 -315 -326 12 -232 -287
1544 -287 -119 -66 95 19 217 94 163 361 -69 269 224 325 572 447 -18 328 402 65 -8 127 -45 -74
1566 -74 -23 -125 -219 -295 -252 -249 -488 -247 -130 -79 -275 -116 -409 -134 247 189 -62 276 103 -32 365 489 150
1589 150 167 174 136 24 133 267 -23 -161 -129 -65 -243 -56 -22 -246 -233 -278 -321 -206 -93 -387 -279 -35 -95 -24
1613 -24 -121 161 100 2 135 289 204 398 77 -6 272 259 38 306 -289 -253 47 366 -129 -405 69 66 -256
1636 -256 -427 1 -242 -252 59 -315 -328 -124 107 -330 -85 424 -117 66 360 263 26 603 304 11 -23
1657 -23 298 35 69 -64 -132 26 11 185 -553 -55 -7 -316 -50 -235 16 -448 -78 71 -211 -205 70 38 -405
1680 -405 -153 100 -65 475 130 304 302 0 360 438 186 88 78 269 -72 -15 62 -131 -229 50 -351 -334 127
$$ packed form
1522C14J52n52K06M37l19k7K46j80m30L35M4m48O5P4J88m21J22j21j1L38k44n5
1544b87J68N3J61p6J98j23O9J98m30L38m5J01K47j25m65L46P4l37p3J35j72k9
1566g4N1j02r4p6M3Lk39K41J17N1j96J59k93K75L81n8k51L38j73j35L97J24l39
1589A50J7Pl8j12J09J34k90j38L2O4j78J87L4k24J3m5m3J15J13k94J08K44o0P1
1613b4r7K82o1r8J33J54q5J94l21q3K78j3k21K68n95L6L00L19m95k76M74ll22
1636b56j71M28k43j0L11l74j3K04K31m37K45N09n41J83K94r7k37N77k99k93l4
1657b3L21k63L4j33o8J58j5J74p38M98M8l09K66j85K51m64L70J49k82OK75l2m43
1680d05K52K53j65N40l45J74kl02L60P8k52r8j0J91l41N7P7j93r8K79m01J7M61
$$ plain form
1703 127 62 -301 -194 175 -95 -216 215 88 -52 87 241 136 236 369 77 -56 140 375 302 -60 300
1724 300 120 119 161 268 -155 -31 158 -127 -290 -76 -169 16 87 -46 -369 -275 38 -101 -134 251 -31 107
1746 107 168 -1 208 371 283 111 400 315 72 101 66 -147 4 -125 -211 33 -136 -127 -340 -60 -18 -471 89
1769 89 15 -161 -130 -305 -18 -26 115 16 40 34 136 242 132 121 159 -9 58 199 41 24 338 -116 -120 117 -82
1794 -82 38 -96 -148 -210 -72 -231 -178 132 -41 -72 -225 75 32 154 124 100 43 75 121 248 341 364 265 -1 303
1819 303 -13 4 194 11 -42 -191 -196 -153 191 -179 -175 -304 -215 47 -368 -337 61 -286 -379 76 282 -190 15
1842 15 176 -7 11 308 280 159 215 110 -94 -170 269 187 -178 153 157 -121 -6 -134 -296 -102 33 -136 -108
1865 -108 -254 -171 50 -259 -229 -74 16 104 -95 -383 31 165 252 314 199 486 22 37 278 203 -88 9 -75
$$ packed form
1703A27o5l63J07L69k70j21M31j27j40J39J54j05J00J33k92j33J96K35p3l62L60
1724C00j80jM2J07m23J24J89k85j63K14r3J85P1j33l23R4L13j39l3L85k82J38
1746A07O1j69K09J63q8j72K89q5k43K9l5k13J51j29q6K44j69Rk13K80M2m53N60
1769H9p4j76L1j75K87qJ41r9K4oJ02J06j10j1L8j68O7J41j58j7L14m54mK37j99
1794h2J20j34n2o2J38j59N3L10j73l1j53L00m3J22l0k4n7L2M6J27R3K3r9k66L04
1819C03l16J7J90j83n3j49nM3L44l70Mj29Q9K62m15L1L98l47r3M55K06m72K05
1842A5J61j83J8K97k8j21N6j05k04p6M39q2l65L31Mk78J15j28j62J94J35j69K8
1865a08j46Q3K21l09L0J55R0Q8j99k88M14J34Q7O2j15K87m64J5K41p5k91R7q4
$$ plain form
1888 -75 43 -21 -81 -105 -130 -46 -108 -114 -113 -74 -174 -313 -463 155 98 3 -137 141 -33 46 72 -163 299 337 -106 10
1914 10 38 -219 251 202 81 -190 -169 130 214 -105 110 -92 -383 -205 -232 -7 50 -91 -163 -54 142 24 96
1937 96 78 -37 145 53 349 112 113 331 13 437 106 304 313 -171 -49 -36 192 -92 29 65 -333 -140 -328
1960 -328 -441 -215 -493 -79 -172 -226 -122 -141 168 -7 -148 -4 -118 361 152 243 122 266 157 -14 385
1981 385 153 0 -90 -128 -262 -119 -93 -119 -33 -69 -177 16 12 -234 63 15 22 -134 -123 -151 -218 -58 98 36 -36
2006 -36 297 234 65 83 261 389 139 171 101 32 -9 -124 123 72 -7 -291 -318 -14 -315 -73 -213 81 62 -296
2030 -296 -264 -122 -282 -20 155 69 -84 -29 206 141 172 77 -133 286 -87 79 -110 57 -88 -236 -64 161
2052 161 44 -95 -140 -68 18 -390 15 -58 -230 -94 -273 -213 -88 215 190 72 155 162 -102 113 111 55 68 249
$$ packed form
1888g5J18o4o0k4k5Q4o2oJL9j00j39j50O18n7r5j40K78j74P9K6k35M62L8m43J16
1914A0K8k57M70m9j21k71K1K99Q4l19K15k02k91J78k7K25N7j41p2J09J96j18P2
1937I6j8j15J82r2K96k37JK18l18M24l31J98Rm84J22J3K28k84J21L6l98J93j88
1960c28j13K26k78M14r3n4J04j9L09j75j41J44j14M79k09R1j21J44j09j71L99
1981C85k32j53r0l8j34J43K6k6Q6l6j08J93mk46K97m8Pj56J1k8o7J60J56o2p2
2006c6L33o3j69J8J78J28k50L2p0o9m1j15K47n1p9k84k7L04l01K42j40K94j9l58
2030b96L2J42j60K62J75q6j53N5K35o5L1r5k10M19l73J66j89J67j45j48J72K25
2052A61j17j39m5P2Q6m08M05p3j72J36j79O0J25L03k5j18Q3Pk64K15kn6J3J81
$$ plain form
2076 249 273 22 -41 242 71 85 -112 -6 46 120 213 -245 -319 -70 42 -87 -359 -149 -93 -374 -76 -254 -60
2099 -60 -116 -23 83 -53 327 200 14 238 21 -159 196 214 64 52 210 -74 -244 -19 -31 40 -286 -92
2121 -92 -176 -126 -217 -111 -177 -324 119 -188 179 -43 -17 -93 34 375 251 219 51 79 87 -9 -45 53 76 118 216 -281
2147 -281 -160 154 89 -118 -70 -79 -336 115 -51 -112 -290 -211 -172 -61 -137 -56 23 -58 5 16 -31 19 377 83 159
2172 159 -5 143 111 -154 90 54 261 -12 -41 -127 -82 138 -247 -182 -2 -64 24 163 33 -294 -55 -69 45
2195 45 183 15 -3 -228 -63 55 276 338 176 270 70 87 171 195 56 -90 181 -11 -287 -278 -264 -50 -207
2218 -207 -124 38 -392 -161 -93 84 -54 210 -27 -60 15 174 -23 253 272 137 111 178 306 -49 176 4
2240 4 435 295 78 81 -320 -232 -16 3 -219 -146 -201 -221 -200 -230 -59 -124 -156 -101 61 128 119 116 45 -203 -3 187 144
$$ packed form
2076B49K4k51o3K83j71J4j97J06N2P4R3m58p4K49J12j29k72K10N6k81K98j78J94
2099f0n6R3J06j36L80j27j86K24k17j80L55J8j50j2J58k84j70K25j2P1l26J94
2121i2q4N0r1J06o6j47M43l07L67k22K6p6J27L41j24l2j68K8Qr6l6R8K3M2R8m97
2147b81J21L14o5k07M8rk57M51j66o1j78P9L9J11p6Q1P9q1O3J1m7N0L58k94P6
2172A59j64J48l2k65K44l6K07k73k9q6M5K20l85O5J80o2Q8J39j30l27K39j4J14
2195D5J38j68j8k25J65J18K21O2j62R4k00J7Q4K4j39j46K71j92k76RJ4K14j57
2218b07Q3J62m30K31O8J77j38K64k37l3P5J59j97K76J9j35k6O7J28l55K25j72
2240DM31j40k17Lm01Q8K16J9k22P3n5k0K1l0J71o5l2N5J62O7rlp1k48K00J90m3
$$ plain form
2267 144 110 116 275 148 13 109 193 -89 24 7 34 165 -30 -257 21 -53 -135 -70 -114 -138 -297 -176 -29 -80
2291 -80 212 162 70 203 153 32 34 86 120 44 226 132 -225 -117 148 13 -172 -52 104 74 -62 -137 -12 -1
2315 -1 -38 -99 -259 -243 -90 -124 -158 209 86 148 -55 -31 -130 -86 160 170 32 -170 173 -17 222 185 -41 79
2339 79 -32 -145 27 -185 151 -63 -18 50 -172 -37 -180 -112 -27 -22 -188 95 -52 175 -40 91 -35 -62 138
2362 138 -24 79 248 88 240 286 66 210 86 -90 -101 34 -146 307 -76 27 246 -133 -48 -199 -201 -65
2384 -65 -184 -173 -9 -120 42 44 -17 48 -5 3 186 22 218 -12 -61 133 65 171 241 90 196 11 -25 -37 76
2409 76 -260 73 -277 35 -120 -211 -297 -200 -94 54 268 58 -82 -170 101 -70 128 39 250 100 152 91 174
2432 174 33 318 -13 -3 55 29 -124 -23 160 -103 0 -81 -105 145 -386 30 139 66 -188 91 34 -117
$$ packed form
2267A44l4OJ59j27j35R6Q4k82J13j7K7J31j95k27K78p4q2O5m4k4j59J21J47n1
2291h0K92n0r2J33n0j21KN2L4p6J82r4l57J08K65j35j85J20J56l0j36p5J25J1
2315al7o1j60J6J53l4l4L67j23O2k03K4r9M4K46J0j38k02L43j90K39l7k26J20
2339G9j11j13J72k12L36k14M5O8k22J35j43O8Q5Nj66K83j47K27k15J31j26k7K00
2362A38j62J03J69j60J52M6k20J44j24j76j1J35j80M53l83J03K19l79Q5j51kJ36
2384f5j19J1J64j11J62Ko1O5n3QJ83j64J96k30m9J94o8J06P0j51J06j85l6j2J13
2409G6l36L33l50L12j55r1q6R7J06J48K14k10j40q8K71j71J98q9K11j50N2o1Q3
2432A74j41K85l31J0N8k6j53J01J83k63J03q1k4K50n31M16J09p3k54K79n7j51
$$ plain form
2454 -117 42 89 127 29 -25 194 195 -10 -35 278 67 71 133 -223 209 106 -119 -208 251 132 -405 -9 -33 -201
2478 -201 -214 152 14 -100 -297 -39 36 -294 -76 203 105 -71 95 251 -31 17 121 6 65 -148 237 166
2500 166 256 293 51 -305 184 -73 -139 -284 -132 -241 16 162 -220 -157 -101 -97 -369 21 197 137 25 -58 9
2523 9 80 166 24 238 68 -29 68 -83 166 206 -159 -111 142 148 174 -206 -174 -152 -218 -27 38 -75 -78 -101 -317 -216
2549 -216 -55 -153 -22 158 236 -33 371 90 112 114 151 74 252 252 56 -225 103 190 -83 -214 161 79 -181 -182
2573 -182 -112 -140 -280 116 -94 -138 -106 -250 -38 -217 49 112 -174 275 -19 369 47 4 313 -34 133 23
2595 23 28 10 156 25 -67 -80 -60 -33 -18 -90 35 14 2 -148 -46 -269 20 -12 -54 -192 -1 210 184 126 209 -17
2621 -17 33 163 79 56 179 291 78 -11 -61 -53 10 -130 62 -347 175 42 -103 -214 -181 -66 -21 -147 -156 -319
$$ packed form
2454a17J59M7L8r8n4K19Jk05k5L13k11MO2l56M32j03k25q9M59j19n37L96k4j68
2478b01j3L66j38j14j97K58P5l30K18K79r8j76J66J56k82M8J04j15N9k13L85p1
2500A66R0L7k42l56M89k57o6j45J52j09K57J46l82O3N6Mk72L90J76o0j12q3O7
2523IP1Q6j42K14j70r7R7j51K49M0l65M8K53OK6l80L2K2o6J91O5j13lk3k16J01
2549b16J61r8J31J80P8k69M04k81K2KL7p7J78%j96k81L28Q7k73j31L75q2k60j
2573a82P0k8j40L96k10m4L2j44K12j79K66O3k86M49k94L88l22m3L09l47J67j10
2595B3Nj8J46j31r2j3K0K7J5p2J25k1j2j50J02k23K89l2m2j38J91K11k6n8Q3k26
2621a7N0J30q4k3J23J12k13q9n0QO3j40J92m09N22j33j45j11L3J15M5j26rj63
$$ plain form
2645 -319 6 -34 70 119 151 42 121 263 21 -143 152 233 56 112 124 127 -26 74 -111 -136 -11 106 -45
2668 -45 -93 -18 -202 -84 -91 -116 -9 48 -345 26 -148 46 64 -21 39 128 101 86 -34 206 4 59 -21 78 127 -90
2694 -90 -8 -132 184 -201 139 -2 36 -77 14 -39 142 -259 -22 -261 -402 316 -36 -51 -172 45 -40 -183
2716 -183 -83 -101 350 -54 -243 -142 13 248 -30 2 98 50 35 -105 249 250 -144 -304 -101 -74 -306 -112 -8
2739 -8 -288 -177 64 155 -145 -41 -39 78 -1 69 160 -97 -22 158 206 193 114 -206 75 46 -110 -6 -151 -47
2763 -47 20 3 101 -176 -151 -247 -137 -70 -51 -217 -93 -102 18 -100 -221 79 72 57 197 187 11 204 -34 9 -43
2788 -43 -248 55 -68 -92 -250 158 -15 -18 -113 62 -29 -135 -88 -488 -101 -100 -27 81 31 153 230 -98 176 34
2812 34 -73 82 152 16 -11 -208 39 -44 118 -96 -168 144 172 42 -142 210 -101 -71 -198 -132 -274 22 24
$$ packed form
2645c19L25m0J04M9L2j09P9J42k42j64K95Q1j77N6J2Lj53J00j85k5J25J17j51
2668d5m8P5j84J18pk5J07N7l93L71j74J94J8q5O0Q9k7j5j20K40k02N5q0R9M9k17
2694i0Q2j24L16l85L40j41L8j13R1n3J81m01K37k39j41P18l52j5j21K17q5j43
2716a83J00j8M51m04j89J01J55K35k78L2R6m8j5j40L54Jl94j60K03K7k32J94J04
2739hk80J11K41R1l00J04KJ17p9P0R1k57P5J80M8j3p9l20K81k9j56J04j45J04
2763d7O7j7R8k77K5r6J10O7J9j66J24rJ20j18j21L00pj5J40j0j76J93k38M3n2
2788d3k05L03j23k4j58M08j73lr5J75r1j06M7m00L87JP3J08n0J22P7l28K74j42
2812C4j07J55P0j36k7j97K47q3J62k14p2L12K8j30j84L52l11L0j27O6j42K96K
$$ plain form
2835 24 106 -98 -160 309 171 -93 152 -43 4 45 -16 133 404 195 -59 -63 47 271 -97 24 264 17 -14
2858 -14 61 -11 -55 -230 -10 -120 10 -109 13 41 -75 -290 -89 158 95 43 -94 153 -121 21 -1 151 48
2881 48 17 -43 30 100 75 102 73 -57 70 -63 -6 67 -182 75 128 -124 -9 109 -76 -135 -17 -9 -233 -97 91
2906 91 115 64 -185 -32 40 -250 67 -24 45 34 295 -81 60 123 -117 24 -88 88 45 -133 -358 -29 -130
2929 -130 -120 -15 114 14 -53 -164 -136 6 14 132 181 47 -67 -169 -53 100 -13 272 76 210 36 18
2951 18 15 355 73 66 -6 -437 -225 -119 -148 -50 -94 -267 -139 149 -166 -56 12 -81 -300 40 64 -87 165 80
2975 80 256 -52 -50 -144 -175 188 155 42 -8 286 -34 19 -39 17 -87 -25 -195 -156 -162 -162 30 52 -123 53 -54 -101
3001 -101 -18 -203 -98 166 12 50 -43 64 -72 -16 70 -4 172 -106 -127 -18 -119 -39 -91 -113 85 -82 -109 113
$$ packed form
2835B4Q2k04o2M69j38k64K45j95M7M1o1J49K71k09k54mJ10K24l68J21K40k47l1
2858a4P5p2m4j75K20j10J30j19J22K8j16k15K01K47o3n2j37K47k74J42k2J52j03
2881D8l1o0P3P0k5K7k9j30J27j33N7P3k49K57N3k52J15J18j85n9J18Qk24J36J88
2906I1K4n1k49J53P2k90L17r1O9j1K61l76J41O3k40J41j12J76m3j78k25L29j01
2929a30J0J05J29j00o7j11K8J42QJ18M9j34j14j02J16J53j13K85j96J34j74j8
2951A8lL40k82pp2m31K12J06k9R8m4j73J28K88l15J10O8r3k19L40K4j51K52q5
2975H0J76l08Kr4l1L63l3j13n0K94l20N3n8N6j04O2j70L9o%J92K2j75J76j07m7
3001a01Q3j85J05K64j54L8r3J07j36N6Q6p4J76k78k1J09j01Q0n2k2J98j67k7K22
$$ plain form
3025 113 -45 -24 -43 -248 -19 -165 -185 28 -25 42 52 -212 50 14 -218 53 164 167 83 -151 -110 -85 205 -45
3049 -45 101 55 105 -182 -6 -81 -43 -115 -104 -89 94 113 29 -185 11 135 -66 101 48 127 8 88 127 -82 262
3074 262 52 203 61 -105 -58 81 -51 -105 -97 -223 -33 106 -144 27 178 -206 -28 66 239 -21 -9 -13 -234
3097 -234 -304 133 92 13 24 236 107 -210 286 91 138 322 134 190 256 -88 35 1 -89 -74 1 -90 183 -9
3121 -9 97 -43 100 7 -379 -174 -68 147 -161 -158 -79 79 -33 130 11 17 -219 138 147 60 82 -39 -235 -7
3145 -7 -49 -142 -93 52 70 58 -160 -121 80 -5 -3 146 215 -115 117 -248 20 108 -101 29 322 -196 2 161
3169 161 38 72 102 76 386 290 13 -189 185 -117 -42 90 40 -42 -169 251 -118 -133 100 216 186 87 -82
3192 -82 53 125 182 40 -91 120 -75 -31 77 71 138 -279 -68 74 97 -40 46 13 7 -136 -210 -13 0 405 -204
$$ packed form
3025A13j58K1j9k05K29j46k0K13n3O7J0k64K62l6k32K71J11Lq4k34M1K5K90k50
3049d5J46m6N0k87J76p5L8p2J1J5J83J9q4k14J96J24k01J67n3P9j19Q0L9k09L44
3074B62k10J51j42j66M7J39j32n4Qj26J90J39k50J71J51l84J78R4J73k60J2mk21
3097b34p0M37m1p9J1K12j29l17M96j95M7J84j88N6O6l44J23l4r0J5P5r1K73j92
3121iJ06j40J43r3l86K05J06K15l08LP9J58j12J63j19Ok36L57Rq7K2j21j96K28
3145gm2r3M9J45J8j2k18L9K01q5KJ49O9l30K32l65K68Q8k09J30K93n18J98J59
3169A61j23L4L0k6L10r6k77k02L74l02P5J32n0q2j27M20l69j5K33J16l0r9j69
3192h2J35P2N7j42j31K11j95M4J08oO7m17K11J42K3j37Q6l3oj43p4J97J3M05o09
$$ plain form
3217 -204 76 -49 -151 64 -165 158 106 26 176 -158 -122 -66 -286 328 -360 5 -73 4 -42 -95 248 127 70
3240 70 -91 -60 3 133 243 -41 45 -36 -136 -104 -157 -8 -228 -120 -59 4 135 -196 -48 56 81 -40 -113 125
3264 125 -44 11 241 221 23 -77 93 71 194 145 110 63 174 -106 116 9 112 -86 -169 113 -70 -96 17
3287 17 -74 -266 -159 27 124 -31 -15 88 72 -94 6 -2 -39 296 -132 -161 -169 239 123 37 236 -204 -13 -204
3311 -204 -205 147 -39 103 65 124 -244 -38 -68 -29 -165 -82 -45 -161 109 49 53 23 221 -147 -71 204 5 -45 29
3336 29 24 -87 104 283 114 -149 107 268 -217 177 92 -100 -88 25 -77 -90 -23 144 70 -161 -70 100 239
3359 239 -121 -134 11 -293 168 171 162 86 258 356 34 -44 129 -66 74 -95 138 31 -126 12 19 127 -57
3382 -57 -55 71 -67 -111 -317 -180 -17 2 2 134 -24 69 -95 -105 72 151 135 -53 172 151 89 26 68 -69 -124
$$ packed form
3217b04K80j25j02K15k29L23n2q0J50l34L6N6k20O14o88L65p8P7m6n3L43j21n7
3240G0j61L1O3J30J10k84Q6q1j00L2n3J49k20J08O1O3J31l31J48J04K5j21p3K38
3264A25j69N5K30k0j98j00J70k2J23m9l5m7J11k80K22j07J03j98q3K82j83k6J13
3287A7r1j92J07J86R7j55J6J03j6j66J00ql7L35m28k9qM08j16q6J99m40J91j91
3311b04jL52j86J42l8N9l68K06l0L9j36Q3L7j16K70o0Ml0J98l68P6K75j99n0P4
3336B9nj11J91J79j69k63K56J61m85L94q5j92J2J13j02j3O7J67p4k31R1J70J39
3359B39l60j3J45l04M61Lrp6J72R8l22p8J73j95J40j69K33j07j57J38PJ08j84
3382e7KJ26j38m4k06J37J63J9%J32j58R3j64j0J77P9j6j88K25k1o2o3M2j37n5
$$ plain form
3407 -124 9 70 -97 -159 -111 32 30 -190 -65 44 -24 100 129 -43 92 -137 239 -10 97 69 -105 153 251
3430 251 91 -88 54 40 121 113 -106 196 -207 -52 -20 152 -61 124 -110 113 -171 185 -103 49 67 -106
3452 -106 -26 -52 173 27 -29 -191 9 -71 -224 -64 295 -12 152 -47 -54 54 -2 15 272 154 190 8 -189
3475 -189 -29 110 -51 299 179 16 -245 -112 5 -116 39 175 19 -199 -131 187 32 116 -36 -162 2
3496 2 -47 -77 212 170 1 -21 178 -5 -115 -112 -14 -161 -280 38 99 -104 -133 -314 -61 -112 -108 -52 178 -45 96
3521 96 171 13 -75 -292 36 180 81 -32 141 -130 54 -55 -185 63 -247 -140 33 138 143 -45 -213 -111
3543 -111 -19 169 126 -345 48 -2 -88 12 -177 120 -95 -76 246 209 276 63 9 -72 -40 -16 -212 -24 -53 351
3567 351 125 -1 -112 52 129 -13 274 -23 65 -74 -186 -107 -15 -73 -149 -92 -24 -120 -58 -68 371 207 134 168
$$ packed form
3407a24J33O1j67o2M8J43kk20J25J09o8J24K9j72J35k29L76k49J07k8j74K58R8
3430B51j60j79J42j4Q1qk19L02m03J55L2J72k13J85k34K23k84L56k88J52J8j73
3452a06Q0k6K25j46n6j62K00q0j53J60L59l07J64j99pJ08n6J7K57j18L6j82j97
3475a89J60J39j61L50j20j63k61J33J17j21J55J36j56k18O8L18j55Q4j52j26J64
3496Bm9l0K89m2j69k2J99j83j10LR8j47j19L18O1k03k9j81K53n1MN6K30k23J41
3521I6P5j58q8k17L28J44r9j13J73k71J84j09j30K48l10J07J73J05Nj88j68J02
3543a11R2J88m3m71L93n0q6J00j89K97k15J9L22l7O7k13n4q1L2K4j96J88k9M04
3567C51k26j26j11J64P7j42K87k97Q8j39j12P9R2n8p6N7O8r6O2j0M39j64p3L4
$$ plain form
3591 168 128 -27 -26 122 32 -149 105 19 48 -22 7 108 -89 -122 -199 -3 88 -276 -241 28 -19 -39 47 8 189
3616 189 174 123 -192 57 -78 179 133 27 122 -9 282 111 48 -5 236 -37 -86 -110 80 56 -137 36 -221
3639 -221 56 -104 -109 -149 -124 -156 82 25 67 152 24 -27 13 -81 94 41 14 309 -11 202 -27 128 261 213 16
3664 16 -53 -229 -77 170 58 -172 82 88 -113 -102 -232 -51 9 36 80 152 -162 92 118 82 -179 20 -105 268
3688 268 51 68 -68 232 -53 280 -71 -6 -118 -67 -106 -39 -146 153 -314 -226 -114 -44 -202 -49 117 -184
3710 -184 -57 89 17 20 201 -138 104 -204 -19 32 -109 -21 53 50 94 64 102 11 29 -173 3 63 182 -68 69
3735 69 -186 186 -153 -39 -23 -273 -144 133 202 157 90 -30 185 78 -21 81 148 -52 102 -81 136 80 -86
3758 -86 -9 -29 154 111 391 112 73 65 160 129 59 116 -177 -13 -63 -24 -82 -11 -5 84 -153 98 73 -10 63 -66 134
$$ packed form
3591A68m0j55JJ48r0j81K54q6K9p0K9J01j97l3p7J96R1l64L5K69m7k0Q6l9J81
3616A89j5n1l15K49j35K57m6j06R5j31K91j71o3n3K41k73m9k4J90k4j93J73k57
3639b21K77j60nm0K5l2K38n7M2Q5j28n1M0r4J75n3k7K95l20K13k29J55J33m8j97
3664A6o9j76J52K47j12k30K54Ok01J1j30J81O0K7M4P2l14K54K6l6k61J99j25L73
3688B68k17J7j36L00k85L33l51O5j12N1l9O7j07K99m67Q8J12P0j58J53J66l01
3710a84J27J46p2LJ81l39K42l08J85N1j41Q8P4lM4l0L8r1J8k02J76O0J19k50J37
3735F9k55L72l39J14J6k50J29K77O9m5o7j20K15j07r9J02O7k00J54j83K17n6j66
3758h6P7k0J83m3K80k79l9qR5l1p0N7k93J64n0L9n8P1OQ9k37K51k5q3P3j29K00
$$ plain form
3785 134 -93 125 33 7 144 -1 18 47 37 -7 86 -49 -217 152 106 67 -90 110 190 108 -179 -49 6 90
3809 90 -122 105 -13 -115 160 29 -37 -11 166 178 14 146 138 -51 39 139 -158 63 -94 -68 92 -158 85
3832 85 -31 -15 42 -94 -59 81 -157 118 41 15 -206 -175 134 -48 108 -324 209 50 286 154 21 -84
3854 -84 -26 347 -101 -7 49 220 159 -83 82 98 127 52 -60 98 246 -4 -76 -235 -161 -175 -35 -121 -114 57 -145
3879 -145 36 254 -28 181 -17 92 37 118 -157 -355 83 51 60 96 -121 -25 84 -17 -270 -295 -66 53 -172
3902 -172 -14 51 -12 138 156 -40 304 25 -72 190 239 116 -36 186 27 37 178 219 133 163 218 3 -47 9
3926 9 124 -34 124 -53 -1 -21 -55 -242 -376 -153 -73 -81 296 9 -53 21 102 25 -11 127 -23 -138 50 133 58
3951 58 -51 302 91 73 122 35 -97 -189 -188 -48 -20 -188 -285 -153 -97 -20 57 -14 203 168 -77 94 -160 -25 218
$$ packed form
3785A34k27K18r2k6J37j45J9K9j0m4R3j35j68L69m6l9j57K00Q0q2k87J30N5Q4
3809I0k12K27j18j02K75j31o6K6J77J2j64J32qj89R0J00k97K21j57K6J60k50K43
3832H5j16J6N7j36L5J40k38K75p7k6k21L1L09j82J56m32N33j59K36j32j33j05
3854h4N8L73m48R4N6J71o1k42J65J6K9p5j12J58J48k50p2j59P4j4J40q6PJ71k02
3879a45J81K18k82K09j98J09n5Q1k75j98M38l2RL6k17R6J09j01k53k5K29J19k25
3902a72J58O5o3J50J8j96L44k79r7K62M9j23j52K22j59J0J41M1q6L0N5k15n0N6
3926IJ15j58J58j77N2k0l4j87j34K23Q0qL77k87o2P4Q1p7l6J38j50j15J88Q3p5
3951E8j09L53k11j8M9q7j32r2JJ40K8j68r7J32N6P7P7p1K17l5k45J71k54J35K43
$$ plain form
3976 218 -9 -45 -21 93 -15 215 20 -10 96 -136 -180 119 36 16 201 205 158 -288 -245 40 112 41 -149 -45
4000 -45 -60 87 32 -98 -75 36 -104 84 11 7 98 -155 -4 44 67 -10 152 34 487 -65 43 146 223 75
4024 75 -128 -347 -69 -49 -178 121 -95 37 -121 -11 55 130 -75 -115 237 68 177 -107 -104 -59 44 -31 -226
4047 -226 51 -16 -134 -175 -87 32 23 -123 108 -286 -32 54 161 59 -71 150 -96 98 -31 -245 -63 -98
4069 -98 120 151 -41 192 58 9 -50 -71 -57 -264 14 164 -169 -120 -29 104 31 92 -50 173 -191 -112 -257 -109
4093 -109 73 -150 -151 -211 -4 109 126 -251 95 98 -139 16 9 -132 189 -2 276 65 35 2 235 28 -68 -35
4117 -35 105 91 -44 -153 170 -189 -206 25 -206 -84 63 16 -41 249 329 -145 164 -66 -128 -77 0 59 36 -187
4141 -187 3 -22 41 395 32 -15 -25 -119 18 90 157 82 161 112 84 256 -40 114 1 -121 138 -77 17 72
$$ packed form
3976B18k27l6K4J14j08K30j95l0J06k32m4K99q3k0J85Mm7m46M3K85P2p1j90J04
4000d5j5J47n5j30K3J11j40J88p3mR1k53J51M8K3p7J62j18M53n52J08J03P7j48
4024G5k03k19K78K0j29K99k16J32j58J10O6P5k05m0L52j69J09k84LM5J03p5j95
4047b26K77o7j18m1Q8J19rj46K31l94K54Q6J07j02j30K21k46J94j29k14J82l5
4069i8K18L1j92K33j34m9n9k1J4k07K78J50l33M9R1J33p3O1j42K23l64P9j45J48
4093a09J82k23jo0K07J13J7l77L46Lk37J55pj41L21j91K78k11l0l3K33k07r6L3
4117c5J40j4j35j09L23l59j7K31k31J22J47m7n7K90Q0m74L09k30o2N1P7N9k3k23
4141a87J90k5O3L54l63m7j0r4J37P2O7p5P9m9k8J72k96J54j13j22K59k15R4N5
$$ plain form
4165 72 -86 88 69 126 153 -22 233 242 -312 -48 -9 55 -3 172 107 -63 189 -15 -3 104 -118 357 -145 2
4189 2 136 13 180 -52 -4 104 -128 -6 49 -66 197 -69 -115 93 -245 237 -251 44 166 -213 138 -22
4211 -22 -59 125 16 -149 -78 -24 35 43 106 -293 88 106 176 145 17 43 -6 138 42 -117 290 48 -31 40 95 -206
4237 -206 6 133 -141 109 -143 -46 128 30 57 -102 -304 108 121 -20 -157 -108 -14 9 -59 -23 -62 -145 100 -21
4261 -21 43 88 88 -51 -149 -11 132 -25 19 134 -40 29 -192 97 183 290 271 63 223 116 -154 22 -153
4284 -153 -196 159 13 201 8 -172 -18 -212 24 -125 68 -190 109 -108 -38 4 128 38 -84 268 -237
4305 -237 46 19 93 178 -66 -59 -77 282 4 67 9 -157 -84 -67 -43 -125 77 14 -150 130 -205 -59 -96 144 -15
4330 -15 169 24 -85 234 -6 71 -39 180 -124 22 49 -159 -363 -3 -141 -40 -13 -288 -114 -23 143 19
$$ packed form
4165G2j58J74j9N7K7j75K55Rn54K64L9O4n8J75o5j70K52k04J2J07k22M75n02J47
4189BJ34j23J67k32M8J08k32J22N5j15K63k66m6K08l38M82m88K95J22l79L51j60
4211b2l7J84j09j65P1N4N9QO3l99L81J8P0l1j28K6m9J44r6j59M07k42p9P1N5l01
4237b06K12J27k74K50k52R7J74r8K7j59k02M12J3j41j37M9R4K3o8L6l9q3K45j21
4261b1O4M5%j39r8J38J43j57M4J15j74O9k21K89Q6J07j9k08J60j07k70J76j75
4284a53m3L55j46J88j93j80J54j94K36j49J93k58K99k17P0M2J24r0j22L52n05
4305b37K83k7P4Q5k44Pj8L59k78O3n8j66P3J7K4q2K02o3j64K80l35J46l7K40j59
4330a5J84j45j09L19k40P7j10K19l04J46K7k08k04L60j38J01K7k75J74R1J66j24
$$ plain form
4352 19 -84 24 -55 -103 47 31 -105 51 -73 -79 20 147 12 89 -131 47 120 -34 -60 -124 395 165 50 151
4376 151 -39 184 9 14 33 -33 281 -196 68 -144 -191 -13 3 91 -70 58 -51 -120 178 73 165 79 44 28
4400 28 50 -32 -6 179 242 56 87 50 -85 -16 -65 -87 35 -18 27 -140 58 -35 -110 40 -207 -83 -54 -98 25
4425 25 10 -17 -7 4 -207 287 96 23 165 -86 -99 3 72 148 -164 209 -128 62 -55 -40 21 -90 107 -8
4449 -8 -141 -133 -14 -160 20 -19 -109 -231 -141 -62 51 215 34 -193 -132 15 -172 -49 -69 -123 7 3 -85 21 59
4474 59 76 -30 74 -163 44 -99 -72 41 52 46 -86 94 -26 -123 130 44 -223 252 119 -130 161 63 -8
4497 -8 119 72 33 44 -52 -197 116 212 115 209 18 48 -175 -199 -179 -127 -118 -23 -269 392 44 -107 133 29 185
4522 185 9 331 -169 -10 41 4 -75 56 46 75 191 -207 -239 -129 256 -59 134 161 -107 13 -73 -11 47
$$ packed form
4352A9j03J08p9m8J50j6j36J56j24oR9J27j35P7k20J78P3j54k6o4N19k30j15J01
4376A51j90K23j75NJ9o6L14m77K64k12m7J78J6Q8j61J28j09o9K98j05R2q6l5j6
4400B8K2q2K6J85O3j86L1l7j35O9m9k2J22n3M5j67J98r3p5J50k47J24K9m4J23
4425B5j5k7J0J1k11M94j91p3J42k51j3J02O9P6l12L73l37J90j17J5O1j11J97j15
4449hj33QJ19j46J80l9r0j22R0P9J13J64j81k27O1J47j87J23k0n4J30mq8J06L8
4474E9J7j06J04k37K07j43K7J13J1oj32J80j20r7K53q6k67M75j33k49K91r8p1
4497hJ27m7l9J1r6j45L13R6r7R4j91L0k23k4K0N2RR5k46O61l48j51K40j04J56
4522A85j76L22n00J59N1l7p9J31j0K9J16l98l2J10L85l15J93K7k68J20q6O2N8
$$ plain form
4545 47 -92 18 -56 -26 -208 -120 -271 101 -135 -227 54 -172 227 18 -64 -53 -101 -36 212 131 -84 -73 22 -222
4569 -222 -51 64 -13 46 -272 262 91 -108 77 -24 172 62 99 20 113 -73 -54 12 -309 128 -12 59 16
4592 16 -70 155 -182 100 -99 -43 -39 29 -143 -62 -124 -42 -117 21 -102 -16 -47 -171 -209 -38 14 -178 51 66 -204
4617 -204 137 93 -15 -51 68 6 -145 -144 -69 217 12 -240 25 -112 172 50 276 51 46 214 11 47 -7
4640 -7 154 197 -20 -268 -57 -192 248 20 -70 -184 208 346 -93 76 111 152 -10 -64 70 43 -75 234 76
4663 76 71 -134 -183 237 31 95 46 -115 206 -72 -67 -45 77 50 214 70 207 -74 73 84 -48 -123 -218 -143 44
4688 44 94 -140 82 125 -14 122 72 169 -167 100 119 82 29 -37 -8 -178 -15 -157 232 -221 157 189 -52 175
4712 175 25 36 196 -253 142 -84 -143 232 32 133 264 -71 125 -23 131 134 -47 1 76 8 39 132 223
$$ packed form
4545D7j39J10p4L0j82Q8j51L72k36r2K81k26L99k09q2J1m8O5K48q1k15J1R5k44
4569b22J71J15p7N9l18N34j71j99J85j01J96j10L7p9R3j86J9O6l21M37j40P1m3
4592A6q6K25l37K82j99N6MO8j72Q1o2Q2p5J38j23Q6l1j24l8J71N2j92K29J5k70
4617b04L41m4j08l6J19o2j51JP5K86k05k52K65j37K84j22K26k25nJ68k03L6n4
4640gJ61M3k17k48K11j35M40k28r0j14L92J38m39J69L5M1j62n4J34k7j18L09j58
4663G6nk05m9M20k06O4m9j61L21k78NK2J22k7J64j44J37k81J47J1j32p5r5P5J87
4688D4N0k34K22M3j39J36n0R7l36K67J9l7n3o6K9j70J63j42L89m53L78L2k41K27
4712A75j50J1J60m49L95k26n9L75k00J01J31l35J96j48J54Lj81M8P5o8L1R3R1
$$ plain form
4735 223 12 44 -50 -67 332 -67 -106 -93 -87 -139 -28 -151 -111 -209 266 117 -8 240 390 51 7 39 -33 -52 82
4760 82 91 -142 68 271 -99 112 100 104 252 -193 9 48 46 -225 121 -92 79 203 154 76 203 -149 -11 -219
4784 -219 272 -240 -306 252 7 67 234 13 149 187 152 0 -47 49 141 -17 -98 -242 -1 -33 -184 160 102
4807 102 -207 -173 -179 -129 62 -337 -62 32 -67 -77 43 -16 52 69 -39 5 26 -210 168 295 222 62 -117 -1
4831 -1 167 -95 -113 -67 30 -139 70 -200 -77 75 -117 -91 -166 330 -8 33 -86 26 -93 -56 163 -211 -177
4854 -177 -19 283 -6 258 197 -127 -41 -20 145 66 -198 68 -250 31 -84 15 -31 52 -51 -44 65 84 10 -245
4878 -245 7 -1 -125 17 -229 -50 11 107 -259 28 -38 170 -16 -193 -92 -62 110 -1 -48 33 42 -40 -107 53
4902 53 -156 105 44 -127 -9 270 -115 -108 4 53 153 -97 164 1 154 -306 204 -217 -258 -355 -52 177
$$ packed form
4735B23k11L2r4j7L99l99l9J3On2J11j23M0r8M75j49j25K48J50l39m4L2p2j9J34
4760H2Rk33K10K03l70K11j2MJ48m45K02L9kk71L46k13J71J24m9p8J27l52J38k08
4784b19M91n12o6N58k45O0J67k21J36L8l5j52m7R6R2j58q1j44K41l2j51L44n8
4807A02l09L4oN0J91l99K75R4r9j0J20n9O8J7j08M4K1k36L78J27p3j60j79J16
4831aJ68k62j8M6R7j69K09k70J23J52j92K6p5M96l38M1j19J12j19L7K19l74L4
4854a77J58L02k89K64o1l24Q6K1J65p9k64K66l18K81j15R9m6Q3j03PJ09J9p4k55
4878b45K52qj24J42k46J79O1R6l66K87o6K08j86j77J01L0J72j11m7Q1Rq2o7J60
4902E3k09K61o1j71J18K79l85PJ12M9J00k50K61j63J53m60N10m21m1r7L03K29
$$ plain form
4924 177 5 85 -138 -134 -117 -57 310 -208 -73 181 -73 -45 -32 -11 -54 68 -241 298 13 -113 66 -331 -110
4947 -110 30 76 106 180 -30 196 -48 14 208 -69 146 92 245 59 43 48 68 -7 21 -16 43 13 -158 -150 58
4972 58 304 -34 -226 -270 -112 -164 120 -131 -11 167 117 28 25 88 -50 366 50 23 -75 30 222 -70 146
4995 146 -47 -224 -174 -58 -30 105 6 35 -153 62 -86 188 -135 -106 25 -221 66 236 -72 -251 -89 -125
5017 -125 -165 39 23 116 -89 185 29 165 -350 84 -98 181 -50 134 339 -59 125 -7 -182 -33 62
5038 62 246 214 -68 134 -94 85 19 57 125 -6 -131 180 10 229 -120 -201 -147 -19 303 24 21 -82 -191
5061 -191 62 -107 -18 84 -59 -64 70 -22 -169 132 -3 131 41 -19 53 -109 -61 70 97 -122 -43 105 58 -60
5085 -60 39 -52 -18 -175 -112 -200 -25 44 7 201 -189 56 -224 -12 -179 -360 153 -210 -117 -114 -202 -89 -25 -46 -212
$$ packed form
4924A77j72Q0k23MJ7O0L67n18J35K54k54K8J3K1m3J22l09N39k85j26J79l97K21
4947a10J40M6L0P4k10K26k44O2J94k77K15n4J53j86j6NK0p5K8l7N9l0j71QK08
4972E8K46l38j92m4J58n2K84k51J20J78n0q9lO3j38M16l16k7r8J05J92k92K16
4995A46j93j77N0J16K8J35r9K9j88K15j48K74l23K9J31k46K87J70l08j79J62l6
5017a25m0K04j6R3k05K74j56J36n15M34j82K79k31J84K05l98J84j32j75J49R5
5038F2J84l2k82K02k28J79o6L8O8j31j25L11j70K19l49q1N4J28L22k79lj03j09
5061a91K53j69Q9J02j43nJ34r2j47L01j35J34r0o0P2j62M8J31K7k19P9J48m7j18
5085f0R9r1L4j57O3q8J75O9l7J94l90K45k80K12j67j81N13l63R3Lq8J13O4k1j66
$$ plain form
5110 -212 213 41 246 51 17 79 -207 -116 0 280 35 110 86 146 118 -69 -64 6 -27 -129 -193 -230 233 -244
5134 -244 -151 -34 -126 -3 -83 -261 17 226 -60 284 -259 98 -68 -60 202 -174 63 18 221 -212 -291 -118
5156 -118 117 -129 -28 246 236 22 119 -108 106 163 -4 -28 -36 -54 -91 -106 -17 -150 -134 172 -34 -47 -70 185
5180 185 -295 72 2 -10 73 10 53 147 91 115 190 1 113 -80 58 2 -152 -20 -23 62 40 93 -40 126 -37
5205 -37 2 38 61 191 67 200 155 140 172 -81 173 92 186 50 -183 -225 -115 143 -195 64 160 81 28 77 149
5230 149 157 31 -20 21 -146 154 221 -125 -149 120 80 191 -1 73 12 177 152 62 -295 193 57 184 39 -10
5254 -10 221 53 85 153 0 -35 81 -56 -132 -130 123 -66 94 7 101 -235 -144 -90 -32 -127 0 -200 53 -136
5278 -136 1 -28 246 45 18 16 121 -170 218 -28 13 -324 -213 78 -163 106 -59 232 -95 -92 220 -165
$$ packed form
5110b12M25j72K05j95l4O2k86R1J16K80k45P5k4O0k8j87NP0l3j02o4l7M63m77
5134b44R3J17r2J23q0j78K78K09k86L44n43L57j66QK62l76K37m5K03m33p9J73
5156a18K35k46J01K74j0k14R7k27K14N7j67k4qj8l7j5Q9j33J6L06k06j3k3K55
5180A85m80L67p0j2Q3o3M3R4n6K4P5j89J12j93J38n6j54J32lQ5k2N3j33J66j63
5205c7L9L6K3J30j24J33m5j5L2k53K54q1R4j36k33m2J10K58l38K59R6p9n3M9P2
5230A49Qj26n1M1j67L00O7l46k4K69m0J11j92P4o1J65k5r0l57M88j36J27j45m9
5254a0K31j68L2O8j53l5J16j37p6KK53j89J60q7R4l36R1N4N8r5J27k00K53j89
5278a36J37k9K74k01k7kJ05k91L88k46M1l37J11K91k41K69j65K91l27LL12l85
$$ plain form
5300 -165 16 179 56 -180 117 7 -27 122 -157 -25 -18 -250 45 -41 -23 -127 -127 -38 -16 -172 -23 97 -240
5323 -240 66 166 -35 29 -100 -88 113 -86 38 -48 -37 -178 166 -188 187 34 -10 53 -16 -139 -80 103 -95
5346 -95 -52 132 -21 44 -19 -18 192 6 -23 -268 -71 -193 109 -5 1 -33 8 47 109 -90 -27 27 -75 -85 -8 -7
5372 -7 119 100 20 65 92 76 156 141 123 182 196 -150 49 -79 -37 20 45 -52 -77 60 -138 -156 181 19 -133 -42
5398 -42 137 -38 -286 260 -39 192 -13 -19 311 4 -120 262 51 -15 235 -176 -167 23 22 175 -135 -191 138
5421 138 -257 41 70 -95 -47 -47 -124 202 199 155 -55 -55 -87 -85 247 8 134 -20 166 -84 -82 -18 29 -173 -164 38
5447 38 36 157 -131 88 -70 49 56 28 -73 -60 40 69 -64 -197 21 6 39 -15 30 -201 -103 -77 -116 -2 173
5472 173 -248 132 -63 -20 128 -60 -20 -72 -55 58 -31 14 160 9 99 -51 39 16 139 -26 110 -31 -161
$$ packed form
5300a65J81J63j23k36K97j10l4J49k79J32Pk32K95q6J8j04%Q9K2j56J49J20l37
5323b40L06J00k01O4j29J2K01j99J24q6J1j41L44l54L75j53m4O3o9j23N9J83j98
5346i5M3J84j53O5o3JK10j86k9k45J97j22L02j14Ol4M1L9O2j99O3N4j02j0P7J
5372gJ26j9q0M5K7j6Q0j5j8N9J4l46J99j28M2N7K5r7k5J37j98j8L37j62j52R1
5398d2J79j75k48N46k99K31k05oL30l07j24L82k11o6K50m11RJ90jJ53l10n6L29
5421A38l95K98K9j65M8%p7L26lm4k10%l2KL32k39J26j54J86k50KO4M7k02RK02
5447C8kJ21k88K19j58J19Pk8j01J3J00K9j33j33K18j5L3n4M5k31R8K6l9J14J75
5472A73m21L80j95M3J48j88M0n2J7J13q9M5J46j51R0j50R0k3J23j65J36j41j30
$$ plain form
5495 -161 -70 26 -76 111 -132 31 175 181 -192 -105 46 67 86 52 89 9 -102 -19 -110 26 157 -53 -82 37
5519 37 228 -222 -227 26 147 -26 -140 -34 -84 235 -83 -11 30 -265 109 25 35 242 351 120 -93 -47 0
5542 0 43 45 93 63 -40 158 -104 10 -33 -22 243 9 -8 -57 -156 79 68 -44 19 -180 -249 107 50 97 76 -86
5568 -86 20 5 0 109 43 257 82 61 45 -86 0 -108 142 56 -75 57 -103 72 -88 163 31 -29 -242
5591 -242 -126 -117 58 -238 345 40 -197 195 -128 189 149 49 -359 177 -90 8 242 46 -252 134 -19
5612 -19 25 11 -1 207 121 -122 118 -284 154 -123 102 7 -51 -125 46 113 23 -114 6 14 97 34 98 121 178 -201
5638 -201 280 70 116 139 -61 243 -161 -53 78 -242 -136 -37 -106 182 76 -102 -160 54 -180 -120 17 25 77
5661 77 324 -99 -49 -308 25 166 31 181 47 225 92 -131 18 8 -80 274 114 -6 -198 67 87 87
$$ packed form
5495a61R1R6j02J87k43J63J44Ol73Q7J51K1J9l4L7q0j11Q3r1J36J31k10k9J19
5519C7J91m50nK53J21j73j14J06n0L19l18P2M1k95L74q4J0K07J09k31k13M6M7
5542@M3KM8l0j03J98k62J14m3J1K65k34j7m9r9K35j1j12O3j99o9L56n7M7k1j62
5568h6J06j5nJ09o6K14j75k1j6j31Q6j08K50q6j31J32j60J75j60K51j32o0k13
5591b42J16RJ75k96N83l05k37L92l23L17m0j00m08N36k67R8K34j96k98L86j53
5612a9M4j4j2K08q6k43K40m02M38k77K25r5n8p4J71O7r0j37J20QQ3o3O4K3N7l79
5638b01M81k10M6K3k00L04m04J08J31l20J06R9o9K88j06j78n8K14k34O0J37QN2
5661G7K47m23N0k59L33J41j35J50j34J78j33k23J49j0q8L54j60j20j92K65K0%
$$ plain form
5683 87 98 30 83 69 -11 46 -184 64 -114 -88 107 12 -44 41 245 39 -109 -81 186 128 112 157 29 57 -7 -90
5709 -90 162 -80 109 -20 112 -53 127 65 220 -84 47 30 264 317 -149 43 -160 -26 -210 96 -44
5730 -44 22 -115 -39 25 17 130 27 7 27 -163 183 31 124 -247 49 -14 -317 -301 304 167 -173 101 173 190
5754 190 -2 34 147 155 195 -152 -16 67 -25 25 -98 -289 186 22 41 -203 195 -34 77 74 -83 -92 -77 -140 1
5779 1 -108 -183 16 -133 252 218 -128 -93 -166 14 155 90 68 -25 -246 147 169 -143 -52 148 -96 -35 -148 97
5803 97 -73 11 68 -219 -86 -68 55 35 -24 83 53 41 166 53 -36 -12 153 93 -118 37 22 -48 184 5
5827 5 74 -48 -33 105 32 25 -206 -47 -177 174 71 -72 -275 -93 -114 -187 329 -13 161 -75 -45 -229 225
5850 225 -166 -51 128 49 112 237 20 -185 147 32 66 -102 4 89 -72 91 173 -213 170 80 -143 -219
$$ packed form
5683H7J1o8N3j4q0N7k30K48j78K6J95r5n6Q5K04k06j48K8K67n8j6M5j28K8o4q3
5709i0K52k42J89j29J32j65J80o2J55l04J31j7K34N3m66J92k03J34j84L06j40
5730d4O6j37P6O4qJ13j03k0K0j90L46j52R3l71K96o3l03J6O05j37l40K74P2J7
5754A90j92L6J13QM0l47J36Q3r2N0j23j91M75j64J9k44L98k29J11lj57rJ5o3J41
5779Aj09p5J99j49L85l4l46L5p3J80J41o5k2r3k21L93K2l12R1K00k44O1j13K45
5803I7j70Q4N7k87J33J8J23k0n9J07l0j2J25j13q9K4J65o0k11J55j5p0K32j79
5827EO9j22J5J38p3pk31J59j30L51j03j43k03J82k1p3N16l42J74k36L0j84M54
5850B25l91J15J79p9O3J25k17k05L32j15L4j68J06Q5j61J63Q2l86L83r0k23p6
$$ plain form
5872 -219 -274 124 78 -132 -118 -262 -58 -46 -166 -60 21 -30 -12 175 -65 -44 -79 156 80 61 -52 0 54 51 -107
5897 -107 208 -108 85 -39 -145 -28 210 155 -3 -89 -2 29 60 8 53 166 89 305 -186 66 -29 -14 71 131
5921 131 -97 102 82 -17 -57 37 51 136 -156 11 -79 228 -44 62 26 -399 -140 -89 -150 -46 -87 214 88 9
5945 9 174 252 -28 221 -139 -78 69 -35 -36 70 -118 2 179 113 -74 73 72 -54 238 22 -60 -157 -163 -301
5969 -301 -105 52 82 -14 91 -134 285 59 10 -63 51 -45 -68 297 45 18 112 -75 -176 -89 146 72 -262
5992 -262 -88 -40 60 -175 -267 69 109 -105 -422 -57 117 104 54 -125 -123 45 38 112 255 4 35 68 15 -162
6016 -162 -121 56 111 -24 80 -20 -72 75 -125 -39 67 282 -188 -314 18 52 -2 -94 -42 125 56 190 -123
6039 -123 -153 51 -164 18 -74 141 16 170 -132 -180 124 34 169 -267 -145 88 -96 17 -13 -111 -108 -99 131
$$ packed form
5872b19n5L98m6k10J4j44K04J2j20J06Q1n1J8J87k40K1l5K35p6j9j13N2N4lj58
5897a07L15l16J93j24j06J17K38n5j58q6Q7L1L1n2M5J13p7K16m91K52r5J5Q5O0
5921A31k28J99k0r9m0R4J4Q5k92J67r0L07k72J06l6m25K59N1o1J04m1L01j26p9
5945IJ65P8k80K49l60O1J47j04jJ06j88J20J77o6j87J47jj26K92k16q2r7oj38
5969c01J96J57L0r6J05k25M19k26m9p3J14r6k3L65k52k7R4j87j01Q7K35p4l34
5992b62J74M8J00k35r2L36M0k14l17L65J74j3n0j79KJ68pP4J43k51L1L3n3j77
6016a62M1J77N5j35J04j00n2J47k00Q6J06K15m70j26L32L4n4r2N2J67o9J34l13
6039a23l0K04k15J82r2K15j25J54l02m8L04r0J35m36J22K33j84J13l0r8LRK30
$$ plain form
6062 131 -33 -30 -178 -32 -331 -10 161 143 36 55 -62 118 13 159 73 -251 -240 -166 71 -137 61 306
6084 306 23 -93 -27 -100 -76 -179 25 -128 30 27 -16 -98 -48 -205 -119 -53 71 -66 -12 -261 111 6 33 -83
6108 -83 56 108 81 115 172 -124 -206 49 -156 38 -121 -158 -62 -75 -47 79 -173 22 -159 -64 -135 258 -161 -214
6132 -214 83 -260 -22 -197 -132 40 56 110 -116 -73 35 67 -128 -81 -102 246 45 128 110 157 201 -2 239 -40
6156 -40 -318 11 44 11 -143 133 -184 -75 214 110 -43 51 276 -36 79 26 70 -41 116 143 -115 129
6178 129 -116 84 160 90 61 -190 184 112 203 -25 -86 -130 11 10 -32 -15 -58 -40 204 -20 -268 -85 94 -55
6202 -55 96 -156 -22 219 -12 -98 -29 -169 283 221 -27 125 364 -5 -124 121 -33 -98 177 7 -63 -83
6224 -83 14 -174 64 51 -229 87 -216 -242 43 115 -317 -46 -57 146 37 -171 20 259 -109 239 191 44
$$ packed form
6062A31j64Lj48J46k99L21J71j8j07J9j17J80j05J46q6l24J1P4K37k08J98K45
6084C06k83j16O6p3K4j03K04j53J58lm3q2N0j57Q6O6J24j37N4k49L72j05K7j16
6108h3J39N2k7L4N7k96q2K55k05J94j59l7R6j3K8J26k52J95j81R5p1L93m19n3
6132b14K97l43K38j75O5J72J6N4k26M3J08L2j95M7k1L48k01Q3j8M7M4k03K41k79
6156d0k78L29L3l3j54K76l17J09K89j04j53R4K25l12J15n3M4j11J57K7k58K44
6178A29k45K00P6p0k9k51L74p2R1k28o1m4J41jm2J7m3J8K44k24k48J83J79j49
6202e5J51k52J34K41k31q6O9j40M52o2k48J52K39l69j19K45j54o5K75j70p0k0
6224h3R7j88K38j3k80L16l03k6K85P2m32K71j1K03j09k08J91K39l68L48m8j47
$$ plain form
6246 44 -167 43 -283 -3 142 88 -3 -224 -214 -110 -20 118 34 -108 -6 -187 86 -308 109 78 -181 244
6268 244 -75 160 9 -76 242 107 26 -230 9 -102 72 -216 -178 167 103 -140 -109 -20 129 -249 -141 265
6290 265 -162 9 211 -186 -229 -58 145 -229 118 13 -59 -176 83 93 -105 49 -11 -18 -36 117 2 -146
6312 -146 -138 21 -93 301 14 158 66 143 36 -71 266 2 8 -170 -8 67 -105 156 75 251 -68 135 -79
6335 -79 141 -63 -95 -112 70 -121 138 33 42 48 196 -157 42 66 4 24 -71 -113 -177 -66 -331 -71 220 -30
6359 -30 -169 -219 -109 -76 -160 -105 -22 52 -70 45 -85 -204 -190 138 21 135 -112 -54 -132 -71 257 159 -56 -291
6383 -291 84 -26 -221 -118 76 49 -141 -25 -123 102 -146 25 86 -146 -169 128 19 -110 -58 353 -44 -33
6405 -33 255 192 -143 42 -21 -75 261 -109 -246 -109 68 -139 18 33 -44 41 17 -169 127 115 -57 79 -5
$$ packed form
6246D4k11K10l26K80J45n4r1k21J0J04R0J38q4j42J02j81K73l94M17l1k59M25
6268B44l19K35j51q5L18j35q1k56K39j11J74k88L8L45o4k43L1Q9J49l78J08M06
6290B65m27J71K02l97m3J71K03l74L47j05p2j17K59J0j98J54o0pj8J53j15j48
6312a46QJ59j14L94k87J44r2P7j07j07L37k64Oj78J62P5j72K61q1J76l19K03k14
6335g9K20k04l2j7J82j91K59j05ROJ48l53J99K4o2K0r5m2o4J11k65K60K91k50
6359c0j39n0J10L3q4N5Q3P4j22J15j30j19J4L28j17J14k47N8p8O1L28r8k15k35
6383b91L75j10j95J03J94k7j90J16r8K25k48J71O1k32k3K97j09j29N2M11l97J1
6405c3K88o3l35J85o3n4L36l70j37J37J77k07J57J5p7Q5k4j86K96j2j72J36q4
$$ plain form
6428 -5 -50 -59 -119 -86 171 -98 -108 205 241 35 -32 -74 210 -18 89 -198 -30 202 -118 209 163 50 -246 2
6452 2 3 38 59 -163 -33 -96 -30 -150 14 -69 -108 121 163 -65 -31 97 -6 90 241 138 142 -42 353 -87 64
6477 64 -187 -35 134 -119 158 9 -227 35 11 -19 95 325 157 287 147 -9 -48 -76 60 -71 44 -114
6499 -114 -147 53 -11 -56 -95 54 -145 -64 23 -196 -104 16 10 8 -80 -27 -61 -53 -266 -140 -271 -124 17 -103 -9 -158
6525 -158 -11 -53 35 186 240 86 -214 -53 77 -47 187 -101 -76 96 -313 -44 -136 -86 188 -46 58 -21
6547 -21 -213 72 -35 55 1 -3 -5 -159 -88 -333 -159 42 72 -155 -35 109 -127 140 -69 125 -77 161 26
6570 26 -15 32 -304 -22 -89 32 -129 -130 27 23 118 186 -43 -105 62 33 1 -143 -202 42 59 -82 309 52 83
6595 83 80 7 -184 -109 133 47 46 64 81 180 197 -189 -4 -14 -152 -280 -66 -17 39 -41 -76 174 -26 5 -249 -41
$$ packed form
6428em5ro0L3K57k69j0L13L6k06o7m2K84k28J07k87J68K32l20L27m6j13k96K48
6452BJL5K1k22J30o3O6j20J64q3l9K29M2k28L4J28j03R6J51j03Mj84L95m40J51
6477F4k51J52J69k53K77j49k36K62k4l0J14K30j68J30j40j56l9k8J36j31J15j58
6499a14l3K00o4m5l9J49j99Q1Q7k19R2J20okq8N3l4Qk13J26j31J47J41j20R4j49
6525a58J47m2Q8J51N4j54l00J61J30j24K34k88K5J72m09K69r2N0K74k34J04p9
6547b1j92K85j07R0n4mkj54P1k45J74K01L0k27J20J44k36K67k09J94k02K38j35
6570B6m1M7l36K82o7J21j61jJ57mR5O8k29o2J67k9l2j44n9K44J7j41L91k57L1
6595H3lp3j91P5K42q6jJ8J7R9J7l86J85j0j38j28K14M9N6q0l5K50k00L1k54K08
$$ plain form
6621 -41 35 -45 -90 62 35 251 -171 -179 149 -75 -14 -82 -158 -106 -187 66 -134 -159 83 92 65 -185 343 -71 91
6646 91 -257 -102 -32 -71 -59 -277 -140 259 14 63 -129 -153 221 -224 -57 -103 -14 -83 162 -72 -193 -107 89
6669 89 34 -101 196 69 -16 179 31 192 16 -16 64 -81 -48 -96 -112 -42 -189 -42 196 39 246 185 -360
6692 -360 -281 -14 -152 203 45 17 -48 137 -39 -34 -30 -189 -303 -48 86 99 -69 40 -194 -108 -88 -219 -184 145
6716 145 -2 -158 339 -208 214 -185 -5 -104 -135 41 -201 303 -71 -68 -154 29 -90 -89 74 1 144 50 -209
6739 -209 -14 -55 52 134 -227 -252 -73 -242 -207 32 -101 -221 -36 66 77 -146 -79 -155 -168 -13 -30 190 -137
6762 -137 -66 -300 211 155 141 94 104 -82 2 -36 378 45 -116 155 203 18 -196 199 -81 -1 139 29 -143
6785 -143 -14 -182 -14 -3 164 13 106 -164 -136 -59 28 -75 42 100 82 198 167 150 -192 49 -44 -87 234 143
$$ packed form
6621d1P6q0m5J52k7K16m22qL28k24O1o8p6N2q1K53k00k5K42Rk7k50N28m14J62
6646I1l48J55P0l9J2k18J37L99k45M9j92k4L74m45J67m6Q9o9K45k34j21Q6J96
6669H9n5j35K97j27q5J95j48J61j76l2Q0j45L3m8j6P0j47J47K38j57K07o1n45
6692c60P9K67j38L55j58k8o5J85j76NMj59j14K55J34J3j68J09k34Q6K0j31L5L29
6716A45j47j56M97n47M22l99J80r9l1J76k42N04l74Lq6J83j19JJ63p3J43r4k59
6739b09J95m1J07Q2l61k5J79j69L5K39j33j20J85J02J1k23O7p6j3J55j7K20l27
6762a37P1k34N11n6j4m7J0j86Q4l8M14l33j61K71M8j85k14L95k80Q0J40j10j72
6785a43J29j68J68J1J67j51R3k70K8P7Q7j03J17N8j8J16l1j7l42K41r3m3L21r1
$$ plain form
6809 143 -247 156 115 68 -45 380 29 169 -142 19 -83 -7 49 -35 -268 26 214 77 50 91 49 -1 -95
6832 -95 -89 103 -211 -59 -36 -33 -37 -8 83 198 -10 10 -224 81 -206 145 -56 -19 63 -198 63 9 -314 239 -12
6857 -12 164 174 148 137 112 94 -124 99 -21 70 164 -23 -31 298 400 -111 -183 17 122 159 -20 -11 -161 72 -52
6882 -52 11 -115 -71 -135 -140 120 -3 53 31 112 57 55 111 -46 47 -9 -6 65 -156 -156 105 -93 7 -220 -219 17 82 10
6910 10 111 -4 -95 -14 12 88 -68 -263 -16 -86 131 123 -52 -180 -108 68 140 177 54 -131 -200 -68 -214 -26
6934 -26 -41 -203 17 178 79 52 -170 235 177 -127 7 32 96 47 -221 5 134 140 -37 11 -31 -114 0 158
6958 158 -64 149 30 290 55 -60 24 271 -173 164 -55 26 3 13 -104 -91 211 67 -15 -59 -9 -57 -105
6981 -105 148 45 41 -153 26 108 -108 36 -49 -21 -26 -129 -106 111 -90 -226 -214 111 187 -17 45 -127 23 -222
$$ packed form
6809A43l90M03m1m7j13M25l51J40l11J61j02P6N6q4k33K94J88j37k7M1m2n0r4
6832i5OJ92l14J52K3LmK9R1J15k08K0k34L05k87L51k01L7Q2k61K61n4l23N53k51
6857a2J76J0k6j1k5j8k18K23j20R1R4j87qL29J02n11p2K00J05L7j79Rj50K33j24
6882e2O3j26M4o4nK60j23N6k2Q1n5kN6j57R3n6LP1k21%K61j98J00k27JK36O5p2
6910A0J01j15r1Q1K6P6j56j95K47p0K17qj75j28P2J76P2L7j23j85o9J32j46J88
6934b6j5j62K20J61r9k7k22M05n8l04J34K5O4m9k68K26J29Oj77M8m2q3J14J58
6958A58k22K13j19K60k35j15Q4K47m44L37k19Q1k3J0j17J3L02j44q2m4N0m8m8
6981a05K53j03mj94J79Q2k16J44q5K8nj03K3K17k01j36J2L25P6k04O2j72J50k45
$$ plain form
7005 -222 -49 27 35 217 -24 -66 -149 -138 -135 -14 59 114 164 82 117 116 -78 56 -29 -222 31 36 209 46 196 -347
7031 -347 -33 41 -148 -116 -142 -375 29 142 -158 -136 177 -72 -65 -11 -82 -13 -12 -205 200 -178 12 -222 -134 8
7055 8 127 -56 11 -261 -101 -273 244 23 -151 25 -126 -116 -2 53 -16 -121 -26 -17 59 -129 -218 29 259 171
7079 171 -138 121 147 -58 49 91 64 56 -133 -180 -2 88 180 145 -64 -146 65 -55 -101 160 29 -281 -48 -71
7103 -71 -274 -97 -24 138 -23 -233 44 179 216 -206 85 14 119 -67 147 286 -47 158 -11 325 -156
7124 -156 -15 -316 94 87 61 -47 144 -61 -197 -173 -115 5 192 -120 212 99 -15 10 -67 -60 -127 -218 119 31
7148 31 -33 74 66 -117 47 28 200 111 -261 2 -30 182 -111 -19 18 63 -317 19 -67 230 62 73 -130 190
7172 190 -64 -52 182 -15 177 10 194 -4 -234 160 3 -82 133 -146 -20 -85 -15 14 -91 -122 -28 155
$$ packed form
7005b22J73P6QJ82k41m2q3J1LJ21P3N5N0q2L5jj94J34q5j93K53NJ73j63J50n43
7031c47L14P4j89L2k6k33M04J13l00K2L13k49PN4p1O9Jj93M05l78J90k34Q8J42
7055HJ19j83O7k72J60j72N17k21j74J76j51J0J14N5o9j05R5RP6j88q9K47K30q8
7079A71l09K59K6k05J07M2k7qj89m7J78R0R2l5k09q2K11j20m6K61j31l10K33k3
7103g1k03J77P3J62j61k10K77J35L7m22K91p1J05j86K14J39l33K05j69L36m81
7124a56J41l01M10pk6j08J91k05j36K4N8J20J87l12L32j13j14K5p7Po7r1L37q8
7148C1o4J07qj83J64j9J72q9l72K63l2K12k93R2L7M5l80L36q6K97j68J1k03L20
7172A90k54J2K34j97J92j67J84j98k30L94j57q5K15k79J26o5P0K9j05l1R4J83
$$ plain form
7194 155 -9 50 135 -195 -176 17 9 -138 -263 104 -33 -156 -225 8 -112 192 286 -126 47 -16 -83 197 -115
7217 -115 -44 115 30 14 122 27 159 52 48 -269 -47 -3 -12 -60 74 168 159 122 -173 160 -208 -15 -43 -9 -229
7242 -229 -101 -157 39 91 64 93 111 -102 -194 -97 -96 117 -79 18 -236 188 95 -228 -43 11 -101 -119 195 -124
7266 -124 202 -29 108 -141 -48 26 -137 61 6 -89 -15 207 -45 -87 -132 -57 150 -52 40 -50 113 154 91 70
7290 70 129 63 43 -238 139 147 70 56 -34 -71 63 -51 -30 30 103 132 -19 -118 -24 140 20 -12 36 52 50 -64 237
7317 237 -20 140 85 -234 -196 109 208 150 146 5 -72 -247 -226 7 -151 -59 177 111 -79 166 -56 -160 73
7340 73 -231 42 114 49 -166 -84 -23 16 51 -71 -9 -82 -232 -52 9 264 -126 -104 108 -89 -222 -17 -117 -126
7364 -126 -211 -190 1 172 28 89 10 54 70 -56 28 -219 21 -121 -192 -25 -44 -53 -106 -88 214 -233 273 154
$$ packed form
7194A55j64N9Q5l30J9J93qj47j25L67j37j23o9K33j20L04R4m12J73o3o7K80l12
7217a15P1J59q5j6J08r5J32j07ml17K22M4rm8J34R4rl7k95L33l68J93k8L4k20
7242b29J28n6J96N2k7K9J8k13r2R7JK13j96R7k54M24r3l23J85N4j12j8L14l19
7266a24L26k31J37k49R3P4j63J98n5r5P4K22k52m2m5P5K07k02R2r0J63M1o3k1
7290G0N9o6k0k81L77Qp7j4r0l7J34j14K1O0P3K9j51r9R4J64j20l2M8J6kj14L01
7317B37k57J60n5l19L8L05R9n8mj41p7j75K1K33j58R2K36o6j90K45k22j04K33
7340G3l04K73P2o5k15Q2O1L9L5j22O2p3j50J80O1K55l90K2K12j97j33K05j00r
7364a26q5K1J91J71j44O1p9M4J6j26Q4k47K40j42p1J67j9rn3J8L02m47N06j19
$$ plain form
7388 154 -101 147 -191 -163 176 -96 -16 70 110 151 -18 149 -104 208 -219 250 -4 141 -61 87 -36 -16
7410 -16 -71 -278 -58 -186 33 -15 -241 41 -23 132 72 176 -102 -119 -61 -297 246 81 31 100 58 15 -47 -38 62
7435 62 82 144 -106 44 -217 -135 128 -108 -33 -4 267 -42 -23 21 107 88 81 5 59 -33 -158 -19 313 212 -197
7460 -197 149 -29 75 0 263 -3 91 -182 -80 -6 -20 218 -47 -29 44 -19 -41 122 -6 -140 -98 -97 77 2
7484 2 -81 166 2 36 -210 -28 29 -51 -230 114 66 36 -117 -124 217 216 106 97 -17 -44 24 -48 -109 -29 -14 -141 241
7511 241 3 108 30 307 234 106 -100 18 -229 -111 144 176 122 -185 79 -105 54 -72 86 24 38 31 -150
7534 -150 -125 165 -57 -97 57 4 97 111 -94 90 -186 -132 -171 74 -355 -98 208 46 -5 72 176 -357 -190
7557 -190 139 -171 100 -12 -91 82 -265 27 25 54 -89 68 -117 -185 139 -143 -95 -2 -60 115 69 281 -107
$$ packed form
7388A54k55K48l38K8L39k72Q0Q6M0M1j69J67k53L12m27M69k54J45k02J48j23K0
7410a6n5k07K20j28K19m8k26K82o4J55o0J04k78j7N8k36N43j65n0O9m2m3o2RJ00
7435F2K0O2k50J50k61Q2K63k36P5K9K71l09J9M4Q6j9pp6N4r2j25J39L32j01m09
7460a97L46j78J04p5K63k66R4k73J02P4j4K38k65J8P3o3k2J63j28j34M2JJ74p5
7484Bq3K47j64L4k46J82N7q0j79L44m8l0j53pL41jj10rj14k7O8p2o1Q0J5j27L82
7511B41k38J05p8K77p3j28k06J18k47J18K55L2n4l07K64j84J59j26J58o2J4pj81
7534a50K5K90k22m0J54n3R3J4k05J84k76N4l9K45m29K57L06j62n1P7J04n33J67
7557a90L29l10K71j12p9J73l47K92kK9j43J57j85o8L24k82M8R3n8J75m6K12l88
$$ plain form
7580 -107 -114 -23 -129 35 -77 -199 233 95 84 155 118 -43 -106 98 81 10 58 123 -240 -42 108 3 -28 212
7604 212 -109 -38 285 121 -227 -39 34 42 -93 -149 -40 -4 -10 -40 91 -221 106 6 330 31 -57 -151 -36 -100
7628 -100 -245 89 -144 161 -140 -140 -81 -139 -107 50 13 13 -64 -84 -242 -36 -113 179 88 -186 19 135 -212 -36
7652 -36 -168 -22 76 -61 -42 -162 75 -178 132 356 -190 245 -37 93 175 88 72 -49 166 174 -31 -222 71
7675 71 74 -53 272 -73 163 -65 -1 100 -172 -31 -40 -43 -109 -149 180 34 -67 -106 -66 -181 158 -56 -73 -51 130
7700 130 -197 -254 45 60 171 -69 -6 -150 66 10 -113 -37 -61 -196 235 -97 -232 -87 -67 -134 -20 -247 106
7723 106 30 -15 7 27 173 -20 -289 104 104 -32 -206 -62 45 -49 -108 5 206 -107 -57 226 -349 93 -91
7746 -91 129 -59 -48 217 -7 -37 45 360 87 -19 56 -69 21 85 -47 -33 60 23 -25 107 77 -32 -141 22
$$ packed form
7580a07pR1j06J64j12j22M32j38j1P1l7j61o3K04j7p1M8O5l63J98J50j05l1K40
7604B12l21P1L23j64l48J88P3Qj35n6J09L6ol0J31l12L27j00L24k99q8r4J15o4
7628a00j45L34k33L05l01%N9n8L2J57l7%p7k0j58K06p7K92r1k74K05J16l47J76
7652c6j32J46R8j37J9j20K37k53L10K24n46M35k82J30Q2q7j6j21K15Qk05j91K93
7675G1Lj27L25l45K36k28O4J01k72J41rlo6m0L29j46j01l9M0j15L39k14j7K2J81
7700A30l27n7K99J5J11k40O3j44K16n6j23P6k4j35M31l32j35J45K0o7J14k27L53
7723A06p6m5K2K0J46j93k69L93%j36j74J44J07r4n9J13K01l13N0K83n75M42j84
7746i1K20j88J1K65k24l0Q2L15k73j06P5j25R0O4j32J4R3l7m8J32l0j09j09J63
$$ plain form
7770 22 133 -217 89 -43 -97 105 246 81 -115 -83 -50 120 -180 -116 -101 -100 -28 -13 101 81 22 -87 -84 -225 -111
7795 -111 -192 136 -15 4 202 -156 -46 260 -21 85 -67 65 -35 65 -20 -17 -138 42 126 7 236 -3
7817 -3 86 21 -50 -14 -29 175 -138 -40 -52 -201 108 84 178 173 -1 210 -3 -123 28 -148 99 16 79 -85 -71
7842 -71 21 62 5 215 -221 -45 72 -87 -58 -250 89 -86 138 -104 130 -40 -104 29 -19 -68 -78 -52 -110 64
7866 64 170 -46 -294 80 -143 189 -120 31 -14 -233 74 125 191 7 75 -161 25 54 -188 41 -16 -140
7888 -140 24 93 144 -6 131 163 -86 -11 65 4 81 79 -249 -30 101 -268 147 170 -50 16 -36 211 -247 95
7912 95 214 -18 190 -97 -9 -137 16 -12 -264 -134 -120 180 -27 -54 66 66 142 -12 -162 -226 93 96 122 115 133
7937 133 69 -167 305 117 132 -61 -46 -52 -67 -2 -314 -158 56 104 117 8 -138 -102 196 -42 100 -57 93
$$ packed form
7770B2J11l50L06j32n4K02J41j65j96L2L3J70l00O4J5JP2J5J14k0n9j09Lj41J14
7795a11q1L28j51J9J98l58J10L06k81J06j52J32j00J00q5Lj21J80Q4j19K29k39
7817cQ9o5p1L6j5K04l13R8j2j49L09k4R4nj74K11k13j20J51j76K47q3O3j64J4
7842g1R2M1n7K10m36J76J17j59K9j92L39j75K24k42K34j70o4J33m8m9j0K6n8J74
7866F4J06k16k48L74k23L32l09J51m5k19L07N1O6j84O8k36J86K9k42K29n7j24
7888a40J64O9N1j50J37L2k49P5P6o1P7kl28K19J31l69M15K3k20O6n2K47m58L42
7912I5J19k32K08k87Q8j28J53k8k52J30J4L00k07k7J20%P6j54j50o4L19LK6pJ8
7937A33o4k36M72j88J5j93J5oj5O5l12J56K14M8J3j09j46L6K98k38J42j57J50
$$ plain form
7960 93 -163 13 19 223 -137 -45 71 -259 87 -24 -115 61 -44 -235 -59 101 83 19 -123 92 25 227 -68
7983 -68 -70 -9 -240 138 -64 16 -212 -10 37 -62 -17 -72 105 -94 -44 8 -223 -150 -107 -131 81 -237 -345 -23 196
8008 196 -56 -258 6 -116 6 -156 -126 -30 -23 -142 110 -12 -110 -14 106 97 74 -141 -113 212 -32 -171 -84 33
8032 33 -8 -214 108 -87 211 78 24 -188 163 0 -185 -183 -70 1 54 -29 -226 257 -186 -204 16 -63 46
8055 46 -14 -133 -36 128 86 4 126 41 188 189 161 41 -7 -168 -138 78 177 -19 -128 -203 -124 -81 -24 0 -135 -93
8081 -93 -114 152 12 226 87 112 -116 56 -46 13 161 -223 226 -56 49 -96 -6 -72 32 60 -106 -40 34
8104 34 -217 -74 213 -39 7 -37 -19 -84 -228 59 -67 -50 267 205 181 -154 -117 168 145 -1 -150 72 89 82
8128 82 193 138 11 -74 -229 -17 -21 -75 -91 144 133 -203 33 -191 16 26 77 159 -53 -107 56 -125 28 87
$$ packed form
7960I3k56J76OK04l60R2J16l30L46j11r1J76j05j91J76J60j8o4j42K15o7K02k95
7983f8kO1k31L78k02Q0k28K02M7r9M5n5J77j99N0N2k31P3M3k4K12l18j08L22K19
8008A96k52k02K64j22J22j62L0R6Pj19K52j22r8R6J20rk3k15K8L25k44j39Q7J17
8032C3m1k06L22j95K98j33n4k12L51j63j85KJ13P1N3q3j97M83m43j8K20p9J09
8055D6o0j19R7J64m2q2J22q5J47Jk8j20m8j61L0K16R9j96j09p5P9M3N7K4j35M2
8081i3k1K66j40K14j39K5k28J72j02N9J48l84M49k82J05j45R0o6J04K8j66O6P4
8104C4k51J43K87k52M6m4J8o5j44K87j26J7L17o2k4l35L7K85k3j46j49K22J7p
8128H2J11n5j27q5j55K12mn4j6K35j1l36K36k24K07J0N1Q2k12n4J63j81J53N9
$$ plain form
8152 87 63 64 -62 106 -30 203 41 87 -65 48 57 122 -28 69 -318 203 -168 -11 131 49 161 26 -170
8175 -170 -186 -175 -112 -69 10 -40 116 20 55 -112 21 155 0 49 20 80
$$ packed form
8152H7k4Jj26J68j36K33j62M6j52J13RO5j50R7l87N21l71J57J42q2J12j35j96
8175a70j6J1O3M3P9n0J56r6L5j67J33J34j55M9k9O0
8191H0
$$ Imaginary data points
##PAGE= N=2
##DATA TABLE= (X++(I..I)), XYDATA
$$ plain form
0 0 0 0 0 0 0 0 0 0 0 0 0 0 0 -1 8 -8 8 -8 8 -16 16 -20 24 -25 32 -39 41 -48 56 -64 73 -84 94 -106 121 -134
36 -134 151 -167 188 -208 232 -257 285 -315 347 -385 423 -465 512 -563 621 -684 756 -835 925
55 925 -1026 1143 -1279 1439 -1632 1866 -2162 2544 -3059 3791 -4911 6803 -10576 20803 -101055
70 -101055 -248202 158226 72639 -186426 80070 157639 -145075 -40883 135636 -54500
80 -54500 -66027 115786 6776 -88095 37725 35871 -57624 -2378 45742 -3114 -29698 -1988
92 -1988 16885 -13906 -30533 32584 31793 -47407 -11090 41699 -38916 -28775 65549 -1328 -54283
105 -54283 37931 15057 -56964 25719 44370 -41381 1906 40774 -35729 -16162 43486 -9593
117 -9593 -17729 29846 -7159 -23998 17046 -3298 -13499 20596 -5883 -20236 19933 -6316
$$ packed form
0@%%%%%%%%%%%%%jRj6J6j6J6k4L2l6M4m9N7p1Q0q9J04j20J37j57J78k00K27k55
36a34K85l18L55l96M40m89N42o00O62p32Q08q88R77j075J184j305J440j591J760
55I25j951K169k422K718l071L498m028M706n603O850q702J1714j7379L1379j21858
70a01055j47147M06428q5587k59065K66496P7569l02714J04192J76519j90136
80e4500j1527J81813j09010r4871J25820j854r3495N5246M8120m8856k6584K7710
92a988J8873l0791j6627O3117p91p9200L6317N2789q0615J0141R4324o6877n2955
105e4283R2214k2874p2021Q2683J8651q5751M3287L8868p6503J9567N9648n3079
117i593q136M7575l7005j6839M1044k0344j0201L4095k6479j4353M0169k6249
$$ plain form
129 -6316 -29400 26963 14244 -37778 6599 23161 -31211 -5131 35024 -12332 -18601 25277
141 25277 627 -22470 16398 18273 -14005 -44 17132 -6885 -16036 10289 15276 -13029 -10923
154 -10923 17784 -1243 -28128 9652 22094 -24728 -10536 28377 -13614 -26319 29928 10493
166 10493 -33289 13704 23066 -31642 -3644 35235 -15967 -22030 30606 4578 -29778 14471
178 14471 21529 -21524 -3478 25381 -6170 -17027 14442 8583 -15958 193 14347 -7726
190 -7726 -13037 8360 3097 -14731 1645 10960 -11399 -8843 13242 -353 -13606 8584 9225
203 9225 -11623 941 13807 -5253 -7143 10563 4365 -6286 3225 5274 -3247 -1253 3383 2081
217 2081 -1400 -2116 939 102 -4796 -402 4649 -4790 -6315 5091 -788 -8832 5101 5246 -11117
$$ packed form
129f316k3084N6363j2719n2022M4377J6562n4372K6080M0155m7356o269M3878
141B5277k4650k3097L8868J875l2278J3961J7176k4017r151K6325M987k8305K106
154a0923K8707j9027k6885L7780J2442m6822J4192L8913m1991j2705N6247j9435
166A0493m3782M6993R362n4708K7998L8879n1202o063N2636k6028l4356M4249
178A4471P058m3053J8046K8859l1551j0857L1469n859k4541J6151J4154k2073
190g726n311K1397n263j7828J6376R315k2359K556K2085j3595j3253K2190O41
203I225k0848J2564J2866j9060j890J7706o198j0651R511K049q521J994M636j302
217B081l481p16L055q37m898M394N051r439j525J1406n879q044J3933J45j6363
$$ plain form
232 -11117 -540 12379 -4971 -8358 11671 3653 -11706 5148 11823 -7981 -3946 12616 -948
245 -948 -9073 7380 6305 -9288 -193 9011 -5850 -7272 8455 1051 -11776 2546 7772 -9982
259 -9982 -6313 9807 -1808 -10930 6080 5900 -10810 -708 11820 -3835 -6114 9863 2757
272 2757 -8003 5989 8089 -6504 -427 8773 -3238 -5224 7229 1674 -7723 1447 4041 -6034
286 -6034 -2644 4484 -1885 -5753 1340 1344 -3051 -1072 1815 -651 -1747 136 629 47 641 1711 1583
303 1583 10 507 2307 1245 -398 1833 1943 -1458 -440 3581 111 -3316 1451 1732 -4695 -1557
319 -1557 4352 -2453 -5261 2366 675 -6428 576 5297 -4476 -3982 5549 159 -5311 4345 4154 -5452
335 -5452 851 7465 -2661 -3231 7535 1611 -6127 4042 6089 -5354 -1714 6913 -2586 -6544
$$ packed form
232a1117J0577J2919j7350l387K0029q018j5359J6854O675j9804M035J6562j3564
245i48q125J6453j075j5593R095R204j4861j422J5727p404j2827J4322N226j7754
259i982L669J6120j1615r122J7010j80j6710J0102J2528j5655k279J5977p106
272B757j0760J3992K100j4593O077R200j2011j986J2453n555r397R170K594j0075
286f034L390P128o369l868P093Mm395J979K887k466j096J883M93n82N94J070j28
303A583j573M97J800j062j643K231J10l401J018M021l470l427M767K81o427L138
319a557N909o805k808P627j691p103P004M721r773M94R531n390n470R656j91r606
335e452O303O614j0126n70J0766n924p738J0169K047j1443L640Q627r499l958
$$ plain form
349 -6544 4600 2026 -7498 134 5075 -5532 -4428 4916 -1592 -5955 3932 2866 -6109 69 5589
364 5589 -2427 -1717 5767 164 -4544 4165 4259 -3111 704 4548 -1347 -2064 3033 875 -2246 769
380 769 683 -2610 -943 825 -1481 -1373 -68 -1268 -1645 -73 -76 -1355 -573 267 -91 -12 161 245 1398
399 1398 869 -176 1227 2197 -14 400 2499 128 -1503 2101 1665 -2453 60 2263 -2618 -2449
415 -2449 2513 -1247 -3755 1427 532 -4805 258 3210 -3225 -2749 3622 -482 -3479 3274 3194 -3952
431 -3952 533 4952 -1504 -1894 4788 1627 -3304 2623 3148 -3450 -215 4759 -2126 -3807 3311 128
447 128 -5071 1520 2703 -4929 -2011 3566 -2543 -4153 3366 1083 -4221 833 3131 -2842 -279
462 -279 4348 -730 -2148 3095 2202 -1562 1280 2698 -1072 -155 2408 -205 -1370 1148 650 -1853
$$ packed form
349f544J1144k574r524P632M941j0607J104R344o508m363R887j066q975O178N520
364E589q016P10P484n603m708Q709R4p370L815L844n895p17N097k158l121L015
380G69q6l293J667J768k306J08J305j200l77J572lj279P82Q40l58P9J73Q4J153
399A398n29j045J403R70k211M14K099k371j631L604m36m118K513K203m881J69
415b449M962l760k508N182q95n337N063K952o435M76O371m104k997O753q0p146
431c952M485M419o456l90O682l161m931N927N25o598L235M974o885j681P118l183
447A28n199O591J183p632K918N577o109j610P519k283n304N054K298n973K563
462b79M627n078j418N243q93l764K842J418l770R17K563k613j165K518m98k503
$$ plain form
478 -1853 -1007 386 -716 -1251 39 -1040 -1472 -924 -413 -774 -215 -363 -307 160 -11 -195 1218 1532 -119
497 -119 754 1757 -223 505 2473 -163 -1369 2231 1307 -2718 812 2087 -3079 -1117 2873 -2122
513 -2122 -3339 2181 -216 -4451 525 2319 -3361 -982 2946 -1928 -2890 3247 1601 -2710 1378
528 1378 3050 -1863 -418 3726 816 -1653 2573 1911 -2468 -126 2973 -454 -1658 1706 -53
543 -53 -3108 439 1592 -3066 -1974 1989 -1526 -2825 1614 305 -2808 776 1501 -1801 -70 2343
559 2343 -516 -608 1841 440 211 2280 934 -915 1215 1263 -985 404 1528 -1032 -619 518 -1275
576 -1275 -1527 636 -148 -1695 -238 -650 -1846 -252 656 -908 -719 1327 0 -1541 935 1486 -789
593 -789 114 2366 -289 -1109 2607 1428 -1608 1155 2298 -1244 -535 1743 -1158 -1664 1780 113
$$ packed form
478a853Q46J393j102n35J290j079m32N48N11l61N59j48N6M67j71j84J413L14j651
497a19Q73J003j980P28J968k636j206L600r24m025L530J275n166J962L990m995
513b122j217N520k397m235M976J794n680K379L928m874r62O137j646m311M088
528A378J672m913J445M144k910k469M226o62m379K342L099l427j204L364j759
543e3l055L547J153m658J092L963l515j299M439j309l113L584P25l302J731K413
559B343k859r2K449j401k29K069j346j849K130M8k248J389J124k560M13J137j793
576a275k52K163p84j547J457m12j196J594R08j564J89K046j327j541K476N51k275
593g89R03K252k655q20L716j179l036K763J143l542P09K278k901n06L444j667
$$ plain form
609 113 -2548 172 682 -2856 -877 1675 -1379 -1834 1625 66 -2362 456 1287 -365 272 1715
625 1715 -237 -188 1331 260 -131 1685 1187 -1000 340 834 -944 -29 1697 -1021 -1891 285 50
642 50 -1946 -78 456 -2047 -790 709 -1529 -773 1613 -652 -1717 1539 1108 -1750 1087 2234
658 2234 -1109 -462 2794 775 -1040 1341 1055 -1230 522 1507 -756 -746 1333 -476 -2063 678
674 678 363 -2309 -583 1301 -1840 -2050 1773 48 -2667 838 1709 -2113 -151 2451 -514 -816
690 -816 2493 638 -1110 1665 1662 -1265 757 1703 -1145 -152 2206 -472 -1741 310 315 -1397 -259
707 -259 173 -682 -975 -473 -566 -683 -263 29 -444 -427 -48 -181 111 1164 567 -165 1058 974 16 424 1254
728 1254 122 115 495 -182 -167 613 -327 -578 143 -1018 -1199 564 -672 -2036 -80 578 -1060 -477 732
$$ packed form
609A13k661K720N10l538J979K552l054m55L459j559k428K818Q31j652O37J443
625A715j952M9J519j071l91J816m98k187J340M94j778R15J726k718q70K176k35
642E0j996J868N34k503J257J499k238P56K386k265j065L256m31k858K837J147
658B234l343O47L256k019j815K381k86k285J752R85k263J0K079j809j587K741
674F78l15k672J726J884l141k10L823j725k715L505Q71l822J962K602k965l02
690h16L309j855j748K775lk927K022R46k848R93K358k678j269K051Nj712J138
707b59M32q55k93N02r3j17M20K92m73J7L79j33K92J053n97p32J223q4r58M08Q30
728A254j132pL80o77J5P80r40k51P21j161j81J763j236j364J956O58j638N83J209
$$ plain form
747 732 -696 -1021 1006 85 -558 1292 815 -893 745 1238 -258 565 2240 4 -1104 1447 1074
764 1074 -1055 -144 1313 -675 -1717 307 -81 -1415 5 599 -1700 -1422 787 -692 -1176 1026
780 1026 210 -1714 596 1946 -1080 -587 2217 331 -1148 1293 1694 -802 634 1518 -646 -596 1489
797 1489 490 -943 103 253 -1015 -143 455 -1052 -1179 107 -463 -1478 -519 497 -763 -825 319
814 319 141 -673 674 1045 -211 158 834 481 443 528 468 452 107 -62 90 253 -206 -73 -264 -740 -632
835 -632 125 -414 -972 148 -783 -1548 5 695 -1215 -602 1375 -580 -1054 1362 1110 -668 811 1314
853 1314 -553 21 1841 596 -801 556 813 -957 27 1054 -747 -1006 749 17 -1572 425
869 425 886 -1665 -1285 792 -583 -1638 702 550 -1310 38 1266 -416 -455 1328 294 -326 908
$$ packed form
747G32j428l25K027r21o43J850m77j708J638M93j496Q23J675k236j108K551l73
764A074k129R11J457j988j042K024l88j334J420N94k299K78K209j479m84K202
780A026q16j924K310J350l026M93K804j886j479K441M01k496J436Q84k164N0K085
797A489r99j433J046J50j268Q72N98j507j27J286n70j015R59J016j260o2J144
814C19j78q14J347L71j256L69O76l53l8Q5o0j6l45j69J52J63m59J33j91m76J08
835f32P57n39n58J120r31p65J553O90j910O13J977j955m74K416k52j778J479N03
853A314j867N74J820j245j397J357K57j770R84J027j801k59J755p32j589J997
869D25M61k551L80K077j375j055K340j52j860J348J228j682l9J783j034o20J234
$$ plain form
886 908 1054 35 636 1065 -142 -245 649 353 -134 -47 -278 -667 -362 -213 -698 -407 -754 -440 -393 -565
906 -565 -228 -95 -186 -258 -117 -15 -25 533 444 254 227 319 546 458 294 379 125 76 493 252 -344 257 407
929 407 -504 -883 56 -166 -1066 446 -133 -1378 -337 594 -879 -497 831 -408 -1070 945 487 -533
947 -533 951 1177 -354 87 1484 515 136 915 396 -242 161 554 -372 -191 382 120 -908 -339 -76
966 -76 -360 -821 113 -436 -1180 200 351 -899 -409 1035 -339 -376 1024 400 -441 1047 772 -266 466
985 466 1005 -74 221 681 15 -64 772 265 -586 -284 -206 -540 -127 -260 -253 -447 -921 -475 54 -225 -480
1006 -480 429 -141 -565 421 428 0 192 732 99 98 894 493 169 373 740 49 -94 152 300 -349 -451
1027 -451 238 -516 -812 252 -149 -1760 -511 650 -829 -661 738 -474 -1050 664 597 -880 654
$$ packed form
886I08J46j019O01M29j207j03Q94k96m87Q7k31l89L05J49m85K91l47L14M7j72
906e65L37J33r1p2J41J02j0N58q9j90k7R2K27q8j64Q5k54m9M17k41n96O01J50
929D07r11l79R39k22r00J512n79j245J041R31j473L82J328j239o62K015m58j020
947e33J484K26j531M41J397r69l79P79n19o38M03L93r26J81N73k62j028N69K63
966g6k84m61R34n49p44J380J51j250M90J444j374l7J400o24q41J488k75j038P32
985D66N39j079K95M60o66p9Q36n07q51L02P8l34M13j33Pj94m74M46N29k79k55
1006d80R09n70m24R86Pm28J92N40o33jP96m01l24K04L67o91j43K46J48o49j02
1027d51O89p54k96J064m01j611J249J161j479J68J399j212n76J714o7j477J534
$$ plain form
1044 654 1646 -591 -372 1354 6 -547 1156 745 -681 129 1229 -302 -806 744 287 -1505 -187
1061 -187 397 -852 -914 473 -470 -1246 18 458 -1020 -266 560 -491 -395 1101 345 -804 592 949
1079 949 -9 67 925 528 103 293 167 13 286 265 264 -419 -633 -125 -249 -659 -169 124 -924 -733 229
1100 229 -343 -417 394 271 -863 25 752 -214 -56 1174 328 -241 744 1179 -255 -291 734 503 -546
1119 -546 477 705 -580 -383 402 -700 -1073 777 80 -1485 -355 90 -1271 -402 901 -768 -1254
1136 -1254 564 148 -775 211 1258 121 126 680 130 10 681 1034 213 27 377 218 -397 119 12
1155 12 -685 -169 371 -654 -829 546 -178 -1359 -24 490 -907 -253 369 -412 -452 616 509 -328 249
1174 249 415 -342 371 657 -74 415 606 -33 133 336 430 203 70 -337 -148 -577 -417 -159 -232 -823 -400
$$ packed form
1044F54R92k237K19J726j348n53J703m11j426Q10J100j531n04J550m57j792J318
1061a87N84j249o2J387r43p76J264M40j478P54Q26j051R6J496p56j149J396L57
1079I49r58P6Q58l97m25J90j26j54K73k1jo83k14N08j24m10M90K93j048J91R62
1100B29n72p4Q11j23j134Q88P27r66J58J230q46n69R85M35j434l6J025k31j049
1119e46J023K28j285J97P85j102l73J850o97j565J130M45j361Q69J303j669m86
1136a254J818m16r23R86J047j137NN54n50j20O71L53q21j86L50j59o15N16j07
1155A2o97N16N40j025j75J375p24j181J335N14j397O54O22p81m0J068j07q37N77
1174B49J66p57P13K86p31M89J91o39J66K03R4k27j33m07J89m29J60K58p3n91M23
$$ plain form
1195 -400 -6 -335 -421 -181 1 -462 257 114 20 508 357 119 156 457 357 547 465 183 -114 -102 99 346
1217 346 -304 -111 246 -643 -1044 237 15 -551 49 196 -927 -583 532 -233 -476 543 29 -633 550
1236 550 392 -355 433 1059 -156 -253 630 444 -131 180 900 -418 67 618 222 -762 -32 293 -626 -485
1256 -485 15 -299 -710 -191 -230 -792 -356 142 -821 -343 189 181 -224 442 534 -257 -16 777 156 -57 569
1277 569 459 29 -279 -124 132 -54 -95 -200 -301 -553 -358 43 -304 -386 -98 -147 -554 73 -174 -136 288
1298 288 217 -347 -16 681 221 -228 272 516 17 358 793 10 -207 252 407 -113 -348 291 52 -325
1318 -325 64 -130 -616 -67 -5 -925 -551 224 -425 -648 280 107 -720 -151 563 -49 -181 480 371 -101
1338 -101 308 362 296 481 391 38 187 2 -97 -69 161 -405 -229 -181 191 -238 -476 82 -298 -357 -481 56
$$ packed form
1195d00L94l29q6K40J82m63P19j43r4M88j51k38L7L01j00J90q2k82k97J2K01K47
1217C46o50J93L57q89m01J281k22n66O00J47j123L44J115p65k43J019n14o62J183
1236E50j58p47P88O26j215r7Q83j86n75L11P20j318M85N51l96r84P30L25r19J41
1256d85N00l14m11N19l9n62M36M98r63M78N32qm05O66R2p91K41P93o21k13O26
1277E69j10m30l08J55K56j86m1j05j01k52J95M01l47q2K88m9m07O27k47L8M24
1298B88p1n64L31O97m60m49N00K44m99L41M35p83k17M59J55n20k35O39k39l77
1318c25L89j94m86N49O2r20L74P75o49k23R28j73q27N69P14o12j32O61j09m72
1338a01M09N4o6J85r0l53J49j85r9K8K30n66J76M8L72m29k38N58l80n9j24N37
$$ plain form
1360 56 166 -316 -151 108 131 153 123 311 253 43 198 379 319 71 173 342 -68 100 362 197 136 -79
1382 -79 -195 -422 91 -458 -553 -123 -353 -617 -129 232 -501 -349 -1 -89 -135 165 533 402 40 260 295 394
1404 394 523 178 286 66 -44 -132 187 206 -230 -285 -45 -76 -623 -192 337 -467 -605 -129 -212 -254 101 -173
1426 -173 -229 35 -75 -8 196 304 29 61 446 112 -111 372 396 55 -25 356 184 -98 283 187 -134 -303
1448 -303 -98 -198 -301 -92 -213 -188 -190 0 -562 2 110 -579 -266 344 258 40 313 485 -147 75 410
1469 410 244 217 154 215 165 67 -61 291 270 -251 -474 -42 -120 -378 -205 -216 -746 -93 99 -354 -269 -13 -98
1492 -98 -50 227 205 44 549 249 -284 290 777 323 397 190 336 12 -20 147 -143 7 -49 -113 -502 -152
1514 -152 -58 -335 -26 50 -633 -245 75 -60 -217 -11 228 -223 -118 275 236 -155 97 499 363 191 555
$$ packed form
1360E6J10m82J65K59K3K2l0J88n8k10J55J81o0k48J02J69m10J68K62j65o1k15
1382g9j16k27N13n49r5M30k30k64M88L61p33J52L48q8m6L00L68j31l62K20L5R9
1404C94J29l45J08k20j10q8L19J9m36n5K40l1n47M31N29q04j38M76q3m2L55k74
1426a73n6K64j10O7K04J08k75L2L85l34k23M83K4l41q0L81j72k82L81r6l21j69
1448c03K05j00j03K09j21K5kJ90n62N64J08o89L13O10q6k18K73J72o32K22L35
1469D10j66k7o3O1n0r8j28L52k1n21k23M32p8k58J73j1n30O53J92m53Q5K56q5
1492i8M8K77k2j61N05l00n33N74M87m54P4k07J46l24l2J67k90J50n6o4l89L50
1514a52R4k77L09P6o83L88L20j35j57K06K39m51J05L93l9l91K52M02j36j72L64
$$ plain form
1535 555 203 -78 57 -135 292 65 45 -305 -306 -38 -356 -143 -66 -368 -275 -275 -533 -332 113 -42 116 196 -431
1558 -431 -220 323 283 -53 373 340 237 252 147 302 -106 142 218 5 127 60 -178 -136 -197 -392 -477 122 -211
1581 -211 -517 -173 28 -77 -305 204 -16 -345 -59 68 24 38 138 197 110 158 261 400 39 176 166 51
1603 51 279 176 194 -10 28 -125 -306 -217 -196 -296 -2 -51 -513 -155 -74 -269 -176 -22 -123 368 418 70 -136
1626 -136 44 203 249 391 576 295 393 239 -4 -14 367 228 -107 80 -200 -350 83 -238 -298 -210 -173 -249
1648 -249 -340 5 30 -337 -145 -88 -234 -11 337 202 172 91 150 247 146 233 57 231 213 91 111 101 50 -117
1672 -117 -305 -216 -38 -207 -38 -221 -306 -160 -236 -176 -110 0 -70 -121 -43 121 230 216 19 185 53 -147 217
1695 217 407 29 101 355 -22 341 -6 193 -266 -58 262 -248 -438 64 -323 -305 -356 -131 -310 -308 73 -93
$$ packed form
1535E55l52k81J35j92M27k27k0l50jK68l18K13P7l02R3%k58K01M45j55J58Q0o27
1558d31K11N43m0l36M26l3j03J5j05J55m08K48P6k13J22o7k38M2o1j95q5N99l33
1581b11l06L44K01j05k28N09k20l29K86J27m4J4J00N9q7M8J03J39l61J37j0j15
1603E1K28j03J8k04L8j53j81Q9K1j00K94m9m62L58Q1j95R3J54j01M91N0l48k06
1626a36J80J59M6J42J85k81R8j54k43j0L81j39l35J87k80j50M33l21o0Q8L7p6
1648b49r1L45K5l67J92N7j46K23L48j35l0q1N9R7j01Q7j76J74j8j22K0j0n1j67
1672a17j88Q9J78j69J69j83q5J46p6O0O6J10p0n1P8J64J09j4j97J66j32k00L64
1695B17J90l78P2K54l77L63l47J99m59K08L20n10j90N02l87J8n1K25j79KL81j66
$$ plain form
1717 -93 -244 -166 239 13 156 273 105 -127 344 117 291 417 215 91 -211 -128 16 -63 153 79 -417 -108
1739 -108 -134 -327 -284 -57 -228 -398 69 -229 -156 240 -142 -42 89 114 78 231 347 56 368 303 185 -82
1761 -82 367 111 102 223 -4 111 -51 123 -310 130 -272 -150 -157 -232 -341 -181 -292 103 -135 22 -260 -50
1783 -50 -55 21 -102 54 110 27 -12 -94 83 331 184 17 244 -114 -21 -199 115 -229 -125 -340 -109 -113 -264 -267
1807 -267 -95 -341 -423 181 158 -172 -102 -37 34 -110 399 338 -117 299 234 58 71 268 283 -91 220 64 -42
1830 -42 227 168 -179 -114 -111 -325 -78 -64 -6 -218 -146 -31 13 -279 -9 -201 -357 -125 215 -36 -121 262 187 -123
1854 -123 272 -69 187 261 -4 47 45 271 -47 32 318 -52 -69 -122 -128 -209 119 -271 -391 -154 -179 97 -317 -79
1878 -79 -178 -1 -142 14 58 80 -68 110 216 66 36 307 408 197 128 12 146 -102 -36 217 -130 -155 33
$$ packed form
1717i3j51P8M05k26J43J17j68k32M71k27J74J26k02j24l02Q3J44p9K16p4m96L09
1739a08k6j93M3K27j71j70M67k98P3L96l82J00J31K5l6J53J16k91L12o5j18k67
1761h2M49k56rJ21k27J15j62J74m33M40m02J22pp5j09J60j11L95k38J57k82K10
1783e0nP6j23J56N6q3l9q2J77K48j47j67K27l58R3j78L14l44J04k15K31mj51l
1807b67J72k46q2O04k3l30P0O5P1j44N09o1m55M16o5j76J3J97J5l74L11j56j06
1830d2K69n9l47O5Lk14K47J4N8k12P2J15M4k92K70j92j56K32L40k51q5L83p5l10
1854a23L95l41K56P4k65N1kK26l18P9K86l70j7n3oq1L28l90j20K37k5K76m14K38
1878g9r9J77j41J56M4K2j48J78J06j50l0K71J01k11o9j16J34k48O6K53l47k5J88
$$ plain form
1901 33 -17 -216 -96 -117 -271 144 -206 -217 59 153 -75 100 -284 179 -85 48 294 29 99 144 102 0 43
1924 43 166 243 97 183 31 -8 -165 -77 72 -103 0 -228 -52 -127 -508 -254 -255 -102 -281 -46 -94 103 -220
1947 -220 86 239 -152 121 141 211 174 -55 14 337 -86 47 325 141 -36 -151 -16 72 -211 -99 -17 2
1969 2 -386 -445 -257 -108 -24 -65 -321 -62 265 -120 108 337 220 39 201 156 -150 76 181 118 80 84 10 -123
1993 -123 399 -8 11 -224 -215 49 -21 -99 -103 -214 -237 -306 -84 61 -99 125 -262 -167 212 95 60 -55 22 -139
2017 -139 101 482 186 216 249 17 56 0 20 251 -20 -34 -245 46 -151 -285 -204 -44 -176 -268 142 -85 -57
2040 -57 152 48 87 298 77 80 125 74 -1 175 77 214 14 -46 18 -78 36 116 -114 42 -84 -67 -14 -250 -66
2065 -66 -4 -211 -111 51 47 203 -162 -88 -261 232 41 272 200 202 -106 94 159 16 239 96 427 -19 155
$$ packed form
1901C3n0j99J20k1j54M15l50j1K76R4k28J75l84M63k64J33K46k65P0M5m2j02M3
1924D3J23P7j46Q6j52l9j57Q8J49j75J03k28J76p5l81K54jJ53j79K35m8J97l23
1947b20L06J53l91K73K0P0l7k29O9L23m23J33K78j84j77j15J35Q8k83J12Q2J9
1969Bl88n9J88J49Q4m1k56K59L27l85K28K29j17j81J62m5l06K26J05o3l8Mp4j33
1993a23N22m07J9k35RK64p0p8mj11k3o9K22J45j60K24l87R5L79j17l5j15P7j61
2017a39K40L81k96L0L3k32L9n6K0K31k71j4k11K91j97j34Q1J60j32r2M10k27K8
2040e7K09j04L9K11k21LM5n1p5J76r8J37k00o0O4r6J14Q0k30J56j26J7N3k36J84
2065f6O2k07J00J62mJ56l65P4j73M93j91K31p2Kl08K00O5j43K23j43L31m46J74
$$ plain form
2088 155 52 261 -86 -236 70 -71 -161 -81 -161 -262 -209 12 -437 -154 -105 24 -85 88 -63 -85 104 441
2110 441 -38 152 551 133 15 319 481 67 126 137 -53 -23 -129 -56 -209 -147 -80 -108 -95 -99 -245 -137 -214 9
2134 9 26 46 -144 81 -77 30 57 113 43 142 396 143 -119 237 413 -122 -20 173 31 -168 -95 -141 -151 -329
2158 -329 33 -317 -143 -144 -94 15 -371 -57 -120 34 -117 9 54 244 224 -207 141 26 186 218 112 108 106 242
2182 242 216 -32 194 188 58 209 -156 -168 -222 -150 86 -82 -232 -106 -237 -40 -207 -52 -91 -40 -104 -82 -229
2205 -229 165 115 -50 -50 -230 199 390 -51 164 55 210 -130 265 -36 0 -136 -192 -154 47 -175 18 -314
2227 -314 -97 -49 -302 -139 -233 -36 -115 -26 20 -27 -19 280 113 96 -12 140 16 163 360 81 121 205 69 114
2251 114 74 -156 -13 59 55 -182 -71 90 -227 -98 -190 -161 81 -148 -142 -30 -90 44 -89 299 -135 -7 111
$$ packed form
2088A55j03K09l47j50L06j41r0Q0q0j01N3K21m49K83M9J29j09J73j51k2J89L37
2110D41m79J90L99m18j18L04J62m14N9J1j90L0j06P3j53O2O7k8J3mj46J08p7K23
2134IJ7K0j90K25j58J07K7N6p0R9K54k53k62L56J76n35J02J93j42j99P3m6j0j78
2158c29L62l50J74jN0J09l86L14o3J54j51J26M5J90k0m31L48j15J60L2j06mkJ36
2182B42k6k48K26oj30J51l65j2n4P2K36j68j50J26j31J97j67J55l9N1o4K2j47
2205b29L94n0j65%j80M29J91m41K15j09J55l40L95l01L6j36n6L8K01k22J93l32
2227c14K17M8k53J63r4J97p9Q9M6m7QK99j67j7j08J52j24J47J97k79M0Q4j36M5
2251A14m0k30J43P2mk37J11J61l17J29r2K9K42k29OJ12o0J34j33L88m34J28J18
$$ plain form
2274 111 -23 -120 116 36 135 -135 79 148 161 -102 174 -214 -68 16 -126 -104 -31 -121 -243 -320 -309 -160 12 40
2298 40 65 -229 -249 208 -144 -169 393 -70 -47 310 105 244 79 117 135 42 37 53 -78 -31 -13 6 -44 -233 28
2323 28 -83 -238 -297 -89 -114 24 -14 -28 -124 75 146 -77 -49 -52 147 -119 197 -172 -19 -31 145 -221 123 -8
2347 -8 327 16 35 205 -92 -204 5 42 -155 -243 -47 -303 -125 19 -22 90 -2 176 -48 331 -39 -106 -8
2370 -8 92 387 -36 185 267 167 10 56 107 -152 4 -28 -76 -35 -231 -28 -156 -107 -24 -89 -93 -266 -68 108
2394 108 -54 -3 51 -23 -147 -275 102 52 32 -88 252 237 42 22 324 67 85 263 -159 -116 -141 -15 215
2417 215 -282 -107 -183 -180 56 -177 -52 46 45 110 147 -78 -98 25 -290 84 176 127 79 -183 42 387 198 40
2441 40 -21 -185 67 -13 -139 43 49 -59 120 -113 -106 60 -277 -255 -189 27 36 -35 75 -103 -171 83 73 173 101
$$ packed form
2274A11j34r7K36q0R9k70K14O9J3k63K76l88J46Q4j42K2P3r0j22p7J1J49J72K8
2298D0K5k94k0M57l52k5N62m63K3L57k05J39j65L8J8r3nJ6j31M7J8J9n0j89K61
2323B8j11j55n9K08k5J38l8j4r6J99P1k23K8lJ99k66L16l69J53j2J76l66L44j31
2347hL35l11J9J70k97j12K09L7j97q8J96k56J78J44m1J12r2J78k24L79l70o7R8
2370hJ00K95m23K21Q2j00j57M6N1k59J56l2m8M1j96K03j28M9Q3o5mj73J98J76
2394A08j62N1N4p4j24j28L77n0k0j20L40j5j95k0L02k57J8J78m22M3k5J26K30
2417B15m97J75p6LK36k33J25R8jO5L7k25k0J23l15L74R2m9m8k62K25L45j89j58
2441D0o1j64K52q0j26J82Oj08J79k33PJ66l37K2O6K16Rp1J10j78o8K54j0J00p2
$$ plain form
2466 101 -34 -90 393 -2 360 179 134 31 103 -175 -177 -196 -23 43 -243 122 166 -30 -257 -232 -60 -207 -192
2489 -192 421 -147 -67 77 -105 -114 -67 89 -15 69 332 -2 3 313 -22 120 -256 300 180 -28 128 109 30
2512 30 -41 17 62 -84 45 -35 7 -271 -315 -7 -5 -74 -48 327 5 -59 33 228 48 18 140 199 223 -129 -78 108
2538 108 233 159 107 132 103 -236 -77 85 -81 198 -144 121 -181 -165 -172 57 -244 -35 -61 -19 9 91 62 354
2562 354 235 -90 146 44 -85 30 205 17 -74 132 144 -78 91 53 -314 37 -130 -191 90 -210 -12
2583 -12 -101 50 -218 -37 -206 -90 -206 -166 -25 -34 233 32 -179 -21 221 275 77 297 66 149 0 94 204
2606 204 -142 224 -14 -141 43 -168 -277 296 -68 -61 -51 -41 -326 14 -189 -229 -178 72 -126 -71 124 120 -71
2629 -71 52 217 75 128 285 59 6 40 50 319 142 -76 -38 -9 -98 -181 63 -50 30 54 29 -181 0 85
$$ packed form
2466A01j35n6M83l95L62j81m5j03P2k78kj9J73O6k86L65M4j96k27K5J72j47J5
2489a92O13n68Q0J44j82rM7J56j04Q4K63l34NL10l35J42l76N56j20k08J56j9p9
2512C0p1N8M5j46J29q0M2k78m4L08Ko9K6L75l22o4R2J95j80l0J22N9K4l52N1J86
2538A08J25p4n2K5k9l39J59J62j66K79l42K65l02J6pK29l01K09k6M2K8Q2k9K92
2562C54j19l25K36j02j29J15J75j88r1K06J2k22J69l8l67L51j67o1K81l00J98
2583a2q9J51k68J81j69J16j16M0J41rK67k01k11J58K42N4j98K20k31Q3j49R4J10
2606B04l46L66k38j27J84k11j09N73l64PJ0J0k85L40k03m0N1K50j98N5J95mj91
2629g1J23J65j42N3J57k26n3L4J0K69j77k18L8K9q9q3K44j13Q0K4k5k10J81Q5
$$ plain form
2653 85 170 -254 41 293 -123 177 24 28 -56 -120 160 89 77 -21 176 205 -74 -209 218 -79 -123 -125 -101 -344 -245
2678 -245 -151 -131 55 -226 -218 -53 -85 -68 -63 -163 -15 73 -62 165 344 112 31 -92 346 105 190 96 23 -2 392
2703 392 160 217 5 -160 -42 -12 -41 -84 -130 -174 84 1 -26 -97 -52 -81 84 -218 -278 -30 103 -91 478 177
2727 177 310 -6 302 46 61 37 -1 128 -57 140 75 34 -7 46 73 -88 -188 -356 -68 -4 -12 -169 -82 -82 -28
2752 -28 5 208 124 42 -218 -132 163 -2 138 61 69 -106 155 163 41 14 21 -32 82 20 -183 -235 -283 46 -311 28
2778 28 -93 -174 -229 131 197 21 -237 117 159 76 249 -94 -57 227 -90 102 252 125 29 -87 -174 26 -8
2801 -8 262 9 -339 86 -175 -190 74 91 -126 -208 58 -23 -298 -286 60 -92 -168 264 243 -288 116 64 107 256
2825 256 -62 483 179 258 119 -7 -23 -37 -4 -21 -96 -14 -124 -68 93 -131 -182 -255 31 102 109 -116 -4 -152
$$ packed form
2653H5Q5m24K95K52m16L00j53Mq4o4K80p1j2r8J97K9k79j35M27k97m4kK4k43R9
2678b45R4K0J86k81QJ65l2J7Nj00J48Q8j35K27J79k32q1j23M38k41Q5r4p3k5L94
2703C92k32N7k12j65J18L0k9m3m6m4K58q3k7p1M5k9J65l02o0K48J33j94N69l01
2727A77J33l16L08k56J5k4l8J29j85J97o5m1m1N3K7j61j00j68K88O4qj57Q7%N4
2752b8L3K03q4q2k60Q6K95j65J40p7Qj75K61Qj22k7Pn3J14o2k03n2m8L29l57L39
2778B8j21q1n5L60O6j76k58L54M2q3J73l43L7K84l17J92J50j27r6j16q7K00l4
2801hK70k53l48M25k61j5K64J7k17q2K66q1k75J2L46j52p6M32k1n31M04n2M3J49
2825B56l18N45l04P9j39j26j6j4L3j7p5Q2j10N6J61k24n1p3K86P1Pk25J12j48
$$ plain form
2849 -152 -84 266 115 129 -78 -75 58 27 -254 81 31 81 118 -134 73 85 49 -165 130 -187 179 122 93 57
2873 57 92 -283 -213 -123 42 -152 -22 -9 77 19 105 -99 2 -6 -100 -55 35 -87 100 209 129 163 77 115 28 16
2899 16 -187 -11 -109 2 -187 -180 -83 -155 111 -149 -49 81 -17 -231 -61 329 -106 123 -108 -99 233 -86 -19
2922 -19 98 -34 124 -20 67 132 180 49 19 314 90 -87 -106 -68 -261 -131 86 -363 45 -175 10 -134
2944 -134 -65 86 24 86 -24 182 119 170 -52 -146 183 17 199 43 88 7 82 -189 141 247 -33 80 19
2967 19 -221 -204 -25 13 -213 138 148 -205 16 -60 -78 -67 -66 -89 -20 226 -87 -86 -102 232 -183 -68 175 68 -17
2992 -17 -86 -62 153 -27 180 108 -8 20 -126 -179 -50 115 76 -85 38 23 160 -119 -62 189 -94 58 -62
3015 -62 -12 -16 133 -174 -246 148 148 121 -186 -38 142 -151 7 -120 -56 -136 163 -196 -152 -85 30 59 -107 -59 24
$$ packed form
2849a52O8L50j51J4k07LJ33l1k81L35n0N0L7k52K07J2l6k14K95l17L66n7k9l6
2873E7L5l75P0R0J65j94J30J3Q6n8Q6k04J01qr4M5R0j22J87J09q0L4q6L8q7j2
2899A6k03J76r8J11j89PR7p2K66k60J00J30r8k14J70L90m35K29k31RL32l19O7
2922a9J17j32J58j44Q7O5M8j31l0K95k24j77j9L8j93J30K17m49M08k20J85j44
2944a34O9J51o2O2j10K06o3N1k22r4L29j66J82j56M5q1P5k71L30J06k80J13o1
2967A9k40J7J79L8k26L51J0l53K21p6j8J1Jk3O9K46l13Jj6L34m15J15K43j07q5
2992a7o9K4K15j80K07p2j16K8j46n3J29J65l9j61J23j5J37k79N7K51k83J52j20
3015f2N0mJ49l07p2L94%k7l07J48J80k93J58j27O4q0K99l59M4O7J15K9j66M8Q3
$$ plain form
3040 24 165 362 15 -84 -40 -166 23 360 -129 70 -68 125 121 -5 140 -104 129 -14 -29 52 -45 75 -187
3063 -187 -270 16 -24 56 -178 93 -181 408 281 -175 75 -42 158 -52 -147 -137 -252 -75 189 -173 62 47
3085 47 152 -42 226 25 59 186 92 -160 12 122 -141 35 -153 -250 63 -47 -69 -210 48 -194 -62 -192
3107 -192 67 -86 -66 198 83 236 -193 280 128 71 -22 125 174 152 26 -124 59 -10 55 -104 -44 145 -331
3130 -331 -148 -104 -107 83 60 -60 246 -21 225 -181 151 61 0 112 -100 71 55 26 160 -85 128 281 -53
3153 -53 64 121 43 -152 34 -2 -135 -354 40 -228 156 8 74 51 -108 -105 151 -21 32 -171 77 -176 -169 14
3177 14 57 -134 283 82 -13 143 -237 -89 -71 211 73 -74 63 -100 -11 -94 53 -80 21 208 26 123
3199 123 -84 -131 -84 56 -121 -64 -112 -144 90 -18 -227 28 6 56 29 96 53 161 -67 -64 -140 40 -126 -196 -159
$$ packed form
3040B4J41J97l47r9M4j26J89L37m89J99j38J93mj26J45k44K33j43j5Q1r7J20k62
3063a87q3K86m0Q0k34K71k74N89j27m56K50j17K00k10r5J0j15J77K64l62K35j5
3085D7J05j94K68k01L4J27r4k52J72J10k63J76j88r7L13j10k2j41K58k42J32j30
3107a92K59j53K0K64j15J53m29M73j52n7r3J47M9k2j26j50J83o9O5j59O0J89m76
3130c31J83M4lJ90k3j20L06k67K46m06L32r0o1J12k12J71j6k9J34k45K13J53l34
3153e3J17N7p8j95J86l6j33k19L94k68L84j48O6k3j59LK56j72N3k03K48k53PJ83
3177A4M3j91M17k01r5J56l80J48J8K82j38j47J37j63Q9q3J47j33J01J87j82R7
3199A23k07m7M7J40j77N7m8l2K34j08k09K55k2N0k7O7m3J08k28Lp6J80j66p0L7
$$ plain form
3224 -159 -257 -66 -149 71 -53 -172 -135 -57 58 -45 -57 -111 13 16 -88 59 193 199 -113 -89 138 70 235 141
3248 141 13 56 -82 85 18 -55 148 155 -11 -114 -157 248 -272 -168 78 -164 284 69 31 -10 -162 13 142
3271 142 9 5 258 181 37 -28 237 118 211 -28 10 -17 -93 -79 265 318 189 -14 37 -202 -292 -23 -155 -130
3295 -130 -134 -65 -89 111 -143 13 187 -105 -88 207 145 223 108 -222 266 252 162 18 109 -161 -82 214 136 -107
3319 -107 -246 -144 109 -181 -82 273 -41 -17 17 -26 -116 -160 51 13 -81 78 -146 31 53 69 216 -9 72 263
3343 263 -2 -135 59 143 -194 -65 163 -130 -246 -168 23 -129 -50 -32 75 -113 -100 -283 -101 197 -275 -119
3365 -119 4 -228 36 119 -208 238 161 70 -243 -234 -9 168 -133 -37 -84 248 -99 77 -114 -47 236 196 -59
3388 -59 81 6 -133 -50 -108 21 -3 -54 66 -103 -267 -51 -43 12 -404 -187 -142 110 220 -92 15 -142 -187 33
$$ packed form
3224a59r8J91q3K20j24j19L7P8J15j03j2n4J24Lj04J47J34Ol12K4K27o8J65r4
3248A41j28M3j38J67o7p3K03Pj66j03m3M05n20J04K46k42M48k15l8m1j52J75J29
3271A42j33mK53p7j44o5K65j19R3k39L8k7p6J4L44N3j29k03N1k39r0K69j32K5
3295a30mO9k4K00k54J56J74k92J7K95o2P8j15l30M88j4r0j44R1k70P9K96p8k43
3319a07j39J02K53k90R9L55l14K4L4m3r0m4K11l8r4J59k24J77K2J6J47k25Q1J91
3343B63k65j33J94Q4l37J29K28k93j16P8J91j52P9J8J07j88J3j83J82K98m72J56
3365a19J23k32K64Q3l27M46p7r1l13RK25J77l01R6m7L32l47J76j91O7K83m0k55
3388e9J40p5j39Q3n8J29k4n1J20j69j64K16QN5m16K17M5K52J10l12J07j57m5K20
$$ plain form
3412 33 -128 -69 412 190 46 94 138 -243 -16 -96 0 -51 59 -104 -6 22 -155 291 -145 -83 -80 0 49 44 91 -122
3438 -122 80 -8 101 100 0 214 -145 -204 43 96 -236 -127 -49 17 276 -140 -10 -101 48 -88 -138 -43 -115 -188
3462 -188 7 248 -231 -42 -91 151 16 62 172 12 113 112 443 50 66 -166 -146 -38 -154 202 41 -104
3484 -104 84 258 55 42 -85 -78 -184 -111 -193 62 -59 -52 192 6 109 55 69 354 122 -124 -68 277 240 -194
3508 -194 -188 -80 119 -45 -51 48 272 194 45 53 -191 -70 153 -54 -108 60 -196 14 78 -93 -21 -2 106 1
3532 1 47 45 397 -84 115 -110 -97 -44 170 -410 46 -146 98 227 -309 -144 -90 113 -51 164 -338 56 97
3555 97 171 85 118 53 -157 113 142 -114 144 120 -73 138 166 45 -19 -26 186 -83 238 216 -138 100 -55 -173
3579 -173 -34 -84 163 96 49 155 -5 146 186 -101 102 194 1 -71 48 115 -118 -178 59 -273 144 38 138
$$ packed form
3412C3j61N9M81k22j44M8M4l81K27q0R6n1J10j63R8K8j77M46m36O2LQ0M9nM7k13
3438a22K02q8J09jj00K14l59n9K47N3l32J09P8O6K59m16J30r1J49j36n0R5p2p3
3462a88J95K41m79J89m9K42j35M6J10j60J01jL31l93J6k32K0J08j16L56j61j45
3484a04J88J74k03j3j27Pj06P3q2K55j21PK44j86J03n4J4K85k32k46N6L45l7m34
3508a94OJ08J99j64oR9K24p8j49Qk44J21K23k07n4J68k56K10O4j71P2J9J08j05
3532AM6kL52m81J99k25J3N3K14n80M56j92K44J29n36J65N4K03j64K15n02L94M1
3555I7P4q6L3o5k10K70K9k56K58k4j93K11K8j21o4pK12k69L21k2l54K38j55j18
3579a73J39n0K47o7m7J06j60J51M0k87K03R2j93p2J19O7k33o0K37l32M17j06J00
$$ plain form
3602 138 -26 -110 117 -255 -26 122 183 -19 -43 113 -137 -37 -267 11 169 -111 -143 -80 -133 -87 2 -37 -263
3625 -263 133 133 -106 82 56 237 143 128 38 -235 170 35 96 -112 -44 105 22 -20 148 -7 60 -15 -46 71
3649 71 -125 -149 -23 144 -76 87 250 -36 132 -68 57 99 -18 105 -92 -210 -62 3 136 -218 114
3670 114 19 -178 -35 -11 -135 -40 -50 -88 -41 38 136 82 21 122 55 75 -2 225 -39 -5 250 -115 -145 22 -74
3695 -74 16 67 -177 -83 -53 212 16 -90 -153 -217 5 -32 -25 -169 14 -154 -77 -30 172 -71 -96 214 -211 4
3719 4 70 203 159 -195 187 1 286 -282 -12 -59 128 215 -95 170 148 -87 49 67 -183 218 153 -76 18
3742 18 218 -83 -46 32 -151 -67 2 -214 135 -101 -26 242 8 -45 -10 92 -62 -27 -98 185 221 -253 -159 203
3766 203 -67 -245 -55 -226 41 -61 76 -10 112 186 -353 -137 108 99 170 137 -122 25 30 -146 -140 -112 -183 71
$$ packed form
3602A38j64q4K27l72K29J48O1k02k4J56k50J00k30K78J58k80l2O3n3M6Q9l9k26
3625b63L96%k39J88k6J81r4j5r0k73M05j35O1k08O8J49q3m2J68j55O7p5l1J17
3649G1j96k4J26J67k20J63J63k86J68k00J25M2j17J23j97j18J48O5J33l54L32
3670A14r5j97J43K4j24R5j0l8M7P9R8n4o1J01o7K0p7K27k64L4K55l65l0J67r6
3695g4R0N1k44R4L0K65j96j06o3o4K22l7Pj44J83j68P7M7K02k43k5L10m25K15
3719DO6J33m4l54L82j86K85n68K70m7J87Q7l10K65k2k35J36J8k50M01o5k29R4
3742A8K00l01L7P8j83Q4O9k16L49k36P5K68k34n3L5J02j54L5p1K83L6m74R4L62
3766B03k70j78J90j71K67j02J37q6J22P4n39K16K45rP1l3k59J47Nj76OK8p1K54
$$ plain form
3790 71 278 -23 -141 118 54 -27 -103 36 -2 159 245 -96 46 80 9 -114 36 -37 -40 -18 77 -11 252 24 -53
3815 -53 251 -259 -192 18 -54 -113 -52 -115 -116 25 -63 42 144 58 44 84 274 88 55 -234 -52 16 -238 -1 34
3840 34 -101 24 -188 -50 118 -2 -125 -93 -38 -108 57 143 -14 118 203 206 -220 -20 -149 71 119 1 -79
3863 -79 -200 95 3 52 0 173 -4 -281 6 104 66 108 -210 -101 -76 199 -172 -35 115 38 -291 -119 -94
3886 -94 -68 194 -58 -9 -84 54 44 135 135 41 74 -42 25 -63 18 91 -133 159 202 48 -13 -113 -343 9 45 -284
3912 -284 -104 -342 -10 163 -87 -71 62 150 -3 162 252 22 72 -50 191 -110 79 -215 149 -8 -55 150
3934 150 -69 -3 -31 87 -21 -131 75 -167 104 -151 38 -8 -120 -146 -22 115 35 81 210 -189 -1 30
3956 30 -227 -150 121 -41 -40 168 -10 -279 17 -122 -50 -55 189 -139 24 66 -90 -57 -154 137 -145 -95 109 -99
$$ packed form
3790G1K07l01j18K59o4q1p6J39l8J61Q6l41J42L4p1j23J50p3lK2R5q8K63k28p7
3815e3L04n10O7K10p2n9O1o3jJ41q8J05J02q6j4M0J90j86l3k89J82O8k54K37L5
3840C4j35J25k12J38J68j20j23L2N5p0J65Q6j57J32Q5Lm26K00j29K20M8j18q0
3863g9j21K95r2M9n2J73j77k77K87R8l8M2l18J09K5K75l71J37J50p7l29J72K5
3886i4K6K62k52M9p5J38j0R1%r4L3j16O7q8Q1P3k24K92M3j54o1j00k30L52L6l29
3912b84J80k38L32J73k50J6J33Q8j53J65R0k30N0j22K41l01J89k94L64j57m7K05
3934A50k19O6k8J18j08j10K06k42K71k55J89m6j12k6J24J37q0M6J29l99J88L1
3956C0k57P7K71j62JK08j78k69K96j39P2nK44l28J63M2j56L3r7K91k82N0K04k08
$$ [...]
8191A43
##END NTUPLES=NMR FID
##END=
