##TITLE=1H_3MBDE 2-7 
 CDCl3
 8 sc, 
 13.12.2022
##JCAMPDX= 6.0         $$ Bruker NMR JCAMP-DX V2.0
##DATA TYPE= NMR FID
##DATA CLASS= NTUPLES
##ORIGIN= UXNMR, Bruker Analytische Messtechnik GmbH
##OWNER= root
$$ XWIN-NMR		Version 3.5
$$ Tue Dec 13 13:59:10 2022 Russian Standard Time (UT+4h)  she@DPX200
##.OBSERVE FREQUENCY= 200.13135
##.OBSERVE NUCLEUS= ^1H
##.DELAY= (6, 6)
##.ACQUISITION MODE= SIMULTANEOUS
##.ACQUISITION SCHEME= undefined
##.AVERAGES= 8
##.DIGITISER RES= 18
##SPECTROMETER/DATA SYSTEM= spect
##.PULSE SEQUENCE= zg30
##.SOLVENT NAME= CDCl3
##.SHIFT REFERENCE= (INTERNAL, CDCl3, 0, 15.7039)
##AUDIT TRAIL= $$ (NUMBER, WHEN, WHO, WHERE, WHAT)
$$ ##TITLE= Audit trail, XWIN-NMR		Version 3.5
$$ ##JCAMPDX= 5.01
$$ ##ORIGIN= Bruker BioSpin GmbH
$$ ##OWNER= she
$$ F:/spectra/data/she/nmr/H-F/1/audita.txt
$$ ##AUDIT TRAIL=  $$ (NUMBER, WHEN, WHO, WHERE, WHAT)
(   1,<2022-12-13 13:58:20.68 +0400>,<she>,<DPX200>,
      <created by zg, POWCHK disabled, PULCHK disabled
       configuration hash MD5:
       00 E9 B6 7A A2 85 ED C7 34 08 36 98 17 FE 4E 26
       data hash MD5: 16K
       13 3F 16 68 C7 84 D0 FE 26 28 EA 0D 12 89 99 3E>)
$$ ##END=
$$ 
$$ hash MD5
$$ 2C BF 56 A2 95 85 00 13 B2 8A 3E 22 AD 30 DA ED
##$RELAX= 
##$RELAX= 
##$RELAX= 
##$RELAX= 
##$RELAX= 
##$RELAX= 
$$ Bruker specific parameters
$$ --------------------------
##$DU= <F:/spectra>
##$EXPNO= 1
##$NAME= <H-F>
##$PROCNO= 1
##$TYPE= <nmr>
##$USER= <she>
##$AMP= (0..31)
100 100 100 100 100 100 100 100 100 100 100 100 100 100 100 100 100 100 
100 100 100 100 100 100 100 100 100 100 100 100 100 100 
##$AQSEQ= 0
##$AQ_mod= 1
##$AUNM= <au_zg>
##$AUTOPOS= <>
##$BF1= 200.13
##$BF2= 200.13
##$BF3= 200.13
##$BF4= 200.13
##$BF5= 200.13
##$BF6= 200.13
##$BF7= 200.13
##$BF8= 200.13
##$BYTORDA= 1
##$CFDGTYP= 0
##$CFRGTYP= 5
##$CHEMSTR= <none>
##$CNST= (0..31)
1 1 145 1 1 1 1 1 1 1 1 1 1 1 1 1 1 1 1 1 1 1 1 1 1 1 1 1 1 1 1 1 
##$CPDPRG= <>
##$CPDPRG1= <>
##$CPDPRG2= <>
##$CPDPRG3= <>
##$CPDPRG4= <mlev>
##$CPDPRG5= <mlev>
##$CPDPRG6= <mlev>
##$CPDPRG7= <mlev>
##$CPDPRG8= <mlev>
##$CPDPRGB= <>
##$CPDPRGT= <>
##$D= (0..31)
0 1.2 0 0 0 0 0 0 0 0.06 0 0.03 0 0 0 0 0.0002 0 0 0 0 0 0 0 0 0 0 0 0 
0 0 0 
##$DATE= 1670925500
##$DBL= (0..7)
120 120 120 120 120 120 120 120 
##$DBP= (0..7)
150 150 150 150 150 150 150 150 
##$DBP07= 0
##$DBPNAM0= <>
##$DBPNAM1= <>
##$DBPNAM2= <>
##$DBPNAM3= <>
##$DBPNAM4= <>
##$DBPNAM5= <>
##$DBPNAM6= <>
##$DBPNAM7= <>
##$DBPOAL= (0..7)
0.5 0.5 0.5 0.5 0.5 0.5 0.5 0.5 
##$DBPOFFS= (0..7)
0 0 0 0 0 0 0 0 
##$DE= 6
##$DECBNUC= <off>
##$DECIM= 32
##$DECNUC= <off>
##$DECSTAT= 4
##$DIGMOD= 1
##$DIGTYP= 9
##$DL= (0..7)
0 120 120 120 120 120 120 120 
##$DP= (0..7)
150 150 150 150 150 150 150 150 
##$DP07= 0
##$DPNAME0= <>
##$DPNAME1= <>
##$DPNAME2= <>
##$DPNAME3= <>
##$DPNAME4= <>
##$DPNAME5= <>
##$DPNAME6= <>
##$DPNAME7= <>
##$DPOAL= (0..7)
0.5 0.5 0.5 0.5 0.5 0.5 0.5 0.5 
##$DPOFFS= (0..7)
0 0 0 0 0 0 0 0 
##$DQDMODE= 0
##$DR= 18
##$DS= 0
##$DSLIST= <SSSSSSSSSSSSSSS>
$$ [...]
##$SUBNAM2= <"">
##$SUBNAM3= <"">
##$SUBNAM4= <"">
##$SUBNAM5= <"">
##$SUBNAM6= <"">
##$SUBNAM7= <"">
##$SUBNAM8= <"">
##$SUBNAM9= <"">
##$SW= 18.05172834244
##$SWIBOX= (0..15)
0 0 2 0 0 0 0 0 0 0 0 0 0 0 0 0 
##$SW_h= 3612.71676300578
##$TD= 16384
##$TD0= 1
##$TE= 0
##$TE2= 300
##$TE3= 300
##$TEG= 300
##$TL= (0..7)
0 120 120 120 120 120 120 120 
##$TP= (0..7)
150 150 150 150 150 150 150 150 
##$TP07= 0
##$TPNAME0= <>
##$TPNAME1= <>
##$TPNAME2= <>
##$TPNAME3= <>
##$TPNAME4= <>
##$TPNAME5= <>
##$TPNAME6= <>
##$TPNAME7= <>
##$TPOAL= (0..7)
0.5 0.5 0.5 0.5 0.5 0.5 0.5 0.5 
##$TPOFFS= (0..7)
0 0 0 0 0 0 0 0 
##$TUNHIN= 0
##$TUNHOUT= 0
##$TUNXOUT= 0
##$USERA1= <user>
##$USERA2= <user>
##$USERA3= <user>
##$USERA4= <user>
##$USERA5= <user>
##$V9= 5
##$VALIST= <valist>
##$VCLIST= <CCCCCCCCCCCCCCC>
##$VD= 0
##$VDLIST= <DDDDDDDDDDDDDDD>
##$VPLIST= <PPPPPPPPPPPPPPP>
##$VTLIST= <TTTTTTTTTTTTTTT>
##$WBST= 1024
##$WBSW= 4
##$XGAIN= (0..3)
0 0 0 0 
##$XL= 0
##$YL= 0
##$YMAX_a= 270088
##$YMIN_a= -417245
##$ZGOPTNS= <>
##$ZL1= 120
##$ZL2= 120
##$ZL3= 120
##$ZL4= 120
##$ABSF1= 10
##$ABSF2= 0
##$ABSG= 5
##$ABSL= 3
##$ALPHA= 0
##$AQORDER= 0
##$ASSFAC= 0
##$ASSFACI= 0
##$ASSFACX= 0
##$ASSWID= 0
##$AUNMP= <proc_1d>
##$AZFE= 0.1
##$AZFW= 0.1
##$BCFW= 1
##$BC_mod= 2
##$BYTORDP= 1
##$COROFFS= 0
##$CY= 11.3945322036743
##$DATMOD= 1
##$DC= 2
##$DFILT= <>
##$DTYPP= 0
##$F1P= 2.36226072786647
##$F2P= -0.459571619588291
##$FCOR= 0.5
##$FTSIZE= 0
##$FT_mod= 4
##$GAMMA= 1
##$GB= 0.15
##$INTBC= 1
##$INTSCL= 1
##$ISEN= 128
##$LB= 0.24
##$LEV0= 0
##$LPBIN= 0
##$MAXI= 10000
##$MC2= 0
##$MEAN= 0
##$ME_mod= 0
##$MI= 1.114404
##$NCOEF= 0
##$NC_proc= 0
##$NLEV= 6
##$NOISF1= 3.799351
##$NOISF2= 2.8
##$NSP= 1
##$NTH_PI= 0
##$NZP= 0
##$OFFSET= 15.70392
##$PC= 1
##$PHC0= -19117.58
##$PHC1= 15.40072
##$PH_mod= 1
##$PKNL= yes
##$PPARMOD= 0
##$PSCAL= 0
##$PSIGN= 0
##$REVERSE= no
##$SF= 200.130013532006
##$SI= 16384
##$SIGF1= 3
##$SIGF2= 2
##$SINO= 400
##$SIOLD= 16384
##$SREGLST= <1H.CDCl3>
##$SSB= 0
##$STSI= 0
##$STSR= 0
##$SW_p= 3612.71676300578
##$SYMM= 0
##$S_DEV= 0
##$TDeff= 0
##$TDoff= 0
##$TI= <>
##$TILT= no
##$TM1= 0
##$TM2= 0
##$TOPLEV= 0
##$USERP1= <user>
##$USERP2= <user>
##$USERP3= <user>
##$USERP4= <user>
##$USERP5= <user>
##$WDW= 1
##$XDIM= 8192
##$YMAX_p= 0
##$YMIN_p= 0
$$ End of Bruker specific parameters
$$ ---------------------------------
##NTUPLES= NMR FID
##VAR_NAME=  TIME,          FID/REAL,        FID/IMAG
##SYMBOL=    X,             R,               I
##VAR_TYPE=  INDEPENDENT,   DEPENDENT,       DEPENDENT
##VAR_FORM=  AFFN,          ASDF,            ASDF
##VAR_DIM=   8192,          8192,            8192
##UNITS=     SECONDS,       ARBITRARY UNITS, ARBITRARY UNITS
##FACTOR=    0.0002768,     1,               1
##FIRST=     0,             0,               0
##LAST=      2.2672688,     0,               0
##MIN=       0,             -417245,         0
##MAX=       2.2672688,     270088,          0
$$ Real data points
##PAGE= N=1
##DATA TABLE= (X++(R..R)), XYDATA
0@%%%%%%%%%Kj0J6j6K4l2L3m1N6p2Q8j04J20j44J75k06K39k78L24l73M29m92N60
32B98o37P22q16R22j038J165j303J454j622J806k005K222k461K721l004L315l656
49a917M028m436M887n386N937o551P243q026Q919r946J1145j2568J4286j6408
63h793J9109k2683K7655l5097M7586p3711K22141l22700j61921N78502l29336
74e9248j98784M82866j9179m38576K47613J22971l23179R7961L17377k00389j62816
85a33383J53055J5418j31146P9214J23711n8429j16870M9029L3411j01831O0718
96b7103J92487j29292j59133J68058l689k05319J77327J70266k21805j7546J50381
107I4632j83224l3918K61944q0078j60798J76103k2880k06673J34529J28184j26920
$$ y = [0, 0, 0, 0, 0, 0, 0, 0, 0, 0, 2, -8, 8, -8, 16, -16, 17, -24, 32, -40, 48, -56, 64, -80, 95, -111, 128, -150, 174, -199, 230, -262, 298, -339, 383, -433, 489, -549, 616, -687, 767, -855, 951, -1054, 1168, -1293, 1428, -1576, 1739, -1917, 2111, -2325, 2562, -2824, 3113, -3438, 3805, -4221, 4698, -5248, 5897, -6671, 7615, -8793, 10316, -12367, 15288, -19809, 27777, -45934, 176207, -146493, -308414, 270088, -59248, -258032, 224834, 205655, -232921, 14692, 137663, -185516, -87555, 229822, 29433, -133383, 19672, 35090, -96056, -16842, 106869, 48440, -68430, -19401, 14010, -87821, -27103, 165384, 36092, -123041, 45017, 41328, -163991, 13336, 183602, -38203, -55749, 94632, -88592, -122510, 139434, 59356, -101442, 74661, 51781, -154892, -20363, 107821, -19099]
118a9099J9643M9175j27013K1693J15488n3785j5085N2057n5982j6729K7182m4016
130d6471N8533Q4416j05511m2131Q8235o0800m2794J23242q857q3194O2607j1445
142A5830r2464P2285O2109p0961Q794L5753n7872n207M0133p253J7648M619n1424
155b8010O261K3159j5716L9558R972o8021L0669L2979r0410L5323J13939q9097
167F06n7236J07098m6613p8255J19682r26j19565R8073N9074j53144K0895J26838
179G6527q4635m2298J04863m4429p7747Q6874K1121p8635L3319M9381n8744k8423
191d2826N2394J9950l8253r398M4189q054o2357L2339N9640n8017j5248P3554
203D7913n3251n7745J06663J684j16701P1199P5826j19970l707J13983o7924n6864
$$ y = [-19099, 544, 49719, -77294, -55601, 59887, 6102, -8983, 43074, -12908, -29637, -2455, -46471, 12062, 96478, -9033, -51164, 37071, -23729, -66523, 56719, 47862, -35332, 27275, 15830, -76634, -4349, 57760, -13201, -4407, 31346, -26526, -31733, 8400, 1147, 18795, 23414, -28010, -21749, 1410, -14306, 25252, 35224, -32797, -2128, 30851, -59559, -24236, 89703, 606, -56630, 50468, 3855, -74400, 45282, 44356, -75209, 22864, 81938, -71206, -50311, 76527, -8108, -50406, 54457, 10028, -67719, 19155, 40276, -38359, -5040, 44341, -14403, -42826, 9568, 29518, -8735, -18133, 26056, 18002, -44355, -12016, 47624, -10393, -25641, 47913, -5338, -63083, 43580, 45264, -71437, -238, 75588, -44382, -48089, 65894, -2030, -58894]
215e8894J04188k1367r0394Q2068M0210j04325J5087Q9891m6247n4667M7937J8737
227B2224l4512P566K5676k1710k3661L3389J7322m8886M418O1718l9443n5466
239e1365P2518J9858q5813L2532O4944p6016j3782Q3581m6971n0766Q8581o639
251C0662r2863N9231O2148q2322j4214O9522k5937l2370M4315o194m0418L2661
263D221K6066m2524j1881M4501J637m5501O673M4875j6751l5934K7577J1358l5709
276b1392K4092K9574n6926o179P1917k8784o1340N6706K9358o4520J0650M8604
288C1760l8155j5758M4742j8087l2589M0272J1557m3789R567L6083k2759k5596
300b2752K5795J6173k3224p414J7972m435r614J9120m161l4234J9849L9168l5087
$$ y = [-58894, 45294, 23927, -66467, 15601, 55811, -48514, -33427, 56464, 10217, -44450, 3487, 22224, -12288, -4722, 20954, -756, -24417, 8972, 26294, -22592, -18174, 43544, 4101, -51365, 21153, 41011, -44802, -12270, 52674, -23342, -37124, 46457, -514, -51280, 37301, 30662, -62201, -2970, 59178, -23144, -37358, 32164, 6227, -26143, 18172, 11978, -28440, 4221, 30287, -12237, -24118, 20383, 22020, -23481, -16808, 28067, 11316, -24618, 2959, 14317, -21392, 2700, 32274, -24652, -30831, 41086, 12302, -49038, 7668, 37026, -27494, -16844, 31760, -6395, -22153, 22589, 4502, -28087, 12185, 23742, -20047, -10480, 25603, 2844, -22752, 3043, 19216, -4008, -11422, 6550, 2115, -7499, 11621, 7460, -26774, -6925, 32243, -2844]
313b844k9318M5455Q287m4643J4564K8997k9098k779L0418k3602j7054M3832k957
326A9258n0468K0883M2082l1235k2317L4712n73k9916J9953J6336l4301J316L9417
339B5147k0508l3246L6843J7936m6902J120M3280k1078k7842L5950P266l6767
351a8801J4295K2395l1954P30M1083k4129l6469M2423K2150m8547j418L9794k0225
364A327k0504L6225m242l8534K8150K5685m6074m384N0699j9956m0146L6979J8139
377B3364m0077P699K7856k9737o625L9156j4292l2979L0655J7551l8020N10L5283
390B0344j5267k4591K5348J1300k7681K856K4905j7899j7491K7706K964l0126
402a7632J7251K6321l5996j6388M2087j082l4015J8497J4528k6565J0440K2332
$$ y = [-2844, -32162, 13293, 21580, -23063, -8499, 20498, -8600, -11379, 19039, -4563, -21617, 22215, 19258, -31210, -10327, 31755, 520, -21797, 12915, 12342, -17574, 2379, 18715, -15586, -14270, 25147, 4639, -28607, 8236, 26172, -20730, -19610, 23670, 2592, -25250, 10700, 17966, -18801, -4506, 17889, -14065, -13335, 27748, 3619, -32850, 9573, 31723, -16824, -18242, 21552, 1327, -19177, 17048, 12806, -25728, 2422, 28107, -17967, -22351, 28348, 8392, -31754, 5225, 23364, -16713, -9014, 18842, -10895, -17520, 21636, 7344, -25635, 5020, 22571, -15449, -14939, 20344, 5077, -19514, 5834, 17134, -10547, -7691, 17214, -685, -18176, 9530, 12494, -17632, -381, 25940, -10056, -26444, 15643, 14561, -19454, -957, 13571, -12994, -2554, 19778]
414A9778l0994q950L8428p803l1354K0934J8100k4828l279K0232n959j2144R204
427A365M471j1059K593J5250q342j9875J3139J7664k0807p377K7952o308k7669
440a9003J7519J3053k2920R153J9378k6509n263L1223j4933k2449L1306Q843l5101
453a5703L225K5090r665p666J1263n240q872J0962M411j5412k896K2424N867k7718
467i930o662K5107l875j6714J9788M576k6813J1228J5462k8971P280M0124k9009
480A591l2717M0631P813l9668J9908K9737l3684j0134K8824j3228j5904L1532
492A4701O116l5099J393K6517j1969j8777K2662J6300k7252j0786K3033o569j4833
505a4563K7759K095l7633J9359K9142m6712q802O3426j3197n1826L2160J4493
$$ y = [19778, -11216, -20166, 18262, 10459, -20895, 39, 18139, -6689, -9968, 10264, 4305, -7839, 1365, 5836, -5223, -2630, 12620, 4278, -15597, -2458, 15206, -5601, -12978, 14974, 8666, -19003, -1484, 11569, -11351, -2198, 17180, -9329, -14592, 16631, 1698, -20751, 10555, 19398, -15703, -12478, 12612, 2947, -4719, 6544, 1304, -7568, 3394, 7805, -7607, -10503, 11921, 17788, -9930, -16592, 8515, 4640, -12074, 7714, 12290, -14523, -3295, 12167, -16804, -9524, 30600, 1591, -31126, 9505, 17318, -22350, -2442, 27295, -6389, -16523, 12301, -927, -16831, 14701, 20817, -14282, -12889, 13628, 1659, -17118, 5544, 21844, -5408, -16194, 6839, 270, -14563, 13196, 15291, -22342, -2983, 26159, -20553, -29355, 34071, 20874, -30952, 1208, 15701]
517A5701m3475K7872L8131n1387r962N2301k8448l9178N3080J8458m9875P901
529h881K7797l2458o023M0771r341k9618K3862R322l8584M471M4063j2879l3959
542b1457K4107J4401l7551M710L9556j9709j9913L3399j0589m0290L4116K9649
554C0429m1441K34L6747l0068k4010L7592K573k0184K2924m574l8766J9885L0924
567B2265k5186p280K4930j1546j8844J3589M204o498J1856K996j7195m032J0332
580d09K891k339L223M063o809r896M737Q742j987J369L426r619m254P325k618
595b155m35J2949k243j6056L3O372J401M432j442l528L509p985q625J7484Q918
610A2629j5643K136N950j6830N952K1892j7171j1536K7002m970k8440J6711J6099
$$ y = [15701, -27774, 98, 38229, -13158, -23120, 29181, 733, -38445, 14635, 33093, -16782, -8881, 18916, -13542, -19565, 21206, 11865, -17753, 6109, 15431, -23153, -18682, 25381, 12502, -21457, 2650, 17051, -20500, -15790, 23766, 4057, -15856, 17543, 6954, -33336, 780, 30429, -11012, -10778, 25969, -4099, -28109, 9483, 12056, -8128, 14796, 10222, -28544, -8659, 22265, -2921, -10201, 14729, 3183, -15661, -2072, 2132, -4366, 7490, 10486, -6709, -10741, -409, 2482, 143, 3366, 7429, 620, -9276, -4539, 4203, 2216, 3585, 7011, -2608, -6862, 463, -2155, -2590, 10359, 8116, -7940, -7907, -1535, -134, 4298, 2856, -672, 2837, -5148, -13773, 3711, 12629, -3014, -878, 5072, -11758, -5806, 16086, -1085, -12621, 14381, 9411, -19029, -2318, 13781]
623A3781j9439M856J5662k2527o876K6333p487j7650K1929N127k9308N085K4260
636A3746j4603j1478K2726m87k4067Q691J5290j6302M33K4409j5275k4833K4563
649B813J4517k8439L823K6707k0126j6059K7096l624k3217K4313J1106l6854N572
662a2372L5348k3034k2856L2723N517l0173J1325J5857k3652K396K7852j6879
674B052k1263K5065P328k6632P275K2744j6579j2371J9791j351j7598J3749J0327
687A2537k0041P07K0368j4073j5799K4437P861k7961J224K2139r934j0850J5374
700E989k461j4584J3860P693k0868J684K1922r466j6404J4195P688j4083R55Q858
714D978o555J03J0131r220j0993J5373Q623j7094m312J5055r98j1194N552N357
$$ y = [13781, -5658, -802, 14860, -7667, -14543, 11790, 4303, -13347, 8582, 13709, -15599, -10514, 13746, -857, -12335, 10391, 9904, -14163, -5472, 9818, -6484, -6051, 18358, 3083, -21750, 2813, 17330, -11109, -7286, 19421, -705, -16764, 10332, 6708, -16509, 7804, 18910, -17944, -12372, 22976, -58, -22914, 9809, 15326, -14847, -3522, 12335, -11317, -8921, 18931, 2052, -19211, 5854, 13182, -13450, -6175, 16569, -10, -12381, 7410, 6059, -11539, 2210, 12537, -7504, -6797, 13571, -502, -16301, 8136, 15997, -11964, -10740, 11399, 1465, -9385, 5989, 3528, -11056, 2804, 10497, -10371, -8687, 13235, 3769, -12635, 1560, 9248, -4835, -3880, 4978, -1577, -1474, 8657, -563, -11556, 3817, 12440, -4654, -8966, 6089, 5091, -6103, -551, 4806]
728D806p713P87O841p355m314J1774K47j2706N079J0689j0004o440J2866R85j1571
743f029M316P114p445R70P872r717n995J6303L174j8825R31J6327n104j0996P305
758B01M238p749K069N457p600o91J0422m609j1564Q873J0040j0676n933J0134
772B612N87o865N040J621q563N080R307j1063n878J4516j25j4086O283R800j0667
787b401k711J1150m328q411Q798K403r923M452P395j0979k788J4239j024j4024
801h152L901J0029n956l117P147l687o324R548L326j3021J508J4247p256j1719
815i526J2088O056j3519Q38J0611p517m350J1349l792j0872J0008O343j3521M59
829e345J2373o563p724R826J624r915M414P261q508k475R825k421q289Q134M254
$$ y = [4806, -2907, -2120, 4721, -2634, -6948, 4826, 5073, -7633, -2554, 8135, -1869, -8309, 4557, 5542, -6029, -1713, 5401, -2044, -1074, 6798, -2919, -8914, 7389, 10563, -8262, -7331, 8996, 3892, -7104, 201, 4439, -3310, -1241, 4216, -3384, -4075, 6347, 1738, -9826, -953, 9087, -1589, -7522, 2612, 3199, -3666, 1374, 2995, -5568, -488, 8819, -2244, -8122, 6394, 6269, -7817, -1534, 8266, -2401, -5112, 6038, 1710, -6701, 2097, 4500, -5423, -971, 6424, -4555, -7343, 6896, 5872, -8152, -4251, 5778, -178, -3295, 3852, 165, -6159, 3389, 6715, -6306, -4798, 9449, 2193, -9526, 2562, 8618, -4901, -4063, 6548, -969, -5319, 6030, 2238, -8634, 1374, 7717, -5804, -5345, 7028, 465, -7259, 2567, 4191, -5724, -1310, 5951, -2557, -5032, 4793, 2372, -5917, 2217, 6471]
844F471j1916L38J3800m826j2085P607O571p839J158N356q593j169J2703m429
858C147j2497R334P530j1716o89J0323n302n755Q740p83q389P310N439j1169j099
873e576J1708k744r421N984N857p020j985O281j632m043M535J97o138L776N526
888E305p215l231R272r13r448M416P609o326m267N973j015k690O048o44j0246
903g372M505J1696o590j0089P323O481o346j532L803k464p65N098l057n256O252
918A687L908q951j481R484j682p864L990M223n808L70N487m600k691Q190k070
933B192r572O660Q750r877m793J0994m93q902N758M038q122K528O368q461j663
948d595J2203m642j2439R055R341j0624m206Q306j737l386O566k157r709O611
$$ y = [6471, -5445, -5107, 8693, 3867, -8218, -611, 5960, -1879, -721, 4635, -3958, -5127, 7576, 3147, -9350, -16, 7514, -4202, -4891, 5432, 130, -5625, 3115, 2332, -6057, 1253, 6692, -4477, -5576, 6132, 3388, -6033, -49, 5808, -1212, -3197, 3084, 1452, -2591, 1944, 2141, -3997, -221, 5305, -1910, -5141, 4131, 3218, -6230, -1814, 5795, -531, -4798, 1175, 160, -2530, 3518, 2874, -7372, -2867, 8829, 2239, -7850, -527, 5954, -392, -1924, 1879, -585, -1350, 3748, 691, -4565, 1687, 5595, -3356, -4837, 4647, 2965, -4899, -909, 3314, -2494, -2124, 3363, -1237, -3928, 4262, 2192, -7380, -720, 8030, -1847, -6640, 4354, 3861, -5041, 717, 4755, -3367, -839, 5529, -2932, -4595, 7608, 2966, -9473, -418, 8923, -1701, -5907, 2399, 662, -2724, 3842, 1685, -8024, -1413]
962a413R820r458o990J0995K981j0987J583Q997n264l933P739k822p269Q493L827
977F299j1485K509J0905r448o523J2638l91j0610P010L970j0504L781Q893r877
991b833m025J2636k082j1247O340O978p661k051O723j076l887K241O79l097L334
1006I72N028o702o453Q880N319r750n73Q110n250m340Q726k066q751R162M776
1021G088j3076P37J1333o204m964Q722j378p297M785K433m381K797K112m511R39
1036h65L047k794j305K737J383m45k849j172L819o19l194M505O12o224K391L021
1052B048n730L022P637q618n561R530R32o626L431J719l666K644R04m704J647
1067a391M413j889j883J78M73J359j886m08M641k733n584O841J910r368M628P268
$$ y = [-1413, 8407, -1051, -8041, 2954, 5935, -5052, -3469, 5528, 264, -3669, 4070, 1248, -6021, 2472, 6299, -5186, -2677, 8228, -1220, -7743, 4895, 4504, -6106, 904, 4874, -5630, -1849, 7044, -2833, -6858, 5778, 3696, -7551, -1211, 5767, -1894, -3945, 2778, 1702, -2185, 56, 735, -2362, 972, 6000, -702, -7155, 1725, 7044, -2706, -3279, 4831, -419, -4759, 3967, 1901, -6850, 2312, 7088, -5988, -5251, 6082, -122, -5086, 3636, 2258, -5039, -254, 2179, -2202, 595, 2707, -1804, -865, 2182, -612, -1917, 820, 2203, 1758, -1091, -2263, 1556, 937, -2257, 2248, 2860, -3364, -973, 2048, -3682, -660, 6977, -1641, -7202, 2328, 3260, -3366, 65, 1784, -1882, 762, 1666, -3038, -1391, 3022, 1133, -750, -572, -99, 1260, -626, -1034, 3607, 874, -4710, 2131, 4041, -5327, -699, 6569]
1083F569j0284J2J0964r901o237J6287j454j5476Q629P518j1673K591R182r198
1097b471j966J0242n667p169J0525K924j0163O2P509j398n010J906L269l291r48
1112a646N660l609p829R373O226j4105R6J4224q439q989J4176p27j2859J0569
1126B121M849j5314N795J2160j3866k456J6545p751j1901J2548L698j0625L759
1139d38M463p390J978O813n201n172N553L414l986l979L764L856n246j917N888
1154B400k049l389O138k901p041J0568L579j4829L101J3061r083n447J0965l971
1168A102o593R922j054r809P301N287r146M58N755l587r97K693j981K84J508l314
1184b171J791K666l597m2J987k154K911J745q017J874R233n760n086P356j555
$$ y = [6569, -3715, -3703, 7261, -2640, -8877, 7410, 5956, -9520, -891, 6627, -5046, -2455, 6727, -2471, -4437, 5805, 138, -7031, 3494, 6418, -3745, -3683, 3826, 2428, -2582, -676, 2593, -698, -1646, 4014, 405, -7424, 1949, 8175, -5930, -5834, 8390, -49, -9038, 5138, 4411, -8448, 2121, 6970, -8344, -2549, 9611, -4255, -6711, 9834, 2083, -9818, 2730, 6428, -4197, -438, 4025, -3365, -1387, 5426, 225, -4947, 606, 4020, 34, -3945, -181, 3675, -1571, -3488, 2400, 351, -3038, 3100, 199, -6842, 3726, 7305, -7524, -4423, 8638, -445, -5892, 5073, 1102, -5491, 4431, 3377, -6432, 869, 6156, -2990, -2532, 3223, -364, -1361, 1332, -649, -365, 1143, -2171, -380, 2286, -1311, -1353, 634, -1520, 1391, 3136, -4881, -3007, 6226, 466, -4620, 2736, 1181]
1199A181m613O835j145p409O921L297r144J350P508m511k842L474j239o3K234
1214A834l141p04K991q58k6Q0k979L410L092p255P28Q118o027l957R316l263p800
1231f441R767J636j0694N583O258j0227J290R966p475n560Q438L00n327L099K66
1246H79l941L929J917m491m27K833M18j580j584K263K106m361lN123l177k926
1262c022O680k635o168P992K118j0182L929P812q872j629R421n417m915Q628j711
1277B029p429O546K796p764K312M970m991j621N260k59l359m07J857K166j663
1292D43k128K063j62j366L953j348o182N279M810p734n74P362m688l229O960k736
1308G23n448P581L70q689M826N741p498j201O585k239l537L293M53k247J317O19
$$ y = [1181, -3432, 3403, 2258, -5151, 1770, 5067, -4077, -2727, 4781, 270, -2572, 902, -337, -400, 1834, -1307, -2011, 980, 122, 96, 176, -2803, 607, 3699, -3556, -2828, 5290, -737, -4694, 4622, 1359, -6441, 3326, 4962, -5732, -149, 6109, -4118, -2828, 7138, -337, -5897, 2541, 2841, -2486, 613, 879, -3062, 867, 2784, -1707, -2134, 699, 1117, -463, -2047, 216, 2322, -2039, -2042, 3081, -96, -3022, 3658, 1023, -5145, 2847, 4965, -5217, -1288, 6524, -2348, -3977, 5444, 27, -4888, 3740, 2029, -5400, 1146, 3942, -3822, -1510, 3460, -1531, -3152, 2108, 1849, -1510, -1917, -60, 2106, 443, -1685, 378, 216, -1150, 2803, 1455, -4727, 552, 5362, -2372, -2946, 4416, -272, -3501, 3459, 723, -4725, 2856, 3226, -5463, -637, 5104, -2394, -3595, 2990, 751, -2786, 507, 960, -1287, 30, 649]
1324F49j146k83J225J072j899j486L595P04n302K264M832n443k004O223k324l458
1340b781N847k336o627Q118L917j0542j26Q865l429l948M692j659k924M835M32
1355B334n601K026M420k657l036K472K098j800j688J925Q47k442J204J916l542
1370a524Q3N035l764m445P040J455q294K218O526m905k718N603j883l645M835
1385A617O8m694K815L102m185j393M786R8l450k43K011O10m10j52j440j043L256
1402A353K054n313j762O275J8o048K573L633m283J35L971l871j889O128j466n730
1418d222M515L197n692O2N319k690l202L852O09l708K331K435m218q63N358j042
1434B041n422K625M204m383k052N219l71m872K535K568l712R06L448m326k149
$$ y = [649, -497, -780, 445, 1517, -382, -1868, 1727, 2431, -2871, -607, 4225, -1218, -3222, 3001, 677, -2781, 3066, 730, -5897, 2221, 6138, -4404, -4530, 4335, 906, -3042, 1650, -9, -2933, 1902, 2334, -3267, -1241, 3179, 522, -2514, -42, 2056, 256, -1432, 493, 1340, -1102, 102, 2018, -1524, -1441, 3594, -170, -4615, 2425, 3880, -4414, -2196, 4330, -575, -3293, 2310, 427, -3218, 1617, 1685, -3009, -194, 2908, -1277, -2670, 2116, 2214, -1236, -1479, 532, 1142, 732, 580, -860, -1903, 1353, 3407, -1906, -3668, 2607, 2625, -3423, -850, 2783, -1500, -1365, 2606, -1265, -3154, 2974, 1508, -4222, 293, 3490, -2202, -2140, 3179, 489, -2713, 1139, 1748, -1960, 371, 2806, -1412, -2275, 3083, 2041, -3381, -756, 3448, -935, -2987, 2232, 1861, -3011, -476, 2092, -1620, -714, 2734, -1592, -3741]
1449c741O333R7n787J832L854l052n92K928k249j742M413k02m753J525M355l087
1465A32k431L863m0l659J946K538l513r50L839r80k906K494J107l608J325L534
1481B691k577k642L117J015k956Q95K200j856j183K342j09k380K205J495l794
1496a537j016N209n59m755J695L339k704j237K864j670j935L804N4m174J546L413
1512B337k769j111K798o59k285J985J316k643O7K661r93j872J965O87l535J087
1528i64M573l155m445M482K524m620L74L531l389r06M295k127l772N324J155o175
1544c295J574M962l399k380L853p19k432L365m1m370K155M473k886l924L246K551
1560B733l429q28L376j159k615K607Q40l786J664L675m118j758N286j949m679
$$ y = [-3741, 2592, 2689, -3098, -1266, 2588, -464, -1056, 1872, -377, -2119, 2294, 2092, -2661, -1136, 3219, 132, -2299, 1564, 1524, -2135, -189, 2349, -1164, -2114, 1725, 745, -2161, 333, 1440, -2168, -843, 2691, 114, -2528, 589, 1604, -1352, -457, 1743, -113, -1296, 1046, 937, -1443, 762, 2257, -1537, -2553, 2656, 2097, -2658, -963, 2376, -328, -1565, 1299, -371, -2306, 1498, 1552, -2622, -1076, 2337, -432, -1543, 1255, 596, -1689, 296, 1612, -1031, -964, 1697, 704, -1168, 797, 1484, -2051, -964, 3609, 454, -3991, 491, 3015, -1605, -1231, 2300, -1089, -1995, 2300, 173, -3599, 1725, 2880, -3295, -1721, 3241, -158, -2538, 1315, 596, -1836, 1529, 1488, -2882, -727, 3746, 860, -3064, 182, 2733, -696, -1524, 1852, 693, -1922, 685, 1525, -2261, -597, 3078, -1040, -2798, 2488, 539, -4140]
1575d140N276K302n774O26L797l137l16M518l244l584N430J164n228P84L968j271
1591A171k155R82N51q37M56L10q25k18J688l09l143J100L942j913l201K467Q53
1608I19k246J774Q11l397J904L324m590j372N113n95l533K414Q41k750J023J941
1624A581j596k53J085j161l96J395K23j078j103J377J485j929j776K328J137k219
1640i00J038N07k722J788L100m026j188M900j068m328K684K551k881J16J743j985
1656f71J79K004j511j115J662M42j152o12M33Q40j86q35O81m24p83J811J82k866
1674a921J555K372l080o49L886k246k825M667Q47m883J269L058k827J44K788k897
1690g42j619M070l9l588J205K534k066j140K012j76j493R09J060j582j027L058
$$ y = [-4140, 1136, 3438, -2336, -1710, 2087, -1050, -1366, 3152, -92, -3676, 1754, 2918, -2310, -1526, 2442, 1171, -984, -2, 549, -288, 168, 478, -347, -565, 1123, 814, -2329, -1229, 2713, 800, -2401, 66, 919, -1327, 447, 1258, -2139, -235, 3089, -1501, -2873, 2240, 1645, -1888, 526, 1367, -1383, -360, 1581, -15, -268, 817, -344, -740, 655, 878, -200, -1303, 74, 1559, -370, -2146, 182, 1319, -900, 138, 645, -2077, -289, 2811, -1215, -2403, 2497, 1429, -2899, -215, 2336, -545, -429, 1314, -671, -492, 1512, 1, -1114, 548, 990, -162, -774, -341, 499, 313, -522, 159, -265, -1048, 763, 945, -1921, -366, 2006, -1074, -1723, 2163, -83, -2908, 1759, 2606, -2277, -1008, 2050, -777, -633, 2155, -742, -2361, 1709, 1670, -1918, -713, 1821, -245, -1385, 627, 451, -1042, -133, 927, -655, -1682, 1376]
1706A376r4l521J839L002l462j341M235j224l203L267J035m238K196L024l973
1721a082n50M088k289k487M019q0m229K103K766k579j049K012p05r85J943J63
1737A059k892L49L153n04l088J031K420j506j136K087o76j800K542L67l564J931
1753b27L066l739j219M119r90l301K906R69l134J208J785k499k63K856j184k212
1769a859J780J332j707o11J349K99j045l1J329n95o80R40m92r24J888P20l240
1786a547KL926j226l105J644J290j734J217R20l119M79L386j695k666K260J530
1802A562j968o93J487j44p85O48K17q28N61R12j183o66K088j46k488P78K525j876
1820Aj427K378l24j915K053N46l042J237K509k762j025L041l51k922J260J943
$$ y = [1376, 1282, -2239, -400, 2602, -860, -2201, 2034, 810, -2393, 874, 1909, -2329, -133, 2891, -1082, -1632, 2456, 167, -2320, 1699, 1619, -2610, -507, 2259, -320, -1369, 643, -62, -1047, 896, 1059, -1833, -1484, 1669, 1165, -1923, -892, 1528, 22, -1114, 973, 297, -1503, 1039, 1406, -2158, -227, 2839, -900, -2119, 2000, 1010, -2291, 615, 1584, -1550, -342, 1443, -1056, -1319, 1537, 353, -1859, -79, 1253, -454, -1065, 284, 583, -462, -493, 836, 241, -439, 501, 9, -915, 973, 1693, -1547, -1545, 2381, 1155, -1950, -306, 984, -750, 467, 1387, -1732, -1253, 2133, 438, -2228, 32, 1562, -406, -1099, 388, 244, -541, 107, 324, -504, 57, 969, -214, -880, 1208, 1062, -1426, -648, 1877, 1, -1426, 952, 628, -1287, 766, 1312, -1730, -493, 2016, -746, -1771, 1270, 919, -2003, -743, 1200]
1836A200j353j61P77j160QK182q62k416J203K559j321k057J378J299j687J99J069
1853H57j349m12K450q86k520J857J562k316o44K513o31j757J700K44j474P72O20
1870E86j307P5J917j047j576J569Q73j508j32J341m16j196J052O00j345M10R08
1887H04j296m49K258m36k577R65K176j359j186J476l72r11J527pk228J282K226
1904A893k014j290K003K69j692R11J080j741k73K064n80j642J137O88j401O8J717
1921A197j193j366J782O28j860K8J353p58n35J134k43q95J041N8j555J041J399
1938A256j333j184J534P29j169j06P83q08J01J271p77j515J481R33j491o18J220
1955C07N7j029P91M25j317L34Q70n09n62J055n44q18J184P41j711l08J878L2j408
$$ y = [1200, -153, -314, 463, -697, -689, 1493, 631, -1785, -582, 1977, 656, -1401, -23, 1276, -411, -212, 857, -492, -904, 1546, 660, -1860, -3, 1559, -757, -1401, 1112, 481, -1276, 424, 668, -806, -34, 586, -721, -646, 1271, 224, -1352, 217, 1090, -418, -550, 791, 375, -821, 231, 831, -514, -104, 804, -492, -941, 1317, 881, -1696, -731, 1445, 86, -1100, 376, 4, -907, 620, 613, -1615, -333, 1893, -121, -1411, 592, 861, -831, 80, 1160, -581, -854, 1210, 630, -1012, 125, 813, -588, -520, 1197, 4, -1362, 420, 1048, -812, -784, 569, -189, -724, 410, 167, -728, 313, 371, -1184, -143, 1256, -77, -1261, 273, 1002, -167, -273, 510, -298, -197, 1074, 297, -1218, 263, 1196, -295, -913, 307, 364, -665, 126, 551, -766, -432, 438, -71, -633, 422, -122, -940, 244, 985, -726, -1034, 844, 876, -532]
1974e32J75Q82p72L00P40p15p06J418J31j891J61K107r88j295R12N42r99M48J26
1993D4j040R69J361j866j176K281P02k020J33J405r40o9J072p39j018J493N01
2010A093j719j64J702n60j264J232P11j727J00J162l58m19M52o44n10J763N4k397
2028a493N64K128q82j557J272N36j051P76K10j375O05J507r62j433J595P78j574
2045c56l09J114R4l37J7n63j78J110J53j550K9J689n03j305N15P90q28O1Q67m30
2065H0r56J105L69q25L48L65q82k13J205Q0j024RQ06k61j69j05m18M59P34n08
2085A99j214N78J212o47o23L83M09m73k92O99l93k7O28l81r11Q40R12j126n26
2104g53J326Nr22J94N92o11J89Q57j147n83J278J96j107L76N62j010K6J186l24
$$ y = [-532, -357, 525, -247, 53, 793, 78, -628, 790, 921, -970, -809, 1298, 310, -985, -73, 469, -530, -82, 44, -996, -27, 1334, -532, -1708, 573, 1275, -745, -612, 793, -147, -216, 856, 117, -901, 592, 1093, -626, -790, 912, 352, -912, 320, 1031, -696, -596, 566, 208, -211, 241, -403, -913, 850, 904, -1493, -929, 1199, 317, -1240, 32, 568, -483, 293, 503, -872, -267, 1240, 278, -1155, 440, 1218, -356, -665, 449, 543, 206, 223, -340, -518, 592, 745, -805, -776, 913, 410, -895, -380, 410, -418, -357, 510, 80, -876, 229, 598, -227, 121, 486, -396, -609, 596, 676, -348, -339, 467, 206, 37, -68, -486, -27, 707, 199, -1015, -437, 775, 128, -495, -112, 297, -176, -468, 231, -162, -189, 439, 58, -853, -13, 899, -227, -753, 573, 578, -344, -150, 442, -169, 20, 877, -270, -853, 425, 621, -486, -110, 452, -558, -532, 654, 330]
2123C30j323N70R69n10n69P46j98o73J191K11j351j16J646l04j264P67L66q97
2141d09M57N78j204K49J307r79j042J368L02j593N12J186j146l72J320n03p35
2158g04Q45M50j131K5J065m10n60P57J62j053M47R51o73q96Q29N53r31M12L08
2177D46j233L66J791j251j611J559R31j555K44O91r38J47J088q54o99J098K63
2194D83r56J57P40k85k46L21m7j76J07J14k54jM30l27o01N11Q56j095m16J003
2214C18J8r94N98M29o66J07M25o46J40Q96q32p43J183N68j008k23J92J92O56k70
2234C40q39P1R71J10q53m28P36N48m54p43K91Q38o71q9L03n57K28O37o87k94J079
2255E37l09q82O49O11q90J52K62j94J85K83o50n9P55j97m33J38K70N8m03j87O58
$$ y = [330, -993, -423, 546, 36, -533, 213, 15, -658, 533, 744, -607, -723, 923, 619, -645, 122, 488, -409, 48, 626, -578, -329, 978, -1, -1043, 325, 627, -966, -454, 732, -414, -786, 534, 31, -704, 141, 591, -540, -515, 550, 140, -420, 337, 499, -554, -107, 844, 171, -725, 104, 657, -274, 138, 446, -787, -421, 1370, 119, -1492, 67, 998, -557, -313, 378, -560, -413, 675, -179, -878, 220, 483, -473, -316, 424, 139, -107, 214, 167, -9, 98, 212, -42, -43, 387, 60, -541, -30, 826, -269, -685, 318, 336, -658, -60, 369, -297, -190, 235, -411, -271, 625, -207, -950, 233, 801, -207, -430, -238, -46, 610, 340, -499, -428, 543, 653, -200, -628, 108, 656, 202, -541, -250, 588, -83, -172, 131, -426, -198, 439, -248, -542, 537, 228, -654, -5, 606, -284, -132, 130, -64, 121, 404, -246, -305, 450, 253, -180, -42, 228, 286, -117, -304, 354]
2276C54P8q99l3P28k03j31K16q11M08J232p90j135J030M21o30J26J4n13R28M42
2296H32j253j60J269l25q39N72J91m13J96J91l02m0J83j42J57j66J84r0m49J85
2316b19O45o62l51P62k7n85O27K47j044M63P77j132K18J239j068o78J335P8p50
2335a25J60J98k83L25j58m18J73M89l10k20R5j56L89J13l88j41K48j31M74k53
2355H1m74L84K54m20M1O05p51k7J070o39q58Q22M25p00L32K36o84J77O19o93k01
2376d01Q53m29m97L23J91Rq0K3j7J02Q8k13mj73M44K90q48r2R41j31p15O26j69
2399A21l83M74K83o96K15K69p51L85O03o99m33Q03n7l56J20k9k12N37O3n47QK63
2421a9L39j67n38R5P87l98m56O55K80o24O1J15l74N46K48q73o3J140n20p84O53
$$ y = [354, 432, -467, -500, 228, 25, -106, 110, -701, -293, 939, 149, -986, 44, 465, -165, -39, -25, -538, 390, 832, -421, -581, 688, 363, -476, 96, 287, -126, 70, 261, -41, -81, 102, -40, 117, -49, 135, 45, -404, -219, 426, -236, -587, 175, 148, -437, 190, 437, -607, -144, 633, -499, -281, 958, -110, -788, 547, 625, -125, 35, 233, -50, 275, 117, -301, -128, 361, 51, -169, -74, -230, 159, 272, -116, -257, -9, -140, 334, 81, -393, -9, 245, -175, -134, 471, -280, -307, 763, 124, -734, 88, 513, -187, 145, 381, -303, -126, 493, -200, -401, 452, 23, -474, -151, 40, 49, -31, -8, -25, 77, 165, -48, -52, -225, 219, 509, -339, -431, 510, 379, -336, 290, 121, -262, 212, 495, -201, 14, 283, -468, -83, 520, -179, -612, 191, 134, -222, -102, -131, -343, 194, 257, -290, -282, -19, 320, 153, -385, -290, 497, 99, -357, 298, 578, -46, 15, 130, -244, 302, 550, -323, -386, 754, 234, -550, 103]
2442A03Q5m77M97j51o28M39P06o48k42K80K78k52k01J29K04k12j86O28j00l89
2462a37J53J27r6K76q1p68J79J230p87n55O15L0o45O07k28m59N60O33q60m43J020
2483C71No16O3L73q9Nj08o7J68K54j48n46L11M66j32o75J84L39k44K3K11m13j08
2506c73Q59m35o28N28L51p00L01P45p01m48M87K48l23p8J77r6L09J39o76P1M28
2527A85K52m30l17M93J8n6q9O6k71Q4L67m80l55Q17L9n78j7O50k83m67L96k11
2549a87K02J70l41r9M54N9j68j51Q3j91K24K76k34k77J18L37j27j76qM6P6J50
2571B36m5l65k78N27L57n11k26K19J26N5p8o8J7J28N5k41m5J86J57l44K5L47k20
2594A4j50L87j66k17J52K44l49L6K86l23j71J02K22l97K02M20m69k53L54J87J1
$$ y = [103, 188, -289, 208, 57, -571, -132, 574, -74, -316, -36, 242, -10, -211, -82, 122, -90, -276, 352, 252, -137, 16, 143, 47, 323, 242, -526, -347, 883, 96, -459, 156, 186, -459, 148, -80, -539, 21, 654, -206, -649, 371, 376, -240, -177, 196, 107, 112, 4, -63, 105, 359, 211, -335, -24, 442, 310, -365, -181, 158, -86, -63, 148, -265, -373, 486, 51, -577, -49, 302, -398, -97, 648, -53, -501, -14, 234, -89, -167, 10, -86, 223, 362, -314, -243, 185, 437, 7, -310, 183, 201, 145, 56, 122, -149, -65, 302, -178, -533, 284, 323, -255, -272, 378, 95, -372, 24, -187, 15, 185, -156, -255, 199, 258, 90, -61, 22, -169, 55, 331, 97, -180, -62, 275, 148, -28, -36, 10, 86, 236, 191, -174, -452, 75, 432, -79, -305, -86, 40, 95, 17, -51, -34, 94, 149, -92, -137, 49, 206, -138, -113, 234, 14, -136, 251, 85, -132, 20, 264, -85, -49, 237, -86, -257, -155, 67, -330, -128, 292, -177, -430, -76, 111, 122]
2615A22j49o1k6M50l8m27k68O97J47m40j39K55j61L7L36m54k51Q44j95q10L18
2636b13N55l76j14K25j6l86M19rm48L66J24m24k4O13j17l55J99J15Rn0J73k74
2658hk00J36K49k92J28K49m55l27P38J38o16j80N84j00j8K5o04L13P68l41p94
2679f07M88N09l23k05K10p0J2J64k25k56N15K88m69k03J11K58k74k2M6K10j92
2700c5k25K78p8J71j07j68j27O16j53n15K70L81l98N0K36j37j63K71q2k05L12
2721A92p0k97l6M82Q4n05j65L34L52l85k58J14J60O1J16n29J1R25l62n69O2M85
2743B02l19J81Q9l29n7N07k41j59K07Q8k90J49K40j47k13M7J13lj90K7Q6j23L04
2766A69j69j40P8K21l77j78O13po67M98K97l97j49O19n42p8O28l41l76K48M86
$$ y = [122, -27, -88, -114, 336, 298, -129, -397, 300, 447, 7, -132, 123, -38, -1, 335, -119, -370, 474, 279, -531, -213, 342, -34, -148, 77, 61, -325, 94, 85, -363, 3, 127, -297, -321, 292, 175, -180, 19, 134, 143, 93, 266, -8, -208, -72, 177, -115, 13, 262, -193, -520, 218, 356, -260, -440, 144, 44, 26, 51, -553, -240, 528, 187, -607, -119, 390, 67, -138, 72, 2, 14, 178, -47, -303, 212, 500, 31, -172, -61, 197, -77, -99, -53, 157, -35, -260, 18, -60, 111, 4, -164, -291, 325, 172, -343, -73, 308, -90, -40, 196, 59, -104, 167, 85, -120, 192, 122, -175, -211, 271, 355, -150, -315, 19, 371, -14, -272, -158, 2, 63, 179, -350, -339, 586, 224, -345, -283, 202, -117, 64, 153, -176, -233, 274, 33, -126, 81, 169, -121, 28, 268, 121, -92, -45, 68, 65, -125, -98, -12, -135, 169, 0, -140, -62, 159, -218, -396, 217, 210, -457, 41, 338, -59, -208, 411, -131, -209, 419, 78, -298, -50, 436]
2787D36m15N4L0k59r9N80m12k06O9L39p7j02j34L89l61p5M78k47m65N77K26m99
2809a73J2M02l65K2M08j41m03L39J55l49J54K15l28k29N32l96J20M40m28l75M59
2830G1J05k05l29L88R9k80m3M58n06N4K58K47m92P3L52l95n8N05k86n55Q83L3
2852C77m86k51N76l93J68K10n25j09P13po11K03J38K07l18m5J47K07l11M0K58
2873A88j79K23j14j27k23O25j61m90K00K12j63L0J04l54L45J40m10k21M25L22
2893C72n32m3K67p9r3J25K1j85O6q8L33j55J10j21j78J76K85j62m64L50M06l63
2915D8PK24n88M39K42n46j71P80k35n48J58M80l73J20L8k30L1K98k55j61K05K78
2937B41n3n16M11K07j76j49l8q1K71J90j40l71L95J4m33Q9M08n17RN92l27l62
$$ y = [436, 21, 75, 105, -154, -253, 327, -85, -291, -222, 117, 40, -62, -196, 193, -168, -243, 235, -12, -477, 100, 326, -173, -161, 241, -124, -102, 306, 165, -238, 101, 256, -93, 61, 276, -52, -281, 251, -145, -25, 415, -13, -388, 71, 176, -29, -358, 30, 129, -151, -194, 264, -242, -188, 70, 317, -175, -102, 250, -145, -203, 302, 16, -539, 344, 377, -109, -360, 216, -177, -9, 201, -324, -433, 280, 273, -338, -135, 3, 210, -108, -153, -6, 201, -110, -70, 188, 9, 232, 118, -9, -232, 393, 232, -258, -58, 154, -9, 21, 125, -229, 116, 256, -154, -375, 50, 372, -160, -203, 64, -15, -108, 17, 38, -147, -81, -169, 164, 9, 119, -2, -180, -4, 281, 119, -345, 5, 411, 48, 55, 279, -309, 130, 372, -174, -345, 435, 200, -348, -190, 290, -83, 37, 75, -155, -124, 174, -81, -242, -37, 241, 188, -328, 83, 290, 114, -35, -73, -154, 117, 307, 167, -204, 191, 205, -228, -139, 269, -248, -239, 353, 26, -336]
2959c36K73K16k65J42J78l73j93N79J1l81J7J17J67o2j80P3N1J86j36j90M0L78
2981C12k68k66RN31k49k56L33k54%J76j68o1K89J03l39j42L14j65J11R5j24j45
3003a64J77K22j32k81K1K78KO7q0j43m5K73j4m80J51J83M3j18J12j39k03L65L3
3026A28l22Q1K11j02j30J30O2l03K69J40j48n4J72k31l8L80J11n51k0N18k69l75
3048c41L26J96l66J11K35p1k40L12j24k11J76L9l79K31K63k56j51J58R5p1J64
3069I6M7l05J69L44j73o47M14K94l23j54L95j39m4K23j82j55j14N27m92J23L03
3090B07L2n89L37K03k33q7J55k33J9M54j54l57K75K68k14k56J70L88o45N5L96
3111A91m0k39J24M1k40M16j53k89J12M07j70n57L76R6j17m0J33l12K17L56k50
$$ y = [-336, -63, 153, -112, 30, 208, -165, -358, 221, 232, -149, -132, -15, 152, 90, -90, -17, 34, 220, 84, -106, -66, 312, 44, -222, -213, 318, 69, -187, 146, -108, -108, 68, -100, -161, 128, 231, -108, -250, 64, -101, 10, 105, -19, -164, 13, 235, 103, -178, -157, 121, 123, 190, 110, -33, -78, 195, 181, -299, -148, 35, 78, -40, 72, -67, -270, 95, 128, -194, -113, 98, -4, -134, -4, 58, -245, 24, 164, 16, -38, 134, -97, -135, 245, 356, -195, -215, 303, 34, -341, -15, 181, -185, -74, 161, 90, -150, 162, 38, -173, 3, 42, -337, -106, 157, -99, -250, -92, 3, -68, 96, 143, -162, 7, 351, 178, -469, -55, 239, -84, -238, 157, 18, -26, 197, 15, -140, -254, 273, -219, -96, 207, 239, -350, -13, 190, -43, -130, 25, -208, -189, 265, 111, -246, 29, 297, 83, -173, -3, 385, -260, -205, 191, 151, -88, 36, 77, -163, 253, 100, -189, -77, 330, 160, -397, -21, 75, -42, -82, 51, -261, -44, 312, 62]
3132F2l77K45L07k53j80L42k13j74M29M4k68p4K82l61J36K21j33k30J81P8k36
3153a72M4J78j71M1O4J07k68J05K27l63k2M81j50l11J55M10l14j21R0N3K6O6j57
3176bk14K54J81k80r5Q7J79k14m6K13k83R2J93m6j11NO5k5j13M15q6m17L51j7
3200H6k30J21J61J3k19Q3R5k87J92L47l90j46L28o9j87j01L94j34j14J82k12k5
3222a12L42k49k74J32M22j07l28J92P1pk47L05j85p8K69q4k38J56K23k47K39j34
3244F1j73j02M56j10m55L19J93l37L0K50j42l27M20M7l99K46J12k0k90K29K26
3265B34l60J38N2j83J27K52k05l64M71Q3l36O4L3M7J4j09k8p9O9J40k70J41K4
3288d5J65k87N3K28k34k3J94J14k77j88M77j6K04j20l43l0N07o4l76j29K25k8
$$ y = [62, -315, -70, 237, -16, -196, 146, -67, -241, 188, 232, -36, -110, 172, -189, -53, 168, 35, -195, -14, 64, -172, -128, 50, -121, -80, -16, 91, -177, -72, 155, -208, -230, 251, 101, -210, -55, 355, 41, -80, 10, 63, 89, 155, -2, -216, 38, 219, -61, -156, -69, 110, -104, -150, 63, -220, -128, 65, 19, -92, -87, -22, -47, -160, 255, 169, -248, 103, 86, -144, -23, 138, 151, -68, 15, 110, -177, 15, 362, -28, -174, 154, 85, -102, -203, 191, 57, -57, 125, -87, -112, 230, -19, -293, -161, 261, 154, -174, 18, 89, 82, -165, 140, -45, -123, 146, 62, -176, -20, 203, -44, 195, 61, -112, -214, 242, 132, -323, -4, 189, -148, -118, 132, -10, -337, 83, 130, -269, -23, 89, 69, -221, 8, 234, -126, 12, 64, -119, 8, 260, 55, -309, 162, 245, -91, -27, 6, 53, 67, -42, -70, -149, -80, 60, -210, -69, -45, 120, -167, -114, 114, -120, -143, 51, 165, -112, -300, 177, 161, 365, 245, -98, -128, 379, 315, -61, -190, 35, 7]
3310GK8R5j74p2K63m9j67N0L29m15j64L46Oq5k6J58n3N1Q3l19k46M26Q4r1j97
3335a32K39r0K4J0J12j73kP5q3P2J1j01j84M37r2l42p4L62J45k42j26K60j70j0
3359g4P4o3P7J18j0l97P6K65J4k01R0OM3J19j10r8O3J49k09k61K65L19k36j72
3383a53Q9j6j08L30k39k17L16O6l54K42J27j39J61j6o6j15p9L46l63K18j42R5
3405a7q2L06l7k32rO0J02k13j7J33P2k66J73n2Q3J58n3k05J19J35l59Q4K46j62
3429c3n9J51P3l01K71L7j53n3J22J52l73J44r0K7J97j33P9k21L8L04k04p6J48
3452D7k59J50K82l00j35L34J46k52n1p6J51k5L8M4k20Q5J92j93Rm0m8J09j07J63
3476D4k55J06N6N9j90K02M0o3j11N8N4j97L47j37j31K13L8r9j38K32Qr8n4J81
$$ y = [7, 35, 130, -44, -116, 147, 98, -69, -19, 310, -105, -269, 77, 83, -2, -28, 130, 77, 128, 211, -108, -354, 72, 156, 65, -132, 107, 17, 41, 51, 163, -10, -12, 63, -20, 52, 63, -38, -222, 215, 123, -219, -293, 69, 214, -28, -154, 106, -64, -74, 0, -63, 14, 132, 122, -275, -199, 66, 80, -121, -31, -25, 18, 137, 27, -71, -8, 141, -68, -329, -64, 255, 19, -153, -64, -80, -188, 142, -97, -314, 2, 68, -286, -44, 83, -56, 105, 89, 23, -92, -171, 175, -188, 30, -112, -17, -99, 207, 170, -62, -71, -11, 91, -122, -139, -6, 66, -200, -27, -79, 4, 162, 109, -96, 23, 158, -201, -117, 129, -33, -92, 59, 132, -169, 102, 139, -14, -67, 55, 207, -166, -22, -112, -85, 112, -21, 58, -163, -125, 179, -25, -101, 47, -212, -62, 220, -80, -215, 119, 265, 13, -38, -114, 37, 12, 50, 94, -126, -41, 151, -42, -33, -73, -121, -12, -119, 44, -211, -105, -49, 10, -180, 22, 62, -1, -112, -54, 0, -197, 150, 13, -118, 95, 133, 34, -104, 128, 136, 38, -16, 165]
3500A65j2j32m3J04k84K64R5j54%j0n8J02K42k54j83J46J51jj52J51J15l08K14
3523A58q7n9m5K17j06j14O2L6k24J74J5J6j98L00j23j56Q6J10k20J52J80l99L35
3546A10j30K20m15J28K08j53j05J11L8L0m4k4j00J45K61j79m35K13M17j59k22
3567h5K3J39J00lk31j9K51q7k20J81k7j17j27J49n8R5q7J23RJ9OP1k91K19J2J16
3593A61l31K69K5k10N7J22j29RJ40j87p0M8J72j34j2K37r8j57J03k5nJ24j38j60
3617a89K45J96k28p3j49K46pj81J93j39O5J61l29L16p1o5l3r9J80p1j47J52M6
3640A9j32J04j2o8Q3p3K38k42mK26j80K41k98J25q6K5J08j36J29JP8j95Q3q7q
3665f1J21lj94K5J48Q3j55k24L20k52K24K0j29j78K45K14o0k29K2Q4j2n7M7p4
$$ y = [165, 153, 21, -22, 82, -202, 62, 157, 3, 3, -7, -65, 37, 279, 25, -158, -12, 139, 138, -14, 137, 252, -56, 158, 71, 12, -33, 184, 78, -36, 26, 62, -162, 12, 27, 43, -155, 145, 22, -134, -48, 62, -158, -6, 174, -225, 110, -20, 200, -215, -87, 121, -32, -137, -26, 12, 42, -2, -26, -126, 19, 280, 101, -334, -121, 296, 137, -85, -62, 77, 177, 174, -57, -76, 175, 88, -132, 49, 22, -95, -222, -73, -131, -36, -123, 0, 9, 28, 34, 105, -186, 33, 45, 161, -170, 99, 124, -86, -29, 93, -36, -27, 113, -74, -144, -96, 76, -58, -70, 167, 69, -88, 15, -10, -15, 109, -29, -189, 56, 252, 24, -49, -198, 48, 41, -140, 53, -86, -21, 140, -189, 127, 56, -9, -42, -141, 39, -32, -179, -27, 19, -113, -9, -21, -89, -6, -79, 159, -83, -87, 139, -41, 200, -98, 27, -59, -34, 74, -62, 67, 68, 146, -49, 34, -53, -61, 60, 57, -137, -112, 36, 119, -36, -260, 60, -192, 32, 52, -77, -255, -10, 204, 144, -85, -63, 21, 9, -48, -1, -75]
3689g5m2K77j52J4j47J74P4j13O4k10j06K36j42K13M9K6r4j46p4J33J12N5J0r6
3713D0O4M5j37p1J61j3K1j01j6J03M5j56j19m6J44P4m5q0J19q6r8L05l9j13m2
3738d1j6p8K97k88R2N9k5o7J27%qP2q5j20J40qM2K5k66J58J51j98j18Q5P6M0j39
3765i3l2J40K5k44J04J63N7j92qp5J99J12j09o8J4kK5j30N0j3J39j0r6N7J18l48
3791b17L50j7j36l1j03L00j27k2J5j21N0K05k03j24K27N5q8L6p8q4J45J07k04
3814f5%M2J35p4p3K27m0j30Q3r3o8N7j7k4J01q1J02j30j02J58q0J72j87J15k0
3839Hj48J14K2nK3q3J45l6k13P1R6R4r6J62l03L59J4p8l13J66m1LJ50k50J36j2
3865a5j6J40k26o7K26p8p6P4J48l2n2j09K9J85j84J95k18N3j0P1m4qK1Pl9M7j42
$$ y = [-75, -117, 160, 8, 22, -125, 49, 123, 10, 74, -136, -242, -6, -148, 65, 114, 140, 46, -100, -174, -41, 71, 126, 136, 40, 104, 149, 12, -59, 102, 89, 110, 9, -7, 96, 141, -15, -134, -180, -36, 38, -7, -87, 32, -54, -152, 153, 114, 1, -41, -57, -135, 162, -126, -34, 25, 0, -67, 60, 60, 52, 124, 39, -81, 59, 51, 93, 118, -148, 10, 161, -37, -155, -70, 6, 46, -93, -125, 15, 40, -204, -100, 63, 120, -72, -80, -155, 44, 156, 47, -21, -7, -9, 16, -114, -64, -77, 62, 52, -44, 13, 131, -217, 133, 116, -20, -51, -154, 146, 19, -3, 12, -109, -59, 146, -57, -181, 46, 101, 13, 49, -29, -113, 32, 139, -65, -65, -23, 112, 38, -35, 192, 152, 22, 105, 12, -56, 1, -16, -40, 61, -20, 82, -48, -150, 8, -72, 100, -87, 28, 8, -140, -26, -4, -9, 14, -69, 76, 40, -173, -102, -6, 88, -8, 154, -149, 210, 224, 146, -167, -1, -42, -39, 111, -139, -3, -15, -31, 109, -117, -184, 42, -36, -112, -38, 110, 78, 26, -83, -54, 131, -53, 142, -76, -23, -33, 38, -6, -14, 7, 14, -25, 22, -120]
3892a20K53Ok08l0J18k9J25j70j02K4J38N0j76J12j61K35q1J15k51K26q9J75p3
3915H7q7j94J67N1j69J18J49j80n8rq2K78j52L2N3k2J51l6j60O3j9%r7O1J05j57
3941a07K10o3r9J02n5J46k87jJ96N4r4n9J4LJ33j58Q7l6r7J68o1K8j49l6K3K47
3967A09j37J8r0K64k30J94r6j3j94Q8Q3r9Q6q4K42K2r5j85J23P7j03j19J41k7
3991b5NJ9P2k01K13j90oJ32J31L2j02j59L3J51j99j3j3KL12k59J06L1l1k4m5q1
4017a09J12k3M4P3k72K79K1j04k2n9p5J10q8J87q2k4j9O7O1O3q1M9o5J5P6k94
4043a60N4J31N0pj69J41m8j10J33j7j30K57k73J89r0O1O9j27L1N5lk16Q8J50L2
4068I1K2j04r8J11R2j20j29K6J97m6j31K3kK56k28p1J54O6j49q4J52n5P4m2l6
$$ y = [-120, 133, 139, -69, -99, 19, -10, 115, -55, -157, -133, 5, 55, -121, -9, -170, 65, -16, 99, -152, 74, -15, 160, 87, 0, -194, -27, 24, -145, -27, 122, -58, -116, -125, -207, 71, -81, -49, 4, -18, 133, 97, -63, 0, -19, -19, -116, -55, 50, -107, 103, 40, -59, 43, -12, 134, -153, -154, 42, 96, 2, -57, -43, -40, 93, -65, 22, -14, -111, 57, -4, 24, -125, -161, -138, 109, -28, -10, -100, 164, -66, 128, 32, 19, -175, -87, -4, -103, -17, -101, 141, 163, 68, -117, 6, 83, -20, -139, 2, -25, -20, -1, 71, -130, 83, -107, -113, 19, 150, 182, 80, -79, -46, 105, -94, -107, -120, -118, 194, -65, 41, 72, 41, 17, -28, -109, 3, -20, 24, 97, -175, 104, 125, 21, -1, -60, -135, -25, -113, 74, -8, -32, -51, 16, 77, 140, 59, 108, 43, 58, 134, -160, -106, 25, 75, 68, -101, 40, -8, -118, 15, -2, -132, 125, -148, 41, -49, 12, 81, -46, -15, 40, 37, -179, -91, 59, 91, 113, 9, -89, 22, 114, -6, -135, -109, 88, 42, -89, -66, -68, 188, -40, -111, 43, 109, -40, -124, 28, -27, 47, 5, -31]
4093c1J05j72k5K51j79P9M9Jj8j12J0k0J68k30J8L15j09l05J53K36k10j05K37
4116A06jk76J27Q2o5J09j53J09p6J67q1k42J73rr8P8K21r9PM5j23o0N3K72l91
4141a25J42M8j62J08q5P1r1K23l03K42k04K66m2l7j16k3P2M1j34J4k6J58J0j07
4165f0m3J52jQ0r2o1O8m0J40k92pJ52p8J10m3J5q9LJ42j8j83R0Jk2L9j94J56L
4193g2P4q9K25k06K86j63mK7j23P1N2Q5j05N3N8j69j08R7J33k03j20K40L4N7j61
4218c1k8k1J13m9q3qK22j69M6j5J86l05K63j3q9j20K04j71K8O9J16k09Q4K3J1
4243E4j24n0K00m7M9j65L8P2J9Pj80M7L2L2o1K0O3q2J51j32J63q4l3L7p4M3K22
4270B17j84m5l1M8J05j13R8j63J42j17M4l2K8Ko7O6J31o7n9K5MK5k64K44q2MQ1
$$ y = [-31, 74, -98, -123, 128, -51, 28, 77, 78, 60, -52, -42, -62, 106, -124, -106, 209, 100, -205, -52, 184, -26, -131, 106, 105, -171, -44, 38, -27, 82, -71, 38, -38, 129, 48, -194, -21, -30, -128, -50, 171, 72, 79, 124, 1, -59, -6, 266, -125, 17, 65, -97, 11, -74, -3, -94, 129, -174, 68, -136, 130, 88, 51, -65, -88, -16, 25, -109, -95, -121, 37, 47, -60, -103, 49, 48, 128, 36, -25, 43, 3, 143, -149, -156, -4, -82, 28, -15, 0, -89, -86, 56, 38, -145, -55, -54, -76, -37, -231, -75, -72, 2, -87, 138, -68, 218, 55, 51, 78, -45, 26, 78, 163, 58, 111, 169, 0, -108, -11, 122, -81, -201, 39, 73, 130, -31, -59, -80, 33, -16, -99, -107, 115, -54, -8, -23, 163, -142, 121, 108, 19, -101, 103, -68, -40, 29, 145, -64, 20, 43, 54, -70, -120, 80, 33, 82, -83, -45, 27, 46, 53, -127, -80, -48, -16, -77, -57, 6, -76, 75, -57, 106, 22, -11, 26, -48, -5, 217, 33, -12, -43, 5, 110, -3, 95, -68, 74, -43, 1, -31, -3, -1, -68, -2, 129, 62, 3, 28, 32, 57, -207, 37, -45, -41, 40]
4297D0j05J50p0%j39o3J2K67J37l60J02J69j9j33O2j44l9J43r3R9n2j8p2k2k8
4322a76J26J10k8j41L14j29n3N2j25j9RK73k35J00L8l5j59M2PK6r6J70n5j32L8
4347g8O9m9j38J98N0j71K2J79Mj97O3J4J06o0p2J79j42J25j08N8K5k9j21rJ96
4372A14l33K97J92k63r4N1J26j25j28J39j4k70L78jO4k26r0P6K73j28Oj0k0K5
4396C9j00K5j08J12J53O7k11M2n3K40j18k32R7J50k12k9O4K32k67o0J84j60J34
4419a1K0j15J03p0jK2j6J05%m6M4o4N6J5j37R9O3J06k75J49Mj14n0J47P5K1j63
4446c3o4l9J37J47j16k47J16K53j6j86J26n4J0LL2j14K14j86O9qJ42k39J36n2
4470C1jkk25J54o3J68n0q6n6K7J82k44M4J10n4K3n9o4J54j51O7K14n2J17j21l
$$ y = [40, -65, 85, 15, 15, -124, -187, -175, 92, 229, -131, -29, 140, 121, -12, 50, -94, -133, 10, -83, 16, -36, -54, -126, -148, -176, -50, 60, 32, -109, 205, 76, 23, 75, -50, -69, -60, 213, -22, 78, 116, 81, -78, -36, -29, -3, -99, 71, 16, -116, -78, -9, -58, -196, 2, 52, -119, -97, 82, 86, -111, -48, -34, 72, 12, -60, 119, -23, 102, -6, 52, 77, 48, -73, -82, 114, -219, 78, 270, 7, -87, -36, 90, -35, -163, -24, -38, -308, 70, 69, 133, -93, -183, -107, 166, 38, 44, 34, 14, 39, -61, -36, -144, -32, 121, 188, -23, 19, -34, 206, 88, -144, -47, 103, -109, -138, -74, 158, -109, -169, 15, -145, -11, 9, -106, -3, -73, -74, -52, -68, 37, 37, -9, 35, -29, 27, 42, -95, 4, 67, 173, -102, 47, 51, -63, -113, 34, 109, 130, -33, -97, -136, 1, 148, 32, -215, -99, 154, 138, -48, 78, 24, 34, 37, 69, -45, 169, -17, 52, 44, 186, -53, 83, 31, 30, 28, -197, -43, -106, 62, 12, -74, -130, -103, 79, -165, -121, -11, -65, -42, -101, -165, -11, -162, -95, 119, 67, 184, 63, 60]
4496F0n9J05j08p6P5K31k48j9j1J6P0j20Q5o2L2j8Q1J9j52N0M9R2k71J63m9P0
4522EJ12j10J98o9k06l8K97l5j40o8k8R8l8j8P5j1l8J3l5k12K68rm3J22pj89K0
4549h6O2Q6j50O3j0m1J53J6j38o8J57j00M9p1J18p1Q9K0k67J14O8j95K70j2M2
4574I8j11p0n8m5J35K2P5j45J87L5r4r2O2l2J31o9j18J03o7P8q7l9J68m7j02J56
4600G4j57j7Q5J75k79J59M2j71l4J31L8L0j68K13pk30J34J4l8n5J6K3j99O4J75
4625A8p8J8J04j5J14j68q8R8J13P3j75Pn7L9L4r5K4J12q1K16k54Oj0j21J43J24
4651A01j05Q5l65L71N3j54m9o5K40kk9j54K4n7J46j27K6QR5r1J20q5L8o2m3J54
4677G3l8K7n3Q2m7J6j19L7M9J38j66L3j20M3N9jj13R7o6N3n7j5R7m9J39j73l9
$$ y = [60, 1, 106, -2, -78, -3, 228, -20, -39, -50, -34, 36, -84, 1, -61, -29, -47, 34, 53, -99, -49, 0, 92, -179, -16, -65, 5, 117, 7, 205, 136, -70, -108, 189, 154, 14, -54, -82, 16, -22, -40, 35, 24, -14, -1, -36, -248, 20, 11, -32, 90, 83, -106, -86, -24, 62, -88, -25, -35, -76, 77, 93, -45, -113, 44, -56, -7, -78, 40, -31, 58, 78, -189, -75, -7, -202, 68, 56, 98, -13, -83, -141, -186, -51, -29, 46, -99, 88, 123, 29, -63, -1, -33, 98, 29, -89, 14, -53, 25, -62, -101, 67, 20, -82, 74, -83, -100, -15, 160, -119, 40, 82, -89, -123, 8, 46, 76, -92, 121, 114, -116, 18, 32, -6, -61, -45, -22, -221, -157, 18, -60, -42, 62, 47, 161, -7, -95, 3, 116, 189, 14, 21, -36, 3, 37, -58, -34, 78, -3, 213, -41, -35, -45, -166, -23, 101, -4, 81, -284, 87, 140, -14, -63, -128, 112, 110, 81, -73, -49, -106, 40, -87, -61, -53, 42, -49, 71, -14, 24, -38, -81, 73, 35, 62, 9, 91, 44, 60, -59, -22, 27, 165, -1, 32, -88, -45, 14, 13, -100, -3, -69, -16, -73, -88, 9, -40, 99, -74, -113]
4704a13J01O8j07j05J85j5j17K2K75n2j80j2P1k6J21j32M6j7n2R6p8q6L5K09p6
4729F1K9r1j2O9O3P3m16J79J08k03J43j50P1k5k0K47k3m0r5R3j64J80m3k3Q0j04
4755a3qJ28m3mj35M4K8q4J01k5jJ41J25k52k24K34pmj45K3O1j7J5O7j29P7J40
4782I3q8J0j4P9j38Q7j03L7Q7r4O0R4j08m3p4K9K03j18l3N0l7M7j63J98o5K3r8
4809g9JK09k35J43N2l3q8N7K3p9k6o8J1J75o7oO4M1k56J99o7J6q9N7j43J81J47
4836A40k71J09O3n9l3j17K37K4j09N1ln6Q1j44P7k9J00p4J0j31J63j2l4P8m5j29
4862a13rJ05r4J25j19J78k64P0J98O6l61J64L0o2j4J30m4J72j13j60J78o5q0j2
4886i4J31J05j34J3J35j57n3O9Kr3j42K34J41j23k06K49mk19L56k82jl8k6K7J20
$$ y = [-113, -12, 56, -51, -156, 29, 14, -103, -81, 194, 142, -38, -50, 21, -5, 116, -16, 30, 13, -39, 57, -21, -107, -72, 137, 61, 90, -1, -13, 56, 119, 192, -224, -45, 63, -140, 3, -147, -76, -101, -121, 126, 103, 63, -32, 61, -103, 77, 34, 11, 91, -13, -21, 107, 64, 60, -75, -31, -3, -87, 14, -11, -12, 129, 254, 2, -222, 12, 5, 1, -144, -121, -60, -77, -62, 5, -124, -47, 93, 5, 15, 1, 80, -58, 29, -74, -37, 50, -44, 16, 110, 2, -41, -115, -86, 117, -1, -34, 16, -21, 26, -137, 61, -4, 19, -79, -78, 131, -104, 39, 91, 58, -30, 27, 50, -29, -55, -123, -112, 63, -4, -10, 54, 95, -161, 38, -29, -13, -102, -45, -188, -7, 140, -131, -22, 41, -18, -51, -168, 69, 93, -16, 35, 32, -24, 57, -87, -10, -39, 61, -13, -3, -134, 29, 17, -17, 61, 16, -113, -122, -17, -111, 14, -105, 73, -191, -121, 77, 143, -218, -54, -24, -86, -100, 30, -14, 158, 45, -115, 63, -2, -82, -94, 37, 142, 8, 21, 156, -1, -54, 15, 17, -76, -218, 16, 157, 34, -172, 77, 73, -146, 210, -72, -73, -111, -137, -110, 10]
4911A0Q3n6K3j08O3J0p8Q9j88J16J79kj74J09Ko7m7R4l3j13J35o8j21J26j48Q5
4937g9p8R6P8P0q5j0j2k3Q1o2Jn8RR7N7n8j48l4K15o1j99J55L9L0r6p0J4J0k8
4966a49K37j56P3K7J9j14L2o5KK03j59k0M1l7k9J61m8N1q4o7K63k51J09k8j12
4991a01Q7j35K75j30J8r4JJ81k6q0n3J86k84K35J9k6j21K08j91J8n7Q6m9K5j8
5016b6J48o1j67K45l8j06k0M0k5l5K2j16J68o9L9m5J57j32j23J67L4Q6q3QJ0m4
5042C4n2J3j7K0j05K21j67j6J32j60J02K4p6j52J06P8l6q8N0J71M7K2j42J1p7
5067e7J32n3q1J70j10J12j72Q1P2J10k52K4n0J65j93J23j12L9J66j1P5k26j54
5090b02K61j02jj4n4J06R0k01O8P1M8R6l28J53lM9k5J66k16J84n4j84K4P1o3l
$$ y = [10, 93, 37, 60, -48, 15, 25, -53, 36, -152, -36, 143, 141, -33, 76, 78, 11, -36, 58, 25, -88, 47, -21, -142, -16, -164, -79, -157, -61, 17, 87, 2, -8, -20, -43, 38, -24, -23, -81, -72, 25, 82, 24, -124, -158, 57, -4, -203, -48, -9, 21, -75, -145, -131, -121, -149, 88, -68, 5, 32, 51, -63, -31, -96, -94, 109, -50, -70, -29, -66, -95, 66, 18, 69, -15, -82, 181, -70, 39, 11, -101, -14, -149, 126, -4, 14, -80, -79, 102, 76, -4, -57, 129, -155, 80, 99, 73, -48, 160, -31, -13, -70, 16, -33, -8, -26, 122, 61, -106, 139, 101, -5, -25, 15, -10, -45, -23, -139, 29, -40, -1, -46, 111, -21, -144, 23, 57, 143, 60, 68, 78, 34, -18, -5, -22, -2, -107, 114, -53, -69, 63, -97, 5, 29, -47, -199, -93, -15, -51, -139, -89, 82, 129, 151, 9, 20, -57, 75, 22, -59, 111, 1, 113, -59, 22, 94, 204, -48, -24, -74, 91, -102, 21, -91, -52, 114, 103, 178, -48, -202, 59, -43, -44, -58, -112, -6, 84, -117, -49, 22, 70, 166, -162, -9, -12, 37, 12, 178, -38, 146, 92, -92, -68, 3, -60, -63]
5116f3O2J13o3k11L00j69j07J64M4q9l8M2K7O4j7j16k3L7n7Q1k3k3J35J90j92
5141F8r2j90J07K45j78K7n4K3J88j06R4j60k9p3P5J28p5K9p9L2M3l7o1J6R3m3
5167ipk9Q6r0%L06o9l60J97Nr3J1pj07N9O9O8j27PQ0o3J93j52q6L01k84J84j7
5195F6J52l55J34N0n9m3K4R9j72J65j40J16N8q9m7J20j07n1K3Q1l0Lj0P0l6O7
5221H9j01Rk12J82j6l1J36j23n3j8Q4J19R0k52J94j60Q2L2M0j48r6K13n8j06J58
5246E4n1P4q9O5j99R2J75j20j80N0J32m6J60o5n7M2q4J68j78P7j53J58k36K31
5270B0L6k28K19n8j56K15j30P5mk3K17k96K3J10K1n3Rj11J87j53j6m2J86q3J36
5295A01o5j64J80j44MJ5J21j45J0R8K4k8J4J7J4l0J2m3J61j23kl4o2j55K29k7
$$ y = [-63, -1, 112, 49, -162, 138, -31, -138, 26, 70, -19, -57, -15, 12, 76, 59, -57, -80, -43, -100, -19, -42, -65, 70, 260, 68, -24, -214, -107, 138, -40, -13, -67, -44, 144, 38, 132, -28, -57, -130, -55, 73, -2, 27, -52, -20, 23, -14, -75, -59, 34, -9, -16, -45, 41, -49, -49, 257, 188, -172, 25, 30, -63, -52, -59, -166, -107, -38, 30, -97, -90, -10, -73, 120, -32, -118, 183, -101, 83, 66, 218, -137, -3, 47, -12, -55, -31, 68, -104, 61, -79, 37, 95, 6, -41, 79, -28, -79, -56, 25, -5, -2, -12, 58, 22, 89, -12, -3, -215, -33, -49, -80, 56, -67, -120, -138, -54, 65, 155, -97, 97, -63, 19, 51, 91, -57, -153, 60, 2, -104, 54, 3, 77, -12, 53, -146, -54, 121, 1, -179, -129, 3, -43, 117, 52, -5, 37, -47, 121, -57, 20, -133, 25, -211, 20, 56, -172, 47, -11, -167, 48, -82, -7, -11, -34, 183, -113, -90, 20, 41, -12, -3, -114, 73, -80, -96, -138, 48, -35, 101, 36, -128, 52, -92, -88, -73, 48, -97, -87, 11, 35, 7, 21, 38, 52, 22, 34, -9, 152, 29, 27, -7, -69, -224, 5, -22]
5321b2P4j23J79rN4k31J93J5n2j3j33m5K09j28J3J68p3p6j76J9J89q2J9%L9J14
5347A22j34k08K13M4K8j34M7l3K2r5R8P7J06j24j21K49j90J30k47O3k1K26j34
5370a6J12j78L2K6m4J15M2r8l6l6J9J48j25n6J56j6k8l8q9J72l3o5j7J18j35o6
5396a36J39n6R4K6q2L5n4n4J44j3j13J73j90J73j47n8J73r9j5M1J49q9p3oJ20
5421H2j29M3j70K01l6N6n8M3n7J04m0q6LK0O8j8j2q2J72Kq1P0q6M9np2m2J20j5
5450D4p9L2j23J83j3P9k4j06j17J81L3jj06m2J54j71RJ64l8l8k21J71J91j19m2
5475Ak21K15K1l2K3j38L21k26o7R9N7n8R8k14J92o9J08k33R4K7O8o4j53J39j46
5500a58K76m5o6pp5N1J36Rj39O1q0j07J7J16q9K5P6K5r3j8K7J40K6K9j52L4j23
$$ y = [-22, 52, -71, 108, 99, 153, -78, 115, 130, 78, 65, -68, -113, 96, -32, -19, 149, 76, 0, -176, -157, 32, -50, -31, -31, 8, 122, -12, -220, -7, 37, 65, -69, -22, -55, -33, -128, -30, 47, 153, 29, -92, 157, -33, 97, -150, -87, -108, 118, -16, 96, -82, -50, -24, -68, 47, 89, -9, -45, -81, -62, 86, -39, -95, 61, 45, 17, -21, -110, 62, 29, -36, -53, 65, -70, -136, 3, -53, 41, 67, -15, 20, -34, -88, 56, 43, -70, 103, -87, 86, -61, -119, 54, -45, -60, -19, 130, 41, -32, -38, 82, -47, -4, -174, 27, -9, 47, -11, 32, -25, 79, 39, -47, -44, -24, 44, 26, 14, -68, 104, 106, 25, 95, 9, 58, 53, -19, -61, 59, 44, -35, -3, -126, 57, 44, 123, 99, -7, -124, 57, 90, 89, -17, -59, 95, -76, -67, 97, 59, 21, -200, -29, 162, 43, 1, -220, -5, 16, -16, 7, -131, 190, -36, -103, -4, 53, -5, 93, -121, 71, 2, 110, -123, -29, -2, 66, 2, -151, -12, -158, 118, 73, 7, 0, -75, -24, 112, 121, -18, 43, -37, -144, -127, -11, -100, -75, 1, 26, -67, -85, -58, 82, 108, 137, -15, 19, -104]
5527a04RJ5J73q6J17j61J30j10n3J93j98J08m8k8k2O1N5L4l0K5r8Q6N0j07o9J7
5553d1Q3k29J26K5l8k6J39o6N4mJm8K8J8p8M9j5J08O4k50L4n0J93M5j7k07O8j53
5581a87L29j99L6L1l5j39J27O6M9o0j46L73j86m3j04J74p4k8J20j46l5K09j37
5604eK3j20L7K52j51M1j4J4Jj16K1r0J50Q8p2l8n3j21J75k7L0O5o0o8nJ80q7j35
5632h5l4q5K99m6k4p4%J13J00j99P7M9pj80J70k89rK48L6j32J30j4l0l7q3J13
5658Gm7O4k2L5q3p3Q6L2R6j1n7O8j94O3M8p5K7J85j50k3j92J00J56k7R9p1Qn8
5686iO2Pp7Lj46J7P0L8o4l9J38Q9r0j93J73k6L7J15o3l4j52J33jJ08j4p8q4K89
5714B09j67k6n9J63j44J57j92Q0jLj6j5j34N1J80j69J42L9k03N1J43j19Q7K2q8
$$ y = [-104, -95, -80, 93, 7, 124, -37, 93, -17, -70, 123, -75, 33, -15, -43, -65, -4, 51, 85, 55, 80, -18, 68, 118, 11, -58, -41, 42, -187, -61, -36, -74, -100, 39, -27, 27, 23, 24, -24, 4, 22, -56, -7, -22, 86, 150, -100, -66, -116, 77, 122, 105, -102, -34, -187, 142, -57, -21, 10, -25, -164, -37, 29, 78, 18, -128, 245, 59, 16, -88, 86, 12, -16, 104, -42, -77, 132, -5, 18, -102, -65, 187, 36, 77, 63, 77, 78, -38, -17, -107, 43, 131, 59, 21, -32, -153, 22, -5, 25, 90, 30, -38, -43, 137, 50, -85, -119, -204, 95, 49, 25, -49, -49, 64, 164, -35, 42, 91, 84, -96, 74, -215, -224, 24, 60, -72, 58, 44, 14, -23, -106, 7, -40, 24, 2, 37, -46, -119, -33, -1, 95, 84, 27, 95, -99, -36, 12, -63, -36, 149, -1, -24, -216, -116, 40, 13, 112, 41, 49, -9, 53, 60, -17, -14, -160, -143, -73, -35, -99, -138, 0, 89, -1, -194, -21, -47, -10, 105, 42, 8, -144, -11, -12, 96, 82, 4, -80, 209, 42, 16, -43, 120, -24, 133, -59, 21, 20, 23, 7, -8, -142, -91, 89, -80, 62, 101, -102, -51, 92, -27, 60, 82, -6]
5739fn7r2J92j89K16j%k27J68JJ09r1j02q9J76op5J14lK1o9j36O8nj8J78j76P6
5767b3N3j29J53%r6K2p8rJ15J47j97l1J32k4j65R9n8j6K05j53Q4j6O6m0m5L2k02
5794a74J80j04K3mO6L6M0k2K4j05O3q1K9J01j86J10J5JJ0l1J57j83J32p6j78K60
5820A03l10K13l4q7q2M05j61j26j01K36K6q9Lq6K01r6o8p9J08J52M6j13L0j01
5844a0K8o9%J77k3k7j82M4J58j6n9j09J20k5o4P9lm5j6L9j32m4L7J57J2%j61K4
5872a10K7L2J30o9O2m5m5nJ13q8K6pmK2p3k1P4j61J38P6k0J43j33o9l2M3n4K06
5900A56k08K5j0l2l4l3Q0O3j29K24n2j07J95o3pr1O4L9l0J5j06j27J61j24qK28
5926H9j71o4J9J06L5r5mP3R1J14j90n2L8P7m0j57K43j53K8jL8j39j09K61j59O5
$$ y = [-6, -63, -155, 37, -152, 64, 63, 63, -164, 4, 5, 114, 23, -79, -168, 8, 2, -73, 41, 38, 59, -10, -146, -78, -83, -101, 77, -99, -23, 30, -99, 54, 54, -42, -20, -98, -107, 8, 155, -42, -73, 59, 35, -130, -31, -89, -105, 100, -53, 31, 15, 81, 41, -4, 28, -174, 6, -98, -75, -79, -13, 23, 63, 41, 65, -40, 23, -58, -29, 72, -114, -4, 11, 12, 22, -9, 148, -35, 97, 21, -157, 103, -207, 6, -28, -115, -197, 208, 47, -79, -180, 56, 82, -7, -4, -90, 111, 15, -53, -132, -24, 128, 174, 61, 91, -10, 18, -51, -51, 126, 103, 76, -106, -62, 96, 80, 21, -88, 32, 7, -57, 22, 19, -26, -42, -3, -135, -179, -142, 15, 27, 27, -134, -110, -83, -51, 79, 10, 72, 27, -18, -23, 90, 2, 28, 21, 17, 39, -34, -55, 19, -142, -4, 72, 52, 195, 62, -7, -39, 4, -50, 156, -52, -27, -37, -69, -103, -136, -56, 7, -122, 102, 50, -57, 138, 75, 68, -23, 41, 80, 50, 65, -41, -168, -7, -131, -139, 89, -82, -146, -127, -21, 14, -81, -85, -12, 79, 193, 3, -49, -11, 66, 26, -131, 112, -41, -13, -14, 24, -115, -224, 37, -122, -57]
5952e7j8K06p7k44J86q3M1%J29k07O4j3L2mJ1oj3R9l4mj2j63K40j51L9Q7j17K19
5980A50j16j30R6j7k3q3J5P1rQ7M6l7J23j00o1J92k70Q3ll0J03j14J26j08p9P1
6006a7j3J35k04mJ72q7k2L3MR8j07O7j43J53R5r4l4j21R4J02j45M9N7j15lk0o7
6033a37O1P0p0p7J56M6j03n1J12j12K50o9l0q1J5Q6Nj54R7J16k57J90j41J25n0
6058cR9k30N2N2N8k39O0J54q4LJ57j30q7J38l4J65K2k70K34j68J08p5l9K34k55
6083g8m3J35k6OJ84k52O3k2m6N5R5j01J4N8L8P6o9r7o9l8K69j21K8q5O2j91qK71
6111A08j01M8l2k4J10j70j78K49m0r3n8J59o5P5Q5j67J19K7L8n0k6o3J2O5L8k
6137F4o2K8r5l3L1J17j40P3J7p7J74o9j18O2J0O0m9rLk7K17p6k32K8O7N8J7N0
$$ y = [-57, -75, 131, 54, -190, -4, -87, -46, -46, 83, -124, -60, -73, -41, -45, -34, -40, -53, 46, 12, 8, -4, -167, 73, -78, -39, 48, -69, 150, 34, -96, 0, -17, -40, -123, -108, -37, -46, 41, 87, 50, 173, 73, 12, 204, -66, 17, 14, -16, 87, -27, 99, -9, -88, -17, -30, 105, -99, -103, 69, -18, -40, -7, -3, 95, -12, 55, -88, 65, 160, 66, 32, -89, 5, 107, -38, 11, 68, -47, -50, -70, -137, -76, -6, -76, -153, 3, 49, -54, -105, 7, -105, 145, 76, 46, -35, -20, 66, 71, -83, 14, 130, -127, 63, -78, 47, -3, 96, -134, -82, -30, 28, -211, -151, 3, -81, -78, 79, -51, -138, 0, -34, 131, 153, -117, 117, -51, 57, -18, -57, 177, -78, -121, 14, -12, -6, 178, -74, -11, -33, -79, -24, 71, -30, -16, 42, 80, 156, 87, -10, -79, -117, 152, 31, 59, -26, 36, -155, -163, 108, 7, 55, 23, -1, 109, -61, -239, 10, -30, -123, -181, -22, -87, -12, 73, -94, 25, 52, 90, 40, 14, -49, -37, 28, 66, 64, 2, 30, -65, -98, -67, 50, -90, -17, 0, -77, 97, 28, -90, -28, -18, 42, -7, -16, -13, -40, 177, 101, -131, -103, -36, 22, 39, 89]
6165H9j39l5M2R7P5mK1j16j35J80j25J4j6Q9p7l2L13l90Q4N1P3k03J59O8lL9m2
6192G7j08K43k05R4j42N3J34k07N3O1l7P0q8j65J95jj21R2J44k09p2J72o8n1J65
6217G9J0k32K71k50J82k82K43j3J01l8j2k07K48j94O3R0m9J01l07J35M0LO6k33
6241a85K2J21K2J5j4O6M1j63J77p0q8Q5N4k34J61K0Q8p1k8n3M6j05J87j25q2R1
6267b2N2j25J08K9j0N7j9M7l4q9L0J65n0j24K9j45J14L8j11J01o7J16r6J29m6
6292G7J1j06Kp2R9j30K68j34p1j09R9L8N5MJ27N4j86J7l2k21K33KO8m0nl8j6L9
6320C3r1L8r4RK8P7J54k49J64K0Q2j30j82J31pJ35k26J34j08r9P6J03j39K57j46
6345c0RQ6k03Q4R8j60L0L8j3j45J89%p6P4L9k8o0R9k34L81P5j91j38rJ03n5j13
$$ y = [89, -50, -85, -43, 54, 129, 125, 146, 30, -105, 75, -50, -36, -52, 37, -40, -72, 241, -149, -65, -14, 59, -144, 15, 83, 80, 119, 77, -31, 212, 7, 101, -41, 12, 146, -61, -8, 53, 16, 86, -2, -167, 28, 27, -94, -2, 142, -67, -139, 33, -35, -86, 79, 89, -143, 128, -122, 60, -222, 21, 8, 109, 71, 59, -148, 100, -94, -31, 59, 10, 111, -196, -61, -21, -18, 48, -185, -163, -42, -20, -5, -19, 47, 88, -75, 102, 32, -56, 29, 83, -151, 10, 30, 118, 47, 19, -34, 12, -93, 94, -31, -113, -22, 30, -95, 13, 42, 32, 89, 70, 117, 83, -6, 24, 189, 139, 15, 44, -101, 13, 51, -60, 41, -26, 90, -6, 123, 77, 88, -18, -16, -88, 11, -119, 149, 15, -56, -165, -66, -28, 27, 31, 158, 212, 26, 43, 11, -210, 23, 25, 93, 53, 48, 10, -6, 33, -58, -20, -114, -105, -77, 0, 154, -95, 69, 89, 171, 41, -141, -10, -17, 118, -108, 26, -82, -181, -105, -2, -141, 116, -30, -21, 65, -138, -54, 44, -116, -86, -48, -61, -206, -17, -17, -93, -19, 20, -8, -68, 31, -203, 178, 253, 62, -76, -85, 18, -37, -150]
6372a50R1LJ12p5M1J9j65K41j6l07K75r3pL9J3j92K42L3j71N6N1L5j02j5K49l80
6398a73L0J83m4R2k19J48p8J02O4j98K7O7j6o6L2M2qN0o8j10Q6L9j61L18k49K61
6424A51k65J43m9k9lR6P9j71p8O2R7j65J41L5j25L1K61k46j1K05j57rm6n6K6K1
6450f2k5o9P6J90j74P3j06P5KJ19j71J02q5J44p9J7N9N0j96j01J8J85j15J7p9
6475a35M5J41j47rO5J29p9k4J25j25J62l9j00p3L4q5J33Qk7J46j07J8r7J08l9
6500B8j69R4J36rj04J08p5q8L3K6P0J8j12J8O2K7j4J08j59O1j51J19j22K1L5J23
6526H4j74K9j6q6J64l5K32k39J76M3l00j2Q3J22j32LK73k41rnR5N1k87K66k29
6551a44J12L7j2Q6o6P7lj69J31R1m0k02J48l9j23O1m1JJ73l9j46J44k3L7qk9j91
$$ y = [-150, -59, -56, 56, -19, 22, 41, -124, 117, 101, -206, 69, -24, -31, 8, 21, -171, 71, 104, -67, -11, 40, 75, -27, -42, 207, -173, -143, 40, -4, 88, -131, 17, -61, 41, 105, -93, -66, 1, -15, -81, -49, -7, -15, 35, -33, -143, -57, -18, -179, 139, -110, 151, -114, 29, -20, -49, -52, 44, 123, -48, -126, -64, 33, -132, 9, 44, -81, -50, 211, -35, -46, 159, 2, -7, -53, -109, -83, -62, -87, -156, -80, 110, -64, 9, -97, -22, -20, 99, -72, 30, -55, 89, 10, 27, 86, 136, -60, -161, -143, 42, -73, -56, -135, -90, 51, -96, -105, -40, 89, 10, -14, 111, -14, 148, 109, 9, -64, -30, -115, 18, 26, -1, 145, 38, 56, -41, 67, 28, -141, -47, 89, 80, -24, 84, 9, -79, -46, -20, 50, 68, -44, -26, 36, 63, 49, 157, -2, 59, -92, 27, -95, -74, -39, 84, -90, -61, -77, -163, 1, -34, 198, -41, 135, 178, -122, -134, -51, 71, -61, -58, 215, -26, -35, -40, 55, 106, -181, 85, -144, -32, 5, -7, 79, 13, 90, 87, -82, 49, 140, 100, -102, 46, 7, -116, -55, -96, -95, 78, 39, -107, 37, 14, 51, 43, 14, -177]
6578a77J37J40o4p3J39m1j47P6J82j05j05qK16k27K04j70j7J24j88J2mJ36J5m8
6602Gj39O3O7j26J44Mj39J22P4n2l4J32j56K4JR0j41m8j3J01K6p3J58j19J58j73
6628d2L0J68j82rJ23k06J78n3j1o6k4R8O5J8RQ3j37M0k26O4L0l0J11Q8r0l9m3
6655e3K6j21J11Mr4J88L5l0o8Q2m6n6L5r5k1K57j33np1J30m0R3m7qj57O6j7K5
6683a0J96k79J6J23j48m5K65n8p3Q4j70J37k5M7j68p4J28LL1l7Q2j21J6mJ26J9
6709F1Qr9k03L25p4mk0J2j99K70r9p3J46p0N8jq6O4M1q0J7k03K04k2mM0j9p6K94
6738B08k72J94q5r8K33k01M7j3L1m2J79k33M3OJ03n9j2K4j13L6Rn8J06j27P3K34
6764B13j47J8L5l5k17O0P4P8p2J42l10J55J9N1o1J58k58J29q8K50j72j17oJ68
$$ y = [-177, -40, 100, 36, -37, 102, 61, -86, -10, 172, 67, -38, -46, 170, -57, 147, -23, -40, 84, -104, -92, -96, 40, 55, 7, -132, -69, -2, -128, 16, 20, -119, 3, 77, 25, -9, 123, -33, -9, -8, 82, -59, -107, -120, -19, 7, -66, 92, -27, 131, -42, -12, 156, -26, -35, 88, -118, 60, 7, -4, -70, -94, 4, 69, 87, 96, 179, 42, 82, -144, -80, -50, -80, 31, 119, 29, -10, -53, -27, -148, -37, -33, -127, 61, 96, 66, -2, 80, 34, -22, 13, -82, -103, 154, 21, 16, -55, 75, 35, 128, 81, 73, -84, -18, -35, -10, 186, -93, -77, 46, -102, -147, 118, 60, -13, 71, -99, 38, 13, 60, -108, -182, -54, -51, -20, -57, 25, -96, -80, -84, 42, 61, 69, -30, -233, 92, 18, 14, -6, 6, -193, 77, -22, -95, 51, -19, 39, 38, -48, 16, 57, -23, -6, -209, -5, -27, -31, 9, -10, -86, 208, -64, 130, 45, -53, 180, -21, 26, 13, 44, 2, 181, -52, -9, -3, 100, 41, 29, 53, -60, -24, -15, -73, 33, -94, -21, 213, 66, 84, 119, 84, -133, -73, 1, 79, 7, 149, -161, -6, 13, 64, 3, 161, -97, 32, -56, 194, 22, -95, -101, 67]
6788F7Mj2n7J71j01j66J68k2Ok19K63j33J55k03K50q8k6l0P7k51M7J46j58M5J04
6813C7O0L4k83J67J6j75J84j82R0j21N3Q5J98q5q4J00m5j30O5m0J44p4o9M1M9
6838C5l1L6oj97J60n4P3K3k0J12p1j4O0j09j53K60j82N0P3r4n8Q1k2n8J31j61
6864a36J56Mo1R8Nj91J47j09J45j62J74j84J66n5Q3j02J28k1o2j55K96j26lJ11
6888A46j98q7L5N7J20QM5j7P2k63J56P6l7j45P7k9k23P5J86K7j67r0J31n7n5K98
6914A41o0j0r1m4j1n3J32m4R8N8j92J59j60P0p5L8N4OjQJ59k53lL9o3K57l21j0
6942a72K28QK6k33J56j08J12p0M6M9j06K4j3MP6J8k2j59L1Q8j25L5J92j2j09N7
6968B1o7J10l0j7pJ07n2J63j32j84l0J97l3r9M7L0q6K7J3k1J1j3Q9j53Q2m3k3
$$ y = [67, 71, 59, 2, 173, 72, -94, 74, 52, 58, -161, 102, -31, 124, -79, 171, 83, 57, 27, 104, -147, -100, 46, -112, -67, 37, 97, 131, -152, 15, 31, -144, 40, -142, -52, -173, -120, -35, 163, 78, -6, 94, 49, -81, -16, -56, 88, 14, -55, -14, 35, 4, 40, 34, -163, -3, -57, 16, 39, 19, 131, 60, 46, 106, -3, -156, 104, -78, -28, 45, -49, -107, -26, -48, -106, 25, -136, 20, 24, -37, 61, 66, -125, 22, -87, 58, -104, 70, -114, 52, -3, 80, -22, 106, 85, 23, -132, 164, 38, 35, 146, -52, -139, -104, -47, 73, 81, 126, 109, 181, -82, 74, 150, 113, -32, 45, 16, -207, -132, 54, 81, -86, -176, -45, -102, -157, 141, 81, 71, -20, -64, -75, -128, 4, -40, 58, 116, -76, 83, -77, -7, -82, -44, 10, 16, 15, 23, 182, -71, -74, -35, -98, 159, -162, -172, 56, 64, 90, -143, 13, -95, 17, -53, -7, 42, -64, -40, -53, -49, 27, 45, 23, -136, -105, -17, -142, -107, 85, 73, -36, 21, -46, 64, 34, 17, 10, 117, 65, 228, 96, -88, -118, 79, 46, -53, -6, 24, -62, -35, -22, -43, -32, -45, 44, -109, -27, -70, -93]
6995i3J11r5R1K3M5k35R3O3J78J0k37N3q0O4Q4j21J48J12Jj38j39m5J97r7r3J74
7021G4p9J25j72q6Q3L84m04J03n8N0m7j05K12j21j09J07J40j09j20J55q8K0r0
7044a35J34J20o4j82J90q4OJ0o5M2o4J64r0o6KJ9L6P4r2Q5J9j21N2R2j72R0M7
7071D7j44J60n0k9Kj1R6p5p3J2J54o5r9p2J10j3q5L32k24J0N9Q0j55o5oJ43n3
7098a4J51k18K03p6J3L7l0l1j6J9o4oQ5j45K41p2j34k4J61q4j00Q4j30J75k50
7123b25J75q3%K79q2j38J49J2j25P0p0J08O8j06K8Okj30o2q2K80l0J53j41j67
7148a15K31j72R6k7j42K63j41M3K2m9r7mJ14k2%J27l80K15J18n8m3j7J17j22J01
7173E8o9J01k07M8J37m6p0r2O1J86j36Q7k94K89l0J11j16q0j07J37o2J76j87o2
$$ y = [-93, 18, -77, 14, 37, 82, -153, -60, 3, 181, 191, -46, 7, -73, -9, 75, -46, 102, 214, 215, 77, -62, -107, 90, -7, -100, 74, -5, 120, -52, -138, -55, 329, -75, 28, -30, 20, -27, -132, 80, -41, -150, -43, 97, -12, -132, 23, -65, -45, -135, -1, 119, 55, -127, 63, -21, -15, -5, -70, -28, -92, 72, -18, -84, -82, -63, -27, 47, -45, 40, 59, -62, -10, 82, -90, 0, 47, -97, 63, 13, -16, -14, -25, 71, -4, -77, -65, 89, 24, -75, -147, -37, -50, -135, 197, -27, -17, 42, 122, -33, -98, -104, 39, -14, 137, -81, 122, 46, 59, 96, 66, 35, 19, 38, -26, -32, 53, -92, 149, 77, -57, -81, 80, -4, -104, -20, -150, 25, -225, -50, -133, -133, 146, 64, -74, 75, 87, -38, 32, -38, 70, 138, 32, 60, 66, 64, -66, -128, -210, 70, 40, 193, 52, -115, 116, -56, 40, 13, -129, 134, -7, 36, 58, 9, -88, -92, 22, 0, 0, 127, -253, -38, 80, 22, -21, -38, 79, -43, 58, -11, 90, -117, -69, 68, 22, -48, -140, -79, 107, -29, 58, -236, 53, 23, 134, 18, -62, -169, -32, -94, 82, -105, -167]
7197a67L74k00j60K64j08L2k16J57J64j44k3P5O7r2K5j08J51j08K06l04J06r9
7219a08N8J72K1k49J20J5j1N9j25J16L0o0m8j06R7J6M0j06J74j07p6q4J12O4l7
7244b3L02l29J1J8p6P5j03o9K61j84%K05O9j87n8K8l5N4P0j48K16k70J40k4N8
7269ARL6n4k0K3KL9j81J96M4Kr2j89J18L6l7m0J90j04j6J29j07NQ5o0P7j74JJ56
7298G5M1j01r7K11j53P2O6j09J5l7O0j38J88k9P1j96m2K1%K2R0J69k28M2R3j1
7324I5j9m3n1J19m5o2j25N8Mj15P9M5M4o8R9Qj50J28J7Mo1n8J40j44O0Q3n9P4
7352E7q2o%Qm1O5knR6j15o0m9J93m7j28j9K27o2r3L0J2k8J0j6j21L48k21K3R7
7381G1K4j58M6N4j24P4j1J24r5j0p9J65j74R3J1k0Q7J08j59J02j56L4k13K15r
$$ y = [-167, 207, 7, -153, 111, 3, 35, -181, -24, 140, -4, -27, 48, 115, 23, 48, -60, 91, -17, 189, -115, -9, -108, -50, 122, 143, -106, 14, 29, 18, 77, -48, 68, 98, 38, -10, -116, -19, -3, 37, -69, 105, -2, -78, -162, -50, 14, -23, 279, -50, -39, -21, -97, -22, -125, -194, 67, -117, -117, 88, 157, -30, -88, -60, -95, -41, 29, -119, 97, -173, -33, -57, 1, 10, 46, -8, -28, -5, -3, 36, -145, 51, 95, 97, 5, -184, -66, -30, -67, -107, 83, -21, -37, 92, -15, -10, 75, 15, 92, -82, -81, 75, 116, 15, -82, 129, -24, 48, 114, 5, 20, -17, 43, -95, 93, 64, 135, -61, -103, -82, -82, -60, 30, 199, -29, 13, 106, 95, 76, 33, -18, 101, 56, -6, -131, -73, -69, -184, -105, -60, -16, -84, 15, 23, -127, 1, 18, 22, -39, -97, 43, -101, -41, 42, -17, 57, -25, -31, -31, -23, -64, 1, -1, -6, 90, -25, -85, -134, 59, 12, -116, -135, 92, 30, -63, -33, -21, -49, -39, -55, -176, 172, -49, -26, 71, 95, -63, -17, 37, -87, -13, -24, 100, 5, -5, -84, 81, -93, 0, 11, -9, 78, 186, 27, 129, -27, 7, -206, 9, 0]
7406@J2L1n1J6JO2j84J07K6L7j57l1qQ4p1J83k1q6J6O9q8j97K73j77K75r8K7L1
7434H1j67K06k03J86k60J91p4P2j22K8J14j36N4M3J61j05n5n7K7L2J72k62q0J24
7458c0L2J6J17j12m7n7K25j84j36J69j32nL1J6J57O0j52N1J17k39P1M6m6oK5n
7484a8Lp5J26kJ41j00p9K00j99q8M2P4l9J49k43J01K9j36J34P3K0L5o0n6o1J47
7510A18j34j60K64j22J1Rj6oJ6k2Q5j55J35n0R4q8J1n4O2n6P5J1j55R0q8J67O1
7537A03q5Lq6R7j05J81o5p8nj27K21j29R7ol9M8N2l8n5l9J30k73J20K08j88l8
7563i6N0J1K36k39l7Q9Q5k8k64J85J50j50j2J52k22L33k95J39j76KJ98j22J49
7586A38qj47N1o8J27j36k4J20M1L4k89P3M3l8O6J39k35L9P8m7RJ08P6k29j01J29
$$ y = [0, 12, 43, -8, 8, 9, 71, -113, -6, 20, 57, -100, -131, -139, -55, -126, 57, 36, -50, -34, 35, -53, -250, 23, -154, 121, 23, 50, 81, -86, 120, -83, 103, -157, 34, -40, 32, -90, -62, 52, -84, -30, 13, 174, 69, 14, -43, -16, 16, 188, -74, -154, -30, 2, 18, 135, 23, -24, -81, 144, -40, -176, -7, -139, -144, -113, -97, 60, 120, -32, 19, 136, -103, -32, 14, -32, -38, -13, -18, -15, -90, 36, 34, 175, 75, -4, 196, -3, -91, -49, 25, -14, 135, -108, -7, 22, -114, 20, 93, 113, 148, 88, 32, -29, 118, -16, -176, 88, -34, -23, -14, -30, -36, -20, -42, 43, -112, 23, -27, 67, -21, -10, -64, -2, -58, 17, 28, -127, -37, -125, 42, 103, 18, 21, -65, 32, -73, 108, 43, -35, -40, -167, 54, -75, 22, 16, -23, 25, 77, 39, -16, -55, 75, -198, -78, 130, -58, -96, -46, -35, 201, -38, -75, 14, 99, 71, -193, -8, 142, -8, -20, 132, -90, 243, -52, 87, -89, -87, 111, -11, 138, 130, -17, 34, -34, 93, -43, -67, 53, 94, 128, -161, -88, -45, -83, -17, 122, -113, -74, 4, -43, -34, 74, 150, -79, -180, -51]
7612e1m4O2L3L2N7j33K1J6k3N0P8k25J56j79J88n3O7j43r6J48l5J00P0p6L5n9
7638dp0k0J9R9K9k06J83o3J51r8j33P0J04n9P2k29J73j4Q8j00P7p4k20L74k73
7663a24K11j23J04l4m6j01J43p9K31j32j9R4j02PO0l7M5j04J14k15J94j7j86N1
7687f5J10j60J00Ol6J52q6q6K8J08r1K0N2k0l4N0K7r9J77r9k62J89N5o9J26L9
7713A32M7j70j49J24mJ08k5K1p5J1o5M8rj8K24k97J22L1k6r5J05j71J58N1n3r1
7739f6J99l0q7j2M2m5q7J21M4p7N3J31l09K33j63l0M3q1M2NJ54m7L2j8N7j54Q2
7766C2L1k39J35l7K20J9j49N1k50L56k63J01j26k1L8J42l4K6j51J25J30j62m3
7789f9j05K38j8k0lJ8q1l8K05j21kp1J54j07J17k1j44R4l2k3P5p4O9p0p1J86R0
$$ y = [-51, -95, -33, 0, 32, 89, -44, -23, -7, -30, 20, 98, -127, 29, -150, 38, -15, 52, -91, -187, -39, -74, 26, 96, 20, 55, -4, -74, -94, -75, 24, 53, -153, 30, -33, 118, 20, -113, -43, 61, 2, 74, -155, 18, 4, 92, -8, 69, -5, -225, 149, -124, 87, -36, 68, 34, -12, -113, 30, -49, 182, 50, 31, 125, 23, 30, 90, 53, 98, -6, 108, -107, 87, 70, -116, -65, 45, -115, -15, -9, -45, 107, 21, -65, -37, 71, -20, 0, 52, 32, -2, 48, 75, -24, 153, 54, -208, -19, 36, -33, 93, 132, 179, 9, -140, -16, -20, 88, 63, 84, 9, 20, -45, 3, -6, -24, 200, -97, 25, 56, 30, -65, 40, -131, 27, 78, 25, -66, 133, 103, 16, 4, 46, 1, -86, 35, 79, 2, 55, 186, -123, 110, -53, -83, -40, -121, -79, -74, 80, 33, 65, 47, 104, -50, 32, 63, -176, -41, -78, 142, 161, 12, 63, -187, 169, -94, 7, -119, -140, -102, 40, 6, 32, -119, 6, 136, -26, -69, -174, 64, 46, 26, 23, 41, -40, -78, 127, 6, 4, -67, 87, -20, 97, 76, -68, 26, -6, -29, 46, -28, 41, -29, -100, 86, 176]
7816A76k29k4pn2K36n7Oq0j0N7j20J55OR4j74Q2J41k13R0j6j46J02mk0P2P4r7
7843D2j77J63j1pl1k0N2l3m5O9j0p1M8n3pK62k80L18j20j10n9J24QJ2M2o2m9%
7871eK4l4j49RL36k30j11J40K2J09k50J85m5m1J71o7Q9j83k33K43J59j05L6j84
7895a14K04k31J68n7N0j46R4j7jM6Ol9J52j18K14k84Q1j58J25P0o4qk0J29k1n4
7921GM7r5nM4K19l20j16K90q1j3J77k00J29j32J64m2o9n9L2j23O3R0J44k31K7
7946e3K6o5L8J41j13J00k15K21l3p4J37j61M3k1PO4k3n2O3n3J05j19O9P6m4k9
7972C5j13k4J24O0pj24K7N1m8jL7lm4M9q6K02j69J64l9l9j4j34J04j02Q1K22k31
7999b2J50j89J21o8M9m6o9J72O4j32O1j03J9k8J44j65pmn8K40k88Q7Q2J3j03J99
$$ y = [176, -53, -77, -84, -136, 100, 43, 49, -31, -41, 16, -104, 51, 57, 151, -23, 59, 200, -13, 77, 61, -85, 17, 13, -7, 65, 139, 42, -135, 28, 17, 10, -21, -41, 11, -22, -67, 2, -8, -79, -31, -84, -91, 171, -109, 209, 89, -21, -80, 44, 52, 64, 106, 44, -5, -5, 19, -15, -164, -155, 181, -49, -160, -20, 2, 111, -139, 46, 1, -40, 131, 64, 153, -30, -263, -20, 139, 34, 70, -114, 90, -141, 27, -30, 20, -126, -32, -49, -50, -4, 2, -37, 115, -3, 211, -73, 8, -150, -25, 45, -19, -27, -47, 82, 61, 7, 54, -41, -46, -2, 217, -103, -219, 71, -10, -23, 154, -46, 83, -49, 115, 73, 4, -55, -23, -146, -83, 7, 151, -80, -53, -27, -92, -54, 87, -26, 74, -141, 80, 47, -27, 110, -51, -8, -29, -22, 42, 19, -33, 30, -23, 82, -37, 32, 108, 64, 35, -78, -102, 22, 82, 75, -49, -22, 29, -19, -20, 17, 14, -30, 19, -67, 135, -34, 130, 91, 52, 38, -96, 8, -94, -13, 209, -22, 128, -61, 60, -8, 41, -5, -74, 98, 162, 30, 91, -12, 7, -21, 123, -42, -49, -53, -111, 129, -159, -72, 10, 23, -80, 119]
8025A19k91O1Q6R8J7j27Q5o4K9J65q8k03J92j19N8n7K2N1n9M2J5p9N4K3m7J9j32
8052a30M9J62j15m3L6J46j96J67k8n5L1K2j70M7p0K36m1j03oK2P3p3m6N2L2n9
8078f0J39J30k45J06j71K7R3M2L5q2j18K0N0n2o8R4K08l35K21P8o1j2L8j10L1
8103bJ1P0r3m3J21n4l1L7m4K9O5j8j03o8K5M8J36k19M6l2J84P0o8j47Q9oj90L34
8131A47j32L8j5K9k6j89M7J43j32KJ83j96J7J84r9j9o4K09l9j95MK72n6j06M9
8156E6O4j92L7O5l7O2J10l19J82m0N5k04Q1L0K55k23K3j94K00J9k1L3L1j33J13
8181E3j9m8K27j49k1J4n8O0m9K3
$$ y = [119, -172, -111, -25, 73, 90, -37, 48, -16, 13, 178, 90, -113, 79, -40, 18, -39, -17, 34, -25, 17, 32, -47, 7, 30, -17, 2, -130, -81, 81, -34, -77, -41, 105, -91, 76, 48, -7, 24, 46, -124, -77, -147, 89, 48, -55, -61, -39, 34, -39, -85, -33, -1, -60, 79, 209, -36, 70, -101, -74, 19, 61, 96, 14, -104, -84, -34, -86, -154, -60, 148, -187, 34, 112, 51, 39, 77, -33, -2, 9, 79, -14, -57, 64, 10, -21, 16, -28, 1, 66, 48, -55, -123, -98, -50, 86, -133, -87, -119, 65, 135, 67, -80, 9, 3, -187, 147, 15, 53, 38, 67, 41, -148, -101, 42, -90, -88, 95, -101, -84, 100, 1, -18, -82, 127, 88, -107, -103, 169, 113, 7, 56, 120, -72, -35, 30, -7, 55, 165, -154, 28, -12, 43, -161, -80, -50, 205, -18, 5, -189, 11, 30, 9, 42, 73, -60, 53, 34, -14, 213, 64, 43, 57, -1, 59, 10, 33]
8191C3
$$ Imaginary data points
##PAGE= N=2
##DATA TABLE= (X++(I..I)), XYDATA
0@%%%%%%%%%%%qJ6j6J6j6K4l2L4m2N6o4P2q8J04j20J37j59J83k09K41k75L11l49
34a84L92m42M96n56O21o91P68q50R40j044J154j273J406j547J703j876K069k281
52a195K514k775L069l402L780m220M733n342O080o993Q162r704J1839j4997K0116
67A1665k9711N3317k07806k44710O47566j20514l69566M24676R4244n07450J51863
78i6426K83036k93314j224L41477j74354k46489J79863Q7318j40558M7591J21881
89A08801p5332j29202M8185Q0571o3842J4492J53914j01237j94993J48476R0002
100G9835j89874J01860K01225k17401j07743J96828q7285r2762K45485k3540k30987
111a24359J32949O8091k03639R3373J80824j44731n6939R0793q5627j0031J36645
$$ y = [0, 0, 0, 0, 0, 0, 0, 0, 0, 0, 0, 0, -8, 8, -8, 8, -8, 16, -16, 18, -24, 32, -32, 40, -48, 56, -64, 73, -86, 97, -112, 129, -146, 165, -184, 208, -234, 262, -294, 327, -364, 404, -446, 494, -550, 604, -669, 737, -810, 893, -983, 1086, -1195, 1319, -1456, 1613, -1789, 1991, -2229, 2504, -2838, 3242, -3751, 4411, -5293, 6546, -8451, 11665, -18046, 35271, -172535, -417245, 230321, 109807, -259759, 164917, 259161, -248289, -96426, 186610, -106704, -107928, 233549, 59195, -187294, -7431, 79887, -60671, -13080, 108801, 33469, -95733, -47548, 33023, -30819, -16327, 137587, 36350, -158643, -10167, 79835, -110039, -8179, 193046, -24355, -132098, 64730, -22555, -115317, 130168, 106628, -124359, 8590, 76681, -126958, -33585, 147239, 2508, -54431, 36362, -49265, -59296, 77349]
122G7349m3003o9655N6557l1166l8942N3956j1928J5196P1650r0308p4618J03252
134A8340o924o6290J03947J7854j15074L6467L6890q3295M9944Q5028p8345k8653
146c0111N4599m0368j8666N6897l624j2737P077m1495J11M4630j2130Q071J6064
159B8318o1297N856N7764o1120O97J11281o5706r5002J03642O477r8879R1328
171B3359M4187j28732N0751R4293j34396j9073J49935n6963q8705J00909m740
182C0825r6849P2310N1177q7874Q106O4053n0682l7240N8566K3337m4357j5299
194b3927L8504J727n3563J9824O5766m5016m2107O8641j8220p0410Q3972L4286
206E9477j17979L5101J02236j01326m2288J24727l5139r0440R2071J7494j03675
$$ y = [77349, 34346, -35309, 21248, -9918, -48860, 5096, -6832, 8364, 80014, -10294, -84912, 18340, 11416, -54874, 49073, 66927, -48147, -11680, 25210, -58085, -8141, 76887, -1458, -30111, 24488, -15880, -34546, 22351, 18727, 5990, 13067, -28428, -28317, 16313, 4183, 12254, 28318, -32979, -27123, 30641, -30479, -29782, 81499, 15793, -79209, 24433, 30910, -67969, 23359, 67546, -61186, -10435, 83858, -50538, -69611, 80324, 23361, -65344, 35565, 30825, -66024, 6286, 57463, -30411, -22305, 41748, -8934, -46174, 12392, 35729, -8628, -23927, 14577, 16304, -37259, -17435, 48331, 3315, -38792, 29849, 11629, -58781, 25191, 59477, -58502, -23401, 78835, -22491, -64779, 59948, 24809, -65631, 26440, 43934, -59741]
217e9741N5575O7848r8392j1271J00623l4862p3369N0020L5997m1668l933K9075
229A5902j5356k4224K7315K2196m0548q050N6828k0950o2120N7549M1368q2907
241c2997N907P9658n7469m2209Q4855j7249p1946P1365K3342r6006L5097Q0731
253F3079p5361l8668P9749q169n2609L8478J2229m4769K1805L3850l8866j8365
265b7617M4310O102m4367K654M5972j1194m2026K2140K5790l2860N765L4709m2084
278a2706k0212O7172j1029o9955M4174M7212o3696r395N9157k6905l3705M4325
290A4437j855m0513L1712K2604m3785l20M0842j7229l0462K5493K1044k4740j1727
303a4499K0760J973j4405J1419L287k7219J1558L8431k7837l6407M1004J9410
$$ y = [-59741, -4166, 63682, -34710, -45981, 54642, 19780, -53589, -3569, 32428, -9240, -13173, 15902, 546, -23678, 3637, 25833, -14715, -22765, 34063, 13113, -49007, 8542, 49910, -32997, -27090, 52568, -4901, -47110, 37745, 20496, -51450, 19915, 43257, -52749, -17652, 63079, -12282, -50950, 28799, 20630, -31979, 6499, 18728, -26041, -4236, 29614, -9252, -27617, 16693, 22795, -21572, -18918, 27054, 15860, -26166, -4026, 21764, -11096, -5331, 29378, -12706, -32918, 34254, 23225, -46730, -2556, 44656, -19040, -28435, 30722, 3817, -29888, 14437, 12582, -27931, 3781, 26385, -17400, -17720, 23122, 5893, -24569, 924, 21968, -2772, -14499, 6261, 8234, -6171, 5248, 8535, -18684, -7126, 31305, 3468, -32939, 8065, 27475]
315B7475m6961L331L8511k3441j6576L1508j0856k5332L4959P552m8907J2638
327a6099M8436k6799l2812L4219J0833l3448J1154K4149k8065p476L7974j0916
339A1150l7522K8841K6313m3358q610M6258j1530l6548K9570J7506l8516L498
351a2948L1059k3874j1358L8006j2604m0319L4462L0461m7283j2113M6168r518
363A0139l0864K9807Q612l9442J6584L4140l8515j5851N0412q236m7403K9944
375f73K9985m0897n389L5229j9548j7905L6023m270l8120K3299K6043l5676q240
388b0139L7926q156l0576K1198J8458k7262m444K7247j0593k1616K3835J1258
400A7136k9424O598K8821k7822k2235M0938Q133l9779J0218K5061k4013k477K5668
$$ y = [27475, -19486, -16155, 22356, -1085, -17661, 13847, 2991, -22341, 12618, 20170, -28737, -16099, 32337, 5538, -27274, 6945, 17778, -15670, -4516, 19633, -8432, -15908, 22066, 11150, -26372, 2469, 28782, -14576, -23186, 23072, 11542, -25006, 4564, 22070, -16446, -12948, 18111, -5763, -17121, 20885, 8281, -32038, 2424, 32885, -14398, -26511, 19657, 10139, -20725, 9082, 17694, -21748, -5164, 28976, -9539, -25390, 25022, 16786, -30617, -673, 29312, -11585, -16974, 18255, -1293, -19198, 16825, 12555, -25565, -2266, 23777, -11899, -20139, 17787, 9631, -20945, 253, 18711, -8551, -12995, 14252, 3659, -17957, 5878, 17136, -12288, -5690, 23131, -4691, -26926, 14012, 22145, -17634, -7416, 17645, -6368, -8845, 16823]
413A6823k2081j6457L6591N81l6485J5225K5125k4200r889K3094k025j6039Q320
426a417Q452j0106l43J2732n657j7565J0597J9934j6725j3297K4822L90k9410
439a7593J2431K1691k1387k366K2644j9512j3492L0488m954k7763K3976J5845
451B0008l5241k184L1513o781j6514J1127M06j0335Q766P010j2846k778J8766
464A0917M199k5815p346K7515K682k1407J1914J1083k5651K741K3475k0648m872
477a1213L6095j9250l9126L6193K1790m1527O714L6046k9097k0934L3229j166
489G754k2581K3981J0525l5307k045L1689o297k1603J7333J7686k6205j4865K5773
502E838L499j9386J7748R088l5052P221L5396l3227j9962N7914k678o1823K3588
$$ y = [16823, -5258, -21715, 14876, 15457, -21028, -5803, 19322, -4878, -14767, 8327, 6302, -9737, -1417, 7035, -3071, -3414, 9318, 3661, -13904, -3307, 16627, -98, -13395, 11427, 11817, -17593, -5162, 16529, -4858, -7224, 15420, -4092, -17584, 12904, 7950, -19813, 4163, 20008, -15233, -17417, 14096, 7315, -9199, 1928, 2334, -8001, 765, 7775, -5071, -7849, 10917, 15116, -10699, -18045, 9470, 12152, -9255, 2659, 13742, -11909, -9168, 14307, -6341, -11213, 24882, 5632, -33494, 2699, 24489, -17038, -10324, 25722, -3375, -24309, 8920, 7754, -14827, 9154, 19679, -15628, -17673, 14016, 7719, -13884, 3449, 21135, -5070, -19935, 5838, 9337, -10049, 7699, 16787, -18265, -11044, 24352, -8875, -28837, 29077, 26399, -35424, -11836]
515a1836L5203l9323Q176M3204m2579k6545N4393q905m6926M4024K9638n4750
527a6226n596L9945k1098j6238L9282k156l7243J6177J9399l1489j379M2893r111
540A7160m1106J7658K4722l1480m378M0801j2589l2055K6909M918l8551K4250
552c741L7962l9792j6020L9999j6397l1158L7518J4430l0979J0434P394l3208
564b3558J3853L7581k3447j9848K5549m384k2705J4388J2057j0158M386L639j6468
577i115l250J4652M099n731J37K092n745p170O495J0780k802m130K543o573m319
592h037R714K096m032Q202j707j6194J382J2253J268n61j413n944J649j674o044
607i042J3575J0151j8250m743J1464j0020j82K1456j1272j8492K2693L229k8840
$$ y = [-11836, 23367, -15956, -7780, 35424, -7155, -33700, 20693, 11788, -35138, 8886, 38524, -16226, -21822, 18123, -2975, -19213, 20069, 17913, -19330, -3153, 16246, -15243, -16622, 26271, 17160, -23946, -6288, 18434, -13046, -17424, 23377, 10788, -21267, 5642, 10560, -27991, -3741, 34221, -5571, -21591, 18408, 2011, -29147, 8371, 22801, -8178, 2256, 9650, -23558, -9705, 27876, 4429, -15419, 10130, 5746, -16959, -2571, 9486, -672, 3714, 7353, -9115, -12365, 2287, 6386, 655, 792, 2884, -2861, -10031, -3536, 7244, 4442, 312, 2855, -3718, -8037, 1677, 3773, -259, 7943, 6236, -9958, -8576, 3677, 4945, 4384, 2971, -2973, -1324, -2998, -9042, 4533, 14684, -3566, -8309, 3155, -6865, -7047, 14409, 3137, -15355, 7338, 10567, -18273]
620a8273J2093K4039j9134n723J8294j5083j1774K6414K81k2947J4812J1301k6844
633a2544J81K7848r909j8358J8887N133k4961M801K0955j2664p650K0637q376
646C980k5752K0624K1101k7166n702K8562j2478k2348K4888P328k6497J4539J8137
659A9216l2268k862L7624j4711l0127K9435J4106l3330L080K3985j8391o736K7038
672A6059j0743k5808K1735J4680k6588M47K5563j2716j8216J8997N608j9135Q101
685b016J4815j7509n398K1123p250j8555J9869J2152k7243l350K6000n830j7093
698a0285J3242L964j5834Q455J1367j8042l264K2250n726k0069J2330J2154j4653
711d111l161J2046m025m333Q576m713j0607J2772J0022j6572o398J6470J533j3139
$$ y = [-18273, -6180, 17859, -1275, -6998, 11296, -3787, -15561, 10853, 11134, -11813, 2999, 14300, -12544, -12363, 15485, 5576, -12782, 6105, 11238, -13723, -8922, 12033, -631, -8281, 12356, 3980, -21772, -1148, 19953, -7213, -12915, 15647, 3169, -19179, 5709, 13037, -13460, 1079, 19216, -13052, -15914, 21710, 6999, -23128, 6307, 20413, -12917, -9837, 14148, -4243, -10979, 16059, 5316, -20492, 1243, 15923, -10665, -10218, 15345, 2629, -15587, 3410, 9018, -10117, -2016, 12799, -4710, -10108, 11015, 3765, -14790, 5079, 17231, -10012, -13362, 12638, 6808, -10285, 2957, 6921, -8913, -458, 10909, -7133, -10397, 11853, 6127, -13942, -1612, 10542, -4111, -7272, 4774, 749, -3584, 4992, 279, -10328, 2444, 12466, -4106, -10504, 5966, 7499, -5640]
725e640L781P902o923k401P695m242n802R712K254j2828K256J2070p914q860J1954
740C014L642j2743J974R748o108l365P961n265o981J3486M836j8229q82J8042
754I130k893j4012O559P668p863r19O587n055l029Q975k043j1184O751J1162j0473
769f39q373J0779L286r034K565M471p025J662R406q229p844J3196L218j4710L381
784c890J2402q730o406J1526j091j0103P108N553r908J172Q772q042n331J3021
798F053Q59j4828K508J2451n265o740O738k39p169O738N208j1434j110J4067m589
813C248j2960J0111R187j3305k776J2860m346p557R754J63j1714P310Q930j2377
827c472l034J3257l657j0351Q450M348j0290J751Q691o796n006R567l6r281N360
$$ y = [-5640, -1859, 6043, -880, -3281, 4414, 172, -5630, 4082, 6336, -6492, -4236, 7834, -80, -8940, 3014, 6656, -6087, -4113, 5635, -473, -3838, 4123, -1142, -8123, 5363, 10199, -8030, -8912, 9130, 6237, -7775, -1216, 6452, -1411, -2330, 4257, -798, -3827, 5148, 3105, -8079, -1328, 9834, -639, -9012, 1767, 5053, -3981, -1416, 3055, -3970, -2308, 7098, -1131, -8975, 4221, 7439, -7271, -3890, 8512, -218, -6624, 4902, 3811, -6292, 816, 6369, -3539, -2367, 6405, -1637, -6968, 6053, 6912, -7916, -5408, 7043, 1778, -4962, 1776, 1537, -5632, 1106, 6314, -5120, -6230, 7837, 3248, -9712, 399, 9586, -3719, -6495, 6365, 2019, -5538, 4216, 4379, -7335, -25, 8905, -3472, -6506, 6751, 3094, -7257, 1193, 5541, -4749, -2998, 5693, -1103, -6109, 3458, 3422, -5859, -499]
842d99O345j0019j896J3061k441j3128O303R968q040k916P062n095l589J1391
856F507j626j3332P216J0265j1091m129J1327k625q634P477K722r106M080P035
870F086r454l535J1869p33j0769M590P728o650l967P352J5n253L221K292n569
885b777J907O062n786m196Q338J101r712K761Q793n722o246O195J703m662L491
900A250J108q403K870J1003n862j0956P389Q319o870m105N532o83k246M067j050
915A363n414M722N026p839k765R481j73q768K630O514n409k075N873k712m467
930d013O370O41r234M372R474q689p150J0949K237j0233L660O552p143q45P692
945D640n630m079J0821j567j2611P164J1293j0579o798R998J004o128M407M18
$$ y = [-499, 5846, -4173, -6069, 6992, 4551, -8577, -2274, 7694, -346, -3262, 3800, -1295, -4884, 6507, 4881, -8451, -1235, 9030, -2061, -6190, 5137, 2512, -6122, 1355, 4077, -5029, -949, 6086, -3368, -6903, 4966, 4233, -6536, -1946, 5782, -868, -4835, 2517, 2532, -2721, 500, 2792, -2777, -870, 5192, -594, -4790, 3548, 4649, -5063, -2302, 6491, 769, -5477, 718, 2421, -2241, 1250, 2358, -6045, -3175, 7828, 1966, -8990, -1601, 6718, -152, -4257, 1275, 592, -1654, 2413, 1363, -4051, 671, 5697, -2142, -4907, 4574, 4401, -4367, -1737, 4777, -632, -2707, 3166, 454, -4013, 2357, 2998, -6236, -1864, 7610, -1079, -8229, 2720, 4957, -5276, -1616, 4936, -2207, -3052, 4640, -990, -5069, 5752, 4185, -8426, -1262, 10031, -548, -7346, 2652, 3656, -2472, 1935, 2353]
959B353q512M699R879q454q541J0196N081j1339p34J0527l603o770O738P50p619
974e349N933N910j0283p39J1718o217r027J1875K996j2355L870P824r537J19J0509
989G247p372o941J1634P96j2510M460R436p244m654P188N04n837J966K670k810
1004a467J407L973n088n743Q132O312r275l292Q949k044o792P592J442r290N521
1019C37P019j1540k131J2625l539q509P740J621q583L361N005m948N36L326m045
1034a725m87M066k102j978L236J035j668k017m73L490P20l761K633K256o064P55
1050b084N450m167k87O784o183o909R456L384q628J580M260m256N29K774l939
1065b236M06M864k074l230J177O93J133o17j207L112m69n846M993M395q654J362
$$ y = [2353, -6159, -1460, 8419, -35, -8576, 1620, 6701, -4638, -5372, 5155, 1552, -5218, 1520, 2270, -5349, 584, 6494, -3789, -4528, 7190, 973, -8054, 3821, 6817, -5538, -1668, 6156, -3381, -3262, 7247, -125, -7066, 4568, 5364, -7146, -2686, 6750, -494, -5148, 2040, 2544, -3293, -1327, 1343, -1467, -60, 3913, -1175, -6918, 1214, 7526, -1749, -5041, 3908, 1864, -4928, 2664, 4106, -5184, 337, 7356, -4184, -6315, 6310, 2771, -5738, 2002, 3623, -4960, -1599, 3406, -1542, -1006, 2320, -1725, -2212, 1854, -248, -2226, 1010, 2045, 377, -1640, -2113, 1377, 2097, -1664, 969, 3225, -2839, -2084, 3366, -801, -1088, 5696, -487, -7396, 2060, 5444, -3184, -1604, 2656, -1600, -1071, 1703, -2236, -1830, 3034, 960, -2270, -1093, -400, 733, 116, -1091, 2021, 1552, -4294, 699, 5094, -3560, -2198]
1081b198Q835p741m335J1269m937r110J3728K493j7158N383J2016j0858k124J0902
1095F165o679n759J0178j995q779Q543N133j0941j095Q930o34o024J554M083k411
1110B69j926M089r29p123O514P844j2255l734J4668m160j2498J2120M397j4664
1124g388N792R502j3718L87J4721j0626p659J6269k946j5059J0963Q108j2180
1137c834M93P847o311p87P508m085n947N861M116m865l543L455L967m233l155
1152c513N635J12n267M094O20p016O562O057j3158n82J4464o188r761J0754P97
1167C610r245P183L089j0449M509Q156q890k174Q107k687l328L621j057j207K045
1182A283j985N3L222l133j577L140j292M21K297n708m75R247l851p642O985J819
$$ y = [-2198, 6637, -1104, -5439, 5830, 893, -8217, 5511, 8004, -9154, -3771, 8245, -2613, -4737, 6165, -514, -6273, 3905, 1910, -6869, 1674, 6807, -4134, -5229, 3701, 3067, -2957, -1403, 2680, 269, -1657, 2432, 1503, -5620, 894, 8738, -3517, -7251, 7417, 3257, -9241, 2879, 7276, -7388, -1596, 7906, -5812, -5425, 9296, -1330, -8989, 7280, 4334, -10725, 238, 8346, -3834, -3341, 4506, -1805, -2592, 4916, 831, -5116, 745, 4861, -4, -3547, -92, 3875, -358, -3513, 2122, 2234, -3033, 1061, 1681, -5335, 1227, 7284, -5874, -6456, 8008, 1820, -7941, 2813, 3610, -5635, 1548, 4637, -5812, -1303, 6853, -2037, -4211, 3896, 1209, -2119, 1502, 445, -762, 1283, -702, -649, 2573, -560, -2137, 1003, -289, 132, 2429, -3279, -3754, 5493, 1642, -6000, 985, 2804]
1198B804o376M683K092p805M231N911q636p27Q876l421n379M624L48j631K141
1213A735k108j618L485m52j639J049j920J319L530n600j710Q313l335o549P847
1228B347P13r225O872N108j0985K006R486q307k604J0778m890q001Q785K696p350
1243b571K116K490l975K276L009m834q75L639K15k055j110J874J925l427j256
1258b559M840j631m370N363N74p063N544M820r713Q45R626o824m822R892k133
1273B389p775P501J799q558M584N239p760K5O514m202l066N404K8m139j7K385
1289C51J328j634k252J777J280j883K084L74n434L285N875o644k871Q119k095
1304A660n617O230K59o729N623L024q640K612P226o456l618P442q70n289L125
$$ y = [2804, -3572, 1111, 3203, -4602, -371, 5540, -3096, -3823, 5053, 1632, -3747, 877, 1225, -406, 1735, -373, -1991, 1494, 1042, -597, 452, -1468, -149, 3381, -2219, -3929, 4384, 1049, -5500, 2347, 3060, -6165, 707, 5815, -5170, -3164, 6322, -1985, -4589, 6189, 1299, -6702, 2083, 4779, -2571, -455, 2035, -1940, 336, 3345, -1489, -2364, 1275, 1490, -565, -1675, 199, 2124, -1303, -2559, 2281, 650, -3720, 1643, 2217, -4846, 698, 5518, -4195, -3350, 6276, -548, -5370, 4522, 2389, -5386, 2115, 3914, -4644, -60, 5179, -2581, -2556, 3958, -244, -3310, 2094, 2122, -2017, -2034, 351, 1679, 45, -2207, -430, 850, -1033, 1051, 1425, -4009, -724, 5151, -1493, -4364, 3755, 1660, -3957, 2273, 2532, -4197, 1426, 4450, -4190, -1578, 5648, -808, -4426, 3016, 2146, -3143, -18]
1319a8J820l124N88J526j557M0J000N93j331j645K907J570m645P96N192l742l751
1336c781O170j85n276M530O01o446N281N648r816k078J0096j862o734M188J309
1351A645m318L438J808n526P59N248k494l719K449K782j878j931J668J599k118
1366e88j56K469k054j402M438j591n108N498L079p830P2P943l901m663N444Q8
1382A738m953L646K105n186J371M296l966k184M745N77l930l57K811M45j226j87
1398b55n76k86K274J829m326k069O037O97o331J437N072l773k008M554k306l154
1414c184N383K56o295K893M878n634j497N750j482m364L390K039l891J079L110
1429B431l229j743M787K57n497J762N100l493l627M941J070n301J485L947l336
$$ y = [-18, 1802, -1322, -734, 792, -765, -725, 275, 868, -463, -2108, 799, 2369, -2276, -1480, 3712, -30, -3781, 2389, 2204, -3072, 1458, 2059, -4387, 894, 6542, -3274, -5352, 4744, 2882, -3852, 336, 1645, -2673, 765, 2573, -2953, -2194, 3054, 560, -3159, -710, 2072, 194, -1737, -69, 1530, -588, -744, 1725, -329, -1731, 2707, 1116, -3992, 1506, 4585, -3245, -3173, 4770, 869, -3794, 1650, 1738, -3215, 431, 2536, -2650, -1279, 3017, -949, -3133, 1612, 2189, -1741, -2098, 713, 1158, -68, -255, -831, -1117, 1157, 2986, -1340, -3409, 2628, 3325, -3006, -1569, 3503, -270, -2278, 2276, -30, -3184, 2199, 2455, -3840, -947, 3931, -1703, -3200, 2550, 1068, -3296, 94, 2133, -1758, -679, 2431, -798, -2541, 2246, 2503, -2994, -1232, 3868, 375, -3252, 1689, 2759, -2542, -1057, 2890, -446]
1444d46j042L736k861k676N241J327o548Q58N120k369k361K898p34k277L435Q40
1460B141m816J060M744k563l243L529J485l932Q62L251k743j910L617rl179J684
1476b2J864l202J90L484j900l242K970J736k969j10K665j493j777K229N49k253
1492a281J194K076l094j330M532M06n074J101M394k450k389L105m55k524K894
1507A105J036m247O16M038k495k151K925J21k643J247J900k253n86K473l91k336
1523a641J535J241k422J57M132k221m667L984L843m727j339M334j876k660M247
1538A920l62m677L895K678o167J93N945k655l975M009O40l390K144J275l867J058
1554a336M653k661m186L259L122l215j594L523j17l222J717K024l367M16L965
$$ y = [-446, -1488, 2248, -613, -3289, 1952, 3279, -3269, -2411, 2709, 340, -2021, 877, 143, -2134, 1301, 2141, -2675, -1615, 3129, 566, -2677, 852, 2337, -1595, -733, 2518, -225, -2135, 1482, 1473, -1706, -22, 1842, -1360, -1170, 2314, 414, -2828, 142, 1878, -1091, -1201, 1464, -29, -1806, 423, 972, -1281, -87, 1989, -1105, -2435, 2097, 2503, -2571, -1470, 2924, 474, -1915, 1190, 735, -1789, 1105, 2141, -2106, -1490, 2548, 53, -2098, 827, 948, -1695, -448, 1452, -801, -1387, 1086, 695, -1641, -106, 1135, -1287, -1130, 3002, 781, -3886, 98, 3941, -786, -2125, 2209, 333, -2327, 1920, 1558, -3119, 776, 3454, -2713, -2520, 3425, 770, -3205, 804, 1444, -1946, 198, 1473, -2394, -1336, 3317, 656, -3530, -271, 2851, -364, -1958, 1565, 1448, -1774, -57, 1967, -1400, -984, 2981]
1569B981l102l013N032p0n206L697L649n861j190N432k351j999M319j936m297
1584c915M629K586n578k41M969j150l250J529J119o89QP33q48l51J187K8k379
1601a613P94L711j730l617K128K002k592O78J731k994N28L454l268k551N142N48
1617B351m676J449K519k795L56K364j320j253J530m78p21J477K73j402l85R98
1633B87J218j440j915K295J549k443j71J377j767K86K953k738k197M466p2m678
1649b990K208L245k820j024K378j294p67K502r99j710J647Q79j533n62J136P12
1665A008o30p05J71L31p29J065P10k607O16K658k284j524L451q63l593L543K138
1682B756m970K01M150k114j493L144j677k441L789J076m459R58L252j915j756
$$ y = [2981, -121, -3134, 1898, 1828, -3378, 319, 3968, -1893, -3083, 2349, -2, -2001, 2318, 382, -3915, 714, 3300, -2278, -2519, 2450, 1300, -1950, -421, 698, 9, 17, 750, -98, -449, 738, 766, -1613, -819, 2892, 1162, -2455, -327, 1675, -917, -239, 1492, -1502, -974, 2480, -788, -3339, 1803, 2351, -2325, -876, 1643, -1152, -796, 1568, 248, -1005, 525, 47, -674, 803, 1076, -326, -711, 287, 1505, 65, -1850, 445, 1994, -449, -620, 757, -1010, -724, 2229, -509, -2706, 1760, 1688, -2990, -782, 2463, -357, -1381, 997, -297, -1064, 1438, 439, -1271, 376, 1255, -278, -840, 296, 1008, 378, -327, -156, 175, -554, 511, 1221, -1386, -770, 1888, -396, -1920, 1531, 668, -2925, 618, 2756, -2214, -2013, 2137, 23, -1470, 1674, -3, -2444, 1345, 2421, -2038, -1080, 2172, 257, -1499]
1697a499K165M43j863L44J567j218j381K429K41l069Q01L351k623k424M124K52
1713A640m262K604K388m088O21L627l013j978M470r47l324L200J264m218J065
1728i51L729k407j949K282o2j571J514O06k579J16L130n74l230P60K965j391k154
1745a766K107L34k172J778J120k937N80L595l012k018M001k2l633K102K134l064
1761h73J2K636j893j266K772n20k685J690J642j698j044J386M99j263pR55K57
1778F00j482O85K56o84R49R57k625l15L851n67l812J498K344k048Q7J628k270
1795i48n9L228j328l225K092K176k229j233J957P0r54L03M76p24O4R23r88o40
1813a039J615N10k419M66K566j334j946K181N65k194J097J330k417K71K797k044
$$ y = [-1499, 666, 1109, -754, -410, 1157, -61, -1442, 987, 1228, -1841, -1040, 2311, -312, -2736, 1388, 1640, -2622, -18, 2370, -1718, -1097, 2530, -483, -2461, 2009, 1062, -2262, 938, 2202, -2016, -951, 2778, 371, -1578, 704, 642, -929, 585, 1191, -1388, -1272, 1858, 1284, -1946, -1186, 1779, 388, -1766, 341, 675, -1497, 281, 1401, -1536, -956, 2639, -373, -2391, 1610, 1588, -2045, 57, 2191, -873, -861, 1775, -118, -1384, 1388, 868, -1817, -127, 1515, -183, -1227, 159, 658, -605, -612, 343, 600, -882, -197, 59, -625, 324, 1281, -1344, -1659, 2192, 1625, -2187, -689, 1655, -393, -306, 1322, -948, -1007, 2221, 893, -2332, -240, 1936, -293, -1526, 431, 501, -453, -150, 326, -398, -334, 589, -399, -1039, 576, 1086, -1333, -867, 1699, 365, -1581, 600, 1165, -1029, 68, 1398, -1019, -748, 2049, 5]
1829Ej755L040K45l156Q35K299j339j084J133m22n35J848n70k378J149K564j057
1846H22k568J437J793j689n99J520o27j003K042j43k456J188K339k271j177K383
1862I91j94k035J300R06j470j7J409j286m47J658o68j503J303J151j522o18J664
1879F22l52j190R76P96j198j57J296p99q31J739K48k531Q00K433j393j690J413
1896A82M40j270R95M02k020N24K263j525j771K077R17j892K48J419j420p12J909
1913G66k0j858P10J637j420l59J554p15j404J449J007j816l98J599n26r44J153
1930D15j2j096R67J34j234M90J419j328j118J605P59j404m15J242n34j53R07k54
1948C90j426J085J260j332q01J361J67j018K92O46j233K43J102n55q43Q68L1q58
$$ y = [5, -1750, 1290, 1535, -1621, -786, 1513, 174, -910, 223, -199, -734, 1114, 544, -1834, -685, 1879, 822, -1746, -309, 1484, -205, -804, 716, 89, -914, 1128, 985, -1471, -283, 2056, -215, -1392, 991, 797, -1238, 62, 968, -502, -519, 890, -396, -843, 815, 147, -1356, -53, 1098, -424, -1042, 622, 270, -920, 56, 852, -346, -503, 793, -6, -837, 902, 1150, -1381, -581, 1852, 459, -1231, 182, 622, -648, 347, 749, -1271, -747, 1516, -9, -1780, 297, 1214, -678, -430, 989, -431, -1143, 766, 746, -1112, -402, 1235, -185, -544, 1010, 295, -1109, 340, 1347, -469, -867, 732, 206, -738, 415, 403, -693, 274, 408, -826, -336, 1083, -245, -1363, 242, 1001, -403, -818, 424, -110, -263, 644, 390, -1036, 49, 1309, -23, -824, 537, 704, -314, -22, 624, -609, -366, 736, 181, -662, 206, 237, -621]
1966f21N48R41j509n85J893J73j686lJ199j51n35O55k05r86J097O97j606k3K034
1985A327q22j576R41J081j051k4M61p78K52J298j278j324K080O92k234o3J641
2002F23m71q07R97p5j235R80R45j490k93J709l02j432R56R56j416l55J683n36
2020D37q18N51j93o04J226N82k303j35K372n19j868J182Q94j182Q3P81j129J05
2038e38J558q28j526J365J191j558o41J389L72q93J09J6n06R26N67j486l34J567
2056G50o0j485N20R18n93m95Q60m47p92P75P18j052j37O70n23n32J368J42j097
2075d92J63Q51p0o67K34k54L93M31m09j073P52R97n37r00M97O71p11k02N16rm00
2096b19K66M0q43M53J234j050p82J176L06j176K13P93m73j74Q66o77p56J222M01
$$ y = [-621, -73, 868, -641, -1226, 667, 840, -846, -849, 350, 199, -336, 319, 114, -872, 225, 922, -684, -707, 1327, 505, -1071, -130, 951, -100, -124, 337, -441, -189, 1109, -169, -1493, 587, 1279, -955, -1018, 623, 152, -655, 342, 267, -968, 12, 957, -533, -826, 883, 581, -851, 105, 1061, -355, -710, 973, 437, -381, 170, -23, -627, 599, 1181, -1122, -1257, 1115, 596, -1272, -90, 804, -378, -295, 486, -643, -538, 1020, 192, -1334, 31, 1222, -336, -977, 412, 784, -109, 0, 16, -490, 436, 1003, -483, -817, 750, 690, -795, -275, 643, 50, -445, 415, -32, -824, -49, 669, -383, -520, 150, -373, -905, 463, 605, -492, -329, 522, 452, -215, 19, -235, 158, 589, 180, -893, -141, 856, 319, -581, -84, 587, -124, -326, 190, 181, -219, 47, 87, -756, -303, 931, -119, -901, 275, 581, -595, -382, 411, -62, -236, 630, -47, -803, 419, 820]
2115H20j078Q1O56m98m51R21Q4j247L40J141l70j119M49L88m22N01L32j297n5
2134h24J524j84j391P74P94j038M7R71q88m04J509n75j173J259N58j588K07J528
2152A106j200o12J265j88j025Q23M90j118l20J350k28r44N89L47p02J04Q96n00
2170A33j033R84O02p49q6N78r26J75J610r01j818J508J247j471n09J048m05m14
2188d27Q84m80q12J068L34j292J45J075m83o21O24J51j81n7K2J1j1L96j46o40
2208d40M16R24j011m84Q01M31j079K59P11o04k27P52m96l37R97n95q41Q98O41
2227G16j080k54O42R5J50j47p85M73P40q8p91j52N49N55m04q23L73P76l82l60
2247a97M05j60k88M92k91l91R27j46j054N55P74j040J16N00m63K15K98o06k35
$$ y = [820, -258, -177, 479, -19, -470, 451, 535, -712, -372, 769, 399, -720, -271, 117, -305, 196, 528, -769, -824, 700, 516, -875, -101, 693, -345, -298, 673, -215, -619, 890, 315, -858, 401, 959, -629, -422, 1106, -94, -706, 559, 371, -654, 169, 659, -459, -779, 571, 343, -601, -12, 335, -367, -263, 633, 133, -900, 84, 686, -63, -149, 429, -497, -322, 1288, 387, -1431, 77, 1324, -147, -656, 392, -13, -427, 457, -23, -835, 233, 567, -725, -580, 495, 12, -609, 15, 166, -15, -72, -50, -39, -50, 346, 200, -440, -24, 900, -111, -595, 206, 637, -442, -183, 528, -76, -303, 449, -47, -384, 613, 18, -823, 75, 716, -364, -618, 24, 119, 269, 122, -663, -190, 550, 462, -329, -481, 68, 623, 219, -604, -231, 545, 163, -197, 208, 48, -240, 252, -39, -430, 497, 351, -703, -148, 626, -414, -298, 202, -261, -46, 252, -354, -589]
2266e89J104j90n42J18L50r5k78j27N64O1q19O6Q86j83n33J82j64k0R85m73j220
2287i17P18J110j089j83M36m29L01Q01j091m76J319Nj085M88M31n68Q7M35k90
2306Cn4J18q2K1K12k00M6j69J71L17l47n82O83L56r31M16K61o16J34Q11p62l54
2328e48J232n75j023J218N30j358K58M98k85K73M3p02K58O45k45m49L51q4K40
2347B77j8l94k75M60N4o6Q1m23K68N43o85j92O80n29k84R88k28j017P22N73p11
2368a76R5O20o75J59O10n84m46P30J3o85K92L96l17j5o1o3J20J21l00L3j57K91
2390AL55o99j50Q24P6q26L19L91o51L24N25q10J72M68m34k8O96n72o10R23L43
2411F37q28N2J83j00K37L17p23j22M49J46k71l49J45N88j47o95M47L70m42j51
$$ y = [-589, 515, 325, -217, -99, 251, 156, -122, -249, 315, 376, -443, -377, 509, 326, -207, -25, -189, -209, 776, 303, -917, -199, 911, -178, -361, 75, -354, -53, 748, -343, -819, 500, 505, -580, -92, 339, -229, -142, 293, 3, -51, 67, -15, 6, 218, 18, 64, -105, 66, 383, 36, -546, 137, 493, -438, -22, 239, -377, -243, 568, -194, -548, 684, 109, -914, 304, 834, -524, -266, 232, -53, 220, 263, -439, -181, 464, 219, -230, 121, 37, 277, 259, -135, -410, 50, 104, 38, 119, -304, -36, 507, -178, -370, 310, -219, -503, 485, 257, -760, -38, 535, -176, -81, 539, -136, 23, 633, 49, -397, 333, 346, -339, -47, 349, 32, 17, -44, -107, 13, 134, -166, -133, -290, 1, 356, -343, -493, 331, 407, -419, -100, 291, -360, -36, 489, -321, -149, 319, -115, -143, 553, -19, -629, 294, 637, -191, -139, 44, -56, 181, 498, -225, -347, 102, 248, -23, -372, -227, 361, 214, -481, -34, 336, -106, -257]
2431b57M94m57K49M58r46p8J315l71r46N38L82k86n8K30n59J56O09o22k90L19
2451a20L26k35k66J96J37l5l57M98N5n02J87K29k5l5K27o42J81Q30m94q66Q30
2472A19M20o82K84J44o79L96N29o58n34J026J72j009N7N98kk09o0j30J76L45k24
2493G9m45J51N95o9n70N1N64n9m67K15p0k19P04p2r01N10O12p71R3N52n64m46
2515e27P33J24n14M8L8qJ82R5l16k06M01L41l23m01N13R4k08k7j6q0M7K39k46
2538a7k00M78L8o88Q8P63l72l05K54j25RQ7N1n05M07J03j01j98K5J93q9L22k30
2561a2l68L59L49q1k28R8%j61J61J52l57j29K95K43l07l17K76Q4o8nnk78K64J86
2585A51l18J75J39j1k83J91J40k32j25M03Q2m36J36K41k86JL43k31p5M2L90p09
$$ y = [-257, 237, -220, 29, 487, -459, -537, 778, 407, -539, -1, 381, 95, 37, 267, -292, -136, 473, -149, -439, -120, 206, -29, -295, -99, 38, 3, -354, 144, 199, -303, -116, 113, 88, 53, 280, -362, -181, 649, 155, -711, 119, 539, -143, 141, 285, -394, 2, 531, -127, -661, 365, 537, -472, -415, 183, 181, -28, -88, -218, -42, 303, 79, -366, -215, 380, 311, -259, -208, 356, 297, -170, 45, -25, -244, 460, 388, -513, -3, 609, -162, -69, 483, -81, -527, 206, 330, -184, -136, -98, -106, 76, 171, -145, -351, 50, 391, 68, -333, 180, 274, 66, 39, 23, -57, -10, 229, -17, -217, 261, 299, -389, -301, 462, 90, -215, 39, -86, -77, 10, 61, -444, -37, 66, -35, -233, -208, -15, -104, 218, -12, -380, -21, 328, 247, 19, 117, 117, -44, 117, 269, -88, -217, 78, 321, 14, -303, -27, 57, -11, -16, -21, -299, -35, 151, -167, 8, 147, 136, -147, 44, 184, -48, -173, 230, 312, -124, 12, 253, -33, -32, 311, 80, 5, 47, 437, -272]
2607b72K42K22k79o9J73J92l09j61J03qL00M2m24j86O98J39n86j89M88noJ70l79
2630a04l24R11l6r10Q8Q14l76l70L51J59n48L75K12p18M03K57l34j87N48j22m65
2651c76K76L59k51j99K49p0k33L34J45k38j88N45l72j56L15J70n33m5O04p7k47
2672A2k2k26l5O90k62q03L52P56n23j75J49K2N6K60j86l49L47L53l60k61L71Q0
2694B46k74k7O6Q4l40Q6K23j67R9m8ol8K55j06n07L53L73l59k39N98l58L8Q2q8
2718e4J04l1n1k02J85J84K27n58j11M20Q6j34l34K70J01N2K35o46n3P79q5q29
2740d45Q0N38k06k3K12l27j70N44o1l01R3K30k74O5J75lj63Kn1K83N8k09j38J51
2764F0L4P9j95L0M02n17k71P36k5o62K7Q12o44k31M61l09j17P61q9q49M16M36
$$ y = [-272, -30, 192, -87, -156, 17, 209, -100, -261, -158, -166, 134, 176, -248, -434, 264, 403, -183, -372, 116, 111, 105, 275, -104, -428, 483, 447, -463, -375, 439, 63, -307, 44, 203, -345, 30, 242, -476, -73, 184, -150, -337, 211, 89, -376, -100, 259, 8, -191, 58, -12, -245, 89, 234, -4, -192, 353, -19, -175, 140, 310, -223, -268, 336, 259, 12, -10, -236, -271, 419, 157, -646, -294, 462, -61, -236, -87, -65, -9, 251, 65, -284, 63, 416, 56, -205, 166, 246, -28, -55, 11, 95, -245, -159, 64, -103, -4, -52, -58, -96, 159, 53, -454, -101, 272, -87, -326, 272, -86, -48, 34, -54, 50, 19, -32, -234, -49, 135, 362, -196, -307, 113, 199, 65, -269, 1, 102, 154, 389, -257, -310, 469, 384, -445, -365, 173, -33, -56, 156, -171, -341, 203, 142, -159, -66, 164, -110, -45, 130, 127, -36, -34, -85, 198, 256, 47, -91, 60, 94, 173, -22, 8, 410, -107, -378, 358, 333, -329, -302, 510, -134, -365, 96, -213, -330, 431, 342, -507, -91, 345]
2786C45l74j91K52n7j76N88k97l96J75L43m1k35M4N4p1j61N07l08l36L65K58n35
2808b47PL71j53k31K82j78k73N68J05n20L21K33k72k47M10j35k04L78j61m32M73
2829I5K45k89m96N29qQ0n17J93K83l4n7K89n75K3M47n1m47M36J50o03M12L15n38
2852a18j05N44j45k84L58k62j42N69qo60K4M95j42j56j5J81q3j11m7J56j47J06
2874HL7k93r0O43k05l83K79K74j97j56N6j39K36M02n39k77M83J98l17k06L57r3
2896G8q1P5k8j08J32qNk4k6j5r4O4J04j51k93L19L51m36N6J25j25P2L51n42j38
2921c37P68k80o06M18L53l02OP2p3k67M41j48l41L25J18n7m47J88M06p2j69m5
2943d9j33K31J61j73m15L49L58n61K18K00j38m14O84kn01J88J46mk83K49k49j07
$$ y = [345, -29, -220, 32, -25, -201, 387, 90, -306, -131, 212, 171, -64, -20, 34, -37, -198, 309, 1, -335, 30, 288, -247, -240, 131, -22, -253, 29, -149, -422, 146, 251, -269, 52, 285, 13, -234, 176, 41, -163, 215, 54, -378, 95, 340, 51, -445, 84, 76, 156, -361, -168, 115, 81, 24, 313, -262, -239, 208, 157, -290, 146, 296, -307, 105, 420, -118, -223, 321, 176, -108, 250, -12, -154, 415, 407, -253, -229, 266, 124, -32, -47, 134, 51, -60, -107, 49, -98, 8, 45, -248, -338, 305, 100, -283, -4, 270, 73, -83, -27, -166, 70, 472, -67, -344, 139, 337, 20, -186, 171, 78, -3, 72, 44, -64, 68, 60, 65, 41, 15, 0, -94, -30, 74, -77, -370, -51, 300, -136, -80, 45, -80, -8, 343, -199, -337, 431, 151, -455, -37, 316, 14, 20, 92, 19, -248, 193, 45, -296, 29, 147, 90, -357, -169, 237, 165, -4, -49, -182, 49, 210, 37, -378, -29, 329, -232, -14, 186, 48, -366, 318, 316, -185, 3, 149, 145, -138, 111, -138, -245]
$$ [...]
8191i7
##END NTUPLES=NMR FID
##END=
