##TITLE=1H_3MBDE 2-1 
 CDCl3
 8 sc, 
 13.12.2022
##JCAMPDX= 6.0         $$ Bruker NMR JCAMP-DX V2.0
##DATA TYPE= NMR FID
##DATA CLASS= NTUPLES
##ORIGIN= UXNMR, Bruker Analytische Messtechnik GmbH
##OWNER= root
$$ XWIN-NMR		Version 3.5
$$ Tue Dec 13 13:48:52 2022 Russian Standard Time (UT+4h)  she@DPX200
##.OBSERVE FREQUENCY= 200.13135
##.OBSERVE NUCLEUS= ^1H
##.DELAY= (6, 6)
##.ACQUISITION MODE= SIMULTANEOUS
##.ACQUISITION SCHEME= undefined
##.AVERAGES= 8
##.DIGITISER RES= 18
##SPECTROMETER/DATA SYSTEM= spect
##.PULSE SEQUENCE= zg30
##.SOLVENT NAME= CDCl3
##.SHIFT REFERENCE= (INTERNAL, CDCl3, 0, 15.7039)
##AUDIT TRAIL= $$ (NUMBER, WHEN, WHO, WHERE, WHAT)
$$ ##TITLE= Audit trail, XWIN-NMR		Version 3.5
$$ ##JCAMPDX= 5.01
$$ ##ORIGIN= Bruker BioSpin GmbH
$$ ##OWNER= she
$$ F:/spectra/data/she/nmr/H-F/1/audita.txt
$$ ##AUDIT TRAIL=  $$ (NUMBER, WHEN, WHO, WHERE, WHAT)
(   1,<2022-12-13 13:47:58.25 +0400>,<she>,<DPX200>,
      <created by zg, POWCHK disabled, PULCHK disabled
       configuration hash MD5:
       00 E9 B6 7A A2 85 ED C7 34 08 36 98 17 FE 4E 26
       data hash MD5: 16K
       6F BD 31 A1 B0 38 38 F2 E5 B0 C1 AE FD 6F 6D 8A>)
$$ ##END=
$$ 
$$ hash MD5
$$ 92 53 D3 8C B2 2F 3E FE 9A 1C C7 A3 CB A1 54 50
##$RELAX= 
##$RELAX= 
##$RELAX= 
##$RELAX= 
##$RELAX= 
##$RELAX= 
$$ Bruker specific parameters
$$ --------------------------
##$DU= <F:/spectra>
##$EXPNO= 1
##$NAME= <H-F>
##$PROCNO= 1
##$TYPE= <nmr>
##$USER= <she>
##$AMP= (0..31)
100 100 100 100 100 100 100 100 100 100 100 100 100 100 100 100 100 100 
100 100 100 100 100 100 100 100 100 100 100 100 100 100 
##$AQSEQ= 0
##$AQ_mod= 1
##$AUNM= <au_zg>
##$AUTOPOS= <>
##$BF1= 200.13
##$BF2= 200.13
##$BF3= 200.13
##$BF4= 200.13
##$BF5= 200.13
##$BF6= 200.13
##$BF7= 200.13
##$BF8= 200.13
##$BYTORDA= 1
##$CFDGTYP= 0
##$CFRGTYP= 5
##$CHEMSTR= <none>
##$CNST= (0..31)
1 1 145 1 1 1 1 1 1 1 1 1 1 1 1 1 1 1 1 1 1 1 1 1 1 1 1 1 1 1 1 1 
##$CPDPRG= <>
##$CPDPRG1= <>
##$CPDPRG2= <>
##$CPDPRG3= <>
##$CPDPRG4= <mlev>
##$CPDPRG5= <mlev>
##$CPDPRG6= <mlev>
##$CPDPRG7= <mlev>
##$CPDPRG8= <mlev>
##$CPDPRGB= <>
##$CPDPRGT= <>
##$D= (0..31)
0 1.2 0 0 0 0 0 0 0 0.06 0 0.03 0 0 0 0 0.0002 0 0 0 0 0 0 0 0 0 0 0 0 
0 0 0 
##$DATE= 1670924877
##$DBL= (0..7)
120 120 120 120 120 120 120 120 
##$DBP= (0..7)
150 150 150 150 150 150 150 150 
##$DBP07= 0
##$DBPNAM0= <>
##$DBPNAM1= <>
##$DBPNAM2= <>
##$DBPNAM3= <>
##$DBPNAM4= <>
##$DBPNAM5= <>
##$DBPNAM6= <>
##$DBPNAM7= <>
##$DBPOAL= (0..7)
0.5 0.5 0.5 0.5 0.5 0.5 0.5 0.5 
##$DBPOFFS= (0..7)
0 0 0 0 0 0 0 0 
##$DE= 6
##$DECBNUC= <off>
##$DECIM= 32
##$DECNUC= <off>
##$DECSTAT= 4
##$DIGMOD= 1
##$DIGTYP= 9
##$DL= (0..7)
0 120 120 120 120 120 120 120 
##$DP= (0..7)
150 150 150 150 150 150 150 150 
##$DP07= 0
##$DPNAME0= <>
##$DPNAME1= <>
##$DPNAME2= <>
##$DPNAME3= <>
##$DPNAME4= <>
##$DPNAME5= <>
##$DPNAME6= <>
##$DPNAME7= <>
##$DPOAL= (0..7)
0.5 0.5 0.5 0.5 0.5 0.5 0.5 0.5 
##$DPOFFS= (0..7)
0 0 0 0 0 0 0 0 
##$DQDMODE= 0
##$DR= 18
##$DS= 0
##$DSLIST= <SSSSSSSSSSSSSSS>
$$ [...]
##$SUBNAM2= <"">
##$SUBNAM3= <"">
##$SUBNAM4= <"">
##$SUBNAM5= <"">
##$SUBNAM6= <"">
##$SUBNAM7= <"">
##$SUBNAM8= <"">
##$SUBNAM9= <"">
##$SW= 18.05172834244
##$SWIBOX= (0..15)
0 0 2 0 0 0 0 0 0 0 0 0 0 0 0 0 
##$SW_h= 3612.71676300578
##$TD= 16384
##$TD0= 1
##$TE= 0
##$TE2= 300
##$TE3= 300
##$TEG= 300
##$TL= (0..7)
0 120 120 120 120 120 120 120 
##$TP= (0..7)
150 150 150 150 150 150 150 150 
##$TP07= 0
##$TPNAME0= <>
##$TPNAME1= <>
##$TPNAME2= <>
##$TPNAME3= <>
##$TPNAME4= <>
##$TPNAME5= <>
##$TPNAME6= <>
##$TPNAME7= <>
##$TPOAL= (0..7)
0.5 0.5 0.5 0.5 0.5 0.5 0.5 0.5 
##$TPOFFS= (0..7)
0 0 0 0 0 0 0 0 
##$TUNHIN= 0
##$TUNHOUT= 0
##$TUNXOUT= 0
##$USERA1= <user>
##$USERA2= <user>
##$USERA3= <user>
##$USERA4= <user>
##$USERA5= <user>
##$V9= 5
##$VALIST= <valist>
##$VCLIST= <CCCCCCCCCCCCCCC>
##$VD= 0
##$VDLIST= <DDDDDDDDDDDDDDD>
##$VPLIST= <PPPPPPPPPPPPPPP>
##$VTLIST= <TTTTTTTTTTTTTTT>
##$WBST= 1024
##$WBSW= 4
##$XGAIN= (0..3)
0 0 0 0 
##$XL= 0
##$YL= 0
##$YMAX_a= 43477
##$YMIN_a= -40594
##$ZGOPTNS= <>
##$ZL1= 120
##$ZL2= 120
##$ZL3= 120
##$ZL4= 120
##$ABSF1= 10
##$ABSF2= 0
##$ABSG= 5
##$ABSL= 3
##$ALPHA= 0
##$AQORDER= 0
##$ASSFAC= 0
##$ASSFACI= 0
##$ASSFACX= 0
##$ASSWID= 0
##$AUNMP= <proc_1d>
##$AZFE= 0.1
##$AZFW= 0.1
##$BCFW= 1
##$BC_mod= 2
##$BYTORDP= 1
##$COROFFS= 0
##$CY= 11.3945322036743
##$DATMOD= 1
##$DC= 2
##$DFILT= <>
##$DTYPP= 0
##$F1P= 2.36226072786647
##$F2P= -0.459571619588291
##$FCOR= 0.5
##$FTSIZE= 0
##$FT_mod= 4
##$GAMMA= 1
##$GB= 0.15
##$INTBC= 1
##$INTSCL= 1
##$ISEN= 128
##$LB= 0.24
##$LEV0= 0
##$LPBIN= 0
##$MAXI= 10000
##$MC2= 0
##$MEAN= 0
##$ME_mod= 0
##$MI= 1.114404
##$NCOEF= 0
##$NC_proc= 0
##$NLEV= 6
##$NOISF1= 3.799351
##$NOISF2= 2.8
##$NSP= 1
##$NTH_PI= 0
##$NZP= 0
##$OFFSET= 15.70392
##$PC= 1
##$PHC0= -19110.08
##$PHC1= 11.80072
##$PH_mod= 1
##$PKNL= yes
##$PPARMOD= 0
##$PSCAL= 0
##$PSIGN= 0
##$REVERSE= no
##$SF= 200.130013532006
##$SI= 16384
##$SIGF1= 3
##$SIGF2= 2
##$SINO= 400
##$SIOLD= 16384
##$SREGLST= <1H.CDCl3>
##$SSB= 0
##$STSI= 0
##$STSR= 0
##$SW_p= 3612.71676300578
##$SYMM= 0
##$S_DEV= 0
##$TDeff= 0
##$TDoff= 0
##$TI= <>
##$TILT= no
##$TM1= 0
##$TM2= 0
##$TOPLEV= 0
##$USERP1= <user>
##$USERP2= <user>
##$USERP3= <user>
##$USERP4= <user>
##$USERP5= <user>
##$WDW= 1
##$XDIM= 8192
##$YMAX_p= 0
##$YMIN_p= 0
$$ End of Bruker specific parameters
$$ ---------------------------------
##NTUPLES= NMR FID
##VAR_NAME=  TIME,          FID/REAL,        FID/IMAG
##SYMBOL=    X,             R,               I
##VAR_TYPE=  INDEPENDENT,   DEPENDENT,       DEPENDENT
##VAR_FORM=  AFFN,          ASDF,            ASDF
##VAR_DIM=   8192,          8192,            8192
##UNITS=     SECONDS,       ARBITRARY UNITS, ARBITRARY UNITS
##FACTOR=    0.0002768,     1,               1
##FIRST=     0,             0,               0
##LAST=      2.2672688,     0,               0
##MIN=       0,             -40594,          0
##MAX=       2.2672688,     43477,           0
$$ Real data points
##PAGE= N=1
##DATA TABLE= (X++(R..R)), XYDATA
0 0 0 0 0 0 0 0 0 0 0 0 0 0 0 0 0 0 0 0 -8 8 -8 8 -8 8 -16 16 -16 24 -24 26 -32 38 -40 48 -54 58 -65 73 -83
39 -83 95 -104 115 -129 143 -158 174 -192 211 -232 256 -282 311 -343 379 -419 462 -512 573 -639
59 -639 716 -812 925 -1069 1256 -1505 1861 -2408 3386 -5627 24092 -16862 -27696 43477 -4507
74 -4507 -30621 25306 16877 -29628 7461 18058 -18455 -4967 17722 -9001 -9656 9649 -1373
87 -1373 -10852 4376 2659 -6770 -855 4997 -3783 -5337 4653 3350 -6821 1957 9614 -6274 -6303
102 -6303 13058 1174 -12019 10735 10284 -15591 1303 17110 -11300 -8031 17862 -4201 -15601
115 -15601 12784 3420 -16684 6142 8199 -14366 -393 10074 -9636 -4221 9924 -4835 -6542
128 -6542 8651 120 -7693 5917 5211 -6335 1176 8062 -2348 -4148 6758 3664 -5900 1483
142 1483 6886 -4540 -4687 7078 509 -8536 3150 4423 -8950 -2005 7742 -5217 -6479 7158
156 7158 -547 -8445 5078 4084 -7632 2247 6522 -6054 -762 8267 -3410 -3662 8447 223
170 223 -6315 6096 4083 -6813 1734 6706 -4599 -3444 6058 -1086 -6458 2834 2784 -6157 -1728
185 -1728 4346 -3290 -4985 4182 820 -6009 1633 3876 -4305 -469 5712 -1950 -2381 5655 688
200 688 -3553 4555 2904 -4559 2239 4703 -4348 -876 5437 -2669 -3992 4699 -17 -6078 2068
215 2068 2372 -5905 -1040 4134 -3279 -3841 3534 132 -4549 1942 3093 -3262 -385 4211 -899 -1825
231 -1825 3962 1423 -2699 2607 3255 -2822 279 4113 -2510 -2156 4279 -735 -4350 2684 1435 -5487
247 -5487 168 3419 -4809 -2654 4281 -2102 -4644 3547 1401 -5053 1433 4078 -3316 -1039 4979
262 4979 -450 -2564 4053 2249 -2986 1702 3500 -2455 -547 3615 -1215 -2611 2602 130 -3718
277 -3718 1105 1591 -4072 -1380 2943 -2635 -2926 2754 -168 -4202 1731 2403 -3511 -77 3943 -1591
293 -1591 -1930 4121 594 -2970 2793 2867 -2689 692 3835 -1815 -1488 3294 -173 -2900 1852 1026
309 1026 -3409 65 1690 -3021 -1594 2304 -1776 -2982 1981 112 -3400 1290 2369 -2769 -441
324 -441 3688 -1100 -1880 3496 1041 -2525 2329 2911 -2306 178 3550 -1310 -1739 2959 170 -3082
340 -3082 1055 1270 -3113 -604 2005 -2309 -2218 2032 -731 -3239 1310 1193 -3025 286 2829 -1796
356 -1796 -1118 3367 -35 -2240 3041 2169 -2656 1127 3430 -1886 -817 3463 -315 -2704 2324 890
372 890 -3083 373 1858 -2814 -1560 1890 -1277 -2480 1638 129 -2705 461 1435 -2088 -376 2308
388 2308 -898 -1183 2340 859 -1858 1759 2077 -1383 235 2711 -680 -1321 2372 340 -2425 1179
404 1179 1131 -2443 -492 1611 -1928 -2053 1669 -907 -2681 1272 609 -2609 79 1767 -1796 -824
420 -824 2533 -381 -1424 2383 1140 -1490 1613 2249 -1439 322 2635 -567 -1214 2184 334 -2290
436 -2290 830 1130 -2222 -739 1572 -1571 -2114 1486 -282 -2639 440 1150 -2154 -430 1960 -977
452 -977 -1210 2289 468 -1711 1732 2013 -1481 519 2697 -878 -745 2596 2 -1749 1426 830
468 830 -2172 110 1470 -1822 -1236 1443 -1071 -2241 1159 165 -2333 133 1244 -1994 -721 2035
484 2035 -380 -1244 1908 805 -1329 1215 1845 -859 394 2010 -520 -776 1802 477 -1631 907
500 907 1098 -1963 -454 1495 -1459 -1563 1278 -512 -2250 779 362 -2269 22 1561 -1467 -742
516 -742 2070 -316 -1271 1864 1053 -1195 1083 1865 -988 -86 2052 -109 -1003 1589 490 -1618 566
533 566 1197 -1790 -685 1128 -1214 -1823 941 -207 -2248 316 939 -1937 -558 1731 -850 -1266
549 -1266 1854 618 -1453 1324 1920 -1166 403 2371 -627 -761 2108 292 -1279 1608 858 -1851
565 -1851 149 1371 -1468 -996 1066 -1025 -1959 711 128 -1791 152 972 -1332 -734 1102 -343
581 -343 -1049 1293 814 -1020 504 1627 -481 -199 2026 301 -938 1454 777 -1426 463 1386 -1367
598 -1367 -544 1338 -1204 -1619 1152 -241 -1959 520 621 -2136 -203 1404 -1358 -532 1479 -331
614 -331 -1124 1506 736 -1237 901 1462 -661 132 1392 -47 -498 929 608 -1028 188 862 -827
631 -827 -922 850 -249 -1542 190 225 -1828 -276 1193 -1267 -1084 1264 -492 -1354 1215 768 -1321
648 -1321 762 1500 -1184 169 2053 -394 -602 1757 187 -992 1402 840 -1364 172 810 -1065
664 -1065 -730 696 -562 -1208 295 -278 -1276 -319 284 -767 -783 632 94 -841 257 664 -344 173
682 173 1432 -95 -382 1544 304 -733 1303 944 -938 360 1068 -1124 -486 1159 -694 -1332 733
699 733 -270 -1486 432 348 -1555 -373 760 -1075 -585 1052 -360 -545 889 462 -629 568 1030
716 1030 -126 239 1150 236 -264 648 854 -586 177 810 -566 -534 688 -114 -1304 190 196 -1422 -547
735 -547 750 -1083 -911 931 -627 -1208 1038 470 -1193 597 1093 -968 303 1521 -368 -368 1400
752 1400 330 -842 925 562 -688 104 739 -664 -570 437 -348 -883 44 -12 -1088 -404 342 -543
770 -543 -739 529 -5 -886 345 648 -474 289 1074 -145 -64 1135 293 -494 882 720 -661 503
788 503 967 -569 -254 865 -479 -711 453 -77 -1246 199 66 -1076 -249 573 -626 -483 644
805 644 -278 -562 582 556 -408 367 847 -8 -95 962 389 -434 603 796 -532 160 848 -386 -708
824 -708 639 -198 -950 185 101 -1230 -189 346 -892 -492 546 -427 -907 653 195 -847 466 787
842 787 -336 220 973 27 -246 924 517 -496 581 679 -394 -56 616 -178 -622 463 -60 -843 -10
861 -10 92 -910 -437 166 -591 -659 438 58 -699 254 473 -571 114 759 -279 -108 999 374 -376
880 -376 769 459 -257 229 803 -319 -359 598 -180 -619 215 -61 -669 -199 87 -875 -434 252 -421 -640
900 -640 281 -113 -726 369 533 -236 -20 780 19 68 744 374 -298 502 718 -359 62 673 -173 -484
920 -484 494 -213 -882 -9 125 -889 -408 247 -673 -725 343 -221 -923 331 131 -636 129 682 -268 -22
940 -22 851 1 -292 686 599 -265 379 716 -203 -17 591 -109 -389 168 -93 -571 -102 -63 -710 -358 130
961 130 -589 -642 213 -60 -435 142 235 -420 129 542 18 28 641 221 -13 530 530 -44 31 560 -96 -279
983 -279 543 8 -648 325 154 -702 -123 239 -755 -491 485 -445 -491 303 -319 -533 213 316 -438 -9 629
1004 629 -173 -79 610 275 -115 729 550 -121 145 515 -199 -153 367 -94 -445 16 57 -664 -324 167 -580
1025 -580 -550 118 -78 -657 308 316 -687 193 621 -116 -221 793 243 -171 619 445 -149 445 491 -269 -92
1046 -92 451 -92 -144 232 -41 -653 64 98 -653 -326 146 -420 -496 168 -145 -294 251 167 -331 -44 325 84
1068 84 2 633 357 -83 480 509 -23 150 777 90 -199 374 226 -315 205 1 -565 43 163 -604 -474
1089 -474 160 -396 -553 259 -242 -446 1 432 -239 209 484 -151 -85 634 365 -147 421 421 -58 273 516
1110 516 6 -273 321 65 -350 107 137 -290 -282 151 -428 -624 -3 -152 -526 105 141 -631 -24 504 -152
1131 -152 -45 603 118 -351 607 411 -101 375 541 4 -7 345 -44 -230 346 -119 -375 -102 -70 -484 -206
1152 -206 -74 -382 -439 -5 -57 -452 -102 164 -308 -171 271 57 -90 189 465 -17 149 436 136 160 575
1173 575 34 -102 468 32 -466 160 122 -589 -111 133 -601 -267 76 -312 -562 135 -117 -413 20 89 -111
1194 -111 -29 351 7 -78 496 170 -136 457 369 -93 338 314 103 -160 342 153 -175 -33 183 -357 -275 154
1216 154 -256 -604 5 -213 -407 -93 108 -417 -194 260 -278 -178 476 355 -228 356 335 -140 233 562
1236 562 -47 51 536 -54 -187 204 29 -402 7 67 -100 -134 147 -387 -397 -52 -70 -357 -197 97 -194 -7
1258 -7 271 133 83 135 175 -110 233 453 -44 163 396 106 -97 319 40 -320 196 84 -369 -86 72 -277
1280 -277 -201 128 -246 -353 40 -209 -326 -91 261 -230 -28 344 -4 -132 342 105 -29 238 314 -140 176
1301 176 512 89 1 349 156 -259 66 -8 -282 11 76 -384 -406 -4 -147 -549 35 92 -296 -44 148 -227
1323 -227 -353 366 83 5 311 179 -13 226 422 215 19 356 118 -101 277 262 -253 40 219 -179 -271
1344 -271 67 -208 -350 -77 -25 -491 -41 66 -104 -136 147 -193 -247 251 311 -10 141 408 -5 236 390
1365 390 77 72 322 191 -126 127 238 -288 -53 67 -339 -290 80 -97 -308 68 -55 -374 -57 157 -259
1386 -259 -148 166 19 -209 371 80 -103 88 440 -54 183 523 13 102 394 -7 -59 35 102 -185 -133 136
1408 136 -377 -348 -21 -165 -392 -20 42 -297 -224 1 -167 -92 139 173 -131 217 259 5 104 373 -78 90
1430 90 375 71 117 124 193 -45 47 193 -129 -122 -18 -286 -257 -215 -101 -363 -127 -25 -389 -207 172 -49 -116 171
1454 171 276 -58 70 324 32 110 377 143 -10 138 182 -63 143 166 90 -104 -17 -197 -205 35 -230 -306 -53
1477 -53 -88 -377 -130 98 -209 -157 24 66 -39 120 74 54 242 356 52 4 443 77 59 341 32 0 51
1500 51 126 -239 -289 70 -102 -333 63 -88 -500 -131 29 -235 -146 37 -51 -181 262 57 -289 13 367 24
1522 24 37 323 142 41 332 49 20 132 52 -25 114 34 -64 -184 -97 -31 -162 13 -164 -210 -248 -73 -216 -76
1546 -76 2 -134 -55 164 140 -100 156 275 -38 163 241 276 39 285 267 -19 162 192 -84 70 -17 -229 -133
1569 -133 -148 -231 -331 -2 122 -482 -150 42 -343 -121 36 51 -120 219 179 38 290 203 -138 74 364 221
1591 221 133 227 321 -107 -3 144 -14 129 -13 -19 -234 8 -38 -255 -147 -122 -452 -286 26 -70 -206 -65 -192
1614 -192 -97 67 224 -89 95 265 132 219 355 259 -54 203 211 -60 93 279 -215 -194 35 -136 -189 -77
1636 -77 -158 -415 -167 -66 -202 -223 -29 97 -183 72 -33 8 -69 2 134 151 289 126 145 182 85 101 59 220
1660 220 -150 -48 45 -48 -168 39 -62 -283 -37 -97 -393 -201 31 -343 -41 51 -115 -15 131 83 -185 232
1682 232 235 101 24 234 94 130 207 110 -36 31 191 16 -56 -88 -91 -148 -96 -111 -178 -107 -24 -91 -138 -36 -107 -375 -84
1709 -84 62 27 10 214 -68 80 280 -51 7 433 90 -45 163 133 71 -38 58 -83 -75 17 -187 -141 -118 -36
1733 -36 -15 -44 -123 -166 -168 -96 -160 -180 -133 13 -107 -119 124 -47 42 63 48 -93 223 105 140 131 48 -130 -73 111 29
1760 29 -129 60 57 -12 14 -67 -159 -26 97 -272 -31 82 -16 -260 89 52 -48 -9 124 -99 -39 196 207 134
1784 134 32 175 108 -39 124 142 160 156 -98 41 128 29 -114 -94 -19 -257 -250 -140 -176 -210 98 -121 -183 -2 232
1809 232 141 -137 191 -81 190 135 11 -27 178 65 -15 159 159 50 -145 -24 -38 -244 -132 85 -184 -81
1831 -81 -144 -240 -46 38 -52 -284 -135 146 10 -81 123 46 135 152 108 -70 263 170 127 59 93 5 93 72 5 -39
1857 -39 162 78 -165 -3 -159 -270 -138 -15 -76 -242 -80 -120 -268 -63 -30 -20 11 79 136 -72 189 170 91 204
1881 204 134 33 48 249 -90 47 240 115 -42 12 -137 -231 -112 97 -140 18 -87 -343 -109 -163 -108 -235
1903 -235 12 -86 -118 33 -7 96 -126 8 -6 -223 121 -26 -112 162 395 0 71 50 152 -212 25 -29 -182
1926 -182 -203 -238 -136 -54 -21 -104 -84 67 10 126 11 86 18 42 197 128 53 199 244 -81 214 57 126 166 280
1951 280 78 -3 137 73 -146 -173 46 -216 -155 -41 -210 22 -42 -54 -182 -67 -114 -201 18 95 57 -9 17 15 -13
1976 -13 86 132 -100 129 144 89 39 194 74 -2 -141 -47 -64 29 -71 -226 -138 -208 -143 -231 24 -88 21 43 9
2001 9 -48 -22 182 92 113 172 3 60 169 320 151 116 244 -78 -82 -65 -48 79 57 -181 -141 -110 5 -148 -40
2026 -40 -26 5 52 -10 -30 14 -71 106 -65 31 126 30 -32 49 33 -24 23 177 -6 -31 36 73 100 35 -80 -54 -63 -98
2054 -98 -163 -80 19 -41 -205 -144 -106 -77 76 -31 10 4 9 55 -97 40 53 70 250 21 106 305 253 97 -22 5
2080 5 -118 -219 -58 18 21 -29 -47 -133 -94 18 -6 13 18 -64 -25 -153 -130 -181 15 63 -166 -39 -12 317 32 175
2106 175 149 -8 -57 98 117 -42 301 71 -58 155 -10 -29 -76 -60 44 38 -5 8 -184 -119 -80 30 4 -114
2130 -114 -164 -86 -21 114 70 37 81 24 186 41 192 66 154 61 7 -23 -99 -103 155 -148 -184 -75 -130 -78 -100 158
2156 158 -83 -140 -27 101 -20 62 110 -212 -51 42 -5 8 15 52 -17 8 163 -84 -49 29 -69 -73 66 -106 -21 107
2182 107 15 -119 -197 -134 67 -42 27 -35 -79 -37 21 -18 27 106 24 -156 93 74 -106 115 51 213 174 126 94 15
2208 15 46 -47 40 -55 28 -18 -80 -96 -116 -243 -48 -153 -65 -47 35 -154 -184 37 -60 -92 26 104 66 63 37 70 66 -18
2236 -18 91 6 4 232 -132 152 176 121 -1 25 -54 -85 -74 -131 -106 -97 -4 29 -14 -166 21 -86 16 -130 -113 65
2262 65 35 -69 89 55 98 113 -23 -100 163 74 -4 28 93 27 -97 132 -70 -111 -85 -8 -93 -172 -163 -36 -70 -119 174
2289 174 -21 -20 3 -14 -55 86 54 -157 -44 67 -49 50 183 -63 23 139 151 -1 119 111 13 164 -37 28
2313 28 -8 119 -56 -58 -39 -118 -60 -138 60 75 154 153 70 -8 177 96 -54 74 66 108 64 -32 194 -147 106 94 -39
2340 -39 70 -56 -30 -165 -57 1 14 16 -79 31 -108 -169 -134 65 -65 42 45 87 63 -184 64 26 96 27 -2 -110
2366 -110 -35 37 135 108 130 72 135 122 -17 -86 -54 -76 78 -123 -63 -61 -75 -24 125 2 52 107 83 49 -119 93 -44
2393 -44 81 118 37 -53 101 -33 -30 -30 93 -17 146 89 -97 99 -186 7 -39 39 -121 -147 -36 -86 -100 112 48
2418 48 -73 60 -12 -64 -41 246 47 20 -61 -6 92 37 123 20 50 -8 -110 -65 -74 67 26 -10 -21 3 -97 -50 6
2445 6 -88 -81 -21 -10 53 -37 -153 75 44 72 -70 -133 26 -5 22 114 90 44 0 -54 35 34 73 -47 -78 -73 -39 -171 85
2474 85 -9 -67 -39 -193 76 -75 -158 -163 -287 -76 31 -10 43 7 35 25 36 -75 108 52 147 62 19 -90 74 153
2500 153 198 -66 12 -19 -105 48 -44 -114 116 -16 25 -99 -8 123 -93 -34 -125 -50 -3 -39 -16 11 7 35 92 19 212
2527 212 23 -53 -87 166 -14 103 0 -96 -33 103 -48 -52 -5 -30 -1 40 -112 -38 -66 80 -226 61 19 98 55
2552 55 30 -64 -36 33 -111 123 69 163 13 96 62 35 87 -233 -23 -158 37 -73 -71 -22 -136 -37 -126 29 39 27
2578 27 30 -120 48 80 -170 -9 -8 -134 75 -62 -26 31 139 139 102 7 -130 61 16 -63 3 -57 -46 3 -128 98
2604 98 -58 20 -41 -250 -158 51 -56 2 -134 23 118 -57 38 -48 -127 184 -5 123 -55 -5 81 63 186 257
2628 257 41 30 13 20 8 16 -84 -135 44 5 27 -167 -70 -26 25 -79 -35 -18 -54 -61 70 47 -73 36 45 118 27 -3
2656 -3 140 16 -106 160 -55 -62 98 -90 -70 50 120 71 -82 -93 122 14 -1 -4 -70 -3 24 9 -30 142 60 76
2682 76 22 -72 -10 22 -32 18 28 19 49 85 -15 -17 31 64 106 38 -39 43 -19 -232 106 22 -19 140 -101 -58 126 -92
2710 -92 127 79 -99 33 -16 48 103 103 63 32 -146 24 133 125 10 -81 -129 -18 77 69 30 -14 -36 -132 47 83 161
2737 161 -192 65 -98 -76 -108 -206 1 113 213 -67 13 155 42 54 87 -24 -124 32 122 29 -58 -79 88
2760 88 -73 -100 0 -8 -30 -7 -122 -167 -54 -38 -223 -71 61 95 -205 7 51 -20 116 176 -55 -32 37 124 98
2785 98 58 1 -70 -14 -100 16 -11 -175 6 197 -46 -15 -6 -101 -68 103 -170 -30 -126 198 -93 7 29 -118 -18
2810 -18 -104 26 -171 -9 162 69 21 87 2 82 -3 75 61 -116 56 14 9 152 -10 77 -57 49 122 -91 63
2835 63 -237 74 -94 17 40 -89 74 145 -89 -99 1 117 -131 58 -23 22 25 -23 -25 119 -31 -66 189 -78
2859 -78 6 -163 26 -5 -58 71 -136 -119 -162 18 -32 54 -162 30 -50 57 35 142 85 -128 62 156 119 105 -81
2884 -81 -11 31 -29 112 -11 18 185 86 16 -157 85 -61 -9 -103 -16 22 18 73 -5 -31 20 28 154 17 -123 -167 124
2911 124 -11 75 214 36 -200 -47 14 -77 37 87 -294 33 9 -67 108 -10 32 33 1 53 -154 53 33 24 210
2936 210 -129 52 -25 239 148 -95 -54 -42 97 123 87 54 118 132 5 -140 -76 -20 107 -93 80 240 -90 -3
2960 -3 -15 -10 -268 22 -283 6 -45 49 -15 40 1 -60 27 68 109 89 41 43 25 93 133 14 72 19 100 19 103 -120 35
2989 35 -79 -34 -70 -13 -32 95 -86 -40 -8 80 -83 -47 25 -8 -26 106 -62 -54 122 -30 8 -25 63 138 94 -23
3015 -23 -91 68 95 95 -15 86 -106 -39 67 -24 108 30 40 -1 10 -115 49 -23 173 38 79 -67 -97 -147 22
3040 22 82 -28 134 115 58 10 25 93 -19 164 64 -96 -66 40 107 139 -109 -79 26 202 -22 -8 32 -97
3064 -97 65 -73 145 87 19 -31 53 -5 58 -38 87 173 -13 38 -45 37 -38 15 -56 -37 -16 70 -38 -6 -37 -84 -1
3091 -1 -43 11 22 -101 -32 18 -101 8 -45 79 22 67 -75 103 -8 18 175 -24 9 -108 -54 24 -37 55 24 29
3117 29 -106 -163 -8 53 54 -20 -51 -43 37 -74 -13 46 -25 -57 18 -17 -39 20 11 226 -4 142 90 197 -104 -79 -144 -90
3145 -90 60 24 -95 45 124 31 -134 6 27 -48 -31 -10 -137 -26 153 35 -64 8 -184 -20 -50 -88 14 54
3169 54 75 5 106 -139 22 20 46 -39 45 21 99 19 88 28 -9 -93 -20 171 68 41 -115 -137 117 -53 -8 -181
3195 -181 -67 -85 -10 -144 145 -36 -105 -42 15 197 58 -21 24 -181 -34 25 -108 -56 -47 -29 183 99 -154 8
3219 8 -102 -14 -64 -5 102 -69 -86 -102 130 -54 -124 68 27 -37 79 -83 157 37 71 -31 51 87 48 1 92
3244 92 21 3 137 -141 -43 85 53 -153 34 9 -24 57 -83 22 -8 -7 -5 -52 -106 -77 96 -87 96 221 133 -55
3270 -55 89 105 55 0 -96 39 28 161 90 89 -77 -62 -51 65 36 -23 43 33 -26 -29 62 -91 17 -13 81 -110 -155
3297 -155 84 -96 -132 -8 135 79 188 31 -148 -81 258 127 -94 -69 37 -64 -7 113 23 22 37 -120 85
3320 85 -39 -5 30 -144 -6 -107 -1 46 -98 32 101 -178 61 55 5 -23 122 104 59 219 42 -12 -138 130
3344 130 -121 -121 -81 26 -75 41 52 39 36 43 -12 7 -14 -17 -145 51 75 150 129 -7 -24 -6 9 -136 -68 21 66 37
3372 37 -27 9 3 -111 -12 3 104 -22 -21 -3 20 -1 -35 28 -23 74 -107 39 -10 124 -190 -53 82 -34 98 -139
3398 -139 -69 15 43 -46 -42 -20 141 -102 132 -38 -22 -53 49 83 -82 4 -107 57 7 -65 -33 -140 -141 65 -80
3423 -80 -81 -44 -121 -94 52 2 13 -4 -110 150 -205 -49 25 127 61 -143 -171 -100 70 -111 137 83 28 -137 -122
3448 -122 7 136 174 -18 79 -40 -30 141 27 -13 -30 19 -58 56 -5 40 -51 -22 106 22 47 -162 -35 12 72
3473 72 28 0 -48 42 -54 25 24 115 -68 110 53 34 57 37 64 158 33 -72 -14 60 4 2 -75 177 224 -112 -111 -28 -118
3502 -118 -106 27 14 -109 -3 -37 -40 -81 -54 -47 1 32 -100 58 -19 -69 -118 151 -10 -31 3 -139 0 -33 -14 -17 111
3529 111 -37 28 -59 86 84 49 25 22 -108 -48 -12 -121 -95 86 65 105 151 -40 -34 98 -36 109 -32 30 67 103
3555 103 11 -23 -227 25 6 -22 -3 -11 25 14 50 -17 -168 -33 -104 -44 -46 -104 -50 196 -228 52 70 65 -31 31 1 17
3583 17 49 11 -184 128 114 34 -226 14 -100 -150 -65 -13 33 48 20 29 60 107 -33 8 99 -47 38 -172 -3 37
3609 37 87 -88 -114 -76 -29 61 14 -29 -14 -66 -150 -44 -66 80 7 60 -191 78 235 5 194 -11 -36 24 128
3634 128 3 -9 107 -5 -60 129 -87 20 -31 23 81 -76 62 2 67 90 138 -73 130 -57 -133 20 -114
3657 -114 9 -149 158 -89 60 43 -5 167 21 -111 -1 -120 -30 5 -31 -59 -109 33 1 -18 245 105 83
3680 83 29 34 6 44 -39 14 -87 16 2 49 7 87 123 -30 -105 19 169 60 39 -117 -13 -17 -21 40 78 73 12 -43
3708 -43 -35 -68 -96 -117 -99 -19 -143 -7 69 -78 40 -64 -139 -16 15 -39 123 14 -18 86 -18 213 46 6 -7
3733 -7 158 -12 -64 -58 41 -115 59 -159 69 -2 -29 158 -6 4 -43 128 -109 -91 158 105 88 30 -40 4 35 -41
3759 -41 65 -98 35 -36 -76 33 -11 -90 -3 -25 -28 -56 103 137 211 19 79 -45 188 12 -29 56 16 -73 -32 -5
3785 -5 24 1 56 -136 30 151 -151 89 171 83 21 -34 57 91 -27 92 -3 -13 -115 -98 -5 64 36 28 -21 -28 -44 -2
3813 -2 8 -59 -146 129 77 35 2 166 -91 140 -65 63 -44 -36 62 -30 105 -62 51 179 -19 -1 59 -38 29
3838 29 -11 -69 -28 -47 2 50 27 -77 79 3 11 -5 -15 -81 -8 90 -70 42 -4 91 155 -16 36 69 29 34 28 -105 -24
3867 -24 -76 53 105 -77 -21 -87 110 -72 -140 134 114 -18 11 55 -44 71 43 61 -150 149 -13 123 109 -38
3891 -38 8 131 210 95 -126 -187 -64 -128 138 -80 49 -105 26 -55 -5 17 11 -103 19 -146 49 -8 -61 -55 -98
3916 -98 64 -52 88 107 7 201 -44 -43 -17 230 -119 -101 102 -92 12 -221 119 87 51 -109 15 91 -60
3939 -60 1 146 -20 24 16 23 -22 -45 -45 65 35 -3 143 -11 109 127 -1 6 130 -44 59 14 40 35 13 137 284
3966 284 -197 -93 -75 -34 17 -8 31 -45 136 -18 -83 -18 5 8 -40 98 -8 -136 47 -29 -84 141 40 117 94
3991 94 86 -55 -82 -75 -49 -123 -61 -24 -107 38 -40 -61 27 -57 77 20 40 60 -99 129 -31 26 5 -4 -47 97 -61 -71
4019 -71 20 52 -36 -25 135 14 18 188 127 29 4 134 71 15 77 19 -228 43 -257 -11 145 -176 97 -27 -76
4044 -76 97 -30 66 -27 -120 -29 -57 -64 16 -42 -35 90 122 68 27 55 7 -13 -68 145 129 3 71 -52 174 59 4
4071 4 17 -99 -161 -6 -58 -97 -143 -7 -105 -11 -89 114 95 -72 101 -60 -6 22 144 -158 47 140 -47 52 69
4096 69 -147 97 -75 -112 57 38 135 -64 7 25 15 75 146 -123 -199 -4 4 7 -169 147 20 -74 -17 97 4 -28
4122 -28 44 31 8 5 -16 58 -26 -147 -101 -155 38 20 84 66 29 -37 -119 228 50 -92 -35 126 -26 3 76 -136 -9
4149 -9 36 -13 -98 -27 70 -36 93 55 88 18 30 -84 27 -22 46 107 82 64 191 159 -5 -47 42 22 47 11 92 74
4177 74 -89 72 70 -34 -40 135 -3 -16 70 52 -1 -63 137 55 -14 220 152 -29 3 10 -93 45 50 -60 -62 16 -73
4204 -73 65 10 -157 -19 -157 -12 41 -8 123 174 13 99 -33 80 -1 108 -37 -206 -86 -10 -28 113 233
4227 233 105 56 108 -85 12 -171 41 37 -96 -14 -23 -28 37 -108 -68 -4 105 40 -67 -86 -179 81 17 223 83 96
4253 96 -34 9 -74 -25 6 87 -18 -173 -177 15 -5 -45 27 18 -111 -4 91 47 45 -18 2 10 -155 5 -61 -18 -108 46
4281 46 -24 -14 13 -157 -44 39 -66 -73 -32 4 29 -121 -160 -19 -13 125 72 -36 -5 36 32 -28 -78 48 25 -14 23 -206
4309 -206 -7 -185 93 -132 -177 -14 83 -44 69 -37 90 -112 -6 -32 -134 -73 26 35 65 -144 112 44 -176
4332 -176 200 8 141 12 -97 -14 -35 -133 12 -24 -34 63 50 91 -24 110 50 -105 98 -10 -67 70 -55
4355 -55 -113 10 -134 -139 -51 -22 74 67 10 112 64 -98 -47 58 2 -11 -168 63 181 65 -167 63 66 -31 -127 73
4381 73 35 -71 -42 -60 -108 -107 15 -26 29 -130 -34 -114 -17 -40 -2 194 -55 146 51 -37 102 63 64 79 171 -30 35
4408 35 2 -30 121 -56 115 -82 37 66 -38 -9 120 41 -238 28 -3 51 -102 2 34 18 -107 107 -159
4431 -159 -74 -74 4 -89 -18 -43 145 81 -51 66 -25 7 -52 76 -81 63 -14 24 -156 -44 -31 12 -128 42 127
4456 127 71 60 157 -100 73 116 -38 -89 130 -82 44 25 -14 94 26 -111 1 -75 -39 -110 -57 206 70 -90
4480 -90 -82 113 -9 -69 -28 -68 -49 69 -70 145 46 -81 -137 -165 119 -26 48 35 74 25 35 13 -98 113 -95
4505 -95 83 -50 82 146 51 -35 6 114 -100 -52 -31 -60 97 9 -26 87 158 183 43 -115 -95 38 13 33 0
4530 0 -5 148 -61 140 -78 -109 63 9 -45 130 124 -10 43 -65 -99 3 55 0 -43 29 -73 -15 -222 -108 88
4555 88 38 28 101 -73 -50 5 99 8 -116 -57 -28 117 -49 -17 7 -57 75 106 157 122 127 70 -16 92 110 49 -118
4582 -118 -66 128 -3 131 15 74 -42 -16 -113 64 -155 -59 -107 93 43 -31 -122 -14 -30 -4 -188 -27 61 4
4606 4 96 1 110 -69 -124 -16 -179 -74 98 125 -30 27 120 -117 -76 23 -62 -101 -146 49 65 126 -31 -60 36 79
4632 79 -42 49 59 105 -44 63 -120 134 59 41 -6 -227 -1 -69 -60 128 -30 -54 -106 34 -160 -5 84 18 173
4657 173 -196 79 -66 -92 53 173 35 -39 -10 -73 64 4 -20 -4 -115 -64 112 26 -82 20 128 180 -78
4680 -78 -83 98 91 -31 86 -131 -107 -21 -41 81 -20 -31 123 -83 -109 73 -22 27 -5 -125 -12 102 8 107 8
4705 8 -88 46 21 31 21 93 37 27 -64 -30 179 234 40 120 -17 -61 -99 143 -10 -51 131 7 107 123 54 15
4731 15 -74 -28 -54 29 -87 -55 -43 118 -13 -24 38 -72 79 17 32 -67 -83 17 95 86 36 -18 -104 94 27 5 283
4758 283 188 -77 57 4 -90 -12 -15 -3 -56 -84 -55 16 -99 -12 209 -111 41 89 -80 -30 63 93 -126 -74 -29 -32 -42
4785 -42 135 19 -74 66 2 -62 -9 172 -20 112 134 15 -122 65 206 251 -15 -55 -48 -24 -49 20 78 -63 66
4810 66 -8 -98 8 -133 -89 16 -163 -199 112 -126 -81 -117 -76 -42 60 -55 132 21 200 19 -82 113 -97
4833 -97 -62 28 150 -48 91 50 131 -31 13 -70 -70 71 1 -21 -19 -94 44 153 -111 221 2 -98 -102 176 42
4858 42 -99 -51 3 101 145 -124 -47 152 -18 56 1 76 21 -44 -201 -39 124 124 27 113 -84 -108 -122 52 -193 -116
4884 -116 244 121 232 -16 34 55 -167 16 -21 -50 -40 21 -18 -39 48 5 -6 -180 -73 -142 -73 88 -7 -158 6
4909 6 -143 -16 -157 -55 4 -117 -95 -73 202 -8 52 120 -20 -16 -278 26 26 44 18 81 35 -58 -32 -43 -256 -61
4935 -61 -164 90 197 -101 53 36 30 -42 54 -9 -6 -12 -180 52 -74 -104 115 -39 -30 -75 -30 59 -119 61 2 93
4961 93 -72 83 -14 57 164 -14 130 -7 -28 53 56 22 98 120 -17 -82 -64 56 61 -136 5 -110 24 -117 -31
4986 -31 -44 102 -87 34 175 -134 -6 82 23 79 -65 120 154 -68 -39 -81 -143 84 38 -54 39 -78 80 100
5010 100 41 63 15 -26 -32 80 91 16 -144 78 -59 -45 -110 4 -127 -17 -102 94 52 -137 47 -43 -35 117 -113
5035 -113 -14 -29 -3 -107 17 -24 -108 -84 -24 101 -94 -92 -23 -24 103 67 13 14 21 137 -11 -6 -42 11 26 -18 89 -67
5063 -67 -208 11 -1 74 -61 37 -87 0 -20 -121 -73 -6 33 68 2 31 31 31 114 -77 -124 -2 170 -26 63 20 -4
5090 -4 -68 -1 -47 -10 67 -107 150 -93 -41 112 -61 43 -234 28 -10 -126 17 -164 -89 -95 121 -69 122 7
5114 7 -10 -78 -49 -52 -101 129 4 -198 -34 69 -66 3 -89 132 87 50 19 57 -39 -27 132 -111 -209 -136 -17 102
5140 102 -49 -183 -107 69 2 4 20 -48 -137 138 -43 82 121 1 68 -55 145 44 -26 3 -168 116 8 -130
5164 -130 -62 -6 98 -69 -133 25 179 4 -112 132 8 40 -1 41 31 -94 150 22 102 -126 67 -23 115
5187 115 93 5 -104 93 -3 -205 93 86 -6 -49 -16 -34 17 26 86 -107 -45 -73 -127 110 -173 41 131 -93 -63 41
5213 41 54 -47 -6 -12 45 -190 86 8 75 -25 -33 -16 58 -234 -123 90 39 108 -107 -48 -67 -32 -81 -158 16 61 -70
5240 -70 10 -185 -18 106 35 33 64 -37 104 -4 70 26 -83 130 21 -32 54 -63 162 143 -55 -101 13 27
5264 27 -193 148 -1 63 -2 -103 -2 -15 -13 13 149 -160 -60 66 -60 -137 -150 241 -103 -80 -15 -101 90 100
5288 100 9 -70 27 32 48 -46 24 4 21 102 -33 -72 21 -39 -169 41 -72 31 -110 -37 43 -73 -2 -68 106 97 209
5315 209 -32 122 -7 -69 51 -162 -22 63 -16 -18 63 -16 12 -54 11 62 -97 58 156 -35 30 -96 -76 -35 97
5340 97 81 91 -61 109 106 -130 15 64 -59 110 -148 90 -15 19 69 -82 88 35 -11 -8 109 105 -176 -39 41
5365 41 47 138 59 -28 68 119 69 -111 -95 -124 -48 158 4 61 77 -4 -43 38 14 -24 8 -103 43 -12 -126 0 166
5392 166 -111 -123 125 -67 87 81 65 -47 13 -16 -31 178 -115 137 -41 -205 -126 -15 10 169 59 31 -80
5415 -80 -20 -94 -177 46 4 111 33 -46 5 -10 86 38 -53 -87 4 -52 -54 123 -171 -65 24 96 12 -138 55 162 -59
5442 -59 29 126 -59 -140 276 -35 79 46 69 -7 35 137 -172 -121 -25 -35 46 -52 -77 -40 150 10 -94 -25 -74 -109
5468 -109 19 -49 226 -32 -43 128 -65 2 -184 101 -90 12 77 -80 162 135 -5 -97 -61 26 -88 -47 -93
5491 -93 -78 -20 -79 -80 120 21 -88 135 25 -60 -19 27 107 -102 -30 -87 98 -58 -172 69 93 0 -78 201 -62
5516 -62 11 -8 -210 142 186 -54 79 60 -25 42 -25 3 75 38 221 59 -127 -2 121 135 104 161 99 -2 123
5541 123 26 79 84 -40 -75 74 -76 -42 174 -47 -184 -49 -122 -9 87 -45 191 1 -78 -7 182 -6 18 26
5565 26 16 41 22 -93 49 -37 60 -16 -1 -11 136 78 0 77 -42 2 -45 46 68 57 66 -12 -42 -36 -4 114 18 51 -81
5594 -81 -122 11 18 65 117 90 -179 -17 1 111 0 -26 -90 -40 -85 66 69 -116 84 -95 -63 22 -74 5 -175 119
5620 119 12 -51 -54 -15 -136 141 83 -39 8 38 -7 254 36 -65 20 -45 -106 34 38 -50 -136 6 -35 -18 -16 -1 -9
5647 -9 -46 201 -51 8 -66 -103 28 -32 -29 -130 -38 -6 56 146 34 -46 -11 152 -147 23 51 140 -33 157 0 247
5673 247 82 43 131 -60 -169 74 -47 48 134 -121 114 31 85 -52 107 23 49 -74 90 38 125 -73 -36 -13
5697 -13 119 34 -109 -32 -13 -65 20 -93 -143 235 14 -68 132 -66 -83 -86 -86 -129 157 41 11 102 81 -56 -78 -116
5723 -116 79 -11 -106 57 39 77 46 15 -50 -3 -183 -9 6 -17 -74 -22 -171 1 -122 -3 -41 117 65 4 -111
5748 -111 -27 191 50 62 145 6 20 39 -52 -23 -3 132 -67 -13 154 68 -94 23 -75 -91 -25 82 59 -151 -35
5773 -35 126 91 54 149 -20 -14 -4 -124 -90 -186 40 113 -16 -7 -57 38 13 -56 119 -26 -159 -62 37 -24 -40 121 46
5800 46 43 -4 92 -86 -92 88 46 -104 -69 -104 19 -50 -88 -79 -75 18 -35 76 -42 -68 2 16 4 -24 85 -37 46 190
5828 190 103 -29 -37 24 -6 27 102 52 -74 -40 110 119 -208 117 -16 -251 -32 -47 0 -52 52 45 -9 -14 -60 -73 -179
5855 -179 -90 57 139 -18 -175 -38 -9 126 85 124 93 -127 -146 -77 -20 -25 103 -209 139 -70 2 -49 -131 27 -67
5880 -67 -28 -71 6 62 118 -54 -62 -61 87 6 69 121 96 37 -86 97 23 -106 -22 89 -59 -35 63 -124 -103 61 -109
5907 -109 -43 -13 24 118 158 -59 -80 -65 -108 -9 -110 94 66 -200 12 -150 -27 41 -9 57 -79 39 105 -69 48
5932 48 105 57 21 35 -20 -30 -13 39 71 -100 -24 -135 57 -53 -90 56 17 34 100 -58 -38 -34 -63 59 104 32 182
5959 182 16 -91 -70 93 -38 189 -56 83 -56 -34 131 -113 -13 -25 -49 174 -126 40 -34 76 -29 -158
5981 -158 46 97 53 -56 91 -28 -22 47 -158 34 51 89 0 140 16 -136 13 -39 40 13 48 -33 132 116 47
6006 47 64 115 -107 -154 -62 64 41 45 84 5 4 -197 77 91 51 -127 -17 -18 7 -151 -12 20 32 -46 -29 -52 -124 -87
6034 -87 -42 42 95 -22 -79 23 108 149 -152 32 1 -22 7 73 59 6 73 71 13 29 146 -87 40 -6 7 -53 -6
6061 -6 -19 -25 -133 -71 85 -47 64 -77 77 17 18 95 7 -201 -50 -73 160 108 48 -107 148 2 -99 165 -98
6086 -98 -87 26 26 -77 199 -34 -77 -108 126 1 49 21 -13 0 -53 -75 96 -59 25 -141 33 -132 86 -157
6110 -157 28 -95 -78 -65 -38 53 -35 58 94 79 -54 75 -3 18 -119 8 -49 32 55 -34 -6 124 1 126 127 -195
6136 -195 -122 235 4 146 -41 -22 137 -209 -163 -104 113 257 -16 142 15 182 212 -33 -69 33 -82 99
6158 99 5 -113 -38 206 91 91 69 -48 93 -42 281 127 -51 84 114 -81 109 17 -114 -50 -59 59 14 146
6182 146 30 32 -14 73 78 -49 38 3 12 -48 -172 -47 62 75 125 50 18 -37 -162 -56 -23 -50 65 169 58 -29
6208 -29 52 131 -31 -1 17 45 138 18 176 80 -54 11 159 73 96 69 72 -119 -67 -11 53 -82 -17 86 -57 22
6234 22 -55 15 -183 67 49 130 -121 -161 -2 -4 176 -127 -4 34 -24 -3 219 -30 146 -31 -92 -43 38 -40 76
6259 76 85 -28 -8 3 -16 -8 112 -56 119 104 4 -31 -19 -113 50 -105 -41 113 -92 -8 -51 -64 32 -60 -78 89
6285 89 10 -65 14 42 -161 40 16 -31 85 -1 141 -99 -36 -48 -76 -60 88 114 125 29 137 97 -86 28 13 57
6311 57 33 -93 -7 130 120 52 268 -29 -1 29 87 18 -159 -30 55 16 -22 79 -163 -101 -82 -132 163 85 -18
6336 -18 -10 105 -63 -66 187 124 44 -75 178 -141 21 -98 147 16 -59 -7 43 -66 1 -87 147 -58 -14 -88 -166
6361 -166 -71 40 1 193 -18 58 -39 0 76 4 -70 -85 -24 -25 141 -208 149 -95 -15 94 -19 -91 169 21 -131
6386 -131 -25 103 47 128 32 22 -90 -95 34 19 44 -262 -93 -53 -36 -30 -55 -44 28 106 -43 41 20 29 17 126 13
6413 13 84 -40 43 -72 0 65 -4 -28 -32 139 -63 -55 -46 168 35 25 9 -11 -123 -107 -82 -123 41 61 20 25 140 -74
6441 -74 -20 -126 -171 86 -34 135 48 -11 -6 91 -79 -56 46 -108 -197 -57 1 28 -22 -122 2 62 49 -130 -24
6466 -24 69 59 64 -93 159 2 35 -10 -69 -50 -136 -25 111 -96 -139 -14 4 32 -52 -115 145 28 114 -14 17 27
6492 27 40 -116 -88 -142 56 51 -111 112 -50 -16 72 74 25 -152 73 51 -59 39 127 -20 45 134 -26 43 46 52 95
6519 95 -35 -94 74 126 -73 -18 -83 122 -140 -45 119 -54 100 68 21 87 -30 -75 81 28 33 149 -24 1 87
6544 87 110 107 57 24 -109 -55 7 -88 -18 74 79 -38 -28 73 37 200 -79 114 83 -30 -39 -32 -7 21 2 189 123 63
6572 63 27 40 -180 147 28 -129 -155 153 66 -129 -83 66 15 -78 -54 -61 146 -145 32 64 11 1 2 4 -47 99
6598 99 -48 15 3 -40 117 -86 -221 113 -51 29 64 -10 -8 105 27 -53 -13 125 -15 2 -119 -155 -25 120 -143
6623 -143 92 35 2 144 -44 -48 -25 94 2 -20 -13 -80 -87 25 43 -37 9 -5 -80 -10 64 92 -67 6 -73 -11 -124 75
6651 75 52 38 -205 -86 136 73 -3 -89 83 32 37 -84 -21 111 -1 -99 -57 23 -88 152 4 64 -124 -171 -37
6676 -37 37 31 59 -3 -117 37 -26 -124 0 109 52 221 20 -167 39 -30 53 28 -184 -1 -2 -28 96 -111 79
6701 79 -15 61 -71 -37 33 -36 85 140 29 15 192 -4 39 26 146 88 -11 84 113 -18 66 81 5 -85 -28 -109 -17
6728 -17 57 -47 21 -23 133 -44 -67 120 74 59 -151 3 -6 121 -94 45 91 -160 -44 -61 50 -199 19 -144
6752 -144 131 -50 124 -30 -33 108 41 -15 -10 -38 116 83 -34 14 124 117 49 94 -55 164 -144 -102 105 -107 -210
6777 -210 11 25 27 77 80 -35 103 -111 -100 -85 14 3 34 76 -1 -114 -107 -85 79 58 -22 37 -115 89 -109 -66 163
6804 163 -144 25 -44 -33 77 -3 21 30 27 122 34 -15 -133 105 -29 26 -52 84 112 -16 -19 -8 56 -74 127 28
6830 28 -41 -9 74 77 -23 -40 -34 61 85 -11 -5 96 -30 -39 78 61 -23 -17 23 52 100 23 93 77 110 -122 66 -3 -115
6859 -115 -66 63 -133 -194 -61 0 49 2 10 38 -27 96 -10 -115 -2 89 1 -19 -106 34 -103 38 -51 -42 -17 -2
6885 -2 -110 50 32 146 65 -47 70 -77 -70 53 -57 34 -61 87 -16 5 58 -45 52 19 -30 93 -14 228
6909 228 53 14 87 -149 -62 70 -88 -186 34 18 -62 -19 -5 26 -85 156 106 59 -42 72 -22 107 -118 -10
6933 -10 50 88 53 -85 68 -166 -11 -127 -56 -20 -25 52 -98 -134 -77 -126 -41 39 -26 26 -99 -17 99 33 -35 -18 2
6960 2 -1 27 78 -48 150 1 95 -51 201 -67 -158 122 30 60 17 -119 9 44 -50 -18 7 -27 -18 97 61 123 73
6987 73 84 -12 77 -41 42 111 -25 101 -75 -124 -57 125 15 -4 -16 101 210 37 20 -15 70 -124 -110 -91 -5
7012 -5 119 -29 2 24 -36 9 -40 82 9 -96 6 13 -74 136 -144 25 -70 155 108 -35 -97 88 159 77 28 -33
7038 -33 113 84 -62 -13 48 -10 129 37 7 -39 -5 -50 -66 59 112 33 78 -10 85 56 -35 17 -58 -46 -37 -40 74 78 48
7067 48 -53 -4 -34 -4 54 81 -2 33 14 18 -43 87 -69 -47 -49 37 32 -18 42 -63 -70 -156 -81 142 -51 -10 96 34 32
7096 32 -34 -44 -154 -91 -45 -32 -150 14 -132 -75 128 102 -32 -54 -94 93 -7 90 -70 -30 -16 -52 39 150 -26
7121 -26 -105 18 -67 -124 -146 -26 71 -44 25 4 -29 28 -125 -53 -11 -128 -70 -27 -59 45 -154 94 4 37 18 7
7147 7 71 51 -59 -94 49 61 101 32 -5 50 -63 37 -110 -183 -143 -29 0 -67 -1 -21 18 19 91 38 -59 39 -36 83
7175 83 119 93 64 -21 175 -58 33 143 58 -130 31 132 -99 -31 49 -3 44 0 35 -188 112 -94 -14 -68 -1
7200 -1 -55 -44 34 97 180 -28 94 -20 30 84 74 120 140 18 -31 -19 95 4 70 109 131 16 -83 -67 159 26 -53
7227 -53 -8 47 -92 -152 -143 -43 4 -158 -56 61 -31 -69 -138 21 -58 63 -21 -9 36 10 6 30 12 19 -82 -200 -6
7254 -6 108 57 -33 40 -68 8 18 29 144 90 20 -39 -60 -136 -131 62 -68 -10 26 51 -6 2 27 90 -139 43 -47 -62
7282 -62 108 -38 10 -82 66 89 -25 -89 -6 144 5 49 -126 265 97 -43 20 23 -31 -175 -5 -115 84 -75
7306 -75 -42 36 33 8 98 -47 59 166 73 94 202 -6 116 68 -142 10 23 -5 -108 -37 -133 -83 -110 9 43 -166
7332 -166 51 91 29 -142 124 19 -117 1 97 90 77 -161 7 60 162 2 48 57 -28 -22 -97 108 26 -54 -135 -64
7358 -64 -111 -98 38 -33 166 46 -142 56 107 -15 -82 4 58 51 -1 16 -53 119 90 -21 60 62 -6 -107 70 18
7384 18 -64 -82 -52 69 -41 157 -90 13 -37 -125 -36 -257 -22 -191 -183 51 3 4 9 90 38 16 17 15 126 -19 37
7411 37 -123 26 82 62 45 -159 212 204 44 -3 50 -164 -6 -61 137 152 75 79 -9 -39 -80 -15 32 52 -15 5 -13
7438 -13 112 -69 -13 -44 76 40 52 47 -44 96 -19 -24 -31 62 -41 -48 -48 -32 -30 -34 -51 141 60 57 -20 -92 10 16 -91 -55
7468 -55 164 -77 163 -5 -6 -29 -93 66 -44 -47 156 58 -58 -33 58 102 56 129 -25 19 63 -45 -1 79 91 -178
7494 -178 -51 -19 85 62 -79 -74 29 -75 -138 -33 -86 -163 0 -115 56 41 86 -1 29 152 -81 -18 53 58 -13
7519 -13 42 -76 37 -71 10 -11 -30 18 -5 16 -137 3 38 9 181 53 8 -129 1 -198 -81 -10 -6 -3 -79 19
7545 19 120 124 -47 -18 26 -71 -79 -26 73 36 74 64 43 35 -110 -19 -61 -25 -43 -16 77 70 -91 -109 -3 -55 90 148 14
7574 14 -58 -11 128 92 -52 -46 -53 58 13 27 -19 -136 -54 107 -85 101 -47 34 -75 -21 63 23 -85 -23 37 9
7600 9 137 63 34 122 -34 -30 12 105 41 9 -109 1 -80 2 -52 -216 32 -25 -34 63 45 -140 -30 -118 -79 78 40
7627 40 -49 -39 -136 -10 32 -96 -56 68 177 93 -86 130 153 -20 -96 15 -71 109 47 -76 220 -41 -77 99
7651 99 43 122 51 -3 17 63 67 97 -152 -23 129 -91 71 58 -115 76 62 -217 -20 84 163 -61 -49 -13 -11 117
7677 117 -205 -76 -50 28 150 70 -5 62 40 44 -16 -160 -103 -30 -67 -105 -105 -136 -7 -12 168 109 78 25 -31 -116 81 75
7705 75 172 -4 7 -13 39 -40 -84 50 -89 -14 73 -33 23 -88 59 -4 48 55 68 -21 -66 34 147 -67 -72 -91 -166
7732 -166 -7 64 -36 190 49 132 46 26 220 -118 5 -212 116 -103 30 102 -72 -6 -44 -12 -164 5 17
7755 17 -98 -72 -92 -54 58 -107 -42 29 78 -195 -3 153 25 132 -18 -22 19 105 16 34 -9 -107 14 39 -45 82
7781 82 -40 -106 109 -98 67 124 -52 42 -18 -63 -64 112 -72 152 176 16 4 -46 8 6 81 -121 76 -51 58
7806 58 4 27 141 90 -1 -105 -2 -9 160 146 -89 -27 44 -65 -100 -153 -189 -135 19 29 -86 68 -97 16 -95
7831 -95 121 26 129 32 62 10 -98 -42 -48 2 -61 -143 18 -48 -46 -40 -215 -126 -43 97 67 -112 31 -9 36 90 -95
7858 -95 -169 -18 16 -107 66 170 -10 -19 -51 -42 -2 0 -114 252 75 -8 17 93 -11 -52 25 32 23 51 -177 37 -75
7885 -75 61 9 81 1 -7 -16 94 -12 15 -37 -134 2 180 -28 217 39 62 -29 55 113 11 -56 34 5 -175 51
7911 51 29 -34 49 102 33 -54 -99 -120 88 6 -154 14 65 100 -8 -177 6 -2 -23 155 74 -34 27 107 131 138 -48
7938 -48 48 36 -115 -127 27 49 -230 30 7 112 -41 52 23 -10 97 -76 -45 114 62 -21 68 -24 81 -136 53
7963 53 -10 55 2 177 20 13 -24 139 136 -131 44 72 -61 11 -7 -15 -107 141 -48 10 -41 -206 34 227 -183 -101
7989 -101 53 -86 70 -74 9 5 71 150 35 -113 119 -23 8 32 -96 -104 -27 80 76 78 46 -73 48 -30 -20 -71
8015 -71 3 -65 100 73 52 -73 -89 21 -8 30 88 -122 -98 163 13 91 21 60 -90 -5 59 91 -21 -39 -14 -57
8041 -57 45 -176 47 29 -7 92 -150 -108 78 -66 -50 -38 23 76 19 -46 -114 33 98 7 165 -33 -18 -8 -5 54
8067 54 95 -137 -227 18 -96 -51 23 128 164 71 -111 -8 -124 40 -68 -35 5 183 110 170 -25 89 17 -70
8091 -70 37 -13 22 18 16 98 -31 18 90 -34 86 -18 55 -23 98 -222 74 -68 48 128 -82 76 81 65 -3 -68
8117 -68 -42 -25 165 23 -13 90 29 0 -37 42 -34 141 73 19 86 47 -192 0 29 3 -131 55 -107 72 24
8142 24 133 21 58 -92 -59 -113 -148 -44 139 -94 77 14 -140 -103 -16 7 -61 62 67 50 -153 61 3 3 70 81
8168 81 20 13 -1 -36 18 0 92 -131 -18 157 -143 100 15 -60 57 24 -44 -80 25 144 27 -32 -190
8191a90
$$ Imaginary data points
##PAGE= N=2
##DATA TABLE= (X++(I..I)), XYDATA
0 0 0 0 0 0 0 0 0 0 0 0 0 0 0 0 0 0 0 0 0 0 0 -2 8 -8 8 -8 8 -8 8 -15 16 -16 16 -22 24 -24 31 -32 38 -40 46 -50 55
43 55 -62 68 -75 82 -90 100 -110 121 -133 148 -164 181 -200 223 -249 280 -316 363 -421 493 -592
64 -592 732 -946 1306 -2019 3931 -19016 -40594 35175 10523 -37182 17446 27043 -28369 -1662
78 -1662 26713 -12505 -10039 21557 -1611 -12829 10887 4407 -10637 3575 6499 -6252 -2524
91 -2524 4958 -2989 -6411 2764 3113 -7216 -2253 7076 -5116 -9341 9324 3843 -13479 4841
105 4841 12417 -13381 -4078 18533 -5214 -12045 17235 3354 -16486 10472 11381 -15164 2357
118 2357 13654 -11073 -4555 12783 -5830 -8454 9861 -1684 -10227 6008 2109 -9852 2135
131 2135 5417 -7652 -2772 6945 -2231 -6191 5037 4611 -5766 -63 7863 -1803 -4738 7361
145 7361 4053 -6810 2193 7622 -5570 -3229 8847 -1658 -8005 5832 2265 -9202 1985
158 1985 5600 -7946 -2215 6583 -5432 -4841 7199 -1909 -6736 6113 2067 -7500 3597 6032
172 6032 -6217 -174 8078 -2404 -4065 6657 2113 -5205 3014 5538 -4141 -2100 5560 -940
186 -940 -5239 3312 2195 -6207 -639 3870 -4532 -3520 4251 -1742 -4955 3503 1007 -5211 2069
201 2069 3587 -4506 281 5512 -2717 -1905 5999 54 -4031 4959 2983 -4951 1781 4934 -3928
216 -3928 -1645 5162 -1404 -4593 2905 1143 -5192 -5 2750 -3724 -2670 2962 -922 -3805 2094
231 2094 1321 -3733 886 3425 -2321 -786 4507 -602 -2465 4218 1762 -3740 2555 3859 -3845
246 -3845 -195 5008 -2441 -3244 4276 -75 -5144 2088 2446 -5404 -793 3968 -3500 -3579 3583 -537
262 -537 -4485 2216 2414 -3613 67 3815 -1693 -1335 4129 370 -2243 3037 2275 -2552 1257 3430
278 3430 -2089 -1377 3792 -649 -3192 2565 899 -4397 317 2620 -3635 -2183 3044 -1667 -3632
293 -3632 2460 946 -3881 771 2828 -2780 -788 4030 -688 -2117 3360 1449 -2408 1918 2930
308 2930 -2099 77 3207 -1281 -1693 2678 -367 -3035 1476 1187 -3469 -425 2101 -2920 -2238 2662
324 2662 -1081 -3468 1952 1141 -3394 423 2952 -2166 -950 3541 -141 -1920 2891 1688 -2257
339 -2257 1337 3105 -1446 -630 3069 -720 -2170 2160 586 -3028 531 1679 -2892 -1227 2166
354 2166 -1884 -2892 2164 -22 -3326 1294 1893 -2891 -537 3251 -1226 -1794 3487 788 -2557 2087
370 2087 2665 -2122 449 3237 -1294 -1412 2769 339 -2462 1372 1081 -2948 -356 1759 -2117 -1791
386 -1791 1853 -905 -2514 1155 542 -2452 188 1950 -1608 -796 2517 0 -1626 2268 1372 -1916
402 -1916 1125 2564 -1313 -297 2804 -346 -1736 1872 815 -2415 825 1464 -2479 -954 1819
417 1819 -1632 -2044 1321 -486 -2597 954 979 -2282 -8 2011 -1336 -862 2552 68 -1449 2004
433 2004 1388 -1529 911 2479 -1111 -572 2272 -154 -1567 1751 941 -2271 -39 1431 -2071 -1572
449 -1572 1586 -967 -2636 1118 481 -2550 324 1534 -1845 -843 2104 -562 -1453 2220 769 -1776
465 -1776 1382 1821 -1447 64 2625 -537 -1054 2046 336 -1930 992 1133 -2244 -558 1387 -1763
481 -1763 -1662 1336 -445 -2333 572 361 -2065 -55 1506 -1088 -814 1827 -126 -1196 1688 1384
497 1384 -1289 814 2053 -801 -114 2283 -85 -1236 1583 489 -1929 602 1113 -1792 -717 1444
513 1444 -1506 -1996 1168 -373 -2083 473 701 -1862 -295 1374 -1255 -844 1875 263 -1327 1292
529 1292 1422 -1132 787 2157 -495 -423 1848 110 -1199 1377 890 -1780 5 1309 -1565 -1200
545 -1200 1495 -737 -2160 726 310 -2355 -121 1444 -1659 -752 1756 -539 -1553 1915 904 -1501
561 -1501 1143 1895 -1143 1 2138 -388 -733 1826 206 -1579 898 976 -1577 -92 1194 -1180
577 -1180 -1313 832 -199 -1595 130 371 -1640 -573 1042 -835 -1087 1325 360 -1344 1029 1304
593 1304 -1009 252 2165 -370 -544 1935 151 -1332 1484 1062 -1623 351 1065 -1768 -669 1341
609 1341 -1153 -1474 945 -438 -1966 406 525 -1549 -303 1207 -827 -684 1194 164 -687 948
625 948 1052 -436 231 1469 62 -551 1389 777 -990 496 1061 -1131 -226 1233 -791 -1542 836
642 836 -219 -2053 560 443 -1962 -419 1176 -1392 -739 1515 -499 -1280 1263 654 -1220 888
658 888 1596 -731 231 1652 -229 -329 1410 299 -782 664 553 -827 -185 647 -621 -917 101
675 101 12 -1391 -359 341 -1015 -817 574 -437 -1112 763 488 -1023 416 1221 -647 60 1765
692 1765 -299 -340 1710 160 -818 1236 785 -1169 484 1007 -1107 -271 959 -952 -1180 612 -213
709 -213 -1293 55 122 -1195 -300 671 -571 -332 680 5 -394 675 886 -301 103 1059 229 -279
727 -279 1200 718 -710 586 1118 -752 -425 1051 -536 -1072 769 -261 -1380 323 441 -1678 -195
744 -195 902 -1057 -859 1015 -313 -1152 841 674 -930 552 975 -486 304 1011 186 -120 935
761 935 493 -449 345 493 -493 -314 640 -313 -703 250 -65 -1007 -164 426 -836 -624 473 -571 -938
780 -938 762 262 -943 294 974 -579 348 1317 -129 -252 1406 343 -350 1069 597 -619 59
797 59 749 -525 -261 682 -557 -911 220 -43 -920 -56 45 -923 -533 434 -379 -612 509 176 -661
816 -661 406 874 -275 148 1147 119 -251 945 497 -483 564 867 -560 -281 747 -474 -678 458
834 458 -133 -1149 -25 214 -944 -303 589 -631 -657 533 -153 -722 444 395 -528 333 716 -203 -10
853 -10 959 291 -359 609 757 -370 198 724 -373 -410 469 -122 -627 144 145 -909 -204 297 -850 -756 341
874 341 -285 -712 317 90 -661 296 583 -330 -51 889 -137 -178 919 325 -301 709 771 -303 277
893 277 645 -359 -482 502 -259 -683 63 18 -881 -109 67 -629 -475 377 -481 -720 369 103 -517 174
913 174 596 -298 57 752 89 -89 693 401 -325 296 703 -190 -132 765 -249 -563 453 -42 -801 -65
933 -65 188 -855 -249 270 -569 -594 293 -226 -731 398 362 -685 75 789 -108 -82 843 221 -315 687
953 687 341 -353 270 453 -263 -177 472 -181 -469 318 -43 -666 -90 147 -585 -530 186 -281 -625 84 81 -606
975 -606 -20 416 -90 -54 717 154 -73 578 410 -229 398 616 -252 231 741 -170 -223 458 -239 -716 106
996 106 29 -829 -335 230 -668 -561 136 -252 -473 343 103 -402 268 266 -57 159 655 209 47 612 287
1017 287 -228 318 652 -258 13 394 -83 -426 344 12 -711 -14 224 -608 -413 252 -405 -746 151 -65
1037 -65 -628 80 369 -679 88 620 32 -35 656 117 -235 612 506 -69 228 650 -88 -132 514 -68 -400
1058 -400 128 2 -408 -159 105 -331 -430 230 -350 -352 114 56 -485 -106 217 -206 4 657 183 -252 573
1079 573 378 -191 288 603 -231 159 495 -165 -64 391 38 -358 250 51 -659 -258 117 -421 -408 129
1099 129 -254 -448 53 -132 -410 67 218 -217 -78 456 7 51 365 226 -128 307 730 60 -39 388 43
1120 43 -426 340 173 -379 -61 207 -612 -494 126 -298 -648 102 -93 -562 94 98 -368 -76 515 -141 -36
1141 -36 508 227 -125 528 458 -134 115 583 -10 185 341 -23 -260 58 7 -302 -213 -107 -295 -405 21
1162 21 -179 -460 -104 -148 -305 -163 342 -199 -185 474 135 -153 388 467 -238 335 532 -186 41 563 -68
1183 -68 -235 293 37 -332 148 -41 -518 -175 -95 -518 -475 80 -333 -308 -45 -178 -386 -24 198 -102 -110 339
1205 339 132 -135 374 330 -8 168 517 -22 164 219 31 -134 202 230 -332 -61 95 -490 -264 305 -380
1226 -380 -534 56 -87 -524 -9 41 -463 -48 101 -40 -156 504 219 -53 421 239 58 248 421 -1
1246 -1 -59 362 142 -140 121 225 -375 -246 192 -426 -285 -56 -214 -350 8 -57 -508 -49 5 -203 -162 244
1268 244 109 -151 172 223 20 291 429 116 200 377 288 -85 282 139 -134 28 -66 -280 -16 250 -302
1289 -302 -423 -52 -109 -489 -72 -165 -312 -185 177 -122 -24 266 203 5 285 308 -47 204 623 -146 86 339
1311 339 215 -59 227 137 -385 -1 132 -424 -361 27 -175 -522 -116 25 -346 -80 170 -376 -52 142 -146
1332 -146 -209 139 168 -39 250 473 124 234 417 107 53 247 198 -167 159 20 -136 -153 161 -369 -313 97
1354 97 -23 -421 -130 -13 -304 -154 24 -128 -83 122 279 -28 274 199 -77 282 397 30 -9 177 127 -124
1376 -124 337 110 -154 296 64 -170 -63 82 -270 -192 170 -199 -354 -6 -46 -360 -217 222 -193 -203 175
1397 175 60 -91 279 321 -65 173 344 87 188 434 131 34 209 335 -244 -80 162 -145 -260 39 -214
1418 -214 -205 -100 -69 -490 -257 -101 -373 -62 170 -43 -197 267 292 -40 278 289 48 104 216 155 -30 374
1440 374 155 -48 167 226 -82 -33 -20 -156 -261 -40 122 -366 -165 -100 -298 -83 -23 -100 -70 60 -107 -79 251
1463 251 201 38 288 284 192 90 366 147 -58 231 176 -155 148 178 -264 119 112 -245 -226 63 -84 -347 34
1486 34 -182 -220 -178 -55 -179 -67 235 -86 -48 180 195 127 108 440 25 132 455 -3 62 110 200 -71 77
1509 77 160 -104 -122 34 -36 -156 -92 -157 -296 -280 227 -269 -253 119 -72 -180 137 188 -103 146 194 99 87 390
1533 390 -28 -18 8 97 -65 119 76 96 -142 105 -179 4 -9 -56 -360 -81 -112 -135 -176 -196 -317 -209 101 15
1557 15 10 88 86 -185 116 170 180 112 297 96 64 229 253 -10 262 136 -223 -44 131 -99 -132 -96 -95 -353 -133
1582 -133 32 -336 -174 -40 -112 -104 114 124 -62 27 32 -54 90 431 125 50 115 118 -6 124 142 -16 82 132 -131
1607 -131 -174 -7 -38 -344 -19 -248 -235 -71 -36 -177 -183 123 21 -278 205 81 -111 102 87 -65 263 208 50
1630 50 -13 166 250 201 148 189 -3 -142 35 52 -153 -111 -146 -152 -111 -90 -220 -167 -49 -255 -198 90 -55 -157 114
1655 114 50 -66 32 323 86 93 259 256 16 219 212 155 120 181 -72 69 -49 -86 -323 15 43 -237 -192 -116 -231
1680 -231 -134 7 -247 -198 24 -154 -191 30 69 49 -3 274 75 -76 145 152 40 138 246 130 19 148 27
1703 27 -29 73 -120 -291 -7 -111 -179 -252 -72 -132 -246 20 -158 -75 -42 142 -72 159 90 82 95 369 12 5
1727 5 159 157 -155 -48 40 -136 -36 122 32 -4 -95 -3 -201 -103 -103 -238 -126 81 -115 -84 -57 -88 -286 -33 86
1752 86 70 -110 270 30 87 252 -95 -14 35 30 144 15 267 97 29 77 -44 -30 -7 -39 -33 6 -74 -184 -256 211
1778 211 -266 -86 -38 54 -2 71 183 -107 64 166 34 58 182 229 -41 230 139 38 104 48 48 -131 180 -17
1802 -17 -295 9 -36 -171 -60 -162 -204 -182 36 -45 -65 43 58 -78 41 -96 76 11 26 34 15 299 29 132
1826 132 152 234 -43 27 178 -201 15 114 -43 -146 -163 -40 48 -236 55 -186 -266 -55 -2 -196 75 -18 14
1849 14 139 186 -50 6 143 39 77 137 188 26 96 79 41 66 190 -204 0 4 -144 -41 -44 -71 -151 6 -18 -72
1875 -72 48 -13 -111 -91 -70 150 69 -15 48 -4 10 -25 132 -37 127 142 68 35 308 25 -59 -24 -91 -198 150 -49
1901 -49 -276 -77 -3 -83 -180 8 -282 -105 -57 -47 25 67 102 -19 30 203 150 34 144 67 -28 203 65 12 31
1926 31 138 -14 -92 -59 -54 -95 -146 -11 -266 -207 -23 -128 -189 -69 -214 -113 -107 -103 -67 171 25 -80 7 134 68
1951 68 101 151 131 119 180 143 144 136 78 -74 -169 87 64 -286 85 28 -180 -45 -49 -180 54 -93 -20 10 27 101 -17
1978 -17 -189 202 -8 43 -31 114 34 88 64 99 44 -44 -63 -136 68 -51 67 15 -189 -99 -116 -186 -38 -45 -84 -84 -128
2005 -128 3 -7 -23 -50 -91 57 73 229 40 103 230 -73 81 83 52 -22 38 92 63 -80 92 -77 -219 28
2029 28 -56 -76 -7 -102 -217 -212 -121 -126 -287 44 -107 54 28 36 29 -110 -11 18 -8 32 175 114 -24 229 69 -10 218
2056 218 -49 -58 135 10 -182 -32 43 21 -142 49 -220 -104 -128 -129 -113 106 -83 144 -6 -85 -51 81 78 -8
2080 -8 114 132 -2 135 65 46 -51 -128 -13 60 27 -63 76 -44 -34 19 -95 -20 -147 -101 -63 -161 -172 -29 -31 17 111
2107 111 33 94 94 19 98 6 -30 176 94 33 95 22 -66 67 -41 -25 -97 -86 86 -44 22 -40 -120 27 -122 -109 -34
2134 -34 -31 -96 -26 66 71 95 67 -52 107 62 112 236 -52 9 178 -20 107 124 147 -69 -75 17 -233 -50 -58 -125 -111
2161 -111 -171 -164 -56 -44 -35 -167 -130 -24 -56 -55 -36 -8 -145 50 145 -75 -34 236 -47 180 30 -136 72 2 -37
2186 -37 83 -163 -20 -77 -3 -143 -74 -121 -39 -122 -119 -254 49 -110 -34 -66 -15 135 -44 82 123 116 -66 71 132
2211 132 -55 58 7 10 -27 83 37 -31 71 60 -20 104 -222 -121 -81 -101 -106 -94 -112 56 22 -28 -11 -40 -117 10
2237 10 232 -17 -40 62 70 110 162 75 149 53 80 91 132 -247 128 37 147 64 -93 -65 -59 -102 -76 -29 -134 -116 -55
2264 -55 -20 -191 -10 177 -45 -37 18 -86 -18 234 155 106 155 -25 34 -105 21 30 -117 20 133 -12 -136 -111
2288 -111 15 -29 -6 -3 -33 -61 -63 -111 -58 -14 -39 73 30 -78 132 107 44 64 173 41 95 142 140 -66 14 31 -162
2315 -162 -87 -2 140 131 -94 -41 -211 -143 -106 61 -57 -96 102 63 52 -33 -23 -137 111 27 21 151 -114 28 148
2340 148 143 53 117 62 133 -57 -47 73 -101 69 -83 20 -97 -6 73 -112 -41 -111 -4 -137 -3 -97 47 -56
2364 -56 152 -126 93 43 -134 194 65 79 5 73 211 -62 -70 87 -104 103 -42 -81 -63 -39 -11 -111 -101 -88
2388 -88 -28 -10 20 30 115 -178 -209 27 132 -87 -54 94 118 69 99 45 -52 137 -14 20 33 -4 -138 47 71 -47
2414 -47 -110 4 119 -108 -64 35 -25 -194 -59 -34 -88 60 -66 -113 7 -3 -87 37 206 2 -81 1 119 32
2438 32 39 145 153 9 45 -59 -106 53 -28 4 118 2 -69 -229 63 -90 -61 -131 46 -1 -119 48 132 -63 60
2463 60 92 4 30 -94 -14 -22 68 89 58 -7 90 155 35 233 -68 58 2 -52 -33 -10 87 -112 -139 -26 -194 -238 23
2490 23 -150 34 -44 -78 30 -126 -48 30 -26 70 90 119 213 11 145 25 16 1 57 -5 -42 -104 -130 40 -122 20
2516 20 29 71 -32 -93 75 -50 88 104 -17 73 0 -19 61 65 -65 4 -30 165 -37 165 37 141 253 84 -105
2541 -105 106 54 49 -41 -40 -38 -22 18 -104 -178 -150 -44 -134 -9 -25 -84 -15 1 -69 -120 10 11 175 -108 -93 186 73
2568 73 99 145 109 -66 -48 96 8 -50 52 -41 -29 -98 -24 -79 95 -135 -40 100 38 89 86 -130 -61 -1 -14 -51 66
2595 66 -94 66 118 119 92 37 56 38 97 45 73 -43 -28 -215 -111 -70 -53 187 -113 66 106 3 -63 -84 -76 -152 -126
2622 -126 24 -34 49 -80 -74 -18 124 -96 -24 11 -90 -53 49 -78 49 -4 172 -150 38 -17 148 48 -130
2645 -130 23 -152 60 -162 -149 -125 78 -59 -14 53 1 28 79 66 -92 -12 81 90 10 -92 -24 -14 88 -33 80
2670 80 -3 -44 -13 -136 168 -99 -94 14 -15 78 -72 -30 76 -143 -46 -100 102 -51 -28 44 163 -167 -172 80 42
2695 42 -10 134 -101 14 108 -20 -35 30 -132 -13 10 -95 -106 65 37 -80 -85 -37 -58 -66 35 37 -55 50 60 -68
2721 -68 -47 88 -70 -47 -60 -54 90 123 114 -53 17 0 -11 -48 -33 84 152 -35 -65 24 7 -90 -108 -56 14 -190 0
2748 0 -29 3 -90 -10 -167 44 29 -84 -47 24 59 -46 189 -39 107 26 -53 128 -92 109 -11 38 88 70 -107
2773 -107 -101 -15 -37 -71 -1 -170 -25 -44 -34 -98 39 -10 -15 95 131 -53 -176 150 84 -66 114 -63 -123 -23 68
2798 68 145 -97 -65 141 -84 -64 -30 -158 -286 33 -29 1 -60 134 -86 -39 -107 -88 -27 62 -42 11 228 -10 -28
2823 -28 35 163 45 154 93 -32 132 -55 19 51 24 -14 -91 190 -12 -88 -125 32 -76 -162 -15 -50 -96 257
2847 257 125 -113 109 11 -113 -41 -77 199 46 27 16 -69 19 -77 58 65 -59 23 -86 -146 22 -6 -188 -39
2871 -39 9 -35 18 -136 35 138 67 -90 -95 -51 92 99 65 -19 35 32 -56 74 -118 5 112 0 9 33 13 49 -48
2898 -48 75 30 -57 -62 40 3 -147 51 -188 22 -115 -82 83 70 -12 28 -26 -58 6 132 -15 12 150 -83 55
2923 55 -15 -114 -39 68 -55 -38 -48 -40 -1 121 133 -274 52 -96 -99 -168 -104 -56 -122 -118 18 48 -47 -67 98 94 25 -7
2951 -7 -32 0 87 -58 6 34 64 26 -17 -24 79 -43 -21 -196 46 -23 -47 44 -97 -140 -48 -139 -8 -16 -61 100 20 -31
2979 -31 25 -55 -49 -23 40 87 169 93 41 -36 -7 128 0 -5 147 -128 -61 -17 62 -21 -25 29 -66 -16 -35 -73 108 -23 104
3008 104 -105 -93 -21 -15 33 25 17 -121 -42 -49 77 140 -5 -148 15 117 12 154 1 -79 -58 92 -16 -102 59
3033 59 -10 -78 -38 -31 -93 -19 39 -49 53 -131 -114 -21 79 -47 -114 -39 -97 97 44 87 -144 120 108 7 163 -18
3059 -18 -85 -68 -178 -3 -74 -65 15 29 -133 12 -49 30 15 22 -14 110 -104 -74 -10 -53 72 -54 179 50 93 42
3085 42 61 -74 14 37 -34 13 -31 197 -11 -33 7 -84 -62 -322 -113 -73 -98 -9 27 -51 -111 75 128 -55 -28 27 -31
3112 -31 90 -68 19 -195 201 107 79 68 -9 -46 -124 84 1 31 26 -53 26 7 -127 54 -66 69 -19 31 -28 -19 -142
3139 -142 -73 -37 25 48 40 14 -1 -21 7 69 -36 -12 -89 42 -25 -6 60 -29 92 -64 35 -47 -39 -30 -142 189 -176 15
3167 15 31 18 52 14 -51 -16 -80 152 67 63 31 3 68 72 -11 56 46 142 -67 59 28 70 29 -59 -14 -8 10 5 47 21 16
3198 16 99 120 -16 76 12 35 -215 130 149 74 -4 201 -107 211 -180 6 -159 -120 -65 9 132 -53 -12 -19 -39
3223 -39 -98 -28 -61 43 -48 -33 -94 68 -40 -89 -46 -99 -10 -44 -23 -52 -67 90 140 42 19 -48 195 77 98 243 -36
3250 -36 -132 7 -56 16 -33 -51 -60 -12 74 -16 33 16 -110 55 -227 -9 73 70 100 23 -10 -37 -78 22 25 164 47 106
3278 106 152 24 -256 -47 -61 -1 118 -39 -135 125 -12 154 30 -238 20 -61 -16 -27 -209 -51 -11 42 -75
3301 -75 -28 -34 -149 175 66 -54 13 203 61 138 -13 44 -132 17 -19 -28 -88 -37 82 -62 -73 -70 -106 -109 38 -156
3327 -156 0 -16 -157 122 11 20 -100 7 63 -19 -101 -1 -114 -134 160 -87 26 191 162 -78 11 180 146
3350 146 90 -52 -103 40 -184 -66 153 14 2 -70 -52 -46 -18 -16 -34 -66 -109 -182 -7 -42 129 -22 23 -53 21 -76
3376 -76 68 67 -41 -16 -82 44 16 -57 -35 29 90 127 10 40 -64 58 -20 114 -118 -25 -12 -149 23 -106 -20
3401 -20 -35 -32 -35 -81 -157 -111 -146 -135 -148 33 61 28 -29 -26 -62 -20 -8 213 196 -42 -30 -94 -6 -18 34 101 52 7 -57 -27
3431 -27 -5 64 -84 -19 -51 97 -52 32 -51 -15 -145 -33 -44 50 142 -41 -59 -68 -52 -122 11 118 44 -12 24 -19 -98
3458 -98 6 -105 -8 -58 253 116 153 24 4 64 42 56 -103 72 70 -58 -32 60 11 86 -52 159 157 0 -3 -109
3484 -109 116 32 -7 94 -98 107 40 25 -71 -14 4 21 8 -103 -139 74 144 -13 -63 -31 -137 -13 152 -116
3508 -116 79 -66 -141 155 -7 87 70 -39 -61 -24 20 -86 -17 -68 40 59 -2 38 -65 -44 -123 -3 30 147 -143
3533 -143 25 60 -138 -52 -259 -137 237 24 -74 60 54 13 22 -119 -21 -10 -7 -140 27 77 -154 33 -30 80 -140
3558 -140 77 -155 72 99 -181 22 73 -43 30 72 -57 248 -93 -3 45 2 68 -19 56 72 9 -52 40 -155 -44
3583 -44 76 -31 -27 12 -38 -94 -21 -156 -26 -52 -9 -57 -73 37 -17 16 -131 -60 137 124 -48 -33 43 15 108 85 -6
3610 -6 -22 -29 78 8 76 80 -115 26 -2 -122 -96 12 -3 -111 -98 -223 1 -42 42 -46 52 -1 -52 88 143 -59 273
3637 273 11 168 -64 -78 79 93 -183 3 -54 -30 31 -65 46 -144 -22 -4 79 -155 25 -15 47 86 48 -84
3661 -84 63 -27 -74 131 45 81 21 21 135 233 -4 -10 -2 -32 50 107 -9 77 122 56 14 12 95 -69 59 47 45 78 4
3690 4 103 26 -7 160 -88 -118 23 81 116 269 -11 41 -57 -46 -11 -90 -91 -52 87 -83 108 2 -45 74 -56 -117
3716 -117 19 -106 -36 -107 -10 62 111 83 -47 39 -100 22 -38 -46 212 -14 79 -14 50 169 208 -77 -13 -75 124
3741 124 61 -55 79 -83 -211 -31 -251 -10 -48 -109 -9 7 -54 -142 35 -95 32 -44 -78 -35 -50 -86 -38 -110
3765 -110 22 -21 -25 135 -49 144 -84 60 34 145 54 -143 18 -51 0 -52 39 -89 162 -99 -4 -86 -170 -72
3789 -72 49 -146 -48 69 67 62 95 -88 -49 -219 -252 23 -15 67 96 -45 -223 -55 13 -29 58 -74 149 -5 64
3814 64 -18 -98 34 23 100 -35 -20 9 45 -50 3 -26 -23 -8 164 -80 -25 113 -83 22 -30 -109 112 -99 104 -198
3840 -198 25 -99 -68 -96 -30 -81 -46 68 -7 159 -45 15 54 150 -75 -35 44 117 144 -161 72 -107 75 99 -50
3865 -50 -76 38 -11 -63 13 -39 -29 -55 64 -58 63 -73 1 20 -47 -98 9 -41 -53 10 40 -86 -94 -13 144 -127
3891 -127 -90 18 105 156 -17 -86 75 16 6 38 -41 -37 118 22 31 19 81 -68 6 40 -53 -18 151 9 -51 -73 -52
3918 -52 158 -4 169 -34 78 19 -10 20 -130 31 7 140 -80 -153 24 -63 -59 -46 162 -44 -4 85 95 138 127
3943 127 -68 -45 -110 -64 -128 -54 128 12 61 -46 148 56 -12 108 76 67 70 -163 -26 26 -47 -19 -37 49 148 -113
3969 -113 193 50 14 139 -17 -71 -52 -185 20 -43 -107 40 -30 84 -20 132 88 45 -193 15 62 11 11 36
3993 36 -7 0 -24 54 -69 -102 -36 -98 -58 -105 -84 6 42 53 -22 65 -148 -12 13 -98 -76 61 -137 38 -30 -9 -94
4020 -94 99 -3 63 -45 114 120 -64 -120 -92 -151 -14 134 24 -104 95 -101 -62 8 66 -57 75 154 -34 29
4044 29 -87 -20 -20 20 98 -8 102 83 56 28 83 -8 45 27 -50 -95 37 65 -33 120 162 18 -1 81 27 -86 26
4071 26 30 -46 79 166 47 -185 126 53 -35 -95 -22 55 91 51 -51 -32 -11 -13 -28 10 0 55 74 50 -214 133 -70
4098 -70 -65 -1 -142 76 -72 -129 -118 72 -214 60 -4 -66 -24 44 -48 27 -123 -71 10 94 -79 12 61 -42 33 85
4124 85 94 110 -88 -42 259 39 162 13 -61 107 -61 53 -115 33 -76 60 122 58 2 -65 136 54 -67 62
4148 62 59 110 -90 160 91 124 -127 -142 -54 -64 123 0 14 7 52 107 -16 113 -23 -49 46 64 -103 44 119 -69
4174 -69 24 -110 2 -77 -12 14 77 -79 -25 66 49 -117 44 158 101 133 -65 -12 145 -57 -4 -9 61 -94 79
4199 79 13 -78 84 -64 -44 -12 -48 -31 -10 -35 -21 -83 -83 -19 -12 30 -27 -34 -2 -12 47 -14 -65 35 45 31 -1 67 28 -44
4229 -44 49 87 38 133 198 72 48 -71 139 44 9 12 -27 -12 56 17 12 -105 -199 24 -39 59 -22 104 -2 35 -11 -33
4257 -33 7 71 -19 70 48 -16 -90 151 -48 0 -73 105 36 -31 21 3 -5 -114 -90 97 98 64 38 150 -49 -26 97
4284 97 -41 68 -68 -110 4 29 70 176 28 -4 66 -21 -133 98 -169 -32 -6 146 108 -48 -148 64 5
4307 5 -1 -48 37 109 6 59 -40 4 48 -93 29 0 89 175 118 36 -34 25 17 16 117 73 130 -116 216 102 -49 51
4335 51 55 72 -93 -133 -86 50 249 47 46 -81 38 114 -53 -32 -89 72 31 -120 100 -43 -105 5 -190 99
4359 99 -134 61 49 71 -295 62 -76 -108 74 18 17 38 94 26 -144 28 -75 44 -39 199 -35 97 38 99
4383 99 105 0 41 -2 228 -22 62 25 -2 8 -71 193 84 -57 98 -2 -27 7 144 -28 -196 -69 80 -73
4407 -73 10 -66 117 15 -14 101 -113 -29 64 -32 118 34 37 -2 -83 121 -53 65 7 -211 -114 43 32 15 -88
4432 -88 -106 25 -55 179 -75 -25 -42 30 -68 59 -26 -40 -130 -195 25 10 -14 120 36 1 81 -193 -117 2 -81 0
4458 0 170 -113 87 64 90 34 -67 41 64 -37 -59 51 -68 74 -53 89 2 21 45 170 181 -274 -101 39
4482 39 5 -184 77 12 -24 97 20 3 -35 82 -53 -61 114 88 -52 95 -53 -122 104 -28 -101 112 -25 111
4506 111 112 42 -64 21 -39 -32 161 8 -61 15 -52 173 89 15 -151 -81 -16 3 -3 11 -2 -53 -28 -61 -45 -6 52 -121
4534 -121 -43 -91 -136 -19 45 124 207 -71 -125 -76 -63 -106 47 30 83 90 -97 -152 55 81 -6 -36 111 51 -40 -33 62 32
4562 32 -14 -60 -67 -56 -93 -80 93 87 -119 -86 24 -93 47 132 40 69 22 -130 -9 59 12 -89 -104 81 6 21 -30
4589 -30 12 -11 -107 60 87 78 133 -3 65 -31 57 -28 11 189 226 116 35 13 -140 71 -33 36 120 -107 111 49
4615 49 -19 30 -91 -20 -73 19 -13 31 -175 -125 -57 56 -142 125 12 -3 80 77 55 -161 -17 42 74 -84 38 41
4641 41 -65 11 76 81 -84 42 -42 23 94 36 -231 -155 56 -110 -148 19 -169 33 31 55 -121 -61 -142 135 129 42
4667 42 -35 87 119 -92 -25 37 94 -69 5 68 -39 60 122 -94 7 -7 9 163 95 -34 56 25 -100 -87 -50 -2
4693 -2 22 -2 -51 123 -54 -121 68 83 93 73 178 75 77 -90 -187 87 -44 -75 22 91 -41 -20 -90 72 45 -8
4719 -8 159 66 -6 11 -167 -75 39 27 -27 -48 98 -89 24 -119 -1 -26 120 102 -200 -105 -18 50 -82 -126 -66
4744 -66 -18 82 -46 151 115 -89 -63 141 -40 -194 121 80 48 13 -98 -77 59 41 76 -67 -175 -71 -84 32
4768 32 74 124 -7 -91 199 69 64 -45 -133 72 -18 -132 -159 -184 -21 11 119 73 -32 22 6 50 123 -55 3 -38
4794 -38 -131 -14 -123 -55 -86 -96 21 94 -43 -105 9 -174 177 30 -61 -47 -87 -8 -22 275 -94 -173 18 -57 -28
4819 -28 -153 -79 0 -6 3 119 39 25 66 -55 -41 -45 -28 30 8 -27 54 27 -3 -49 -114 75 -97 65 29 -32 -120 212
4847 212 28 -15 -21 23 72 2 -43 -130 8 -31 -127 84 4 -28 57 39 53 -50 12 -140 16 79 -85 31 -43 9
4873 9 97 0 34 31 -11 24 -48 7 95 77 -43 11 115 155 -75 61 3 -33 76 25 -28 24 -5 -9 -39 -20 32 -104 -139
4902 -139 -12 29 216 56 -100 -33 97 -10 73 62 -115 41 -139 -35 -67 -51 7 18 71 51 127 61 57 183 -106
4927 -106 -10 -157 -63 -9 19 24 -245 -81 -40 175 -166 63 100 -164 152 73 -49 63 -69 -122 -98 46 31 -40
4951 -40 97 -121 58 -211 -143 50 62 30 -89 75 18 128 109 121 22 -28 -14 -17 78 60 51 78 -57 9 65 6 20
4978 20 60 73 -147 -50 49 -50 -34 -57 51 126 11 -48 -74 -8 173 -17 28 -40 -69 -96 -98 100 -55 -49 -22 -53 3 104
5006 104 -95 29 -66 98 -35 38 46 35 80 23 66 -85 18 23 89 30 132 4 21 104 -23 116 87 19 59 129
5032 129 113 -56 96 -82 -78 -40 87 74 66 72 -96 -17 -96 23 -36 -116 -112 70 -163 -112 -65 68 138 -83 -43 38 53
5059 53 43 -6 2 54 -157 -68 -108 148 -48 -26 44 109 98 -93 -55 -60 137 -61 7 -44 -3 13 -51 36 10 94 -153 -1
5087 -1 -101 37 11 53 69 216 -30 93 -27 80 163 -97 226 94 -29 -85 68 9 73 117 -22 66 22 -8
5111 -8 23 -130 -257 27 -85 5 3 -12 32 -9 99 -99 -39 -11 71 -21 148 -65 -7 -30 -59 -3 71 -34 -59 -35 78
5138 78 -165 169 117 209 90 -103 -118 -21 -20 -75 16 -149 -161 98 -15 133 214 202 98 63 99 -31 61 36 61 36
5164 36 57 25 -55 -15 68 -8 175 29 16 4 -72 -71 -58 -10 -29 -94 -127 44 34 -139 92 -11 -26 19 9 11 -37 -16
5192 -16 -43 189 158 -201 -34 6 -156 91 153 52 63 -124 7 -73 105 120 -10 -60 -111 -29 -151 2 9 42 201
5217 201 -51 80 17 -32 -9 29 -116 39 142 79 122 99 173 45 -72 -91 25 -134 39 12 206 38 -73
5240 -73 -149 70 47 -210 14 -7 143 -22 27 -47 -58 119 -11 91 88 46 104 -20 -93 9 69 -133 -71 -79 60
5265 60 16 -64 16 88 -51 114 -45 -41 -37 81 -50 -219 -73 -37 2 24 114 18 90 -88 40 -32 115 109 -157 177
5291 177 13 -109 88 -94 -192 152 57 212 27 -127 76 -33 61 -31 -104 -59 6 18 -116 -37 -144 -85 -71 135
5315 135 -55 80 65 7 170 -56 186 -204 47 -24 27 0 -10 -146 -81 3 -9 -26 187 54 -22 -90 11 45
5339 45 36 -79 -113 85 -162 -129 72 -14 16 -94 -110 67 165 -82 27 29 21 110 4 1 -28 33 -147 -24 94 175
5365 175 54 -71 -29 -90 78 156 127 -238 -114 131 -114 2 -67 -27 8 -77 -3 16 52 16 -27 95 -34 116
5389 116 -67 33 99 -12 55 -116 65 -38 2 -58 -7 59 -31 -66 -93 2 -88 44 -82 10 125 28 -161 8
5413 8 10 61 1 112 75 -98 35 -57 15 -43 -37 47 3 -24 -73 -27 77 44 -105 184 197 41 120 -60 80 -176 5
5440 5 33 -17 -1 -25 -56 -23 -49 -6 30 -4 106 116 47 -37 88 164 97 -49 -29 -11 -4 -11 -34 -25 -22 -78 42 -98 35 68
5470 68 110 23 -13 10 29 11 12 -161 126 -22 -17 26 -69 45 180 65 54 78 53 181 -33 -57 -79 -66 75 -30
5496 -30 20 30 -14 4 99 -162 22 153 168 28 -71 -92 120 64 -54 87 112 28 15 -6 136 4 1 -114 -185 -75
5522 -75 -61 72 -23 4 -195 -39 103 -76 76 63 -94 -151 29 -109 108 94 -79 46 122 -142 69 168 -129
5545 -129 65 3 -50 29 46 -3 -44 -83 29 -44 -78 111 198 186 38 -111 56 -7 -108 -150 5 56 103 52 -66
5570 -66 -81 -2 69 -108 -91 48 -69 91 -47 -10 52 55 60 4 -53 -17 21 155 26 -54 62 -132 61 102 120 5
5596 5 117 54 -77 30 -33 29 -30 -61 -59 40 -27 12 -73 16 85 -64 124 54 -16 111 8 33 -24 24 94 12 -5 -43
5624 -43 100 78 -175 144 -27 11 -22 -11 -39 -46 41 -19 -15 -155 -49 118 7 -38 106 151 -36 24 -14 30 -6 21
5650 21 33 -20 43 98 -20 -43 184 -19 -3 9 18 35 -26 -89 -91 -9 -94 57 -43 -33 6 -126 -80 36 -30 52 -92
5677 -92 146 121 -80 119 155 38 31 10 36 49 -27 -40 127 44 96 61 7 55 -53 -11 -87 -114 -123 12 -154 59 -39
5704 -39 -58 161 112 -34 -9 -51 -102 -32 43 151 -79 14 -26 -170 -33 55 -2 25 -11 -9 -25 -71 52 -74 114 -118
5730 -118 -122 21 40 -19 13 54 32 175 105 44 -32 104 -34 -114 44 238 34 31 20 -11 90 159 -15 -58 -26 150
5756 150 -93 129 4 -87 30 6 63 41 -17 -29 -18 59 -64 -8 -50 17 -14 4 13 79 -30 -104 22 67 -46 -66
5782 -66 -79 77 -150 79 -28 -117 -52 -164 87 -129 49 8 109 -92 -2 130 30 -37 -9 9 7 65 -125 202
5806 202 127 104 -60 -6 34 15 5 66 -132 -58 -70 -107 49 54 113 -67 -99 -107 107 -11 -73 -29 32 -41 -74 198 32
5833 32 -22 195 46 89 47 -15 116 102 116 46 20 12 -34 -136 12 73 112 72 -73 -94 73 79 -2 -43 -51 -52 -86 45
5861 45 99 62 112 26 34 -26 19 -51 0 48 38 50 -63 -90 -33 104 79 -1 -88 23 64 89 -125 12 80 35 -6 -106
5889 -106 90 9 -59 7 0 -39 -23 69 -25 84 87 49 109 -155 129 57 0 40 -49 -112 -76 19 -158 -56 -54 -86 63 59
5917 59 136 -141 -79 1 55 108 56 -17 -76 -91 -97 33 63 114 -23 108 -85 77 96 43 75 26 -42 77 -40 62
5943 62 137 35 -44 -30 -21 -111 -228 9 72 81 89 -74 -34 26 65 3 -130 -27 175 -82 153 -34 123 76 27 -53
5969 -53 0 25 31 93 163 40 -141 -87 -127 -111 -101 87 13 68 3 -39 131 -8 -22 -55 -98 57 -142 163 71 127 -85
5996 -85 37 -48 1 -105 -56 42 62 -11 94 9 -30 -134 -3 -43 0 23 79 81 -58 -18 120 -100 -23 -49 -13 63 -18
6023 -18 -11 -241 -7 64 -36 -21 48 90 91 48 202 78 -62 22 18 -105 -157 -80 113 -83 -123 -8 -31 70 -52 165
6049 165 22 -115 -73 -28 18 -127 120 -120 -22 67 48 13 129 49 214 209 -48 95 48 26 140 154 179 -21 124
6074 124 -91 -28 -98 -75 120 36 97 14 17 21 -243 -202 -108 -100 20 -78 195 80 -34 -76 -107 32 63 50 24 182 102
6101 102 85 122 64 15 -25 91 -97 -86 38 -120 47 -15 -84 147 34 -100 -66 56 34 -140 115 18 52 89
6125 89 42 45 -49 -92 -37 85 -87 10 8 -84 7 -45 43 -52 -3 96 -135 -62 -2 36 -128 72 -91 104 -6 -150 102
6152 102 88 -50 -133 -123 222 -27 2 -15 49 -25 25 47 -43 29 40 -18 160 114 -8 -85 -106 108 -85 2 -16 -13 62
6179 62 27 101 -99 -90 -59 -50 96 56 -23 121 10 -25 165 -16 -53 108 133 52 80 187 -14 161 48 -122 95
6204 95 19 -38 50 -105 -84 88 -17 58 112 -1 -36 -32 110 192 -38 117 36 -4 48 -190 -44 15 37 -25 50 61
6230 61 -8 60 103 -74 -44 38 172 106 -56 -69 1 -8 72 -63 -41 -33 -71 -28 -96 -53 -72 -36 -40 10 -8 72 19 -2 -6 124
6260 124 -29 -132 23 25 -127 124 -81 -51 -22 -95 3 -69 44 146 -46 -47 -28 130 -51 -82 -102 51 202 -22
6284 -22 -137 -38 -142 -68 -72 32 -90 -18 -150 104 109 -29 -41 109 36 -35 90 136 95 36 -12 -106 32 40 118 -137
6310 -137 -107 -17 33 41 -170 45 -25 -108 -14 -59 -92 107 149 -9 -75 86 51 -40 128 -7 21 -87 -44 -12 12 -25
6336 -25 94 -117 -68 41 21 -30 104 74 -132 84 -34 -52 -144 -79 -57 26 10 85 141 -4 79 0 -2 -15 156 2
6362 2 145 50 163 148 -214 14 79 95 -10 -28 -130 69 -91 -60 101 88 37 -76 -78 2 -34 -14 -151 69 138
6387 138 -58 71 98 20 -84 -137 -125 -78 45 55 4 114 3 -117 2 -35 -37 -22 -34 -40 15 37 56 68 4 -95 -23
6414 -23 140 97 -51 103 88 71 -111 -124 -10 -19 -121 -1 -129 22 49 -4 -30 -5 -71 112 -57 73 -189 26
6438 26 -82 -70 36 140 75 -28 -63 -82 -62 -27 8 -174 172 35 -6 -72 -100 89 43 87 55 -73 -29 -121 51
6463 51 -3 81 24 121 -51 -35 9 -233 -56 -12 -33 78 39 16 47 -68 75 -128 -10 22 67 -39 -62 44 -7
6488 -7 -22 -103 17 -21 48 -88 -62 -82 -58 -26 19 -34 32 170 40 25 -40 6 20 -168 75 -66 18 139 91 -54
6514 -54 126 -88 -15 -131 -37 87 -97 -26 -76 -2 -30 -167 -64 149 18 -101 -68 70 10 52 -90 2 -92 -62
6538 -62 -48 -103 -59 1 -57 -235 57 190 -19 105 43 65 -72 85 45 -99 215 -6 40 191 -104 31 158
6561 158 -33 37 164 44 61 -3 79 52 -122 1 -82 -148 65 88 194 -14 101 -26 -55 98 -84 -70 -118 80
6585 80 78 -78 72 -126 9 -59 93 123 -17 -94 79 16 18 3 -202 104 -26 36 -5 65 82 37 -25 22 -113 2
6611 2 -39 -5 -100 120 93 1 156 98 -61 -67 -27 97 -35 128 -81 42 -182 -19 -25 -125 -134 164 9 -50 102
6636 102 -43 -98 -21 57 -25 -35 14 64 96 -189 48 74 36 40 105 -87 -120 97 -87 -24 -61 -76 -116 -96 28 -73
6662 -73 77 -5 84 -102 -35 -7 -24 222 84 55 7 -25 36 -159 -20 -43 -72 -17 56 48 41 79 94 44 33 -46 -52 21 77
6691 77 148 1 -22 -140 147 30 -115 57 -94 28 -33 66 -114 31 -27 107 35 41 250 110 107 176 39 -88
6715 -88 -4 60 5 -10 -83 151 72 38 9 164 -19 103 142 -81 -73 -210 -95 77 58 95 84 -60 -39 -21 79 79
6741 79 -83 -12 -25 7 -18 24 68 -24 64 -152 11 -49 43 40 73 35 -59 137 35 20 196 35 -83 -4 -160 -93
6767 -93 61 -81 -54 -53 -67 101 -72 -16 35 57 -165 -160 -122 -40 85 -165 16 -5 129 -67 -6 -43 -118 162 -124
6792 -124 36 12 -89 57 -151 -46 -13 113 20 -93 -34 -142 -21 71 -44 78 178 1 43 -68 2 -29 -9
6815 -9 110 -46 -88 -3 -68 81 -18 103 73 -60 -79 -47 -161 66 -135 -116 0 69 -27 142 -4 -111 121 75
6839 75 118 44 -45 110 -131 -59 -62 -75 -46 103 -18 63 -57 -51 -54 55 6 -38 -144 -182 115 -8 -135 -144 -59 -26 138
6866 138 -94 -16 -14 48 89 -63 -119 -5 -13 201 119 62 -49 -80 80 -15 -62 45 31 -186 -7 -94 -79 -35 -70 32
6892 32 45 -64 83 14 234 21 40 8 -79 -86 -1 -12 87 -138 -88 208 66 -42 6 25 -172 -84 161 66 9 -136
6918 -136 158 -128 13 125 175 149 -5 100 -41 -26 -7 42 194 -7 98 -73 -53 14 26 99 -148 36 48
6941 48 16 -50 23 66 11 -10 38 -112 -36 -40 -54 18 -76 106 -38 -85 80 79 -24 46 130 -72 -44 88 -76 -38 87
6968 87 2 -168 98 -67 -57 80 66 -55 16 73 -7 -102 -35 37 9 -148 -115 -13 40 63 42 -74 -103 43 81 -129
6994 -129 -57 36 83 61 -94 -25 -7 -52 47 98 76 -27 47 11 117 -8 15 33 98 -58 -94 134 -78 -13 -110 -73
7020 -73 -82 -152 66 31 8 82 -60 49 -2 15 -19 57 -51 183 -22 38 -4 -84 -3 -36 -16 94 -97 1 -14 48 44
7047 44 -129 -103 -262 -103 -40 67 10 19 -25 -108 120 101 128 15 42 -128 70 -2 92 19 64 87 134 -33 -74 25
7073 25 -2 -61 120 -31 -78 -86 -20 82 -78 17 13 -136 -77 -60 -9 89 7 -5 -16 -12 -8 -39 43 -75 -80 83 92 193 39
7102 39 -60 42 30 -96 21 78 11 50 13 -29 25 -119 105 57 77 -46 155 41 209 175 -167 60 -18 -153
7126 -153 -21 105 20 121 5 -70 87 -70 11 -89 135 -35 37 -99 60 121 103 3 -57 106 55 -44 72
7149 72 37 -16 37 32 136 -72 13 -23 11 88 -99 99 50 -18 45 -78 60 -25 13 67 101 -58 -44 -22 20 -135 -135
7176 -135 43 -164 -83 -129 47 -33 -79 120 39 -75 -175 -31 71 4 132 -99 -9 7 -151 57 46 -23 72 163
7200 163 -44 -56 65 -22 -28 -159 -102 235 14 -61 -114 65 -81 -75 4 -101 54 -16 -14 -72 88 70 73 13 85 -39
7226 -39 83 -22 125 -112 3 -79 10 143 -80 -80 100 48 -70 32 -9 23 -125 -98 50 -127 -30 -88 -43 -132
7250 -132 -189 160 113 165 -155 -46 -13 -82 5 -5 118 -75 -31 74 -79 -45 -27 -121 -47 -24 -63 -46 1 -62 53 -109
7276 -109 -9 126 18 29 -236 113 37 96 156 113 249 175 -75 114 36 48 -45 0 111 47 48 -53 -43 -50 -80 102
7302 102 49 57 32 -111 -80 -113 21 77 29 -87 63 38 -43 -68 2 82 145 -26 34 -42 55 -71 79 12 -63 43
7328 43 -7 148 -203 85 127 -23 90 -121 -17 -1 -145 1 -70 92 77 -30 62 6 90 -7 51 -1 -171 25
7352 25 8 104 -6 20 36 -55 11 57 83 -35 63 -37 90 80 47 -117 -6 147 -175 -164 -45 -37 51 -55 -201
7377 -201 -322 48 46 -117 -117 -40 -50 34 -73 118 10 137 -80 -61 160 62 18 34 -12 -50 111 -13 -150 -4
7401 -4 98 14 108 60 -32 39 52 -122 -18 33 18 34 -132 -2 -156 -110 -78 46 -31 81 -44 14 -22 204 109 -108
7427 -108 80 -114 -69 -71 -74 31 -62 31 -17 -61 65 185 156 211 -128 -96 160 -83 -89 28 -102 -48 72 -10 -25 84
7453 84 -61 -1 -108 -31 30 -35 -115 -81 -29 -82 90 72 46 -101 -5 44 -72 -20 -34 -130 -122 63 -18 -31 20 -56 59
7480 59 59 45 86 91 -21 85 28 105 50 -48 -82 47 86 -87 -134 -135 79 -5 102 7 -55 140 -20 108 124 14 24
7507 24 -83 -113 -135 -101 -39 -56 -27 -18 48 36 -35 -182 -13 27 -11 -62 -104 33 135 165 -12 70 -111 114 2 -145
7533 -145 83 15 -90 26 65 2 2 -67 108 -42 15 13 -149 50 41 3 -80 -203 -50 -4 15 -61 71 -153 26
7558 26 -93 -63 -99 -17 10 -41 9 -126 -70 49 -27 124 53 125 -44 -15 23 -140 89 -1 176 -34 -217 95 64
7583 64 112 -89 -53 -153 3 -26 -81 -35 163 -55 -17 -163 -6 78 -82 -155 25 -122 -124 -36 -11 -47 -52 -83 -86 102
7609 102 -155 -45 22 115 -8 180 -67 -95 113 48 -70 85 128 -67 -7 -105 -105 64 28 28 11 -3 -54 162 -101
7634 -101 -63 -8 62 123 -11 31 78 66 65 21 85 -69 43 141 -3 94 70 6 44 5 -128 -195 -66 -12 -93 16 48
7661 48 16 65 -11 46 -59 149 -161 35 -137 -55 -80 124 10 -93 81 64 -26 21 29 58 -136 153 -74 -57 -80
7686 -80 -102 -96 -42 38 -35 152 149 77 -9 -22 3 -62 -14 229 78 -12 171 -39 2 81 -27 88 -14 21 12 15 129 -30
7714 -30 60 -44 -22 -69 162 25 23 88 -58 -32 26 -33 -61 131 110 -36 -88 -1 -90 -134 6 -29 37 58 14 -28 58
7741 58 231 7 25 97 114 102 -25 56 -81 61 158 4 -44 70 14 -12 78 62 -40 64 -46 -167 -20 116
7765 116 34 -21 -75 170 -91 54 0 -47 32 -54 116 -119 -5 128 54 -34 77 -103 -106 -3 -20 29 8 -63 18
7790 18 -15 69 63 -11 -25 -83 -95 -93 -14 -45 115 134 191 10 74 -85 54 87 -36 -42 68 142 -63 190 68 -183 65
7817 65 42 112 -81 -96 27 13 52 -154 128 74 101 -32 -186 269 186 87 96 152 42 170 8 -17 -66 13 54 3
7843 3 194 -12 -28 -1 243 -129 85 -59 -74 41 15 -139 147 110 8 -156 -26 49 12 -198 -117 140 326
7866 326 6 -20 17 -101 259 62 9 60 122 -3 28 11 15 2 221 -27 -82 -195 -2 -49 -14 1 -114 24 -24
7891 -24 -59 24 -35 -72 -9 57 -5 56 -66 -105 -133 137 -176 89 -109 55 181 30 34 -208 -4 49 111 89 27 -76
7917 -76 -32 -38 -31 76 99 -123 29 47 20 94 44 95 48 -59 -80 126 -103 -34 -24 -119 169 -50 -81 225 -153 31
7943 31 -78 47 89 28 -49 -179 86 -16 14 66 -14 5 63 -86 -57 16 -157 -32 -33 -236 155 16 137 -16
7967 -16 93 102 21 57 -144 -16 50 75 -156 -97 111 116 8 -71 0 130 54 -67 50 95 54 -27 37 97 12 54 -140
7994 -140 184 156 -182 -15 92 -88 -44 -36 -78 0 17 -69 14 -120 -1 171 -74 -37 -80 -3 28 -169 113 -13
8018 -13 -20 181 154 -10 -10 45 7 -126 33 111 -98 67 -20 -148 -5 2 85 -4 20 -61 58 -62 85 108 -106 -11
8044 -11 -144 38 10 -83 33 71 -8 -117 154 10 -70 -44 -49 15 -116 -11 9 -49 52 -4 70 86 -96 -123 -35 -70
8070 -70 -10 82 175 62 13 -1 48 149 -79 -144 38 98 -58 -133 19 -56 48 134 19 70 -145 108 -9 69 -14
8095 -14 -136 17 2 -59 -21 -167 -85 52 37 44 -59 68 -98 -96 43 -128 -50 -40 -15 3 -163 -18 79 -21 -125
8120 -125 -33 5 65 27 74 -78 95 -82 133 -41 102 141 54 -54 80 37 -44 23 230 59 108 18 -203 -65
8144 -65 8 35 85 -98 106 -49 16 30 36 -90 72 -64 -19 -4 173 -6 -73 17 -78 84 76 -103 29 135 52
8169 52 -12 -75 -155 13 -47 -158 -93 120 135 -56 147 34 24 -193 -131 -48 220 45 -17 -65 12 3
8191C
##END NTUPLES=NMR FID
##END=
