##TITLE=1H_3MBDE 1-6 
 CDCl3
 8 sc, 
 13.12.2022
##JCAMPDX= 6.0         $$ Bruker NMR JCAMP-DX V2.0
##DATA TYPE= NMR FID
##DATA CLASS= NTUPLES
##ORIGIN= UXNMR, Bruker Analytische Messtechnik GmbH
##OWNER= root
$$ XWIN-NMR		Version 3.5
$$ Tue Dec 13 14:06:48 2022 Russian Standard Time (UT+4h)  she@DPX200
##.OBSERVE FREQUENCY= 200.13135
##.OBSERVE NUCLEUS= ^1H
##.DELAY= (6, 6)
##.ACQUISITION MODE= SIMULTANEOUS
##.ACQUISITION SCHEME= undefined
##.AVERAGES= 8
##.DIGITISER RES= 18
##SPECTROMETER/DATA SYSTEM= spect
##.PULSE SEQUENCE= zg30
##.SOLVENT NAME= CDCl3
##.SHIFT REFERENCE= (INTERNAL, CDCl3, 0, 15.7039)
##AUDIT TRAIL= $$ (NUMBER, WHEN, WHO, WHERE, WHAT)
$$ ##TITLE= Audit trail, XWIN-NMR		Version 3.5
$$ ##JCAMPDX= 5.01
$$ ##ORIGIN= Bruker BioSpin GmbH
$$ ##OWNER= she
$$ F:/spectra/data/she/nmr/H-F/1/audita.txt
$$ ##AUDIT TRAIL=  $$ (NUMBER, WHEN, WHO, WHERE, WHAT)
(   1,<2022-12-13 14:05:49.25 +0400>,<she>,<DPX200>,
      <created by zg, POWCHK disabled, PULCHK disabled
       configuration hash MD5:
       00 E9 B6 7A A2 85 ED C7 34 08 36 98 17 FE 4E 26
       data hash MD5: 16K
       16 F0 F2 A4 9E E5 A9 62 01 06 6E 3B C7 CC 87 D1>)
$$ ##END=
$$ 
$$ hash MD5
$$ 74 5C B1 AD A1 6B 10 8B 9D CA AB A1 7C 3A 68 1B
##$RELAX= 
##$RELAX= 
##$RELAX= 
##$RELAX= 
##$RELAX= 
##$RELAX= 
$$ Bruker specific parameters
$$ --------------------------
##$DU= <F:/spectra>
##$EXPNO= 1
##$NAME= <H-F>
##$PROCNO= 1
##$TYPE= <nmr>
##$USER= <she>
##$AMP= (0..31)
100 100 100 100 100 100 100 100 100 100 100 100 100 100 100 100 100 100 
100 100 100 100 100 100 100 100 100 100 100 100 100 100 
##$AQSEQ= 0
##$AQ_mod= 1
##$AUNM= <au_zg>
##$AUTOPOS= <>
##$BF1= 200.13
##$BF2= 200.13
##$BF3= 200.13
##$BF4= 200.13
##$BF5= 200.13
##$BF6= 200.13
##$BF7= 200.13
##$BF8= 200.13
##$BYTORDA= 1
##$CFDGTYP= 0
##$CFRGTYP= 5
##$CHEMSTR= <none>
##$CNST= (0..31)
1 1 145 1 1 1 1 1 1 1 1 1 1 1 1 1 1 1 1 1 1 1 1 1 1 1 1 1 1 1 1 1 
##$CPDPRG= <>
##$CPDPRG1= <>
##$CPDPRG2= <>
##$CPDPRG3= <>
##$CPDPRG4= <mlev>
##$CPDPRG5= <mlev>
##$CPDPRG6= <mlev>
##$CPDPRG7= <mlev>
##$CPDPRG8= <mlev>
##$CPDPRGB= <>
##$CPDPRGT= <>
##$D= (0..31)
0 1.2 0 0 0 0 0 0 0 0.06 0 0.03 0 0 0 0 0.0002 0 0 0 0 0 0 0 0 0 0 0 0 
0 0 0 
##$DATE= 1670925948
##$DBL= (0..7)
120 120 120 120 120 120 120 120 
##$DBP= (0..7)
150 150 150 150 150 150 150 150 
##$DBP07= 0
##$DBPNAM0= <>
##$DBPNAM1= <>
##$DBPNAM2= <>
##$DBPNAM3= <>
##$DBPNAM4= <>
##$DBPNAM5= <>
##$DBPNAM6= <>
##$DBPNAM7= <>
##$DBPOAL= (0..7)
0.5 0.5 0.5 0.5 0.5 0.5 0.5 0.5 
##$DBPOFFS= (0..7)
0 0 0 0 0 0 0 0 
##$DE= 6
##$DECBNUC= <off>
##$DECIM= 32
##$DECNUC= <off>
##$DECSTAT= 4
##$DIGMOD= 1
##$DIGTYP= 9
##$DL= (0..7)
0 120 120 120 120 120 120 120 
##$DP= (0..7)
150 150 150 150 150 150 150 150 
##$DP07= 0
##$DPNAME0= <>
##$DPNAME1= <>
##$DPNAME2= <>
##$DPNAME3= <>
##$DPNAME4= <>
##$DPNAME5= <>
##$DPNAME6= <>
##$DPNAME7= <>
##$DPOAL= (0..7)
0.5 0.5 0.5 0.5 0.5 0.5 0.5 0.5 
##$DPOFFS= (0..7)
0 0 0 0 0 0 0 0 
##$DQDMODE= 0
##$DR= 18
##$DS= 0
##$DSLIST= <SSSSSSSSSSSSSSS>
$$ [...]
##$SUBNAM2= <"">
##$SUBNAM3= <"">
##$SUBNAM4= <"">
##$SUBNAM5= <"">
##$SUBNAM6= <"">
##$SUBNAM7= <"">
##$SUBNAM8= <"">
##$SUBNAM9= <"">
##$SW= 18.05172834244
##$SWIBOX= (0..15)
0 0 2 0 0 0 0 0 0 0 0 0 0 0 0 0 
##$SW_h= 3612.71676300578
##$TD= 16384
##$TD0= 1
##$TE= 0
##$TE2= 300
##$TE3= 300
##$TEG= 300
##$TL= (0..7)
0 120 120 120 120 120 120 120 
##$TP= (0..7)
150 150 150 150 150 150 150 150 
##$TP07= 0
##$TPNAME0= <>
##$TPNAME1= <>
##$TPNAME2= <>
##$TPNAME3= <>
##$TPNAME4= <>
##$TPNAME5= <>
##$TPNAME6= <>
##$TPNAME7= <>
##$TPOAL= (0..7)
0.5 0.5 0.5 0.5 0.5 0.5 0.5 0.5 
##$TPOFFS= (0..7)
0 0 0 0 0 0 0 0 
##$TUNHIN= 0
##$TUNHOUT= 0
##$TUNXOUT= 0
##$USERA1= <user>
##$USERA2= <user>
##$USERA3= <user>
##$USERA4= <user>
##$USERA5= <user>
##$V9= 5
##$VALIST= <valist>
##$VCLIST= <CCCCCCCCCCCCCCC>
##$VD= 0
##$VDLIST= <DDDDDDDDDDDDDDD>
##$VPLIST= <PPPPPPPPPPPPPPP>
##$VTLIST= <TTTTTTTTTTTTTTT>
##$WBST= 1024
##$WBSW= 4
##$XGAIN= (0..3)
0 0 0 0 
##$XL= 0
##$YL= 0
##$YMAX_a= 190486
##$YMIN_a= -258411
##$ZGOPTNS= <>
##$ZL1= 120
##$ZL2= 120
##$ZL3= 120
##$ZL4= 120
##$ABSF1= 10
##$ABSF2= 0
##$ABSG= 5
##$ABSL= 3
##$ALPHA= 0
##$AQORDER= 0
##$ASSFAC= 0
##$ASSFACI= 0
##$ASSFACX= 0
##$ASSWID= 0
##$AUNMP= <proc_1d>
##$AZFE= 0.1
##$AZFW= 0.1
##$BCFW= 1
##$BC_mod= 2
##$BYTORDP= 1
##$COROFFS= 0
##$CY= 11.3945322036743
##$DATMOD= 1
##$DC= 2
##$DFILT= <>
##$DTYPP= 0
##$F1P= 2.36226072786647
##$F2P= -0.459571619588291
##$FCOR= 0.5
##$FTSIZE= 0
##$FT_mod= 4
##$GAMMA= 1
##$GB= 0.15
##$INTBC= 1
##$INTSCL= 1
##$ISEN= 128
##$LB= 0.24
##$LEV0= 0
##$LPBIN= 0
##$MAXI= 10000
##$MC2= 0
##$MEAN= 0
##$ME_mod= 0
##$MI= 1.114404
##$NCOEF= 0
##$NC_proc= 0
##$NLEV= 6
##$NOISF1= 3.799351
##$NOISF2= 2.8
##$NSP= 1
##$NTH_PI= 0
##$NZP= 0
##$OFFSET= 15.70392
##$PC= 1
##$PHC0= -19115.45
##$PHC1= 13.40072
##$PH_mod= 1
##$PKNL= yes
##$PPARMOD= 0
##$PSCAL= 0
##$PSIGN= 0
##$REVERSE= no
##$SF= 200.130013532006
##$SI= 16384
##$SIGF1= 3
##$SIGF2= 2
##$SINO= 400
##$SIOLD= 16384
##$SREGLST= <1H.CDCl3>
##$SSB= 0
##$STSI= 0
##$STSR= 0
##$SW_p= 3612.71676300578
##$SYMM= 0
##$S_DEV= 0
##$TDeff= 0
##$TDoff= 0
##$TI= <>
##$TILT= no
##$TM1= 0
##$TM2= 0
##$TOPLEV= 0
##$USERP1= <user>
##$USERP2= <user>
##$USERP3= <user>
##$USERP4= <user>
##$USERP5= <user>
##$WDW= 1
##$XDIM= 8192
##$YMAX_p= 0
##$YMIN_p= 0
$$ End of Bruker specific parameters
$$ ---------------------------------
##NTUPLES= NMR FID
##VAR_NAME=  TIME,          FID/REAL,        FID/IMAG
##SYMBOL=    X,             R,               I
##VAR_TYPE=  INDEPENDENT,   DEPENDENT,       DEPENDENT
##VAR_FORM=  AFFN,          ASDF,            ASDF
##VAR_DIM=   8192,          8192,            8192
##UNITS=     SECONDS,       ARBITRARY UNITS, ARBITRARY UNITS
##FACTOR=    0.0002768,     1,               1
##FIRST=     0,             0,               0
##LAST=      2.2672688,     0,               0
##MIN=       0,             -258411,         0
##MAX=       2.2672688,     190486,          0
$$ Real data points
##PAGE= N=1
##DATA TABLE= (X++(R..R)), XYDATA
$$ plain form
0 0 0 0 0 0 0 0 0 0 0 0 0 8 -8 8 -8 16 -16 23 -24 32 -32 40 -48 59 -72 80 -96 112 -128 144 -167 191 -216
33 -216 245 -276 312 -351 393 -440 490 -546 608 -674 747 -827 912 -1008 1112 -1224 1348
50 1348 -1485 1636 -1804 1990 -2196 2431 -2698 3000 -3353 3768 -4261 4863 -5618 6589 -7899
65 -7899 9765 -12652 17742 -29340 113810 -93081 -187942 184589 -48783 -185468 159395
76 159395 157372 -164746 -8714 108367 -111445 -81681 142754 35975 -83701 12308 28224
87 28224 -74766 -25500 85110 44400 -65620 -22598 33755 -54248 -45201 113180 49820 -91325
99 -91325 15666 42010 -113742 -6641 143242 -19447 -62728 83017 -31323 -120823 73308
110 73308 80039 -69028 22545 58866 -91150 -41015 75772 -5006 -23361 45936 -16032 -56689
$$ packed form
0@%%%%%%%%%%%Qj6J6j6K4l2L9m7N6o4P2q8J07j31J52j76K08k40K72l11L58m07
33b16M61n21N88o63P44q33R30j036J154j282J421j574J739j920K120k336K572
50A348k833L121l440L794m186M627n129N698o353P121q029R124j0481J2207j4488
65g899J7664k2417L0394m7082J43150k06891r4861L72531k33372j36685L44863
76A59395k023l22118J56032J17081k19812K9764K24435j06779j19676R6009J5916
87B8224j02990M9266J10610m0710j10020M3022N6353q8003R047J58381o3360j41145
99i1325J06991K6344j55752J07101J49883j62689m3281J45745j14340q9500J94131
110G3308O731j49067R1573L6321j50016N0135J16787q0778j8355O9297o1968m0657
$$ plain form
122 -56689 8023 14700 6872 25359 -9337 -20596 -896 -29772 131 61805 1829 -30506
134 -30506 29312 -16975 -60084 39480 49059 -30785 13416 30816 -54017 -24293 43927 -3374
146 -3374 -10443 33079 -9826 -36414 6597 7814 -2838 11632 -2513 -10678 -4085 -16631 7681
159 7681 32152 -13451 -13324 25841 -25712 -33723 51032 17873 -41734 33692 24573 -68667 3618
172 3618 61966 -37157 -17587 67373 -22513 -61392 45707 18992 -54681 24067 42573 -48135
184 -48135 -20146 41438 -11076 -28715 27144 14824 -31383 -9515 24170 1309 -20219 13985
196 13985 25276 -27443 -22194 38696 4442 -38129 30995 32563 -52552 -5679 54537 -30930
208 -30930 -33278 59771 511 -61032 33042 33115 -57587 1802 54100 -33783 -32853 45076 -782
$$ packed form
122e6689O4712O677p828J8487l4696j1259J9700k8876K9903O1674n9976l2335
134c0506N9818m6287m3109R9564R579p9844M4201J7400q4833K9724O8220m7301
146c374p069M3522m2905k6588M3011J217j0652J4470j4145q165O593j2546K4312
159G681K4471m5603J27L9165n1553q011Q4755l3159n9607P5426r119r3240P2285
172C618N8348r9123J9570Q4960q9886l8879J07099k6715p3673P8748J8506r0708
184d8135K7989O1584n2514j7639N5859j2320m6207K1868L3685k2861k1528L4204
196A3985J1291n2719N249O0890l4254m2571O9124J568q5115M6873O0216q5467
208c0930k348R3049n9260o1543R4074P3r0702N9389N2298q7883R30P7929m5858
$$ plain form
221 -782 -43280 22900 26866 -32203 -8830 29595 -5730 -22606 16636 19927 -20065 -11566 26926
234 26926 1595 -28531 17659 27268 -31982 -10733 40140 -14290 -34568 37479 13536 -47699
246 -47699 13125 35654 -39280 -13960 44943 -15231 -35670 32955 11661 -39227 9700 29135
258 29135 -23471 -11655 27957 -1652 -22013 12605 15973 -15172 -6462 20304 1624 -19202
270 -19202 8448 18646 -17843 -11850 25159 -2378 -27079 17738 17951 -31210 -3695 30066 -18250
283 -18250 -23070 29241 4132 -31477 13450 21167 -25692 -6545 26289 -8094 -18135 19564
295 19564 9952 -18870 2743 17521 -9685 -11384 15718 7239 -15711 2284 17061 -10399 -14279
308 -14279 16230 4247 -22208 5491 19474 -17158 -11802 21908 -4053 -24226 14140 14009 -21978
$$ packed form
221g82m2498O6180L966n9069K3373L8425l5325j6876L9242L291l9992Q499L8492
234B6926k5331l0126M6190R609n9250K1249N0873n4430k0278P2047k3943o1235
246d7699O0824K2529p4934K5320N8903o0174k0439O8625k1294n0888M8927J9435
258B9135n2606J1816L9612k9609k0361L4618L368l1145Q710K6766j8680k0826
270a9202K7650J0198l6489N993L7009k7537k4701M4817K13m9161K7515L3761m8316
283a8250m820N2311k5109l5609M4927P717m6859J9147L2834l4383j0041L7699
295A9564r612k8822K1613J4778k7206j699K7102q479k2950J7995J4777k7460l880
308a4279L0509j1983k6455K7699J3983l6632N356L3710k5961k0173L8366j31l5987
$$ plain form
321 -21978 61 23578 -11976 -16281 20293 4547 -21545 9090 19959 -15039 -7464 21267
333 21267 -2373 -20412 12152 14644 -18286 -3661 21757 -6802 -19649 14402 8783 -22541
345 -22541 261 20620 -12584 -14614 19552 2398 -23468 6980 16880 -17228 -6446 23380
357 23380 -3067 -19396 14830 12261 -21085 -32 23457 -9521 -14824 21303 5827 -24053
369 -24053 6401 19144 -18310 -9643 23682 -3590 -21912 13969 10981 -23583 -1373 20463
381 20463 -12038 -14052 19358 3677 -20542 5804 14447 -14517 -7061 19135 493 -15238 9819
394 9819 12321 -15261 -4777 18666 -2719 -15532 13213 10910 -18488 -749 19045 -11727 -15560
407 -15560 17846 3103 -20595 8693 14711 -18707 -6618 17740 -8061 -14474 15971 6898 -15968
$$ packed form
321b1978K2039K3517l5554m305L6574j5746k6092L0635J0869l4998P575K8731
333B1267k3640j8039L2564K492l2930J4625K5418k8559j2847L4051n619l1324
345b2541K2802K0359l3204k030L4166j7154k5866L0448R900l4108J0782K9826
357B3380k6447j6329L4226k569l3346K1053K3489l2978n303L6127j5476k9880
369b4053L0454J2743l7454Q667L3325k7272j8322L5881k988l4564K2210K1836
381B0463l2501k014L3410j5681k4219K6346Q643k8964P456K6196j8642j5731K5057
394I819K502k7582J0484K3443k1385j2813K8745k303k9398J7739J9794l0772l833
407a5560L3406j4743k3698K9288O018l3418J2089K4358k5801o413L0445r073k2866
$$ plain form
420 -15968 3415 11664 -10869 -6397 13494 3326 -8654 4251 8235 -6883 -5794 9691 4089
433 4089 -9618 1518 9691 -8281 -7365 13239 1504 -15346 5172 7972 -15501 -1795 17288
446 17288 -6059 -11724 10992 -460 -16082 7334 13268 -8024 -1924 9951 -5200 -9200 7481
459 7481 7781 -3487 -396 5926 -2123 -8994 3531 10889 -4355 -6954 8795 -1905 -15792 8219
473 8219 14414 -13407 -4701 14541 -12765 -16433 19517 8024 -18081 7826 12134 -22040 -6793
486 -6793 22895 -683 -11682 14493 4389 -20561 -4 17919 -2902 -6970 12209 1933
498 1933 -18864 -147 17597 -4231 -9853 14341 392 -25718 4222 21866 -13600 -8059 23736
511 23736 -10282 -29796 18294 16854 -22843 7688 25491 -25347 -18997 28528 775 -20229
$$ packed form
420a5968J9383Q249k2533M472J9891j0168j1980J2905L984j5118J089J5485n602
433D089j3707J1136Q173j7972R16K0604j1735j6850K0518K800k3473J3706J9083
446A7288k3347n665K2716j1452j5622K3416N934k1292O100J1875j5151m000J6681
459G481L00j1268L091O322q049o871J2525P358j5244k599J5749j0700j3887K4011
473H219O195k7821Q706J9242k7306l668L5950j1493k6105K5907M308l4174J5247
486f793K9688k3578j0999K6175j0104k4950K0557J7923k0821m068J9179j0276
498A933k0797J8717J7744k1828n622K4194j3949k6110K9940J7644l5466N541L1795
511B3736l4018j9514M8090j440l9697L0531J7803n0838O350M7525k7753k1004
$$ plain form
523 -20229 23305 14406 -31025 -3216 24245 -10915 -9439 25565 1564 -27203 3256 15624
535 15624 -13046 -3254 22213 -3660 -25199 5304 12703 -14873 123 24094 -8932 -24349
547 -24349 12244 8387 -18448 10410 23999 -17615 -15006 17929 -3831 -14082 21932 12301 -21528
560 -21528 -622 11452 -14319 -1994 22214 -1873 -14834 5381 -538 -13242 6192 13327
572 13327 -5311 -6405 1868 -5634 -6710 6629 8895 -1618 -4339 -48 -3073 -4928 6197 10301
586 10301 -1739 -4136 2296 -4000 -5744 8790 8603 -3757 -1351 924 -6937 -2699 7368 3455
600 3455 -1010 -1148 -4724 -4397 -257 1288 4786 3173 -6778 -4201 2608 -4204 -1077 12100 1038
615 1038 -10467 3486 3265 -9822 4854 14483 -6332 -6814 9248 -3778 -10379 12083 9323 -11509
$$ packed form
523b0229M3534q899m5431K7809K7461l5160J476L5004k4001k8767L0459J2368
535A5624k8670R792K5467k5873k1539L0503P399k7576J4996K3971l3026j5417
547b4349L6593l857k6835K8858J3589m1614K609L2935k1760j0251L6014r631l3829
560b1528K0906J2074k5771J2325K4208k4087j2961K0215n919j2704J9434P135
572A3327j8638j094Q273p502j076J3339K266j0513k721M291l025j855J1125M104
586A0301j2040k397O432o296j744J4534j87j2360K406K275p861M238J0067l913
600C455m465j38l576L27M140J545L498j613r951K577O809o812L127J3177j1062
615A038j1505J3953k21j3087J4676R629k0815m82J6062j3026o601K2462k760k0832
$$ plain form
629 -11509 -728 8340 -10539 -7132 14361 3075 -12069 3600 5908 -13600 -3999 15066 -713
642 -713 -11322 7953 4562 -15638 1089 17179 -6442 -9499 14266 369 -17480 9032 15957
655 15957 -13307 -3746 17425 -7761 -16007 15396 8694 -16862 3627 14333 -14771 -10591 16804
668 16804 393 -14923 9320 8655 -16609 -3079 15491 -5042 -10504 12302 4061 -15466 3006
681 3006 13167 -8468 -5816 14225 -366 -13631 7597 10075 -11011 -1375 13714 -5741 -11370
694 -11370 10049 4842 -12090 2574 10385 -9287 -7536 10090 -586 -10365 6150 6842 -10043
707 -10043 -2533 9323 -3636 -7048 8120 3755 -8586 1763 8265 -4875 -4100 8657 1288
720 1288 -7789 3466 6490 -5765 -2188 7484 -1421 -6728 3832 3482 -6726 -866 6284 -2956
$$ packed form
629a1509J0781R068j8879L407K1493j1286j5144J5669K308j9508R601J9065j5779
642g13j0609J9275l391k0200J6727J6090k3621l057K3765j3897j7849K6512O925
655A5957k9264R561K1171k5186q246L1403o702k5556K0489J0706k9104M180K7395
668A6804j6411j5316K4243o65k5264J3530J8570k0533n462K2806q241j9527J8472
681C006J0161k1635K652K0041j4591j3265K1228K478k1086R636J5089j9455n629
694a1370K1419n207j6932J4664P811j9672J751J7626j0676r779J6515O92j6885
707a0043P510J1856j2959l412J5168m365j2341J0349O502j3140P75J2757p369
720A288r077J1255L024j2255L577R672q905n307J0560l50j0208N860P150r240
$$ plain form
734 -2956 -5591 4287 1582 -6692 571 5879 -3598 -3947 5961 1216 -6655 2443 6401 -4477 -2289
749 -2289 7569 31 -6436 4082 5397 -5875 -1383 6839 -1871 -5794 4676 2822 -6258 -398
763 -398 5258 -3757 -4705 4670 1035 -6142 1227 4601 -4607 -3492 5792 436 -5829 3525 5118 -5757
779 -5757 -1847 7415 -1214 -5824 6030 4061 -7156 656 7357 -4273 -4490 7189 591 -7716
793 -7716 2908 5077 -6578 -2358 6363 -2606 -6626 4511 3094 -6747 -102 6377 -3535 -5018
807 -5018 5742 2437 -6512 1592 7218 -3828 -4005 7239 1335 -6987 3648 6169 -5883 -2171
821 -2171 7649 -2024 -6486 5366 3026 -7620 506 6082 -5114 -4268 6357 -353 -7049 2972
835 2972 4202 -5831 -1704 6391 -1479 -5202 4298 3663 -5235 0 6366 -1985 -3944 5546 2505
$$ packed form
734b956k635R878k705q274P263N308r477l49R908m745p871R098L958j0878K188
749b289R858p538o467J0518J315j1272M492Q222q710l923J0470j854r080N860
763c98N656r015r48R375l635p177P369L374r208J115R284n356o265R354J593j0875
779e757L910R262q629m610J1854j969j1217P812O701j1630k17J1679o598q307
793g716J0624K169j1655M220Q721q969m020J1137j417r841O645O479r912j483
807e018J0760l305q949Q104N626j1046j77J1244n904q322J0635K521j2052L712
821b171R820r673m462J1852k340j0646Q126N576j1196Q46J0625o710o696J0021
835B972J230j0033M127Q095p870l723R500o35q898N235O366q351j959R490l041
$$ plain form
850 2505 -6019 1309 5966 -4197 -3250 6467 -340 -6836 3582 3843 -6851 -1021 6194 -3806 -5321
865 -5321 5278 1506 -6854 1626 4993 -4667 -2564 5876 -185 -4912 3220 3989 -4061 -747 5479
880 5479 -1047 -3848 3709 2942 -4504 84 4867 -2215 -3835 4267 1142 -5487 899 4107 -4478
895 -4478 -3141 4807 -469 -5486 2612 3491 -5018 -1325 5400 -1440 -4291 3867 3029 -4442 323 5084
911 5084 -2065 -2825 4620 1772 -4354 1256 3901 -3038 -2326 4629 160 -4980 1667 2950 -4389 -1766
927 -1766 4800 -1321 -5308 3087 2675 -5487 -362 5453 -2604 -4420 5156 1898 -5817 2243 5933
942 5933 -4294 -2573 6599 -527 -5698 4630 4289 -5855 -117 6016 -3393 -4740 5477 1466
956 1466 -6511 1295 4455 -5141 -3352 5811 -157 -6363 2629 4114 -5531 -1916 6766 -852 -5729
$$ packed form
850B505q524P328M657j0163R47R717o807o496J0418K61j0694N830P215j0000j515
865e321J0599l772q360Q480L367r660K103Q440o061m727Q132P69q050L314O226
880E479o526k801P557p67p446M588M783p082j620Q102l125o629O386L208q585
895d478J337P948n276n017Q098Q79q509L693O725o840k851Q158q38p471M765M761
911E084p149p60P445k848o126N610K645o939P12O955m469n140O647J283p339K623
927a766O566o121l987Q395m12q162N125N815q057j816R576l258p715Q060L690
942E933j0227J721R172p126n171J0328l41j0144N738O133r409j347J0217m011
956A466p977P806L160r596J789R163n968o206Q992J485r645L615Q682p618m877
$$ plain form
971 -5729 4532 3573 -6518 718 7484 -3391 -4380 7083 708 -7324 4307 5789 -7041 -1084
985 -1084 7516 -4322 -6184 6987 1519 -7916 2431 4988 -6785 -2700 6472 -1288 -5092 4002
999 4002 2630 -5727 -434 5326 -1596 -3157 4174 1781 -5029 760 5783 -2060 -3023 5364 659
1014 659 -6288 2591 5041 -5287 -1402 6393 -3150 -5893 4937 1324 -6231 2340 3806 -5581 -1651
1029 -1651 4410 -2014 -2352 3967 124 -3423 1230 1401 -1329 1182 1785 -136 -319 -335 501 1060 -405
1046 -405 739 1818 -2116 -2069 2535 81 -2853 2318 1280 -4208 -437 2732 -2500 -1233 2823 -1025
1062 -1025 -2610 1501 355 -1050 995 1012 -381 -276 -728 1091 1339 -1131 1112 2633 -2888 -1604
1078 -1604 4613 -1072 -3995 5245 1473 -7340 2040 5127 -6532 -1282 7633 -4218 -6141 6623
$$ packed form
971e729J0261r59j0091P236O766j0875r89J1463o375q032J1631J482j2830N957
985a084Q600j1838j862J3171n468r435J0347K557j1773M085R172p760l804R094
999D002j372q357N293N760o922j561P331k393o810N789N023p843r63Q387m705
1014F59o947Q879K450j0328L885P795r543k743J0830l613p555Q571J466r387L930
1029a651O061o424l38O319l843l547M653J71k730K511O03j921j83j6Q36N59j465
1046d05J144J079l934M7M604k454k934N171j038n488L771L169n232J267M056l848
1062a025j585M111j146j405K045J7j393J05m52J819K48k470K243J521n521J284
1078a604O217n685k923R240l772q813R380L087j1659N250Q915j1851j923J2764
$$ plain form
1092 6623 453 -7385 3969 4589 -6720 -696 6252 -3118 -3435 5624 1171 -4788 1356 4071 -2437
1107 -2437 -2192 4022 1840 -4393 335 4935 -3119 -4213 6007 1238 -7672 2772 5769 -7617
1121 -7617 -1973 8831 -4147 -6843 7947 996 -9655 4836 6504 -8491 -278 8686 -4672
1134 -4672 -4679 7994 481 -6247 4066 4114 -4773 -192 4630 -1524 -2811 2352 1613 -2717 -1017 2881
1150 2881 -370 -3777 1404 2993 -4092 -1904 5014 -2060 -5083 5128 1791 -6708 2480 5252 -6066
1165 -6066 -1011 7084 -2877 -3693 6293 253 -5259 3697 2638 -4521 1163 3405 -2720 -752 2251
1180 2251 -1168 -981 1058 -783 -438 -241 -1137 823 158 -2127 986 1358 -3182 309 3408 -2878
1196 -2878 -1421 4533 -1457 -3217 4422 919 -4035 2726 2885 -3842 606 3469 -2303 -1020 2688
$$ packed form
1092F623o170p838J1354O20j1309O024O948r370l17R059m453n959O144K715o508
1107b437K45O214k182o233M728M600q054j094J0220m769q910J0444K997j3386
1121g617N644J0804j2978k696J4790o951j0651J4491J668j4995Q213Q964j3358
1134d672pJ2673p513o728J0313M8q887M581M822o154j287N163p39m330J700L898
1150B881l251l407N181J589p085K188O918p074l023J0211l337q499R188K772j1318
1165f066N055Q095r961q16R986o040n512Q956j059p159N684K242o125J968L003
1180B251l419J87K039j841L45J97q96J960o65k285L113L72m540L491L099o286
1196b878J457N954n990j760P639l503m954O761J59o727M448K863n772J283L708
$$ plain form
1211 2688 -824 -1518 1022 -362 -552 178 -918 410 405 -2354 663 1814 -3296 -324 4071 -2683
1227 -2683 -2681 5118 -426 -4759 4303 2505 -5427 1731 4723 -4276 -986 5376 -1905 -3320 4113 700
1243 700 -3885 1779 1901 -2819 -424 1882 -866 -1429 289 657 -811 -1592 760 1407 -2346 -473
1259 -473 3531 -1555 -3099 4092 958 -4831 2924 3799 -4872 122 5589 -3374 -2797 5960 -570 -4940
1275 -4940 3742 2047 -4900 1055 3474 -3278 -1615 2925 -1077 -2321 1218 606 -1450 -641 692
1290 692 453 -1141 -762 1966 64 -2225 2255 2062 -3280 467 3882 -2783 -1711 4585 -975 -3959
1306 -3959 4030 1462 -4924 1717 3499 -4312 -1221 3967 -2143 -3072 3067 236 -3214 1037 1764
1321 1764 -1663 -778 1343 245 -755 16 1338 216 -1353 1392 2026 -1842 -462 3380 -1236 -2534
$$ packed form
1211B688l512o94K540j384j90P30j096J328nk759L017J151n110K972M395o754
1227b683KP799n544m333R062j798p932P158K992q999L290O362p281j415P433l413
1243G00m585N664J22m720K395K306k748n63J718L68j468p81K352O47l753J873
1259d73M004n086j544P191l134n789P755Q75q671M994N467q963N77Q757o530m370
1275d940Q682j695o947N955K419o752J663M540m002j244L539o12k056Q09J333
1290F92k39j594L79K728j902k289M480j93n342L747L415o665J072O296n560k984
1306c959P989k568o386O641J782p811L091N188o110r29O139k831l450M251P27
1321A764l427Q85K121j098j000P71J322j122j569K745O34l868J380L842m616j298
$$ plain form
1337 -2534 3481 806 -4153 1854 2885 -4169 -633 4237 -2319 -3182 3558 330 -3995 1734 1924
1352 1924 -2969 -333 2494 -1275 -1635 1756 787 -1500 -94 1430 101 -1207 975 1857 -1448 -988
1368 -988 2804 135 -2794 1949 2075 -3314 -279 3306 -2225 -2671 3133 -93 -3750 1627 1873 -3445
1384 -3445 -299 2855 -1685 -1918 2287 511 -1944 1009 1618 -1047 -678 1676 752 -1344 454 1891
1400 1891 -720 -1439 1890 819 -2538 627 2290 -2355 -1249 2930 -953 -2951 2243 1265 -3817
1415 -3817 305 2930 -2395 -1582 3140 -396 -2946 1908 1957 -2507 50 3123 -720 -1697 2139 1244
1431 1244 -2133 297 2489 -1168 -1813 1983 798 -2559 820 2212 -2218 -1726 2523 -373 -2837
1446 -2837 1723 1581 -2791 -475 2584 -1396 -1903 2511 556 -2477 1101 1977 -1645 -529 2703 -118
$$ packed form
1337b534O015k675m959O007J031p054L536M870o556q63O740l228m325N729J90
1352A924m893K636K827l769l60L391r69k287J406J524j329j308K182Q82l305M60
1368i88L792k669k929M743J26n389L035L585n531m46N804l226l657N377K46n318
1384c445L146L154m540k33M205j776k455K953O09k665L69K354r24k096J798J437
1400A891k611p19L329j071l357L165J663m645J106M179l883j998N194r78n082
1415c817M122K625n325Q13M722l536k550M854M9m464K557L073l843r77L836q95
1431A244l377K430K192l657o45L796j185l357L379J392m430M92M249k896k464
1446b837M560j42m372K316L059l980n07M414j955l033L578Q76l622J116L232k821
$$ plain form
1462 -118 -1867 1603 1398 -1978 -15 2265 -796 -1705 1679 455 -2343 425 1741 -1520 -1142 1415
1478 1415 -385 -1975 970 1151 -1769 -430 1557 -622 -1275 1303 966 -1150 -66 1359 -304 -1058
1494 -1058 1317 958 -1089 7 1424 -732 -1345 1458 586 -1716 348 1114 -1450 -975 1515 -212
1510 -212 -1365 721 685 -1577 -131 1161 -484 -704 819 492 -1004 74 1248 -3 -871 940
1526 940 783 -1416 38 2276 -474 -1678 1742 701 -2632 738 2184 -2208 -1114 2230 -1119
1541 -1119 -2535 1895 960 -2610 424 1988 -2073 -1414 2380 19 -1930 1074 1380 -1688 -605 2213
1557 2213 157 -1491 1304 1608 -1894 -743 2535 -320 -1978 2040 1098 -3368 203 2912 -2146
1572 -2146 -1526 3120 -938 -3529 2181 1597 -3393 590 2956 -2626 -1742 3180 -31 -2319 2292 1592
$$ packed form
1462a18j749L470k05l376J963K280l061r09L384j224k798K768J316l261L78K557
1478A415j800j590K945J81k920J339J987k179o53K578l37k116J084J425j663p54
1494a058K375l59k047J096J417k156o13K803q72k302K064P66k564M75K490j727
1510b12j153K086l6k262J446J292j645k20J523l27j496J078J174j251q68J811
1526I40j57k199J454K238k750j204L420j041l333L370J446m392J094L344l349
1541a119j416M430r35l570L034J564m061O59L794k361j949L004L06l068J083K818
1557B213k056j648K795L04l502J151L278k855j658M018r42m466L571K709n058
1572b146O20M646m058k591N710n84m990L983K366n582Q84M922l211k288M611p00
$$ plain form
1588 1592 -2405 -144 2231 -629 -940 1874 806 -1830 -53 1491 -632 -1098 1640 375 -2406
1603 -2406 -13 1697 -1526 -1131 2507 -652 -2918 1504 1081 -2741 729 2877 -1987 -1331 2593 -572
1619 -572 -1902 2076 1216 -1972 570 1347 -1119 -83 1604 69 -751 380 -163 -380 -160 374 332
1636 332 -629 -769 400 -189 -1222 791 813 -1789 -219 1397 -904 -791 2078 166 -1391 1093 634
1653 634 -1177 508 1435 -520 -212 857 -446 -431 570 181 -25 -178 -362 106 32 -593 667 357
1671 357 -1408 48 1005 -1522 -563 2029 -685 -1654 1683 346 -2125 1201 1847 -1760 -129 2198
1687 2198 -952 -1133 2170 502 -1640 900 1105 -1291 -373 1119 -161 -1191 305 666 -936 -979
1703 -979 1006 157 -1646 382 1470 -1560 -904 2096 -278 -2007 1920 1144 -2560 730 2458 -1906
$$ packed form
1588A592l997K261K375k860l11K814j068k636J777J544k123m66K738j265k781
1603b406K393J710l223L95L638l159k266M422m23l822L470K148m864O56L924l165
1619e72j330L978q60l188K542P77k466J036J687j535q20J131n43k17K20N34m2
1636C32r61j40J169n89j033K013K2k602J570J616k301J13K869j912j557K484m59
1653F34j811J685R27j955L08J069j303J5J001l89k06j53j84M68p4o25J260l10
1671C57j765J456R57k527R59K592k714r69L337j337k471L326O46l607J631K327
1687B198l150j81L303j668k142K540K05k396R18J492j280j030J496L61j602m3
1703i79J985q49j803K028J088l030O56L000k374j729L927p76l704L290J728m364
$$ plain form
1719 -1906 -702 2647 -652 -1951 2194 689 -2313 773 1590 -1803 -679 1793 -466 -1538 897
1734 897 541 -1361 -267 1034 -240 -1207 435 848 -955 -555 1375 -19 -1478 1091 1256 -1573
1750 -1573 77 2010 -1002 -1106 2333 53 -1926 1379 1261 -1837 9 1668 -1195 -1101 1494 -106
1766 -106 -1523 473 645 -1119 -315 676 -243 -634 198 557 -325 -390 684 348 -737 493 1273 -760
1784 -760 -313 1662 -89 -1191 1131 681 -1630 224 1533 -1123 -857 1413 -399 -1325 767 561
1800 561 -1186 -251 713 -734 -496 616 150 -583 -126 521 -102 -402 501 694 -530 22 1126 -234
1818 -234 -894 1186 361 -1208 534 1058 -1114 -398 1621 -402 -1405 1056 326 -1658 234 791 -1226
1835 -1226 -513 918 -279 -906 463 532 -583 -221 943 88 -521 539 759 -517 -189 982 84
$$ packed form
1719a906J204L349l299j299M145j505l002L086Q17l393J124K472k259j072K435
1734H97l56j902J094J301j274r67J642M13j803M00J930j394j459K569J65k829
1750a573J650J933l012j04L439k280j979L305j18l098J846J659k863R4K595j600
1766a06j417J996J72j764Q04R91r19l91Q32L59q82o5J074l36j085J230P80k033
1784g60M47J975j751j102K322m50k311J854J309k656K66K270j812r26K092k06
1800E61j747R35R64j447K38J112m66p33M57O47o23l00R03J93j224N52J104j360
1818b34o60K080q25j569J742N24k172P16K019k023j003K461p30j984J892N57k017
1835a226P13J431j197o27J369O9j115L62J164q55o09J060K20j276L28J171q98
$$ plain form
1852 84 -808 707 754 -1076 -257 1283 -646 -972 1010 244 -1289 401 740 -1004 -294 757 -658
1869 -658 -731 799 240 -802 140 1070 -477 -419 867 252 -578 351 878 -504 -456 998 42 -932 204
1888 204 830 -845 -381 1119 -358 -1349 788 269 -1307 128 1020 -953 -632 1010 -200 -1102 600
1905 600 538 -829 96 946 -173 -491 748 447 -497 24 832 -310 -653 755 207 -772 190 665 -838
1924 -838 -440 713 -301 -954 409 356 -980 2 626 -663 -513 724 -60 -700 483 726 -642 -97
1942 -97 913 150 -509 490 422 -473 -58 740 101 -415 303 448 -662 -144 781 -352 -660 410 176
1961 176 -715 -111 663 -663 -430 591 -161 -716 504 468 -521 -332 704 44 -407 571 586 -301 -24
1980 -24 655 -159 -486 585 312 -549 -88 570 -532 -657 739 -13 -1004 135 413 -972 -147 699 -374
$$ packed form
1852H4q92J515M7j830Q19J540j929l26J982p66j533J690L39j744P10J051j415
1869f58p3J530n59j042R42R30j547N8J286o15q30R29N27j382M8J454r56r74J136
1888B04O26j675M64J500j477r91K137n19j576J435Q92j973L21J642j210r02J702
1905F00o2j367R25Q50j119l18J239l01r44N21Q08j142l43J408n48r79R62M75j503
1924h38L98J153j014o53J363n3j336R82O24j289J50J237p84o40J183K43j368N45
1942i7J010p63o59R99o8q95M15P98o39n16P18J45j110N18R25j133l08J070k34
1961A76q91O04P74j326K33J021p52n55J220l6r89J89J036o60m51R78J5q87K77
1980b4O79q14l27J071k73q61M61O58j102j25J396p52r91J139K78j385Q25Q46j073
$$ plain form
1999 -374 -821 535 292 -818 217 901 -232 -448 821 151 -728 601 786 -486 -324 776 -240
2016 -240 -674 542 574 -705 -263 536 -585 -717 787 225 -1121 244 473 -997 -408 1173 15
2033 15 -926 810 480 -946 146 1208 -286 -460 914 -36 -887 365 945 -667 -136 552 -345 -904
2051 -904 616 485 -731 -178 650 -589 -844 694 175 -896 261 387 -755 -389 710 152 -566
2068 -566 423 362 -590 190 855 -135 -97 758 110 -768 394 546 -337 0 494 -246 -651 160 218 -272 15
2089 15 487 -246 -675 194 88 -385 72 510 -189 -560 174 408 -68 344 576 -221 -341 307 256 -200 206
2110 206 462 -386 -678 401 160 -497 78 252 -588 -339 436 36 -319 21 135 -453 -346 484 -101 -314
2130 -314 328 233 -258 67 607 -43 -56 576 404 -527 132 582 -368 -41 750 -111 -662 373 425 -669
$$ packed form
1999c74m47J356k43j110J035O84j133k16J269o70q79J329J85j272J62J100j016
2016b40m34J216L2j279M42P99j121j32J504n62j346J365K29j470N89J581j158
2033A5r41J736l30j426J092J062j494j74J374r50q51J252N80j612N31O88q97n59
2051i04J520j31j216N53Q28j239k55J538n19j071J157J26j142L66J099n58p18
2068e66R89o1r52P80O65r90L8Q55o48q78J162J52q83L37M94p40m05Q11N8m90K87
2089A5M72p33m29Q69j06m73M57M38o99l71P34K34m76M12K32p97j20O48n1m56M06
2110B06K56q48k92J079k41o57N75J74q40K49P75m00l55L40J14n88J07Q30n85k13
2130c14O42r5m91L25N40o50j3O32j72r31O59M50r50L27P91q61n51J035N2j094
$$ plain form
2150 -669 -61 590 -586 -544 513 45 -753 207 584 -687 -365 565 -67 -508 523 417 -641 43 702
2169 702 -184 -338 615 297 -635 99 691 -395 -340 781 -23 -768 290 459 -784 -14 664 -509 -685
2188 -685 398 -118 -958 157 250 -631 -256 686 -183 -379 548 277 -492 177 664 -179 -181 547 227 -424
2208 -424 177 399 -162 -203 478 3 -609 19 506 -430 -292 575 -308 -564 413 164 -694 162 393 -442
2228 -442 -192 846 -58 -176 529 322 -289 140 386 -75 -111 364 27 -241 270 113 -25 -117 -56 96 -398
2249 -398 -263 291 -233 -346 258 249 -332 -53 413 -550 -174 490 -139 -312 430 328 -325 282 641 -235 -107
2270 -107 299 -35 -152 217 295 -155 -11 138 101 -141 -14 205 -189 -216 127 -57 -398 -30 313 -519 -232
2291 -232 498 -291 -274 694 119 -695 514 520 -549 -6 855 -115 -250 488 173 -302 301 194 -268 -5
$$ packed form
2150f69O08O51j176M2J057m68p98R60L77j271L22R30o32m41J031j06j058O84O59
2169G02q86j54R53l18r32P34N92j086N5J121q04p45J058J69j243P70O78j173j76
2188f85J083n16q40J115R3q81L75R42q69j96R27k71p69O69M87q43kP28l20o51
2208d24O01K22n61m1O81m75o12O28M87r36J38Q67q83k56R77k49q58Q56K31q35
2228d42K50J038r04j18P05k07o11M29K46m61l6M75l37k68N11j57j38r2O1J52m94
2249c98J35N54n24j13O04rn81K79M66r63L76O64o29j73P42j02o53O07L59q76J28
2270a07M06l34j17L69P8m50J44J49l7k42J27K19l94k7L43j84l41L68L43q32K87
2291b32P30p89J7R68n75q14J209Oj069N43Q61r70j35P38l15m75O03j07m62K63
$$ plain form
2311 -5 183 -17 -224 -35 31 37 -412 41 135 -427 -74 455 -301 -564 400 35 -636 409 386 -508 -9 663
2333 663 -228 -206 683 -9 -335 518 286 -530 108 330 -384 -182 121 -87 -311 -3 89 -192 -303 49 70
2354 70 -277 116 320 -111 -317 471 211 -350 175 650 -182 -76 681 56 -521 656 252 -565 95 563
2374 563 -405 -212 293 -90 -354 276 77 -397 50 54 -155 -164 175 317 -228 -274 280 114 -185 91 411 -326
2396 -326 -144 470 -144 -328 443 168 -462 261 384 -399 32 374 -401 -377 400 -24 -532 -8 100 -245
2416 -245 -160 210 -199 -43 -6 158 -107 -181 24 91 -237 65 315 -77 -163 278 276 -237 217 444 -420 -39
2438 -39 551 -269 -297 353 80 -527 235 344 -607 0 179 -378 -257 277 25 -240 -94 147 -16 -71 -6
2459 -6 281 -107 -42 452 -108 25 399 219 -364 29 455 -392 -343 556 -73 -467 296 78 -526 30 415
$$ packed form
2311eJ88k00k07J89O6Om49M53R4n62L53N29p56k63R64l65o71J045k3q94M99O72
2333F63q91K2Q89o92l26Q53k32q16O38K22p14K02L03k08k24L08R2k81j11L52K1
2354G0l47L93K04m31k06P88k60n61N25M75q32J06P57o25n77J177m04q17O60M68
2374E63r68J93N05l83k64O30j99m74M47Mk09rL39J42n45m6N54j66k99K76L20p37
2396c26J82O14o14j84P71k75o30P23J23p83M31L42p75K4P77m24n08N24J08l45
2416b45Q5L70m09J56L7J64k65p4K05O7l28L02K50l92q6M41kn13M54K27q64L81
2438c9N90q20k8O50k73o07P62J09r51O07J79n57J21N34k52k65J46K41j63n5O5
2459fK87l88O5M94n60J33L74j80n83L93M26q47M9Q99o29l94P63k18o04N56L85
$$ plain form
2480 415 -345 -332 515 -35 -421 103 181 -146 -141 410 -44 -162 393 145 -240 88 182 38 -228 266 126 -208
2502 -208 -42 113 -262 -165 407 -77 -516 49 293 -593 -119 396 -415 -185 278 166 -247 168 405 -51
2522 -51 18 334 -72 -237 166 209 -215 73 214 0 -87 39 127 -113 -207 114 -247 -321 165 46 -297 37
2544 37 157 -350 -245 83 45 -159 172 165 -272 -41 332 -81 -112 248 25 -91 139 133 7 54 292 21 -71
2567 -71 21 90 47 -315 117 -38 -228 -163 28 5 -163 174 -165 -408 133 88 -271 122 299 -239 -30 249
2589 249 169 -35 110 182 -97 -138 427 121 -223 51 303 -323 -222 260 -114 -322 144 125 -304 22 304
2610 304 -144 -338 113 -79 -216 148 328 -240 -54 317 176 -322 275 214 -133 146 460 -141 -331 233
2630 233 63 -291 44 318 -379 -289 425 -90 -416 251 124 -288 47 195 -192 -230 186 -79 -325 188 254
$$ packed form
2480D15p60J3Q47n50l86N24P8l27NN51m54j18N55k48l85L28R4j44k66M94j40l34
2502b08J66J55l75R7N72m84m39N65K44q86M74N15q11K30M63j12m13M15K37m56
2522e1O9L16m06j65M03M3m24K88J41k14q7J26Q8k40r4L21l61p4M86j19l43L34
2544C7J20n07J05L28l8k04L31pm37K31L73m13l1L60k23j16K30oj26M7K38k71r2
2567g1R2O9m3l62M32j55j90O5J91k3j68L37l39k43N41m5l59L93J77n38K09K79
2589B49q0k04J45P2k79m1N65l06l44K74K52o26J01M82l74k08M66j9m29L26K82
2610C04m48j94M51j92j37L64J80n68J86L71j41m98N97o1l47K79L14o01j90N64
2630B33j70l54L35K74o97R0P14n15l26O67j27m12L35J48l87l8M16k65k46N13O6
$$ plain form
2651 254 -283 -85 244 33 -120 160 260 -176 -36 282 -41 -199 115 143 -284 -107 231 -194 -272 297 -156
2672 -156 -278 158 89 -371 -227 275 -12 -199 96 -6 -192 77 374 -42 37 201 -2 -58 10 142 -61
2693 -61 35 123 127 -282 -58 148 -262 -94 183 -235 -257 -13 169 -403 65 149 -297 -181 230 -31 -329 202
2715 202 218 -124 -9 78 -20 28 144 153 3 -175 245 144 -217 111 166 -43 -146 235 36 -279 99 149 -316
2738 -316 -236 173 -250 -313 138 10 -349 131 277 -184 -8 231 -83 -45 240 123 -91 32 19 -121 180
2759 180 123 66 -143 120 127 -55 -99 74 -12 -235 17 -12 -250 -186 246 -32 -347 218 209 -292 58 310 -139
2782 -139 -38 182 -35 -106 267 228 -36 198 239 -243 -44 211 -134 -132 111 25 -70 -91 112 61 -243 -247 157 -96
2806 -96 -435 139 121 -354 154 114 -304 151 405 -73 -217 346 -21 -153 184 236 -98 -27 165 -109 33 33
$$ packed form
2651B54n37J98L29k11j53K80J00m36J40L18l23j58L14K8m27J77L38m25p8N69m53
2672a56j22M36o9m60J44N02k87j87K95j02j86K69K97m16P9J64k03n6O8J32k03
2693f1R6Q8Mm09K24K06m10J68K77m18k2K44J82n72M68Q4m46J16M11k61k98N31
2715B02J6l42J15Q7r8M8J16Rj50j78M20j01l61L28N5k09j03L81j99l15L78N0m65
2738c16Q0M09m23o3M51j28l59M80J46m61J76K39l14L8K85j17k14J23j3j40L01
2759A80n7n7k09K63Pj82m4J73q6k23K52k9k38O4M32k78l15N65rn01L50K52m49
2782a39J01K20k17p1L73l9k64K34M1m82J99K55l45KK43q6r5k1K03n1l04mM04k53
2806i6l39N74j8m75N08m0m18M55K54m78j44N63l67j32L37N2l34P1J92k74J42%
$$ plain form
2828 33 36 -55 -57 -16 21 18 -146 164 -246 -308 191 36 -277 87 171 -230 -21 367 -225 -116 261 261 -296 272 99
2853 99 -139 49 385 -184 -150 274 -30 -159 184 199 -266 -173 54 96 -69 -7 171 33 -147 4 123 -165
2875 -165 42 131 -54 -248 169 -95 -344 347 187 -142 237 246 -114 -95 350 66 -227 59 83 -187 -136 32
2897 32 -71 -172 51 -168 -124 -74 86 -56 1 45 76 -140 -115 137 60 -162 377 277 -140 103 333 -149 -25
2920 -25 366 -190 -239 74 10 -255 -2 119 -192 -63 77 -63 -103 86 54 -167 36 -22 37 28 175 120 -69
2943 -69 -72 106 -131 -67 -38 82 -95 50 181 -139 -241 28 -14 -231 124 -29 -263 -80 178 -221 -89 172
2965 172 -3 -193 -27 -101 -147 23 231 -17 -67 92 144 18 -134 76 29 -115 31 198 -69 -122 177 29
2987 29 51 306 188 -153 -8 243 -282 -26 161 81 -58 -137 -129 -90 -160 165 -80 -129 98 83 1 100 12 11 -147
$$ packed form
2828C3Lr1kM1L7lj64L10m10o2M99j55l13L64Q4m01K09L88n92J09L77%n57N68j73
2853I9k38J88L36n69L4M24l04j29L43J5m65R3K27M2j65O2J78j38j80J51J19k88
2875a65K07Q9j85j94M17k64k49O91j60l29L79Rl60J9M45k84k93K86K4k70N1J68
2897C2j03j01K23k19M4N0J60j42N7M4L1k16K5K52p7k22N39j00m17K43K30m82J24
2920b5L91n56m9L13o4k65K53J21l11J29J40j40m0J89l2k21K03n8N9rJ47n5j89
2943f9lJ78k37O4K9J20j77J45J31l20j02K69m2k17L55j53k34J83K58l99J32K61
2965A72j75j90J66p4m6J70K08k48n0J59N2j26j52K10m7j44J46J67k67n3K99j48
2987B9K2K55j18l41J45K51n25K56J87q0j39p9QL9p0L25k45m9K27j5q2R9q8jj58
$$ plain form
3012 -147 76 -57 -165 20 251 -47 -232 120 144 -8 215 254 -206 -118 168 -89 -144 98 43 -87 -105 126
3034 126 -63 29 -18 90 -171 88 -18 -126 -102 118 41 -66 116 14 -139 -3 125 15 -55 115 -148 -135
3056 -135 -4 147 -104 -58 -63 -81 -237 2 57 -184 -96 157 122 -196 92 -123 -3 -54 94 -38 -133 96 100 -224
3080 -224 73 204 -129 -86 268 104 -174 69 134 63 -102 56 -19 -175 182 -75 -196 -3 80 -152 -106 272
3102 272 42 -291 104 112 -157 -38 211 -69 -121 102 75 -177 -26 156 -179 -102 -71 122 -245 38 -16 -189
3124 -189 -1 -5 -86 -132 197 140 27 -49 132 -11 -27 153 53 -3 -46 -34 84 -89 189 39 -52 124 -39 -36
3148 -36 2 -32 -108 -30 177 87 -123 -202 23 -113 -27 141 -71 -201 47 51 -173 -96 179 107 -96 195 178 -113
3172 -113 25 54 -20 -117 88 100 57 153 177 -67 -91 99 -25 -127 -150 234 -94 -69 84 -30 -370 -51 253
$$ packed form
3012a47K23j33j08J85K31k98j85L52K4j52K23L9m60Q8K86k57n5K42n5j30j8K31
3034A26j89R2m7J08k61K59j06j08K4K20p7j07J82j02j53J36J28j10p0J70k63J3
3056a35J31J51k51M6nj8j56K39N5k41Q8K53l5l18K88k15J20n1J48j32r5K29Ml24
3080b24K97J31l33M3L54j64k78K43O5p1j65J58p5j56L57k57j21J93Q3k32M6L78
3102B72k30l33L95Qk69J19K49k80n2K23k7k52J51J82l35P7L1J93l67K83n4j73
3124a89J88mq1m6L29n7j13p6J81j43j6J80j00n6m3J2J18j73K78j50r1J76j63L
3148c6L8l4p6P8K07r0k10p9K25j36Q6J68k12j30K48Mk24P7K75p2k03K91j7k91
3172a13J38K9p4r7K05J2m3R6K4k44k4J90j24j02k3L84l28K5J53j14l40L19L04
$$ plain form
3195 253 -33 -168 -22 -2 105 -73 80 -127 125 133 -78 -87 145 6 -81 193 128 -197 -43 144 109 -98 82
3218 82 -8 -361 -6 16 -256 -63 104 -80 -207 164 76 -94 -165 98 21 1 47 3 -84 51 126 -42 5 40
3242 40 86 -52 177 -31 -117 -117 65 116 -181 55 5 -144 -149 54 -119 -268 17 10 -122 61 95 -181 -104 180
3266 180 119 -200 136 180 -19 68 137 -89 -134 -131 123 -140 71 27 -127 150 71 -21 104 26 82 1 -143 27
3290 27 -98 -167 -17 31 -200 -54 40 43 113 97 -24 -62 -23 125 -147 -4 -64 -10 -57 -45 -6 -19 -3 -3 -138 -226 -205
3317 -205 -58 -180 -14 28 -63 -179 99 7 -26 -27 100 11 -64 1 123 -137 120 74 68 56 19 64 -186 114 -110
3342 -110 -157 -27 59 33 -13 -134 85 -85 193 -3 68 -117 22 -84 -9 -113 -19 -5 -38 26 -193 -72 83
3365 83 20 -86 28 82 44 -41 47 -23 -88 -54 172 69 -15 -46 44 -55 -35 -94 -104 4 237 -184 -9 57 -62 -82
$$ packed form
3195B53k86j35J46K0J07j78J53k07K52Qk11rK32j39q7K74o5l25J54J87l5k07J80
3218H2r0l53L55K2k72J93J67j84j27L71q8j70p1K63p7k0M6m4q7J35P5j68M7L5
3242D0M6j38K29k08q6%J82N1k97K36n0j49nK03j73j49K85pj32J83L4k76P7K84
3266A80o1l19L36M4j99Q7O9k26m5LK54k63K11m4j54K77p9r2J25p8N6q1j44J70
3290B7j25o9J50M8k31J46R4LP0j6j21l8L9J48k72J43o0N4m7J2L9j3J6%j35q8K1
3317b05J47j22J66M2r1j16K78r2l3jJ27q9p5O5J22k60K57m6oj2l7M5k50L00k24
3342a10m7J30Q6k6m6j21K19j70K78j96P1j85J39j06P5j04R4J4l3O4k19J21J55
3365H3o3j06J14N4l8q5Q8p0o5L4K26j03q4l1R0r9K0n9j0J08K33m21J75O6j19k0
$$ plain form
3391 -82 54 16 117 -78 65 -58 -62 -72 73 -26 194 -5 -60 27 -77 83 50 158 86 98 -14 129 58 62 107
3416 107 37 40 -45 -174 -134 -20 142 73 76 110 42 -86 -1 19 -207 36 31 -77 42 64 32 31 -147 54 65 90 -54
3443 -54 1 -293 72 44 -31 -72 5 -22 -155 -150 168 201 -11 14 91 33 -14 261 -181 -137 190 -91 85 -35 32
3468 32 88 -140 150 -107 30 76 190 -72 -24 209 -8 -59 55 -59 90 -100 -106 -271 -64 22 -40 -94 -147 76
3492 76 -117 -39 63 151 28 42 15 -150 -66 240 115 -151 -87 -5 4 -46 8 -19 -80 86 3 76 116 52 -19 85
3518 85 182 -9 -70 187 68 -163 16 102 99 -95 -113 -32 -102 -133 96 127 -36 6 -47 -31 -16 -94 -166 46 125 -264
3544 -264 -78 46 10 -149 -17 -31 -3 29 -66 47 -263 27 -145 272 -4 117 50 -70 82 -12 -73 -20 73
3567 73 59 21 29 114 8 -79 47 -87 -15 134 -47 -142 -22 -13 -21 93 -66 -58 -4 -17 -30 159 47 48 -23 50 -13 128
$$ packed form
3391h2J36l8J01j95J43j23mj0J45r9K20j99n5Q7j04J60l3J08p2J2j12J43p1MM5
3416A07p0Lq5j29M0J14J62o9LL4o8j28Q5K0k26K43nj08J19K2l2jj78K01J1K5j44
3443e4N5k94L65k8p5m1P7k7j33NL18L3k12K5P7n8m7K75m42M4L27k81J76j20O7
3468C2N6k28K90k57J37M6J14k62M8K33k17n1J14j14J49j90oj65K07Q6o2n4n3K23
3492G6j93P8J02Q8j23J4k7j65Q4L06j25k66O4Q2Rn0N4k7o1J66q3P3M0o4p1J04
3518H5R7j91o1K57j19k31J79Q6lj94j8Q1p0l1K29L1j63M2n3J6J5p8p2K12P9l89
3544b64J86J24l6j59J32j4K8L2r5J13l10K90j72M17k76J21o7j20J52r4o1N3R3
3567G3j4l8QQ5j06q7J26j34P2J49j81r5J20RqJ14j59QN4j3j3J89j12Jp1P3o3J41
$$ plain form
3595 128 -75 132 11 -48 92 -103 -69 13 20 181 2 -218 21 6 -113 -73 -10 -78 126 -45 33 20 54 21
3619 21 -89 90 147 -32 40 90 -7 -61 28 10 36 -122 -16 -93 -59 11 66 -175 101 10 143 -88 21 -50 -167
3644 -167 54 53 122 -180 138 6 103 -121 53 -52 -26 41 28 -139 75 -76 -161 67 5 -55 -27 80 37 -110
3668 -110 12 6 -125 -2 9 -79 122 22 41 -178 27 162 -87 -43 146 47 82 17 -7 79 18 39 -78 -31 54
3693 54 68 -36 -27 124 -62 -83 -16 -36 -40 -123 -65 -56 64 -63 -114 90 -95 -10 36 -45 -106 -21 -82 122 -149 -21 35
3720 35 18 47 60 141 -283 190 -15 82 -94 108 59 -48 -157 47 106 -11 -24 57 29 -23 64 -16 -158 -130 19
3745 19 -119 -57 5 -164 35 -29 -79 15 -137 -76 105 -63 135 78 -141 -222 -109 5 -102 -50 60 -121 64
3768 64 13 -13 -102 -90 -197 -118 93 26 -199 -102 55 0 -71 -114 80 -24 32 130 -86 -1 85 -147 -93 50 32 27
$$ packed form
3595A28k03K07j21n9J40j95L4Q2PJ61j79k20K39j5j19M0O3o8K04j71P8j3L4l3
3619B1j10J79N7j79P2N0r7n4Q9j8K6j58J06p7L4P0N5k41K76r1J33k31J09p1j17
3644a67K21jO9l02L18j32R7k24J74j05K6O7j3j67K14j51q5K28o2o0K8J07m3j47
3668a10J22oj31J23J1q8K01j00J9k19K05J35k49M4J89r9L5o5k4Q6o1K1j17M7Q5
3693E4J4j04RJ51j86k1O7k0mq3N8RJ20j27n1K04j85Q5M6q1o1Q5o1K04k71J28N6
3720C5j7K9J3Q1m24M73k05R7j76K02m9j07j09K04N9j17j3Q1k8n2Q7q0j42K8J49
3745A9j38O2O2j69J99o4n0R4j52O1J81j68J98n7k19q1J13J14j07N2J10j81J85
3768F4n1k6q9J2j07P9K11o7k25R7J57n5p1m3J94j04N6R8k16Q5Q6k32N4J43j8n
$$ plain form
3794 27 23 -6 -44 -76 27 53 -113 -39 91 18 -115 -93 24 65 -30 185 -163 -37 -13 -39 -98 48 117 -34 -64 118
3820 118 -2 -64 41 150 43 -64 107 -44 60 -8 131 -73 55 15 -67 -54 0 34 115 -6 -151 107 -52
3843 -52 33 31 -17 97 65 -82 -103 -23 93 43 -16 88 -98 -32 73 25 -70 200 -41 -21 -14 100 -238 70 12 -89
3869 -89 -78 -30 -20 -294 -18 154 -94 -146 40 44 -122 68 49 -29 29 39 50 57 47 1 -94 50 -70 10 29 -33 45
3896 45 -131 1 -138 -70 -59 92 11 -89 124 -31 -46 -196 72 35 -11 54 139 -85 31 58 -145 70 37 -58
3920 -58 -8 26 99 79 -142 63 10 137 33 -9 20 -117 88 -129 -113 -63 219 -77 200 12 63 -121 81 -105
3944 -105 -37 -78 45 13 -113 12 -161 10 103 23 -80 189 45 -112 -37 77 -5 -16 40 53 15 -127 -181 14
3968 14 55 -19 -55 105 -147 -14 30 -76 135 -46 -56 82 94 180 144 93 -90 36 56 15 -88 36 219 -103
$$ packed form
3794B7mk9l8l2J03K6j66P4J30p3j33K2J17M1r5K15l48J26K4k6n9J46O9j51l0J82
3820A18j20o2J05J09j07j07J71j51J04o8J39k04J28m0q2J3N4L4Q1j21j45K58j59
3843e2Q5km8J14l2j47k1Q0J16n0n9J04j86O6J05m8r5K70k41K0PJ14l38L08n8j01
3869h9J1M8J0k74K76J72k48n2J86Mj66J90j9p8N8J0J1Pj0m6r5J44j20Q0J9o2P8
3896D5j76J32j39O8J1J51q1j00K13j55j5j50K68l7m6O5Q5k24J16K7k03K15l3r5
3920e8N0L4P3k0k21K05n3J27j04m2K9j37K05k17J6N0K82k96K77j88N1j84K02j86
3944a05O8m1J23l2j26J25j73J71R3q0j03K69j44j57P5J14q2j1N6J3l8j42n4J95
3968A4M1p4l6J60k52J33M4j06K11j81j0J38J2Q6l6n1j83J26K0m1j03J24J83l22
$$ plain form
3992 -103 31 96 -9 38 -151 45 -134 -53 -81 -130 -25 90 98 -75 -59 -11 49 -65 -94 -16 63 19 35 -65 84
4017 84 153 -113 108 117 159 -2 45 74 -94 -132 94 -144 -39 6 -12 -72 -89 138 -74 -29 -175 -52 -20 -37 102
4042 102 -145 -53 -144 194 -24 -19 -75 35 78 175 57 17 -71 166 5 67 67 -95 68 -356 81 64 5 -104 -143
4067 -143 -34 3 93 -73 38 27 -8 6 73 -47 -131 10 157 97 -68 62 -51 -105 0 72 15 -119 10 -32
4091 -32 -56 162 27 -174 2 99 30 -85 -35 58 4 -51 -20 -9 27 30 5 -27 -30 152 -6 108 36 73 -19 23 67
4118 67 -94 -68 128 47 -13 118 62 -177 28 -78 -126 -83 -39 33 -154 -102 89 -22 52 303 136 51 49 -21 6
4143 6 38 77 -3 -103 149 19 -30 -106 -87 -84 -53 28 -17 -110 -27 39 13 73 -26 -120 -1 109 36 -143 42 -1 -82 -92
4171 -92 110 29 7 -57 11 -135 19 200 165 -190 14 -34 -48 45 56 -8 41 98 -27 -110 -93 73 -175 11 -128
$$ packed form
3992a03J34O5j05M7j89J96j79Q1k8m9J05J15Qj73J6M8O0j14k9P8P9m4J6j00J49
4017H4O9k66K21RM2j61M7K9j68l8K26k38J05M5j8o0j7K27k12M5j46J23L2j7J39
4042A02k47R2r1L38k18Nn6J10M3R7j18m0q8K37j61O2%j62J63m24M37j7n9j09l9
4067a43J09L7R0j66J11j1l5J4O7j20q4J41J47o0j65J30j13n4J05P2n7j34J29m2
4091c2k4K18j35k01J76R7o9j15N0R3n4n5L1J1L6Lk5l2lJ82j58J14p2L7r2M2M4
4118F7j61K6J96q1o0J31n6k39K05j06m8M3M4P2j87N2J91j11P4K51j67q5kp0K7
4143FL2L9q0j00K52j30m9p6J9LL1Q1m5r3Q3O6k6O0r9r4J19J10p3j79J85m3q1j0
4171i2K02q1k2o4O8j46J54J81l5l55K04m8j4R3J1o4M9N7j25q3J7J66k48J86j39
$$ plain form
4196 -128 12 -29 -108 -46 -163 66 19 113 -24 -3 114 -176 91 -3 61 17 -139 22 75 -111 -45 196 -56 33
4220 33 118 -57 34 5 -121 69 9 -64 30 -13 -28 61 -93 -113 -103 35 -77 -13 80 78 52 -39 -7 -67 -167 -164 24
4247 24 77 31 -9 115 71 -20 5 54 28 -69 -121 -51 13 -65 27 -83 -68 -39 -123 -34 -177 -6 -130 93 -59 43
4273 43 2 0 50 47 -79 180 -69 117 147 -21 90 93 12 -50 49 -51 39 158 -17 -35 -1 -86 -48 33 84 121 49
4300 49 -23 50 -63 62 38 -87 -84 46 -66 -91 -27 25 -8 -42 -8 97 -56 144 -52 195 29 -40 43 24 -56
4325 -56 -62 118 -97 155 150 103 113 -12 -88 102 -72 -55 -41 -1 -37 57 -59 32 158 30 -26 -24 -181 -58 -2 -68
4351 -68 144 85 253 -59 -100 -9 -125 14 20 -18 27 -169 40 -20 -43 0 -43 77 92 151 44 61 60 -31 66 70 -103
4378 -103 124 29 83 -88 22 -35 80 6 -84 145 -158 31 -45 -47 173 21 -3 -145 84 -38 -84 21 5 -3
$$ packed form
4196a28J40m1p9O2j17K29m7R4j37K1J17k90K67r4O4m4j56J61N3j86O6K41k52Q9
4220C3Q5j75R1k9j26J90o0p3R4m3j5Q9j54k0J0J38j12O4R3kk6r1L2o0j00LJ88
4247B4N3m6m0J24m4r1K5M9k6r7n2P0O4p8R2j10J5K9q4Q9j43J71j24K23j52J02
4273D3m1kN0lj26K59k49J86L0j68J11Lq1o2R9j00R0J19j75j8L4q5L8Q1N1L7p2
4300D9p2P3j13J25k4j25LJ30j12k5O4N2l3l4L4J05j53K00j96K47j66o9Q3j9q0
4325e6oJ80k15K52nm7J0j25p6J90j74J7J4M0l6R4j16R1J26j28n6Kj57J23N6o6
4351f8K12n9J68l12m1R1j16J39Ol8M5j96K09o0k3M3m3J20J5N9j07J7jr1R7Mj73
4378a03K27r5N4j71J10n7J15p4r0K29l03J89p6kK20j52k4j42K29j22m6J05j6q
$$ plain form
4402 -3 -72 97 -128 -181 188 99 27 1 -183 -50 -130 -60 -85 38 -85 -87 -46 29 160 82 -12 -95 65 22 112 47 28
4429 28 21 177 4 -13 -77 34 31 -61 61 -44 212 10 -56 67 77 -175 30 44 -29 -24 -41 -55 -43 87 -140 -62
4455 -62 244 -167 -78 -34 -64 93 -60 -39 94 -39 -25 -2 -104 -11 137 19 -81 5 83 -11 99 2 25 23 89
4480 89 88 -119 -71 -125 -21 48 84 -137 51 -28 -36 -62 10 -5 -29 -83 94 73 68 -72 29 82 109 -40 73 54 5
4507 5 147 -147 -38 -51 61 123 -73 37 103 -5 -96 75 -116 56 127 32 91 -28 -45 59 37 55 154 49
4531 49 -81 169 109 149 43 -63 -47 17 -99 31 -15 35 117 -12 -17 -93 67 -42 0 255 11 -82 79 15 130
4556 130 -149 41 119 -48 33 -79 -51 -22 57 121 17 59 -121 110 -25 -1 59 -95 57 74 44 3 13 -22 59
4581 59 -79 -251 -99 1 91 -56 139 12 -95 -94 87 44 147 -1 -128 150 -10 6 44 -62 -43 172 7
$$ packed form
4402co9J69k25n3L69q9p2k6j84J33q0P0k5J23j23kM1P5J31p8r4q3J60m3R0o5j9
4429B8pJ56j73j7o4J11lr2J22j05K56k02o6J23J0k52K05J4p3Nj7j4J2J30k27P8
4455f2L06m11Q9M4l0J57j53K1J33j33J4K3j02R3J48j18j00Q6P8r4J10r7K3kO6
4480H9jk07M8n4J04O9L6k21J88p9qk6P2j5k4n4J77k1nj40J01N3K7j49J13j9m9
4507EJ42k94J09j3J12O2j96J10O6j08r1J71j91J72P1r5N9j19j7J04k2J8R9j05
4531D9j30K50o0M0j06j06J6O4j16J30m6N0Q2j29np6J60j09M2K55k44r3J61o4J15
4556A30k79J90P8j67Q1j12K8K9P9O4j04M2j80K31j35K4O0j54J52J7l0m1J0l5Q1
4581E9j38j72J52J00R0j47J95j27j07JJ81m3J03j48j27K78j60J6L8j06J9K15j65
$$ plain form
4604 7 14 81 -110 -23 36 43 5 -54 127 -6 164 56 126 46 27 -11 19 -11 -20 -157 81 -55 -69 109 10 -56 -94 112
4632 112 -5 34 3 203 -72 -173 -54 -11 -72 -139 182 128 71 -141 23 41 43 69 -139 -141 103 -15 111 15 132
4657 132 -62 62 68 -23 -2 -72 -20 66 -85 -30 -71 -186 -31 -34 17 -49 -36 -3 111 -43 96 6 78 57 -102 -64
4683 -64 -72 130 24 -42 78 43 -189 -19 115 147 96 25 -47 -63 31 108 89 18 74 43 -63 1 -67 -88 -40 -18 22
4710 22 45 80 27 -122 128 -36 102 -71 28 83 -59 -4 -1 -169 -67 -88 12 -4 -163 193 59 -17 20 83 -75
4735 -75 -69 -88 11 23 -114 -31 -47 10 74 75 -106 -36 60 36 -21 54 -14 -60 5 -27 165 -30 -33 44 75 -39 12 -73 27
4764 27 62 62 -98 60 116 -78 42 54 -113 9 130 5 7 -98 92 -150 143 -32 -7 -59 -5 -169 149 13
4788 13 46 -84 4 -116 -66 -22 0 3 -199 -7 -115 -36 4 110 -139 -57 -137 126 -137 40 5 108 -138 99
$$ packed form
4604GPO7j91Q7N9Pl8n9J81j33J70j08P0q0j9l8L0l0rj37K38j36j4J78r9o6l8K06
4632A12j17L9l1K00k75j01J19M3o1o7L21n4n7k12J64J8KK6k08kK44j18J26r6J17
4657A32j94J24Or1K1p0N2Q6j51N5m1j15J55lN1o6J3L3J14j54J39r0P2k1j59L8
4683f4qK02j06o6J20l5k32J70J34L2n1p1p2j6R4P7j9p1N6l1j06O4o8k1M8K2M0
4710B2K3L5n3j49K50j64J38j73R9N5j42N5Lj68J02k1J00j6j59L56j34p6L7O3j58
4735g5Oj9R9J2j37Q3j6N7O4Jj81P0R6k4n7P5o8m6O5l2J92j95lP7L1j14N1q5J00
4764B7L5%j60J58N6j94J20J2j67J22J21j25Kj05J90k42K93j75K5n2N4j64L18j36
4788A3L3j30Q8j20N0M4K2Lk02J92j08P9M0J06k49Q2q0K63k63J77l5J03k46K37
$$ plain form
4812 99 5 -68 81 -35 20 82 -77 101 29 -64 -101 61 80 22 140 0 -15 -125 7 -30 70 90 -12 -24 22
4837 22 -25 -92 -69 -43 -51 53 55 106 -85 116 125 -1 17 3 50 31 -14 86 -102 27 -52 34 33 -58 -3 87 -167 10
4865 10 47 71 -151 74 -72 47 39 12 4 -227 60 -89 -39 -74 -81 1 58 56 59 11 42 57 -1 152 17 234 73
4892 73 -29 1 -108 124 -25 -115 -42 80 58 -51 -57 -36 -253 -77 -53 3 -41 -217 -39 -135 -107 -57 -72 47 -33
4917 -33 -61 -124 66 82 30 9 -14 -45 -94 23 48 145 -101 -107 11 18 69 21 -115 65 -64 -54 55 -63 52 -13
4943 -13 -113 -22 94 47 -108 -55 85 186 19 -62 -68 -46 -13 92 171 27 -18 92 -11 -58 -46 56 86 6 35
4968 35 28 -132 37 -12 42 5 138 86 73 -213 8 14 -26 -142 -14 59 -23 -50 56 40 -72 81 -60 78 10
4993 10 72 122 3 38 -128 -35 136 28 -70 -148 139 40 28 83 -7 17 -52 -128 162 2 84 129 -22 -10 113 32
$$ packed form
4812I9r4p3J49j16N5O2j59J78p2r3l7J62J9n8J18j40j5j10J32l7J00K0j02j2M6
4837B2m7o7K3K6qJ04KN1j91K01Rj26J8j4M7j9m5J00j88J29p9Q6jr1N5R0k54J77
4865A0L7K4k22K25j46J19qk7qk31K87j49N0l5pQ2N7kLm8L1J5n8J53j35K17j61
4892G3j02L0j09K32j49r0P3J22k2j09oK1k17J76K4N6m4j76J78r6K8N0j5J19q0
4917c3k8o3J90J6n2k1k3l1m9J17K5R7k46oJ18PN1m8j36J80j29J0J09j18J15o5
4943a3j00R1J16m7j55N3J40J01j67q1oK2L3J05P9j44m5J10j03m7J2J02L0q0K9
4968C5pj60J69m9N4l7J33n2j3k86K21Om0j16J28P3q2k7J06j6j12J53j41J38o8
4993A0O2N0j19L5j66R3J71j08r8p8K87r9j2N5r0K4o9p6K90j60Q2M5j51J2J23q1
$$ plain form
5019 32 118 -4 -55 -70 -122 -58 -29 26 87 -100 11 -59 -131 -62 -8 102 135 82 42 -121 198 -56 -53 30 144 90 -250
5046 -250 28 209 -13 -36 102 132 23 45 -61 -21 99 -47 -44 10 11 -58 -29 31 -129 -66 31 -22 -2 209 18
5071 18 -137 -20 -16 -14 -48 -104 22 134 -121 159 181 4 93 -10 -17 -72 104 1 23 -30 -85 -136 18 144 -70
5096 -70 -15 138 118 -33 33 110 32 139 -52 -47 -100 90 106 -30 -94 8 160 -45 -25 -24 -33 -30 2 -45 8 -26 -249
5123 -249 38 8 9 -21 82 70 36 104 -2 -165 44 3 44 21 109 -25 85 7 -91 161 -66 86 11 -108 -38
5148 -38 114 -14 -70 -31 17 87 -120 -94 -11 -18 20 -98 -79 14 -15 -148 41 56 11 13 -43 10 -104 -15 -124 40 15
5175 15 -78 93 -114 -18 -26 -60 -29 82 2 -19 37 17 36 162 83 61 149 126 -152 -59 14 163 38 -65 9 38 88
5202 88 71 58 -67 -105 49 4 56 -4 -39 71 50 46 -83 7 129 153 43 -23 -59 -105 33 -190 -30 -25 170 -78
$$ packed form
5019C2Q6j22n1j5n2O4K9N5O1j87J11p0p2O9N4J10L3n3m0j63L19k54LQ3J14n4l40
5046b50K78J81k22k3J38L0j09K2j06M0J20j46LN4Jo9K9O0j60O3R7n3K0K11j91
5071A8j55J17MKl4n6J26J12k55K80K2j77Q9j03pn5J76j03K2n3n5n1J54J26k14
5096g0N5J53k0j51O6P7p8J07j91Nn3J90J6j36o4J02J52k05K0JrLL2m7N3l4k23
5123b49K87l0Jl0J03j2l4O8j06j63K09m1M1k3Q8j34J10p8r8K52k27J52p5j19P0
5148c8J52j28n6L9M8P0k07K6Q3pL8j18J9R3k9j33J89J5m5Kn6N3j14Q9j09J64k5
5175A5r3J71k07R6ql4L1J11q0k1N6k0J9J26p9k2Q8k3k78R3P3J49j25j03P4K9N0
5202H8j7j3j25l8J54m5N2o0l5J10k1mj29R0J22K4j10o6l6m6J38k23J60NJ95k48
$$ plain form
5228 -78 -80 -45 41 -99 -34 -18 -33 -44 -105 41 -142 27 -86 -48 -93 -38 226 -54 -115 8 -45 50 -3 53 -70 -55
5254 -55 -79 -62 21 -259 -123 34 -28 46 -159 -136 162 70 -45 31 -47 65 80 44 100 6 168 36 82 -30 -94
5279 -94 -9 -77 -43 -85 -29 -96 38 85 -6 25 -5 218 -61 36 -80 -154 53 87 -52 -66 -84 37 40 -133 22 -113
5305 -113 -11 191 22 -31 99 30 -33 -18 -48 124 85 -8 36 -141 -1 -124 22 108 -40 93 -134 13 121
5328 121 42 -37 -83 90 -13 -37 -14 -16 -20 21 67 91 -93 -119 115 -104 -37 -91 68 -82 -54 37 53 64 99 -7 -17
5355 -17 86 58 -171 142 85 -21 28 18 23 -83 24 -80 39 13 -162 -116 20 117 -1 34 -4 8 -58 -58 43
5380 43 -98 -102 36 -39 1 -25 -73 38 43 -48 17 -46 -27 88 13 136 50 -6 36 4 -132 2 155 -97 -30 -50 8
5407 8 95 -71 104 -4 63 6 65 -100 -111 16 36 112 -18 87 101 -95 1 -65 -66 -2 37 -41 -109 100 4 -99
$$ packed form
5228g8kL5Q6j40O5J6j5j1o1J46j83J69j13L8m5N5K64k80o1J23n3R5n3N6j23J5
5254e5k4J7Q3k80J36J57o2P4k05K3K98r2j15P6p8J12J5l6N6r4J62j32M6j12o4
5279i4Q5o8L4m2N6o7J34M7r1L1l0K23k79R7j16p4K07L4j39j4j8J21Lj73J55j35
5305a13J02K02j69n3J30o9o3J5l0J72l9r3M4j77J40j23J46Q6j48J33k27J47J08
5328A21p9p9m6J73j03k4K3kmM1M6K4j84k6K34k19O7n4J59j50K8R1J6J1L5j06j0
5355a7J03k8k29L13n7j06M9j0Nj06J07j04J19k6j75M6J36R7j18L5l8J2o6%J01
5380D3j41mJ38p5M0k6m8J11Nr1O5o3J9J15p5J23q6n6M2l2j36J34J53k52O7k0N8
5407HQ7j66J75j08O7n7N9j65j1J27K0P6j30J05J4j96R6o6jO4L9p8o8K09r6j03
$$ plain form
5433 -99 45 31 100 -19 -79 -57 -4 26 -116 20 95 -70 -27 -18 52 20 37 41 55 -113 -10 0 -111 97 -27 -7
5459 -7 -58 105 61 -120 -46 -4 80 -19 -48 -97 -17 45 68 -63 48 48 -48 142 -3 30 97 -56 -166 1 54 151 147
5486 147 74 -33 45 -53 -246 -13 21 -1 179 -44 20 -9 -2 -92 34 -106 114 -70 149 163 86 -6 132 35 -109
5511 -109 84 -65 -32 15 147 23 5 70 159 -111 -56 -110 4 -12 -52 35 -60 199 -65 20 -6 -10 166 -81 -127
5536 -127 -52 -162 -10 32 -56 -44 -52 56 -22 94 -48 84 71 128 -60 42 -1 -27 12 -9 -108 -62 -3 21 -61 -73
5562 -73 87 42 79 -6 -89 -39 -7 -72 102 55 220 147 39 -16 28 -72 -9 10 -32 20 28 -112 -30 -82 39 47 -48 29
5590 29 25 16 -178 31 89 46 19 -35 -196 -69 -91 -135 -7 107 -45 -54 9 18 252 -72 105 142 120 -150 98 63
5616 63 16 -101 123 137 -75 119 -168 91 114 27 17 -81 -76 -28 -81 -137 -8 162 178 10 -56 106 152 66 46 31
$$ packed form
5433i9J44j4O9j19o0K2N3L0j42J36P5j65M3RP0l2J7MJ4j68J03J0j11K08j24K0
5459gn1J63m4j81P4M2Q4r9k9m9Q0O2K3j31J11%r6J90j45L3O7j53j10J67N3R7m
5486A47p3j07P8r8j93K33L4k2J80k23O4k9Pr0J26j40K20j84K19J4p7r2J38r7j44
5511a09J93j49L3M7J32j24j8O5Q9k70N5n4J14j6m0Q7r5K59k64Q5k6mJ76k47m6
5536a27P5j10J52M2q8J2qJ08p8J16j42J32j3N7j88J02m3k6L9k1r9M6N9K4q2j2
5562g3J60m5L7q5q3N0L2o5J74m7J65p3j08n5M4j00O3J9m2N2Qj40Q2n2J21Qr5P7
5590B9mrj94K09N8m3k7n4j61J27k2m4J28J14j52rO3RK34l24J77L7k2k70K48l5
5616F3m7j17K24J4k12J94k87K59K3q7j0r8NM8n3n6J29J70J6j68o6J62M6q6k0j5
$$ plain form
5642 31 -90 153 123 -29 -24 -51 -15 -12 -164 5 66 16 24 83 -1 -5 -69 10 -132 -63 23 -7 -146 3 22 -61 -61 157
5670 157 -94 119 -30 5 -74 91 28 -61 1 -59 -43 -41 6 -11 -34 181 -125 -69 62 -52 46 -18 52 -21 21 7
5696 7 47 16 -23 113 120 97 -58 -50 5 23 -1 22 -27 38 41 80 -91 14 34 36 60 -79 -22 -100 76 243 -98 95
5724 95 64 -101 -88 6 -32 -117 109 67 65 233 13 -36 -77 99 60 69 -46 -126 -157 -44 -16 111 57 18 163 97 -144
5751 -144 116 43 -12 -159 43 60 78 99 18 87 157 -175 115 -45 -135 -210 -185 40 22 116 -77 77 -19 -150 -84
5776 -84 -123 -89 -113 19 -20 13 -7 -62 -70 5 -24 -9 -69 -11 9 39 -68 -41 35 7 -87 89 -48 156 41 13 82 -40
5804 -40 2 -4 -97 44 40 163 -66 -33 -46 153 4 54 90 109 17 14 36 29 -87 -79 142 -302 28 56 62 -155 -20 -17
5832 -17 -93 67 -71 -10 -127 105 152 10 -41 -45 -191 -64 150 27 8 46 -34 36 98 -43 29 19 -62 -36 135
$$ packed form
5642C1j21K43l0j52Nk7L6Lj52J69O1n0QN9q4mo4P9j42O9Q6l0j39J49J9q3%K18
5670A57k51K13j49L5p9J65o3q9O2o0J6KM7j7k3K15l06N6J31j14R8o4P0p3M2j4
5696GM0l1l9J36Pk3j55QN5J8k4K3m9O5LL9j71J05K0KK4j39N7p8J76J67l41J93
5724I5l1j65J3R4l8q5K26m2kJ68k20m9m1J76l9Rj15q0l1J13K8J27n4l9J45o6k41
5751a44K60p3n5j47K02J7J8K1q1O9P0l32K90j60r0p5K5K25j8R4j93J54r6j31O6
5776h4l9L4k4J32l9L3k0n5qP5k9J5o0N8K0L0j07K7P6k8r4J76j37K04j15k8O9j22
5804d0M2or3J41mJ23k29L3j3J99j49N0L6J9r2lK2pj16QK21m44L30K8Ok17J35L
5832a7p6J60j38O1j17K32M7j42n1mj46J27K14j23j9L8q0P0O2j41P2j0q1K6J71
$$ plain form
5857 135 25 18 56 169 11 -10 128 75 12 -97 17 -4 -16 82 -57 -62 87 -81 43 -8 76 8 -81 17 -123
5882 -123 -108 -20 95 -22 -5 -103 -116 70 141 125 -160 64 148 -20 3 -81 -1 -15 -82 32 144 -26 -173 9
5906 9 37 99 -52 175 -116 24 -106 -159 132 -5 -21 60 -38 3 0 -151 84 108 59 125 -67 -89 83 174 -55
5931 -55 -150 73 121 239 -18 48 81 -39 79 -116 7 -90 8 24 -191 20 24 -126 76 -50 -45 -166 -148 12
5955 12 20 -75 24 -61 93 -53 96 139 55 -34 61 47 97 191 -154 45 116 29 65 -101 46 -52 -27 -17 -135 -121 -92
5982 -92 168 -33 41 -42 42 84 -135 -23 25 -84 28 49 63 -121 59 27 112 0 167 77 -49 69 116 -53
6006 -53 -95 74 3 89 -45 34 -37 54 -66 116 -76 -59 -55 2 106 -16 -54 31 -97 -87 -38 92 37 -144 -38
6031 -38 116 52 -176 15 88 -104 100 -55 -194 -14 20 -210 -83 139 -67 39 165 -11 265 92 19 27
$$ packed form
5857A35j10pL8J13j58k1J38n3o3j09J14k1j2R8j39nJ49j68J24n1Q4o8q9R8j40
5882a23J5Q8J15j17J7r8j3J86P1j6k85K24Q4j68K3q4Q0j4o7J14J12j70j47J82
5906IK8O2j51K27k91J40j30n3K91j37j6Q1r8M1lj51K35K4m9O6j92k2J72R1k29
5931e5r5K23M8J18k57O6L3j20J18j95J23r7R8J6k15K11Mj50K02j26Nj21J8J60
5955A2Qr5R9q5J54j46J49M3q4q9R5j4N0R4l45J99P1q7L6j66J47r8K5J0j18J4K9
5982i2K60k01P4q3Q4M2k19J12M8j09J12K1J4j84J80l2Q5j12J67r0j26J18M7j69
6006e3m2J69p1Q6j34P9p1R1j20J82j92J7MN7J04j22l8Q5j28J0M9J30n5j81J06
6031c8J54o4k28J91P3j92K04j55j39J80L4k30J27K22k06J06J26j76K76j73p3Q
$$ plain form
6053 27 -108 168 -44 68 174 -26 -24 -86 -69 2 -3 -8 -26 -57 40 -156 -24 -16 94 23 37 9 8 48 -56 70 77 135
6081 135 -12 -116 259 50 32 59 -92 -141 76 167 -56 -33 -104 19 -157 195 -51 -11 34 -160 -32 -103 20
6104 20 -52 55 1 -30 -22 20 -127 -22 -77 -38 -25 42 32 -50 78 64 82 57 32 10 -47 -6 -96 70 35 -227 31
6131 31 -89 -32 -80 36 86 -136 23 72 13 -23 84 -20 -8 62 -136 125 48 -52 91 54 -5 -25 -97 42 -107
6156 -107 -86 -50 9 29 111 -9 -11 10 117 37 -7 49 -30 5 21 23 120 22 -21 14 56 -39 122 72 -29 -107 23 -52
6184 -52 -45 36 22 -87 -135 26 -13 6 6 115 -104 157 45 -34 40 -40 -13 -65 -7 110 -75 -14 12 -63 -76 -35 38
6211 38 122 121 -110 -75 192 -38 76 -8 -118 -2 -24 -53 -40 115 -105 -114 -64 -155 18 -30 -10 -123 -2 3 93 31
6237 31 -118 59 -33 -4 26 37 70 -122 -45 138 -78 -89 -121 -96 53 93 -344 -121 62 -133 27 -28 -25 8 7 -3
$$ packed form
6053B7j35K76k12J12J06k00Ko2J7P1nnj8l1R7j96J32QJ10p1J4k8jM0j04J26PN8
6081A35j47j04L75k09j8K7j51m9K17R1k23K3p1J23j76L52k46M0M5j94J28p1J23
6104B0p2J07n4l1QM2j47J05n5L9J3O7j0q2J28j4J8k5k5k2n7M1r0J66l5k62K58
6131C1j20N7m8J16N0k22J59M9n9l6J07j04J2P0j98K61p7j00J43l7n9k0p2J39j49
6156a07K1L6N9K0Q2j20kK1J07q0m4N6p9L5J6KR7r8m3L5M2r5J61n0j01p8J30p5
6184e2PQ1j4j09m8J61l9J9%J09k19K61j12p9P4q0K7n2N8J17j85O1K6p5j3M1P3
6211C8Q4jk31L5K67k30J14q4j10J16k2k9J3J55k20rN0r1J73m8K0j13J21NR0o2
6237C1j49J77r2K9L0J1L3j92P7J83k16j1l2K5J49M0m37K23J83j95J60n5LL3jj0
$$ plain form
6263 -3 26 47 -162 78 40 111 -111 -37 45 58 -56 82 96 -44 66 44 23 231 -84 36 97 -96 -19 10 118
6288 118 -184 -114 -55 -43 -137 57 -83 -68 -69 -48 -125 52 -10 6 54 8 -52 -59 104 29 126 -45 -8 -71 -165 -172 3 -32
6316 -32 29 17 -15 -61 -88 102 37 -82 -61 78 -43 -134 -14 81 97 -34 -25 -39 -52 -91 -28 -247 8 65 -52 5
6342 5 -43 16 -68 84 -64 -128 8 -10 -76 74 123 -150 113 -189 -26 162 -39 8 28 68 24 -68 -86 -2 18 -5
6368 -5 -45 66 135 -55 -104 -16 -44 -21 166 22 -133 34 -82 140 -80 65 -62 12 -154 -50 83 -116 2
6391 2 11 139 62 -3 -115 -27 -69 -42 -236 -2 -43 40 26 -38 -99 -19 -9 59 56 -14 -13 -6 -104 67 24 53 128 -41 5 22
6421 22 131 -49 -80 -71 102 77 -42 -149 172 96 -29 -49 -74 40 78 -118 15 40 78 35 30 -31 -45 105 65 -11
6447 -11 6 91 123 -83 -50 97 -75 -66 136 -38 -14 12 46 128 -112 -23 -104 -53 55 -47 -155 -106 63 138 85 63
$$ packed form
6263cK9K1k09K40l8P1k22P4Q2J3j14J38J4j40J10k2k1K08l15J20O1j93P7K9J08
6288A18l02P0N9J2r4J94j40J5jK1p7J77o2J6M8m6o0pJ63p5R7j71L7o3r4pJ75l5
6316c2O1j2l2m6k7J90o5j19K1J39j21r1J20R5J6j31Rj4j3l9O3k19K55N7j17N7
6342Em8N9q4J52j48o4J36j8o6J50M9k73K63l02J63J88k01M7K0M0m4r2j8Q4K0k3
6368em0J11O9j90m9Q8k8K3J87j44j55J67j16K22k20J45j27P4j66J04J33j99J18
6391BRJ28p7o5j12Q8m2K7j94K34m1Q3j4o4o1Q0J0O8lp0JPr8J71m3K9P5j69M6J7
6421B2J09j80l1RJ73k5j19j07L21p6j25k0k5J14L8j96J33K5L8m3no1j4J50m0p6
6447a1J7Q5L2k06L3J47j72RK02j74K4K6L4Q2k40Q9q1N1J08j02j08M9J69P5n3k2
$$ plain form
6473 63 98 -3 -39 -52 -35 -23 -94 19 -38 -30 26 -43 57 1 -88 62 -77 174 -70 -76 -172 -12 12 50 30 -91 -27
6500 -27 3 -36 50 -37 32 197 -189 5 -108 16 110 66 -148 65 -80 -88 -98 53 -62 -77 166 70 71 -100 -6
6525 -6 31 29 15 201 -75 144 67 35 -79 -104 97 63 162 54 -55 -83 -32 -46 24 99 131 -49 -11 -35 -69 30 -234
6552 -234 -28 -104 -2 -19 -180 -115 53 -87 -128 -26 111 119 -57 119 -105 13 -55 114 37 -124 -28 9 -36 80
6576 80 39 27 -71 43 -18 -112 -123 -36 -27 -245 77 -5 -47 21 29 37 -32 -104 -77 9 -3 -124 -75 48 -52 32 3 15 42
6605 42 -79 2 79 -43 -29 62 132 0 16 114 26 254 19 -9 -88 -34 189 -12 30 -78 -91 -67 26 -2 89 -129
6631 -129 -74 -98 -168 89 57 57 -122 -63 63 -66 111 47 53 -6 -4 119 48 131 39 -136 -80 -60 62 -33 -176 -18
6657 -18 -101 18 23 -12 -32 -5 70 60 -145 -25 92 29 159 -37 11 68 96 5 35 148 69 30 -6 -26 -130 15
$$ packed form
6473F3L5j01l6j3J7J2p1J13n7QN6o9J00n6q9J50j39K51k44or6J60K4L8k0j21O4
6500b7L0l9Q6q7O9J65l86J94j13J24R4m4k14K13j45qj0J51j15j5K43r6Jj71R4
6525fL7kj4J86k76K19p7l2j14k5K01l4R9j08j09k8N1j4P0P5L2j80L8k4l4R9k64
6552b34K06p6J02j7j61O5J68j40m1J02J37Qj76J76k24J18o8J69p7j61R6L7m5J16
6576H0m1j2r8J14o1r4j1Q7Rk18L22q2m2O8QQo9p2K7Q6j2j21M9J23j00Q4k9J2K7
6605D2j21Q1P7j22J4R1P0j32J6R8q8K28k35k8p9N4K23k01M2j08j3K4R3k8R1k18
6631a29N5k4p0K57l2%j79N9J26j29J77o4On9KJ23p1Q3r2j75N6K0J22r5j43J58
6657a8q3J19Nl5k0K7P5j0k05J20J17o3J30j96M8N7K8r1L0J13p9l9l6k0j04J45
$$ plain form
6683 15 102 -146 40 16 9 -135 -5 219 -108 -17 -47 -54 -114 72 225 43 -26 -93 30 95 21 19 -18 -27 147 -74
6709 -74 -1 30 37 19 123 24 68 -186 -59 -201 -52 -9 2 22 -15 -106 0 19 28 55 -74 141 6 73 -80 -52
6735 -52 -19 116 -61 60 13 -191 -117 66 -49 -37 -29 -13 34 66 0 84 -68 108 -129 228 -105 -42 6 78 -70
6760 -70 9 84 43 44 86 58 -72 -28 -42 -58 8 14 47 -115 45 -32 -93 -17 10 -39 81 53 9 28 1 -108 83 -8
6788 -8 -81 -8 -19 -45 -137 14 85 -132 110 52 -21 -74 6 12 48 23 -50 -85 123 35 -78 -17 -30 -122 150 133 -63 -134
6816 -134 110 51 64 12 141 -3 -32 -47 55 37 -24 43 90 -119 9 -109 93 -6 41 -17 -2 -20 145 39 57
6841 57 -10 -72 36 -88 36 47 39 72 4 58 64 7 -205 -2 -33 105 -12 43 106 -1 -23 92 -43 -96 91 102
6867 102 -38 -129 37 57 161 65 93 -111 -55 32 -141 -20 -3 72 61 13 150 -43 -80 52 -94 -113 -36 -14 -128
$$ packed form
6683A5Q7k48J86k4pj44J30K24l27R1l0po0J86J53j82o9o7J23O5p4kl7rJ74k21
6709g4P3L1Pj8J04r9M4k54J27j42J49M3J1K0l7r1J06J9RK7j29K15j35O7j53K8
6735e2L3J35j77J21m7k04P4J83j15J2QJ6M7L2o6Q4j52J76k37L57l33O3M8P2j48
6760g0P9P5m1JM2k8j30M4j4j6O6OL3j62J60p7o1P6K7m9J20k8m4J9k7j09J91r1
6788hp3P3j1k6r2J51P1k17K42n8p3n3Q0OL6k5p3l5K08q8j13O1j3r2K72j7j96p1
6816a34K44n9J3n2J29j44k9j5J02j8o1O7M7k09J28j18K02r9M7n8J5j8J65j06J8
6841E7o7o2J08j24J24J1qL3o8N4On7k12K03l1J38j17N5O3j07k2J15j35n3J87J1
6867A02j40r1J66K0J04r6K8k04N6Q7j73J21J7P5j1m8J37j93l7J32j46j9P7K2j14
$$ plain form
6892 -128 -78 20 40 -131 14 -38 7 -91 -102 23 -88 -117 -49 -91 23 -169 -49 -76 -147 -65 -65 57 15 -30 62 -49
6918 -49 28 -55 -176 158 -34 25 53 157 44 54 -79 -68 -66 -7 11 -126 34 12 -51 7 -55 41 -27 32 -44 -180
6944 -180 20 -132 -94 23 -24 103 -97 39 -102 84 -17 66 -177 -31 -67 28 -9 -97 42 10 -39 -45 61 -97
6968 -97 -29 7 -67 -108 27 178 45 35 -7 -173 -20 -99 -69 52 49 -95 68 20 51 -20 37 63 -22 170 -18 -32
6994 -32 3 152 16 -71 -21 -62 7 177 136 134 60 151 80 3 -27 -99 -107 -95 71 -32 10 47 15 -12 22 -207 -43 -53
7022 -53 58 9 -5 -86 -119 253 -19 109 66 -81 43 -8 -11 -91 106 -92 37 14 51 103 19 64 -115 -43 -70 -41
7048 -41 -120 -19 -17 -8 5 126 -34 58 80 -26 -87 -55 54 3 84 7 172 18 -42 26 -32 -70 -31 -3 11 90 -33
7075 -33 93 34 -34 49 -132 -43 82 98 71 98 -50 60 -81 160 161 45 1 137 59 -142 -24 -90 -40 -29 -107
$$ packed form
6892a28N0R8K0j71J45n2M5r8j1J25j11k9O8m2J14j92J20k7p1Q2%J22m2m5R2j11
6918d9P7q3j21L34j92N9K8J04j13J0j33J1KN9J8j37J60k2o3N8o2R6o8N9p6j36
6944a80K00j52L8J17m7J27k00J36j41J86j01Q3k43J46l6R5l7q8J39l2m9oJ06j58
6968i7O8L6p4m1J35J51j33j0m2j66J53p9L0J21lj44J63m8L1p1N7K6q5J92j88j4
6994c2L5J49j36q7N0m1O9J70m1kp4R1p1p7l0p2qJ2J66j03M2L7l2k7L4k29J64j0
7022e3J11m9j4q1l3L72k72J28m3j47J24n1lq0J97j98J29k3L7N2q4M5j79P2k7K9
7048d1p9J01KRJ3J21j60R2K2j06o1L2J09n1Q1p7J65j54o0O8n8l8L9K8J4P9j23
7075c3J26n9o8Q3j81Q9J25J6k7K7j48J10j41K41Jj16m4J36p8k01J18o6N0J1p8
$$ plain form
7100 -107 112 -77 -34 -12 -57 -39 -25 -9 -167 -13 181 -54 23 19 50 -16 65 16 -113 25 -219 -121 -26 -111 -59 -83
7126 -83 2 48 9 -48 -28 58 -20 32 17 74 44 -160 116 51 -94 -2 -20 36 -19 -64 -72 -7 43 -16 39 43 -110 124 77
7155 77 -21 -127 -54 -88 171 -159 -13 56 -96 59 47 78 17 64 32 37 -44 50 -51 -15 -63 -29 -243 163 73 -79
7181 -79 19 -4 192 54 50 -27 96 67 -43 8 59 -22 84 17 99 1 57 -123 -81 -52 85 -15 -34 -67 -152 54
7207 54 -11 -26 -35 -73 -71 129 -47 60 -123 97 -120 102 120 -37 108 72 3 -5 -230 14 -58 -39 16 152 -77
7232 -77 0 -47 9 -13 157 -41 59 78 -16 -34 -71 -61 -88 115 103 40 30 -86 -18 -16 112 11 23 54 19 -43 30
7259 30 77 -16 107 115 -27 41 44 24 -128 -40 -34 66 -29 -149 -61 -6 -71 57 -43 -221 93 123 62 -85 -31 5 55
7286 55 68 88 -84 7 -150 -127 -72 17 9 -8 -14 -28 49 -92 155 61 -134 -41 53 151 61 24 -152 55 37 -269 89
$$ packed form
7100a07K19j89M3K2m5J8J4J6j58J54J94k35P7mL1o6Q1m9j29J38k44R8R5q5N2k4
7126h3Q5M6l9n7K0Q6p8N2j5N7l0k04K76o5j45R2j8N6n5m5qO5N0n9N5Mj53K34m7
7155G7r8j06P3l4K59l30J46O9j52J55j2L1o1M7l2Nq1R4j01L6m8L4k14M06r0j52
7181g9R8k3J96j38mp7J23k9j10N1N1q1J06o7Q2r8N6j80M2K9J37j00j9l3q5K06
7207E4o5j5rl8KK00j76J07j83K20k17K22J8j57J45l6o9qk25K44p2J9N5J36k29
7232g7P7m7N6k2J70j98J00J9r4j8l7J0k7K03j2o3j0j16O8KJ28j01J2L1l5o2P3
7259C0M7r3J23Qj42O8Lk0j52Q8OJ00r5j20Q8N5o5J28j00j78L14L0o1j47N4L6N0
7286E5J3K0j72R1j57K3N5Q9qj7oj4P7j41K47r4j95R3R4R8r0l7j76K07j8l06L58
$$ plain form
7313 89 29 -85 103 56 55 2 1 -8 -89 -211 -138 -33 25 -31 -32 20 -23 73 9 -7 26 46 -32 -43 18 151 115 -92 95
7342 95 -155 -122 -74 17 75 -37 -85 7 24 1 -26 -10 24 -38 4 82 146 73 22 -292 91 -41 112 191 13 -172
7368 -172 122 -20 33 67 -126 206 106 104 24 53 -130 -82 59 23 85 22 -48 217 -21 16 -104 -141 -167 -29 -26
7393 -26 -26 -130 116 -114 -20 -51 24 -82 59 60 -45 91 2 -113 12 38 95 -149 67 4 67 60 58 62 90 33 6
7420 6 -58 0 -125 10 77 -78 -154 66 121 7 46 -21 -82 35 -3 62 -265 -129 -67 -76 41 167 -60 14 11 -72
7446 -72 -6 -63 -30 -145 -137 -83 -36 72 16 135 5 -50 -165 -124 165 -52 -172 -6 57 -10 -126 -82 44 91 109
7471 109 29 -46 -51 46 10 101 -96 82 20 29 -10 74 -4 -116 156 89 11 -47 50 62 -243 100 -34 50 103 -16 123
7498 123 -85 98 141 -72 33 101 116 -61 48 189 -91 35 -93 55 10 -129 57 -55 1 63 78 72 -36
$$ packed form
7313H9o0j14J88m7jn3jrq1j22P3J05N8n6jN2m3R6o4j6L3K0p8j1O1J33l6k07J87
7342I5k50L3M8R1N8j12m8R2J7k3k7J6L4o2M2P8O4p3n1l14L83j32J53P9j78j85
7368a72K94j42N3L4j93L32j00kq0K9j83M8J41l6O2o3p0K65k38L7j20l7k6J38L
7393b6%j04K46k30R4l1P5j06J41Jj05J36q9j15J25K6N7k44K16o3O3pkMK8n7k7
7420Fo4N8j25J35O7j55p6K20N5j14L9o7o1J17l8O5l27J36O2rJ17J26k27P4lq3
7446g2O6n7L3j15QN4M7J08n6J19j30n5j15M1K89k17j20J66O3o7j16M4J26M7J8
7471A09q0p5nR7l6R1j97J78o2Rl9Q4p8j12K72o7p8n8R7J2l05L43j34Q4N3j19J39
7498A23k08J83M3k13J05O8J5j77J09J41k80J26j28J48m5j39J86j12N6O2J5oj08
$$ plain form
7521 -36 -7 -160 -59 -68 28 148 -8 -70 9 58 15 -54 60 -59 -140 0 14 -66 -46 27 129 -194 58 151 90 41
7547 41 -99 42 171 -3 -161 22 20 76 27 -48 -23 -71 66 147 -21 28 168 -87 -57 -170 -56 62 42 -113
7571 -113 47 -144 -58 39 -56 -45 -60 26 -134 78 22 -29 -38 -305 87 -29 -6 -7 -152 108 -38 24 98 -6 125
7596 125 -38 13 -40 33 -52 -69 -45 -55 -149 75 -127 13 -15 22 88 50 42 -70 96 -26 31 -9 -171 1 99 -1
7622 -1 129 54 135 -39 44 136 -96 -8 5 13 -34 -115 -75 4 -87 64 96 87 94 33 -40 63 15 -48 20 82 95 23 23 61
7652 61 72 58 -57 -47 151 179 -140 79 -75 -95 -12 -77 -224 -65 38 69 91 76 167 29 48 97 50 -12 36 -115
7678 -115 139 -19 103 56 12 -57 97 228 -55 -29 62 -110 -29 52 23 -73 30 -51 -71 10 53 -37 -27 85 -36
7703 -36 81 -15 -17 80 152 11 -84 -90 -74 23 -167 22 -57 -64 -57 -57 -93 -43 122 -183 4 20 -209 -123 259 61 -48
$$ packed form
7521c6K9j53J01rR6J20j56o2P9M9m3o9J14j19q1J40J4q0K0P3J02l23K52R3o1m9
7547D1j40J41J29j74j58J83kN6m9p5K5m8J37Q1j68M9J40k55L0j13J14J18k0j55
7571a13J60j91Q6R7r5J1j5Q6j60K12n6n1rk67L92j16K3jj45K60j46O2P4j04J31
7596A25j63N1n3P3q5j7K4j0r4K24k02J40k8L7O6l8qj12J66j22N7m0j62J72R8j00
7622aJ30p5Q1j74Q3R2k32Q8J3Qm7q1M0P9r1J51L2rPo1p3J03m8o3O8O2J3p2%L8
7652F1J1j4j15J0J98K8l19K19j54k0Q3o5j47J59J03L1K2j5R1j38J9M9m7o2M8j51
7678a15K54j58J22m7m4o9J54J31k83K6R1j72Q1Q1k9r6J03q1k0Q1M3r0J0J12j21
7703c6J17r6kR7P2j41r5oJ6R7j90J89p9pP%l6N0J65l05J87J6k29Q6L82j98j09
$$ plain form
7730 -48 21 18 4 -172 -72 71 93 -14 42 94 149 -96 43 14 23 8 -140 -31 -45 63 -113 74 49 -98 -9
7755 -9 186 64 68 -13 -131 -38 -80 -99 -122 75 -160 -36 -94 -56 -24 24 -36 76 -29 -9 -141 -28 51 116 14 -88
7781 -88 12 153 3 -250 -95 -9 -13 -92 -87 1 -194 -46 -19 11 -37 -82 78 46 -31 -174 -133 1 51 38 49 -24
7807 -24 -3 -18 -22 20 9 -117 -4 4 -84 202 -36 -35 4 -39 34 33 74 8 -89 -99 85 65 -38 -72 -88 61 -58 3
7835 3 147 70 91 88 5 -75 -35 49 -37 116 -65 71 89 -74 -1 35 20 110 -146 136 6 197 74 -68 155
7860 155 -172 -78 -105 25 -37 43 49 85 64 0 107 122 142 -88 67 138 -66 165 -96 51 11 -29 -55 -90 48
7885 48 124 7 37 -24 -166 40 -88 86 -78 -21 -122 34 128 -11 30 28 20 37 156 -45 -55 78 -45 81
7909 81 63 168 33 -14 74 -72 -89 -31 33 -19 -38 -43 -66 89 -17 152 116 75 12 59 39 -116 -62 27 107 -29 -4
$$ packed form
7730d8O9lj4j76J00J43K2j07N6N2N5k45J39k9Rj5j48J09j4J08j76J87k5j47Q9
7755iJ95j22Mq1j18R3m2j9k3J97k35J24n8L8L2M8o0J12j05K0j32J13P9O5j02j02
7781h8J00J41j50k53J55Q6mp9NQ8j95J48K7L0m8m5J60l2p7j43M1J34N0j3J1p3
7807b4K1j5mM2j1j26J13Qq8K86k38JL9m3P3jM1o6r7j0J84k0j03l4j6J49j19O1
7835CJ44p7K1lq3q0M0Q4q6J53j81J36J8j63P3L6j5R0k56K82j30J91j23j42K23
7860A55l27R4k7J30o2Q0OL6k1o4J07J5K0k30J55P1k04K31k61J47m0m0k6l5J38
7885D8P6j17L0o1j42K06j28J74j64N7j01J56R4j39M1kqJ7J19k01j0J33j23J26
7909H1j8J05j35m7Q8j46j7N8O4n2j9nk3J55j06J69l6m1o3M7k0j55N4Q9Q0j36K5
$$ plain form
7936 -4 21 45 -116 -40 152 -156 -66 -60 105 41 43 113 6 -9 -46 96 99 10 -31 -1 34 -50 19 -20 -79 92 120 15
7964 15 12 -24 -24 74 89 102 -24 17 6 35 67 42 -83 80 -111 23 154 -49 41 75 -24 -49 -65 -75 64 -89 -198
7991 -198 23 1 63 -54 -66 -37 77 0 150 106 -56 99 0 -76 109 -2 -49 117 9 78 21 45 -77 169
8015 169 11 97 31 126 -113 -104 -32 43 -108 21 -33 -120 70 148 84 -69 -51 -53 -28 -24 -25 90 175 173 -61 83 13 -18
8043 -18 152 -37 -129 54 -33 61 -32 -20 -21 -162 -148 73 135 4 8 -62 163 60 26 41 -51 141 15 -33 155 13
8069 13 -11 -28 63 25 -45 51 -16 3 -68 59 105 -25 -60 218 192 -68 161 10 -5 147 51 -64 -33 -162 54
8094 54 71 184 22 -64 -59 115 -68 -67 -63 -78 -67 89 88 50 6 -19 68 168 -82 -139 -112 99 148 -133 72 51 75
8121 75 59 -35 145 21 68 184 -15 16 -70 -66 85 1 -84 57 -20 -52 108 127 -193 -47 68 55 70 81 102 -107
$$ packed form
7936dK5K4j61P6J92l08R0OJ65o4KP0j07j5l7J42Lq9m1L0L5q4O9l9n9J71K8j05
7964A5ll6%R8J5J3j26M1j1K9L2k5j25J63j91J34J31k03R0L4r9k5j6j0J39j53j09
7991a98K21k2O2j17j2K9J14p7J50m4j62J55r9p6J85j11m7J66j08O9n7K4j22K46
8015A69j58Q6o6R5k39RP2P5j51J29n4q7J90P8o4j53J8kK5MjJ15Q5kk34J44p0l1
8043a8J70j89r2J83q7R4r3J2jj41J4K21O2j31Mp0K25j03l4J5r2J92j26m8J88j42
8069A3k4j7R1l8p0R6o7J9p1J27M6j30l5K78k6k60K29j51j5J52r6j15L1j29K16
8094E4J7J13j62q6NJ74j83JMj5J1J56jl8m4k5Q7J00k50n7K7K11M9k81K05k1K4
8121G5j6r4J80j24M7J16j99L1q6MJ51q4q5J41p7l2J60J9l20J46J15j3J5J1K1k09
$$ plain form
8147 -107 -126 -12 23 -9 -60 -96 109 -54 -4 -19 -71 128 36 -35 -61 82 40 -14 125 1 -52 40 18 6 -83 53
8173 53 -31 83 142 -59 40 64 -15 -80 -79 93 -113 69 219 -52 0 -34 -8 -38
$$ packed form
8147a07j9J14L5l2n1l6K05j63N0j5n2J99r2p1k6J43m2n4J39j24n3R2k2j2q9J36
8173E3q4J14N9k01R9K4p9o5JJ72k06J82J50k71N2l4K6l0
8191c8
$$ Imaginary data points
##PAGE= N=2
##DATA TABLE= (X++(I..I)), XYDATA
$$ plain form
0 0 0 0 0 0 0 0 0 0 0 0 0 0 0 -6 8 -8 8 -8 14 -16 16 -24 24 -32 32 -40 48 -54 61 -70 80 -89 102 -114 129
35 129 -145 162 -181 200 -224 249 -278 307 -340 373 -413 454 -501 553 -609 668 -738 817 -898
54 -898 995 -1105 1231 -1375 1549 -1754 2006 -2321 2730 -3280 4059 -5248 7250 -11237 22005
69 22005 -107726 -258411 153239 60930 -182324 119453 190486 -173976 -84974 137170 -55800
80 -55800 -92290 145215 62018 -115393 -13276 52944 -46286 -19278 85274 36140 -81029
91 -81029 -43410 43933 -14088 -37987 89965 50735 -112918 -28914 64676 -68369 -21540 142341
103 142341 -3503 -112246 49319 12472 -108004 61801 114058 -71664 -28194 66024 -64219
114 -64219 -50655 94028 21777 -49848 28266 -1497 -58016 15345 38792 -906 7604 -12228
$$ packed form
0@%%%%%%%%%%%%%oJ4j6J6j6K2l0L2m0M8n6O4p2Q8j02J15j31J50j69J91k16K43
35A29k74L07l43L81m24M73n27N85o47P13p86Q67r55J054j162J277j406J555j715
54h98J893k100K336k606K924l303L760m327N051o010P339r307J2498j8487L3242
69B2005j29731j50685M11650r2309k43254L01777P1033l64462Q9002K22144j92970
80e5800l6490K37505q3197j77411J02117O6220r9230K7008J04552m9134j17169
91h1029L7619Q7343n8021k3899J27952l9230j63653Q4004R3590j33045M6829J63881
103A42341j45844j08743J61565l6847j20476J69805N2257j85722M3470R4218j30243
114f4219J3564J44683p2251p1625P8114k9763n6519P3361K3447l9698Q510j9832
$$ plain form
126 -12228 -32286 1975 -4268 467 50896 1731 -54394 8714 4616 -47863 33353 63147 -35005
139 -35005 -19117 31119 -38119 -28021 56661 14781 -25239 21772 -1156 -38243 10634 24400
151 24400 -4225 4342 -899 -15613 -1239 -3095 4454 26129 -11876 -28909 17036 -7521 -32906
164 -32906 41204 29799 -49855 5900 33979 -55374 -10910 72406 -18319 -40172 56544 -2523
176 -2523 -68086 38124 44648 -50677 5502 51978 -39177 -32483 47310 3854 -36060 20193
188 20193 19694 -32277 -13061 26683 4433 -22966 4265 20909 -22101 -26662 33165 15482 -39308
201 -39308 13164 37724 -43294 -20349 57898 -10723 -44505 49549 19382 -63106 18071 50924
213 50924 -46763 -15077 59553 -19379 -45749 41276 15056 -47107 12511 34893 -30909 -19255
$$ packed form
126a2228k0058L4261o243M735N0429m9165n6125O3108m098n2479Q1216K9794r8152
139c5005J5888N0236o9238J0098Q4682m1880m0020M7011k2928l7087M8877J3766
151B4400k8625Q567n241j4714J4374j856P549K1675l8005j7033M5945k4557k5385
164c2906P4110j1405p9654N5755K8079q9353M4464Q3316r0725k1853R6716n9067
176b523o5563J06210O524r5325N6179M6476r1155O694P9793m3456l9914N6253
188B0193m99n1971J9216L9744k2250k7399K7231J6644m3010m561N9827j7683n4790
201c9308N2472K4560q1018K2945P8247o8621l3782R4054l0167q2488Q1177L2853
213E0924r7687L1686P4630p8932k6370Q7025k6220o2163N9618K2382o5802J1654
$$ plain form
225 -19255 30250 -487 -27242 10625 20305 -19385 -16543 23323 7482 -27654 8161 29872
237 29872 -24343 -19451 38921 248 -37857 28373 26908 -43520 608 44657 -27133 -25869 44614
250 44614 -1195 -43054 24697 23328 -39419 -1566 34212 -19226 -21843 25782 3184 -26737
262 -26737 7065 18582 -14625 -11026 18196 4700 -18947 4085 20578 -11878 -14630 23355
274 23355 6736 -25872 11255 24725 -24732 -11106 32370 -7581 -27960 24810 13687 -32687
286 -32687 3873 26084 -22178 -15657 25856 -2182 -23932 13878 13571 -20575 -3995 18504 -6511
299 -6511 -14127 13880 10494 -14794 -1666 17701 -5162 -15031 14769 10965 -18771 1166 22488
312 22488 -11323 -16488 19791 3522 -24750 8747 19266 -19707 -8391 22686 -7832 -22070
$$ packed form
225a9255M9505l0737k6755L7867R680l9690K842L9866j5841l5136L5815K1711
237B9872n4215M892N8372l8673l8105O6230j465p0428M4128M4049p1790J264P0483
250D4614m5809m1859O7751j369o2747L7853L5778n3438k617M7625k2598k9921
262b6737L3802J1517l3207L599K9222j3496k3647K3032J6493l2456k752L7985
274B3355j6619l2608L7127J3470m9457J3626M3476l9951k0379N2770j1123m6374
286c2687L6560K2211m8262O521M1513k8038k1750L7810l07l4146J6580K2499k5015
299f511p616K8007l386k5288J3128J9367k2863r869K9800l804k9736J9937K1322
312B2488l3811n165L6279j6269k8272L3497J0519l8973J1316L1077l0518j4238
$$ plain form
324 -22070 15744 9641 -22238 2261 21434 -12585 -14144 18680 2966 -21006 8563 19315
336 19315 -14212 -8182 21803 -586 -20654 11464 15428 -18304 -3788 22870 -6493 -18753
348 -18753 15740 7777 -23357 1177 19942 -13344 -13005 20204 803 -23560 8258 15699 -18987
361 -18987 -6094 23517 -4386 -19235 16051 11357 -22937 1110 23662 -11414 -13841 23231
373 23231 4159 -23168 9558 17177 -19696 -6409 22806 -5745 -18360 15537 8067 -22044
385 -22044 -129 17040 -11640 -11596 16899 3230 -18449 4180 13621 -13094 -8608 17896 2096
398 2096 -16708 9191 14766 -15395 -5347 20328 -4522 -17091 16354 10606 -19444 3270 18524
411 18524 -15106 -11768 18717 -1399 -17377 12130 10333 -18169 -2883 12873 -8674 -9775 12444
$$ packed form
324b2070L7814o103l1879K4499J9173l4019j559L2824j5714k3972K9569J0752
336A9315l3527O030K9985k2389k0068L2118L964l3732J4516K6658k9363j2260
348a8753L4493p963l1134K4534J8765l3286L39L3209j9401k4363L1818P441l4686
361a8987J2893K9611k7903j4849L5286m694l4294K4047K2552l5076k427L7072
373B3231j9072k7327L2726P619l6873J3287K9215k8551j2615L3897p470l0111
385b2044K1915J7169k8680M4K8495j3669k1679K2629R441k6715M486K6504j5800
398B096j8804K5899N575l0161J0048K5675k4850j2569L3445n748l0050K2714J5254
411A8524l3630L338L0485k0116j5978K9507j797k8502J5286J5756k1547j101K2219
$$ plain form
424 12444 4421 -11459 355 8184 -5669 -6250 8977 5984 -9021 -725 10850 -3840 -8070
437 -8070 12071 5404 -14589 2241 12468 -10431 -4878 17182 -2560 -16319 7589 4902 -15054
450 -15054 3735 14832 -8830 -8843 8140 -3094 -10417 6994 8936 -5329 -3851 4534 -784 -6516
464 -6516 3772 11385 -2613 -8842 7031 3566 -11934 6221 16802 -11049 -10699 14035 -4429
477 -4429 -16384 17129 12947 -20626 -1821 14085 -17160 -10601 23297 3085 -18419 7029 6826
490 6826 -18947 -1903 20614 -629 -11780 7749 4201 -15544 -49 20164 -231 -13428
502 -13428 9450 5467 -20439 2422 25955 -8238 -15955 18262 -2238 -28981 14615 25029
514 25029 -21732 -6003 23617 -19139 -24650 28013 10856 -25259 11691 17330 -29530 -9209
$$ packed form
424A2444q023j5880J1814P829j3853n81J5227k993j5005Q296J1575j4690m230
437h070K0141o667j9993J6830J0227k2899N553K2060j9742j3759K3908k687j9956
450a5054J8789J1097k3662j3J6983j1234p323J7411J942j4265J478Q385n318n732
464f516J0288P613j3998o229J5873l465j5500J8155J0581k7851L50K4734j8464
477d429j1955L3513m182l3573J8805J5906l1245O559L3898k0212k1504K5448k03
490F826k5773J7044K2517k1243j1151J9529l548j9745J5495K0213k0395j3197
502a3428K2878l983k5906K2861K3533l4193p717L4217k0500k6743M3596J0414
514B5029m6761J5729K9620m2756n511N2663j7157l6115L6950N639m6860K0321
$$ plain form
526 -9209 29838 -2648 -15726 19954 5491 -27451 1637 23379 -6664 -8072 18400 -856
538 -856 -25163 4445 20090 -9583 -6048 19654 -6369 -27081 9830 16880 -16000 825 21448
551 21448 -16309 -22204 18067 6107 -15866 14520 13981 -23248 -6839 17605 -6301 -5167 20980
564 20980 476 -19449 3955 7508 -8852 5193 14574 -6203 -10719 2600 -827 -4190 6751
577 6751 7555 -5318 -8399 -826 -578 -2679 4969 8011 -4578 -8548 1086 -68 -3577 7738 8656
592 8656 -6175 -5331 2538 -2537 -463 9327 4304 -3927 -2613 -2403 -1723 3258 3605 2744 755 -7063
608 -7063 -5482 4302 -25 -2168 8120 481 -13205 -344 6730 -7068 1001 13057 -5988 -11787
622 -11787 7947 2069 -9149 9618 11193 -11746 -4844 10702 -4488 -7013 14223 6129 -13420
$$ packed form
526i209L9047l2486j3078L5680j4463l2942K9088K1742l0043j408K6472j9256
538h56k4307K9608J5645k9673L535K5702k6023k0712L6911P050l2880J6825K0623
551B1448l7757n895M0271j1960k1973L0386n39l7229J6409K4444k3906J134K6147
564B0980k0504j9925K3404L553j6360J4045R381k0777m516J3319l427l363J0941
577F751Q04j2873l081P573K48k101P648L042j2589l970R634j154l509J1315R18
592H656j4831Q44P869n075K074R790n023q231J314K10O80M981L47q61j989p818
608g063J581R784m327k143J0288p639j3686J2861P074j3798Q069J2056j9045n799
622a1787J9734n878j1218J8767J575k2939O902J5546j5190k525K1236q094j9549
$$ plain form
635 -13420 48 8764 -9107 -5003 14925 1490 -14483 3363 7220 -12961 -2324 16710 -4246
648 -4246 -14493 9741 4437 -16825 4583 17917 -11428 -10286 16279 -1777 -16831 13177 14003
661 14003 -16130 -2195 16813 -9427 -12479 17252 6094 -16413 4441 11689 -14116 -6543 16420
674 16420 -1529 -13962 8375 6398 -15444 -939 14435 -6366 -10127 11490 2432 -14569 4504
687 4504 12798 -9182 -5302 13372 -1510 -12488 8932 9353 -10780 -572 12280 -5907 -8982
700 -8982 10190 3541 -10572 3271 8401 -9098 -5321 9415 -1203 -9175 5492 4980 -9300
713 -9300 -1694 8421 -3589 -6590 6884 2891 -8335 1662 7766 -4374 -3826 7587 929 -6841
727 -6841 3295 5933 -4915 -1817 7144 -870 -6213 3482 3458 -5961 -966 6141 -2639 -5707 4101
$$ packed form
635a3420J3468Q716j7871M104J9928j3435j5973J7846L857k0181J0637J9034k0956
648d246j0247K4234n304k1262K1408J3334k9345J142K6565j8056j5054L0008Q26
661A4003l0133J3935J9008k6240l052K9731j1158k2507K0854P248k5805P573K2963
674A6420j7949j2433K2337j977k1842J4505J5374k0801l761K1617r058j7001J9073
687D504Q294k1980L880J8674j4882j0978K1420M21k0133J0208J2852j8187l075
700h982J9172o649j4113J3843N130j7499L777J4736j0618p972J4667n12j4280
713i300P606J0115j2010l001J3474l993j1226R997O104j2140N48J1413o658p770
727f841J0136K638j0848L098Q961q014n343R695k4r419M995P107q780l068R808
$$ plain form
742 4101 1950 -6998 29 6293 -3768 -4947 5876 1353 -7075 2161 6475 -4530 -3189 7179
756 7179 319 -5930 4003 5130 -5164 -1114 6361 -1534 -4841 4501 2945 -5727 -446 5120 -3639
771 -3639 -4907 4941 1342 -6547 963 5276 -5206 -4122 6865 182 -7118 3762 5355 -6693
785 -6693 -1317 8035 -1976 -5739 6637 3190 -7155 1715 7059 -4474 -3610 7088 -144 -6934
799 -6934 3642 4593 -6045 -1896 6262 -2459 -6655 4121 3364 -6917 -702 6598 -3363 -6112 5505
814 5505 2624 -7093 1521 7249 -4491 -3780 7798 574 -6737 4343 5570 -6365 -616 7566
828 7566 -2761 -5251 5713 1663 -7127 1457 5343 -5062 -3527 5817 -448 -6533 2294 3906
842 3906 -5359 -2132 5862 -1060 -5507 3993 3682 -5633 -331 6610 -2369 -4229 5997 1986 -6285
$$ packed form
742D101k151q948P027O264j0061j179J0823m523q428R236M314j1005J341J0368
756G179o860o249R933J127j0294M050P475p895l307R342j556q672N281N566q759
771c639j268R848l599p889P510M313j0482J084J0987o683p300J0880J593j2048
785f693N376R352j0011l763J2376l447j0345Q870N344j1533Q64J0698p232o790
799f934J0576R51j0638M149Q158q721m196J0776p57j0281O215P300r961k749J1617
814E505k881r717Q614N728j1740P11J1578p224p311J1080J227j1935N749Q182
828G566j0327k490J0964m050q790Q584L886j0405J535R344o265o085Q827J612
842C906r265L227P994o922m447R500l11r315N302O941q979j860J0226m011q271
$$ plain form
857 -6285 2631 6060 -4971 -2323 6678 -1372 -6066 4416 3211 -6726 -189 5687 -4055 -4434 4966
872 4966 850 -6326 1419 4307 -4213 -2739 4920 -4 -4823 2716 3896 -4020 -991 5347 -543
887 -543 -3848 3882 3040 -4625 234 5160 -2540 -3762 4630 1140 -5681 1098 4294 -4259 -2999 4764
903 4764 -639 -5418 2339 3356 -4695 -1639 4652 -1279 -3917 3618 2367 -4294 31 4660 -1766
918 -1766 -2622 4449 1688 -4402 1274 4405 -3012 -2260 4817 201 -5112 1932 3515 -4683 -2192 5240
934 5240 -1516 -5743 3192 2827 -6054 -492 5710 -3527 -4458 5538 1155 -6166 2886 5534 -5091
949 -5091 -2143 6766 -1014 -5024 5219 3842 -5918 135 5793 -3109 -3898 5560 1470 -6596 948
964 948 5005 -4545 -3542 5850 157 -6781 2313 4435 -6054 -1861 7382 -1968 -6428 5624 2716
$$ packed form
857f285Q916L429j1031K648R001q050m694J0482j205r937O537N876r742l79R400
872D966m116p176P745K888q520J474P659m924m819P539J180p916L029O338n890
887e43l305P730q42p665M859M926p700j222Q392l490o821O779L196q553J260P763
903D764n403m779P757J017q051L056O291n931k638P535j251o661M325M629o426
918a766q56P071k761o090N676L131p417P52P077m616n313P044J583q198K491P432
934E240o756m227Q935l65q881N562O202r237r31R996m383p321R052K648j0625
949e091K948Q909p780m010J0243j377r760O053N658q902p89R458m090q066P544
964I48M057r550J003R392n693o938R094K122j0489M193R243r350m460J2052k908
$$ plain form
979 2716 -7343 2290 7511 -5347 -3265 8063 -1305 -6709 6309 4349 -7477 580 6577 -4959
993 -4959 -4150 6583 488 -6368 2317 3156 -5476 -1672 5217 -1144 -4712 2355 2272 -5063 -617 5630
1009 5630 -1230 -4301 4005 2153 -5805 1395 6475 -3568 -2904 6588 -806 -6261 4590 4101 -5773
1024 -5773 643 5073 -4562 -3158 5000 -623 -3991 2822 680 -4304 222 2224 -1626 -57 1559
1039 1559 -1016 -1258 101 628 980 -99 86 1543 -1068 -1930 2970 1920 -2461 1388 2487 -3370
1055 -3370 -1060 3931 -1047 -2076 2687 -303 -3339 1011 961 -1819 94 797 -1308 -886 -390 330
1071 330 1007 -1035 -345 2022 -1789 -2301 4308 791 -4065 3597 3336 -6361 322 7061 -4073 -3113
1087 -3113 7619 -1510 -7475 5579 3353 -7645 1800 6130 -6400 -3002 6370 -1921 -5197 4335
$$ packed form
979B716j0059R633N221j2858K082J1328r368n404J3018j960j1826Q057N997j1536
993d959Q09J0733o095o856Q685Q39q632L804O889o361l568P067q3p335M446O247
1009E630o860l071Q306j852p958P200N080j0043O64R492p394n455J0851m89r874
1024e773O416M430r635J404Q158n623l368O813k142m984M526K002l850J569J616
1039A559k575k42J359N27L52j079J85J457k611q62M900j050m381L849J099n857
1055c370K310M991m978j029M763k990l036M350n0k780J913P03k105M22M96P20
1071C30O77k042O90K367l811n12O609l517m856P662k61r697O683O739j1134R60
1087c113J0732r129n965J3054k226j0998R445M330j2530L398R372q291l276R532
$$ plain form
1101 4335 2051 -5573 57 4451 -1842 -2847 3319 2364 -4109 -619 5135 -1023 -4238 4962 3310
1116 3310 -6896 894 7333 -5329 -3980 8776 -1138 -8608 6391 3941 -9751 1646 8065
1129 8065 -7461 -4087 8724 -2661 -7454 6531 2473 -7722 1987 5478 -4516 -1767 5294 -465
1143 -465 -3607 2642 2592 -2252 -941 3164 671 -3150 859 3603 -2794 -2817 4737 -108 -5560 3353
1159 3353 3342 -6457 -53 6096 -4889 -3751 6511 -1345 -5967 4949 2239 -5979 2110 4361 -4101
1174 -4101 -335 4401 -1907 -1640 3110 -182 -1328 1571 233 -524 560 -541 310 943 -1707 -42
1190 -42 1686 -2697 -1116 3256 -2067 -2971 3575 -146 -4440 2957 2095 -4655 1043 3781 -3426 -859
1206 -859 4125 -1225 -1965 2985 297 -1850 1604 813 -756 798 -157 55 891 -1591 -99 2297
$$ packed form
1101D335k284p624N630M394o293j005O166r55o473L490N754o158l215R200j652
1116C310j0206P790O439j2662J349J2756r914p470J4999k450j3692J1397O419
1129H065j5526L374J2811j1385m793J3985m058j0195R709L491r994K749P061n759
1143d65l142O249n0m844J311M105k493l821M009K744o397k3P554m845n452Q913
1159C353j1r799O404O149j0985J138J0262p856m622J0916k710q218Q089K251q462
1174d101L766M736o308K67M750l292j146K899j338p57J084j101Q51O33k650J665
1190d2J728m383J581M372n323r04O546l721m294P397q62o750N698K738p207K567
1206h59M984n350p40M950k688k147L454p91j569J554r55K12Q36k482J492K396
$$ plain form
1222 2297 -2145 -1713 3423 -1438 -3832 3673 870 -5391 2266 3508 -5435 -489 5589 -3140 -3170 5498
1238 5498 -408 -4420 3731 2274 -3850 1105 3249 -2159 -826 2694 -295 -1404 745 704 -575
1253 -575 -1150 297 1295 -2002 -1359 2798 -921 -3873 2509 1993 -4901 850 4634 -4115 -2158 5763
1269 5763 -1659 -4308 4947 1568 -5350 2584 4240 -4263 -295 4714 -2115 -2474 3494 88 -2783
1284 -2783 1126 1158 -1704 -761 830 186 -1068 -1005 1187 -20 -2464 955 2135 -2884 -912 3811
1300 3811 -1663 -2763 4412 707 -4296 2852 3060 -4270 403 4811 -2915 -2242 4723 -509 -3758
1315 -3758 2858 1698 -3449 267 2353 -1925 -1442 1241 -5 -1421 -312 662 -124 -1636 406 1684
1331 1684 -1453 -1277 2987 -104 -2984 2784 2078 -3692 703 4125 -2674 -1786 4608 -727 -3761 3241
$$ packed form
1222B297m442M32N136m861k394P505k803o261P657J242q943M946O078q729l0Q668
1238E498n906m012Q151j457o124M955K144n408J333L520k989j109K149m1j279
1253e75n75J447R98l297O43M157l719k952O382n16o894N751L784q749J957P921
1269E763p422k649R255l379o918P934J656q503L968N009o829l59N968l406k871
1284b783L909L2k862R43J591o44j254O3K192j207k444L419J180n019J972M723
1300C811n474j100P175l705n003P148K08p330M673M408p726O73O965n232l249
1315c758O616j160n147L716K086m278M83K683j246j416J109R74p86j512K042J278
1331A684l137J76M264l091k880N768p06n770M395L422o799Q88O394n335l034P002
$$ plain form
1347 3241 1672 -4166 813 2941 -2905 -1462 2839 -805 -2384 1247 669 -1846 -483 1223 38
1362 38 -1700 161 1648 -1011 -1554 2232 717 -2649 1238 2906 -2370 -1059 3844 -707 -2997 3139
1378 3139 1369 -3652 894 2953 -2882 -1265 2905 -1174 -2647 1789 901 -2583 108 1635 -1121
1393 -1121 -1337 1313 789 -1501 -34 1791 -290 -1419 1628 1425 -2148 306 2793 -1490 -1754 3040
1409 3040 423 -3005 1725 2160 -3061 -511 3294 -1825 -2620 2648 259 -3364 677 2079 -2622
1424 -2622 -1039 2810 -616 -2448 1511 1639 -2215 -187 2695 -550 -1974 1914 1597 -2109 413
1439 413 2855 -1296 -1848 2532 583 -2662 1008 2357 -2452 -1369 2611 -996 -2589 1911 1084 -3005
1455 -3005 -11 2037 -1626 -1457 2398 152 -2358 1088 1761 -1713 -520 2427 -190 -1759 1603
$$ packed form
1347C241j569n838M979K128n846J443M301l644j579L631n78k515J363J706j185
1362C8j738J861J487k659n43L786j515l366L887J668n276J311M903m551k290O136
1378C139j770n021M546K059n835J617M170m079j473M436q88l484K691J527k756
1393a121k16K650n24k290J467J825k081j129L047k03l573K454K487m283k64M794
1409C040k617l428M730M35n221K550L805n119p95N268k389l623M041J402m701
1424b622J583L849l426j832L959J28l854K028K882l245j424L888l17l706K522
1439D13K442m151n52M380j949l245L670J349m809J083L980l607j593M500q27m089
1455c005K994K048l663J69L855k246k510L446O73l474J193K947k617j569L362
$$ plain form
1470 1603 1357 -1890 160 2133 -780 -1492 1754 262 -1862 473 1504 -1615 -1151 1404 -502 -1664
1486 -1664 589 865 -1393 -810 1152 -243 -1375 966 1081 -1250 -364 1623 -104 -1053 1615 1368
1502 1368 -1305 26 1539 -686 -990 1789 330 -1522 559 716 -1469 -588 1103 -274 -1461 183
1518 183 312 -1189 -404 1009 -88 -1274 431 871 -1121 -377 2100 66 -1796 1493 1461 -1920 237
1535 237 2726 -1060 -1669 2393 50 -2711 1619 1853 -2397 -465 2250 -1486 -1846 2164 439 -2511
1551 -2511 344 1342 -1793 -1029 2045 255 -1772 557 1784 -1638 -1011 2718 429 -2131 1436 1761
1567 1761 -2458 15 3500 -1081 -2316 2800 333 -3669 1523 2814 -2911 -677 3097 -2021 -2901
1582 -2901 2719 797 -2955 1116 1677 -2571 -1015 2424 -76 -1467 1475 936 -1694 -202 1882
$$ packed form
1470A603k46l247K050J973k913p12L246j492k124K335J031l119M64K555j906j162
1486a664K253K76k258N83J962j395j132K341J15k331Q86J987j727r49K668k47
1502A368k673J331J513k225l04K779j459j852K081J57k185Q81J691j377j187J644
1518A83J29j501P85J413j097j186J705M40j992P44K477k034j862L289l2l381K157
1535B37K489l786o09M062k343k761M330K34m250J932K715l736l60M010j725k950
1551b511K855R98l135P64L074j790k027K329J227l422O27L729k289k560L567L25
1567A761m219K473L485m581j235N116k467m002N192J291n725K234L774n118q80
1582b901N620j922l752M071N61m248J556L439k500j391K942n39k630J492K084
$$ plain form
1597 1882 -25 -827 1361 856 -1819 -101 2208 -644 -1375 2079 113 -3004 923 2104 -2271 -528
1613 -528 2657 -1646 -2506 2040 377 -2358 1386 1333 -2418 -197 1872 -860 -592 1663 126 -1022
1629 -1022 345 591 -22 169 671 412 -386 -597 477 363 -948 503 951 -1365 -956 1572 -551
1646 -551 -1413 1292 284 -1898 329 959 -1224 90 1481 -493 -743 999 7 -374 843 539 -204
1663 -204 108 2 193 274 -291 504 686 -1001 -246 1281 -982 -928 1525 -304 -2017 980 816 -2325
1681 -2325 238 1850 -1708 -1056 2146 -517 -1495 1622 840 -1852 508 1469 -798 -550 1495 350
1697 350 -871 329 1064 -481 -726 1032 648 -1568 -116 1458 -1148 -1382 1794 79 -2445 837
1713 837 1530 -2398 -302 2492 -1299 -1721 2323 146 -2387 1745 1491 -2177 418 2226 -1207 -1023
$$ packed form
1597A882j907q02K188n05k675J718K309k852p31L454j966l117L927J181m375J743
1613e28L185m303q60M546j663k735L744n3l751K221K069k732K68K255j537j148
1629a022J367K46o13J91N02k59p98k11J074j14j311J451M48k316M09K528k123
1646e51q62K705j008k182K227O30k183J314J391j974k50J742r92l81J217l04p43
1663b04L12j06J91Q1n65P95J82j687P55J527k263N4K453j829j713K997j64l141
1681b325K563J612l558O52L202k663r78L117p82k692K360R61k267K48K045j145
1697C50j221J200P35j545k45J758l84k216J452J574k606k34L176j715k524L282
1713H37O93l928K096K794l791m22M044k177k533M132k54l668K595J808l433J84
$$ plain form
1729 -1023 2008 92 -1384 830 914 -1071 -435 874 26 -1214 205 816 -770 -973 982 190 -1742
1746 -1742 359 1270 -1617 -676 1809 -517 -1783 1757 688 -2016 927 1782 -1576 -400 2198 -455
1762 -455 -1388 1600 579 -1311 393 964 -1041 -509 768 -70 -825 160 312 -575 -671 326 440 -1077
1780 -1077 -208 938 -417 -903 1251 205 -1421 630 1247 -1310 -144 1848 -640 -1020 1431 290
1796 290 -1463 585 962 -1133 -259 1016 -515 -761 496 181 -912 -285 362 -107 -657 271 392 -754
1814 -754 -391 1056 17 -1074 787 862 -1240 248 1544 -728 -586 1652 190 -1225 856 928 -1218
1831 -1218 -92 1231 -657 -893 979 141 -1195 16 461 -652 -546 548 -103 -712 229 600 -530
1848 -530 -682 750 223 -794 640 908 -682 -312 1384 -125 -830 1034 599 -1108 326 1024 -798
$$ packed form
1729a023L031j916j476K214Q4j985O36J309q48j240J419O11j586k03J955p92j932
1746a742K101R11k887R41K485k326j266L540j069k704K943Q55l358J176K598k653
1762d55r33K988j021j890J704N71k005N32J277q38p55R85J52q87r6R97J14j517
1780a077Q69J146j355m86K154j046j626K051O17k557J166J992k488l80K451j141
1796B90j753K048L77k095Q74J275j531k46J257l15j093O27O47m69n50R28J21j146
1814g54L63J447j039j091J861P5k102J488J296k272J42K238j462j415K081P2k146
1831a218J126J323j888k36J872q38j336J211M45j113J06J094o51o09R41L71j130
1848e30j52J432n27j017J434K68j590L70J696j509p05J864m35j707J434O98j822
$$ plain form
1865 -798 -621 1100 -320 -1126 434 205 -1002 -123 743 -443 -764 593 291 -851 -34 723 -331
1882 -331 -703 816 501 -848 245 1139 -557 -409 1204 -84 -1052 678 1000 -1161 -343 1074 -572
1899 -572 -958 1050 174 -1254 306 695 -871 -633 894 -214 -862 493 473 -770 -127 849 -174
1916 -174 -567 596 713 -516 60 825 -413 -721 696 258 -673 400 704 -912 -462 688 -365
1933 -365 -854 497 125 -1053 -57 492 -590 -576 588 -7 -727 173 470 -304 -107 677 57 -441 321
1952 321 731 -374 -68 689 169 -593 417 582 -655 -51 652 -390 -563 580 83 -675 156 306
1970 306 -644 -478 505 -116 -760 258 442 -445 -167 505 5 -498 580 749 -576 -100 784 -30 -426
1989 -426 837 353 -889 76 612 -524 -421 902 -165 -982 390 366 -796 -205 955 -421 -837
$$ packed form
1865g98J77J721j420q06J560k29j207Q79Q66j186l21J357l02j142Q17P57j054
1882c31l72J519l15j349J093Q94j696J48J613j288r68J730L22k161Q18J417j646
1899e72l86K008q76j428J560L89j566K38J527j108o48J355k0j243O43R76j023
1916a74l93J163J17j229N76P65j238l08J417m38r31J073L04j616M50J150j053
1933c65m89J351l72j178R96N49j082J4J164n95p20R00K97p74J97P84o20m98P62
1952C21M10j105L06P57n20p62J010J65j237O04P03j042j73J143m97p58Q31J50
1970C06r50J66R83o21o44J018J84q87K78O72n00n03J078J69j325M76Q84q14l96
1989d26J263m84j242R65N36j136J03J323j067q17J372k4j162N91J160j376m16
$$ plain form
2006 -837 561 238 -889 195 835 -644 -442 725 267 -565 382 837 -593 -360 860 -110 -533 659
2024 659 522 -946 44 867 -632 -608 997 -76 -1107 149 566 -938 -337 1099 -194 -916 520
2041 520 264 -1090 249 1060 -363 -546 810 79 -692 654 819 -484 -204 698 -237 -737 748 529
2059 529 -757 -73 477 -382 -702 700 177 -927 179 245 -786 -223 658 38 -680 476 295 -637
2077 -637 135 730 -78 -161 628 34 -364 381 581 -215 31 495 -253 -511 328 338 -369 -207 326 -212 -596
2098 -596 108 233 -295 -132 286 -455 -373 144 297 -193 69 425 -135 -255 497 437 -95 89 550 -407 -228
2119 -228 524 217 -311 248 229 -506 -303 235 -45 -501 -171 110 -428 -320 436 -13 -288 239 171 -484 -44
2140 -44 606 -194 -337 661 26 -456 266 741 -400 -51 855 -119 -541 504 353 -721 100 668 -380
$$ packed form
2006h37J398l23j127J084O40j479K02J167m58q32R47M55j430K33J220r70m23J192
2024F59j37j468R90Q23j499K4J605j073j031J256M17j504O01J436j293p22J436
2041E20k56j354J339Q11j423j83J356p31p71J346J65j303K80R02r35n00J485k19
2059E29j286O84N50q59l20J402n23j104J106O6j031N63Q81o20p18J156j81r32
2077f37P72N95q08q3P89n94l98P45K00p96K46M64p48k58Q39J0p07J62N33n38l84
2098e96P04J25n28J63M18p41Q2N17J53m90K62L56n60j20P52o0n32J84M61r57J79
2119b28P52l07n28N59j9p35K03N38k80m56L30K81n38J08P56m49k75N27o8o55M40
2140d4O50q00j43R98o35m82P22M75j141L49R06r74m22J045j51j074Q21N68j048
$$ plain form
2159 -380 -511 547 -9 -763 225 350 -662 -374 630 -207 -530 298 455 -690 6 762 -407 -402 756
2178 756 338 -812 332 702 -466 -307 870 -236 -591 502 314 -706 35 677 -774 -413 544
2195 544 -120 -695 226 254 -645 -116 431 -193 -220 336 170 -362 43 637 -85 -160 454 196 -409 74 664
2216 664 -343 -229 621 -77 -523 272 121 -570 -13 417 -564 -459 456 56 -589 207 351 -621 -84 516
2236 516 -162 -162 434 46 -194 36 318 61 -21 129 296 -163 -63 338 135 -411 192 176 -571 -186 396
2257 396 -262 -320 429 -151 -514 137 170 -514 -42 356 -212 -301 270 95 -236 126 165 -23 -12 386 298 -19
2279 -19 48 333 37 -381 264 181 -424 88 524 -592 -404 538 -246 -503 296 163 -624 68 566 -359 -277
2300 -277 621 -139 -379 353 354 -238 252 434 -69 -133 175 195 -109 8 316 -76 -161 103 214 -403 -40 444
$$ packed form
2159c80j31J058n56p54R88J25j012K88J004q37l23Q28J57j145O96P56j169NJ158
2178G56m18j150J144L70j168J59J177j106l55J093j88j020P41O42j451L61R57
2195E44o64n75R21K8q99N29N47o24k7N56j66n32M05N94p22p5O14k58o05M83N90
2216F64j007J14Q50o98m46P95j51o91N57M30r81J05R15m00o45P96J44r72N37O00
2236E16o78%N96l88k40K30K82k57q2J50J67m59J00M01k03n46O03j6p47L85N82
2257C96o58n8P49n80l63O51L3o84M72L98n68q9N71j75l31L62L9j88J1L98q8l17
2279a9O7K85k96m18O45q3o05N12M36j116J88R42p84k57P99j33p87O92M98r25Q2
2300b77Q98p60k40P32Jn92M90J82n03o4L08K0l04J17L08l92q5K64J11o17L63M84
$$ plain form
2322 444 -22 -529 188 180 -610 158 580 -339 -96 764 -141 -552 511 188 -597 230 413 -391 120 541
2342 541 113 -216 363 163 -90 179 300 22 -91 122 35 -249 -327 128 -35 -551 86 85 -497 -154 422
2363 422 -375 -490 587 108 -525 282 555 -443 246 638 -138 -158 741 -36 -303 260 268 -343 12 302 71
2384 71 -273 145 168 -167 -279 11 38 -453 65 187 -266 -28 447 -64 -401 407 340 -395 135 595 -305
2405 -305 -202 642 66 -294 313 75 -462 110 273 -234 -222 139 -219 -352 -22 65 -169 -252 -56 21 -269
2426 -269 -73 317 13 -415 320 244 -381 140 484 -160 -213 521 117 -454 465 326 -377 246 236 -253 -198
2447 -198 260 -133 -494 69 138 -305 -78 141 -103 -72 55 118 -312 -298 207 53 -321 239 319 -253 41 522
2469 522 53 -312 423 359 -486 375 558 -502 -4 545 -210 -401 227 -20 -394 161 229 -511 -209 222
$$ packed form
2322D44m66n07P17qp90P68M22r19K43Q60r05m11J063l23p85Q27J83q04N11M21
2342E41m28l29N79k00k53K69J21k78j13K13q7k84p8M55j63n16O37jn82L43N76
2363D22p97j15J077m79o33Q07K73r98O89L92p76k0Q99p77k67N63Qo11L55K90k31
2384G1l44M18K3l35j12K90K7m91N18J22m53K38M75n11l37Q08o7p35N30M60r00
2405c05J03Q44n76l60O07k38n37N72J63n07J2L61l58j33L30Q7k34q3J96P7k90
2426b69J96L90l04m28P35p6o25N21L44o44n3P34m04n71R19j39p03O23j0m89N5
2447a98M58l93l61N63O9m43K27K19k44L1J27O3m30J4N05j54l74N60Q0n72K94M81
2469E22m69l65P35o4q45Q61J83j060M98N49p55j91O28k47l74N55O8p40L02M31
$$ plain form
2489 222 -53 -221 148 129 -198 -40 254 15 -221 248 384 -129 -2 510 -97 -368 597 154 -215 52
2509 52 366 -176 -212 430 -225 -313 180 115 -311 39 299 -305 -356 249 -103 -375 124 128 -190 -142 13 -129 -62
2532 -62 174 221 -38 -341 152 205 -311 263 265 -210 -101 116 3 -117 196 82 -329 -11 -20 -147 -90 41 -158
2555 -158 -177 35 -97 -217 82 298 8 -79 191 80 -223 55 313 116 -199 101 -39 -132 83 373 -91
2576 -91 -282 155 -3 -214 35 139 -239 -252 52 -67 -268 186 126 -295 -51 189 -90 -188 87 175 -58 23
2598 23 309 -67 -1 400 134 -145 265 117 -278 -79 211 26 -366 117 162 -353 15 119 -260 -132 52
2619 52 -45 -394 147 403 -256 -155 152 157 -344 122 389 -165 137 404 -80 -291 298 70 -276 172 180 -294
2641 -294 -216 295 -136 -393 253 62 -244 51 175 -254 -200 162 -83 -162 62 271 -341 -77 387 -12 -242
$$ packed form
2489B22k75j68L69j9l27J58K94k39k36M69J36n13J27N12o07k71R65m43l69K67
2509E2L14n42l6O42o55q8M93o5m26L50K60o04n1O05l52k72M99Ml18M8J55j42O7
2532f2K36M7k59l03M93N3n16N74Km75J09K17j13j20L13j14m11L18rj27N7J31j99
2555a58j9K12j32j20K99K16k90q7K70j11l03K78K58j97l15L00j40r3K15K90m64
2576i1j91M37j58k11K49J04l78j3L04j19k01M54o0m21K44K40k79r8K75Q8k33Q1
2598B3K86l76O6M01k66k79M10j48l95J99K90j85l92M83M5n15L68J04l79J28J84
2619E2r7l49N41K56o59J01L07Nn01M66K67n54L02K67m84k11N89k28l46M48Qm74
2641b94P8N11m31k57O46j91l06K95J24m29N4L62k45p9K24K09o12K64M64l99k30
$$ plain form
2662 -242 177 253 -232 -127 433 -165 -96 307 238 -420 89 234 -88 -73 301 -121 -442 114 -86 -217 -101
2683 -101 120 57 -84 249 56 -264 -57 328 44 -35 166 275 -174 -89 15 160 -75 329 121 -167 155
2704 155 65 -141 -36 208 -105 -133 117 97 -217 -106 53 -134 -86 142 -49 -130 -19 -78 13 -107 150 166 -82
2727 -82 169 210 -189 -294 265 28 -128 51 161 -191 -196 368 -98 -300 258 32 -384 -18 150 -163 -129 448
2749 448 -270 -386 281 54 -164 10 -29 98 -22 123 123 -62 -16 163 -50 99 105 32 -101 134 246 -18
2771 -18 -102 464 -12 -351 103 -1 -440 -114 374 -371 -220 369 139 -363 187 254 -118 -17 174 98 -174
2792 -174 298 131 -174 91 154 64 -72 -16 99 -83 -80 200 -144 -265 186 -46 -303 -56 174 -248 -143 259
2814 259 -95 -69 237 56 -182 228 331 -198 -51 235 -53 -132 87 177 44 102 134 -21 -164 -58 184 -207
$$ packed form
2662b42M19P6m85J05N60n98O9M03o9o58N09J45l22J5L74m22l21N56k00j31J16
2683a01K21o3j41L33j93l20K07L85k84p9K01J09m49Q5J04J45k35M04k08k88L22
2704A55r0k06J05K44l13k8K50k0l14J11J59j87M8K28j91q1J11n9R1j20K57J6k48
2727h2K51M1l99j05N59k37j56J79J10l52nN64m66k02N58k26m16L66J68l13L4N77
2749D48p18j16O67k27k18J74l9J27j20J45%j85M6J79k13J49Op3j33K35J12k64
2771a8q4N66m76l39M54j04m39L26M88p45J51N89k30n02N50O7l72J01J91p6k72
2792a74M72j67l05K65O3r0j36N6J15j82LK80l44j21M51k32k57K47K30m22J05M02
2814B59l54K6L06j81k38M10J03n29J47K86k88p9K19R0j33N8L2j55j43J06K42l91
$$ plain form
2836 -207 36 39 -31 -298 -169 243 -276 -185 229 -47 -288 395 153 -345 106 222 -107 -167 366 -26 -263 323
2858 323 36 -217 108 180 40 -80 155 -101 -124 -32 62 -112 -170 125 149 -172 -88 199 -97 -380 255 0
2880 0 -322 88 78 -218 73 285 98 -117 258 40 -151 158 278 -83 28 267 -86 -159 24 219 -73
2901 -73 94 4 46 -191 -185 -9 -66 -184 135 -16 -185 53 27 -161 -27 300 -180 -123 150 40 -170 284 61
2924 61 -86 -10 238 -146 -72 236 17 -155 -61 -41 -161 -4 102 14 -75 61 -47 -75 -155 138 -41 -182 43
2947 43 43 -155 102 100 -31 -84 236 -18 -158 200 202 -83 97 289 -77 -10 67 98 -81 74 116 -261 -81 -31
2971 -31 14 -79 52 -102 -147 -40 127 8 -89 -37 174 44 -39 115 42 -176 65 172 -134 94 195 55 -219
2994 -219 107 -73 -95 93 170 -247 -77 191 -259 -158 -90 -109 -191 -152 -39 55 -139 64 21 65 -96 51 -80
$$ packed form
2836b07K43Lp0k67J29M12n19R1M14k76k41O83k42m98M51J16l29o0N33l92k37N86
2858C23k87k53L25P2j40j20K35k56k3R2R4j74n8K95K4l21Q4K87k96k83O35k55
2880@l22M10j0k96K91K12j87k15L75k18j91L09J20l61J11K39l53p3J83J95k92
2901g3J67r0M2k37OJ76n7j18L19j51j69K38k6j88J34L27m80N7K73j10k10M54k23
2924F1j47P6K48l84P4L08k19j72R4K0j20J57J06q8q9J36j08k8q0K93j79j41K25
2947D3%j98K57kj31n3L20k54j40L58Kk85J80J92l66O7P7L1j79J55M2l77J80N0
2971c1M5r3J31j54m5J07J67j19r7N2K11j30q3J54p3k18K41J07l06K28J01j40k74
2994b19L26j80k2J88P7m17J70K68m50J01O8j9q2L9J13R4j94K03m3M4j61J47j31
$$ plain form
3017 -80 -155 152 133 -134 124 173 -80 -251 69 105 -72 86 109 -149 66 142 -233 -256 99 -42 68 -15 176
3040 176 127 6 162 -26 -117 6 29 -119 -24 274 126 -84 26 195 -124 -113 163 -13 -92 60 -24 -295
3062 -295 -39 -38 -103 29 43 19 -232 49 4 -195 -131 77 -168 -33 222 33 -132 3 93 -68 -247 -32 91
3085 91 -124 10 356 43 -153 181 44 -58 123 -48 -298 -43 203 -99 -131 234 69 -284 -76 232 -135
3106 -135 -67 -22 73 -123 177 5 -89 -73 134 16 -62 209 -174 29 -76 281 -117 -114 0 -19 -156 28 281
$$ packed form
3017h0p5L07j9k67K58M9k53j71L20L6j77J58K3k58K15P6l75k3L55j41J10q3J91
3040A76m9j21J56j88r1J23K3j48R5K98j48k10J10J69l19J1K76j76p9J52q4k71
3062b95K56Jo5J32J4k4k51K81m5j99O4K08k45J35K55j89j65J35R0j61j79K15J23
3085I1k15J34L46l13j96L34j37j02J81j71k50K55K46l02l2L65j65l53K08L08l67
3106a35O8M5R5j96L00j72r4J6K07j18p8K71l83K03j05L57l98LJ14j9j37J84K53
$$ [...]
8191h0
##END NTUPLES=NMR FID
##END=
