##TITLE=1H_3MBBC-1-3d
 CDCl3
 8 sc, 
 20.2.2024
##JCAMPDX= 6.0         $$ Bruker NMR JCAMP-DX V2.0
##DATA TYPE= NMR FID
##DATA CLASS= NTUPLES
##ORIGIN= UXNMR, Bruker Analytische Messtechnik GmbH
##OWNER= root
$$ XWIN-NMR		Version 3.5
$$ Tue Feb 20 16:29:56 2024 Russian Standard Time (UT+4h)  she@DPX200
##.OBSERVE FREQUENCY= 200.1313
##.OBSERVE NUCLEUS= ^1H
##.DELAY= (6, 6)
##.ACQUISITION MODE= SIMULTANEOUS
##.ACQUISITION SCHEME= undefined
##.AVERAGES= 8
##.DIGITISER RES= 18
##SPECTROMETER/DATA SYSTEM= spect
##.PULSE SEQUENCE= zg30
##.SOLVENT NAME= CDCl3
##.SHIFT REFERENCE= (INTERNAL, CDCl3, 0, 15.7039)
##AUDIT TRAIL= $$ (NUMBER, WHEN, WHO, WHERE, WHAT)
$$ ##TITLE= Audit trail, XWIN-NMR		Version 3.5
$$ ##JCAMPDX= 5.01
$$ ##ORIGIN= Bruker BioSpin GmbH
$$ ##OWNER= she
$$ F:/spectra/data/she/nmr/H-F/1/audita.txt
$$ ##AUDIT TRAIL=  $$ (NUMBER, WHEN, WHO, WHERE, WHAT)
(   1,<2024-02-20 16:28:29.54 +0400>,<she>,<DPX200>,
      <created by zg, POWCHK disabled, PULCHK disabled
       configuration hash MD5:
       00 E9 B6 7A A2 85 ED C7 34 08 36 98 17 FE 4E 26
       data hash MD5: 16K
       41 EB A4 49 25 24 A4 75 19 A8 F1 41 F0 80 0B 30>)
$$ ##END=
$$ 
$$ hash MD5
$$ 7F 70 1C 10 16 18 32 0F C2 D4 A6 69 E4 E4 DB B8
##$RELAX= 
##$RELAX= 
##$RELAX= 
##$RELAX= 
##$RELAX= 
##$RELAX= 
$$ Bruker specific parameters
$$ --------------------------
##$DU= <F:/spectra>
##$EXPNO= 1
##$NAME= <H-F>
##$PROCNO= 1
##$TYPE= <nmr>
##$USER= <she>
##$AMP= (0..31)
100 100 100 100 100 100 100 100 100 100 100 100 100 100 100 100 100 100 
100 100 100 100 100 100 100 100 100 100 100 100 100 100 
##$AQSEQ= 0
##$AQ_mod= 1
##$AUNM= <au_zg>
##$AUTOPOS= <>
##$BF1= 200.13
##$BF2= 200.13
##$BF3= 200.13
##$BF4= 200.13
##$BF5= 200.13
##$BF6= 200.13
##$BF7= 200.13
##$BF8= 200.13
##$BYTORDA= 1
##$CFDGTYP= 0
##$CFRGTYP= 5
##$CHEMSTR= <none>
##$CNST= (0..31)
1 1 145 1 1 1 1 1 1 1 1 1 1 1 1 1 1 1 1 1 1 1 1 1 1 1 1 1 1 1 1 1 
##$CPDPRG= <>
##$CPDPRG1= <>
##$CPDPRG2= <>
##$CPDPRG3= <>
##$CPDPRG4= <mlev>
##$CPDPRG5= <mlev>
##$CPDPRG6= <mlev>
##$CPDPRG7= <mlev>
##$CPDPRG8= <mlev>
##$CPDPRGB= <>
##$CPDPRGT= <>
##$D= (0..31)
0 1.2 0 0 0 0 0 0 0 0.06 0 0.03 0 0 0 0 0.0002 0 0 0 0 0 0 0 0 0 0 0 0 
0 0 0 
##$DATE= 1708432109
##$DBL= (0..7)
120 120 120 120 120 120 120 120 
##$DBP= (0..7)
150 150 150 150 150 150 150 150 
##$DBP07= 0
##$DBPNAM0= <>
##$DBPNAM1= <>
##$DBPNAM2= <>
##$DBPNAM3= <>
##$DBPNAM4= <>
##$DBPNAM5= <>
##$DBPNAM6= <>
##$DBPNAM7= <>
##$DBPOAL= (0..7)
0.5 0.5 0.5 0.5 0.5 0.5 0.5 0.5 
##$DBPOFFS= (0..7)
0 0 0 0 0 0 0 0 
##$DE= 6
##$DECBNUC= <off>
##$DECIM= 32
##$DECNUC= <off>
##$DECSTAT= 4
##$DIGMOD= 1
##$DIGTYP= 9
##$DL= (0..7)
0 120 120 120 120 120 120 120 
##$DP= (0..7)
150 150 150 150 150 150 150 150 
##$DP07= 0
##$DPNAME0= <>
##$DPNAME1= <>
##$DPNAME2= <>
##$DPNAME3= <>
##$DPNAME4= <>
##$DPNAME5= <>
##$DPNAME6= <>
##$DPNAME7= <>
##$DPOAL= (0..7)
0.5 0.5 0.5 0.5 0.5 0.5 0.5 0.5 
##$DPOFFS= (0..7)
0 0 0 0 0 0 0 0 
##$DQDMODE= 0
##$DR= 18
##$DS= 0
##$DSLIST= <SSSSSSSSSSSSSSS>
$$ [...]
##$SUBNAM2= <"">
##$SUBNAM3= <"">
##$SUBNAM4= <"">
##$SUBNAM5= <"">
##$SUBNAM6= <"">
##$SUBNAM7= <"">
##$SUBNAM8= <"">
##$SUBNAM9= <"">
##$SW= 18.0517328524113
##$SWIBOX= (0..15)
0 0 2 0 0 0 0 0 0 0 0 0 0 0 0 0 
##$SW_h= 3612.71676300578
##$TD= 16384
##$TD0= 1
##$TE= 0
##$TE2= 300
##$TE3= 300
##$TEG= 300
##$TL= (0..7)
0 120 120 120 120 120 120 120 
##$TP= (0..7)
150 150 150 150 150 150 150 150 
##$TP07= 0
##$TPNAME0= <>
##$TPNAME1= <>
##$TPNAME2= <>
##$TPNAME3= <>
##$TPNAME4= <>
##$TPNAME5= <>
##$TPNAME6= <>
##$TPNAME7= <>
##$TPOAL= (0..7)
0.5 0.5 0.5 0.5 0.5 0.5 0.5 0.5 
##$TPOFFS= (0..7)
0 0 0 0 0 0 0 0 
##$TUNHIN= 0
##$TUNHOUT= 0
##$TUNXOUT= 0
##$USERA1= <user>
##$USERA2= <user>
##$USERA3= <user>
##$USERA4= <user>
##$USERA5= <user>
##$V9= 5
##$VALIST= <valist>
##$VCLIST= <CCCCCCCCCCCCCCC>
##$VD= 0
##$VDLIST= <DDDDDDDDDDDDDDD>
##$VPLIST= <PPPPPPPPPPPPPPP>
##$VTLIST= <TTTTTTTTTTTTTTT>
##$WBST= 1024
##$WBSW= 4
##$XGAIN= (0..3)
0 0 0 0 
##$XL= 0
##$YL= 0
##$YMAX_a= 386560
##$YMIN_a= -422572
##$ZGOPTNS= <>
##$ZL1= 120
##$ZL2= 120
##$ZL3= 120
##$ZL4= 120
##$ABSF1= 10
##$ABSF2= 0
##$ABSG= 5
##$ABSL= 3
##$ALPHA= 0
##$AQORDER= 0
##$ASSFAC= 0
##$ASSFACI= 0
##$ASSFACX= 0
##$ASSWID= 0
##$AUNMP= <proc_1d>
##$AZFE= 0.1
##$AZFW= 0.1
##$BCFW= 1
##$BC_mod= 2
##$BYTORDP= 1
##$COROFFS= 0
##$CY= 11.3945322036743
##$DATMOD= 1
##$DC= 2
##$DFILT= <>
##$DTYPP= 0
##$F1P= 15.7292609196834
##$F2P= 12.9074282941183
##$FCOR= 0.5
##$FTSIZE= 0
##$FT_mod= 4
##$GAMMA= 1
##$GB= 0.15
##$INTBC= 1
##$INTSCL= 1
##$ISEN= 128
##$LB= 0.24
##$LEV0= 0
##$LPBIN= 0
##$MAXI= 10000
##$MC2= 0
##$MEAN= 0
##$ME_mod= 0
##$MI= 1.114404
##$NCOEF= 0
##$NC_proc= 0
##$NLEV= 6
##$NOISF1= 3.799351
##$NOISF2= 2.8
##$NSP= 1
##$NTH_PI= 0
##$NZP= 0
##$OFFSET= 15.70392
##$PC= 1
##$PHC0= -24963.77
##$PHC1= 17.65264
##$PH_mod= 1
##$PKNL= yes
##$PPARMOD= 0
##$PSCAL= 0
##$PSIGN= 0
##$REVERSE= no
##$SF= 200.130013532006
##$SI= 16384
##$SIGF1= 3
##$SIGF2= 2
##$SINO= 400
##$SIOLD= 16384
##$SREGLST= <1H.CDCl3>
##$SSB= 0
##$STSI= 0
##$STSR= 0
##$SW_p= 3612.71676300578
##$SYMM= 0
##$S_DEV= 0
##$TDeff= 0
##$TDoff= 0
##$TI= <>
##$TILT= no
##$TM1= 0
##$TM2= 0
##$TOPLEV= 0
##$USERP1= <user>
##$USERP2= <user>
##$USERP3= <user>
##$USERP4= <user>
##$USERP5= <user>
##$WDW= 1
##$XDIM= 8192
##$YMAX_p= 0
##$YMIN_p= 0
$$ End of Bruker specific parameters
$$ ---------------------------------
##NTUPLES= NMR FID
##VAR_NAME=  TIME,          FID/REAL,        FID/IMAG
##SYMBOL=    X,             R,               I
##VAR_TYPE=  INDEPENDENT,   DEPENDENT,       DEPENDENT
##VAR_FORM=  AFFN,          ASDF,            ASDF
##VAR_DIM=   8192,          8192,            8192
##UNITS=     SECONDS,       ARBITRARY UNITS, ARBITRARY UNITS
##FACTOR=    0.0002768,     1,               1
##FIRST=     0,             0,               0
##LAST=      2.2672688,     0,               0
##MIN=       0,             -422572,         0
##MAX=       2.2672688,     386560,          0
$$ Real data points
##PAGE= N=1
##DATA TABLE= (X++(R..R)), XYDATA
0@%%%%%%%%%%%qJ6j6J6j6J6k3L1l2M0m8N6o8P6q8J04j20J38j58J80k04K32k64
34a40K96l31L71m16M66n17N72o35P05p80Q59r46J046j154J271j398J537j696J872
53I82k067K287k536K821l152L541m006M570n273O174p375R062j1583J5732k3672
68a4495M3753j80193k71637O48948j2452n91819K72379M81697m04554k42762M46954
79A75819L8136m25000J03089L11516j88311k14101K18431J43278k11690j08533
89a57366K27514P0675k75419j4241L26804q5930l21756K30863K70870l52701j44251
100b24938M13787m4640m16386K26475L17486l67031j44137M26484m8854l77572
110b39326K13258K60074l03579j15007L22055j1348k88430J00883K24167j61331
$$ y = [0, 0, 0, 0, 0, 0, 0, 0, 0, 0, 0, 0, -8, 8, -8, 8, -8, 8, -15, 16, -16, 24, -24, 32, -36, 40, -48, 56, -64, 74, -84, 96, -108, 124, -140, 156, -175, 196, -220, 246, -271, 301, -334, 371, -409, 450, -496, 550, -604, 667, -731, 806, -890, 982, -1085, 1202, -1334, 1487, -1665, 1876, -2130, 2440, -2833, 3341, -4034, 5028, -6555, 9177, -14495, 29258, -150935, -422572, 226376, 213924, -377895, -105516, 376181, -28373, -271135, 175819, 213955, -211045, -107956, 203560, 15249, -198852, 19579, 162857, -48833, -157366, 70148, 140823, -134596, -148837, 177967, 92037, -229719, 1144, 272014, -80687, -224938, 188849, 144209, -272177, -45702, 271784, -95247, -239384, 187100, 138246, -239326, -26068, 234006, -69573, -184580, 137475, 126127, -162303, -61420, 162747, 1416]
120A416j62808J89344J07561k03937n6146K30668R749k52005O3648K51821j71441
131G870k16515K70123J20851l30668J8844L36989j59419k76847K70483J60664
141B02375l32550j6515L31803j16208k62961K14767J61625k57321o4260K45557
151A06312k0146k20076P8058J91136j20181j55031J65370J19440k02996p0174
161a28288K31028k098k47416R1552K32678j86710j68276K66487N9849k98896O6781
172h3309K65854j80090j81879K51663P2180k69468L8774K39340j29824j74509
182a51268J80890R4036j91808k0945J77864k5572j54927N7649J37677q9789j22545
193a08738J26555R1701j65906m0990J91824k8939j94361J08145J63311j81474
$$ y = [1416, -161392, 27952, 135513, -68424, -124570, 106098, 115847, -136158, -72510, 179311, 7870, -208645, 61478, 182329, -148339, -129495, 207494, 48075, -228772, 41711, 202375, -130175, -146690, 185113, 68905, -194056, 20711, 182336, -74985, -139245, 106312, 86166, -133910, -55852, 135284, 15103, -139928, 25442, 144882, -58114, -128288, 102740, 100642, -146774, -55222, 177456, -9254, -177530, 88957, 148806, -150090, -83309, 182545, 2455, -179424, 72239, 144419, -125049, -86275, 153065, 23241, -151268, 29622, 123658, -68150, -89095, 88769, 63197, -91730, -34081, 103596, 13807, -108738, 17817, 109518, -56388, -97378, 94446, 65507, -128854, -20709, 142602, -38872]
203c8872r3987K31591l296k34222J07777J86114j87633j02922K22238Q169k13388
214a18431P3060J71959j29346j12362J58759M8648j61418M721J43827m3151j21461
225h5195O9890J02482r5588q0751J26695M6917j54195N868J64073o8626j46273
236a14703J30014J01921j77499l6529J96729m4302j82738J19106J32162j69630
246d5469n7866J84563j5046j64280P3661J25335j10972p9189J29992L2946j33641
257e9966R471J22870m6536j04620P6037Q2429j02786n4942J27504J6381j42248
268g6406L6519J34960r2497j02893J36116N1220j57038R651J53517o7934j24742
279i9527J16395P6074j42851j7299J40962l8510j17198P7573Q0758r9392m5262
$$ y = [-38872, -132859, 98732, 95436, -138786, -31009, 155105, -32528, -135450, 86788, 94957, -118431, -45371, 126588, -2758, -115120, 43639, 92287, -69131, -64410, 79417, 36266, -85195, -15305, 87177, -8411, -89162, 37533, 84450, -69745, -63877, 100196, 31570, -114703, 15311, 117232, -60267, -96796, 99933, 55631, -127107, -8001, 124161, -45469, -103335, 81228, 66182, -98098, -24437, 100898, -10074, -89263, 40729, 73675, -59966, -50495, 72375, 25839, -78781, -2744, 79685, -23101, -78043, 49461, 65842, -76406, -39887, 95073, 2576, -100317, 35799, 87019, -70019, -60368, 93149, 25215, -99527, 16868, 92942, -49909, -67208, 73754, 35244, -81954, -4381, 76377, -23015, -68277]
290f8277J08936J0720j09916K5312J03046n8176q4495Q6941O0162j07851k9172
301f2770J20521j1463j22837N6926J05539j01040o7535J28881J6676j32472L5327
312c4247J14449p7851q1171J07081L8450j19451Q508J12201n0167q7928P8456
323H330N6228r2216k4453R6588m955r5303L3600Q6333o2518o8027Q5098L9006
335E7711r8848n577J02245k9035r3797O4661P3556r3942l6959J09948q033j05938
347f4008M9963Q3228q2380n1604R9045J5030j03404K2498R4035n5732p0775Q0354
359A6250L9888r0517q828R0040j8433q2548M3442O7974o6513m4867Q3591J3953
371D3432q8483J7246Q1156m4613o4817O7306M0126q4160r573R0024k5492q1471
$$ y = [-68277, 40659, 51379, -58537, -33225, 69821, 11645, -72850, 14091, 74253, -33598, -62770, 57751, 46288, -76549, -19623, 85916, -15124, -82659, 46222, 62898, -69574, -34247, 80202, 2351, -78820, 28261, 66711, -52740, -44232, 67969, 17802, -70126, 8330, 64558, -27658, -52111, 44477, 39522, -55781, -22181, 64152, 1634, -66393, 18705, 57711, -41137, -46714, 55531, 26496, -67301, -2640, 70916, -23026, -59985, 49963, 41930, -64008, -14045, 69183, -13197, -64801, 34244, 49274, -54130, -31632, 62403, 6671, -64104, 16250, 56138, -34379, -43207, 46833, 28400, -54148, -10706, 57268, -9245, -54112, 29479, 43432, -45051, -27805, 53351, 8738, -56079, 11227, 51353, -32807, -42380, 47644, 22152, -59319]
383e9319N7285N9509p7296k9403Q7030l64q6126K9763P5880n6338n6365P5091
395A9347K6768q3108L338P7864l0196o4166N1543M6350o7366k2363P7355n671
407B9695p4651L3353O1426n5621m1182O9536J8163p6931N537P6698l1487o6010
419e1474N5846M4996p2082j8273P7027q204p3348L2243O1697n4251m1000P0936
431B4113J3777p5491J6775O7838m1704n0206N8393K8255o8592n202O9957k0394
443A7519o3207M3116M7186n8926k5258O5336M500o3862J5938N9028l5095m7579
455d1304N2608K8915o4390n574O4978j8770n7445L9198M3732n5684k4390O6574
467B8448K31o7754K6217N6817m7859l6977N9468J4727o2652P141N9728k5968n0646
$$ y = [-59319, -2034, 57475, -19821, -49224, 37806, 37442, -48684, -18921, 56959, 621, -55744, 19347, 46115, -36993, -33655, 44209, 14013, -50153, 1390, 47740, -19626, -41989, 35366, 29695, -44956, -11603, 49823, -5798, -46980, 22556, 40719, -36212, -30675, 46023, 14536, -51474, 4372, 49368, -22714, -40987, 36040, 27836, -45512, -13269, 48428, -5823, -46823, 24113, 37890, -37601, -20826, 47012, 5308, -44898, 13495, 41750, -26842, -32044, 37913, 17519, -45688, -2572, 44614, -14312, -39570, 25766, 30266, -33596, -17658, 41370, 6275, -41304, 11304, 40219, -24171, -29745, 35233, 16463, -40982, -1784, 41948, -13736, -38126, 28448, 28679, -39075, -12858, 43959, -3900, -40877, 18591, 33318, -29334, -22193, 37535, 11567, -39079]
480c9079M3387L4811n4701j4787N7241n263n4212K1180M6305l5884l5635M8786
492A2149J8812n6959M440N7002k6665m6193M4575L0276n6097j0652O1040j2133
504A9595n9159L4193M6004n1581k5994N8600M276n6107J4517M8822k9279l7215
516c3328M1044K1749m8705l129M9424j5006m3255K9853L2951m0327k0349M9211
528B0133M142n3965J4830N0318l4115l8217M6703J9652n1953q69N1106j5712m4289
541c2236L1448L2366m2331j3821M6165m413m2582J8343L3738k8700k5453L6697
553I221J3953m3248N33M5367j6294m0299L1023K9936m1076j6076M7951j06m9956
566b9071J8940M3402l7059k8019M9042O916n0189J2615M3118k7487l1373L7073
$$ y = [-39079, 4308, 39119, -15582, -30369, 26872, 21609, -32603, -11423, 34882, -1002, -36637, 12149, 30961, -25998, -21558, 35444, 8779, -37414, 7161, 37437, -18660, -29312, 31728, 19595, -39564, -5371, 40633, -10948, -36942, 21658, 25934, -30173, -15656, 33166, 3887, -33328, 7716, 29465, -19240, -22369, 27055, 12049, -31206, -1353, 31598, -8729, -29078, 20133, 24275, -29690, -14860, 35458, 1343, -36874, 9829, 29481, -22472, -23341, 27765, 12053, -32236, -788, 31578, -10753, -24574, 21591, 17178, -25404, -7061, 26677, -2023, -27476, 9221, 23174, -20074, -19541, 25826, 9532, -30767, 256, 30192, -10884, -26960, 20991, 20885, -29071, -10131, 33271, -3788, -31807, 17235, 24151, -26038, -13423, 29695, 2208, -29165, 7908]
578G908J6687m2454n15M0950j4907l3123K5392K2873k9807j2444L2789M420l5025
591a7256N756L5944j8878l2125L0584K1989l9886r411M3060m608m2460K0523L6140
604B9372l5023k0975M4337J645m3407J7215L3943k9982k1012L6030P243l8089
616a8703N928L5699j8092k8856K6685J9284l0333j0208L0814L081l2041M965L2204
629B0427j5821k8163K7487J8180l4831l367L7358j1510l3855K5126K4948l6823
641a0844j0922M1895p889l9649K4688K8157l4527j2764L6504j4l2957J1201K7871
654B0750j9500j9794K4684R909k6156j334K3910n652k1827J0712K0197j7004j6299
667a7404K4930P343k9589M717K8820j6051k3557K4773J5056l0813l472L3386r043
$$ y = [7908, 24595, -17859, -18374, 22576, 7669, -25454, -62, 22811, -6996, -19440, 13349, 17769, -17256, -11500, 24444, 5566, -26559, 4025, 26014, -13872, -23283, 19777, 15169, -27291, -6768, 29372, -5651, -26626, 17711, 19356, -24051, -6836, 27107, -2875, -23887, 12143, 19386, -18703, -12775, 22924, 4832, -24024, 2661, 21945, -8388, -18596, 12218, 15299, -16742, -11777, 20427, 4606, -23557, 3930, 22110, -12721, -16088, 21270, 9760, -24095, 1031, 25979, -10844, -21766, 20129, 12240, -27409, -2721, 25436, -9091, -21855, 14649, 14635, -18322, -7121, 20750, 1250, -18544, 6140, 16049, -10107, -11441, 12469, 6817, -15010, -4298, 15899, -1105, -17404, 7526, 14869, -14720, -10003, 18817, 2766, -20791, 3982, 19038, -11775, -15247, 18139, 9096]
680I096l0185K1677K0864k8773q675K9256k587k6614R854K2260j6736j6972K2166
693D631R012k4746J232K4588r200k0834J6125J6697k2287j0020K7394r00k9616
706a7924J2802K4657k3074j5222K8137M120k7786N833K4894j3974j8500J9950
718C913R831k2097k21J9433o687j4554R919J1263j2065q488J5158M933j8932J391
732g203J9900r464j7962J5469J3383k1105o867K5668k299k5719J3561K1180k2604
745d062r670K5791k144k2940J0456J5987j6254r227J8721R01j7772O487J3644
758I918j1261p591J2662L678j1248k273J1490J002j3634K678J4910q321j3325
771a1315J3192R222j6287l867J8055l099j7534J0974J2859j8367l963J9829o373
$$ y = [9096, -21089, 588, 21452, -7321, -15996, 13260, 10673, -15941, -6087, 16173, -563, -17535, 4631, 13643, -11103, -9871, 14717, 5517, -15317, 808, 17505, -4782, -14802, 12592, 11692, -17924, -5122, 19535, -3539, -18761, 9376, 13496, -14290, -8457, 16437, 2463, -16037, 3913, 13744, -8353, -8574, 10859, 4172, -10382, -463, 10800, -1265, -9753, 5405, 10338, -8594, -7203, 12697, 3233, -14729, 740, 14123, -6982, -13849, 11819, 9520, -16199, -2638, 18542, -4062, -13732, 12059, 9915, -13025, -2569, 13418, -2836, -12063, 6658, 7559, -10213, -3726, 9918, -1343, -8934, 3728, 7406, -3842, -6115, 5375, 6377, -7257, -4579, 10331, 2010, -11315, 1877, 11099, -5188, -9055, 9000, 5901, -11633, -659, 12200, -6167, -10130, 9699, 3326]
784C326j5499J3900Q699j6515j305J6295l783j4071R130R929j2956m655J2273
797D768n73r701K340O768k455o754L782P638o546n076Q977J486q931K373P811
812E907n589o480Q460L734j1547J075J1963p709q385J1902L237j2257J103J0489
826E903m366q362O525O153q609k481R117j416o498M407L686m897j437M798Q5o365
842c757J820O374n548m873Q320Q45q379K408P495l519o068O096M418p962j436
857c766Q657k992o329N602K002n929M32M807j676m300L398L701n719j339P342
872C891k152o688M800M746n670l327O452K341p661L66Q700m227o531O500K796
887D336p394N97O047l284n182M989L748p199n44R042l427p350P417M528q388j726
$$ y = [3326, -12173, 1727, 10426, -6089, -7394, 8901, 5118, -8953, 177, 10106, -2850, -7505, 4768, 4195, -5506, -3166, 3602, 1147, -5607, -1825, 5813, -733, -5809, 3168, 4654, -4277, -1904, 5907, 318, -6162, 2298, 6032, -5515, -4440, 7523, -186, -8571, 3331, 6568, -5689, -4586, 5903, 1537, -6825, -300, 5853, -2756, -5237, 3880, 2464, -4034, 373, 4059, -838, -2275, 2523, 2608, -3757, -1937, 4437, -1111, -5984, 2336, 3181, -5198, -2790, 4705, 1186, -4882, 1214, 5632, -2330, -3766, 4891, 1899, -4430, 1172, 3174, -2755, -2323, 2484, 808, -3492, -94, 3607, -2112, -3451, 3891, 1739, -4949, -149, 4597, -1073, -4400, 2052, 4393, -3268, -2902, 5798, 1571, -4960, 1540, 4336, -3058, -2461, 3586, 302, -4880, 109, 3857, -3342, -3886, 5156, 1729, -5621, 1796, 6324, -2064, -3790]
903c790Q388l69r194K695Q714o922o596R636K114r626K158P928m361o078O239
918I36M320q198j146R380l329q125P407M797q723j953R152j85r598K399J0200
933G334o678r196J0294N523j2418j052J1925k375j1061O560J0016j0598n460J3771
947F585p73j3861P553R799j2376n235J3790J84j4474M464J3754r843j0097J4347
961C817M954j5207M70J3850m240j1821P359R597j0495o929J3697J451j4293M597
975c193J2069r122q481J2129M518j4663M3J5693o355j4415J2860R672j6286l246
989h777J6901j676j5607O527J3793j0905j0775J4555N145j6703M96J5610o497
1002B087j2878J0788J0105j4705n301J8393j306j8699R883J5397j6670q855J9460
$$ y = [-3790, 4598, 4229, -4965, -2270, 6444, -478, -7074, 2562, 4676, -4950, -2792, 5136, 775, -5303, 936, 5256, -2942, -4088, 5292, 1963, -6162, 1245, 6042, -2681, -4634, 4518, 4333, -5265, -2866, 7334, 656, -8540, 1754, 7277, -5141, -6193, 5732, 3357, -7704, -1144, 8872, -1726, -7186, 6585, 5812, -8049, -496, 9303, -3073, -8308, 5482, 5666, -8808, -4344, 9410, -433, -10530, 3817, 8771, -6436, -5966, 7884, 3644, -8177, -818, 8779, -1716, -8645, 5052, 6503, -7790, -3193, 8876, -246, -8727, 3402, 7920, -6743, -6700, 8993, 2638, -11777, 1083, 10755, -5531, -8777, 8124, 6448, -9159, -2632, 11161, 256, -10519, 4036, 9181, -7522, -7026, 8584, 2087, -10791, -3, 10102, -4603, -9904, 8489, 7183, -11516, -1633, 13764, -2906, -11761, 7699]
1015G699J575k0050N231J7996j1782j4090J7836P158k0357P88J8603p040j4756
1028a1189J0655J0876j3219p258J6161K346j7379M360J6135j0253j2215J4970
1040C990P144j8437j474K0309o422k0314J4564J5468k1542o764K4179k328k1632
1053a3259R783J7738j4859j1896J8687M559j9769K870J7305r709j2308J2825P680
1066I647j4954l830J7080o57j8245O962J7445j4323j3148J9738O676k2546R53
1079i202K2724q658k0307J7197J4182k3524m158K4931o593k1208J4043J4041j8690
1092e222p038K0511n24k0260Q204J7747j3860j2168J7560O582j8727j300J9367
1105A0872m222j9746J0708J6976j7937j1068K2517K418k3291O618K0606j4013
$$ y = [7699, 9274, -10776, -5545, 12451, 669, -13421, 4415, 11573, -8784, -7996, 10607, 3567, -11189, -534, 10342, -2877, -10135, 6026, 8372, -9007, -4647, 11488, 1235, -10980, 3990, 11134, -7303, -8777, 11532, 5110, -15204, -640, 14828, -6714, -13478, 10701, 8373, -13259, -3476, 14262, -597, -12493, 6194, 10753, -9016, -6146, 11159, 1450, -10858, 1967, 9647, -5307, -9137, 7943, 7286, -10959, -3997, 13448, -875, -14023, 5715, 12391, -10155, -9202, 13522, 4864, -15443, 1754, 15936, -7588, -11746, 13185, 6592, -14616, -573, 13468, -5222, -12260, 8251, 7727, -12533, -4329, 13418, -442, -12610, 4950, 11532, -7195, -8495, 10872, 6650, -13096, -2388, 14588, -3349, -14417, 8100, 10518, -12773, -6155, 14451, 438]
1117D38j5289K0153P969k3904J837K2684j1043j7021J7212R264j9108k673J9039
1130I558k610j8168P821J6156j3264j2508J7555O783k0552j052K1545m887k0973
1143a4596J2576J8152k0312j0368K6235r10k5741J1573K0186j9962j2263K4487
1155I057K090k5621Q067K2380j6894j4853K2121O111k2233J755J9716o590j7062
1168a1956J0405J4071j4383j0125J7946M325j9440J863J9324q525j6963J4938
1180A480J2457k1303n016K4961n581k3398J5718J6867k2158p640K5196j673k3933
1193a4023J0033K0237j6898j3809K1222M988k1897J827J9439p394j6447J1554
1205a168J3475j5704q835K0186K111k1721O514J9938j4455j5131K0451Q244k5010
$$ y = [438, -14851, 5302, 13271, -10633, -8796, 13888, 2845, -14176, 3036, 12300, -6808, -9481, 9558, 6948, -11220, -3399, 12757, -507, -13015, 4540, 11323, -9229, -10281, 11264, 6377, -14596, -2020, 16132, -4180, -14548, 11687, 10777, -14964, -3391, 16795, -3167, -15430, 9057, 11147, -14474, -6407, 15973, -921, -15774, 6347, 12458, -9775, -8020, 11696, 5106, -11956, -1551, 12520, -1863, -11988, 5958, 10283, -9157, -7294, 12030, 3505, -13458, 1480, 13937, -7366, -12382, 12579, 6998, -16400, -682, 16185, -5973, -13613, 11583, 9910, -14023, -3990, 16247, -651, -14460, 6762, 11750, -10147, -8320, 11119, 3725, -12722, -1168, 12307, -3397, -12232, 7954, 10065, -11656, -5142, 14796, 341, -14790, 5661, 13905, -11105]
1218a1105O49K6006j1152k2220K0201J4025k5380l371K5177o032k1195J2203J6181
1231A3987j6975r691J9649K768j9589M133J7397r048j3971J2980J0473j7084o279
1244a1250K0759j185k2242R380J9854j7855j3384K3460N142k5377M539K4608j3782
1257B667j9266K1370J0135k4714r8K3089q885j8304J4392J1844j7159o093J9153
1270H131k66j9047O690J6896j2022j3013J5959Q764j9256l774K2121l198k2533
1283a4548J2098J8893j9944j1182K4560J420k5077P818K1447j6174j5254K1845
1295E902O318k4058L929K2028j2156j5722J7014R266j8721l252J9440k694j9376
1308a2082Q542J6860j4679j1993J8233O171j9971j64K0834o442j9366J3669J5203
$$ y = [-11105, -10456, 15550, 4398, -17822, 2379, 16404, -8976, -12347, 12830, 6798, -14397, -2194, 13987, -2988, -12679, 6970, 9738, -9851, -5718, 11679, 2631, -11340, 1640, 12113, -4971, -11250, 9509, 8324, -13918, -4538, 15316, -2539, -15923, 7537, 12679, -12698, -8159, 16449, 2667, -16599, 4771, 14906, -9808, -9906, 13183, 4298, -14006, 386, 12230, -4929, -11022, 8131, 7865, -11182, -4492, 12404, 382, -12631, 3328, 12092, -7164, -10938, 11183, 7985, -14548, -2450, 16443, -3501, -14683, 9877, 11297, -13780, -5962, 15485, -689, -15943, 5902, 12220, -11838, -7909, 14119, 1963, -13759, 3255, 12521, -6200, -9452, 9988, 7294, -12082, -3540, 13320, -1359, -13352, 4881, 11052, -8919, -9083, 11751, 5309, -14057, -388, 14815]
1321A4815k0252p068K3502k815k1897J0958J7512j7294j0807K1435K906k2813
1333a1818N468K0746j3354j5360J8006Q267j9828j909J9751l465j9213R964J6464
1346A3719j5332j0974J9467L915k0419L115J9007r810j6549J5864J0737k0563
1358g823k936K2358o063j9929J4104J4373j8672p475K1193O60k1776O716J9381
1371A4111j3680j4313J8100P766k0105o80J9568n425j7694J1365J3791j6809p969
1384a1974K0248L5k0337P452J7826j3798j2582J8478O724k1295J089K1509r254
1397D121j8242J5579J1853j9438m962J9734j593j9161Q204J6382j3337j1487J7861
1410E514M772j8919K367J7677q181j5313J3278J0947j7657n198K0387k575k0069
$$ y = [14815, -5437, -12505, 10997, 8182, -13715, -2757, 14755, -2539, -13346, 8089, 10995, -11818, -6350, 14396, 1042, -14318, 3688, 11955, -7873, -9782, 9969, 6504, -12709, -2745, 13719, -1613, -12587, 6880, 10795, -9624, -6509, 12498, 2688, -13861, 2003, 12740, -7823, -10759, 11599, 5536, -14393, -289, 14084, -4588, -12063, 9130, 9790, -11986, -5270, 14111, 431, -13882, 4218, 11984, -8121, -8801, 10767, 5342, -12352, -987, 12804, -4005, -11974, 8274, 8309, -12028, -4576, 13250, -548, -13130, 5348, 12072, -9223, -8134, 13375, 4121, -14121, 1458, 13311, -6127, -11089, 8645, 7052, -12109, -3905, 12477, -860, -12347, 5514, 10286, -8633, -6266, 11411, 3230, -12083, 1195, 12142, -5515, -10713, 9674, 7099, -12970]
1423a2970J0487J6037j5799j0481J9013M158k0530K860J9698r874j6322J6180
1435B457R612j8862k313J9503m626j7185J0135J3849j5108r027J8707J495j9749
1448a1112N768J7314j1612j2996J5795P871j8149j723J9731m985j8361J2033J3512
1461A3086j6768p334J8566O35j8619N186J7066j1321j3020J6219O980j8624M78
1474g470J8154p241j5177J2472J0804j6265n551J8833j118j8658P962J6127j3730
1487h58j0930J6944N224j8495M05J8175o476j6358J2297J1517j6466m806J8109
1500H282j655j6994P924J4564j3002j0189J7071M051j9795L390J8383j0356j4511
1513a2837J4839R149j7668l267J9025k868j7848R463J4233j4457q589J7031K286
$$ y = [-12970, -2483, 13554, -2245, -12726, 6287, 10445, -10085, -7225, 12473, 2599, -13723, 2457, 12069, -6793, -9106, 10397, 5771, -11414, -1279, 12570, -2538, -11565, 7142, 8637, -11112, -5344, 11970, 358, -12638, 3157, 11028, -7121, -8844, 10887, 5902, -12459, -426, 13086, -3682, -11016, 7550, 8185, -10434, -5248, 11818, 497, -12523, 3696, 10676, -7948, -7470, 10684, 3443, -11734, 738, 11542, -4723, -10274, 8559, 7441, -11217, -3255, 12872, -858, -11788, 5156, 10380, -8115, -7710, 10465, 3989, -12369, -72, 11445, -5021, -9827, 8282, 6627, -10367, -2443, 12121, -881, -11070, 6001, 10052, -9743, -6353, 12030, 1674, -12837, 2002, 11151, -6517, -9784, 9241, 6373, -11475, -2012, 12221, -2236, -10825, 6206, 8492]
1526H492j7138L529J5810q934j3101J3856Q263j7396j750J8342n264j6450J0940
1539h01J2436j5273p610J8101J307j8574N773J6931j1874j1708J5563N711j7005
1552g023K77J6173n421j4691J0263J0668j4315n543J6045N8j5617N207J4066r527
1566F20j1414J4059P093j7417r60J8544o097j6886J2618J2384j7026o548J9665
1579H635p40j9591Q178J6344j4615j0218J7999K623j7979M556J5155r770j1015
1592a0438J3529O479j5467q65J5829m558j4125Q575J0826j1344q170J3505M327
1605H103j5640Q35J6160o351j4376J2370R937j5753l932J7296k400j6916Q842
1618a825J3800j5066p857J8247K12j7725O718J4699j1556j0321J4695N287j6350
$$ y = [8492, -8646, -5117, 10693, 1759, -11342, 2514, 10777, -6619, -8369, 9973, 4709, -11741, -801, 11635, -3638, -11248, 6853, 8160, -10414, -4641, 12290, 416, -11292, 4271, 9982, -7023, -6746, 9427, 4006, -10685, -422, 10246, -4069, -9612, 6433, 6491, -9126, -3919, 10147, 620, -10794, 3265, 10358, -7059, -8019, 10525, 4428, -12458, 160, 12544, -4482, -11030, 8635, 7895, -11696, -3518, 12826, -1789, -12007, 5992, 8615, -9364, -4808, 10347, 577, -10438, 3091, 9570, -5897, -6762, 9067, 4509, -9616, -1041, 9785, -1559, -9729, 3776, 8103, -7537, -6702, 9458, 3107, -11269, 1101, 11038, -4715, -8647, 8649, 6249, -10667, -1825, 11975, -3091, -10948, 7299, 7511, -10214, -3496, 11203, -353, -10674, 4021, 9308, -7042]
1631g042K13J5947n717j3688J0191R940j2617n853J4248J766j5138L237J4572
1644A0059q789j1714J3252O733j6690l30J6565n768j4557J1364J0938j5521n220
1657i678J8212j812j7137Q336J3396j2716q421J4716L323j5387J283J4921o831
1670B205j2227J1082Q226j3411l494J4296j242j3858N792J2421j0736q920J4681
1683D815L483j6014K558J5289q274j2227J2372Q000j5072l320J6293k849j5206
1696a0152Q233J1679j1846o868J3457K511j3677K259J3270o784j1273J1515O841
1709I165j4439j856J4968l884j4046Q821J1556j2913p270J6017J442j6541N121
1722c859J4337j0433j0025J3372N034j4297r6J3767m658j1994R213Q470j1923
$$ y = [-7042, -6829, 9118, 3401, -10287, -96, 9844, -2773, -8626, 5622, 7388, -7750, -4513, 10059, 1270, -10444, 2808, 9541, -7149, -7479, 9086, 3318, -11239, 125, 11063, -4458, -9678, 8534, 6722, -10415, -2079, 11317, -1399, -9820, 4896, 8219, -7168, -5885, 9036, 2205, -10022, 1060, 9286, -4125, -7619, 6677, 5435, -8423, -2631, 9790, -946, -9866, 4815, 8298, -7716, -5158, 10131, 1857, -10370, 2002, 10002, -5070, -8390, 7903, 5054, -10152, -1919, 9760, -2086, -8954, 4503, 7014, -6663, -4404, 8866, 2082, -9191, 2324, 9165, -5274, -7130, 7838, 3954, -10092, -1271, 10285, -2628, -9898, 6119, 7561, -8980, -3859, 10478, 45, -9980, 3392, 8426, -5871, -5967, 7800, 3142, -8852, 361, 8831, -3092]
1735c092l996J2744m72j2401M052J1180p683r451J1380N760j3893n68J4977m782
1749C755j3085R397R949j2758n612J4527K76j5089N416J2649j0490p953J3061
1762D043K638j3189K054J2227n811j0113R271P319j2389k596J2916j870j2125
1775g625N720J0376r152p802J1957M083j3692P63J3915o429j1104J0184O947j2415
1789d274k598J3222k057j2311O979R630j0465n284J2053O84j1807L244J0420o749
1803F87q377R131N669j1570j949J2447k156j1435O179R273q793o628J1324K942
1817F744j2694J745J1950o968r025J0552M401j1669oJ1411l967r940P526P617
1831G677j0528l861J1611l54j0770L675R373o242p283Q337N205j0342j721J1062
$$ y = [-3092, -7088, 5656, 5184, -7217, -3165, 8015, 332, -9119, 2261, 8021, -5872, -6440, 8537, 3755, -9330, 67, 10016, -2742, -8354, 6173, 6449, -8640, -3224, 9425, -1065, -9018, 4043, 6681, -6508, -4454, 7773, 1962, -8151, 1120, 8439, -3950, -6546, 6370, 4500, -7625, -1905, 8471, -681, -8483, 3474, 7557, -6135, -5372, 8543, 2114, -8990, 1194, 8141, -4274, -6872, 6350, 4293, -8018, -1039, 8591, -1874, -7158, 4895, 5579, -6228, -2984, 7436, 687, -7690, 1441, 7110, -4460, -6409, 6038, 3882, -7553, -1374, 7899, -894, -7522, 3802, 6744, -5950, -4205, 7745, 777, -8248, 2304, 6705, -4964, -4970, 6441, 2474, -7466, 60, 7677, -2851, -6712, 4899, 4545, -6225, -2550, 6823, 581, -6702, 1635, 6840, -3502, -5223, 5839]
1845E839k383j0340O043P743q840m668J0708N73j1181L508J0492p674p395J0860
1859C285K928j1451J685J0571n224q774P498O148r554k887J0180p60r528M131
1873a752P597o072n474P547L360q876m72R434k970q748O633O270r013k604R757
1888D617o76r968M244Q814p755n954R954J815j0495K001R156n004o727O764M860
1903E646q034j990Q855j137q176L832O475o051m466P208J865p972M67Q354l741
1918A135p067O734M999q919j574R502j621q840M420P251o849m951Q807J709r145
1933d409J753P895m610n546O153L209p016j375P681j565p050M161N705o564l045
1948d623P675O50p524J667P443m261o337O486M199q319j109Q051k043o804M039
$$ y = [5839, 3456, -6884, -841, 6902, -1938, -6606, 4102, 4675, -6506, -2998, 7494, -180, -7575, 3285, 6213, -5238, -3553, 7018, 1794, -6980, 518, 6666, -2888, -5775, 4405, 3645, -5883, -1752, 5845, -227, -5701, 1846, 5206, -3670, -4142, 5292, 2322, -6426, 207, 6477, -2536, -5140, 4617, 3941, -6027, -1783, 7031, -724, -6678, 3276, 5091, -5404, -3403, 5753, 749, -5978, 786, 5646, -2388, -4378, 4477, 3340, -4836, -1004, 5471, -580, -5046, 2162, 4027, -3945, -3478, 4876, 1135, -5932, 802, 5801, -3118, -4692, 4810, 3189, -5651, -1231, 6020, -829, -5780, 3027, 4736, -4409, -2656, 5239, 629, -4917, 1236, 4445, -2571, -3946, 3735, 2170, -4880, -719, 4986, -1578, -4623, 3052, 3702, -3822, -2155, 5288, 1027, -5310, 1176, 5375, -2944, -4053, 3998, 1955, -4849, -810]
1963h10N270n456l427O897J016p040J992O282m616m214N644K474o655m11O605
1978C551j666o472M239N198o038l287P161O46p016J634O098l666m887N300L240
1993D035o663m30O904k224n487L932M159n335k504N957M32o483J901N761m326
2008c71m145N929J887o133L19O300k198n704M097M521n860k426O425k30n836K024
2024a401M815l427l304M288J819n090o0N419k287m376L934K790m606j369M933
2039B078J86n277J638N368l559m147N010K183n626m45N260j415m768K845L990
2054C321m555k065N470j93m972K302M223l812k552M358J472n393L66N211k313
2069H68m752M014L079m827j214N047q0m796J437M498l178l165M465J162m608N58
$$ y = [-810, 4460, -996, -4423, 2474, 3490, -3550, -1558, 4724, 108, -4106, 1538, 4012, -2643, -3054, 3551, 1885, -4587, -348, 4850, -1188, -4475, 2686, 3332, -3684, -2050, 4048, 382, -4505, 795, 4035, -2628, -3058, 3846, 1622, -3865, 67, 4226, -1109, -3613, 2344, 2776, -3707, -1806, 3955, -371, -4516, 1413, 3300, -2833, -2514, 3786, 1588, -4116, -19, 4502, -1358, -3784, 2641, 2411, -3425, -1401, 3414, -13, -3317, 971, 2790, -2300, -2360, 3059, 772, -3604, 330, 3120, -1486, -2855, 2078, 2264, -3013, -1375, 3993, 434, -3713, 1297, 3480, -2146, -2591, 2669, 1254, -3514, -669, 3321, -1234, -3299, 2171, 1978, -2994, -692, 3531, -281, -2833, 1525, 2997, -2396, -2030, 3181, 868, -3884, 130, 3209, -1618, -2832, 2215, 2135, -2661, -1224, 3274, 96, -3069, 1396, 2558, -2050, -1492]
2085a492L950k054k997K976K309l593j289M295m61m264J941L264k948k385L384
2100F36J717l934o28M955j483m062K922L024l817j692M067K57m055R62L841k672
2116C8l045L852J364m181M24L852j765k932K739K021l213j419M029r3m315K086
2132e58L360k895k473L399J536l662l95L833j105l871K702K616l636r08L684n16
2148A111l181J669K786k438j916L273O41l792P94L399k092k530K122K016k535
2163f73j531L095P05l534P21L554k017k272K420J649k969p68L456o55l468K061
2179b26K618l343r45L561n46l106J355K656k089k469L021J539l535N6L476j293
2195G30k602J800K102k120j642K693Q89l130K77K949k031k236K954Q67k972Q9
$$ y = [-1492, 2458, 404, -2593, 383, 2692, -901, -2190, 2105, 1644, -2620, -679, 2585, -363, -2748, 636, 2353, -1581, -2209, 2746, 1263, -2799, 123, 3147, -670, -2362, 1705, 1962, -2093, -1131, 2710, 38, -3007, 845, 2209, -1972, -1548, 2304, 539, -2393, 346, 2367, -846, -2265, 1764, 1671, -2644, -558, 2802, -93, -2566, 833, 2369, -1293, -1688, 2145, 1040, -2831, -129, 2487, -1149, -2057, 1627, 1111, -2070, -401, 2385, -53, -1969, 1304, 1945, -1847, -1053, 2346, 254, -2276, -154, 1862, -673, -2204, 891, 1596, -1938, -1217, 2337, 320, -1952, 468, 2117, -852, -1620, 1836, 1181, -2287, -226, 2392, -951, -1896, 1665, 1119, -1987, -632, 2024, -65, -2534, 487, 2026, -1509, -1453, 2023, 730, -1872, -72, 2030, -90, -1732, 961, 1850, -1280, -1003, 1946, -85, -2321, 633, 1500, -1472, -1383]
2211a383L021j094k635K315K027l069o17L001n60k557J242K036j654j769J938
2226B42J563k526o97K798l91k563J102K298j781j769K108J361l032oL221j636
2242B92k378K919J121l151P5L071j167k960K069K450l362j083L134r2k689J192
2258e59K003j200j295J201J399j863q43K284j53k384J069K020j889j491K183J061
2274A543l024K87L320j730k745L041J315l459R4L067q53k832J542K161j955j225
2290a453K380J47k241Q47J441r53j173R24J038j372r35K447o6k471R06K424k050
2307a60j624K572J183l061l32L360j186l030K424J765l109l64K954r10k107J360
2323b65J829j834j233K477K06k482P88K083j481j197J261J156j638q77K213J46
$$ y = [-1383, 1638, 544, -2091, 224, 2251, -818, -1435, 1566, 1006, -1551, -309, 1727, 73, -1696, 242, 1805, -721, -1418, 1380, 989, -1574, -472, 1826, 45, -1724, 384, 1745, -1287, -1293, 1928, 292, -2086, 833, 1954, -1197, -1122, 1949, 782, -2178, -109, 2341, -1021, -2104, 1030, 938, -1751, -559, 1444, 244, -1051, 150, 1549, -314, -1157, 1127, 974, -1410, -341, 1679, -210, -1701, 482, 1543, -1481, -1194, 2126, 396, -2349, 692, 2007, -1452, -1358, 1709, 856, -1976, -434, 1727, -228, -1453, 927, 1074, -1167, -320, 1121, 168, -1005, -81, 957, -415, -1350, 1097, 1031, -1440, -534, 1890, -160, -1784, 788, 1971, -1090, -1422, 1938, 752, -2278, 146, 1911, -1198, -1562, 1392, 482, -1625, -265, 1564, -270, -1503, 974, 1180, -1302, -514, 1569, 88, -1109, 152, 1308, -330, -1207, 1006, 1152]
2339A152k544P77K330j822j763K443R48k768k37K890n76k827K061J948k692l98
2355a078K700p98k274J251J590j809j178K173M79k741R07K511j499j837J839J428
2371A664k160q74K665J85k879O94K591j718j877K347Q57k637O1K479q56k146J605
2388AJ701k692l50K780r42k204J600J836j880j426K380R91k918J71K911j349k407
2405a797J777J468k088r83K385M64l027Q70K732k026j502K723L02k589N90K570
2421A869j565k043K130J293k724o67L283p78k576J567J846j814j551K242J041
2436A553k655j20K821j087k284J983J349k183o53K479O7k756J009K342k080j696
2452a911K751N45l093N54K831j336k259K085J881k816q09L291l91l196J672K080
$$ y = [1152, -1392, -615, 1715, -107, -1870, 573, 1521, -1247, -1484, 1406, 830, -1997, 64, 2012, -680, -1078, 1622, 824, -1450, -199, 1391, -418, -1596, 577, 1056, -1685, -778, 1733, 234, -1603, 236, 1664, -496, -1370, 1295, 1480, -1399, -705, 1886, 168, -1709, 638, 1495, -1142, -1081, 1398, 542, -1604, 1, 1702, -990, -1340, 1440, 498, -1706, -106, 1730, -150, -1576, 804, 1795, -1123, -952, 1959, 610, -1797, -20, 1448, -640, -1623, 762, 1226, -1801, -931, 1801, -225, -1727, 996, 1298, -1291, -701, 1869, 304, -1739, 391, 1684, -1040, -1707, 1576, 798, -1778, -211, 1635, -179, -1730, 512, 1553, -1102, -1222, 1599, 512, -1772, 211, 1560, -623, -1276, 1203, 1270, -1486, -477, 1865, -215, -1911, 840, 1385, -1708, -1154, 1677, 341, -1918, 167, 2048, -768, -1577, 1714, 1323, -1873, -201, 1879]
2468A879k138j364K268Q67k950J37K841j118k268K307J268k766n9K485o08k587
2484a806J288K543k563j632L466L59l327P61L039j890k237K143J687k885o60L099
2500A385l99k740J420K100k314q69K528J66k483M68K741j543k525K647J391l641
2516a668J08L294q42l022J660K536k344j977L193P71l507P03L206j829k066K274
2532D90J195k814l70L333j020l035K175K237k853j154L270l16k840O48L078j953
2548G1k475K961J523l547R8L432j078l070K122K024k540j422L265J8l370J086
2564i02K778k148j768K835R17l049r5L192r48k900K178K288l199j102L281Jl444
2581b085J108L051j764k746L058J425l487k54L818j455k839K135K111k968j153
$$ y = [1879, -259, -1623, 645, 1512, -1438, -1301, 1540, 422, -1846, 461, 1729, -1037, -1096, 1389, 781, -1806, -518, 2025, -538, -2170, 1296, 1655, -1672, -911, 2128, 238, -1999, 144, 1831, -1054, -1714, 1385, 986, -1754, -334, 1766, -548, -1417, 1111, 1277, -1206, -738, 2003, 460, -2065, 582, 1973, -1668, -1560, 1734, 892, -2130, -470, 2066, -278, -2255, 938, 1709, -1798, -1095, 2111, 282, -1784, 490, 1685, -1129, -1499, 1834, 814, -2221, -46, 2191, -662, -1816, 1454, 1138, -1702, -1054, 2024, 71, -2404, 557, 2080, -1467, -1369, 2063, 985, -2085, 37, 2061, -479, -1901, 1364, 1382, -1988, -902, 1876, -272, -2040, 795, 1712, -1337, -1432, 1760, 812, -2088, 90, 2378, -821, -1923, 1358, 1359, -2085, -977, 2074, 310, -2436, 622, 2047, -1440, -1694, 2124, 669, -2170, -35, 2076, -892, -2045]
2596b045L482J21l574J451L226k882k006L406Q67l938M91L648j768l021K530K326
2612B314l299j194L972m15l505J598K824k223k154L000Q79l513M27L496j680l042
2628b515K793J866l343n82L528n18l501J749L027k831k102L405Q04l487N19L108
2644A920j173k907K305K168l187j124L785m89l475J532K831k713j914L272J124
2659A955m068O75M177k113l364L552J637l837m92M097q23m037K254K925l164j943
2675b569M009M65l882Q71L244k005k377K804J533l413l92L638r51l359K138K484
2691B238k706j482L354N03l963P37L721k003l146L098K039l993l59L962r37l561
2707b498K301K710k888j827M052m6l860J327L172k753k071L336J212l838j84M058
$$ y = [-2045, 1437, 1558, -2016, -565, 2661, -221, -2227, 1179, 2046, -1892, -1401, 2247, 479, -2542, -12, 2314, -985, -2179, 1793, 1378, -2127, -529, 2295, 72, -2082, 918, 1797, -1716, -1289, 2207, 527, -2515, 278, 2144, -1199, -1781, 1747, 1229, -2272, -523, 2504, -327, -2429, 976, 1780, -1707, -1188, 1920, 747, -2160, 145, 2313, -874, -1998, 1787, 1298, -2177, -645, 2186, -527, -2441, 831, 1955, -2113, -1438, 2739, 626, -2738, 814, 2451, -1386, -1878, 2219, 1396, -2641, -387, 2538, -626, -2569, 1440, 1905, -1977, -1106, 2138, 133, -2244, 560, 2093, -1320, -1712, 1926, 975, -2384, -246, 2238, -468, -1950, 1404, 1907, -2056, -1319, 2402, 399, -2747, 351, 2390, -1603, -1962, 2000, 1063, -2498, -197, 2513, -375, -2202, 1850, 1804, -2056, -729, 2443, -310, -2381, 955, 2167, -1671, -1855, 2203]
2723B203j293l537K536K781l633j185L520L50l765Q65L660k288k839L368J430
2738B173l942K38L710j513l109K635K028l329j154M302n66m014J961L093k840
2753c27k027L712P40l564J33L590j426l339K636K217l453j021L675k73l463J423
2769g67L178k551k423L687J169m137O04L835k152k854K802K035l632p55L926m91
2785A474m154K164L192l055k057L697N80l495K63L482j616k981K601K357l702
2800a250o17L927p77l662K046K964l054j925L717N49m323R64L963k563k687L378
2816F50J560l628k67L902j009l360J781K931l237j449L622j8l424Q72L173j873
2832B26k508K861J650l770k62M147j453l446K501K705l335j511L778L65m116J162
$$ y = [2203, 910, -2627, -91, 2690, -943, -2128, 1392, 1742, -2023, -1158, 2502, 214, -2625, 743, 2173, -1769, -1531, 2179, 666, -2443, 192, 2220, -1109, -2263, 2039, 1473, -2541, -580, 2513, -327, -2354, 1358, 2098, -1466, -1333, 2257, 831, -2508, 128, 2345, -1108, -2129, 1546, 1273, -2190, -767, 2411, -140, -2563, 1124, 2293, -1844, -1240, 2595, 443, -2411, 391, 2426, -1206, -1961, 1965, 1474, -2680, -516, 2676, -379, -2436, 1261, 1841, -1654, -1391, 2091, 475, -2506, 95, 2452, -1250, -1867, 2060, 1283, -2379, -333, 2631, -423, -2348, 1369, 1918, -2405, -1441, 2522, -41, -2728, 650, 2210, -1418, -1685, 2217, 1208, -2152, -371, 2560, -677, -2126, 1496, 1478, -1946, -1074, 2099, 226, -2282, 579, 2229, -1541, -1803, 2344, 891, -2555, -54, 2651, -684, -2195, 1583, 1948, -2168, -1006]
2848a006L785k559k653L274J141l585K4L484j190l124K409K457l501r22L683l34
2864A383l376J408L110k396k579L325J350l826j30L928j328l533K930K082l372
2879a024j109L713j52l596J418L012k636j768L352M73l284N17L358j946k539K714
2895E03J931l643p98L896o08l682J888K949k740j956L396P62l670L70L648j657
2911E89l118K934J859l418n35L471q20l217J798K521k627j792L685L53l661J044
2927i34L090j828k656K777J835l331r30L930q33l510J926K716k673j723L230O55
2943A741l646Q23L058j725k651K904J550l710J99L441j173k926K073K405k976
2958f13j456L589K00l837J206L111k136k422K916J311l270j27L378r19l180K057
$$ y = [-1006, 2779, 220, -2433, 841, 1982, -1603, -1579, 1905, 715, -2409, 0, 2457, -1044, -1966, 1717, 1383, -1993, -585, 2525, 129, -2450, 875, 2225, -1601, -1731, 2197, 869, -2664, 266, 2348, -1024, -2133, 1580, 1428, -2168, -750, 2262, -374, -2142, 1210, 1683, -1601, -1084, 2274, 328, -2211, 503, 2434, -1209, -2007, 1889, 1281, -2401, -513, 2436, -304, -2260, 1136, 1898, -1772, -1402, 2246, 589, -2529, 405, 2264, -1154, -1689, 1782, 962, -2255, -457, 2064, -563, -2355, 1330, 1683, -1978, -934, 2156, 328, -2328, 449, 2284, -1047, -1977, 1953, 1120, -2390, -464, 2252, -421, -2144, 1086, 1741, -1905, -1082, 1976, 251, -2400, 504, 2054, -1656, -1457, 1984, 811, -2115, -42, 2363, -613, -2069, 1520, 1720, -2117, -911, 2200, 64, -2358, 558, 1869, -1401, -1528, 1850, 931, -2249, -192]
2974a92K567l245r07L337j44l323J304K869k370k240L346R01l460P7L541j404
2990F57l003K421J894k848j327L422K16l356J116L051k273k018K875J046l074
3005a201lL031j226k709K259K059l172r86L702o53l270J575K857k391j956L043
3021I59J011l566N25L340j791k775K475J833k927o99L114k91l242J730K285k263
3037b82j806L052O40l263M78L101j654k399K492J635l125l72L409r03l142J816
3053c23K326k222j789K745P62l294N34L103j625k221K295J483k649m16K932m59
3069A182l056J578K378k581j652L349L36l433Q33L110j670k310K213J896l225
3084a052n65L340p12k946J708K306k450j386K938K05k873P00K717j732k232K719
$$ y = [-192, 2375, -870, -1777, 1560, 1416, -1907, -603, 2266, -104, -2344, 1002, 1903, -1557, -1480, 2061, 657, -2346, 75, 1969, -879, -2206, 1216, 1432, -1924, -808, 2243, -30, -2048, 827, 1873, -1201, -1204, 1827, 601, -2108, 151, 2210, -962, -1948, 1754, 1101, -2169, -594, 2263, -128, -2084, 959, 1970, -1596, -1071, 2269, 478, -2297, 178, 2011, -916, -1615, 1499, 1208, -2034, -304, 1981, -282, -2088, 964, 1604, -1659, -1181, 1920, 266, -2133, 359, 1994, -1131, -1503, 1906, 1003, -2139, -323, 2003, -219, -2008, 737, 1499, -1795, -1261, 1842, 217, -2004, 291, 1774, -875, -1291, 1641, 1182, -1874, -296, 2082, -499, -2151, 1198, 1534, -1899, -1066, 2044, 374, -1936, 277, 2173, -1052, -1617, 1723, 1011, -1935, -227, 2079, -371, -1757, 1181, 1386, -1487, -787, 1930, 198, -2034, 685]
3100F85J031k977j42L130j188k680J968K232k528j269L064K7k794P71K480j635
3116A75j923K103J291k675m72K945r83k279J738J815k271j072K852m7k639O74
3132g68K841k077k062K555J313l091O8L029j145k517J696K266k542j059K727r5
3148A139k809J190K107j821j613K274R98k506O3K617j100k488K284J536k651p45
3164a525K829k22k943J277K328j705j953K694Q04k839L95K480j063k151J699J451
3180A556k012q28K375m1k737J380J898j899j257K323N64k420J78K448r20k256
3196a648J756J627k317q27K649j26k615R84K154j657j479K226P13k735M41K318
3212A464j342j860J946J272k447j14K547o43k510J619J794k056j300K573K85k435
$$ y = [685, 1716, -1261, -1403, 1727, 539, -2141, -173, 2059, -469, -1738, 1326, 1353, -1441, -670, 1810, 175, -1748, 355, 1646, -1029, -1501, 1444, 461, -1818, -80, 1735, -536, -1608, 1244, 1197, -1442, -768, 2073, -4, -2066, 489, 1802, -1289, -1221, 1808, 663, -1854, -158, 2108, -434, -1493, 1234, 1139, -1670, -480, 1627, -194, -1807, 467, 1465, -1041, -978, 1639, 539, -1949, 335, 1871, -780, -1525, 1304, 1082, -1861, -584, 1744, 39, -1914, 780, 1584, -1255, -860, 1620, 557, -1594, 105, 1556, -456, -1284, 1091, 1050, -1687, -307, 1591, -308, -1565, 758, 1322, -1098, -920, 1528, 608, -1648, 108, 1735, -582, -1409, 1240, 1114, -1501, -517, 1637, -20, -1499, 727, 1440, -1295, -854, 1464, 122, -1738, 208, 1480, -967, -1081, 1466, 823, -1687, -68, 1726, -330, -1630, 943, 1228, -1207]
3228a207M93K122j165k157K167J247k393k82K388m83k092J274J582j810j083K175
3244G76M40k688O67K454j601j591K204O91k284j01K152n04k193J176J906j859
3260c55j148K409J17k237N25K231j308j520J668R05k066j88K305o61k209J541
3276IJ310j988o46K096K74k358O78K221j664j439K199O65k170n5K156p44j936
3293a392J268J669j928r95K441l17k119J151J531j421j258J838O57k106N7K102
3309A178p80j759J459J474k052m99K114j32k217N49K085j455j275J743O66k113
3325a014K49J859q40j709J513J149j725n01K229l22k291J107J577j584r74J848
3341E71N20k021J16K052q70j846J636J105j772o28J851L8j851N76J948j435j348
$$ y = [-1207, -714, 1408, 243, -1914, 253, 1500, -893, -1175, 1213, 730, -1362, -88, 1494, -316, -1399, 776, 1216, -1472, -805, 1649, 48, -1543, 661, 1352, -932, -1033, 1119, 615, -1578, -402, 1504, -355, -1503, 906, 1023, -1214, -689, 1542, 234, -1286, 382, 1287, -779, -967, 1338, 677, -1532, 9, 1319, -669, -1315, 781, 1055, -1303, -625, 1596, -68, -1507, 692, 1357, -813, -868, 1288, 544, -1392, -124, 1545, -383, -1378, 1063, 746, -1373, -222, 1309, -112, -1370, 468, 1125, -981, -924, 1178, 398, -1361, 98, 1572, -480, -979, 1135, 1003, -1214, -665, 1420, -35, -1310, 433, 1099, -1014, -765, 1094, 254, -1455, 58, 1207, -518, -1019, 1210, 888, -1403, -296, 1281, -303, -1277, 571, 1091, -930, -814, 1238, 368, -1478, 158, 1263, -509, -1137, 714, 752, -1099, -523, 1425, -10, -1358]
3358a358K213K09j950L37J878j147j679J670J073j977l26K038o12j834J264J551
3374A350j588q58J747L39j835L20J752q68j564J451P78j629l67J744j78j604O76
3391c34J479j376j188K143J64k027N77J758j193j128J590P53k046p8K099n76j804
3408a187J196J096j501q35J791l5j437L27J370o97j179J447O96j640j02J771n28
3425E53j527Q27J199j227j004J889K19k074P06J478r62j335J417Q74j588k63J684
3442H66m66j557J129J161j617l66J673k87j477O56J378j300q22J268P91j628j66
3459g64J670p31j356J030J188j215p69J486K39j771N92J423j114r31J415N65j399
3476d42k52J642o23j458J200J056j576l69J642k38j418O15J251j043r68J215P28
$$ y = [-1358, 855, 1064, -886, -549, 1329, 182, -1497, 173, 1246, -731, -1057, 981, 369, -1465, -201, 1350, -238, -1096, 651, 990, -845, -525, 1227, 359, -1205, 246, 1024, -605, -972, 772, 594, -1010, -334, 1145, -231, -1419, 724, 888, -1139, -562, 1196, 3, -1125, 465, 1218, -828, -906, 1193, 617, -1187, 9, 1105, -396, -1231, 560, 525, -912, -585, 785, 88, -1091, 356, 1052, -588, -690, 1081, 553, -974, -147, 1052, -175, -1179, 710, 929, -1145, -439, 1039, 77, -1258, 159, 1033, -555, -818, 866, 400, -1157, -28, 1133, -484, -850, 823, 536, -941, -285, 1093, -207, -1029, 239, 1030, -598, -764, 906, 175, -1181, -151, 1037, -178, -947, 539, 778, -993, -401, 1022, -92, -1023, 392, 957, -442, -694, 948, 325, -1133, 67, 1123, -453, -822, 820, 582, -836, -221, 1030, -13, -981, 234, 962]
3493I62j492l61J677l50j382R13J115j409o49J605P1j549L54J449r80j047J538
3510D65K29j305J2J651o27j353J133Q83j443l27J370j69j398N57J081p06j003
3527i50J226N26j329j02J604p09j208R60Q28j187m35J219K25j548M69J431j134
3544a14r71J514L84j595K67J266o04j036Q32Q73j020o65J464Rj213K47J177r39
3562a24n89J170J48j166o1J461n65j230J036P05j238k75J393j85j245N94J116
3579I45j007p76J176L65j310L6J191l37j147R14N64j106j48J211m2j192M46J121
3597I04j101n09J105J32j076L7J247n92r40R96O72j279k23J234k10j045L75Q05
3615E32m82q73J086M13j301K67J260p03q21Q05O20j206j43J136q2j372O20R52
$$ y = [962, -530, -891, 786, 436, -946, -33, 1082, -327, -976, 629, 700, -849, -495, 954, -26, -1073, 465, 694, -611, -599, 1052, 425, -928, 205, 1088, -355, -682, 688, 519, -879, -322, 759, 53, -950, 276, 802, -527, -629, 975, 266, -942, 18, 846, -341, -776, 443, 668, -880, -411, 1020, -114, -1085, 429, 813, -782, -515, 751, 147, -889, -57, 816, -204, -869, 595, 604, -609, -362, 815, -124, -713, 457, 605, -561, -622, 839, 274, -956, 80, 785, -453, -728, 665, 480, -765, -171, 945, -62, -838, 338, 703, -607, -571, 620, 283, -864, 50, 614, -492, -640, 571, 529, -663, -217, 904, -197, -706, 399, 531, -545, -508, 739, 147, -793, 203, 875, -404, -627, 607, 397, -648, -273, 532, 50, -823, 263, 676, -625, -358, 902, 199, -622, 183, 803, -403, -546, 590, 508, -864, -244, 708]
3633G08r37n68J150J15r90Q4J079m11r61Q37N93r30k91J051j82r92N82Q95p41
3652I1n98Q63J64j068L28J022o43q94P50M94p15l75J007J10j215L88J055q15o76
3671g27J027L34j075K9R72l35r41N43Q91j083j56J008k84p60L58Q91p49o74J064
3690C33L51j223K83J104o80p90P75L34p91j22J067j64j001K41J042q30n93Q97
3708B33J30r25J93R93n65n95O47N51r39j70J081m57p96N79N57o28l81Q56K24j033
3728d45l4R09k89q58N78Q30r20l00J031j10q91M51P21q38n84J176J72j125R1Q05
3748C70l45o64O35O00r11l93J184k2j137N02J066q23p54J146K43j188OJ167n61
3767A21p69P32M80r26k29R94k21p84M29Q10p42l77Q98J86j102L62P59m83q19Q90
$$ y = [708, -229, -797, 353, 468, -522, -438, 641, 230, -731, 106, 699, -231, -522, 529, 347, -645, -63, 832, 91, -507, 356, 520, -548, -220, 802, 159, -735, 15, 509, -206, -581, 426, 536, -679, -291, 764, -51, -727, 300, 634, -441, -412, 560, 225, -716, -173, 718, -365, -521, 487, 203, -557, -199, 692, -57, -731, 333, 684, -539, -256, 848, 168, -622, 153, 487, -304, -426, 641, 477, -524, -283, 759, -71, -664, 233, 363, -562, -369, 624, 59, -536, 111, 662, -277, -447, 634, 177, -619, -40, 517, -111, -492, 364, 588, -445, -479, 430, 141, -717, -139, 691, -229, -529, 502, 392, -499, -48, 673, -165, -749, 427, 599, -526, -435, 370, 25, -639, -4, 596, -315, -708, 476, 454, -683, -181, 885, 62, -692, 454, 697, -491, -485, 682, 121, -648, 84, 564, -362, -591, 403, 182, -602, -173, 637, -105, -482, 416, 602, -500, -138, 621, 138, -681, 209]
3787B09L14r18l67J270j40j153O27P40p56k98P52K45j038K06J029n67q35Q80L78
3806E78j119J92Q30k04q49O42M98p10o23J078K52j113O7J088n10n31M57O43q65
3825a99l40Q98M5q95N05M60p70k08R15j13j011M06Q90n65q08R89L79j024j32J365
3845G87m23r60M57N98o11m71Q38K87q98M1J009m65o67N76N68r03k61Q79Q1j057
3865e95N03O39q11l26Q05L53r61J17Q26m10p39O52N37q25l88J157k79q16L71P09
3885E19q16j88P70O9p97O5Q15k47n66P15J07o88j86J028j65j003N94R19j066n44
3905f65J051O9j005K58Q28m21o64N42O29q68k23R17R5j029M70N87q73k11P01K24
3925D12j029K35Q76m58p96R92M04j078l6J052k31j132O18Q44q46m76R06L22j054
$$ y = [209, 523, -395, -762, 508, 368, -785, -158, 582, -174, -472, 280, 525, -513, -307, 722, 155, -680, 200, 578, -541, -349, 481, 277, -572, 70, 568, -142, -765, 313, 565, -548, -481, 607, 97, -434, 23, 666, -199, -539, 359, 404, -491, 14, 474, -296, -504, 411, 298, -713, -307, 583, 18, -790, 199, 578, -446, -578, 787, 364, -596, -139, 459, -152, -623, 215, 502, -396, -355, 654, 189, -478, 98, 666, -237, -498, 381, 462, -595, -92, 547, -264, -590, 215, 568, -393, -276, 550, 140, -599, 53, 590, -235, -623, 534, 255, -561, -190, 519, -297, -485, 285, 354, -443, -378, 437, 190, -376, 339, 446, -242, -428, 600, 435, -568, 26, 945, -121, -665, 386, 455, -550, -292, 536, 115, -549, -7, 622, -246, -469, 448, 543, -486, -16, 571, -302, -513, 188, 412, -617, -382, 494, 36, -760, 232, 636, -442, -478, 574, 343, -789, -171, 673, -173, -649, 257, 579, -475]
3944d75J65R85o82n63N48P05q54l07R11l16q44P50M86o27m30O35L89r54J11J001
3964F34m26r20O28O28r62p9P50M8q66K87R65q24l60P74K22r31K97O12n61l46M03
3985b7N06q46o3R63k11r17O81N54o97k69P08M3p88J14O79m79n83Q83K50q97j19
4006e15R38l07m88M16N22q09k36P66J66j083K06J024p23n18O92M32q70j03P41
4025B51%p71N96P23q63n35J010l4q32L67N65o58m58P15N27r38j51R75k73q51O54
4046A9O11q24m8O43j14p45K66P81o85o31J035K92r49j52R14l79o20O01O97r71
4066b59k60Q66n6p33M23O07o33n07P25L68q60n7O98l52o20O46O45q83l29P35R0
4087B54p13K99P04o05l61M76N77q23k43J080n22n64M71O04q33k42Q10Q2j171N70
$$ y = [-475, -310, 675, -7, -570, -22, 683, -171, -478, 433, 117, -727, 23, 509, -118, -548, 87, 476, -478, -367, 634, 208, -712, -84, 544, -418, -497, 253, 301, -565, -278, 687, -137, -497, 277, 499, -432, -135, 477, -84, -430, -27, 479, -367, -430, 533, 322, -595, 86, 640, -57, -326, 382, 425, -363, -249, 430, -49, -632, 251, 501, -396, -515, 423, 116, -372, 44, 566, -243, -479, 287, 453, -630, -424, 600, -123, -641, 51, 483, -387, -490, 251, 251, -520, 76, 799, -64, -599, 411, 377, -455, -88, 477, -181, -639, 76, 603, -335, -486, 489, 216, -635, 19, 630, -194, -242, 401, 287, -458, -192, 589, -96, -727, 308, 600, -349, -501, 413, 34, -586, 15, 712, -259, -519, 347, 291, -442, -19, 588, -45, -552, 173, 541, -319, -376, 322, -30, -650, -4, 641, -242, -571, 164, 254, -459, -160, 544, -61, -422, 54, 631, -192, -435, 645, 123, -441, 30, 634, -199, -441, 369, 451, -720, -150]
4107a50P68o99n47Q69K98j009J94J060m75r54P27N06r64p3Q86rr53N05N92p07
4127a35l07P17K0q39K84O88l33n93N57N18q42k00J015k95p78M94O16o46n07Q31
4147B65J18p12O1O15l26o24O30M33o06j41O92k82p33N02O61p53l40R32L3r47K51
4168b71Q38k90r46O62M91q18j00P38o4q89P01N41p75k76Q07J20q74J03Q21l82
4188A37o63O61L66p95j75Q19k01n01L22N07n46l38Q33Mq85K50P17l90o71N11N76
4209E38q40J32P54m24q24N86N41n99l67P75j21n31R9R40l82q51O01M60p27j54
4229c94Q21j06q07N22N30q95k26Q72j4o77L57N57o77l44M54N13n60k67Q57l06
4249B10q37P12M23p98l05R13L9o65P6N76m21m08P78J79o93j74R04l53n58M10M93
$$ y = [-150, 618, -81, -628, 241, 539, -470, -276, 784, 309, -645, 82, 588, -376, -449, 437, 428, -525, -20, 572, -135, -442, 275, 295, -544, -260, 428, 95, -498, 59, 577, -265, -465, 550, 255, -523, -29, 587, -59, -566, 265, 383, -329, -268, 347, 21, -603, 27, 460, -146, -287, 405, 123, -610, -108, 553, -200, -540, 392, 425, -522, -271, 567, 277, -669, -7, 484, -334, -434, 304, 240, -649, 52, 593, -182, -458, 349, 469, -405, -302, 519, 137, -526, 135, 501, -294, -469, 350, 149, -352, -30, 477, -69, -407, 426, 430, -455, -205, 512, 122, -549, -38, 538, -302, -170, 584, 160, -664, -78, 463, -136, -503, 272, 151, -380, -281, 659, 277, -574, 27, 487, -240, -394, 427, 321, -486, 36, 566, -329, -555, 317, 303, -374, -17, 540, -137, -481, -27, 486, -74, -341, 516, 210, -627, 85, 508, -290, -595, 318, 357, -308, -232, 344, -77, -485, 293, 472, -221, -395, 509, 156, -402, 8, 501]
4270E01p06k54Q40n8o82K62O42n59m40O53J93o84q4P49k75n97M57M80n47l24Q81
4291D48l2q78K04P83m86m17M72K14o43RQ33k85p97P25K68p18j24O93l8q26M85
4312a10P73o40o75J000R4o88L2O91l02q21P43M49p54l34Q21R4p62L78M27l53m50
4333c87N06L58q84j7R99m81n76N32L45n39k65O24l4p71M75O93n91n16N14M16p51
4354c50K1Q20m87n45O12L68o63l03Q78j14o18K62O67n51n11P52J52q47M4J131
4374G18n93n99N96K93n69l81R57p8o47K71N33o08m98Q19J63p68J11N61k45m96
4394d60M31L73o72r8O07J44o60L20O11p26n72P26M41q38J47N91j29o53M29N23
4414E35n77k62P50q0o88L82K70l13n32O92J72p70L57O08n66m91O29L61o64j79
$$ y = [501, -205, -459, 381, 323, -359, -97, 545, -14, -454, 199, 392, -292, -376, 373, 98, -499, -42, 438, -109, -433, 448, 416, -462, -258, 525, 39, -378, 94, 308, -335, -326, 507, 222, -575, 150, 418, -300, -424, 269, 231, -595, -110, 663, 23, -652, 348, 442, -246, -214, 477, 175, -646, 97, 546, -208, -542, 279, 373, -389, -11, 416, 63, -387, 119, 477, -407, -424, 575, 94, -482, 50, 395, -144, -409, 215, 181, -590, -115, 578, -13, -529, -15, 401, -350, -329, 491, 4, -541, 71, 439, -224, -527, 351, 237, -381, -119, 548, -3, -514, 238, 390, -457, -413, 718, 125, -474, 122, 415, -154, -535, 422, 344, -303, -32, 501, -107, -605, 214, 377, -391, -280, 281, 36, -460, -29, 344, -328, -426, 181, 325, -335, -15, 596, -130, -702, 24, 465, -373, -226, 365, 236, -417, 12, 535, -42, -304, 446, 366, -322, 60, 330, 17, -515, 177, 349, -421, -64, 544, -22, -513, 116, 477, -187, -366]
4434c66N70R2p70M58M80n18m34O52J11q00K95O40k76o07N18L98o74k26P42j23
4454A62o91N24N13o06l31O39K18q28J28P96m62p37Q58J27o07j33P68j46p26L87
4474a47O16n41k99N95J31p99K23N12k29n83P02J68o14J0O54m21n01O18L25o99
4494b79j1N90j82n68L94N79o40k91M23L14n13J7N58l45m08K20O79p65k89Q00k7
4515B56p75J93Q82o72k79N53L59p81j6P12l12o82N37L22m03k66O64J6n89K29N87
4536E35m92l16P53J9p40J1N77l81k87K96M62o16k57P57q8n79K80N20n05l67O04
4557A86J70p28Q6P03k96n91M32L81p48J37M57q8l43N5O46m60l73O92o7p32L01
4578a80N88r0p45M40L79n04l31Q88k86n09J70M93l67k83N55P9m25j30N61j41n69
$$ y = [-366, 204, 296, -474, -16, 464, -54, -488, 164, 275, -525, -230, 410, 134, -473, 45, 443, -231, -457, 285, 162, -529, -5, 508, -98, -429, 210, 428, -400, -272, 524, 62, -675, 183, 310, -297, -430, 338, 192, -534, -147, 469, -72, -371, 224, 355, -444, -221, 291, 62, -521, 181, 349, -265, -255, 399, -22, -523, 95, 420, -279, -290, 300, 118, -450, -56, 523, -117, -408, 15, 329, -184, -167, 391, 46, -362, -142, 537, -228, -517, 283, 256, -519, -326, 556, -116, -395, 158, 517, -264, -280, 432, 120, -562, -25, 297, -106, -372, 292, 308, -281, -52, 535, 43, -273, 480, 499, -241, -230, 347, -34, -321, -25, 437, -179, -436, 321, 233, -346, -66, 454, -51, -418, 186, 356, -372, -286, 417, 121, -470, -38, 343, -405, -268, 189, 101, -242, -187, 459, -1, -374, 318, 251, -481, -180, 408, 318, -427, 13, 392, -112, -443, 445, 159, -350, -180, 313, -54, -337, 218, 297, -128, -258, 303, 162, -407]
4599d07N81K65p77j6P25k12m28J93M73m22j93L54J24n57K6O28m95l55M34N60o96
4620a95j90O64j9o85M60K23m02j38P61k23n69J37N25l67m75O53J66o51j11O57
4640B21j09n56L18N65n45l13O91K28p90J22O87n38m05N07K54o05l5P26j51p75
4660e03N81L42m07m03P47j5p78L87M52l25n41N68K98p03K0O47k93m93M39M28o43
4681a95r7N93j55l20L3M10m65p3L93L02n57m6L64j38l90K98M68n13k77M55J62
4702B52o46J94N52k79m45L71M48p09m6O94k68n80M80L81l82k02L61K4l84J41L92
4723C49l33m29M48M63p76J59N69k22p57M32M32n61j26M22J66n43L32K41k39k47
4743b20L50J7l90O2M81j47m85L72L39o07K5M99m7m47K1N01k61n53N96J56m77o9
$$ y = [-407, 174, 439, -338, -354, 371, 159, -269, -76, 397, -25, -218, 136, 260, -297, -271, 357, -138, -493, -59, 501, -195, -385, 279, 260, -425, 35, 258, -144, -282, 479, 256, -313, -176, 349, -18, -493, 160, 326, -325, -436, 221, 112, -444, -126, 439, -106, -419, 272, 500, -290, -168, 519, -19, -424, 83, 337, -268, -303, 423, 272, -503, 78, 420, 13, -390, 357, 342, -436, -49, 403, 78, -463, 105, 403, -300, -280, 367, 74, -419, 20, 448, -195, -292, 301, 146, -174, -141, 269, -196, -269, 124, 426, -131, -177, 187, 49, -341, -43, 425, -88, -365, 90, 252, -394, -200, 352, 73, -372, -1, 447, -262, -308, 386, 118, -462, 18, 399, 17, -185, 176, 200, -184, -43, 349, 16, -413, 35, 498, -278, -119, 450, 228, -529, -97, 335, -226, -352, 70, 236, -307, 25, 266, 27, -220, 130, 147, -243, -181, 300, 153, -332, 40, 379, -228, -203, 296, 249, -198, -177, 324, 63, -490, 106, 262, -215, -284]
4765b84O97k09m60M16J72m61j25K37K72m34j35N88m18j31M20K49n77l3N66l12
4785C8l07L53L11m14l11M80Km35K54L50k27l51K66J82l32nN36l36l11M57P3m23
4807a50j93O31j20m03J23L98n12r7L76L27o28P0M64l09l79L25M89p41N5M61om80
4829b99K94K93k29l85M89Q3m16j96N95l28j34L08K86n38k09O99l6n39J41M09l43
4850e5j34M14j15m77KP82k64m57K22L23l51j04N00j28l74J57L75m28k53M48J51
4871B34o03J5P49j65m39L03J78k13m49N48om63K64K28k74j39K06K57l76K7K19
4892A01j53k23M17O4l53j86L79o2k82K41L62k75l48N20J9n00O9M79k48l13K04
4913h8N12l76k89N82k07l77K13L65l19l94N31J81o49K45K43k26l49M57K12m12
$$ y = [-284, 413, 204, -256, 160, 332, -129, -254, -17, 255, -179, -314, 274, -144, -275, 145, 394, -183, -216, 350, 38, -269, 84, 395, -19, -330, 150, 152, -283, -29, 321, 94, -257, 9, 191, -141, -146, 390, 54, -257, 200, 273, -150, -343, 288, 168, -235, -112, 286, -226, -323, 53, 380, -248, -178, 286, -23, -402, -77, 412, -329, -274, 187, 181, -299, -5, 288, 59, -326, 163, 246, -170, -366, 229, -99, -233, 75, 361, -177, -386, 313, 277, -262, -121, 288, -55, -189, 225, 110, -367, -365, 417, 153, -304, -82, 241, -110, -214, 286, 158, -216, -59, 316, -112, -365, 83, 234, -369, -354, 395, 230, -209, 94, 272, 59, -390, 158, 152, -311, -47, 181, -93, -232, -26, 231, -145, -118, 101, -52, -275, 142, 206, -147, -333, 46, -16, -298, -57, 305, 30, -318, 202, 221, -279, -210, 269, 21, -292, -88, 424, 48, -241, 341, 134, -243, -30, 335, 16, -378, 153, 334, -315, -70, 173, -53, -402, 55, 267, -145]
4933a45P8L92j07n61K62K49j02l06M40On69K90L45l41j33J46J44l65J98M08k24
4954A05l57K18L08k65l48O13j4n65J69K89n8l83M35M1k23j25L69M7n37J87M35
4975C41m33l5L02K4l45P7K97k49k81M46J97n86P9M24j23l44J74K56k83k54N29
4996B13j72l45J79K58j73j38K32K43m46kL45q7l89K28K97l66m8M44j56l10J53
5017d0K48k03m40M64L41n38O7K95r8k31P2K53k09k04M57Qm43nM38j30l34K84M5
5040I7l18J22M44%o60L93K68m06j52J86K51l44L8K74j55l21K70J95m36j2M14j26
5062B2l72K62L08k98k1J87rk69J72K04k56l05O06K19n93pL19m7m44K18N01l86
5084A1l76N79j77k94J50L40k47j55J65K79m17l1K87o4k90L29K08m00j39M55r9
$$ y = [-145, -67, 325, 218, -343, -81, 168, 66, -240, 200, 206, -363, -73, 272, -69, -202, -56, 88, -277, -79, 329, 105, -252, -34, 274, 9, -339, 274, 260, -305, -136, 153, 95, -288, 147, 188, -35, -160, 209, 256, -281, -94, 341, -92, -127, 175, 199, -146, -69, 228, -21, -302, 144, 341, -245, -166, 258, 135, -209, -35, 221, -62, -316, 213, 41, -304, -125, 133, -40, -178, 54, 297, -149, -151, 194, 107, -282, -54, 243, -123, -171, 273, 117, -193, -40, 208, 5, -435, 29, 370, -168, -101, 194, 96, -135, -63, 190, -19, -223, 234, 242, -201, -206, 232, 102, -232, 52, 97, -221, -99, 345, 345, -315, 78, 346, -60, -212, -26, 225, -119, -81, 193, 38, -283, -13, 182, -254, -266, 148, 22, -350, -88, 220, -78, -99, 88, 79, -190, -18, 186, -70, -375, 231, 450, -143, -150, 169, 122, -322, -104, 397, 11, -365, 214, 37, -257, -107, 233, -14, -169, -4, 275, -142, -173, 114, 50, -240, 89, 297, -103, -242, 213, 114]
5105A14l97L33J40k89k2M05m8k63q3M98k51m06K51K61l40k76N12j70k31J15L33
5126A86j04k98L51J60l28j4K65k76j33J62K28l20j03L16k9l06J89L67l67j37K56
5147F5J16m46K01L79l43k07K56L35m06k44L85Ql41J11L83l48j24L56K45m82j1
5168a12K82p7k72K05J86m43J70K64O0m73K91L13m32r7K25R7l10j18M11o1m13K61
5190d3K92m62j44M55J40n17J37M42k86k13J42L78m19k30N22o6l50J32J27j17o1
5211a41L68j30l27J3N20m80mK26K47m20m6L53q1k60%L01j80k28N05j18l14K7J55
5234a4j3j10L43n0l26N0J82M5l01K51J08j39j87L99Nm99K37L73l13k02M29O5n07
5257a74q2M38j46l69K93L12m30J20J21Q5l74K07K74m22j72L29J33k87KL27k6l51
$$ y = [114, -283, 50, 190, -99, -121, 284, 236, -27, -110, 388, 137, -269, -18, 243, -97, -373, 139, -31, -262, -147, 186, 82, -216, 135, 295, -33, -47, 218, -58, -191, -29, 199, -121, -224, 92, 63, -243, -54, 313, -54, -191, 65, 181, -265, -64, 315, -28, -235, 21, 356, -50, -294, 91, 99, -242, -131, 252, -96, -220, 136, 381, -101, -112, 170, 93, -179, 26, 212, -231, -61, 203, 263, -210, 81, 394, -38, -135, 90, 187, -123, -241, 170, 109, -304, -43, 249, -213, -357, 98, 238, -279, -142, 300, 14, -199, -57, 321, -98, -328, 194, 128, -222, -90, 37, -80, -141, 227, 97, -230, -217, 303, -177, -181, 45, 292, -128, -174, 179, 98, -162, -162, 139, -41, -269, 236, 118, -196, -169, -14, -27, -137, 206, 156, -170, -120, 62, 107, -194, 57, 165, 26, -161, 238, 243, -256, -19, 354, 41, -161, 268, 333, -174, -256, 182, 36, -333, -40, 272, -158, -38, 83, 168, -206, 1, 275, -147, -319, 10, 143, -144, -142, 185, 159, -192]
5279a92lM73n76K03J07j14q6K51k4r8l86O43j0l19N6K56k21m3J26J11j15j76M16
5302B79k64j56j17M36k16j82K29K65n44K38K01o5k55J87O1j24q5K63j10k59J55
5323f3J77l10oM02Q1m76O9K51j37k20M12N3m04J17K08ml90K13L27m35m0K70P0
5346A65l23J16K35j83k40K88J68l82J44J90nm26K64L15k57q4J61k5m80J84L96
5367B21l57j22K78J76j82j06L29j57l62K81Q3j13p0K83K5m48J71K98l03r3K59
5388I1J33j62j99L27j88j86K62k5j61k09M14J6k40J14J92k19j07K07J26k87j44
5409b45L56K0m17K84K57l46j33L11R1n24J66M44k14k90K99O7k51J71Q8R6n03L86
5431A13K35n59J51J76J09l89J91K36k08m23M52P9m15J05K47j28j14Q3J64k02k4
$$ y = [-192, -195, 278, -298, -95, 12, -102, -188, 63, 39, -59, -445, 198, 188, -131, -75, 181, -40, -83, 43, 154, 39, -137, 279, 15, -141, -258, 178, -38, -220, 9, 274, -270, -32, 169, 104, -151, 36, 97, -27, -112, 151, 41, -218, -63, 114, -196, -202, 200, 281, -195, -126, 125, -12, -232, 180, 233, -171, -54, 154, 150, -240, -27, 300, -135, -175, 95, 165, -158, -42, 193, 10, -230, 58, 226, -156, -12, 178, 173, -253, 11, 326, 69, -15, 146, 121, -359, -175, 221, -136, -258, 20, 196, 14, -92, 237, 80, -282, -1, 82, -31, -101, 182, 207, -241, -70, 228, -75, -168, 91, 224, 62, -137, 190, 2, -184, 78, 53, -108, -317, 97, 113, -127, -13, 179, -40, -147, 60, 186, -101, -245, 111, 131, -286, -2, 255, -91, -224, 87, 178, -346, -180, 264, 50, -240, 59, 126, -125, 46, 134, 230, -273, 113, 348, -211, -60, 116, 225, -164, 27, 263, 55, -368, 84, 163, -252, -147, 100, -28, -142, -59, 105, -97, -121]
5452a21K31J16k26k13K62j11r5L25n1k53L8J87p9k52J72K14l18J2K84L6k49n1
5474a42L30j19k91L08J47m83L44N0j4m52M55O4l68J9M52j86l98J97K87j90l82
5495c72M19O5k01LK01O5l08P1J29m2j11J85p8l41L05O2q2R2J16%l14L7M74l15
5519F0k95K96K90n15J99J63L9l44M2K66j71l62M01N4l90K48Q9j73j85K23L63k64
5541C4j86K39K4j73J32J33l05j00L31O4l33k7K68L7l91L30K19m46J06Q1O6l04
5563b01J84P7N2l61K07K13l54J47J92j30l03L84l7k07k5J48J3k21J76K61k41k24
5585b50K66J67k74lK75k02k45K39J10j4j89L26N2m43l9M68q5m79L44o1j68rK89
5608G5k59J45J71O8l09n8N11k91m07J84K16o8j39J90J61k45k1L71l08l25K97L06
$$ y = [-121, 110, 226, 0, -213, 49, -62, -157, 168, 117, -136, -98, 89, 10, -242, -70, 144, -174, -162, 122, 158, -91, -142, 188, 69, -222, 86, 233, -250, 94, 144, 130, -322, 133, 197, -171, -152, 300, 114, -284, -87, 200, 10, -372, 47, 112, -89, -86, 115, 180, -128, -57, 72, 30, -81, 104, 26, -315, -10, 52, -30, 62, 178, 178, -136, -99, 375, 60, -235, 61, 351, -164, 35, 198, 237, -107, -65, 201, 30, -332, 69, 123, -267, -19, 70, -103, -288, -65, 298, 34, -152, 87, 111, -62, 70, 203, -102, -202, 129, 193, -140, -167, 101, 138, -253, 77, 296, -150, -44, 37, 103, -201, -17, 60, 112, -249, -42, 171, -183, -36, 156, 26, -277, 107, 70, -137, -162, -14, -1, -222, -46, 215, -26, -250, 16, 183, -91, -94, 181, -21, -266, -27, 83, 69, -120, 206, 258, -185, -224, 244, 159, -320, 24, -37, -205, -214, 75, -184, -39, 132, 200, -109, -167, 344, 53, -354, -170, 46, -22, -161, 29, 190, -55, -76, 295, -13, -338, -41, 265]
5630B65m08r7L34j48k65L18J54j45j09K32Jl06J23K47j87k49L61M6m57JM41j32
5652B0l38L94P0l06K3L41Ok87n9M06l23k6J49J54m14N9L10k49j61P1M16l76r6
5675b16M16j12l27J38L34l05p0L12p8j94n2L22j5l35L01J72l47j00M55k01j63
5696f5k90O39l21l92N92L2k92p0L89k43m0K11q8k22k11N26j15j76pK24m9l04K03
5719f9K62l75l1L87k37k28K64J8j39Q6J22K24n20P8L82k38k79L99J18l95o2L15
5741H2j49j75L21L4j84j47K44M5k63K28Q2j54j71K22Q5k58m0M46j52k04L92m8
5763B36k33m4K64n2k61N0J51k49j60M20l1n4k18L22L7l45J98J57l84J8K23M5k56
5786a66J46J92k98M5K24J5k97qL18Ll14J48J87k86KL46k75j18K4K64j00k81L03
$$ y = [265, -143, -240, 94, -54, -319, -1, 153, 8, -101, 131, 132, -174, -51, 196, 9, -240, 121, 167, -290, -289, 152, 20, -318, 76, 146, -160, -137, 204, 210, -77, -136, 270, -53, -79, 70, 224, -190, -131, 179, -70, -231, -160, 256, -120, -216, 200, 88, -239, -101, 233, -72, -142, 170, 92, -102, -154, 168, 153, -182, 119, 291, -56, -156, 299, 98, -65, -355, 284, -37, -429, 163, 195, -97, -167, 222, -21, -61, 150, 62, -160, -371, 155, 40, -136, -143, 81, 32, -272, -69, 193, -182, -213, 174, -63, -291, -27, -9, -148, -62, 60, 284, -236, -158, 224, -14, -293, 106, 224, -171, -233, 82, -67, -242, 79, 113, -71, -218, 26, 71, -192, 36, 118, -36, -207, 15, 100, -158, -198, 248, 96, -108, 284, 236, 3, -41, 223, 171, -90, -40, 111, -138, -298, 122, 91, 37, -181, 141, 178, -167, 31, 188, -196, -178, 45, 90, -166, -20, 172, -126, -81, 143, 158, -139, -147, 171, 174, -140, 8, 195, -91, -89, 257, -18, -136, -112, 152, 52, -229, 74]
5809G4n4k91K00K88j69l01K73J58l54%K64Q3l54K61J04j71l08K53J85l45J06J18
5831B0rk64L01L25n25j7K97j5l11K10K75l70j46M76j87j70oM45k81j52Q5K45k32
5854fj54L57M5l59n6K75k46j56L48Q0m79J74L09r5l30L14R9j32o5L06k62j71P9
5877a25K00j50N1J11n9k31J22L27j95k90K46or0o0L54j82l63L58J77j44j45K99
5899B05j11j68N5L03j36k67K42lj53l0J77L3k63K7L31k78k76M33l8l73J6M46l24
5922a52jJ25J92j92j32K40l8k07K38J44k62k5J72R0l95J93K07k66p7K13J22n16
5944c27K85K44j56l03K54J88k19j19J42J10l38J45K37j82k02J63K80k89R6J14
5964A23k59JO3K60l26P8P2P4k43Q1L67k74j56J67o8k9J29J90j96k46K50K46m59
$$ y = [74, 20, -271, -71, 217, 48, -253, 20, 178, -176, -176, 88, 171, -183, 78, 182, 11, -297, -44, 141, -204, -98, 20, 11, -253, 48, 373, -152, -169, 128, 113, -198, 12, 287, -83, -229, 247, 60, -110, -116, 329, 48, -104, -19, 226, -6, -160, 197, 242, -117, -173, 102, -144, -300, 48, 128, -351, -177, 132, 37, -293, 21, 120, -12, -77, 229, -33, -204, -125, 75, -75, -24, 87, 28, -203, -81, 246, 51, -239, 7, 1, -89, -149, 205, 23, -340, 18, 195, 51, -94, 205, 94, -74, -19, 284, 148, -119, 123, 120, -33, -63, 114, 147, -116, -89, 242, -36, -312, 121, 83, -290, -274, 172, -152, -153, -28, 164, -28, -160, 80, 42, -165, 73, 217, -45, -70, 102, 192, -203, -10, 197, -69, -146, 67, 189, -327, -42, 202, 46, -257, -3, 185, -34, -153, -11, 99, -239, -94, 143, -39, -241, -78, 202, -87, 9, 123, -136, -135, -72, 188, -138, -60, 12, 86, -157, -76, 291, 17, -139, 28, -40, -69, 60, 250, 54, -192, 58, 304, -155]
5987a55m3M28J3m38K2K41k61L3J79Nk28L7K67o0l26J67J93k09k7L87j32l53K36
6010b4K19j75n9J57M9k68rJ86o8j81O3K85k77l7L26q9k95J61K30N6l93J90R6l54
6034b11J80J14k02pJ59J99k95o6K09j6k23J90J99l88m3L23j4m02K85J71k38k23
6056b99L08J76l19J35%P5l11K48K08k82k05K58J21k83m5K77j05j36L9L56l52m4
6078a80L90j59k88J63K54k74j23L35lk61j07L66j11k22K82M6l02q0M74j68k49
6099b17KM61k78r5J93PLk95L31l3k98K56J08k42OK43j2l72K29J64k14k4K56J5
6123A94l18Q4K05j75k90M01rm1j40K59j95j47K16J95m21N3J14O6j59R5K30k91
6145g4KP7J68m01J88P2P4j61K64k40m2kR2O8j28M0L54l93K3R0jj97K9L98k32k66
$$ y = [-155, -198, 230, 243, -195, -173, 68, -193, -160, 19, 24, -204, -167, 100, 40, -286, -119, 74, -135, -162, 225, 93, -260, -24, 195, 20, -39, 118, 167, -101, -110, 76, 8, -173, -110, 175, -102, -139, 187, 98, -197, -36, 194, 250, -143, 47, 143, -211, -31, 83, -119, -126, 33, 232, -63, -129, 80, 64, -159, 31, 230, -158, -201, 122, 108, -294, -9, 162, -76, -299, 9, 185, -134, 1, 1, 76, -235, 13, 221, -61, -266, -8, 113, -170, -215, 62, -43, -179, -140, 216, -136, -180, 210, 51, -237, -74, 180, -94, -217, 118, 115, -146, -253, 113, 2, -220, 62, 108, -194, -274, 200, 32, -217, -215, 246, -32, -127, 66, 73, 76, -219, 112, 79, -219, 37, 145, -97, -91, 152, 140, -232, -3, 161, -53, -77, 179, 194, -124, -40, 165, -10, -300, 101, 92, 51, -89, 170, -25, -172, 44, 239, -182, -129, -15, 51, -108, -13, 217, -74, -72, 5, 173, -228, -40, 32, 106, -55, 209, -31, -73, -75, 17, 85, -43, -3, 351, -42, -19, 71, 70, -127, -98, 300, 68, -198]
6171a98K04K07l54O0K83j67j48M8J80q6k42L02O2k61p5K80j39j2J44j2r3j10K31
6194A04L9m01J85K19j03k77O8L08k99j0L84k37n0J80J2r2q9N1Q3k75L60m7j49
6217c6p7K05Mk95j1K54J3k46J85R0l5j8O8M7n02K27L21l28q0L05M5k85K83K6k2
6242A38l55K07K59m42o5M13j08k42J45J80m7j84J59Q3l73J55K14j17k12J28R1
6263B7j42L4K63o9j43O1J4j38j4K33n3j66L0K18j07l6j4O3Q3k72K75j11j82K62
6287A16Q7m46K81N1j00j52N1J97r7j48L59j05k11l4L32m0l63K64Q1j92n6J32M9
6310E6j37J7K49k56j21M35o3n66L74P8L9k35J83J79l52j70L21N4j87K11L2j94
6332e3o8J17J05l70J51L60l03l12K73J81k35M4K95j88j67P5L11k32j64L18P2k09
$$ y = [-198, 6, 213, -141, -81, 202, 35, -113, -65, 115, 29, -213, 89, 151, -110, -185, 95, -44, -56, 88, 76, -17, -127, 104, 143, -258, -73, 146, 43, -234, -166, 142, -157, -167, 217, -20, -70, 110, 122, 30, -59, -8, 75, -200, 160, 113, -36, -113, 92, 96, -199, -210, 44, 57, -189, -4, 86, 51, 33, 101, 148, -354, -127, 194, -134, -214, 91, 136, -149, 134, 160, 138, -217, -10, 249, -193, -258, 155, 47, -195, -50, 130, 83, -101, 58, 141, -232, -77, 137, 20, -192, -64, 27, -115, -81, 182, 113, -30, 31, 45, -93, -107, 126, 73, -93, -63, 155, 48, 12, -2, 61, 144, -128, 147, 36, -146, 116, 203, -243, 38, 89, -11, -163, -112, 85, -12, -160, 199, 94, -117, -151, 181, 141, -222, 42, 123, -69, -125, 7, 56, -81, -64, 185, -71, -192, 243, 180, -386, -12, 66, 105, -130, 53, 232, -120, -290, 31, 85, -102, 109, 141, -53, -121, -4, 101, -269, -118, 242, -61, -373, -100, 81, -154, -110, 185, -3, -170, -95, 216, -16, -180, 138, 210, 1]
6354Ak7J74k08j34K59M0j67m5K76j03k64K19R9p3l23K38J83l12N9K47k75m8J54
6377c0J54l79J75K54j41k03o1L70j33l14M82r7k51pK38n5l18K19L27k75n0K34
6399A39j85q3R9J93j50k72J10K03j92M5J93m8j70K95j17j75l4K27j03m8L5J58
6421A20j91j77L51J8k86L27j73L8q7J88Q3k52q5K66M3n76L54K84k99r9J67N3k49
6444a82Q0K95k19J4J43j23j80J07J52j79m1l3J78j28m2L91m8j43J8P3k25j4K77
6467A71r9j34j78L94j95j1r6K70Ml13J04J35l8k57L84k65j02L08J0k87P0L88j48
6490A15l06J33J93k16J19J47q8k52O9J62j97LK17J10l90O7L87p2l24Q3K33l73
6512a80R7J74K1k92J71O5j18j92K53Q7k80Q1J97n1j37P5K40k80k5J07J22j90M2
$$ y = [1, -26, 148, -60, -194, 65, 105, -62, -107, 169, 66, -198, 21, 120, 47, -276, -38, 145, -167, -108, 139, -136, -184, -30, 124, -255, -80, 174, 33, -170, -231, 139, 6, -308, 174, 77, -174, -181, 57, 2, -316, -97, 230, -45, -95, 139, -46, -129, -30, 163, 13, -259, -149, 54, -138, -93, 100, 52, -118, 177, 60, -115, -149, 78, -25, -73, -38, 120, -71, -248, 103, 121, -165, 162, -11, 27, -60, 128, 211, -41, -126, 140, 183, -393, -39, 245, -54, -153, 14, 67, -182, -102, 193, -26, -12, 131, 8, -172, -65, 87, -92, -133, -166, 12, -116, -158, 233, 185, 42, 60, 133, -92, -106, 171, 72, -62, -240, 154, -41, -52, -148, 122, 126, -187, -83, 52, 14, -243, 141, -124, -226, 82, 92, -195, -125, 263, 115, -191, -58, 135, -81, 38, 185, 97, -155, -86, 76, -121, -118, 99, 209, -181, -114, 273, 201, -123, -40, 193, -180, -83, 91, 112, -180, -9, 56, -62, -254, -1, 86, -194, -113, 84, 33, -104, -29, 211, -69, -94, 13, 135, -55, -13]
6535a3J67j61l5J48n3j01p3J79P2l03L67l9j29k14J09J78j96J03J46j01k51L28
6557A28n9q6j17L16o7k57K35K9j59J11J1n6j84K35Q9l67rK44j44o0K01J8J27l78
6581a99M96J1k39k71M56k49k54K42Q5Lk07J29K46m41J86J79j09j98O9J89j94J37
6603F7j19J80m02J94K97k37m4K50j87r7M5K68k08l8L04j06k98K9J85J3l58J65
6625i7K36j24k11J99q8M5k1R6M6j27J15J37k32j57K27qj32R0L69k76j54N5K12
6648B00l63J54L2p8l4K18K6j52o5K05o9j98K16k3j25j00K03jk75J47J90j98j45
6671b35L53r9r5jK30k59j10J67J48j37j24K38M8k34J8J37k2k07J25J18j80L6J15
6694C0j18R4l9J91j28j69J99n0j59o8J44k7l1K44j13k07K73P7O2l10L8K51k60
$$ y = [-13, 154, -7, -42, 106, 53, -48, -121, 58, 130, -173, 194, 155, 26, -188, -79, 99, -97, 6, 152, 51, -200, 128, 69, -17, -134, 182, 115, -142, 93, 122, -37, 74, 85, 29, -155, 80, 169, -198, -207, 37, -107, -167, 34, 52, 179, -199, 297, 308, 69, -202, 254, 5, -249, -7, 78, 81, -126, 3, 249, -192, -6, 173, 64, -134, -65, 124, -70, 67, -52, 128, -274, -80, 217, -20, -64, 186, -1, -98, -53, 215, 7, -31, 273, 167, -131, -102, 83, 96, -262, -97, 139, 15, -196, 3, -85, -40, -61, 35, 81, -46, 69, 206, -26, -183, 44, 36, -96, -6, 363, 87, -67, -12, 200, -163, -9, 23, -55, -89, 129, 155, 3, -62, 143, 74, -124, 92, 69, -56, -156, 47, 46, -229, -82, 108, -90, -235, 118, 19, -76, -77, 153, -106, -216, -49, 99, -38, -162, 76, 124, -110, -92, 45, 23, -184, -59, 59, -121, -85, 30, -88, 6, -33, 158, 30, -139, 60, 10, -149, -217, -73, -100, -131, 113, 0, -207, 66, 143, 205, -105, -67, 184, -76]
6717g6j73L34J41l42J46J73k80M3P3k6j35J31J27k5l30K75Oq2n2K01j02j78JJ70
6741B0lr9j1K47k78J6K18K6k90J44L4j80K05k1N0k31J99J45k19K7J05j29j58L9
6765a44J34j7K8j5R0K4j55J55j4k17P4J35j19Q7J85j22j34L1P8k18n9K61p1j05
6789a08l8N1K02l55K04K30k26k05K66K3j75J98k0rj22J92j06p6m6L12j65j43J24
6812Hl1O0l5J53k02j06O8J13n3m1Q9k6j40J20Q9m4j07J87R3r6l44L72J3k31K01
6837A10p0k0j21M3O4j22J11j6J18j80J08p2P6j34J71j50m5n8L27P8k79K9R6k16
6861a52L2J29M0j49q4K21K6j44J09Q5l56L25J64j16k45j3K47p9p1J65r9m6j40
6884a51K30j09j0M9R5l08J20K21k6l66K11K43r2j08J18j31o7M2K10k47m7R5J7
$$ y = [-76, -249, 85, 226, -116, 30, 203, -77, -34, 39, 13, -122, 9, 136, 111, -219, 56, 62, -20, -72, 129, 27, -151, -150, 20, 17, -82, -93, 154, -124, -108, 110, 136, -154, -10, 24, -156, 49, 28, 78, -153, 46, 191, -28, -1, 104, -25, -183, -144, -10, -27, 1, -14, 76, 100, -55, 100, 86, -131, -57, 78, -41, 46, 231, 109, -25, 6, 84, -134, -193, 68, -3, -108, -146, -95, 107, -248, -44, 186, -40, -245, 21, 44, -131, 67, 47, 38, -84, 108, 2, -74, -120, 192, 27, -116, 8, -23, 37, 2, 155, -47, -153, -85, 28, -25, -66, 23, -3, -143, -23, 66, 22, -85, 102, 195, 99, -245, 127, 140, -91, 110, 40, 20, -101, -58, 6, -116, -5, -21, 97, -83, 25, -47, 29, -105, 66, -84, -129, -187, 140, 218, -61, -32, 64, -152, -120, 9, 49, -100, -184, 37, 63, -81, 28, 113, -243, 82, 246, 130, -115, -128, 119, 40, -31, 134, 35, -11, -151, 79, -30, -40, 9, 104, -204, -84, 137, 111, -255, -44, 199, 107, -1, 117, -14, -81, -39, 171, -76, -123, -28, -11]
6907a1j92J06K86k96RJ06M9j16n2J56j5k19J53N1M0o5k7J78j72j09M35m54J66
6930GK8n8m7rK25j51j59M1K79j70j59J91O2k09K01Jj0q9j8K18j83K4J33k5j77
6955e4O6K66k74j4J9k2j54J03J50%l00K85J6p5k34L05n4j79R8O2n0r8L28q6j28
6980b4n3J5LM0Q0j13mNO5l7r7M2K65r3m20M83j53q2J00J86j83q0O4N0q4j09K30
7007I6r7j42K14N1j92j11L09j35j12J39j18K1r1J77r2L9R5L1n3j71O2K00p9l37
7031b96M20N8l63J73M8k51R2J43O2j56J03K08j30k09J42p5j33O0J74k4j68N9K39
7054A76l04o3L53j16j13j06J59O6j01PJ88j73j21J26k4n9J10J22k10L0N5J17j60
7077d1m1O2o7o1Q9J31k35Q2L78l36N6k4Q8j91RK09j18j78k2N17l26j05nJ37Q4
$$ y = [-11, -203, -97, 189, -107, -98, 8, 57, -59, -111, 45, 30, -189, -36, 15, 55, -10, -37, 141, -31, -140, 295, -159, 7, 35, -23, -70, -79, 146, -5, -164, -123, 156, -14, -173, 18, 80, -129, 72, 73, 63, -26, -44, 174, -9, 15, 148, 123, -54, 12, 278, 4, -10, 9, -13, -167, -64, 86, 86, -214, 71, 87, 12, -222, 83, 29, -150, -52, 10, -40, -138, 190, 104, -24, -77, -62, -59, -19, 61, -52, -56, -51, 14, -23, -120, -78, 187, 94, -326, 157, 4, -78, 22, 208, 25, -55, 9, 59, -25, -134, 96, -1, -143, 71, 122, -70, -181, 128, -7, -119, 20, -98, -77, -168, 9, -83, -44, 51, 82, 29, -142, -80, 120, 41, -296, 124, 182, -181, -8, 40, -211, -119, 24, 86, -70, 33, 241, 111, -98, 44, -31, -164, -104, 70, 46, -122, -63, 176, -128, -191, 162, 46, -67, -173, -14, 52, -49, -42, 146, -27, -148, -22, -46, -105, 5, 127, -83, -53, 2, 119, -41, -82, -20, -87, -148, -59, 72, -163, -81, 297, -39, 17, -7, 81, -110, -101, 108, -10, -188, -210, 307, -19, -124, -129, 8, 92]
7102I2Qq5J07k61P3K03k79j63L62L1n7K8ln0j52J22lj92J17J88j25q0J75J5j85
7127a14j3N5m3J2M3J78q4O3k2L8k13J9J23n8n0J7L9J5J0J93j89q5J88PQ3k20o
7154a4R7j3j29N0jj00Q4K07l24R7J10Nl57K84M7p8p1J11n7r9M5J05P5k11K50J29
7180B42k94n6J99l1k3pRm1rO3L2k32O7K19j08r1N6J53k98J2L00L0k12j91L95l30
7206a46p0L35j37j34k7J06Q6j25K3K23l21K19K2r2O6p1N5o7k8J25j9j80J98J1
7230E2o3j12J08j13J3O3N3O8k55J60K37l39j50N62k55M7p0J80j50k00K88o2j13
7253e1j34K84j47j60J05J30Jj95J93J19k19k8J23M2j48P6n3r5J80R5j02j28L4
7276g8J72j89J64N3j45n1O2J75j99j23J92K1m5l2K0L9k61K10J19o4j13k2M6j25
$$ y = [92, 100, 15, 122, -139, -66, 137, -142, -305, 57, 88, 31, 59, 56, 6, -146, -24, -27, -219, -102, 86, -39, -119, 56, 71, -114, -127, -72, -115, -103, -60, 118, 34, 97, 75, 113, -100, -81, 42, -16, -66, -49, -10, 5, 15, 208, 19, -66, 122, 129, 212, -8, -14, 83, 70, -59, -9, -10, -110, -26, 181, -143, -46, 64, 69, -288, -4, 43, -35, -106, 5, -52, -151, -106, -1, 74, -137, 113, 242, -52, -108, 91, 60, 37, 30, 39, -2, -11, 52, 84, -148, -81, 138, 30, -61, -5, 148, -150, -138, 162, 192, -20, -211, 184, -146, -216, 119, -18, -152, -179, -73, 13, -112, -89, 134, -187, 32, 54, -38, 28, -43, 12, -55, -83, 42, 23, -157, 41, 52, -11, -123, -15, -128, -115, -52, 1, 69, -186, -26, 211, -128, -278, 284, 29, 76, 6, 186, 36, -164, 124, 62, -51, -185, 99, -48, -208, -103, 27, 28, -167, 26, 145, -74, -102, 21, 63, -85, -9, -62, -157, 23, 118, 16, -112, -78, 94, -95, 69, 122, -23, -74, -12, 163, -36, -159, 33, 54, 9, -23, -3, 36, -225, -15, 104, 40, -73, -95, -49, -174]
7300a74J35Q2j27j69K16K04l07K66j21%n0n0J71j88m5J81q9p2O2K04k84R0K06
7323A41j27J17k35L41k11j37J01P5n7j30J69N3k11L2R7nj16lJ79j0q2L4o6Q3J51
7348A83r8p3j72J42J07q0j5J20j63l7K69m4j32j08J87j39n3j15M75l36MJ24M6
7371I2j26j6J57p3k72K75L8n6JJ83R0l83L6K20j83l6K93k38j3r6K54j25j53J83
7395E2lj27K9K52j74k43K30m7pj14J58J95l22J46J12q3k94K77J06r9k48L15j79
7418f8J02oj07J37k20J92Np0L8J90k23j81J64O0n3J3J95j85o5Q1Q8l2j35J22J3
7443E5p6l9j4J49n3Q9r3J05k66J41j55Q5J11K7k27L0J46J43l06J08J85j39j44
7466a38m1J32n0J92P0q9j15J04j64%K13j52K52k25q0RJ21j15O2m1L2J48R4j31
$$ y = [-174, -39, 43, -84, -253, -37, 167, -140, 126, 5, 5, -45, -95, 76, -112, -157, 24, -65, -137, -75, 129, -155, -65, 141, 14, 131, -104, 237, 26, -111, -10, 65, 8, -122, 47, 100, -111, -79, 18, 13, -103, -106, 73, 63, -19, 15, -51, 32, 183, 85, 12, -160, -18, 89, 9, -6, 114, -49, -86, 183, 139, 7, -101, 86, -53, -106, -221, 254, -82, -78, 46, 92, -34, -50, 107, 34, -238, 37, 75, 19, 20, 203, 293, -90, -54, 166, -17, -53, 240, 2, -11, -107, 147, 22, -131, 52, 49, -78, -49, 203, 29, -214, 16, -31, -38, -152, 6, 201, -121, 25, 137, 54, -240, 37, 143, 44, -204, 111, -68, 34, 28, -79, 58, -162, 30, 35, -35, 3, 193, -30, -211, -47, 13, -40, -27, 168, -17, -82, -1, 87, 55, -80, 42, 55, -21, -60, -74, 75, 22, 111, 18, 123, -143, -2, -157, -72, 39, 66, -161, -131, 15, 158, -148, -40, 145, 6, -138, -179, -47, -97, 95, 165, 76, -39, 65, -99, -99, 114, -38, 214, -11, -91, -82, 39, -76, -14, -55, -23, 125, 219, 88]
7490H8j60P5P0o0k0N7j41K7jJ35J32j76J27l7j56K1O8Mj10k0%R1j05R7J69k76
7516a01K04j9k54L0P5K96k10j54K45O0l75L70r7r3J16j3q5j1R9j63j4K5J17N8
7540A06k47K02m1o0m3LJ40p1p3K45j14P1j59J65k44k3K37k2j34Q1M1r8j76P9K63
7565A28p5j46K81j53j80K79oj31j56J13J65j86J75p4N0j07N8M0j55L0J54L2j69
7588c3J22q9q3j23L86q0j86J43J6M1l06L09j61j07R6J54j21j92K10k7K1n5J04
7611C9j21J8J4J43n0r6K24k02Q1J0J1J01k10Q5j8Nm0N7r3L5j01J53j25J03Q3j49
7637d3j34Q0Q9lL7j5Q3q8k33K88q5m8R5nnk1J16o4r1j24K30j77R6k7K37n1k34
7664i7K05p1k11J45K67k73%K17j98q0R8O8J05k63M09l43J1j3O0L5j02Q6L0j38
$$ y = [88, -72, 3, 73, 13, -7, 50, -91, -64, -65, 70, 202, 26, 153, 116, -40, -19, 49, 53, -57, -77, -77, 14, -91, 6, 175, -101, 103, 84, -170, -140, -65, 231, 21, -133, 112, 172, -203, 167, 70, -23, 93, 80, -5, -16, 83, -80, -94, -69, 48, 106, -141, 61, 20, -40, -83, -80, 60, -11, -84, 161, 47, 118, -41, 124, -120, -143, 94, 72, -62, 19, 60, -38, -214, -135, 128, 53, -93, 188, 35, -145, 134, 128, -3, -159, -46, 119, -67, 108, 34, 84, -23, 35, 75, -80, -50, 104, 136, -33, 89, 0, -83, -206, 180, 100, -86, 57, 73, 114, -192, 117, -44, -151, -55, 99, -22, -214, -4, -31, -10, -65, 39, -82, -64, -50, 93, 43, -53, 171, -31, 50, 60, 71, 172, -38, 47, 29, 34, -6, 51, -42, -7, -108, 45, -80, 23, 106, -43, -177, -97, -8, -11, 26, 11, 94, 6, -227, 61, -24, -72, 23, 18, 13, -8, 108, 44, -47, -171, 59, -118, -22, -49, 188, 137, -97, 108, 37, -174, -29, 238, -35, -35, 182, -16, -96, 2, 70, 175, -88, 321, -22, -11, -24, 36, 71, -31, 55, 85, -53]
7688e3O0K4J53k32P0Q1o6r1k3J71k12l2J50j50J84l2k6M3MO6p6m6j04O1j5J04
7714A3oj34jJ91ml2m0J8J47k05J1N1m4k0j14L42j85k03J88n7KO0J17Lk59J02J30
7741G1k04P8K0J05l38K69J40r3j41R0no8mO6j44K37M8j85J7k07J70N1l3J67o9
7766C8k21L03k53J6nj05K82J3k12P6K05j73j23K16lj57J66Q9k28l4K17l9ok15
7790a53N4K05j01J33m0p8O8R3j99J03J69k41j54M8J71m6m4R6m1N4n7j54M6J10
7814D2j24P3j58K9R2N1L4L8k19L52l39K24j64K8n0J14K6n0j21J50o9K0NL4q8j57
7840b27J42K24k24N4K5j18J80k1j7j06J49r1j2n8K09j8m5k70J43K9R9l3O2q3n6
7865f3R5j7k29J93K19j56j60K44p1j11L2J61k9p9j49L9J55q0L3o7J5l8Q9j2j26
$$ y = [-53, 7, 31, 184, -48, 22, 103, 37, -54, -77, 94, -118, -150, 0, -150, 34, 2, -24, 19, 23, 89, 13, -33, -137, -76, -91, 13, 7, -127, -128, 63, 59, 27, -13, 5, 152, -53, -42, 9, -35, -55, -169, 173, -12, -215, -27, -84, -82, -22, 95, 98, -161, -59, 71, -133, -55, -35, 70, -268, 1, 141, 48, -93, -3, -8, -76, -80, -14, -158, 79, 127, -58, -41, -248, -78, -27, -60, 107, 38, -183, 120, -133, -117, -122, -227, 55, 68, -144, -68, 137, -36, -159, 57, 54, -103, 63, 152, -76, -110, 107, 68, 62, -153, -99, 106, 5, 138, 98, 20, 88, 181, -18, 85, 254, 13, -141, -93, 78, 32, -12, 84, 43, 97, 40, -114, -68, 42, -82, -9, -167, -138, -46, 5, 39, 77, -142, 210, -129, 95, -69, -41, -91, 23, 49, -1, -122, 28, -41, -21, -16, 18, -70, -227, -85, 139, -85, -31, -6, -124, 56, 35, 18, -88, 61, -30, -42, -100, 109, 91, 46, -224, -81, -52, 47, 14, 76, -7, -63, 32, 15, -214, -21, 198, 42, -118, 126, 55, -56, -24, 137, 108, 29, -120, -81, 74, -6, 27, -40, -25, -63, 26, 14, -112]
7890a12R8L2P2j07J71Kk09O4P4p1N0n1j2O5p5mN7j08o9J89j84O8J02J3j28qL7
7917d4n3j60L09JM9n4j04R1N1r2p2L7O6N5O7p9J4j15j73K29QJ28r6j0l2n0L9K6
7945C6J70j36l05K94l4j15J36J47k90J0J52k01K59j45K3l9k5R1j6p5J01m9J7j91
7969a85J28K32j63j97J18J61k50o6L04r7k9O7J5j78M0K57j20k46J54l0P7J2p0
7992f6O7RqR6j33K0r1K48rj20P4j56j32K61K6j74J71Kk3m1m6o4M2j02J74n5q3
8019a13K01j41K35k40l2K69k34OL6j38J34q8L71k77J5J19j63n6m2L93k13q4K7
8042a5l7l5Q3Mmk36K25j15N0q5N8K11k19J6J63k2O9j12n7J94k33O4R0l0l2K16
8068B11j46j88J31N2j53J36K5P8j17K41l35j6J74r0J5r3nJ71j00J91r5M8j44j24
$$ y = [-112, -14, 18, 90, -17, 154, 156, -53, 11, 85, 14, 64, 13, 1, 66, -9, -13, 44, -64, -133, 56, -128, -60, 42, 55, -73, -81, -44, -97, -257, 52, 53, 102, 48, -56, 35, 86, -6, -78, -41, 25, 80, 147, 68, 82, -33, -206, 23, 31, 159, 63, 53, 21, -29, 10, 36, 206, 70, -235, 59, 25, -90, 46, 193, -97, -87, 65, -136, 123, -22, 1, -38, -63, 28, 12, -63, 38, -11, 6, -185, -57, 175, 12, -185, -67, 94, -156, -222, 82, -15, -44, 23, 38, -140, -100, 157, 37, -209, -55, -85, -8, 4, -66, 1, 10, 2, 98, -35, -15, -106, 142, 133, 13, 87, -69, -201, 60, 86, -88, 83, 85, 62, 21, -25, -89, -47, -149, 25, -30, -113, 88, -53, 182, -58, -90, 179, -55, -49, -13, -151, -17, -105, 266, -11, 4, 123, -40, -96, -138, 255, 42, -42, -15, -52, -87, -4, 0, -4, -240, -15, -130, -80, -165, -107, 104, -115, -99, 64, 42, 111, -1, -58, 136, -97, -33, 57, 27, -5, 211, 65, -123, 8, 60, -93, 43, 68, 146, 29, 270, -65, -81, 93, 3, 18, -75, -80, 91, -9, 182, 87, 135, -9, -133]
8092a33J23J06Kj57J42j71J36o8J51j93M8J36J0k60J18k0j8M1Q1n1Q3p7N7K2j87
8117g9J86r3p8m4J23p1J22L8k32kK44L8j55m1J5K0mP4k8R4k04K1q9Q0L8O1Mr8
8145f0O7M2p8j78J93P0q9Q8L7L0k54K46k2j41j11k4K56j22J5J18J63l03L1j6j6
8170e8j02K73j18q4J65j54o9k5L03j18o4J3j4J16r7k0J86r4q1J45j78
$$ y = [-133, -10, 96, 98, -59, 83, -88, 48, -20, 131, -62, -14, 122, 132, -128, -10, -30, -48, -7, 74, 23, 106, 29, 86, 108, -79, 107, 14, -64, -108, 15, -56, 66, 104, -128, -130, 114, 152, -3, -44, -29, -9, -13, 61, 33, 127, -77, -56, -145, -65, -27, 34, 38, -60, 7, 49, -29, -207, -14, 56, -33, 55, 92, 122, -132, 114, 92, -49, -160, -184, 72, -50, -35, 83, 246, -57, -26, -42, -58, -160, 113, -5, -89, 76, -78, -147, -172, 131, 13, -51, -38, -52, 64, -33, -53, 133, 39, -42, 103, -75]
8191g5
$$ Imaginary data points
##PAGE= N=2
##DATA TABLE= (X++(I..I)), XYDATA
0@%%%%%%%%%%Qj6J6k4L2m0M8n6P2q8J04j24J48j76K08k40K80l28L76m32M96n66
32c02O45p31Q27r33J050j177J318j475J642j824K026k246K486k748L034l348L693
49A937m069M480m936N441o000O623p322Q115r021J0063j1279J2725j4479J6649
63H927j9415K3088k8228L5974m9113P7061k37785K91370K47508o79021J96044
74a33590N20150l29711l86588M53759J17279m39708K4192L82953j58433k49443
84a99140K01030J77500k22588j15926K12550R5519k53837m3509L04474k3025l33304
95b00256J56385K98569k96800k17242L93545N0547m26570J37896L83937l00803
105b0792k34645M06385M4653m14695J41232L25935k70116j92917L17999M8434
$$ y = [0, 0, 0, 0, 0, 0, 0, 0, 0, 0, 0, 8, -8, 8, -16, 16, -24, 24, -32, 40, -48, 56, -68, 80, -96, 112, -128, 152, -176, 200, -232, 264, -302, 343, -388, 439, -494, 556, -621, 697, -778, 864, -960, 1066, -1180, 1306, -1442, 1592, -1756, 1937, -2132, 2348, -2588, 2853, -3147, 3476, -3846, 4269, -4752, 5311, -5968, 6757, -7722, 8927, -10488, 12600, -15628, 20346, -28767, 48294, -189491, 101879, 349387, -329634, -133590, 386560, 56849, -329739, 124020, 241299, -198409, -174217, 208736, 50303, -199140, 1890, 179390, -43198, -159124, 53426, 148945, -104892, -148401, 156073, 133048, -200256, -43871, 254698, -42102, -259344, 134201, 184748, -241822, -103926, 280011, -20792, -255437, 150948, 195601, -219094, -77862, 248073, -22043, -214960, 103039, 151473]
115A51473l07521O1219K55787j37317j90863J82597J37867j95903q2553K15470
125I0256L5474k41771K1444K52371j17373k39978K25911J76418l08253n6003L41658
136A80154q9050l13729K18860K22365l08739q7175L44068n2316l06473J69490
146b2545K13858k41200j10117K54864J6832k34293N3751K08406r9013j75490J40122
157E175J37000j84723r6046K17749L5363k42473M6372K47369j38275k07656K30091
168D9946J18786k88883L568K89514j28572k28880K23383J28872k68540j7558K58578
179A40214q7575k08739J60971J33191j91824n4141J88922l526j66981M1026J44606
190I6144p1653j29221J07721J08443j47959o9169J82139Q443j97212O6877J82514
$$ y = [151473, -156048, -94829, 160958, 23641, -167222, 15375, 153242, -42661, -125214, 90256, 125730, -116041, -94597, 157774, 40401, -199577, 26334, 202752, -105501, -161504, 180154, 91104, -222625, -3765, 218600, -90139, -177314, 166754, 114438, -192035, -22545, 191313, -49887, -160004, 94860, 111692, -122601, -68850, 139556, 40543, -134947, 5175, 142175, -42548, -138594, 79155, 114518, -127955, -81583, 165786, 27511, -180145, 49946, 168732, -120151, -116583, 172931, 44359, -184521, 38862, 167734, -100806, -118364, 140214, 52639, -156100, 4871, 138062, -53762, -107903, 81019, 77493, -89488, -48462, 96144, 24491, -104730, 2991, 111434, -36525, -105694, 76445, 84888, -112324, -45447, 137067]
201A37067j46050j32677K11116M7119k39813N6700K16552j52418j47614K11053
211F1035N6018k21722L5735J95707j05268j43600J48130Q0247j63449k1807J52927
222G3953k5751j31461N7705J10760q3249r3003J11764O7409j41213k2987J61770
233H5697l6186j57924J00987J27059j57218p2043J91311k744j94530Q2832J61611
244A28852j48406r6538J81404J9365j78055M7336J46799r4783j03727J22276N7000
255H1523j32243j0398J28932k9594j14430O2996R5229q9593p1125J14729L7123
266G3149j36691R280J40981o6103j22568J17052P9660j49285k1039J58278l8830
277D3884j41674R4542J02435j32838m6982J45650j2325j31776N9675R9359q9975
$$ y = [137067, -8983, -141660, 69456, 116575, -123238, -66538, 150014, -2404, -150018, 61035, 117053, -104669, -68934, 126773, 21505, -122095, 26035, 106282, -57167, -78974, 73953, 48202, -83259, -25554, 85206, 1957, -91046, 20718, 88127, -53086, -76073, 85697, 49511, -108413, -7426, 119633, -37585, -109628, 81683, 78939, -115591, -32759, 128852, -19554, -116092, 65312, 84677, -93378, -46042, 100757, 5974, -97753, 24523, 81523, -50720, -61118, 67814, 38220, -76210, -13214, 82015, -7578, -78703, 36026, 73149, -63542, -54262, 86719, 20616, -101952, 15100, 94760, -54525, -75564, 82714, 43884, -97790, -3248, 99187, -33651, -80633, 65017, 52692, -79084, -19409, 79950, -10025]
288a0025o2422J04942K6874j10900P870J08790m1805r5963P2337P3231r7479m4246
300f8796J15311R077j23883L4245J18082p9385q9547J16715M2685j33355J0093
311d8758J25193n9027r9860R4477O0977j15643j5465J18272k9850j00918O6823
322c779P2077q7215l9218R6085R851r7258J7943R1630m8070p7784P4880N3015
334F2157r4430k2410J02842j0915r9633M6283Q4861p9811n5909J04742J4367j11263
346e9119L0041R7295o6805o8582R1800L3528j02651M302J00491m0861q4820O9706
358D325N6229q7092k4971R0871n074q5954L2073P5751n5918n7500P7485L0931
370E1156q6918O28Q5488l1968p3028N7233N2588p7970k6923Q9217o699q7320M1464
$$ y = [-10025, -72447, 32495, 59369, -51531, -43661, 65129, 23324, -72639, -302, 72929, -24550, -68796, 46515, 55592, -68291, -34046, 84036, 4651, -84896, 31819, 74504, -58851, -48758, 76435, 17408, -82452, 12025, 73002, -42641, -58106, 60166, 30316, -70602, -3779, 68298, -18917, -58135, 37950, 47801, -49457, -31514, 60116, 12046, -65738, 9142, 62157, -32273, -54683, 48159, 37244, -62389, -16106, 68755, -11056, -66965, 37777, 52144, -59119, -29078, 68217, 1412, -67170, 24630, 58158, -44493, -40191, 60300, 19439, -65381, 4325, 60554, -26538, -51509, 39362, 34288, -51666, -19593, 56158, 240, -57260, 20225, 51156, -35762, -35134, 50354, 18386, -54642, 2591, 55179, -22791, -49714, 39503, 32804, -54516, -13052]
383a3052P1418o8871m3887Q4072J4705q7999J4585Q2627m2927o7244O6893M1667
395E1987q0453j0847Q1891j7858p2157M0967N6236n9707l5422P2459Q057p7327
407d2174K1316O9480m6098n2419O3502L1123p2529o571P7100j9052p2278M5167
419c433N6772o6262l3230P5471N072p5941K0502O7728m4070n1834O4334K8439
431D3548p5021J777P3360k9877n9628N0961L9077o4129j6737P0599p846o8479
443d2395L2147N6369n1711l6462O2423J4075o5488O300O2547k5569n4769M3911
455A378L9369n8690j6682O5924p527o2223K9996N1968m7999l5259O1096J2432
467C3783o8231J3164O3332l8852m7822N5054K6222o1786l566O2157j6143n5547
$$ y = [-13052, 58366, -10505, -54392, 29680, 44385, -43614, -29029, 53598, 10671, -56573, 10320, 51987, -28466, -39313, 42578, 24720, -47437, -6470, 49766, -9941, -45363, 27096, 35153, -42174, -20858, 48622, 2524, -49895, 13607, 44730, -27799, -34370, 42730, 23678, -48600, -3433, 53339, -12923, -46153, 29318, 34390, -41551, -21049, 46679, 2609, -49225, 15109, 43548, -31473, -29696, 43664, 13787, -45841, 5120, 44197, -19932, -36669, 33930, 26084, -42395, -10248, 46121, -5590, -42052, 20371, 34446, -31042, -24742, 37805, 12236, -42533, 1378, 40747, -17943, -34625, 31299, 23772, -38451, -8455, 43513, -4486, -39745, 21351, 33783, -34448, -21284, 42048, 3196, -44626, 10428, 36650, -25136, -28702, 33455, 17312, -38235]
479c8235L5057M3143n0119k4690N7345M588n7144J2842N0548k8042m1385M2166
491F074K7284n3795p400N8523j5492n2899L6048L8538n0884k0420N9942n56o1459
504c6496K3470N4152m3314l6665N6257J4735n8642N569N2736k2687m3685L5218
516F48L0059m5652j2860N0362o063m6451K3503L8230l5300k6763M5509J3107n2438
529b4109M401N2772k4847m5186M1555K8650n0717j0510N2710p215m8206K3811
541f891L8796l7591k3172M5374M681m5129J2075L8355k3563k9836L2804K0422
553B6325m0066p292M4719q673m3790K3874L5611l6871k3789M4933Q450m9176R329
566a6416M8105k8088l6727M4414J8330n0585L230M7167k0973l8068L3070K4160
$$ y = [-38235, -3178, 39965, -10154, -34844, 22501, 27089, -30055, -17213, 33335, 5293, -36092, 6074, 33358, -20437, -27837, 30686, 15194, -37705, -1657, 36881, -14003, -34423, 25519, 24963, -36496, -13026, 41126, -2188, -38853, 17404, 32139, -26503, -20934, 31802, 9115, -34570, 648, 30707, -14945, -27805, 22557, 16494, -29957, -6454, 31776, -3524, -30287, 15222, 28329, -24109, -19708, 33064, 8217, -36969, 4586, 33236, -17481, -27991, 24719, 17504, -30702, -6891, 31905, -5686, -28858, 16516, 21197, -23932, -11857, 26498, 2935, -26901, 5903, 26325, -13741, -21033, 23686, 15013, -28777, -4903, 30708, -6163, -29952, 14981, 23431, -25745, -16416, 31689, 3601, -33126, 11288, 29618, -20967, -17737, 29430, 8457, -29611, 3459, 27619]
578B7619m0951q932M2533q046l7375K1057K8024k8003j7317L1583Q808l4254P19
591a4535L6145j2037l5249K4948K7930l5504j5967M1907K119m3686J2768M0301
603B9140k8259k9898M0149J1697m5031Q223L9999k4490k7983L4144J4432l7310
615a5187l36L7788j2498l2907K2876K4186k9159j5007L0403O045l1608Q22L2436
628A7854r999l0858K2062K3968l1913j0657L7104l947l6043J8218K9961l1273
640e523j8692M0518J754m2542J6848L4730l0309k0917L6061N924l5341O150L0674
653A9335j5659k4245K2557J5327k5933m920K5366k093k2901Q144K1200j3685j8665
666a6172K0856J2012k8092j832K9510j0579k6342K0487J9455k7657r236L2751
$$ y = [27619, -13332, -22264, 20269, 12223, -25152, -4095, 23929, -4074, -21391, 10192, 19000, -15254, -14535, 21610, 9573, -25676, -728, 27202, -8302, -24269, 17638, 19757, -23929, -11161, 29140, 881, -29017, 11132, 22829, -22202, -13979, 26020, 1530, -26453, 7691, 22123, -15187, -15523, 22265, 9767, -23140, -264, 23922, -5237, -20244, 10159, 16204, -15404, -14582, 17854, 7855, -23003, -941, 23027, -8886, -19543, 17561, 13614, -22429, -4211, 25750, -5523, -24215, 16303, 18057, -24485, -7637, 27093, -3216, -24133, 11928, 17852, -17489, -11339, 19335, 3676, -20569, 1988, 17315, -8618, -13538, 11828, 9735, -13166, -5022, 16178, 2493, -16172, 4684, 16696, -11396, -13228, 16282, 5703, -20639, -152, 19303, -8354, -17590, 15161]
678A5161k385l2566J6095K6225k6065j4863K9670K824k8395O259K3965j3153j9660
691a6888J9635J3015k4038m213K5194n180k2684J2667J8751j9142j3521K5009
703H605N390k9074O917K8160j8652k0269K6519R368k8487Q54K6304j0432k2164
716a6961J7006J4704k2031m981K1589l481j6801R087J2946j1064r652J3475P277
729A1113j7236k194J9451n970j9367J2614J6041j8486j0818K3208L073k6113Q132
742f552K4251j8736j6036K5109L967k5002P128J9473j3813j2527J8066N018j8804
755h458K954J6116r521j0938J2433N036j2128k794J1065J597j2404O69J5067n270
769C424j4418J1114J1674j4801o149J7059K29j8599O830J5987j5166r291J9643
$$ y = [15161, 12776, -19790, -3695, 22530, -3535, -18398, 11272, 14096, -14299, -8040, 15925, 2772, -16888, 2747, 15762, -8276, -12489, 12705, 7525, -15159, -2492, 16259, -2883, -16404, 8605, 13995, -15079, -8162, 19998, 1346, -18923, 7596, 16964, -11523, -10669, 15635, 5203, -16961, 45, 14749, -7282, -12263, 9326, 5845, -10956, -1869, 11077, 13, -9639, 3836, 11113, -6123, -8317, 11134, 5164, -14203, -1589, 14452, -4034, -14852, 8356, 11429, -14684, -6552, 17699, -1037, -17073, 8036, 12003, -12999, -5871, 13602, -211, -12738, 5328, 10346, -8458, -5504, 10612, 1091, -9847, 2586, 7622, -4506, -7300, 3765, 5362, -7042, -6373, 8694, 3424, -10994, 120, 11794, -3007, -9156, 7903, 8132, -10467, -3637, 12350, -2816, -12107, 7536]
782G536j375j8566J1248J2333j5618n094J6776j104j5159O533J2381j1561p253
795h923J3237J934j1323J638Q337k464o985K767P182n052o347P625K978r376R34
810c838Q370l498p323O875N626r920j184J2407m323j0814R989N931j2725r67J1166
825E772l180r400N093P618p638m445R079P06p929L574N290m972k260M840R38n552
841b466J70O543l398o130P274K657q601R42Q186l286o851M545N376o814l270Q530
857C407q08p655M740M811n805n92N166j141m290K385M003m942l143O781o69p394
873e146L547N707n115l701O021K881o630q58Q327j989p902N516M602p403q85O566
889C538k048n725M077M516o155k535Q390j549q491N739O344q452k848Q340R66
$$ y = [7536, 6161, -12405, -1157, 11176, -4442, -9536, 7240, 6136, -9023, -2490, 9891, -1670, -8923, 4314, 6248, -5075, -3437, 4900, 2436, -4549, -1782, 5400, 348, -5999, 1626, 4604, -4772, -3838, 4532, 1034, -6289, 586, 6212, -3708, -4892, 7515, 3192, -7622, 2367, 8298, -4427, -5394, 5772, 2592, -6808, -1715, 5903, -1735, -6180, 2899, 3605, -4324, -750, 4540, -432, -2692, 2148, 3086, -2466, -2296, 4247, 849, -5281, 1993, 4650, -3951, -3009, 5177, 1891, -4960, -415, 4961, -1853, -5123, 3407, 2599, -5056, -316, 4495, -1310, -1902, 3264, 2123, -2167, 218, 4221, -721, -3864, 2917, 2248, -5146, -1599, 4108, -1007, -4708, 1313, 4194, -2436, -3294, 5033, 3044, -4858, 658, 5260, -2143, -3028, 3538, 1490, -4235, -158, 4358, -1797, -4332, 4058, 2509, -5982, -243, 6101, -2351, -5199, 3141, 4107]
904D107q719J582R205m782p951Q734M402j0064N2Q704l541p086N031N148p360
919b538k946R083j029r001N906O869q155l181Q925J146r344J282R850m748j0334
934h215Q790P263j1891l164J2462q47j1686M579J0861q591q053J2514K822j4414
948g570M250J2440j0130p601J3143K855j4257J954J4377p084j2516J2065P729
961I655j5233k102J4621k850j2965O025J1107q737q300J2329M542j4179J712J3412
975I037p125j0536J0739O548j3699k709J5240l042j5430R828J2282j5025o151
988a0043J7060N05j6164L919J4991q456j2598J2841Q249j6054k133J6386l666
1001D837j4373Q496J1521j2794p875J6622K087j9287N620J7720j3757j2108J8737
$$ y = [4107, -4612, -3030, 6175, 1393, -6558, 2176, 6578, -3486, -3434, 5270, 1729, -5357, -326, 4822, -2538, -5484, 3599, 2570, -6431, -525, 6344, -1811, -4992, 3933, 5079, -4265, -2983, 6867, 2119, -8215, 575, 7838, -4053, -7217, 5245, 4398, -7288, -2709, 8152, -439, -8492, 4022, 6844, -7570, -3320, 9120, -1010, -8611, 4532, 7387, -6870, -4916, 9461, 2377, -10139, 1926, 9655, -5578, -7680, 6941, 4091, -8874, -2849, 8258, -479, -8779, 3550, 8092, -6087, -4375, 9037, 1912, -8624, 2115, 8663, -5036, -7745, 7495, 4453, -10977, -1149, 11133, -3892, -10043, 7017, 7522, -8642, -4723, 10268, 1812, -10786, 2055, 10304, -5750, -7883, 8503, 4837, -9536, -1040, 10481, -2313, -10188, 6434, 8521, -10766, -5146, 12574, -1183, -13291, 5446]
1014E446N019j9864K320J9449q789j6407J5113J1108j9697l271J9505m238j7055
1027a1361Q994J2994j2363r119J4808N090j6763J228J6938p499j4064J3038R624
1040A1545j6815m762J9597k161k0524J0256J8212j8779j1039K3538J982k3424
1052a2374O038J9804j2205j4948J6816Q313j9407n42J8958o496j4985J1754J0035
1065A0761j3799n686J5638J773j8068L468J8219j1104j5770J7279R935k1114k941
1078a1409K3111m688k1972J3465J8027k0778r693K4939j597k3041J0554J7143
1090A4061j6857j0423K0015L170k0752M083J9425j1009j5036J6351Q830j8697
1102f839l365J9278j202j9958P209J9193j4352j4187K0618O807k3681K307K2290
$$ y = [5446, 10465, -9399, -7079, 12370, 3581, -12826, 2287, 13395, -6302, -9573, 9932, 5694, -11361, -2367, 10627, -1736, -10855, 3953, 9043, -7720, -6492, 10446, 2947, -11117, 1921, 11545, -5270, -10032, 9565, 7404, -13120, -2864, 15348, -3431, -14470, 9068, 11050, -12374, -6336, 13468, 1263, -13685, 3131, 11444, -7963, -8505, 10453, 3957, -11028, 726, 10761, -3038, -8724, 6914, 8687, -9381, -5913, 12306, 1202, -14568, 2711, 12646, -8468, -11409, 11702, 7014, -14958, -1493, 16534, -4244, -13937, 11002, 9405, -13636, -3082, 14061, -2796, -13219, 6796, 9966, -10786, -6703, 12722, 1713, -13323, 3028, 11858, -6839, -10204, 9074, 7872, -12086, -4877, 14316, -36, -14223, 6395, 13202, -10479, -8172, 14118]
1115A4118j0626j8760J7278J1776k2319l045K3559o440k0280J4829J3478j8192
1127d624n922J9312o3j8681N226J7358j1093j4433J5556R916j9360m453K0961
1140I700j764k1289Q905J9988j6625j4819K3912N311k6667O310K3394j6107j6323
1153a6074K2926P162k5875L205K4765j2912j9401K0090J0275k2933j649K1148
1165A0727m646j8568Q707J5602j1988j2186J6436P438j8839r20J9614n503j8368
1178a2494J1564J5000j8053r776K3549j81k4914J0993K0832j9743j2317K4416
1190H876L091k4890N858K2460j3608j7214J9485R461k1967j349K0812m891j8065
1203a1941R474J4835j3309j1563J8078N433k1331K124K1078j0338j7807J7742
$$ y = [14118, 3492, -15268, 2010, 13786, -8533, -11578, 11981, 5541, -14739, 90, 13568, -4624, -10546, 8766, 8703, -9978, -4752, 12606, 1513, -12920, 2636, 12552, -6808, -11261, 9700, 7936, -13353, -4448, 15540, -1085, -15904, 8008, 13319, -13348, -7038, 16356, 249, -16074, 6852, 14014, -11861, -8656, 16109, 3197, -16204, 3886, 14161, -8772, -10421, 10727, 6081, -12487, -3780, 11822, -166, -12352, 4084, 11522, -7317, -8237, 11377, 5874, -12494, -930, 14070, -3983, -13759, 9790, 9609, -15305, -4312, 16520, -3223, -15540, 8876, 11967, -12923, -7065, 15395, 1787, -15427, 4058, 13519, -8448, -9797, 11015, 6124, -11941, -2467, 12368, -941, -12504, 5574, 11007, -10324, -8200, 12878, 2540, -15267, 2475]
1215B475J2043k2917l906K6275n860k4686J5924J8486k3557q489K5346j741k3458
1228a4065R185J8846j4911j3030J8664O294j9842J197J8834p036j5664J1432J2227
1241A2131j5013q674J8797K957k1988N081K1601j4070j6718K1036R244k4977l05
1254a0898K5446r106k2469J7752J5140k3519n119K4770m821k0818J2073J5103
1266A3534j5762r083J8153K873j9306L182J8267r702j5326J4228J1011j7619o391
1279a1941K0841M38k2302P730K1294j6241j5379K2800O396k5282L245K3040j1920
1292B719j8548J8895J1108k3371j281K3506q131j9313J4819J2650j8117o095J9361
1305H202L32j9549N720J8280j1438j4707J6622R151j9305l214K0537l201k0730
$$ y = [2475, 14518, -8399, -12305, 13970, 8110, -16576, -652, 17834, -5723, -14212, 11134, 9393, -14065, -4880, 13966, -945, -13975, 4689, 10983, -8859, -7662, 11172, 4136, -11528, -96, 12131, -2882, -11556, 7241, 10198, -11790, -6709, 14892, 822, -15896, 5140, 14384, -10593, -10898, 14548, 5442, -17027, 725, 15865, -7654, -12773, 11997, 7176, -13642, -1569, 13534, -2228, -11311, 6842, 9715, -9591, -6409, 11858, 2156, -13170, 1058, 12069, -5550, -11941, 8900, 9338, -12964, -5234, 16060, -181, -15560, 7240, 13636, -11646, -8401, 14639, 2719, -15829, 3066, 14174, -9197, -10478, 13028, 4897, -14416, 403, 13053, -5064, -11159, 8202, 8534, -11015, -5295, 12985, 1547, -13160, 3462, 12613, -6692, -9906, 10631, 7430, -13300]
1318a3300J0040J7843j7593j1363K2511K170k3344P402K0153j4363j4150J9560
1330E566P398k2580J266K1958r809j8373J6157J1799j9480n136K0058q10j9583
1343a1569O638J8000j2689j3762J7638P633k0293l81K0121o485j7905J2846J4051
1356A3843j8674o957K2078j800k1616J0310J7201j6698j1132J9956M063k1591
1368a1017L186K0913j0337j6992J6313J1314j9476m030K0183k583j8886Q558J5737
1381A2883j4110j1547J8615M127k0745L937J9379j0976j5163J6548J0036k0234
1393g250k897K1950n249k0494J2781J5301j7835q450J9888J580j9781M821J8223
1406A2588j0852j4566J5841Q306j8879j126J8561n265j6736J0973J3189j5434
$$ y = [-13300, -3260, 14583, -3010, -14373, 8138, 10308, -13036, -5634, 14519, 156, -13994, 5566, 12964, -9616, -8350, 13608, 3799, -14574, 1583, 13382, -6098, -11234, 8824, 8014, -11569, -4931, 13069, 380, -13382, 4256, 11889, -8404, -8785, 11336, 4851, -13054, -208, 13843, -4831, -11788, 10290, 8490, -13126, -2816, 14385, -2313, -13445, 6511, 10574, -11017, -7831, 13082, 2745, -14247, 2066, 13380, -6096, -10126, 10057, 7474, -11412, -2854, 12883, -1227, -12774, 5841, 9968, -10777, -6840, 12539, 1563, -13600, 2948, 12984, -7250, -10147, 11803, 6554, -13940, -1159, 14142, -3693, -12143, 7745, 9325, -10456, -5635, 12588, 1736, -12830, 3011, 11317, -7562, -8688, 9873, 4608, -12128, -1155, 12034, -3400]
1418c400p837J9331J206k0542O646J8340j3363j3564J7561P293k0102r56K0539
1431A1152o562j8319J3416J3135j7665o145J9809j322j8072P325J5765j3012j1475
1444a1970J7015N353j9420J912J8773q823j5123J3682J0588j7370n025J9423j734
1457G281j9286Q653J6249j4680j0527J8134M170j8784K286J7944q140j5370J3956
1470A886R940j7691l343J8514m107j6831J0060J3021j4382q168J7588K491j9024
1483a0046M886J7987j1363j3621J5254Q461j7936k452J8185l545j7383R539J3902
1496A1868j4649q127J7766J085j7487N021J5645j0411j2532J5178P434j8515l68
1509h092J9302o906j6928J3093J1860j6464o349J8365J94j8917O233J6339j2229
$$ y = [-3400, -11237, 8094, 9300, -11242, -4596, 13744, 381, -13183, 4378, 11671, -8431, -9387, 11152, 4590, -13729, -313, 12822, -4843, -10988, 8821, 7499, -10573, -3248, 12517, -495, -11970, 5045, 10398, -9022, -7110, 11663, 2840, -12283, 1399, 11987, -5383, -10408, 9015, 7281, -12005, -3352, 12897, -1783, -12310, 5824, 9994, -8790, -6504, 11440, 3300, -12070, 1886, 11826, -5865, -9208, 9306, 5199, -11632, -1572, 11449, -2933, -11101, 6487, 8978, -10046, -5160, 12827, 1464, -12157, 3097, 11558, -6378, -8830, 9355, 5810, -11573, -2034, 11868, -2781, -10908, 6858, 7943, -9544, -4523, 11122, 711, -11821, 3357, 10791, -7724, -8092, 11210, 4304, -12624, 469, 12329, -4135, -10484, 7881, 8075, -10842, -4609, 11730, -499]
1522d99j1666J6167N359j7224Q24J6926o202j4583J1604J0935j5711n420J8273
1535H783k184j7625Q311J4533j3405j0127J6740M628j8887K549J8258r147j4671
1548a2244J4385Q783j6604k781J6747k876j5507Q075J2821j2407q348J5326K828
1561H198j6201K911J4828p637j2851J1541R719j5806m544J8569k235j8444R815
1574b137J5031j4956r358J8448K808j9810M317J8225j1644j3702J6638O368j8456
1587h228J210J6797p227j3187J1716R102j4653l807J6040j997j4797O485J2558
$$ y = [-499, -12165, 4002, 9361, -7863, -7039, 9887, 3685, -10898, 706, 11641, -4070, -9490, 8783, 6599, -11026, -2715, 11818, -1587, -11714, 5026, 9654, -9233, -6684, 11574, 2427, -12244, 2141, 10924, -5680, -8461, 8286, 5410, -10097, -2022, 10799, -1608, -9956, 5370, 8198, -8003, -5092, 9736, 2099, -10752, 789, 10508, -5298, -9842, 8727, 6492, -11952, -2137, 12894, -2062, -11420, 7028, 9836, -9974, -5657, 12568, 924, -12778, 3860, 10228, -8228, -7018, 9779, 2552, -10635, 1081, 10183, -4470, -8277, 7763, 5766, -9031, -2546, 10012]
$$ [...]
8191a01
##END NTUPLES=NMR FID
##END=
