##TITLE=1H_3E1603 AN
 CD3CN
 8 sc, 
 17.3.2023
##JCAMPDX= 6.0         $$ Bruker NMR JCAMP-DX V2.0
##DATA TYPE= NMR FID
##DATA CLASS= NTUPLES
##ORIGIN= UXNMR, Bruker Analytische Messtechnik GmbH
##OWNER= root
$$ XWIN-NMR		Version 3.5
$$ Fri Mar 17 14:42:54 2023 Russian Standard Time (UT+4h)  she@DPX200
##.OBSERVE FREQUENCY= 200.13135
##.OBSERVE NUCLEUS= ^1H
##.DELAY= (6, 6)
##.ACQUISITION MODE= SIMULTANEOUS
##.ACQUISITION SCHEME= undefined
##.AVERAGES= 8
##.DIGITISER RES= 18
##SPECTROMETER/DATA SYSTEM= spect
##.PULSE SEQUENCE= zg30
##.SOLVENT NAME= Acetone
##.SHIFT REFERENCE= (INTERNAL, Acetone, 0, 15.7039)
##AUDIT TRAIL= $$ (NUMBER, WHEN, WHO, WHERE, WHAT)
$$ ##TITLE= Audit trail, XWIN-NMR		Version 3.5
$$ ##JCAMPDX= 5.01
$$ ##ORIGIN= Bruker BioSpin GmbH
$$ ##OWNER= she
$$ F:/spectra/data/she/nmr/H-F/1/audita.txt
$$ ##AUDIT TRAIL=  $$ (NUMBER, WHEN, WHO, WHERE, WHAT)
(   1,<2023-03-17 14:41:55.73 +0400>,<she>,<DPX200>,
      <created by zg, POWCHK disabled, PULCHK disabled
       configuration hash MD5:
       00 E9 B6 7A A2 85 ED C7 34 08 36 98 17 FE 4E 26
       data hash MD5: 16K
       9D DC 11 1B AD 20 AD 47 3D D1 48 BE 37 D5 F6 A6>)
$$ ##END=
$$ 
$$ hash MD5
$$ 36 CB EC 09 A6 02 86 02 A0 DE 14 3D 1B 26 37 C5
##$RELAX= 
##$RELAX= 
##$RELAX= 
##$RELAX= 
##$RELAX= 
##$RELAX= 
$$ Bruker specific parameters
$$ --------------------------
##$DU= <F:/spectra>
##$EXPNO= 1
##$NAME= <H-F>
##$PROCNO= 1
##$TYPE= <nmr>
##$USER= <she>
##$AMP= (0..31)
100 100 100 100 100 100 100 100 100 100 100 100 100 100 100 100 100 100 
100 100 100 100 100 100 100 100 100 100 100 100 100 100 
##$AQSEQ= 0
##$AQ_mod= 1
##$AUNM= <au_zg>
##$AUTOPOS= <>
##$BF1= 200.13
##$BF2= 200.13
##$BF3= 200.13
##$BF4= 200.13
##$BF5= 200.13
##$BF6= 200.13
##$BF7= 200.13
##$BF8= 200.13
##$BYTORDA= 1
##$CFDGTYP= 0
##$CFRGTYP= 5
##$CHEMSTR= <none>
##$CNST= (0..31)
1 1 145 1 1 1 1 1 1 1 1 1 1 1 1 1 1 1 1 1 1 1 1 1 1 1 1 1 1 1 1 1 
##$CPDPRG= <>
##$CPDPRG1= <>
##$CPDPRG2= <>
##$CPDPRG3= <>
##$CPDPRG4= <mlev>
##$CPDPRG5= <mlev>
##$CPDPRG6= <mlev>
##$CPDPRG7= <mlev>
##$CPDPRG8= <mlev>
##$CPDPRGB= <>
##$CPDPRGT= <>
##$D= (0..31)
0 1.2 0 0 0 0 0 0 0 0.06 0 0.03 0 0 0 0 0.0002 0 0 0 0 0 0 0 0 0 0 0 0 
0 0 0 
##$DATE= 1679049715
##$DBL= (0..7)
120 120 120 120 120 120 120 120 
##$DBP= (0..7)
150 150 150 150 150 150 150 150 
##$DBP07= 0
##$DBPNAM0= <>
##$DBPNAM1= <>
##$DBPNAM2= <>
##$DBPNAM3= <>
##$DBPNAM4= <>
##$DBPNAM5= <>
##$DBPNAM6= <>
##$DBPNAM7= <>
##$DBPOAL= (0..7)
0.5 0.5 0.5 0.5 0.5 0.5 0.5 0.5 
##$DBPOFFS= (0..7)
0 0 0 0 0 0 0 0 
##$DE= 6
##$DECBNUC= <off>
##$DECIM= 32
##$DECNUC= <off>
##$DECSTAT= 4
##$DIGMOD= 1
##$DIGTYP= 9
##$DL= (0..7)
0 120 120 120 120 120 120 120 
##$DP= (0..7)
150 150 150 150 150 150 150 150 
##$DP07= 0
##$DPNAME0= <>
##$DPNAME1= <>
##$DPNAME2= <>
##$DPNAME3= <>
##$DPNAME4= <>
##$DPNAME5= <>
##$DPNAME6= <>
##$DPNAME7= <>
##$DPOAL= (0..7)
0.5 0.5 0.5 0.5 0.5 0.5 0.5 0.5 
##$DPOFFS= (0..7)
0 0 0 0 0 0 0 0 
##$DQDMODE= 0
##$DR= 18
##$DS= 0
##$DSLIST= <SSSSSSSSSSSSSSS>
$$ [...]
##$SUBNAM2= <"">
##$SUBNAM3= <"">
##$SUBNAM4= <"">
##$SUBNAM5= <"">
##$SUBNAM6= <"">
##$SUBNAM7= <"">
##$SUBNAM8= <"">
##$SUBNAM9= <"">
##$SW= 18.05172834244
##$SWIBOX= (0..15)
0 0 2 0 0 0 0 0 0 0 0 0 0 0 0 0 
##$SW_h= 3612.71676300578
##$TD= 16384
##$TD0= 1
##$TE= 0
##$TE2= 300
##$TE3= 300
##$TEG= 300
##$TL= (0..7)
0 120 120 120 120 120 120 120 
##$TP= (0..7)
150 150 150 150 150 150 150 150 
##$TP07= 0
##$TPNAME0= <>
##$TPNAME1= <>
##$TPNAME2= <>
##$TPNAME3= <>
##$TPNAME4= <>
##$TPNAME5= <>
##$TPNAME6= <>
##$TPNAME7= <>
##$TPOAL= (0..7)
0.5 0.5 0.5 0.5 0.5 0.5 0.5 0.5 
##$TPOFFS= (0..7)
0 0 0 0 0 0 0 0 
##$TUNHIN= 0
##$TUNHOUT= 0
##$TUNXOUT= 0
##$USERA1= <user>
##$USERA2= <user>
##$USERA3= <user>
##$USERA4= <user>
##$USERA5= <user>
##$V9= 5
##$VALIST= <valist>
##$VCLIST= <CCCCCCCCCCCCCCC>
##$VD= 0
##$VDLIST= <DDDDDDDDDDDDDDD>
##$VPLIST= <PPPPPPPPPPPPPPP>
##$VTLIST= <TTTTTTTTTTTTTTT>
##$WBST= 1024
##$WBSW= 4
##$XGAIN= (0..3)
0 0 0 0 
##$XL= 0
##$YL= 0
##$YMAX_a= 542750
##$YMIN_a= -789562
##$ZGOPTNS= <>
##$ZL1= 120
##$ZL2= 120
##$ZL3= 120
##$ZL4= 120
##$ABSF1= 10
##$ABSF2= 0
##$ABSG= 5
##$ABSL= 3
##$ALPHA= 0
##$AQORDER= 0
##$ASSFAC= 0
##$ASSFACI= 0
##$ASSFACX= 0
##$ASSWID= 0
##$AUNMP= <proc_1d>
##$AZFE= 0.1
##$AZFW= 0.1
##$BCFW= 1
##$BC_mod= 2
##$BYTORDP= 1
##$COROFFS= 0
##$CY= 11.3945322036743
##$DATMOD= 1
##$DC= 2
##$DFILT= <>
##$DTYPP= 0
##$F1P= 2.36226072786647
##$F2P= -0.459571619588291
##$FCOR= 0.5
##$FTSIZE= 0
##$FT_mod= 4
##$GAMMA= 1
##$GB= 0.15
##$INTBC= 1
##$INTSCL= 1
##$ISEN= 128
##$LB= 0.24
##$LEV0= 0
##$LPBIN= 0
##$MAXI= 10000
##$MC2= 0
##$MEAN= 0
##$ME_mod= 0
##$MI= 1.114404
##$NCOEF= 0
##$NC_proc= 0
##$NLEV= 6
##$NOISF1= 3.799351
##$NOISF2= 2.8
##$NSP= 1
##$NTH_PI= 0
##$NZP= 0
##$OFFSET= 15.70392
##$PC= 1
##$PHC0= -19107.41
##$PHC1= 12.40075
##$PH_mod= 1
##$PKNL= yes
##$PPARMOD= 0
##$PSCAL= 0
##$PSIGN= 0
##$REVERSE= no
##$SF= 200.130013532006
##$SI= 16384
##$SIGF1= 3
##$SIGF2= 2
##$SINO= 400
##$SIOLD= 16384
##$SREGLST= <1H.CDCl3>
##$SSB= 0
##$STSI= 0
##$STSR= 0
##$SW_p= 3612.71676300578
##$SYMM= 0
##$S_DEV= 0
##$TDeff= 0
##$TDoff= 0
##$TI= <>
##$TILT= no
##$TM1= 0
##$TM2= 0
##$TOPLEV= 0
##$USERP1= <user>
##$USERP2= <user>
##$USERP3= <user>
##$USERP4= <user>
##$USERP5= <user>
##$WDW= 1
##$XDIM= 8192
##$YMAX_p= 0
##$YMIN_p= 0
$$ End of Bruker specific parameters
$$ ---------------------------------
##NTUPLES= NMR FID
##VAR_NAME=  TIME,          FID/REAL,        FID/IMAG
##SYMBOL=    X,             R,               I
##VAR_TYPE=  INDEPENDENT,   DEPENDENT,       DEPENDENT
##VAR_FORM=  AFFN,          ASDF,            ASDF
##VAR_DIM=   8192,          8192,            8192
##UNITS=     SECONDS,       ARBITRARY UNITS, ARBITRARY UNITS
##FACTOR=    0.0002768,     1,               1
##FIRST=     0,             0,               0
##LAST=      2.2672688,     0,               0
##MIN=       0,             -789562,         0
##MAX=       2.2672688,     542750,          0
$$ Real data points
##PAGE= N=1
##DATA TABLE= (X++(R..R)), XYDATA
$$ [...]
1917c76M25m01J695n07k126N92Q32o1P22k51j264N12L24l00J047r8j696Q05L95
1936B69q18Q89N53j748N77R26j343O56J306k077J5K114j741o59K309j249j350
1953a371K792p03k553K567K95k604J861J224l194R69K667k264o18K217j721j140
1969a576K832l07k100R95J78p21J270O71j632n56L59M20Q89J54n99j232n66J532
1987A1J116o44j76l01j971R86K957j215j509J508j752j469M348K85l975J581O79
2004D59k871K582L379m460j341L513k002l33M255k410m505L680J310k235K830
2019A851j5n251J575L677j478L65J008l788r83M207N08j133L38j912j808K496
2035c43K560q33j209j386n58J173J792J038j826k489N45J960J47J102J01l922
$$ plain form
1917 -376 49 -352 1343 836 -1290 -698 134 73 795 544 -720 -208 116 -184 863 765 -931 -126 269
1936 269 -549 340 893 -855 -278 648 -695 -39 1267 -810 -795 1319 -422 -1081 1228 -21 -1371
1953 -1371 1421 718 -1835 732 1027 -1577 284 1508 -1686 -717 1950 -314 -932 1285 -436 -1576
1969 -1576 1256 949 -1151 -156 22 -699 571 1242 -390 -946 -587 -167 722 876 277 -955 -1521 11
1987 11 1127 483 307 6 -1965 -979 1978 763 -746 762 -990 -2459 1889 2174 -1801 -220 459
2004 459 -2412 170 3549 -911 -2252 1261 -741 -1074 3181 771 -3734 -54 1256 -979 1851
2019 1851 1836 -3415 -1840 1837 359 724 1732 -2056 -3039 1168 1676 543 881 -1031 -2839 -343
2035 -343 2217 1384 175 -1211 -1769 -596 1196 2234 408 -2081 -1536 424 571 1673 1774 -2148
2051b148p29M166J14j353J896k802l120M890K325l886J170k2m649L412N292m131
2067D25k249K721l281k68O802j631n525K520K34k449M795K168o257o36L333j790
2083a088J285L892m015l614L113P98n85K581q77m443J038K700J57J98q7k624j040
2100b611K815J795p06j644r77j05R86K258K49l132j186J915M64P86J751k980l127
2117c449K741K420j186J400o77m617R70M583r13j101J691l650k184N247J516l131
2133c40J188o96m105L226M442l113j449J558k683R3M593p15l705J189N49j588
2149a556K780J473l927j042K705k36P2J634j983k901K445J957p11p5l79k364J93
2166a915L288M65j317n20j075q39K136K069j185j700k00m56M02K417J38k349m54
$$ plain form
2051 -2148 -2877 1289 1403 50 1946 -856 -3976 914 3239 -647 523 501 -4148 -736 4556 425
2067 425 -1824 897 -2384 -2652 4150 2519 -3006 -486 -252 -2701 2094 4262 -1995 -2631 702 -1088
2083 -1088 197 4089 74 -3540 -427 371 -214 2367 1490 -2953 -1915 785 942 1140 1053 -1571 -2611
2100 -2611 204 1999 1293 -351 -1328 -1433 -447 1811 2060 -1072 -2258 -343 121 907 2658 -322 -3449
2117 -3449 -708 1712 526 1926 1249 -3368 -2398 2185 1272 171 1862 -1788 -3972 1275 2791 -340
2133 -340 848 152 -3953 -727 3715 602 -847 711 -1972 -1879 2714 1999 -1706 -517 32 -1556
2149 -1556 1224 2697 -1230 -2272 433 197 269 1903 -80 -2981 -536 1421 710 635 256 -2108 -1915
2166 -1915 1373 1838 521 1 -1074 -1913 223 2292 1107 -593 -793 -1249 -847 1570 1708 -641 -1095
2183a095N13J03Q69J612j904j885J487Q74n91Q59j2k225K22K410o75o11M36j178
2201g91n68K193N69j880J74L49j248J064K355j695j661R98j46m63K101N4k511
2218a106K39J142n74M94J530k002j318J793M8m62J362n55k016R12J315q57K47
2235A92N96j388l00J582j52q65M51k89o09J052M95q71k17L37l26J66P71m30o43
2254d48K85J48j10L15J22k14p05M36K87p3r3L13m31k79M97K29l93N7J52n12K67
2275a50N16l60j3K30o57o7Q55k70o22P54N0q88O32M72p34J51M14m81k53N56oj60
2297c1J85j01n60M90L13l84J01K06o58K77M36k15m35L79k95j2P17M1o49j1J11
2318i5J6K27L23l26l68Q9r6L18K36k01n03J66K22J11N6L0l13j77M5L25K44q3n35
$$ plain form
2183 -1095 -582 -479 390 2002 98 -1787 -300 574 -17 842 830 -1395 -1173 1237 562 -49 387 -791
2201 -791 -1359 834 1403 -477 -303 46 -1202 -138 2217 522 -1139 -141 -287 -750 1351 1405 -1106
2218 -1106 -867 275 -299 195 1725 -277 -1595 198 246 -216 1146 591 -1425 -513 802 -55 192
2235 192 788 -600 -900 682 530 -335 116 -173 -782 270 765 -106 -323 14 -312 -146 625 195 -448
2254 -448 -163 -15 -125 190 312 98 -607 -171 116 43 -50 263 -168 -447 50 279 -114 -57 95 -417 -150
2275 -150 366 6 -7 223 -434 -501 354 84 -538 216 266 -622 10 482 -252 -101 313 -168 -421 135 129 -31
2297 -31 154 53 -507 -17 296 -88 13 219 -439 -162 274 59 -376 3 -292 -304 413 454 -195 -206 -95
2318 -95 -79 148 471 145 -223 -134 -230 88 324 123 -380 -214 8 119 175 205 -108 -285 -240 85 329 246 -289
2341b89j7J93K89J34Nm68n17M57O83o3k65m57j57L35N85q3p0n04l57M29O08k60
2363B11j4J13p25j37Q47J04k85j22l00j27P11L03n47j3k35o01J079M14o84j84
2383a92J29n44N35Q62o35n01K15o9J94P88m45q90L86J13n5O49j12r84J04N29j09
2404c2L91Q2q21P1K01J7M07K30n67o63N33K75J52J67n73m04L10L52J92L14q15
2425a81l81M72L48j18L99n52o83Q05l4QL14l14q01N86O35n65K01J07p97K86R09
2446F44o40k12N65p36j46R73q3o30K71p9q30J053P61j046j74K89o06M30Q88k20
2466D72p24%l8j7P45J76n57m73j09L67M86O9j04m32m09P20J44l70L38J02r56K89
2488b81Q31p73J1Q04p96n76J425m67r39J145k30r27J032O46j710N66P51r47J02
$$ plain form
2341 -289 -306 -113 176 310 315 -153 -670 -213 470 407 142 -315 -472 -137 448 365 295 -209 -566 -137 471 211
2363 211 197 310 -415 -552 295 399 114 -8 -308 -435 276 579 32 19 -216 -817 262 676 -8 -192
2383 -192 -63 -607 -72 790 155 -346 -131 -200 -6 782 337 -553 -167 -54 -109 540 428 -556 -452 77 -32
2404 -32 359 441 -380 -309 -108 -91 316 546 -21 -684 -151 124 276 443 -130 -534 -224 128 320 634 -181
2425 -181 -562 -90 258 140 539 -13 -696 109 75 83 397 83 -718 -132 503 -62 139 246 -551 -265 644
2446 644 4 -208 357 -379 -525 448 365 -265 6 -73 -903 150 911 -135 -309 -20 -626 -196 692 472
2466 472 -252 -252 -290 -307 438 614 57 -416 -525 -158 328 397 293 -139 -548 172 316 -54 284 386 -570 -281
2488 -281 550 -223 -212 592 -204 -780 645 178 -761 384 154 -773 259 905 -805 -239 512 -435 -333
2507c33J502j289q87J242k5o26J258m22j538P85P49p77Q24M49j450j97J046k37
2525G4p8M50n12o28M86K57K14j57m5m34R2J95L80j01o32M25j09m40P46M90j177
2546e04M7R62p39j60J229j094p00J662k96r03Q63O1j891J308J733j917K27J061
2564I49k176J36K617j072j357J720q50j656K119P58j779P09O34k050O96J752j000
2581A50n12J100j039n98J520P2j105M54K20o23J19P47q73M7M59J9l85R5K71l18
2601a80k19R16L1j032K18N24n36J70J101q11r61R05p9p67J521O3j759N38R67j390
2621g80N86J356j282q08J502n69q80J740Mj807Q00O96j493Q11J143j304l72J403
2639G46r08n48J116N6j058R48K77j297L35Q41n31j06N75m73n90P07K27n06L35
$$ plain form
2507 -333 1169 -120 -1007 235 210 -416 842 420 -1118 -333 416 -361 463 912 -538 -735 311 74
2525 74 -4 446 -66 -694 -208 49 263 106 61 -373 -281 -86 294 193 -439 -14 -123 -563 183 673 -504
2546 -504 -457 505 -234 -394 835 -259 -959 703 407 -496 367 428 -1463 -155 1578 -339 -112 949
2564 949 -1227 -1091 1526 454 -903 817 -33 -1689 430 1188 -591 118 752 -1298 -602 1150 150
2581 150 -362 738 -301 -899 621 693 -412 42 262 -361 -242 505 -368 -321 138 157 -228 -133 138 -180
2601 -180 -399 517 548 -484 -266 258 -278 -108 993 182 -779 126 47 -720 801 864 -895 -357 610 -780
2621 -780 -194 1162 -120 -928 574 5 -875 865 869 -938 -138 558 -935 -124 1019 -285 -657 746
2639 746 -162 -710 406 462 -596 352 629 -668 -333 508 -23 -129 446 -27 -617 90 317 -189 146
2658A46L00p69k15Q15j38o80Q75j48q35M49P30r31K19R31p56p74R36Q3q36J006
2678D08R0r82K97O17q30J03J196q34o05O03j01o04J274P4j110r4O46n33K67P91
2698F73m26o76K29J59J2L47N6n64j34O65l27k40M32l48m57P05O06j108r8Q31l87
2719e0l92J025j67j205N43M09m16M04N82r09n62R50m8k60R27r86r08R12M11k51
2739IN62N6j576L14J155j59l29J74n77m25R96L33l70j59m47k64P66O41n67l43
2759b10j22m4J75O71Nn83o15M90N03O9Lk47o48j97J023N04o05n35k7k4N01O56
2781G43l29o49k65k51Q94Q54o13q29J2N6K06J065l6j263l92O15K97K50L75j026
2801b86m61M50K94N60L63j247n94Q15N63j63K85m90r72J86J149J13r2o96n30M75
$$ plain form
2658 146 446 -323 -538 277 139 -541 334 186 -649 -200 530 -401 -182 749 -7 -781 155 238 -598 408
2678 408 498 -484 -187 430 -400 -297 899 65 -540 63 -38 -642 632 706 -404 -498 148 -385 -118 673
2698 673 247 -429 -200 -41 -29 318 374 -190 -324 341 14 -226 206 -142 -599 106 712 -396 -494 337 -50
2719 -50 -442 583 416 -789 -246 163 -253 151 733 -176 -738 212 164 -96 831 -155 -1063 -151 260 9
2739 9 571 627 -949 -635 520 361 32 206 -371 -796 200 533 163 4 -443 -707 59 700 133 -210
2759 -210 -332 -376 -201 470 475 -108 -723 -233 270 339 342 95 -553 -750 273 777 172 -363 -390 -414 87 743
2781 743 414 -235 -500 -751 143 997 384 -445 -433 -377 -171 894 858 -405 -797 -182 115 365 740 -286
2801 -286 -747 -297 -3 557 920 -327 -921 -106 457 294 579 89 -883 -697 452 565 473 -223 -753 -278
2821b78M01M65J63r00q21M24R55M38m54n07m65J17O86N19j63p73o25L46P91K75
2841E94j42n27o23j35J008O89m13q69k42M72M08K10o2o39m07K79Q23N17p65m20
2861b44l03L31K78P30j47r97o84O11R18R8k80n01m62P6O50Q02j04j199m65P31
2881a61N48J51l01l49n24j67J180M48m99r10P2L86L78K26j44n45o48M53J073P7
2901G44p34l35p0k5N99M00Q7r97m82N55O32M6n16Q1j69k39N99O15o32n14k9K74
2923a10K29R8Q4l69l98K4P18L31o46m79L31K49q9M55o2q57q6O08M45k62k43l63
2945c92J89J08L68K71j48q54k01P98L69m65M1L2l22l25O30P01p37l89K94K00j78
2966a0J66l5j43l61J74M77l9k67j92L24Q6k56j32M48m53k30P15O6o21n5O87k88
$$ plain form
2821 -278 123 588 751 -149 -970 -546 409 847 393 -114 -579 -462 224 743 580 -193 -818 -472 319 594
2841 594 452 -75 -698 -833 175 864 451 -418 -660 -188 220 430 368 -271 -678 -399 424 941 176 -244
2861 -244 -547 -216 62 792 645 -352 -1036 -425 493 591 311 -190 -652 -576 74 876 772 -427 -892 -161
2881 -161 387 538 237 -112 -636 -803 377 825 326 -584 -512 -126 252 478 334 -211 -859 -406 667 744
2901 744 10 -325 -395 -420 179 579 666 -331 -813 -258 374 420 -96 -15 -184 -423 176 791 159 -355 -384 -110
2923 -110 119 217 301 -68 -466 -442 276 607 -39 -518 -187 62 -27 428 366 -491 -577 31 476 214 -29 -392
2945 -392 -203 -95 273 544 396 -458 -659 139 508 43 84 116 -206 -531 99 800 63 -326 -32 168 -10
2966 -10 156 121 -22 -383 -209 268 229 -38 -230 94 180 -76 -208 240 -213 -443 272 338 -283 -338 349 61
2988F1k32M94j25m76J47K79n7J88j76n33O01J72p95N86L50q93j3Q21k89n76O02
3009A36J69l58r2L55k93j77J61J72L22k22n90L3N30P3k20N25l48q29L53N59M08
3030F67p45j12R9l07K22Q02P1r15j65K20K13J23J51n34j10L99k79L29M93q94n12
3051g84J306k37m88M19Q9j086N33J214o39o99L02n84J38J059R4q15J1m30o4J417
3071G56L84j463k98M38l81N81J071n66j347J40O92K66J21M1q63k85M06O95K24
3090F12k24j058k6N76O27r2l20j03n50J49Q75M87j290k73N46j31L74P05o65j399
3110a180P25M61M92M04n20j557M68R28K81J41K8j797l41J919L28l99l8n84j060
3129a301Q67J567k82q40m52l12K45J125K70j007k33j23N4R44N47j156p99O14K41
$$ plain form
2988 61 -171 323 198 -278 -131 148 91 279 103 -430 171 343 -452 134 484 -409 -422 399 110 -466 136
3009 136 305 -53 -145 210 -83 -260 -99 73 395 173 -417 -384 146 219 -1 524 176 -653 -300 259 667
3030 667 -78 -190 -91 -398 -176 626 697 -218 -383 -163 50 173 324 -210 -320 79 -200 129 622 -272 -784
3051 -784 522 285 -203 216 305 -781 -248 966 327 -372 -70 -654 -516 543 637 -178 -167 -597 -661 756
3071 756 1140 -323 -621 -183 -564 17 1088 522 -825 -685 7 273 394 435 -428 -713 -307 388 612
3090 612 388 -670 -696 -120 507 415 95 -8 -558 -409 466 953 -337 -610 -64 -195 179 884 219 -1180
3110 -1180 -455 6 498 902 382 -1175 -707 221 502 643 671 -1126 -1467 452 780 381 343 -241 -1301
3129 -1301 -434 1133 851 11 -441 -753 -508 617 887 -120 -353 -476 -422 522 1069 -87 -886 -272 -31
3148c1J70P60n50j376O0J527L2k94n7q09o62J393R01l71o49n95o74J237J384r73
3168D23o91j43o16N18J739k01j510j53J72RQ66N55q26r94L02N56L22N13q10p70
3188g39M00M52J56L71m95p88k84J182O09l98n55l83l24O58J103j9j334o57O50
3207c95M84N71K25j160o62N91N50L68M80j049j193Q61P21r8L55j86j466J04J438
3226E39J65n69O1q10m50J230N63n65k45j03n82P99O14m79k86J5n51L57J128l53
3246D78q24k37K48J55N43p7o15k76K84M16M74j99p11l30K62N89L13j78l96l72
3266d53R8M89N73l97o28Q7r2K75M88M4p26j02L67RN2L43o55k81M65K60k14L17
3288C19n55k20M26L08k52R4m8n98L83O22l31j35q0k88J72L74J19m14j08O9j33
$$ plain form
3148 -31 139 899 349 -1027 -967 560 592 298 241 -568 -1230 163 1064 693 44 -551 -1225 12 1396 423
3168 423 -268 -411 -1027 -509 1230 1029 -481 -634 -462 -453 413 968 142 -852 -550 6 328 841 31 -739
3188 -739 -339 113 269 640 145 -643 -927 255 864 466 -89 -472 -796 -138 965 946 -388 -1045 -395
3207 -395 89 660 885 -275 -937 -346 204 572 1052 3 -1190 -329 392 294 649 463 -1003 -899 539
3226 539 704 135 196 -614 -1064 166 729 164 -81 -184 -766 33 647 168 -118 -103 -654 -297 831 478
3246 478 -346 -583 -335 -180 363 286 -329 -605 -321 95 569 370 -341 -671 -409 180 493 315 -81 -453
3266 -453 -355 134 707 310 -318 -231 -323 -48 440 484 -242 -344 23 32 84 427 -228 -509 -44 216 2 319
3288 319 -236 -456 -30 278 26 120 72 -526 -143 479 148 13 -67 -355 -183 191 310 -104 -212 -143 -276
3309b76M34J68l44k11K58j20l0K40j88k06K81K21k29p7J02l9J00j26J31J3m0k02
3331a40J31J32P6j90j75J35J29m0J63j99k57P7M54m4k84o2k02K47J33J80j60k68
3353a64q9K42J55J62m39n1m9J04K74J22l04k13LK85L92j95j71m48J12K65M00M2
3375D35n54j62n6K74K82L7l65j99l5M81K00m2l52n03K26L57J84K20n19n15K89
3396c17M76J93n4m48m40J2Q53K23j98l74n67K55O23K91l13m47l65L16M90L88k41
3417C56o64k28J9Q63K47j58p62k18K11M63N18qr60k61K87N06N37m79o03k69J75
3438d28N47M67j50p96k32N6Q47L95l54o95k84K21P85L23l04r34p9K82O58N12m12
3459D25q86k73N99L99L46j31q90m92O85P47J23k92o15o30M31R79J81n06n05l96
$$ plain form
3309 -276 158 326 -18 -229 29 -91 -121 119 -69 -275 6 227 -2 -79 23 -16 84 -42 89 102 62 -140
3331 -140 -9 123 199 9 -166 -31 98 58 221 22 -235 -158 296 252 -32 -94 -296 -49 84 264 104 -164
3353 -164 -253 -11 144 306 -133 -184 -233 -129 145 267 -37 -250 -247 38 430 235 64 -384 -272 -7 393 435
3375 435 -119 -281 -337 -63 219 256 -109 -308 -343 138 338 296 -56 -559 -333 24 208 428 -91 -606 -317
3396 -317 159 352 298 -150 -590 -578 275 498 300 -74 -641 -386 237 528 215 -232 -597 -281 209 597 356
3417 356 -308 -536 -517 346 593 435 -327 -545 -334 129 647 639 -321 -582 -295 211 748 269 -334 -603 -428
3438 -428 119 586 436 -360 -592 -536 311 706 352 -343 -627 -406 379 702 398 -536 -615 -333 325 837 425
3459 425 -461 -734 -135 264 610 479 -411 -903 -218 529 652 360 -255 -885 -454 525 706 200 -305 -701
3479g01J66R60M06o40o67k75J98R72M85p05q75J3M68N34L90k31r48m07Q28N85
3499E56L02n95n90n26N44Q21N5k91o17n12L43J239j01n87k85l45K24R30K52q73
3519e6l63J5K1O66O11o08q62J93L22L13L22k14r99k6O99M14R2k56q28k33P77O44
3541F44k37m27l24l61N75P75Q5q96j81j82K44Q09K83p26o46K19J3M00P44o76p08
3562e73J06N76jL36j8j073N0P70j00J46n4m37k93O66K83j64l12k42q3L31O74k85
3584C03n71N0m4J49O18K1p48l33M26J99K02K22m65n79K59M80PJ09R9q41l03R57
3606B17J65m24J72j38o27M78O55n34L0o8q9q3O17l01n17M20o3k23M72L9n70j29
3628e01O81l9k40L17l64l81M67N05l53j1k42p3NN79o5l82K57k34l53N54K77m84
$$ plain form
3479 -701 -535 425 831 191 -476 -751 -553 419 904 199 -676 -663 -195 339 729 498 -450 -857 -29 556
3499 556 858 263 -327 -853 -309 512 567 276 -341 -853 -510 729 628 41 -244 -589 -365 565 817 -56
3519 -56 -419 -404 -383 283 894 286 -576 -383 -61 252 574 360 -639 -665 34 448 540 284 -544 -777 0 644
3541 644 407 -20 -344 -705 -130 645 730 -166 -347 -529 -285 524 807 81 -565 -346 -333 67 811 135 -573
3562 -573 -467 109 108 444 426 -647 -597 173 73 219 165 -272 -565 101 384 220 -92 -334 -417 -86 588 303
3584 303 -268 -218 -262 -113 505 526 -222 -555 -129 70 272 494 29 -550 -291 189 196 305 404 -437 -740 217
3606 217 382 -42 130 -8 -635 -157 498 -36 -6 -74 -163 -246 371 70 -447 -27 -90 -313 159 198 -372 -501
3628 -501 180 141 -99 218 -146 -527 -60 445 92 81 -161 -234 -229 350 285 -97 160 -74 -427 127 404 -80
3650h0o0L27k55k19N41l4l86K28J65n91M02K80n16r1P92m34k08L07p2m34O32n8
3672B36n65M0M82l99L28M17o04l48M91Rm7K19q3n14k30P38j76P4R8j11l46K95
3694DK96l72r9K98j08j19K87j78l38L91J44l11L55rn38RO34r2l81L38k98m28N33
3717A8N17n30m7J11o73O32M91k93l85L16l27l51Q82M7o70J56j42O4K99M06n92
3738g1j73mN9L94r1j8l53N6K43K26j40m3k34j14M44K96j99l35k98JM23L16%l91
3762fm94K23L44J60L16n78m69M18K66k4L98o16m12K11O34j61K9o6o51P8N74L45
3784E19k24m14k68kN84K85l48o1l89rK83N35l79l66o5j48L70N18l1n77k59J15
3806c31M95K81j79l86m51L90K38M48j49o27j11N2N31J84j56n60J3n8N66K64j56
$$ plain form
3650 -80 -140 187 -68 -287 254 220 -166 62 227 -364 38 318 -198 -289 503 69 -139 168 96 -338 294 236
3672 236 -329 -289 193 -206 122 539 -65 -413 78 87 40 259 176 -338 -568 170 -6 68 166 55 -291 4
3694 4 300 -72 -171 127 19 -100 187 9 -329 62 206 -105 250 241 -297 -288 346 254 -127 211 -87 -515 18
3717 18 535 5 -42 69 -604 28 519 226 -159 157 -170 -521 361 408 -262 -106 -248 -184 115 521 -71
3738 -71 -244 -248 -189 205 114 96 -257 -201 42 268 128 85 -149 -263 181 477 278 -57 -355 -354 69 385 385 -6
3762 -6 -500 -277 67 227 543 -35 -504 -86 180 156 554 -62 -474 -263 371 210 239 173 -478 -400 174 519
3784 519 295 -119 -387 -389 195 480 132 71 -318 -327 -44 491 112 -254 -319 -467 -97 421 390 -187 -446 -331
3806 -331 164 445 266 -120 -571 -181 57 505 356 -271 -382 -330 201 385 229 -331 -318 -376 190 454 298
3827B98m56n6k52N12L61k94l18k82M18J04J74k61k36q7J54K48K59k19k76r0R1
3848b08N26j21j58k81k39L67L76Q1p2m78k34O3O33K41l43k51l17J42L16M40l03
3869A80m69j14K87M24q8j76l35j31J98M33m1j24j50j26J07M50q0l07j56p6J40
3890a54K19L58k91k28j09J36K33R2l00j60L2J69O6L28l41m35L50q6K29P8k37k45
3912b96J20J15K07N0j19l03K8L25P7k38l9q6j05K25J13Ol7k25K4J30K29m1q4k86
3936b10JK60m9M2M6k09kL03q4j94J65Q0k68K05No5q2j56L8M40J11l76j84K01j07
3961h9J30J07N5m52L07m7n3J36J01l54N0J18PJ72j38r8k2J86m4j26J56j15j2j56
3985a81J02J79j54J89q7M0o0M1j93r1P7L09l19L2N3k8P6K97j50q4L3l51J7L40
$$ plain form
3827 298 -158 -214 -466 46 407 113 -205 -487 -69 35 209 -52 -288 -375 -221 27 286 67 -209 -299 -208
3848 -208 318 197 39 -242 -481 -114 262 343 271 -207 -441 -378 255 496 153 -98 -415 -273 43 483 180
3869 180 -289 -403 -116 308 220 44 -291 -422 -224 209 168 44 -106 -232 -125 325 245 -62 -218 -294 -154
3890 -154 65 423 132 -96 -205 -69 164 256 -44 -204 -172 -3 63 391 50 -385 -35 -121 108 186 -51 -296
3912 -296 -176 -61 146 196 77 -226 -198 127 204 -34 -73 -159 -264 -39 74 80 43 -182 -158 -28 201 160 76 -210
3936 -210 -209 51 2 44 90 -119 -121 182 98 -96 69 149 -119 86 91 26 -56 -212 -174 266 377 1 -183 18 -89
3961 -89 41 148 203 -249 58 11 -42 94 195 -159 -109 9 16 188 50 -48 -70 116 72 -54 102 -13 -25 -181
3985 -181 -79 100 -54 135 48 88 28 69 -124 -215 -138 171 -148 -116 -63 -91 -15 282 132 48 81 -270 -253 87
4009H7J39m00J81o3l2J31Q4j67o3J19j61J69J68j42k06K35N9o3J1P7k47n9K72
4032A29j46K1MN5l16K19M1j72J32k38K68qJ93j46l03J07K15KJ0J71l40q5Q4L04
4056B01p7p5j4l29J36M22k16k5O9k88j7M57j76p1j6J31k62J18L67n55M9J16p5
4079a30o4L30k29j90K75Rq0L28j57l54L7L47N4j76N4p9p7Q3M13l61L3n9L8k34
4103a89L98P5l48M6J17k35J66K89l65k36M05p8r4J75m5k30L6K65j60O1L6j91N
4126i7J87L3m75J25M36l27K41J71l44j98J85jk1M05k36j52j39L44j11j12M40n88
4148b34k5M23j52l7K11k04k80L74R9k82R4J99m11J36J66O8m93L87K4m2M8M4j72
4171e9j91M69k89l8K60j32k64K73J86l09K8K85n01L8M98n0k57l6K10j84O9L70
$$ plain form
4009 87 226 -174 7 -56 -88 43 127 -40 -103 16 -145 24 192 50 -156 79 138 75 86 163 -84 -143 129
4032 129 -17 4 8 63 -253 -34 7 -165 -33 -271 -3 -11 182 36 -267 -160 55 57 67 238 -102 -187 -103 201
4056 201 124 49 35 -294 -158 264 48 23 92 -196 -213 244 68 -3 -19 112 -150 -32 335 -220 -171 -55 -130
4079 -130 -194 136 -93 -283 -8 1 -79 249 92 -262 -225 122 176 0 54 -25 -102 -19 394 33 66 7 45 -189
4103 -189 209 284 -64 -18 99 -136 30 319 -46 -282 123 45 -49 126 81 -149 -113 152 -8 53 89 -102 -97
4126 -97 90 123 -352 -227 209 -118 123 294 -50 -248 -63 -64 -85 320 84 -68 -207 137 26 -86 354 -234
4148 -234 -259 164 12 -25 186 -18 -298 76 175 -107 -13 186 -225 -89 77 145 -348 39 63 21 69 113 -59
4171 -59 -250 219 -70 -108 152 20 -244 29 215 -94 -66 219 -282 -244 254 204 -53 -89 121 -63 6 376
4193C76l90k0j87L69j00O7j11l12L36N0k50L12m2l16R7L08J9m90L51j17k14K53
4215a1K26l32j10R8K2J76J11j79p1j01l9K00J73P7m67J0L21j29m6K55q9l03J95
4238a3K89J4k50n0k33J54J72N7K5j74k39J32K07J49k42k09M05k91j53N15j15m13
4260b63o6L99N1pm2l66O2J69N1L04r5m09n5M68j18N8Q9n4l57l5M57j46j29K4P3
4285F3j22Q0K34j86k03j20P5J96J0jk64K27l02M06L14k83n14J49L62R1j81j12
4307h1K13l42l2L99J83m30J30J3J4pL7N4j08o5j63M24j63p1k04L66j56K1P8K7
4331A37m53J03L36mk05n1P7r4K56jM7j56j90n0N17l03j05J03P2l37K56M37l41
4354E1j66L6J60J1o9M6K0m9k79K76O1k39O8J77m0j00p5K8J98l85M2L87n6k61L7
$$ plain form
4193 376 -14 -34 -221 148 48 115 4 -308 28 78 -172 140 98 -218 -121 187 206 -284 67 -50 -264 -11
4215 -11 215 -117 -227 -129 -107 69 180 1 -70 -171 -210 -10 163 240 -227 -217 104 -25 -71 184 95 -208 -13
4238 -13 276 290 40 -10 -243 -89 83 140 165 -9 -248 -116 91 240 -2 -211 194 -97 -250 265 150 -263
4260 -263 -329 70 121 114 72 -294 -232 -63 -12 292 197 -212 -267 201 83 141 230 176 -181 -216 241 95 -34 -10 63
4285 63 -59 21 255 69 -134 -254 -179 17 27 26 -238 -11 -313 93 407 124 -390 -241 121 212 31 -81
4307 -81 132 -210 -242 157 340 -90 40 53 67 60 97 151 43 -22 -185 239 76 5 -199 167 11 32 110 137
4331 137 -316 -213 123 119 -86 -137 -60 -154 102 101 148 -8 -198 -248 269 -34 -139 -36 36 -301 -45 392 51
4354 51 -115 -79 81 92 23 69 89 40 -239 37 98 -141 -73 104 64 -36 -111 -83 115 -270 -228 159 103 -158 -121
4379a21J87k14O7J34l0rj79K53N1k30J8R8j18L9M7Q0k2l31j4N81k12l58L91k2
4403H6j66N4J13nk54J56K91p4l78J23R9mj63J84J6j84q5K78R5k33p9J93j6k11
4427a64J45J59p2n07M35O1K2k90K79l6k41K88Jm3J0j50%K97j7nJ48l72l73N53
4451A28L09n69m0j68J69j3J27J63l8l23J9M34K11j52m08J46j15j84N09J77m54
4472g2k60L10J21j45jJ94k55K7R8M65k75m99M0K75J22L0L7k33k38j2K42L33j18
4495A86m49J5P5J19K22M28p21l47K98M68lk28k20m8j11M15K27M0o50j78N50J24
4517B12j77k20K98m06O9L58K80m08j24o5J24J32K1K18j81l18r0M56J19k18k62
4538a82K2J28J14J71N7m58m23K96O43j70k34j3j07k57O32K89n25j12k00m1O14
$$ plain form
4379 -121 66 -148 -81 53 23 14 -165 88 139 -91 -73 25 -93 -54 -7 73 51 -280 -294 287 75 -283 108 86
4403 86 -80 -26 87 82 -172 -16 275 201 -177 -54 45 41 -122 62 78 -106 -191 87 182 -51 -130 63 47 -164
4427 -164 -19 140 68 -439 -4 57 79 -211 68 32 -209 79 80 37 47 -103 -103 194 177 172 320 -52 -425 128
4451 128 437 -132 -172 -340 -171 -184 -57 106 68 -255 -236 198 409 257 -151 -5 -120 -304 205 382 -72
4472 -72 -332 -22 99 -46 -47 147 -108 -81 17 482 207 -292 -252 23 145 175 212 -21 -259 -271 -29 304 186
4495 186 -263 -248 -173 -54 168 596 -125 -472 -174 294 291 63 -157 -205 -316 99 326 366 -284 -462 88 212
4517 212 35 -185 113 -293 -224 134 414 6 -118 -183 -59 73 94 312 131 -187 -277 179 298 80 -182
4538 -182 -160 -32 82 253 310 -148 -571 -275 368 198 -36 -49 -156 -413 219 508 -17 -129 -329 -370 244
4559B44J85n15m8j69Q1J88O15n44m88L14K19j30K39J22m03l91M98K97L7p1m38
4580a58k29M30J77R2Q6n80l71K48O98j55j14l14J01k70O01J50m87l20J78J66J73
4601A02K99k85k63q5K58K84j5k01j75k93L99R8j21J45j48m51L17N13l39J7j26
4622g0p2O5K03J42k59j46O2LJ78K3k24j35K2J79K26J63m42k52K09J89j51J60K8
4645A01k54k35M03K51k09j30J25l61L18J23q3n0m8j61OM98m3m27K63j02q3J49
4667E1M01m36l83M41P1O7k09J83k70j5J55oPj40J11j60L05j93r6K70k36k22L81
4690G7m2j05pJ05m2k66K93J54j53k5jL8L3o8j03O0R8j44J08o5J79j59l9J68l17
4715b23J27J79l09J58K79j76j12K0J21m3J74k25j92J50n1J16QK6j67P1K53q8j49
$$ plain form
4559 244 429 -86 -134 -303 -222 -34 581 37 -451 -137 82 -48 191 313 -90 -481 17 314 351 280 -158
4580 -158 -387 43 220 312 398 -182 -553 -305 393 238 124 -190 -89 -359 242 392 -95 -415 -237 -71 102
4601 102 401 116 -147 -232 26 310 295 94 -81 -374 25 123 2 147 -1 -452 -135 378 39 56 -70
4622 -70 -142 -77 126 268 9 -137 -75 -72 106 129 -95 -230 -208 -29 197 360 -82 -334 -125 64 -87 73 101
4645 101 -153 -388 15 266 57 -73 52 -309 9 132 49 -1 -49 -210 -204 294 251 -176 87 -15 -98 51
4667 51 452 16 -367 74 145 212 3 186 -84 -99 56 50 57 -83 28 -132 173 -20 -116 154 -82 -304 77
4690 77 35 -70 -77 28 -14 -280 13 167 14 -11 -12 26 59 -9 -112 -52 46 -98 10 -55 124 -35 -74 94 -223
4715 -223 -96 83 -226 -68 211 35 -77 -57 64 21 195 -30 -222 -72 -123 -7 1 27 -140 -69 184 96 -53
4738e3m5Q5k5J74j2J54m51Q3K24k9p7j27r5Q6J43P2k7l2r9k45J60K62m1j32j08
4763a55j0q7L60J8k33l0L4M5K88J7j59j56k22K49N8L77k98l48k5L88N4p3O3l24
4787a69j53M77J87j89j75j24p6J56L15Qm08Pj74M29N6K0k15k06o7L30L02M6n72
4810a95r4K1K81J20j3j59k76J32J97J39J69k17n08J72K82K97k2l84k51N2L65J51
4832B59j96k34l8j36L89M14k17l06k78M9L76K24n9n51r8J15L89K94k21l72j02
4853b99K2L99J93o1k53l06P8L00K59j59l01j86J11L74L69k17m87k68J76M88J74
4874D06k19k97k58M3M27M32k42n15p3K10K52P9j12j76k78O8K60M63k50l89l01
4895d70J05M34K23k38k67j21J10L36K73k30k00k89J25L29O9J2k94l79L08K07K19
$$ plain form
4738 -53 -98 -13 -38 136 124 278 -173 -90 134 105 28 -99 -194 -108 35 107 80 48 -51 -296 -136 126 85 -47 -155
4763 -155 -165 -252 108 126 -107 -137 -103 -58 230 247 88 -68 -290 -41 17 394 96 -252 -277 111 165 92 155 -169
4787 -169 -322 155 342 153 -22 -146 -222 -66 249 257 -151 -144 -318 111 167 187 -28 -234 -301 29 331 377 -195
4810 -195 -289 -268 13 133 120 -39 -315 -183 14 153 322 105 -403 -231 51 348 326 -58 -309 -257 108 259
4832 259 63 -171 -209 -345 44 458 241 -65 -343 -294 82 306 247 -304 -402 -287 102 396 175 -197 -299
4853 -299 -277 122 315 254 1 -305 -227 73 332 173 -128 -314 -203 171 540 323 -164 -432 -256 232 406
4874 406 187 -110 -368 -325 102 534 292 -223 -296 -86 166 245 133 -43 -321 -253 7 470 220 -169 -470
4895 -470 -365 69 292 54 -213 -334 -224 112 385 155 -45 -334 -209 120 189 201 -93 -472 -164 43 262
4916B62l9m26k0P5M78M4l99j64j61K32M33J0m5m68m4Q3K60J66Pl88n3J19O1L49
4940C72m33k55kJ57L10K10k12l28j06J33L22L52n35k46l4L13J78M0j22l04k9K33
4962A4J64J0j22j62J7J4K64L0k19j96LJ41K16O7j94l1j65J67J36q8k6j72M3kM6
4987d5J84j6l41n7L01Q6r9rj8j78K63J72k17j21J08p4J20J26j10j96K0J47j5J7
5011D8j00J0j02J55j03Q0J91j51k26K62Q0j22P3k79K63j17J26l17L58Nj21J77
5033A90j39j15P8l7j7K0m4Q6K4q2n5J78j31J40q8M6j11J92k2j24J7l2j03O9J54
5058I4j26o2Q2J53k16J98k98j26K30J02K6o7rj67R6K29o4r7K6n2q9L47j04K5l91
5083b60K99j97L38j52J06m06J97J03J19J43l20o2j15J68N6J4K2K0l35K53Q5J00
$$ plain form
4916 262 223 -203 -223 -148 330 374 -25 -189 -350 -118 315 325 280 -188 -232 -149 111 277 284 -104 -157 -38 23 372
4940 372 -61 -316 -318 -161 149 359 147 -181 -287 -154 168 520 -15 -261 -295 18 196 236 114 -190 -219 14
4962 14 178 188 66 -96 -79 -65 199 229 10 -186 -183 -42 174 241 47 16 -149 18 154 66 40 -132 -89 -91 -45
4987 -45 139 123 -218 -275 26 112 13 4 -14 -192 71 243 26 -95 13 -61 59 185 75 -121 -101 46 31 48
5011 48 -52 -42 -144 11 -92 -12 179 28 -198 64 144 22 95 -184 79 -38 88 -229 129 134 13 190
5033 190 51 -64 14 -23 -40 -20 -64 22 46 -36 -91 87 -44 96 8 54 -57 135 113 -11 6 -26 -129 -60 94
5058 94 -32 -94 -12 141 -75 123 -175 -301 -71 31 57 -10 -19 -186 -90 139 75 -22 4 -48 -137 210 106 131 -260
5083 -260 39 -158 180 28 134 -272 -75 28 147 290 -30 -92 -207 -39 17 31 53 73 -262 -9 76 176
5105A76q6m8l19K20J93P2j32o0j24j09K94L23j92l79J68j42L22K0j67k30N4J63
5127A7K16R7k62l38N1K51R1K16k91l46r7L27K64J09j94k10j53K16J92J23k51q6
5149e8k44P8N06O9l18k95M5J50K51J37l13l77R4K09J62J19J31o01j58N46N5J70
5171C58l50m01K4L56L67j87j05k91r7J30L48P2l42j36n1Q6M53K55m77l19RK46
5193e2J38J19j82l68R8K67J89J11j90k60o1J38N34j91k77j77j80L60M01k19m07
5214b09R4k31L99J57J06j69n05K29m3N24k2m61l18J85J91K51J32k14l67NM18N5
5236B07m0o2m99R0M67P0L5l19j84k9K54K07J59m80j38j04K18K84J87l92j77J5
5258b31J25K02K68l39k95K12K45P3l9r0m84J05J89K86p7k40k13pL99P6N0l25j04
$$ plain form
5105 176 90 42 -277 -57 136 208 76 16 -108 -217 77 400 208 -171 -3 -145 177 197 30 -200 -146 17
5127 17 233 330 68 -270 -219 32 123 339 48 -298 -395 -68 196 305 111 -99 -252 -36 156 279 28 -58
5149 -58 -302 -224 282 351 33 -262 -217 -67 184 321 8 -369 -275 -66 96 215 346 -255 -413 133 188 358
5171 358 8 -393 -369 -13 354 167 62 -229 -326 -196 152 224 -118 -254 -305 -219 234 489 12 -307 -298 -52
5193 -52 86 205 23 -345 -247 20 209 320 130 -130 -191 -53 481 290 13 -164 -344 16 417 198 -209
5214 -209 -115 -346 53 210 316 147 -358 -129 -172 352 330 -131 -449 -264 -73 178 310 96 -271 -266 152 207
5236 207 167 105 -394 -304 163 233 268 -51 -235 -264 -10 197 356 -124 -262 -366 -148 136 323 -69 -246 -231
5258 -231 -106 96 364 25 -270 -58 187 260 221 131 -353 -248 -59 227 150 -90 -303 -310 89 165 215 -110 -214
5281b14J9K14K62k09k65J75k88L00J93l9k64j53N2L08J74q6l68R0j02M34M9j74
5303A08k39q7K14k4K45j83M8k06K9j8J87k7j77R1q9K42K01k58j75N9RO6L9J2k25
5328a58OK1J24m7J32k3l21K21R2l7j99J38K04k92J20KJ01r6J24j80L03j19k53
5351a37K05m2j07J39l6j04J04P2q1M0N4k26J32j2k7j2J49k60J38M8j25L9K5k27
5375b51M55j75L5k61P5J1J50J08o9j14m3J07l4J88l25K08j34JJO4Q9j91K53k16
5399f8J58p0K39l42j28J72Lj45K74j29n5K5J17K03n0k23l5n2K18N9k32k5l7J6
5423a07M3J89k04Q1k55K55j32J41J96k61j27o5K40J78j22j77N2P1K0K45j96j05
5445d0o1J73K0K16k74m2l17J39K71J04q0l55KK20J40oJ5j97r0P0K27J27j58j91
$$ plain form
5281 -214 -195 19 281 72 -193 -18 -306 -6 187 148 -116 -269 -217 91 265 179 -189 -99 -201 233 282 108
5303 108 -131 -218 -4 -28 217 34 82 -124 -95 -113 74 47 -130 -39 -128 114 315 57 -118 -59 -50 16 55 67 -158
5328 -158 -152 -131 -7 -54 78 55 -266 -45 47 10 -189 -51 153 -139 -19 -17 84 -12 112 -68 235 116 -137
5351 -137 68 26 -81 58 22 -82 22 94 13 53 107 -119 13 1 -26 -38 111 -149 -11 37 -88 -49 -24 -251
5375 -251 204 29 64 -197 -122 -111 39 147 78 -36 -79 28 -6 182 -143 65 -69 -68 -67 -3 86 -105 148 -68
5399 -68 90 20 259 -83 -211 -39 -36 -181 93 -36 -91 -66 51 254 204 -19 -54 -106 112 171 -61 -86 -123 -107
5423 -107 -64 125 -79 2 -253 2 -130 11 207 -54 -181 -246 -6 172 50 -127 -75 -4 16 261 65 -40
5445 -40 -101 72 92 308 34 -8 -325 -186 85 189 109 -246 -244 -24 116 110 125 -72 -162 -92 135 262 104 -87
5469h7j47lM83mj0l82j15J96J56K33k58j24j44N5L34P4k3m03n6J92K70J66k48
5492A55m25L1k8L04K38k35j47r8K13n8L71j33l12j76L70O7Nj79rk29J81J76J55
5515B37Pm31M1O9L41m3n2k55l7Q6K15N0k52j63N3R7J28P4k20j78J54qL02q0o7
5540F8l39j4J84K44M5N3l03k26J50K33Q1j9j88l09J97K44J13n0l00n4J85J55J94
5563C44j24k68k88L13J57Q2Nm64rJ63J49K58j34m78Q1J20K83p6Pm4m25J27K72
5586E1R3l47K00k45K86J75j5j93k51J53oL67j58l33K3n8K38J55J19j40l10R2J95
5609I1k4J45j02k44n4M1J53R6Q5k91q6J69K49j25n1k49m5K80J47j28p2n3p9J96
5633D9LJ62l65j19J84J60j14J66k31N0j42L14K2O6j69k39J69L5J35j08rq4j37
$$ plain form
5469 -87 -234 -237 246 242 232 -150 -265 -69 87 320 62 -62 -206 -151 183 257 234 -169 -225 -33 237 403 155
5492 155 -270 -239 -267 37 275 40 -107 -205 8 -50 321 188 -124 -300 70 137 142 -37 -46 -275 -94 82 237
5515 237 244 -187 -146 -77 264 221 169 -86 -123 -37 178 228 -24 -187 -134 -37 91 165 -55 -233 -79 -87 215 135 68
5540 68 -271 -285 -101 143 188 241 -62 -288 -138 95 176 157 -31 -340 -143 101 214 164 -136 -190 -5 150 344
5563 344 220 -48 -336 -23 134 216 221 -243 -252 -89 60 318 184 -294 -213 -93 190 114 121 77 -348 -221 51
5586 51 144 -203 -3 -248 38 213 198 5 -246 -93 -99 268 110 -223 -200 -258 -20 135 254 114 -196 -104 91
5609 91 67 212 110 -134 -188 -147 6 102 187 -104 -190 -21 228 103 52 -197 -242 38 185 57 -15 -68 -147 49
5633 49 52 214 -151 -270 -86 74 -40 126 -105 -55 -197 117 139 205 36 -203 -34 1 136 28 19 -65 -202
5656b02J25K03Q9k44j86O4J42m5R7j65R5j06K24M3m6j52J19k0k16K14J49k71n0
5679a39K50j31p5L16j31o7j44J09M3O5j89j21K98n6K9RJ54k39o8L6J47j07P4q8
5703b5O5l6r3K13j55Mj32J79j00J21M2j87J55P3l27L35j06j29P0N5m8j34K14Q5
5727A39j77k1J53j50J54J21k44K4l8j4Q3J95n4k79R3j2O2k2pj37M7P7J30k34J27
5752A6R1j95l7J49P1k71J75J9%l6J75M4j77j97O5N5K07j97PN3p8k03L70j35M1
5777A2j65j33K81N5j1j23k7k0P4L32j63k44O6M2o1n0K53J1k71j04L67J53l16j41
5801a83J04p0J53K14l5j80j83j1L48m9Q6k28mo5J23K31k5k71k5j08K49J8j65O1
5825a5J52k33K07Lq0l05J42J43j36J52O8l6l15J6L19J24o2j81k6L4n0K49O2j23
$$ plain form
5656 -202 -77 126 215 -29 -215 -151 -9 -54 43 -122 -27 -133 91 134 88 -64 55 35 -181 33 182 -89 -139
5679 -139 111 -20 -95 221 90 23 -121 -12 31 96 -93 -214 84 28 57 66 220 -19 -87 -51 96 -11 63 -25
5703 -25 40 4 -89 124 -31 -27 -159 20 -80 41 83 -104 51 124 -203 132 26 -103 -33 22 -26 -160 54 139
5727 139 -38 -59 94 -56 98 219 -25 -1 -39 -53 30 225 171 -108 -15 -27 35 13 6 -131 -84 -7 123 -111 16
5752 16 107 -88 -125 24 95 -176 -1 18 18 -18 157 201 24 -173 -108 -53 154 -43 -36 17 -61 -264 106 -29 12
5777 12 -153 -286 -5 50 39 -84 -111 -131 -57 275 112 -132 -66 -24 -85 -135 118 129 -142 -246 121 274 -42 -183
5801 -183 -79 -149 4 218 183 3 -180 -191 157 108 194 -34 -38 -103 20 251 226 -45 -70 -178 71 89 -76 -15
5825 -15 137 -96 111 114 34 -271 -129 14 -122 30 98 62 -253 -237 82 206 144 -37 -63 -29 -79 170 232 109
5849A09l07J0K25R8L3k74Q4k4J24K48j06k69r9R0n3M46j70j22j16j16J87J32o6
5872F4j18j09J14o1K02Q8l89nM3L16J10q1k23n0p7J47K40k6k10k40J17L25k03
5895b6J85r2j72k85L04L57j61j00j88J49J05N4j07L8l54K19J24J00r5k23K51k05
5917a22J33J68j18l0l03K81M4J04k2j35r7k10K72J93M2k70j79Q6J01J23N4Qm33
5940c10Q1M50P4l54k25J90J05j09J33Q1k25p4N9R5K98l59J03k09Q3R0J80O7m17
5963a93N3n3K91n5l9J09j86l5J67J50k31K8r0Q9P2N1R8j23k86M5L5J31O3lo8j09
5989h9k8J41J6j20nP0J05j48R4j62J59q6P6k6K20k40k52K33J15k15j40N13l26
6012i5j42J69L02j43j58J10j09j11J87J37l8j48L0%j03J76r3J41k56Q0l6J64K6
$$ plain form
5849 109 -198 -188 37 135 168 -106 -22 -46 78 326 220 -49 -148 -58 -111 335 165 43 -73 -189 -2 130 64
5872 64 -54 -163 -49 -110 92 180 -209 -214 -171 145 255 174 -49 -99 -176 -29 211 185 -25 -265 -148 177 -26
5895 -26 159 67 -105 -390 -86 271 110 10 -178 -29 76 130 23 61 -293 -74 50 150 55 -168 83 -122
5917 -122 11 179 61 31 -272 9 53 157 135 0 -97 -307 -35 158 200 -70 -249 -163 -62 61 115 123 -310
5940 -310 -229 221 295 -59 -284 -94 11 -98 35 116 -109 -183 -124 -29 269 -90 13 -196 -113 -23 157 224 -193
5963 -193 -140 -193 98 43 4 113 -73 -108 59 209 -22 6 -84 5 77 128 226 103 -183 -138 -103 28 91 88 20 -89
5989 -89 -117 24 40 -80 -85 -15 90 -58 36 -126 33 -53 23 -3 217 -23 -275 -42 73 -142 -282 231 -95
6012 -95 -237 -68 234 91 -67 43 -66 -177 10 147 109 -39 -9 -9 -112 64 -29 112 -144 -64 -100 64 90
6035I0k79L11J54k20lj21K0J01j63J32j1j67J37m2o3J38k3M2J7k56K92Nk29K41
6059A03k0j03j29K96oj77j31K39m6l4J30j54K44l51K19J04j93m0J95k38J22j06
6081g6P0J51k1l53K49J53k64l1J24O9r1l7P0j09J24k8n9kpK48j37j77J41K9M3
6106G9j96J64J8oj06qJ51o7mk0m1O4J62j26J53l06K7J02l1r8J77k31J04k4k8K94
6132B03k81Qk4J13m2j38R2J36K6j23J39l4l6j31P9q1O6J78j45j55P1J11qJ53l34
6157a57M7N5j32K07J94k00j26K5NK13m9m6K2j56K31J1m9j1k17j9oL11j21j35Q1
6182b2j47J30L07J12l76j05k5K35n9j09l3J96k06O0P6J26r3k84L57j23R7k4oQ4
6206A68l10J49o9L9J41k98K3J04P4J28j59o3l3k1J82lJ3N8q0j57R5J60p6l48J92
$$ plain form
6035 90 -189 122 276 56 53 -68 -48 53 -110 22 11 -156 -19 -61 -124 14 -9 33 50 -206 86 91 -138 103
6059 103 83 -20 -149 147 141 -36 -167 72 26 -8 122 -32 212 -139 80 184 -9 -49 146 -92 30 -76
6081 -76 -6 145 124 -229 20 173 -91 -122 2 71 -20 -57 13 -96 28 0 -59 -61 -68 180 43 -134 7 36 79
6106 79 -117 47 65 59 -47 -55 96 29 25 5 -36 28 190 64 217 -89 -62 40 9 -89 88 -143 -39 -63 -91 203
6132 203 -78 -70 -94 19 -23 -161 -69 67 93 -30 109 75 39 -92 -13 -94 -28 150 5 -150 -79 32 24 177 -157
6157 -157 -110 -55 -187 20 214 14 -112 -87 -82 131 82 36 58 -98 133 144 95 84 -133 -152 -158 153 32 -103 -22
6182 -22 -169 -39 268 380 4 -101 -126 109 50 -59 -92 104 -102 -42 34 160 67 -217 140 17 114 90 84 168
6206 168 -142 7 -62 -23 118 -180 -157 -53 21 149 -10 -73 -106 -127 55 52 65 123 43 -114 -19 141 65 -283 -91
6231i1J42M1j49N3J5k19K38K13j45p5p6K17l24J09O7j64O1Oo3K21k3oj15m6N1
6256f2K72j42j1q8j00L46p5j32J55j59j01K60j52l3M8j04P1J43l2k27Q7K8j3N
6280a6J38k7m1m4j71J23P6J74j92J1l4L8o4K11k26j13J20P4J7J05k05Q6j32M8
6304d4Q2o0J3k6JJ68j00l2Lq8j1j87L77L8p2j25Q1l7R7m8j17j4M7P5J05q1j05
6331f0q6O7M6N0n8J15k18K19o9OL3K0k96K32N6l1n6Pj4K7M1M8j32l5M7L2n7J59
6359I3P9m8j71j49J37M7R4mj79K3M7M1J00Mk03K3M5j7k9J76j31rJ3R5o0J01j58
6386d0j0m9n0R2q3K04pr4l2K85l12l8K07p1J2O5j56L06j05O7k10K0k8p0J53R8
6412A54j87N9Kq3p8P9O7Q4j12K5j38J88j05L3j26L53k35q8J46l2O4j41J37j06
$$ plain form
6231 -91 51 92 -57 -4 11 -208 30 243 98 23 -53 164 -160 -51 16 -148 -87 -81 -144 77 54 48 -67 -113 -62
6256 -62 210 68 57 -31 -131 215 140 8 163 4 -97 163 11 -22 26 -78 -7 136 104 -123 -36 -8 -21 -16
6280 -16 122 95 54 10 -161 -38 38 212 20 31 -3 35 -29 182 -44 -157 -37 37 54 159 -46 40 -92 -44
6304 -44 38 -22 -9 -35 -34 134 34 2 5 -83 -94 -281 96 134 62 -63 18 -19 78 30 -87 -101 -54 21 126 45 -60
6331 -60 -146 -79 -33 17 -41 74 -144 75 6 12 45 65 -231 1 57 26 -30 -23 -37 -10 31 79 -53 -88 -41 -9 -66 93
6359 93 172 124 -47 -196 -59 -12 82 78 -101 -78 -31 10 110 114 -89 -66 -21 -38 -67 109 -22 -31 -18 77 17 118 -40
6386 -40 -50 -99 -149 -57 -140 64 57 -37 -69 216 -96 -134 73 2 14 79 -77 229 124 191 -19 1 -27 -97 56 154
6412 154 -33 26 28 -55 -133 -54 13 97 -15 10 -128 60 -45 -12 -138 215 -20 -108 38 6 70 -71 66 -40
6436d0R2M8p0j24J33j45J74M2k73K41j67n0J27l0J21j59L6M4R2l1o0o7J12j39
6460i3L3K76j57j33Q9l4Q1oN2j57pK4%K09k10n3R9J01j87J91j78J10r7K9j0J16
6486H8k29l3J91J50j59j45K94j32Jo3J3k4O8N0k25Q3J11o5M8l4K2K4N8j00P3q9
6512b4q7O8K05J8j83R0j9n5j80K6J11J28j59j9J10k6l0J98k15M1n0k6K8J27m8
6537B9l2M9j04J82o3o1N7j47P3j0J3j56P6J15k7J42j58J52l40K20M8j00P3k01
6561a70K36M5j97M5j41J88o9J82J2n5p1J11q4l7j43J76MN5N6k16j4o3J62J6p0
6586d2O5n9j08M0J25jM1j4L1m4j6p8L7Q3o0j96J53M6l8R6lm9j27P6l4M3P3l3N5
6615F2J4o5n0L4J31roj66J08m0o3J84q1J1n6J68j30j73J31j0qL0K0m6k1J7M6l4
$$ plain form
6436 -40 52 100 30 -94 39 -106 68 110 -163 78 -89 -139 -12 -42 79 -80 -44 0 92 61 1 -66 46 -93
6460 -93 -60 216 59 -74 15 -19 62 56 108 -49 -56 -32 -32 177 -33 -86 13 114 -73 118 -60 50 -47 -18 -28 88
6486 88 -141 -174 17 167 8 -137 157 25 26 -37 -24 -48 20 70 -155 -72 39 -26 22 -12 10 34 92 -8 65 -24
6512 -24 -111 -43 162 180 -3 87 68 13 -167 -141 -30 98 -61 -80 30 4 -26 172 -43 -2 -52 -78 -50 77 29
6537 29 -3 46 -58 124 61 0 57 -90 -17 -27 -14 -170 -94 21 -6 136 -22 130 -210 10 58 -42 31 -170
6561 -170 66 111 -86 -41 -182 6 -63 119 131 76 5 116 32 -5 -148 28 32 87 143 -73 -87 -150 12 28 -42
6586 -42 23 -36 -144 -104 21 20 61 47 78 34 18 -60 -23 60 0 -196 -43 3 -35 61 58 9 -118 -42 -76 -33 40 7 62
6615 62 76 11 -39 -5 126 117 111 -55 53 13 -50 134 53 64 8 176 46 -127 4 -6 -14 16 36 -10 -31 -14 32 -2
6643bqk4J39j62K9m0N7j63K70j99P9J27k20J75r4J19j07P5q3K2J06j19m7O8O5
6668F3j26j23K52j55J04l1m6J39Jn2Rk3o2J54n2j22J06j82R2j10j71M07R2j42
6692B2n2J69k52J42o7R9k6N2j53J82K1l6n1m5L3J8J12k4l6mj19K9l6K8l9O3jN8
6720H7K3j19R6j10J00m1j44K26j65j26J75k1k12J61L4j6k0j77L22j66o4R7Q2k2
6744@O6P8j33o0O0r2K50j41j06p4K51m7j4R3n7j08j9J12m7o7PP7Q4j7l7r9J45
6771A05j65j5J74k17J85o2Qj51N8J94m0q7O8q7NJ13J28p3j09j13J58N1j93n1L9
6796g7J22Q0j26J22j5j90J85j69KP8J16o7j06L1N4j1J00j98m9J34p7m9K72k26
6820f4P4m5J02j09R1j03N9j16O8p2J95j19Mo7P9K53j78J1mj08J25j25r4J36kJ02
$$ plain form
6643 -2 -10 -34 105 -57 -28 -68 -11 -174 96 -103 -24 103 -117 58 -36 83 -24 51 -32 -10 96 -23 -70 -2 63
6668 63 -63 -186 66 -89 15 -16 -62 77 78 26 35 12 -50 104 52 -70 36 -146 -54 -164 -335 72 164 22
6692 22 -30 139 -113 29 -38 61 35 87 -66 116 137 101 50 5 38 56 168 144 108 104 -15 14 -22 6 -33 30 29 87
6720 87 110 -9 87 -23 77 36 -108 118 -47 -173 2 -19 -231 -70 -36 -52 -72 -249 73 -93 -157 -60 22 0
6744 0 66 144 11 -49 11 -81 169 28 -78 -152 99 52 38 131 74 -34 -53 59 12 -55 -48 29 113 96 59 -40 105
6771 105 -60 -75 99 -118 67 5 13 -138 -80 114 74 -13 55 -32 -27 86 214 141 32 -81 77 128 -65 -116 -77
6796 -77 45 125 -1 121 106 -84 101 -68 -66 12 128 61 -45 -14 40 29 129 -69 -118 16 -61 -110 162 -64
6820 -64 10 -35 67 -42 49 -54 5 -111 -43 -115 80 -39 -35 -102 -23 230 52 63 59 -49 76 -49 -143 -7 -9 93
6846I3j03O6M4o2k21L04j4k12J96k94J64P5l6R0N3k30R5K4N1Nj29L2p4J6R4Q8
6872A15q7j74J04J02j05l3Q3k11K80L7j36J77o2M1k34J61j39K17j20q8J75J5j12
6895FJ36j73p3n3K97n5l2l7j13J01N5m6j20J80k0j92N5J72j66K1j89J62J4K53
6919A83m5M0k10m6J45r1P6j40Q7k6O8J70j59j9k00J62j3J01J13j86l0k13K83o5
6943a5K26k55M8l1m1R2J11j19j17l6O0K53l07J59J3j91J69O7j22p8Q0j05J88n7
6967hL1j3L1j0p1K6O8J6k42K46j25QJ82j44n8J20J5J09j49l1o5RK7J79J6p7k20
6994a30M6j16J89o1J09n4l5lq5J79K5p6J27n2j5j00J20J06j57m3jj10L85k58l0
7019d0R3k00M7J59J3l7r5K64j41j07n3K5P8J00o3n4J5O9Lj7j56lJ30Lo3k6J05
$$ plain form
6846 93 -10 56 100 38 -183 121 107 -105 91 -203 -39 36 0 90 143 -87 8 32 83 88 -41 -9 -83 -67 27 115
6872 115 28 -146 -42 60 -45 -78 5 -206 74 111 -25 152 90 131 -103 58 -81 136 16 -72 103 118 6
6895 6 142 -31 -104 -157 140 85 53 16 -97 4 59 13 -107 73 53 -139 -84 88 -78 -57 -246 -84 -70 183
6919 183 138 178 -32 -78 67 -24 52 -88 -1 -27 41 211 52 33 -167 -5 -18 83 196 10 -20 -233 50 -15
6943 -15 211 -44 4 -27 -68 24 135 16 -101 -137 -77 176 -131 28 41 -150 19 86 -36 -114 -34 -139 49 -8
6967 -8 23 10 41 31 -40 -14 54 70 -172 74 -51 -43 139 -5 -63 57 72 181 32 1 -64 -55 -28 151 167 90 -130
6994 -130 -84 -200 -11 -72 37 -17 -52 -55 -140 39 64 -12 115 63 48 -52 68 174 17 -26 -27 -137 248 -10 -40
7019 -40 53 -147 -100 59 72 35 -60 204 63 -44 -97 -72 6 106 43 -11 4 73 76 59 -97 -100 30 33 -30 -56 49
7046D9l6P7q1KK5J5l6J8p2J02j9J21j88l7j43K93k7k96K47kJ5Q7q6n0k8Ok05K22
7074b7k01J90ln5J5O9Q0j16N4Lm0m9kj2K52r9j16Q0J35o4j2r0J11l07J86jJ64
7101A45m5o6j96M8J17M5N1j88k1K08k67P2J51on5m5%K54j39o0n2P2j29K30p3M0
7127I1j70l3N2j6N3j94J88o0k0M3J63n4j2p8J47m9q4j15J95r2K1J40l6M5m4j85
7153a04J5oJ81q3J43k95J77L6j29J12j85N5K8J06O2n4j90L4j2jJ05J08k6j99J2
7178a10RK01Q4j54o6K4O7l0J50j57j21J99j00J53j51q0j2J00L7L0J27l39M2L1
7202f6J38Rl8n4M%O8J0o2K6n2o1K15j05P7r1n0k04K77J52j39J5n9J7k03K92J06
7229B22l25n5K17q0P0j90J99k1q0p4M05k40k68O8Q0J44P0j58j47M2J75l2L6j38
$$ plain form
7046 49 13 90 9 11 36 51 15 33 -39 63 44 165 -23 -60 -203 90 63 -233 14 12 27 114 28 -22 -50 -44 -249 -27
7074 -27 -228 -38 -41 -96 -81 -12 68 -48 6 9 -31 -80 -82 -94 158 59 -57 23 158 94 82 -8 103 -204 -18 -19 145
7101 145 100 34 -162 -114 3 48 99 -89 -110 98 -169 -97 54 48 -7 -52 -52 202 63 3 -49 23 -106 124 51 91
7127 91 -79 -112 -60 -76 -23 -217 -29 -89 -109 -66 97 43 31 -47 100 51 -33 -148 47 -45 -24 116 80 125 81 -104
7153 -104 -89 -95 86 3 146 -149 28 64 -65 47 -138 -83 -55 51 113 59 -131 -97 -109 -110 -5 103 77 -122 -110
7178 -110 -101 100 184 30 -36 -12 55 25 175 18 -103 96 -4 149 -2 -82 -94 6 43 73 200 -139 -97 -66
7202 -66 72 81 43 -11 -7 -7 61 71 9 35 -17 -78 137 32 109 18 -32 -236 41 193 54 69 10 27 -176 116 222
7229 222 -103 -158 59 -21 49 -141 58 37 -43 -117 288 48 -220 -152 -72 72 142 -16 -163 -121 54 22 58 -80
7253h0N5J6j50J49L9p0j1l9L6L2N5l6l9q2J95j0J3q8l8k5j05K03J78k3k44j5m7
7280a31K66q3J8k4j73P1R6r1J66o7l41K4L53J1o1p0q0K12k99M52l2k81L3k2K34
7305A81J4j08j52J1O4R1J8o9k01L6J63L8l8j23P1k0OK6r4j2J59m03M20Qr5j6J72
7332A47k20K8n2J92j63K4m6R8j60J29J08j62j0N9J46L3j84n7J88j84L6l8Q1o9
7356g6N0J95J01l23J1J16j31n3M8K80k19pN8j12K47k86J79j86J1J35J1j73J48
7379B4LJ3n8P7O0l0n8j27N8L2K4p4mM8pQ7l0q8K4O9l9q1R3M5k50Q5K9J42P6n8
7409H5j14nK3J16J28j86j0q7J2K32j55K5o1j6Jj48K35Q1j61J02m3k5O6l9Qq4J26
7436A06j57J30j29K2K26j30J45k71O7L4j3j43M2J19j25j7J32n0j47J89M6j11Q7
$$ plain form
7253 -80 -25 -9 -159 -10 29 -41 -52 -91 -55 -23 32 -4 -43 -125 70 60 73 -15 -53 -78 -183 20 198 175 -69 -84 -131
7280 -131 135 52 70 46 -127 -56 40 -51 115 48 -293 -269 84 95 34 -36 -116 96 -203 249 217 -64 -31 -53 181
7305 181 195 87 -65 -54 10 101 119 50 -151 -115 48 86 48 -75 -4 -24 -18 8 -86 -98 61 -342 78 86 -9 -25 147
7332 147 -73 -45 -97 95 -68 -44 -90 8 -152 -23 85 -77 -87 -28 118 151 -33 -90 98 -86 -50 -88 -7 -76
7356 -76 -26 169 270 -53 -42 74 -57 -110 -62 218 -1 -8 50 -62 185 -101 78 -108 -97 38 49 -124 24
7379 24 27 40 -18 59 119 89 31 -96 -38 -6 18 -56 -60 -12 -19 68 38 -50 -26 43 4 -77 16 61 -189 -104 -75 67 143 85
7409 85 -29 -34 -11 105 233 47 37 -50 -38 194 39 64 3 -13 -12 -160 75 156 -5 97 54 29 95 56 64 -20 106
7436 106 -51 79 -50 -28 198 68 213 -58 9 43 30 -113 -71 48 -77 -94 38 -12 -159 30 76 -35 52
7459E2R7j57j26J10J23J0j48J68k90K63j35R8P9k26o9J42j56L4J29l2N9J6j85
7482a44O9O2p1j0J88mk9o4M2Nj39K4M3j23j07J58K66k6j34J2m1M2L2P8j08J1k6
7509FJ30l34K37J61j93j86Q8J53J52r6l26K43p2l5R8J67k56j86N5J30J66j20k7
7532d5M3j38J85J58k93K6k8J67n1k9J95j40kj99L3L20k64O7j4Q5j32K44j62k9
7556cn0j01J9K42j40j19J68j04J94k2J04k01j23j09O6K21Q3j9j64q5J7K51J41
7579B66l28K9j09J09q6L93j34j65r3qJ69j58J99j79J1K15j38M7L8j46l4R6P7Q1
7603A52k00j09mJ85P3N9q6r5J56j44J6J56n2j60o8P6N7O3j27r4N7J50l8N7j63
7628h3m8N9R9j6P9k17J91j80P2P9J39j92l0K3K4J80j82PO4j76K05j9Jl8j53J82
$$ plain form
7459 52 149 -8 -134 -24 99 109 -39 129 -161 102 -33 65 144 -82 -151 -9 -165 -131 -2 -34 25 41 -144
7482 -144 -75 -13 -84 -94 94 90 61 -3 39 44 -95 -71 -28 -151 -258 -100 166 140 6 18 -23 19 51 129 21 32 6
7509 6 136 -198 39 200 7 -179 -91 62 214 118 -208 35 -37 -72 26 193 -63 -249 -194 -64 102 -18 -45
7532 -45 -2 -140 45 203 -90 -64 -92 75 24 -5 190 50 48 -151 -118 202 -62 5 -9 76 -56 188 26 -3
7556 -3 -53 -154 -135 107 -33 -152 16 -88 106 84 188 -13 -136 -245 -179 42 125 106 -58 -143 -126 125 266
7579 266 -62 -33 -142 -33 -119 274 140 -25 -118 -126 43 -115 84 -95 -84 131 -7 40 78 -68 -102 -6 71 152
7603 152 -48 -157 -161 24 97 156 70 -25 131 -13 3 159 107 -53 -121 -45 12 75 -52 -146 -89 61 23 80 -83
7628 -83 -131 -72 27 11 90 -127 64 -116 -44 35 174 -18 -48 -25 -1 179 -3 4 68 -108 97 78 79 41 -112 70
7654G0l4J2m0m9j19J96j14J35l05L43j65M5k4J04J5k00Q1j03K42j25K5j43j7J21
7678d9j6L14k49J2p4jR3K32j40k80J60k86M03p4j5l3J0L5m8M8n0Q1M2j88L13j78
7704F2p4o4J3QJ32o8o1J96q5j11K70p6j97P1k68J62J34j6m7qJ70j64P4m6Q3r6
7730fo0L4rQ6J35p1k22OK74o4m1Pj61K2J48O5p2Jj12L4k3J4N2O5N2j56J35j51
7758a8L3n8j18J74r2K32j70K8j01N1L6L8l2J35k05K2N1r7P8O6ok7Q9p1m0M5o6
7785b3p7K24j16p6J12o4j84J64M6j11O3o4J61Qj9l5Q0M0k32j1J25n2n9K23k71
7810a48J80n9J38n9n9K3n4n1r8J54L7o2K07j93m2R2J72k31k5P6r4K36k03J63k38
7835a38K24j38M0J78k34K1p2R9R5m5p3K0p5J13J03r2K9k6j4J1J02j2k35J07lO9
$$ plain form
7654 70 36 48 8 -41 -160 36 -78 57 -248 95 -70 -25 -49 55 70 -130 -49 -152 90 -35 -10 -153 -170 -49
7678 -49 -65 249 0 12 -62 -63 30 262 122 -158 2 -284 119 45 30 -3 7 42 -6 42 -8 73 115 -73 240 62
7704 62 -12 -76 -63 -55 77 9 -52 144 59 -52 218 142 -55 16 -252 -90 44 28 -19 -27 143 -21 53 7 90 -6
7730 -6 -66 -32 -41 45 180 109 -113 -107 167 103 62 69 -92 -70 78 143 71 72 -40 -6 -29 -15 37 102 154 -2 133 -18
7758 -18 15 -43 -161 13 -79 153 -17 11 -90 -39 -3 35 3 138 -67 -45 6 -91 -13 53 47 20 109 38 -2 43 -23
7785 -23 -100 124 8 -68 44 -20 -204 -40 6 -105 -42 -106 55 63 44 9 89 129 -103 -114 11 -41 -100 123 -148
7810 -148 32 -27 111 52 -7 16 -38 -89 -187 -33 4 -58 149 -44 -86 6 178 -53 -78 -2 -96 140 -63 100 -138
7835 -138 86 -52 -12 166 -68 -47 -119 -20 75 30 -43 -23 -98 15 118 26 55 29 15 26 128 116 -119 -12 -15 54
7861E4nj08J07q2J17m2k1O3k01MM7oP6j00j00K34j52Q7R3Lq7p4P0Q0j21M6J53
7888A35l54K02J29j39J51n7k03pK22N0j90J84j69J11l8Q0p3j42K46k37N0J77j42
7911a4j13J53J8q9J5J51j57J02j41J31J4J0j43P1L5l4J66r4k64L5m2J59J78n2
7935I5p8k32J45J09n5j64J38M6j34K42N5m9p3j47Q3m0O6K09j65r8joJ85k5j45
7960c9J39Opn9m0J52j25K8n8P0q2q6j1Q8j47J18L47k13k67J68J27M1l6k04K3q6
7986a53J95k1j46Q4M1j00N2mJ80k10J3O4m7K02j07l6O9k35J71k5O9n1p7O7o5J63
8012I3J03l01J04j40L3N9K0q5R9J62k64K10q3Mj84L34j29J40k99J59k40N2L27
8035A74L8k05J43j83K9R8j36R9r5P4k9KJ62k04N6Q9j21oO5M3J1p3j46J29L3O9
$$ plain form
7861 54 49 -59 48 -34 83 41 20 83 -118 -114 -67 -73 3 -97 -197 37 -115 -28 65 68 -19 -93 -23 57 -64 -18 135
7888 135 -219 -17 112 -27 124 67 -136 -143 79 129 -61 123 -46 65 27 107 34 -108 138 -99 -49 128 -14
7911 -14 -127 26 44 -45 -30 121 -36 66 -75 56 70 80 -63 8 43 9 175 81 -183 -148 -190 -31 147 95
7935 95 17 -215 -70 39 -16 -180 -42 4 -130 112 167 118 45 -102 -19 -59 7 216 51 -47 -48 -54 131 106 -39
7960 -39 100 106 99 40 0 152 27 55 -3 67 -15 -101 -112 -24 -171 -53 294 81 -186 -18 109 150 114 -90 -67 -153
7986 -153 42 21 -125 -41 0 -100 -48 -52 128 -82 -69 -5 -52 150 43 7 76 -159 12 -13 56 5 -72 -5 -70 93
8012 93 196 -105 -1 -141 -108 -49 -29 -114 -15 147 -117 93 10 14 -170 164 35 175 -124 35 -205 -153 174
8035 174 212 7 150 -33 -4 94 -42 57 -38 36 7 9 171 -33 23 112 -9 -15 50 93 104 31 -115 14 47 116
8061A16j67oj07M7K3L5M3j10L4JJ39J22l20J22J00l8QRJ5j54m3K69j95J81j42
8086a8N7r3n5J86lO5j18N3m0J25k88K73k26o5Q1J70n3r6q1j8K35k8Nj12J52j62
8112e4lK12r8j9o6QQ0N5p8M9j87N9J47J05k26l0J34l7q6m1R6OL0o2J68k35L3K1
8140a9N3M0j22J54jj99K5J22j1j20J01J45k2k19Q8J86l11O6m1J46j26P0J43j54
8164fL6lp5J00O3k49rQ9n2J71n3j65Kr3L35n0n7R6l3k1rj54J17J30oj62o4
$$ plain form
8061 116 -51 -57 -164 -117 -94 -59 -16 -126 -92 -91 48 170 -150 -28 72 34 42 51 66 -88 -131 138 -57 124 -18
8086 -18 39 -54 -109 77 74 139 21 74 34 159 -129 144 -82 -147 -66 104 51 -45 -126 -144 91 63 68 -44 108 -54
8112 -54 -57 155 57 38 -28 -20 60 115 37 86 -101 -42 105 210 -16 -46 88 51 -35 -76 20 26 56 -6 162 -73 -40 -19
8140 -19 34 74 -48 106 105 -94 -69 53 42 -78 23 168 146 -73 15 201 -110 -44 -85 61 -65 5 148 -6
8164 -6 30 27 -48 52 115 -134 -143 -54 -106 65 12 -153 -151 -244 91 41 -16 80 47 26 17 -137 -20 110 104 -58 -122
8191a22
$$ Imaginary data points
##PAGE= N=2
##DATA TABLE= (X++(I..I)), XYDATA
0@%%%%%%%%%%%qJ6j6J6k4L2m0M8n4O4p5Q9j06J26j45J67j94K23k54K90l29L71
33A97m20M75n33N96o65P41q26R17j016J125j244J373j515J671j841K028k232K458
51A289k710K988l300L653m053M511n043N667o413P323q457R917j1869J4604j8707
66a0600K5493l8521P1665k96349n41250Q92484O4082l29649N46873j86001q12391
77f14164M04037M55110k85434K28647J42085o28972K7361M76987j51940J3921
87F7638K09082m49668j46227N14369k9914l08795J47462k2846j60084K26215J08951
98A56183j86598n0669k6480K2737K22075M6011j45238p4182j49295K3842L82755
109B21141O9316k98395q4807o7488n1258L42643J53560l02691o3614M283j98938
$$ plain form
0 0 0 0 0 0 0 0 0 0 0 0 0 -8 8 -8 8 -16 16 -24 24 -30 34 -41 48 -58 68 -77 90 -104 119 -135 155 -174 197
33 197 -223 252 -281 315 -350 391 -435 482 -534 591 -653 720 -795 876 -965 1063 -1169 1289
51 1289 -1421 1567 -1733 1920 -2133 2378 -2665 3002 -3411 3912 -4545 5372 -6497 8107 -10600
66 -10600 14893 -23628 48037 -248312 -789562 102922 167004 -162645 384228 198227 -614164
77 -614164 -210127 244983 -40451 188196 330281 -298691 -271330 205657 53717 67638
87 67638 276720 -172948 -319175 195194 165280 -143515 3947 -18899 -178983 47232 156183
98 156183 -30415 -81084 -107564 -84827 137248 183259 38021 -36161 -185456 -161614 221141
109 221141 290457 -7938 -92745 -160233 -211491 131152 284712 -17979 -81593 -77310 -276248
120b76248K56509L74472k73553k24490J29071j35738L9212M19430j23079l79002
130a93416J45807O9594j40788K37216P5312l41616L0891J90079j47734P2657K00882
141A98884k65769j55697K78821M0579j09105J08696r8704k12148J99767K03142
151A88466j44305n8342K4552j42245K6991K39264J190j52837k1666m6436m4765
162a30133J82653J46688j53383j58149K7488M0343N6028J11323l5533j57322k1454
173i1451O7432K3075O1189L4238j15645p5296O9238M2766J6705L9459p1538j00032
185i9860P3911R3034m3362l3285J2377l4541m649O5874J9674m6718l6517r87K4807
198a0242L5319K1599k1234o4595k5010O1887N2640r086k7028m8531k5561O3557
$$ plain form
120 -276248 -19739 354733 81180 -143310 -14239 -149977 -110765 308665 185586 -193416
130 -193416 -47609 21985 -118803 118413 193725 -147891 -117000 73079 -74655 -1998 198884
141 198884 -66885 -222582 56239 96818 -12287 96409 -2295 -214443 -14676 188466
151 188466 44161 -14181 10371 -131874 -104883 134381 135571 -17266 -38932 -85368 -130133
162 -130133 52520 199208 45825 -112324 -84836 -44493 11535 122858 87325 -69997 -91451
173 -91451 -24019 -944 60245 94483 -21162 -96458 -27220 15546 32251 71710 172 -99860
185 -99860 -25949 67085 23723 -9562 2815 -31726 -36375 29499 49173 2455 -34062 -35049 -10242
198 -10242 25077 46676 25442 -39153 -64163 -2276 50364 41278 14250 -34281 -59842 3715
210C715L8451l6968J2190R95q3627J9999J02821l0835m5992M4667m1209m7711
222f3504R5033K1329q4138K7980K8274o1293L2925M4149o7272J4673N9318p4021
234b6547j5017R0942m1340n6860P5858l059o5205N2580J6857o4541L6612L9569
246C9849o0917J8M0244k8752Q676L1880n1262j2871N8301j3178k6351L5391j4880
259F148m2252L1960K8547j4581R29j6154l0209K5825L4852o764r580k3247k8229
272d2755L5097M5818j9162k4274l261j7073J1335M4615M543k9811k4274j7308
284c6510K3072N2159l35m3168k2621q920J6079N6521J4218n6157l5938R628K1277
297a0695L8562K4552l8005n2344o311L3046N0562K1775m9840o1811K584M3104
$$ plain form
210 3715 42166 5198 17388 18383 -65244 -45245 57576 26741 -19251 25416 -15793 -63504
222 -63504 31529 52858 -31280 -3300 24974 -36319 -3394 40755 -26517 -11844 47474 -26547
234 -26547 -41564 49378 8038 -48822 27036 23977 -41228 11352 28209 -36332 280 39849
246 39849 -21068 -21050 19194 -9558 -882 30998 -20264 -33135 25166 11988 -14363 21028 6148
259 6148 -36104 -4144 24403 9822 10751 -5403 -35612 -9787 25065 18301 8721 -14526 -42755
272 -42755 -7658 38160 18998 -5276 -8537 -25610 -14275 30340 34883 5072 -19202 -36510
284 -36510 -13438 38721 38386 -4782 -27403 -36323 -20244 36277 50495 -5662 -41600 -31972 -10695
297 -10695 27867 52419 14414 -37930 -44241 -11195 39367 61142 11302 -50509 -47925 -4821
309d821M0128J6279l9571o5738n310N7640M6699J260l8419n3082j1663N0497N8877
322E2776P744n0640o2781o809O0643N7349m532n1821n2618r874N0288O5204M742
335E9671o0044n5806r84M8721N9857J3563n5792o7440l590N9939O2293N613o2799
348C202o5948L564O1086N3715N616n4850p2950l303P3389O0546o372n5568o4345
361f2218q010P1452O9830q145o4857o0444j830O7810O5066j0184o3190n3225l414
374f1359N8334O8460l391p0410n5358Q044N8823N8548j424o6217o1971R950O9672
387A1701N5847j2261o4775n5893N475O9029O3220j3304p0851n6335N641O8975
399F469P0454j2800q0553n2784J2483N8733O7406j69q3150n9693K4300N5705M7955
$$ plain form
309 -4821 35307 51586 12015 -53723 -59033 -1393 45306 46566 8147 -44935 -56598 -6101 52776
322 52776 60520 9880 -52901 -59710 933 58282 53750 1929 -50689 -60563 -10275 54929 59671
335 59671 -373 -56179 -57163 -8442 51415 64978 9186 -58254 -61844 -1905 60388 66001 3202
348 3202 -62746 -59182 1904 55619 61235 6385 -66565 -69868 3521 64067 57695 2127 -62218
361 -62218 -70228 1224 71054 62909 -1948 -62392 -64222 3588 68654 58470 -4720 -57945 -61359
374 -61359 -3025 65435 62044 -8366 -63724 -55680 3143 61691 60267 -5950 -67921 -57971 11701
387 11701 67548 55287 -9488 -65381 -59906 9123 72343 59039 -11812 -68147 -62506 6469
399 6469 76923 64123 -16430 -69214 -56731 2002 69408 69239 -13911 -73604 -49304 6401 54356
412E4356R772o6140p1469K2244O8015L3164m07m5468o9693J0185Q1861L0727k6945
425C0202l2060m8090j0852Q0273N4172m7723m9710j7119r757N4687P5947l5418
437D4552q4713j2180J9303L5650O8716r384r9351l1463M4346L3322M4430J3209
449F6437q8185o1258N2760N2273J7421J3455n3422p6164L0856P6475J4201j2240
461C2609k9173n5642L359P0739L0640k7935l3512k7576j057M7104M0280k2307
473B7529n1766j6241K2091K8649K7662k750n9089l4204M8672M0843m627K185l5399
486f445o1313M1277P8471j7528k6217l154o0265jJ03134J0092o3938L231k3738
499b6394l8277Q4184N5604p4252k0226J7606m6747L4329Q4679n0283n5653L9001
$$ plain form
412 54356 64128 -2012 -73481 -51237 16778 49942 49535 4067 -65626 -55441 26420 57147 30202
425 30202 -1858 -49948 -60800 19473 73645 25922 -23788 -40907 -50664 4023 79970 44552
437 44552 -40161 -52341 -33038 2612 71328 61944 -37407 -68870 -24524 8798 53228 66437
449 66437 -21748 -83006 -30246 22027 39448 52903 -519 -76683 -45827 30648 44849 32609
461 32609 3436 -52206 -48847 21892 52532 24597 -8915 -36491 -37548 9556 49836 27529
473 27529 -24237 -40478 -18387 10262 37924 35174 -23915 -58119 -9447 31396 26769 28954 -6445
486 -6445 -67758 -26481 51990 34462 8245 5091 -55174 -55175 47959 58051 -5887 -2656 -26394
499 -26394 -64671 19513 75117 865 -19361 -1755 -48502 -14173 70506 20223 -35430 3571
511C571j8006j8829P4613k809p5291K2524K8735l2699K5994K5756n5036q930M7084
524A6677l164j2546R617k2678j6943L0815K7073p598k6377j8450N262J1500K2897
537A6085K6134l4863n0854K5593K2424j1708M2625N683q4239N188O0096l3719
549a1555J0677O3299p1441n2781Q2714r978m9087Q1587m162r9849N4518M5987
561C9929q3026L6885P0118q8801j0874Q2201o0976l2899R1765k6375n7303O7337
573B7981j0727p0400N7025L0380n5028K9707K1032o4199J2174M5778k7593M992
585A122K5715l9041j0469K8789r454M421J9137k2601n331J1584k0639J1509K6072
598B0814k3262L849J8507m3085k445M7549k1628m779M2489m6433m0285O1591m75
$$ plain form
511 3571 -14435 -33264 41349 38540 -36751 -14227 14508 -18191 7803 33559 -21477 -30407 16677
524 16677 13513 967 10584 -12094 -29037 1778 28851 21253 -5124 -23574 -18312 -6812 16085
537 16085 42219 7356 -43498 -17905 4519 -7189 35436 41119 -43120 -37932 22164 -11555
549 -11555 -878 62421 -9020 -61801 20913 10935 -38152 43435 39273 -60576 -6058 39929
561 39929 -43097 -6212 63906 -24895 -35769 46432 -14544 -47443 44322 17947 -39356 27981
573 27981 17254 -53146 3879 34259 -20769 8938 29970 -34229 -22055 23723 -3870 1122
585 1122 26837 -12204 -22673 6116 -3338 1083 20220 -2381 -7712 3872 -16767 -5258 20814
598 20814 -2448 1401 19908 -23177 -25622 21927 299 -4480 38009 -8424 -48709 12882 12407
611A2407l1059N8070j5839q1237M7222L8684n2674M1099L6587r2962j439P4878
623C3737m3062o026P0925n8856n5108P9315j938n1971O0512R17p8525M4753M6887
636D1560o1689P483M2841n0755k132O2523l0418m0410L3095j942j5237M0313J950
649B7182m8743l026J9959M781J9571P994l1675k7140Q764K6854J9828j891j7029
662E429k5351j4485K7950L7870r221k2283o592k0396L861M9426O396l9528l781
675a0705J851j3728L1639K8137l8207k2077K0303k284M721K7888k1329l5975K0886
688h880K1059p935Q700m403l6361N891M1421J324j7718k961j8007j0616L8357
701I871K7508k7252k3904j574o401J8566M0229j1180m4308n062J0608N773L2500
$$ plain form
611 12407 -18652 39418 23579 -57658 -10436 28248 -24426 16673 53260 -39702 -41141 33737
623 33737 -9325 -15351 55574 -3282 -58390 20925 18987 -32984 27528 28445 -50080 -5327 41560
636 41560 -20129 -12646 30195 -20560 -22692 39831 9413 -30997 2098 156 -15081 25232 27182
649 27182 -21561 -24587 -4628 153 19724 27718 -3957 -31097 -22333 4521 24349 22458 5429
662 5429 -19922 -34407 -6457 31413 22192 -91 -6683 -27079 -23218 26208 32604 -6924 -10705
675 -10705 -8854 -22582 9057 37194 -1013 -23090 -2787 -5071 -350 27538 6209 -29766 -8880
688 -8880 12179 4244 12944 8541 -27820 -21929 19492 20816 3098 137 -17870 -28486 9871
701 9871 37379 10127 -13777 -15351 -21752 -3186 37043 25863 -18445 -23507 -12899 -7126 25374
714B5374J1386m8006k3299K4769R444J2868K2884l2669m2581K4184K7317k189
726I482J2850j1182m4864R096M1304l78n637j899l3182m584M4193J0143j9722
739E620n407j7703r747L6612K1321k2240j5471r332o152K8091K4637j8159k0789
752h719q418l031K3533K5090j4272k3467p646j239K0484K4571j2451k4510n697
765a5772P9J6728K5524j2078k8191j571M596J0105K5040o300l4732l453J5393
778d632O661J7074J048l4444j0781K1576R858Q544M492k8727j8237K2629J5149
791A0210P23M845j8557k3832J7051K3335k606k413r035k0281Q617K4943L88q439
805D949o691j5031M531K5441K459j4275o205q695J712K3370P707j7458j1367l285
$$ plain form
714 25374 36760 -11246 -34545 -9776 -332 12536 35420 2751 -39830 -15646 11671 9482
726 9482 22332 11150 -33714 -24618 16686 16308 10671 8772 -24410 -28994 15199 25342 5620
739 5620 213 -17490 -27237 9375 30696 8456 -7015 -16347 -22499 5592 30229 12070 -8719
752 -8719 -17137 -20168 3365 28455 14183 -9284 -16930 -18169 2315 26886 14435 -10075 -15772
765 -15772 -15693 1035 26559 14481 -13710 -15281 -10685 -580 24460 18160 -16572 -20025 -4632
778 -4632 2029 19103 20151 -14293 -25074 -3498 6360 14904 19396 -9331 -27568 -4939 10210
791 10210 10933 15778 -2779 -26611 -9560 13775 11169 8756 -279 -20560 -11943 13000 13388 4949
805 4949 -1742 -16773 -12242 13199 15658 1383 -4822 -13517 -11805 11565 19272 1814 -9553 -12838
819a2838L656J9248R618j6215j4369k116M441J6712J1326j4214j6613j116N722
832f758J2188J0900r372j6105k806O023J0705Q482p095j3511k198M961Q243P538
846A1195n466j2768k335O302P698M838n719j0843j160N693O874N470n845j2358
860h424N6Q111M856L223l714j1358j490Q500N164K133l979r949l69Q036K788J861
876E445j899r624q91Q910J456o23R72p978k819R453R78k824L533o216o065J0465
892B273L069p253M720j661j0324R427Q358j1457J651O396j2744L244J5448j1258
906a11p006J2967p429p322J8088k882j6959J1736M774j4608J0220R243j7655J974
920d970J2967j1630j033J3661r874o338J3742n803r507J3671K01j1884R069K825
$$ plain form
819 -12838 -9182 10066 19684 3469 -10900 -13016 -8575 8137 19463 5249 -11364 -12480 -6758
832 -6758 5430 16330 6958 -9147 -11953 -5930 4775 13257 6162 -7349 -9547 -4586 3657 11195
846 11195 5729 -7039 -9374 -3072 4626 9464 3745 -7098 -8258 -2565 4309 9779 3934 -8424
860 -8424 -8368 -257 4599 7822 4108 -7250 -8740 -240 4924 7057 3078 -6871 -7240 796 3584 5445
876 5445 3546 -6078 -6969 1941 3397 2774 3746 -4232 -7051 2402 3380 556 4089 -2127 -8192 2273
892 2273 5342 -1911 2809 1148 -9176 251 8609 -2848 -1197 5199 -7545 -4301 11147 -111
906 -111 -7117 5850 -1579 -8901 9187 6305 -10654 1082 5856 -8752 1468 10711 -6944 -4970
920 -4970 7997 -3633 -4666 8995 -879 -7217 6525 722 -8785 4886 5087 -6797 2272 5097
934E097j3097N578R813q083r32N440p264j610Q446l27k800Q10l417r42L913P26
950A351J299n69n753R34M792k876J834M168q521k188J0036k939n506Q437m084
965D15q736J1740L993j2932M160N332j1597O985J3972j6023p033J4561p143m841
979g147K1337o780k3778J3924R921j5595J2871J2333k8447m019K5719r293p019
992e973K1827j3569k4212K3744J0641k0186J2200Q458k9001M860K7189j4973q091
1005g086J8891j4838j4485K6752K665k1568J0361N358j8095J1835J6158k0231
1017d283n744J5010o561j944J5659q936j7093J0048R195l259M106j579j3770k141
1031a1292J2372R055k548p776n082l506J667J5538P352j6852p764O101n172O261
$$ plain form
934 5097 -8000 -2422 7391 -692 -1624 3816 -3448 -5058 3388 3061 261 1071 -2346 -3288 625 1351
950 1351 2650 2081 -3672 -2738 2054 -822 1012 5180 -3341 -5529 4507 1568 -3938 4499 415
965 415 -8321 3419 7412 -5520 -1360 3972 -7625 -640 13332 -2691 -9724 4837 -2306 -7147
979 -7147 14190 7410 -16368 -2444 7477 -8118 4753 17086 -11361 -15380 10339 1046 -5973
992 -5973 15854 2285 -21927 1817 12458 -7728 4472 12930 -16071 -11211 15978 1005 -7086
1005 -7086 11805 -3033 -17518 9234 11899 -9669 692 6050 -12045 -210 15948 -4283
1017 -4283 -10027 4983 -1578 -3522 12137 3201 -13892 -3844 5351 2092 6198 4619 -9151 -11292
1031 -11292 1080 10135 7587 -189 -5271 -8777 -7110 8428 15780 -1072 -8836 -2735 -7907 -1646
1045a646K0595j2817k0730J3192J909j0965K1720N452l1678N438K1484j8432J258
1058e220K3998k2950j5292L1368k371k2255J8638k7k4770K1871J7877k7823r34
1071g890J4721j9767O253L1029j8827k2142J7853l757j1147K9254M815l4043J776
1084a1872J6294j1613P648K0350j9171j9410J5029N805n181J1153k32j9268P18
1097i750J4260j441j476L928r427o539J3679N702j0157r08K157p564N966J5430
1111A3860r507j5418P104M748m339J1836M689k1511o286J6879K159k208Q609r351
1125A264j7913J0296J5597m801j041J525j4320l140J8758M019j0798J683j965
1138h36j1304J0382J5946j1410j0005Q701m278n477J7569J827k1040L500J2367
$$ plain form
1045 -1646 18949 6132 -14598 -1406 503 -10462 11258 16710 -14968 -9530 11954 -6478 -5220
1058 -5220 18778 -4172 -19464 11904 9533 -12722 5916 5889 -18881 2990 20867 -6956 -7890
1071 -7890 6831 -12936 -6683 24346 5519 -16623 1230 -2527 -13674 15580 20395 -13648 -11872
1084 -11872 4422 -7191 457 20807 1636 -17774 -2745 3060 -2121 9032 8800 -10468 -9750
1097 -9750 4510 3069 1593 5521 -3906 -10445 3234 8936 -1221 -2129 28 -7536 -1570 13860
1111 13860 4353 -11065 -3961 787 -3552 8284 12973 -8538 -14824 2055 4214 2006 10615 1264
1125 1264 -16649 -6353 9244 4443 3402 4927 -9393 -12533 6225 10244 -554 1129 -836
1138 -836 -12140 -1758 14188 2778 -7227 1474 -2804 -8281 9288 11115 -9925 -6425 5942
1151E942r642L176J3384j6540j0861J9819J035j1137J1923l726j9540J4908J5372
1164A4113j6368K13R311j8248Q66K5387q453j5757J1944l981j1905J9433Q124
1177A4679k0065j91P354q866O402J3441j1004q977N824j802J706J0294m452j0228
1191e885K504K092J19O261n94p736j182L095L384J741l602k556J216j573L773
1206A057O197p852o695Q359J50l322Q406k784j2757O911P509p486N021M125j4461
1221g622N89J3818o221l133J0495r404r634J4608J913r632P909M28j3109P043
1235a952R039q899P46O264r748n08J1302n129n233P258k669n764P872J249p247
1250c419K513K983l719J956J917l910O65K160j834J032J366l088K22K412j328
$$ plain form
1151 5942 -3700 -524 12860 -3680 -14541 5278 6313 -4824 7099 3373 -16167 -1259 14113
1164 14113 -2255 -2042 7269 -10979 -10113 15274 6821 -8936 3008 -973 -12878 6555 14679
1177 14679 -5386 -5577 1777 -7089 -687 12754 1750 -7227 -1403 -3205 -1499 8795 4343 -5885
1191 -5885 -3381 -1289 -1170 5091 4497 -3239 -4421 -1326 2058 3799 197 -2359 -1143 -2716 1057
1206 1057 7254 -598 -7293 1066 1216 -2106 6300 3516 -9241 -2330 5179 -2307 2714 6839 -7622
1221 -7622 -7033 6785 564 -2569 7926 -1478 -11112 3496 5409 -4223 3686 4114 -8995 -1952
1235 -1952 7087 -1812 -1066 5198 -4550 -5058 6244 1115 -4118 3140 471 -5293 2579 3828 -3419
1250 -3419 -906 2077 -1642 314 2231 -1679 -1014 1146 -688 344 1710 -1378 -1156 1256 -72
1265g2l66J013p47K26K27j238J451L64k455K285J861m707J03M384k229j554L838
1282B384k121l200L172R57j381K060j762l385L155J569k149K613M3n688R41N310
1298B518j114j092J125l037j761L813J913l16j509l851M13M539L79j145K15l391
1314b301j587M783L047k363k741j848P07L956J260j486j318l357j073O816K851
1329E346m749k342n61j106M080M642k815m106k289j26N791M288m661l583J75k199
1345d215L646P361k777p821l16J945K889M824j993o448j423J260L557O770k733
1360D526r995k8M956J428M000P79r231m363N754N049L118j974q036k333M734K868
1376A252L867J354r761n977P864N431j92N87n851o422M910O223J876n9p931o505
$$ plain form
1265 -72 -438 575 -172 54 281 -957 494 858 -1597 688 2549 -2158 -2055 2329 100 -1454 2384
1282 2384 263 -2937 235 1192 -189 1871 109 -3276 -121 1448 -701 1912 1955 -3733 -2792 2518
1298 2518 1404 312 1437 -1600 -3361 452 2365 2049 540 -3311 -2898 1641 2020 875 1090 -2301
1314 -2301 -3888 895 3942 1579 -1162 -3010 -2303 1653 2913 1427 109 -3248 -4321 2495 5346
1329 5346 597 -1745 -2306 -3412 668 5310 2495 -1611 -3900 -4026 1765 6053 1392 -2191 -2016 -4215
1345 -4215 -569 6792 4015 -3806 -4122 -2177 712 5536 3543 -2905 -4328 -3068 489 7259 4526
1360 4526 -5469 -5497 -541 887 4887 5666 -3565 -7928 -2174 2875 5993 4019 -4017 -6350 -1616 1252
1376 1252 5119 6473 -3288 -9265 -1401 4030 3838 4425 -1426 -7848 -2938 3285 5161 5102 -2829 -9334
1392i334P870O899k644Q80l420j0080N132J2561j765n438k075o193K468J1984
1406F845K79o302k314n967M36J4140K527j0924k029m78k601R182P678q315p662
1421e505K82J587P027M713o657n702N4m0O370P333p107r150J567M355M006L558
1437F691m353p005j647L047Q260M597r443p832L968K585K514Q099m894j3882J961
1452g334Q605J718L737k368j2164K17Q998R19L229J413j4181l978J4219K948m853
1467A125L392n722r983R186J0641m706l421k160o309M848J0791k531n990o20m616
1482f075J018J1971J860j1098l428L268N10M096N853n005j0439Q06Q327K851r54
1497C561j467n933l489P131N822j740k555m502m461P063Q035n238l734J996n807
$$ plain form
1392 -9334 -1464 5435 2791 3671 251 -9829 -4697 7864 6099 661 -1414 -7607 -5139 6845
1406 6845 7124 822 -1492 -7459 -7023 7117 9644 -1280 -3309 -3787 -6388 2794 10472 2157 -5505
1421 -5505 -5223 -3636 3391 8104 1447 -4255 -4201 -4241 2129 9462 2355 -6795 -5228 -873 3133 6691
1437 6691 2338 -4667 -6314 -3267 4993 9590 147 -7685 -3717 -1132 1382 9481 4587 -9295 -7334
1452 -7334 1271 2989 6726 4358 -7806 -7589 1409 2328 5557 6970 -7211 -11189 3030 5978 1125
1467 1125 4517 -1205 -11188 -2002 8639 3933 512 -1648 -7957 -3109 7682 5151 -839 -1459 -6075
1482 -6075 -5057 6914 8774 -2324 -5752 -2484 -1974 2122 7975 2970 -7469 -6663 1664 4515 3561
1497 3561 2094 -3839 -7328 -197 5625 3885 1330 -3172 -7633 -570 7465 2227 -1507 489 -5318
1512e318pJ2938k35j1840R76L556l556N133O259q237n860M403J665J897M184n604
1528C54p206M808M089j197K710l72q991p33R868J882n253Km08m712L163Q695k568
1545D131p802J177J312j149N659K296q127j110M264l039K700P452q449p139J0010
1560B186M36p409Q811K379j4319L447J1416p754j861Q305p388n008J1077j137
1574C181p054O840j598q677R172N249j1426K024P363q504o60J0990m909q158O972
1589H05J396n194M127K098n351N68K816k108Q14K255k980j414L174j37k375J764
1605B58K105k725k344L414J456m423J143N116m474l842O234Jn581M750K915p420
1621c417J537N172n414Q87O597o884l400Q622k674n917R339j45j2072O451P970
$$ plain form
1512 -5318 -5325 7613 7378 -4462 -3486 70 -3486 1647 7906 -331 -6191 -1788 -123 1774 5958 354
1528 354 -6852 -2044 2045 848 3558 3186 -5805 -6538 3330 5212 -41 -39 -447 -5159 -1996 6699 4131
1545 4131 -3671 -2494 -1182 -2331 3328 5624 -2503 -3613 651 -2388 312 7764 -685 -7824 2186
1560 2186 2622 -4787 4024 6403 -7916 -4469 6947 -807 -2668 5637 -1751 -6759 4318 3181
1574 3181 -3873 2967 1369 -7308 1864 7113 -4313 -2289 5074 -3430 -4090 6900 1991 -6167 805
1589 805 2201 -2993 1134 3232 -2119 -1551 1265 -843 -29 2226 -754 -2168 1006 869 -1506 258
1605 258 2363 -362 -2706 708 2164 -2259 -1116 4000 -474 -4316 1918 1919 -3662 1088 4003 -3417
1621 -3417 -1880 3292 -2122 -1235 5362 -1522 -4922 3700 1026 -4891 4448 4303 -7769 -1318 6652
1636F652r400N00Q352q562m033J1226j676o880O006j271p019Q014L929r199J812
1651a549N042p829J821J0296o872p404P815J61n034O938J773r266K09N596j530
1666A67J283K487n931k520M733J177r0K296m084n193L851N113n29j768j196l043
1682c247k22M528M188k690n526o33K903J371K248J265n728m293M814L419k64J036
1698C169l893n452M927N105k715R94o46p943K219J0555k821n438L088l543l812
1713f206R880L583q692q39J283l856O290O703q104m380L686k618K476R116n282
1728C040r901M252K950j430O048J30j0125m08N885J005K170L83p574k566O545
1743D04K060L74N67o126l863O242M490j071j311l991l432L938N421N86k219n024
$$ plain form
1636 6652 -2748 -2248 6104 -2458 -6491 4735 3059 -3821 2185 914 -6105 1909 5838 -3361 -1549
1651 -1549 3493 -4336 -2515 7781 909 -6495 1320 1481 -3553 3385 5158 -4108 -3899 1697 167
1666 167 1450 3937 -1994 -4514 219 1396 1306 3602 -482 -5675 -1824 3289 2760 992 -204 -3247
1682 -3247 -3469 1059 5247 2557 -2969 -3602 -699 672 2920 4185 -1543 -5836 -1022 2397 2133 3169
1698 3169 -724 -6176 -1249 3856 1141 2135 1489 -6454 -4235 6320 3499 -1939 1149 -2394 -6206
1713 -6206 3674 7257 -1435 -2274 -991 -4847 1443 8146 42 -4338 -652 -3270 -794 8322 3040
1728 3040 -6861 -2609 341 -1089 4959 5089 -5036 -5444 441 1446 3616 3999 -3575 -6141 404
1743 404 2464 2838 3405 -2721 -6584 -342 4148 3077 1766 -2225 -5657 -1719 3702 4288 2069 -2955
1759b955k796M691M951j48j741m002m412M239O741j11l108l441l650L557O445
1774D260J21l509k514l578K278P781J72n647j799q86M28O232K607n952l741P08
1790c039J265M753K639n186m546J114J546L662L344m007o274R00L559K593K001
1805D324k053n722j352M071L820J156k940m617j047L537L663J053k406m469j462
1820d444L669M127K27l106l405o85K846L437J087l423l670O9L077L184K50k894
1836C46l206k52K698K954Q71k929l724L24L061K200K28j832l577m97L375K627
1852B667J95k421l385k00L507K239k8j556l829q25M144K602r71j646k451j516
1868c474L294L283r78j831k112j393L167L110j560j842n95j705J676L918j143
$$ plain form
1759 -2955 -5751 -1060 3891 3743 2002 -2000 -6412 -2173 4568 4457 1349 -2092 -5742 -2185 4260
1774 4260 4381 872 -1642 -5220 -2942 4839 5011 -636 -2435 -3321 -2893 3339 5946 -6 -3747 -3039
1790 -3039 -1774 2979 5618 432 -4114 -3000 -1454 2208 5552 1545 -4729 -3829 -270 2323 4324
1805 4324 2271 -3451 -4803 -732 3088 4244 1304 -3313 -4360 -823 2840 3893 1487 -2982 -4444
1820 -4444 -775 3352 3579 473 -2932 -3617 -771 2666 3753 330 -3340 -3271 -194 2990 3240 346
1836 346 -2860 -3112 -414 2540 3411 482 -3242 -2918 143 2343 2571 739 -2838 -3335 40 2667
1852 2667 2862 441 -2944 -3144 363 2602 2574 1018 -2811 -3636 508 3110 2139 493 -1958 -3474
1868 -3474 -180 3103 2125 294 -1818 -3211 -44 3066 1506 -336 -931 -2636 -960 2958 1815
1883A815k419j05j107M67L638l93k860R6q5m07L184M45l377k23J154r00J934J978
1901B835l540j502K080j34O21J947k491k369K417O70m38J783j439k510J451J731
1917A112j085O78Q1k231N62J454j91q1l2j188M71J077o25M88l8j433N49J010p43
1936a65J71Q00j670K53J677j274j33J425j294r54K355r16j495K063k82k032K373
1953I02K07k912J886J544k610N96K046k729j66L091j754j578K249m60j578K238
1969I72K96k486N38J209p44P88N56j671p27Q39P98M45k30q69p08o3J392J235j275
1988B95q98K44q76N86K867j161k714J588j43j403L187J123m497L50K632k288Q94
2005b14L556m012k606M510l32k072L326j256m746L469L078l063Q56R31m566J162
$$ plain form
1883 1815 -604 -709 -1816 -1349 2289 1896 -964 -868 -953 -1360 1824 2269 -1108 -1331 -177 -1077 857 2835
1901 2835 -705 -2207 -127 -261 360 2307 -184 -2553 -136 534 96 1879 440 -2070 -619 1112
1917 1112 27 705 786 -1445 -883 571 380 299 267 -921 -450 627 2 490 452 -981 -432 578 -165
1936 -165 6 806 -864 -611 1066 -208 -341 1084 -210 -1164 1191 275 -1220 843 561 -1471 902
1953 902 1109 -1803 83 1627 -983 -387 1659 -1070 -1236 1855 101 -1477 772 312 -1266 972
1969 972 1268 -1218 -680 529 -215 573 1129 -542 -1269 -430 368 813 583 -286 -994 -1057 335 1570 295
1988 295 -603 -359 -1235 -649 2218 1057 -1657 -69 -212 -1615 1572 2695 -1802 -1452 1180 -1108 -214
2005 -214 3342 -670 -3276 1234 902 -1170 2156 900 -3846 -377 2701 -362 494 1425 -3141 -1979
2021a979M848j572k008J548k484j200M854O92l108k97j80j155K809J944j825k124
2037a237k98L77J494J435m5k115k139J202K772k57m87j2l003l95M558M25k961
2054f86Q01o75k583M425K861m844r02K142l009J830N268l745m185L335l50j344
2070a661N548r74o947K151L407k752K652K553o325j529N245o78p43L071l202m251
2086d435M143K697k038R36o07l971J325L967l68j388j44j842k54K828J522j703
2102F68k036j75Q77J446J116m79l071r12K668J350n95L56j864k819L150L174k059
2119G95o57K43l385R34N261r22l272J129j359j970N184J919m762k47J148k764
2135b725K422M550l528l152K546p35r24M203m28m800J252K227j303J102J480l583
$$ plain form
2021 -1979 2869 1297 -711 837 -1647 -2847 2007 2699 -409 -706 -886 -2041 768 2712 887 -1237
2037 -1237 -1535 -1158 336 1771 1726 -389 -2528 -1326 1446 1189 702 690 -2313 -2708 1850 2275 -686
2054 -686 115 -560 -3143 1282 4143 -701 -1603 539 -2470 -640 4628 883 -3302 33 -317 -1661
2070 -1661 3887 2913 -4034 -1883 1524 -1228 1424 3977 -2348 -3877 1368 690 -53 3018 -184 -4435
2086 -4435 -292 2405 367 1303 696 -3275 -1950 2017 1649 261 117 -1725 -1979 849 2371 668
2102 668 -1368 -1543 -666 780 1896 1417 -1654 -2566 102 1452 857 1213 -651 -3470 -320 2854 795
2119 795 138 381 -3004 -2070 3191 2269 -1003 126 -1233 -3203 1981 3900 -862 -1109 39 -2725
2135 -2725 -303 4247 719 -2433 113 -622 -1546 2657 2229 -2571 -1319 908 -395 707 2187 -1396
2151a396j160L490L19j339Q42j005k413K375K749j718j067k02j006L12K955M02
2167B138k408r09J60lJ568J849j830k116N06O24L30J582J12k792o20J981J96O2
2185D30J099j551j988J618J685j113L0K69j764L57K303k88j704L83p2q74K031
2202H51Q38k316l66J161o51M10J850j563k062J428R44p51J162K42k388k47K085
2219F27k97k67J147j509j504J703Q63q99P26j90j768Q25J855r21o16P48j063l59
2237h99J672R9j352J88M21p43O84Q53j180l22N13R4j98N66l18n82K53M37n3q8
2257D5K4l38k42N89N41n39j29J71j90m26N48L78l42k86K61l44J37O30k86m56M77
2278B23l34k85Q02l3q35L14N41q00L93M91n16k29P95n24m64O52L2l49K85j23n24
$$ plain form
2151 -1396 -2556 934 1253 -86 756 -249 -2662 -287 2462 744 -323 -525 -1531 -1219 1736 2138
2167 2138 -270 -1179 -1019 -1022 546 2395 565 -1551 -1045 -421 -91 1491 1603 -1189 -1809 172 368 430
2185 430 1529 -22 -2010 -392 1293 180 210 479 -1285 -928 1375 1087 -617 -234 -306 -1180 851
2202 851 1689 -627 -993 168 -483 -73 1777 214 -1848 -420 524 -227 935 1177 -1211 -1458 627
2219 627 330 63 1210 -299 -1803 -100 763 -136 590 400 -1368 -543 1312 391 -225 523 -540 -899
2237 -899 773 872 -480 -292 129 -614 70 923 -257 -579 -66 28 -170 396 78 -504 -251 186 133 45
2257 45 69 -269 -511 78 619 80 -49 122 -68 -494 54 432 90 -196 65 -279 -142 488 202 -254 223
2278 223 -111 -396 406 373 -462 -148 393 -407 -14 477 -39 -268 527 3 -461 191 223 -126 159 36 -488
2299d88M78N94n84j18J89k68O2P09k62o22K08J79j96L07J70m55l57M50J80j68
2319HK69l71l96L81L0J76J96l41l46K98J86q3J78j58r7l08M55J10k20K24n78M4
2341c43M89J11j9j55m58j97O29L49j92j88k14m24P29N36m38l21j75k08N08O31
2361F50l02n65J33l72K38P09l2m85j12r5r4O85k9m60P9k06k23P91M82j122r3M01
2383b2j58J27Q66o27p84M22K16J38M21m41q14L85N53l1K23j24j053M44O79k97
2403A23K67L5r04j04Q90p5r3K94o17m07P12K26j86K22n71m96N09L53k6K00o49
2424b97j62M32K51j38J35j90q89Q44O46p23K67K1q76N60Q89o39l29L91o65J13
2444c59J065m33o84N34j87m85J110p5r78K05K90n34O96P72j030l42L71j60J26
$$ plain form
2299 -488 -10 584 0 -118 71 -197 -135 574 312 -310 -102 77 -119 188 358 -97 -454 -4 176 8
2319 8 277 -94 -490 -109 -79 97 293 -48 -394 -96 90 7 185 27 -70 -378 77 187 -33 191 -387 -343
2341 -343 146 257 238 83 -375 -572 57 406 214 26 -188 -612 117 653 215 -106 -281 -489 19 650
2361 650 348 -217 -84 -456 -218 491 459 -26 -138 -233 -327 358 329 -131 -52 -258 -481 310 792 -330 -423 -22
2383 -22 -180 -53 813 186 -598 -176 40 178 599 158 -656 -271 282 251 474 350 -703 -259 420 123
2403 123 390 425 -479 -583 307 232 139 433 -184 -591 121 347 161 383 -188 -684 -175 178 152 352 -297
2424 -297 -459 -27 224 86 221 31 -858 -14 632 -91 176 197 -679 -119 770 131 -198 193 -472 -359
2444 -359 706 273 -411 123 -64 -549 561 486 -492 -287 3 -531 165 937 -93 -435 -64 -224 -98
2463i8Q76n90q06J89K52J78M83K41q55m90J6P54M32k55k58l46j61M51M35k57j52
2484C9K0n41J54Q76k65n15P33o57m65J140K4j515J082N11j337P08R96j633j1J555
2504H99j025k33J187q29j334J657L22j049P66J47j723P39J536j172K1O32r75l40
2522g74J223K34q00O62o60o69P97N57l74q4j02m04J34L67L50k94m77K84K29l92
2542a93L10M85r09j74J096l73p91J274o70j228J796K29j610P18O46j703P96J974
2560A673j776p27J606j320n91K491n23j901J270j10j529J739J227k126n5J257
2576F05j385J86J928r15j155J042k38q42J256M39j456K18N19m19L0P96o08l70
2594c69M93O9l76j16L45K1n7L44Nr27r9P20rn4Q48o54j260J106M03p72O37M31
$$ plain form
2463 -98 778 188 -618 -429 -177 1 484 725 -130 -620 -604 150 582 327 69 -277 -438 13 448 191 39
2484 39 59 -482 -328 548 283 -232 501 -156 -621 519 543 -972 110 621 -716 -8 988 -645 -656 899
2504 899 -126 -359 828 -1 -1335 322 644 -405 361 508 -1215 -476 1060 -112 -91 541 -434 -774
2522 -774 449 683 -117 545 -115 -784 13 570 196 112 10 -394 -260 107 457 163 -314 -30 199 -193
2542 -193 117 602 -307 -481 615 242 -549 725 55 -1173 623 852 -758 -40 606 -1097 -301 1673
2560 1673 -103 -830 776 -544 -1135 1356 833 -1068 202 92 -1437 302 1529 -597 -652 605
2576 605 -780 -594 1334 419 -736 306 68 -774 482 921 -535 -317 202 -217 -187 609 1 -369
2594 -369 124 193 -183 -299 46 67 10 354 359 -568 -667 53 44 -10 838 184 -1076 30 433 -339 298 729
2616G29j594J64J407q81j50J314j083j186J820L2j205J131M14j761L92J169j097
2633c85K90J064j119o98J361m93q47J126L98j287N90M22j178K19J130n43m74Q29
2651D05k79p43P45L79n06j42L68m15l54R75nq18N49L40j087J20J019n33l61R29
2671E86m89q52J013L00p66L41L74j026M5R87o79O2P01m59q05P71km76Q89M9j075
2692e11j52R12j20k94P40l39j059N51N20k43J27J11m03q5N21N2n36J22K32m23
2712b77J81Q27r29m42Q03l9m65R48j94j235K58J067n39OM28p46m25J062J68n49
2732i2N72m64j027R19P50o09L6K70j286L48J411j79q85J71j21l84O33N63o90j28
2752a92k50O4P65M49p88m70J59N2L13L86k72m68l87O86K20Kj45m69j01J42Q95
$$ plain form
2616 729 -865 -701 706 -175 -325 989 -94 -1280 540 572 -633 498 912 -849 -457 712 -385
2633 -385 -95 969 -150 -848 513 20 -827 299 697 -590 0 422 -756 -537 593 50 -424 405
2651 405 126 -617 128 507 1 -141 227 -188 -542 433 428 -390 159 499 -588 -468 551 18 -343 586
2671 586 97 -755 258 558 -208 133 507 -519 -474 513 -166 -104 597 138 -667 104 102 -374 515 564 -511
2692 -511 -663 249 129 -165 575 236 -823 -272 248 5 132 243 -160 -245 276 328 -208 -86 146 -277
2712 -277 -96 731 -198 -640 163 124 -341 607 413 -822 -564 503 -36 -30 398 -348 -773 289 457 -92
2732 -92 480 16 -1011 -92 658 49 85 355 -931 -583 828 649 -236 -65 -186 -570 63 626 -64 -192
2752 -192 -442 -378 387 836 48 -422 -263 -211 102 488 216 -252 -639 47 267 269 124 -345 -446 -304 591
2773E91J07q38l66J05Q8O35M18n84o51j85K31Q60P32r67j331Q02M79j69P64K9
2793G50j514p7R04M09K25l41r93j14O63L35K85j23q65k09Q17N73k78k70k30n93
2813f46J72J167P6q57n13j5M81O88m9k49o71l82N77J195j75r14l79J69l2O69N40
2834H52o19q61m54J042O63o0o09k82j29R0Q62N51j148p58L88M59L73J80l97o59
2854e16r1M79Q32J75p77j053N02M63M43J21j3j147m48J047Q55k86o49l75k26O08
2874e6N64K11m48r58l47J169P23n29k81k85m95M48R43lp86m26J37M72M01k28j74
2895E2n24r1L79R27j15j025j79L45K44K36L99l94p78j27P41M36k66m50M2l19K48
2916b19O77J39o12o60L28N61O7j23k2l73o4J12N20K44p67l43M60L88k67J55L7
$$ plain form
2773 591 698 -140 -506 -401 -313 322 740 156 -495 -680 -449 411 1143 176 -1155 -353 126 -43 721 750
2793 750 -764 -841 63 472 697 356 -637 -751 -88 247 532 409 -456 -665 152 725 447 177 -53 -646
2813 -646 -474 693 769 -88 -601 -616 -135 553 504 255 -416 -798 -221 974 799 -115 -494 -325 -357 312 852
2834 852 233 -628 -1082 -40 623 563 -46 -328 -457 -367 495 1046 -102 -860 -472 -13 360 540 143 -516
2854 -516 -607 -128 704 879 102 -951 -449 14 457 578 565 -582 -1030 17 872 586 -63 -438 -664 -56
2874 -56 508 719 271 -687 -1034 135 858 329 48 -237 -732 -284 659 656 -130 -556 -419 53 454 226 52
2895 52 -472 -563 -184 743 628 -397 -576 -231 13 249 648 254 -524 -651 90 526 260 -190 -148 -467 -219
2916 -219 458 597 -15 -675 -347 214 281 158 136 -237 -301 -189 331 575 -192 -535 -75 313 46 201 238
2937B38o58l1P17K14l45l06m1J32J65K96k59j24k56j70M98N39o45j71L25l02K7
2958a57M15L70q26k31K70N36l33M9j92k16m2L01L06j88j58j95K20K88l32j35M47
2979A97j91l82M69N50j057Q2O98J02p60M80j7n24L12L39k66j10J0l74M66M74q91
3000c93L04N18m13m63P83r4q41O06N05o47J2M74n24o6K87J75k9m1o97J77N96K6
3022B55l27J86p5o10K76J004k72o83k11M02o9J58L77o1r85N2Q45j27K7r0l66N3
3044b41M46k21J86K63q82k77J189R5j009L61M65j073L18J476o96j096M78J39o7
3063a46P93m2j229L6K20J34J035K74j660m54J017J29pJ035q61j362L13J274J39
3082F38k41j80p83j4M09P28k22l82m61K8P10K74l27n12J42k44K05R27K39j599
$$ plain form
2937 238 -420 -451 266 480 135 -171 -212 -80 85 381 122 -2 -258 -428 70 609 -36 -207 118 -184 -157
2958 -157 258 628 -198 -429 -159 377 44 93 -99 -315 -357 -56 250 62 -96 -291 -71 217 -115 -250 197
2979 197 6 -376 93 643 -414 -332 366 468 -292 188 171 -353 -41 298 32 -78 -68 -442 24 498 -393
3000 -393 -89 429 16 -447 336 242 -599 7 512 -135 -123 351 -173 -239 48 223 194 153 -544 -367 229 255
3022 255 -72 114 39 -571 -295 709 437 -246 -457 -55 -124 34 411 350 -635 -583 262 135 162 72 -294 -241
3044 -241 205 -16 170 433 -449 -726 463 558 -451 -90 375 -698 -380 1096 400 -696 -218 -79 -146
3063 -146 647 605 -624 -588 -368 -234 801 1075 -585 -1039 -22 107 100 1135 274 -1088 -775 499 638
3082 638 397 217 -566 -580 -171 557 335 -47 -508 -480 230 504 177 -335 -193 -437 -232 695 934 -665
3102f65j34J034o1J0M97o38j345Q49J108L2l25m84j242Q28J274j77k58j58j142
3121i97l9J816M40j026n92J39m96O46J427n47j429L9N5L60J003j01j006l80K83
3140d05L92O78k4r34o02O78O59j26J25l19j022J13J752n3r09l68k05k29J343P01
3160A245r35j019j34J26J080J090j083j099M2J46M04J451k66j944k90J266K39
3177C19J63M56j204q02O45R79p4J61q97o50M96P53K36k48k80r37K52J241K22r32
3197a01m76P6L82N43O30n94j192q8P79N27J03j8j019q13J099O55K10j92r27p06
3217a122R89R50l44k23k9j155K60J444O4j078J01j58n46J226O10r44m23J57j98
3236d19P38P58j011p14L89K8K88Q14m64j037j41P78L22J95k77o57m2M19M50K00
$$ plain form
3102 -665 -799 235 174 184 681 43 -1302 -453 655 687 362 -122 -1364 -536 738 561 303 145 -997
3121 -997 -1036 780 1220 194 -398 -259 -755 -109 1318 771 -658 -619 -564 -204 799 698 -308 -688 -405
3140 -405 -13 665 641 -293 -895 -217 442 316 441 122 -900 -787 965 912 3 -365 -570 -799 544 1245
3160 1245 310 -709 -843 -717 363 1453 370 -729 -687 -541 -137 1314 1048 -896 -1186 80 319
3177 319 482 938 -266 -1068 -423 556 482 643 -254 -904 -408 345 581 333 53 -884 -632 609 831 -101
3197 -101 -577 -501 -119 424 1054 460 -732 -820 -41 486 589 571 -448 -1261 -162 493 703 511 -416 -1122
3217 -1122 -133 817 473 250 221 -934 -674 770 834 -244 -143 -301 -847 379 989 45 -378 -221 -419
3236 -419 319 1077 66 -648 -259 -231 57 871 407 -630 -771 7 329 524 247 -410 -452 -33 417 617
3256F17m46o84k6N22K17L96m09m72l05K05P67J97o26m22K75J60Q9L16j05o26j85
3277e45O94J61j25K08p06l97O68L21k40K18l82k34L20M73l24k45J36k57O9P06
3297E19j54m01j73J79J5J94Nl94n2J05L24K07j7o02Q9J86K00k11m1k7Mj46M59
3320B68j63o7j93l5J71J02l4R5k06p2L84k20J9j79R2J69M3k28O5J28k82J52J57
3343A66J01k27n1j50K28k9J53k93k17J76L04Q9k55j28j43K81P1J5Jj74m26K86
3365b22N00N5k68l24n0K62K91J27k32l09q2J99J96J64k95j44k72N05J04M0j08
3386A37n46n7L77L37J02j29n06l37L92O13J64m31l65k96N68M47N5l61l48m42M48
3407a78P02l5n45l09r0L63O16k4l52o78j00N86N29K04n67o07l9M69M96J44n36
$$ plain form
3256 617 171 -513 -539 -17 200 596 187 -285 -590 -385 382 579 -47 -469 -194 -34 55 371 266 -360 -545
3277 -545 149 310 185 393 -313 -710 -42 279 39 257 -125 -359 -39 434 110 -135 1 -256 -187 519
3297 519 365 -36 -209 -30 -15 179 184 -210 -262 -157 167 374 357 -245 -156 30 230 19 -22 -49 -45 -191 268
3320 268 105 38 -155 -190 -19 83 49 144 -62 -134 250 30 49 -130 -38 131 174 -54 11 139 -143 9 166
3343 166 267 40 -11 -161 67 38 191 -102 -319 -143 161 250 -5 -133 -276 5 76 91 92 -82 -508 -222
3365 -222 278 333 65 -259 -309 -47 244 371 139 -170 -252 -53 143 307 12 -132 -404 101 205 245 137
3386 137 -409 -466 -89 248 350 221 -285 -622 -230 383 547 116 -249 -545 23 470 525 164 -184 -626 -178
3407 -178 524 489 -56 -365 -455 -92 524 500 148 -530 -630 -44 485 689 122 -485 -524 -55 441 585 49
3428D9n92q3P49M00m1n36n60j3N47N84Pm79n27k12O26O17J58o02p88J48N59M70
3450D81p0n88n01O5P03L63Rl22p14p1P71N02n7n35o28m4P83O49j95m60o15j80
3472f54N23Q66j34q43l36qL94O85L08r38n18J04O33M29J93q18p06K88J003J17
3492E88Q6o01j000J71J032N59l41n31o42O6N22J004n56m01m10j81O80Q91l55p54
3512a73n85L99K00Q26j31n44n18P6N44M57J09o12p89L03P67J90k31m91m45J19
3532e29J026P8m24k21l27k15Q30N89n75o00pJ3O19N32j98j048j34M02K30O36J77
3553H54j185l28M93K37K83L31n55r64N32M99J84j84p3p86J53P51J88l24k20j67
3573b81j57O08M08m93n64K25O3K54P41o93o94P0M18K29L37r7p06k74M76N38L6
$$ plain form
3428 49 -543 -626 123 523 482 -54 -614 -627 -80 504 511 32 -495 -707 -81 536 694 92 -696 -548 11 481
3450 481 411 -177 -678 -613 90 453 462 140 -574 -645 126 628 571 36 -592 -636 147 796 601 141 -474 -654
3472 -654 -131 735 601 -242 -578 -586 -192 493 801 -137 -655 -551 82 511 704 -114 -820 -532 471 588
3492 588 674 73 -927 -756 276 835 494 -37 -679 -613 -91 913 357 -44 -454 -635 45 936 581 -173
3512 -173 -758 -359 -159 667 536 -8 -526 -450 94 551 660 48 -741 -438 329 519 288 -203 -648 -529
3532 -529 497 575 151 -70 -397 -612 218 807 232 -368 -375 -362 257 789 591 -457 -591 -189 41 677 854
3553 854 -331 -659 -166 71 354 685 130 -834 -302 197 381 197 124 -662 -509 242 430 106 -114 -281
3573 -281 -438 170 578 85 -479 -254 -191 63 804 111 -583 -513 -95 134 471 374 -332 -606 -130 408 444
3594D44j45n93l77O13N34k75o4k1m37j57P36K55n82Mj82k58L39P56m70l66K69
3615B3r9j68P58l10o35M06K39r6q9K84n11l24P72j10k56J44q1l41N36L12m29k45
3637b20L02l29J91L95k3o37L03J23j66R5K94l38m25N34k27K1K60J68m83J33L36
3658C07n98J24M57l75J04K51k67k66L23J14j63K34J79o46n0M05N1j62J53k38l06
3679c69J95M99j48j08J19n01K30L09j56j61L0K9j11K02M9k18K7J87Jj29J27L4
3701A37o48N39J27j24k15K42k83p2M61J41n45J04j33j86O09K64m94k09K89l79
3721c75L96O29k37r09K85PJ87N91n9r05O4L63J23J68Q3o01k40L11K54k7J10m68
3743b50k28M34L04J35k88k41k1r3M46K44l01m50j12L09J97J80K6o27k31N06L32
$$ plain form
3594 444 299 -294 -671 -58 476 201 137 116 -321 -478 258 513 -69 -65 -247 -505 -166 590 120 -246 23
3615 23 -76 -244 514 204 -431 -25 214 118 29 313 -198 -522 250 140 -116 28 -53 -394 142 454 25 -220
3637 -220 82 -247 -56 339 316 -321 -18 105 -61 34 328 -10 -435 99 -128 -107 153 321 -162 -29 307
3658 307 -291 -167 290 -85 19 270 3 -263 60 174 11 245 424 -222 -272 133 184 22 175 -63 -369
3679 -369 -174 325 177 69 188 -313 -83 226 70 -91 -61 -32 -143 59 108 -110 -83 104 105 -24 103 137
3701 137 -511 28 155 31 -184 58 -225 -297 164 305 -240 -136 -269 -455 154 418 -76 -285 4 -375
3721 -375 21 650 413 -496 -211 -204 -17 574 515 -390 -326 37 160 328 411 -190 -430 -119 135 108 218 -250
3743 -250 -478 -44 260 395 107 -134 -155 -248 198 442 141 -309 -421 -112 85 265 291 -336 -567 -61 271
3764B71K7mn14k57L71L65r6p3j53m03L52P39k88l74j37k48M5O75R9l30l93M9R2
3787a85M05M03n96l02oJ18M19K99n53m87J41K58L19L04m71m06l3L21L93J74m33
3808H2l45j03K63M20J12l03n49q1M58L90M2k45m96K4K29N06P0o18k35q1L95N31
3830D66j12k49n49J9L24M21p2j76l59JL29L40pk91m89J55K99J93M6k79m55M6K89
3853a10L84J15l68l93J36M26K9Pj40l40J8J19M28j19l17k10P2K90L68k09r0l66
3875b70P0J76K82M7n19Ml5M94j13Q8l77k9O0K46K16k2m75k54J92K03L35Q4m50
3898d7l53K58L88P0j17j81k51N0L43rN7l46j41O8M56L5q3k37l57L47P3O6L4k55
3922a32j20r0N00o8Q5k37q7P4Q6J91k25om5p8L79j40r8j39J4K03J28o5j64j87
$$ plain form
3764 271 298 294 -220 -477 -106 259 163 90 -63 -466 -114 625 337 -37 -174 -422 -377 298 397 67 -326 -277 -185
3787 -185 220 623 27 -275 -281 -163 256 555 2 -485 -344 -86 233 537 66 -340 -373 -52 341 515 82
3808 82 -263 -366 -103 317 429 126 -423 -504 -46 344 386 141 -355 -331 -102 404 474 -144 -379 -460 -65 466
3830 466 354 105 -444 -425 -101 320 248 72 -287 -286 43 383 376 85 -404 -249 50 243 289 10 -445 -399 -110
3853 -110 274 389 21 -372 -236 190 219 226 86 -254 -236 -117 311 192 -125 -335 -263 27 395 186 96 -270
3875 -270 -200 -24 258 305 -214 -210 -245 249 136 224 -153 -182 -122 124 340 318 -157 -411 -219 -16 319 403 -47
3898 -47 -400 -142 246 316 199 18 -233 -183 160 151 208 -138 -279 -211 245 280 197 -40 -397 -50 23 89 123 -132
3922 -132 -252 -342 158 90 175 -62 -149 -75 11 202 -23 -29 -74 -152 227 87 -11 -150 -136 67 195 130 -34 -221
3946b21J53J15j34L64l31j56L59k33K61K4k65k45K72J47j68J32j23k31J70K96
3966A86k54K13Qn01J22L39R6j80l4n6M2K27P9l42Pjk4P7Q4k03l1J69j15R1r3O8
3992b6k2K6j8K62j91k18J49j39J74P6p0k27J91j5j41L94o8l79J34K25p6J18K27
4015C86m68j71K66K6J25l2j10k43K31K47j28q3J16l13N4K92j04l58K92n8M3PN8
4038G5j50j94K71m3m6L23j88j23j18J94J28%o1l09j98M18J66j20m4rj25k29Q20
4061D38l55j67J54k36K6M08j34l16J45J89l77J88K40l38o7J62J21j87J55j77k00
4082c28M25L7l1j27K08k30j93L55R0l10Qq0j75L67K42k23j56j4N6J4K37j15k60
4105b03J03M4j81K19L59l67k16L64o8n3l6J38k89K85K30l46j35K61j68j77M70
$$ plain form
3946 -221 -68 47 -87 277 -54 -210 149 -84 177 201 -64 -309 -37 110 -58 74 -49 -280 -110 186
3966 186 -68 145 153 -348 -226 113 209 29 -5 -61 -19 208 287 -55 -48 -49 -73 4 88 -115 -146 23 -92 -1 -94 -26
3992 -26 -48 -22 -40 222 31 -187 -38 -177 -3 73 3 -224 -33 -48 -189 205 137 -242 -108 117 41 159 386
4015 386 -82 -253 13 39 164 132 22 -221 10 257 129 46 162 -151 -97 195 91 -267 25 -33 10 17 75
4038 75 -75 -269 2 -41 -87 236 48 -75 -193 1 129 129 68 -241 -439 -21 145 25 -19 -28 -153 -382 438
4061 438 83 -84 70 -166 -140 268 134 -182 -37 152 -225 -37 203 -135 -202 -40 81 -106 49 -128 -328
4082 -328 97 134 103 -24 184 -46 -239 116 206 -104 -96 -176 -351 16 258 35 -121 -135 -79 -65 172 57 -203
4105 -203 -100 -56 -237 -18 341 -26 -242 122 54 1 -35 103 -186 99 329 -17 -152 109 -59 -236 234
4126B34p8k79j9J14j69K25K02l79R7J82Q7k17J30r0l08K05K28q6k34M05l02m58
4148e10N13O5j63K05p7l09J86L52k91j20L85j47k37L12m1n07L46K68l67M6K21
4169A30k90j87N51j54r6J34k63L6K14J95k35k18K20k30LM87k07k83J95J0q1n7
4191a26L24j47k89J80K30m48M31n6l18L30p5m6mK5j41n7M48n4n07K21J12j5q6
4214f8M08l46k99K18J16K5j8j8k45J05K04p9L2K76n58N5M03k02j1O0j16j47J28
4237g7K56k3k13m3j31K40J71K1l19J25K1m1M2Q5k53k2K49j70k0K58J21n81J98
4260a06L58j35l49L74k91LJ34L04k70j65k2M3L70n5l90J19K13l18N1M70j03m50
4282b15J34K08j93K5K66j14j75j03K34J82j19j93m0j1P0o3J81l0k29j22O43o4
$$ plain form
4126 234 156 -123 -142 -28 -197 28 230 -149 -52 130 217 0 130 40 -268 -63 165 79 -155 250 -52 -510
4148 -510 3 68 -95 110 33 -276 -90 262 -29 -149 236 89 -148 164 123 -384 -38 230 -137 -91 130
4169 130 -160 -347 204 50 -46 88 -175 -139 75 270 35 -183 37 -193 -190 297 90 -193 2 12 -69 -126
4191 -126 198 51 -238 -58 172 -276 155 99 -219 111 36 -10 -14 11 -130 -187 261 207 -300 -79 33 18 -68
4214 -68 340 -6 -305 -87 29 54 36 18 -227 -122 82 3 35 311 -247 -192 211 9 -2 58 -58 -205 -77
4237 -77 179 156 -57 -100 -231 9 180 201 -118 7 28 -13 29 114 -139 -161 88 -82 -102 156 277 -304 -106
4260 -106 252 117 -232 142 -149 -146 -12 292 22 -143 -165 -122 248 193 -197 -78 135 -183 -132 338 235 -215
4282 -215 -81 127 -66 -41 225 111 -64 -167 67 249 130 -63 -103 -114 -44 -107 74 44 -185 -307 336 272
4304B72k93K9M8k24Q0L05L2m62P0J63K30m22J89m3J4j55N6K54N2k52n1J56j18
4327g0j68L70P5n06J68K11m4j9L0j26J14j48J54L1j97j87K15L03k14j96L24K7
4349A47j58j08M13l70k05K89J94k17o6Q6J42k96QK25J7k06M6K15q0j64K1K12p5
4372G0k20n4K66o2p6OJ24R7k78L80r0k91P1Q3N7k0j8np6Nj40L89m4l24J49L57
4398C56l68n9L21r2j28k2J46j26k07J10K19j54j99L4J47p4k9J26l6j10j42M09
4420A22J20k34k6Ml0q2J00Q3Jl57L79K42k85l7N5m6j53K8L59m4j77l44K84L73
4444C35j72l05J19J71l48L47L52m04l06J91J62k86L68j15j46j10L7M04n8r9k78
4465a41J25j44J52n9L62m87j26K87L39j10k60O1j26J7R0K33k21l29O1M06J49k31
$$ plain form
4304 272 -21 8 56 -168 -88 217 249 -213 -143 20 250 -172 17 -26 -12 -167 -111 143 195 -57 -108 48 -70
4327 -70 -238 132 207 -299 -131 80 36 17 47 -79 35 -113 41 72 -125 -312 -97 206 -8 -204 120 147
4349 147 -11 -119 294 -76 -281 8 202 -15 -81 5 147 -149 -141 84 101 -105 -59 156 76 -88 -67 145 70
4372 70 -150 -204 62 0 -76 -70 54 151 -127 253 163 -128 -57 26 83 63 45 40 -36 -31 -171 218 174 -150 -1 356
4398 356 -12 -71 250 158 30 8 154 28 -179 -69 150 -4 -203 -169 -22 -96 -125 1 -35 -145 -287 122
4420 122 242 8 -18 -14 -44 -126 -26 57 58 -299 80 322 37 0 55 9 -144 -116 243 199 22 -322 -38 335
4444 335 163 -142 -23 148 -200 147 499 95 -211 -20 142 -144 224 109 -37 -147 -110 294 236 137 -141
4465 -141 -16 -160 -8 -67 295 -192 -318 -31 308 198 -62 -1 -127 -110 -20 213 -8 -337 -276 130 279 48
4487D8J25l95Jl2M45K66m07n15J81L18jP3J05n16m0K91N83m80j3j82j32K63J6
4510BJ21rk07k70K48M67j55l47K62l87J40K85K49m98j34J68J13J36m7j46j46O7
4532h8j3O08j05m02j42p7L43K6P1jn35p2L21N33j62l77j02J37m1K85K33m90l08
4555c58N9L16J60J94m74k15L22J9Q0K05k03o55L34M27j11N4J28n31k05M30M39
4576D15k45m10r9M6L20K53j20j6m54m3M84K04q2m13j36J23J78J51J39l65k75K87
4598e8L75k62K04j48l83L3L15J20jk36k67o1N70r7l6ro6n04M77M29k30n50L85
4621@o8l0L05N7l91j64K9M21J37j46l46j23K85J14k4J41j50m57K81N13k20k12
4643d8J13j19j82K18L37k38k39Q3n9O6K43Mk41J0%J21J21Nn47J54J25q5K20K17
$$ plain form
4487 48 173 -222 -221 -253 192 458 51 -464 -283 35 34 107 212 -304 -344 -53 530 50 37 -145 -277 -14 2
4510 2 123 114 -93 -363 -115 352 197 -150 112 -275 -135 150 399 -99 -233 -65 48 184 137 -9 -155 -88
4532 -88 -101 507 402 0 -142 -219 124 150 221 220 -315 -387 -66 467 305 -72 -174 -37 -78 207 440 -50 -358
4555 -358 -299 17 177 371 -103 -318 4 23 103 308 105 -550 -216 211 100 154 282 -249 -454 -24 415
4576 415 170 -240 -339 -293 27 280 160 144 -310 -353 131 335 253 -160 -296 -173 5 156 295 -70 -345 -58
4598 -58 317 55 259 111 -272 -239 76 196 195 -41 -308 -369 201 104 68 59 -7 -511 -34 395 165 -385 0
4621 0 -68 -98 207 264 -127 -291 -262 159 296 150 -196 -319 -34 80 56 197 47 -410 -129 384 164 -48
4643 -48 65 -54 -236 -18 319 81 -158 -75 -134 -68 175 179 -62 -52 -52 69 190 195 -352 -198 -73 -158 62 279
4667B79k68k67K99J77k54j36R3P8l3L14j42j47j10j28K67P6q6j24J31J5o4K98
4689B68P1l87k82K98K59j31j40k6Q2qK53j53n3OJ3j13J14j75q4J55J57j67m8K85
4713A94j95m9J68lk35K37m2j69m9M13j18j51K3r6K3K03R5k18j87P4pL18r9j73
4737d3q6K11j15R2K5N6l77K54K24j81n4k6LR1M5J37p1j75j60lK54K19m47j03K31
4762Aj58o0M21N8n94mL10J68n2qk69j05K09J29J88j53k57k29K81K52P0p5l54L5
4786a96q0L43J70j79m4k09J06K87J78k01k59r0k5K19J91j34k14j41K07J25J2J01
4808A67k54k82M28K30m0j47k13k17M0M57K51l30m12K2J89L25o0K2k30o9q5M49
4830B41J57k18m81Q0J46K58L66m55l60k03M28K67K72n09k85j03K67K96J72k76
$$ plain form
4667 279 11 -256 43 220 -34 -170 -77 1 -32 282 140 -7 -117 -245 22 98 12 -112 19 34 -30 268
4689 268 339 -48 -330 -32 227 96 -44 -70 12 4 257 104 51 57 70 -43 71 -104 -188 -33 124 -43 -91 194
4713 194 -1 -50 118 115 -120 117 75 -94 -143 270 152 1 24 -72 -49 154 249 31 -156 -82 -89 229 130 -43
4737 -43 -129 82 -33 59 84 140 -237 17 241 60 6 -20 -17 74 119 256 185 10 -150 -153 101 320 -127 -230 1
4762 1 -157 -217 204 262 -332 -336 -26 142 90 82 -187 -292 -83 46 234 81 -176 -405 -124 128 198 123 -231 -196
4786 -196 -276 67 237 58 14 -195 -89 198 376 175 -84 -174 -199 20 211 77 -137 -278 -71 54 66 167
4808 167 -87 -369 59 289 249 102 -111 -328 -288 169 420 90 -322 -300 -111 214 154 176 -54 -123 -208 241
4830 241 398 180 -301 -221 -75 183 549 94 -266 -469 -41 226 498 -11 -296 -399 -132 164 336 60
4850F0m02j37L83L84j00n4l70k31L29L46J42k74n16O0M11K91k4k93l40l16N20
4871a31L52J26j05n68O3L00K71Kl72k15l2K31L30P5l85l23m3M26K20n6p9m28Q
4894c33K95L47K0k44k08k59J87L68J03k34l79J04O0N44m1m18o4j74M82J22k6j19
4916A33m15J55K1M26j23k37k86K14J53K24m6j65k78n3M02N8J10l51m30K33N02
4937B47k8O3l11l31P7L41o3K88j95m47J29K20K03P8k52l97J78L13J52l9k16k08
4959a98q3L81K02j01j21j91JJ62J74m4k14k55J94J89J15N4l02p7j1K35R9k06q9
4982h6j55j23L47K11o6j09k79J72J21J08P9k04j32N2N2K89k06j56Q6k9K65O4k21
5005H0j8j37K0O2L8O9k7j68Q3m1J12K0k4l4o3O9j29J25L1o4J96o5j46P4j66J10
$$ plain form
4850 60 -342 -479 -96 288 188 134 -236 -467 -138 208 350 76 -440 -380 31 322 298 5 -335 -651 -131
4871 -131 221 347 242 -326 -263 37 308 310 -62 -277 -309 -78 252 327 -58 -381 -424 2 222 166 87 -341 -333
4894 -333 -38 309 329 85 -123 -382 -195 173 276 42 -337 -233 -173 371 330 -88 -152 -326 156 278 252 133
4916 133 -282 -127 -106 320 197 -40 -326 -112 41 265 219 54 -224 -277 125 183 293 -58 -488 -255 247
4937 247 219 282 -29 -360 -283 58 -5 283 88 -359 -230 -10 193 271 19 -378 -200 113 265 226 10 -198
4959 -198 -281 100 302 201 80 -111 -110 52 226 182 -32 -287 -93 96 211 265 -37 -114 -125 110 209 3 -86
4982 -86 -241 -364 -17 194 128 19 -260 -88 33 141 220 16 -116 -64 -12 277 71 -85 1 -28 237 301 80
5005 80 62 -75 -55 7 45 114 87 -81 2 -39 73 93 69 35 -28 41 -88 37 68 4 200 135 -11 63 -103 7
5031Gj9k9L6j4q1Q5j4p5Q2j62J63j73J65J94j34o0J16r8l5K50k26p3J03K40j56
5056I2J3j4r6q5J02l7K35k55m2J68k1Q0o5j06j76J85J78L0l46K2J95j3l0K07k02
5081A9j42N7l5J24Q0j84j78J68P0J06J7R7l72J8R0K52k08K06l16k24M36K56k35
$$ plain form
5031 7 -12 -41 -5 -19 -100 -15 -29 -104 -22 -184 -21 -194 -29 165 31 -29 87 -11 -46 204 -22 -95 8 248 92
5056 92 105 91 -5 -90 12 -25 210 -45 -87 81 60 140 75 -31 -207 -22 156 186 -160 -138 57 44 14 221 19
5081 19 -123 -66 -101 23 103 -81 -259 -91 -21 85 102 199 -173 -155 -65 187 -21 185 -131 -355 81 337 102
$$ [...]
8191G5
##END NTUPLES=NMR FID
##END=
