##TITLE=1H_3E1603 AC
 aceton-d6
 8 sc, 
 17.3.2023
##JCAMPDX= 6.0         $$ Bruker NMR JCAMP-DX V2.0
##DATA TYPE= NMR FID
##DATA CLASS= NTUPLES
##ORIGIN= UXNMR, Bruker Analytische Messtechnik GmbH
##OWNER= root
$$ XWIN-NMR		Version 3.5
$$ Fri Mar 17 14:24:23 2023 Russian Standard Time (UT+4h)  she@DPX200
##.OBSERVE FREQUENCY= 200.13135
##.OBSERVE NUCLEUS= ^1H
##.DELAY= (6, 6)
##.ACQUISITION MODE= SIMULTANEOUS
##.ACQUISITION SCHEME= undefined
##.AVERAGES= 8
##.DIGITISER RES= 18
##SPECTROMETER/DATA SYSTEM= spect
##.PULSE SEQUENCE= zg30
##.SOLVENT NAME= Acetone
##.SHIFT REFERENCE= (INTERNAL, Acetone, 0, 15.7039)
##AUDIT TRAIL= $$ (NUMBER, WHEN, WHO, WHERE, WHAT)
$$ ##TITLE= Audit trail, XWIN-NMR		Version 3.5
$$ ##JCAMPDX= 5.01
$$ ##ORIGIN= Bruker BioSpin GmbH
$$ ##OWNER= she
$$ F:/spectra/data/she/nmr/H-F/1/audita.txt
$$ ##AUDIT TRAIL=  $$ (NUMBER, WHEN, WHO, WHERE, WHAT)
(   1,<2023-03-17 14:22:56.42 +0400>,<she>,<DPX200>,
      <created by zg, POWCHK disabled, PULCHK disabled
       configuration hash MD5:
       00 E9 B6 7A A2 85 ED C7 34 08 36 98 17 FE 4E 26
       data hash MD5: 16K
       FA CE 1F 06 0B AD 84 6D 9C 7D 2D 6B EC 8E 4B 16>)
$$ ##END=
$$ 
$$ hash MD5
$$ 9A 4D E0 1C 8E 8A 7E E5 58 BC 5C 39 68 33 58 73
##$RELAX= 
##$RELAX= 
##$RELAX= 
##$RELAX= 
##$RELAX= 
##$RELAX= 
$$ Bruker specific parameters
$$ --------------------------
##$DU= <F:/spectra>
##$EXPNO= 1
##$NAME= <H-F>
##$PROCNO= 1
##$TYPE= <nmr>
##$USER= <she>
##$AMP= (0..31)
100 100 100 100 100 100 100 100 100 100 100 100 100 100 100 100 100 100 
100 100 100 100 100 100 100 100 100 100 100 100 100 100 
##$AQSEQ= 0
##$AQ_mod= 1
##$AUNM= <au_zg>
##$AUTOPOS= <>
##$BF1= 200.13
##$BF2= 200.13
##$BF3= 200.13
##$BF4= 200.13
##$BF5= 200.13
##$BF6= 200.13
##$BF7= 200.13
##$BF8= 200.13
##$BYTORDA= 1
##$CFDGTYP= 0
##$CFRGTYP= 5
##$CHEMSTR= <none>
##$CNST= (0..31)
1 1 145 1 1 1 1 1 1 1 1 1 1 1 1 1 1 1 1 1 1 1 1 1 1 1 1 1 1 1 1 1 
##$CPDPRG= <>
##$CPDPRG1= <>
##$CPDPRG2= <>
##$CPDPRG3= <>
##$CPDPRG4= <mlev>
##$CPDPRG5= <mlev>
##$CPDPRG6= <mlev>
##$CPDPRG7= <mlev>
##$CPDPRG8= <mlev>
##$CPDPRGB= <>
##$CPDPRGT= <>
##$D= (0..31)
0 1.2 0 0 0 0 0 0 0 0.06 0 0.03 0 0 0 0 0.0002 0 0 0 0 0 0 0 0 0 0 0 0 
0 0 0 
##$DATE= 1679048576
##$DBL= (0..7)
120 120 120 120 120 120 120 120 
##$DBP= (0..7)
150 150 150 150 150 150 150 150 
##$DBP07= 0
##$DBPNAM0= <>
##$DBPNAM1= <>
##$DBPNAM2= <>
##$DBPNAM3= <>
##$DBPNAM4= <>
##$DBPNAM5= <>
##$DBPNAM6= <>
##$DBPNAM7= <>
##$DBPOAL= (0..7)
0.5 0.5 0.5 0.5 0.5 0.5 0.5 0.5 
##$DBPOFFS= (0..7)
0 0 0 0 0 0 0 0 
##$DE= 6
##$DECBNUC= <off>
##$DECIM= 32
##$DECNUC= <off>
##$DECSTAT= 4
##$DIGMOD= 1
##$DIGTYP= 9
##$DL= (0..7)
0 120 120 120 120 120 120 120 
##$DP= (0..7)
150 150 150 150 150 150 150 150 
##$DP07= 0
##$DPNAME0= <>
##$DPNAME1= <>
##$DPNAME2= <>
##$DPNAME3= <>
##$DPNAME4= <>
##$DPNAME5= <>
##$DPNAME6= <>
##$DPNAME7= <>
##$DPOAL= (0..7)
0.5 0.5 0.5 0.5 0.5 0.5 0.5 0.5 
##$DPOFFS= (0..7)
0 0 0 0 0 0 0 0 
##$DQDMODE= 0
##$DR= 18
##$DS= 0
##$DSLIST= <SSSSSSSSSSSSSSS>
$$ [...]
##$SUBNAM2= <"">
##$SUBNAM3= <"">
##$SUBNAM4= <"">
##$SUBNAM5= <"">
##$SUBNAM6= <"">
##$SUBNAM7= <"">
##$SUBNAM8= <"">
##$SUBNAM9= <"">
##$SW= 18.05172834244
##$SWIBOX= (0..15)
0 0 2 0 0 0 0 0 0 0 0 0 0 0 0 0 
##$SW_h= 3612.71676300578
##$TD= 16384
##$TD0= 1
##$TE= 0
##$TE2= 300
##$TE3= 300
##$TEG= 300
##$TL= (0..7)
0 120 120 120 120 120 120 120 
##$TP= (0..7)
150 150 150 150 150 150 150 150 
##$TP07= 0
##$TPNAME0= <>
##$TPNAME1= <>
##$TPNAME2= <>
##$TPNAME3= <>
##$TPNAME4= <>
##$TPNAME5= <>
##$TPNAME6= <>
##$TPNAME7= <>
##$TPOAL= (0..7)
0.5 0.5 0.5 0.5 0.5 0.5 0.5 0.5 
##$TPOFFS= (0..7)
0 0 0 0 0 0 0 0 
##$TUNHIN= 0
##$TUNHOUT= 0
##$TUNXOUT= 0
##$USERA1= <user>
##$USERA2= <user>
##$USERA3= <user>
##$USERA4= <user>
##$USERA5= <user>
##$V9= 5
##$VALIST= <valist>
##$VCLIST= <CCCCCCCCCCCCCCC>
##$VD= 0
##$VDLIST= <DDDDDDDDDDDDDDD>
##$VPLIST= <PPPPPPPPPPPPPPP>
##$VTLIST= <TTTTTTTTTTTTTTT>
##$WBST= 1024
##$WBSW= 4
##$XGAIN= (0..3)
0 0 0 0 
##$XL= 0
##$YL= 0
##$YMAX_a= 712457
##$YMIN_a= -956630
##$ZGOPTNS= <>
##$ZL1= 120
##$ZL2= 120
##$ZL3= 120
##$ZL4= 120
##$ABSF1= 10
##$ABSF2= 0
##$ABSG= 5
##$ABSL= 3
##$ALPHA= 0
##$AQORDER= 0
##$ASSFAC= 0
##$ASSFACI= 0
##$ASSFACX= 0
##$ASSWID= 0
##$AUNMP= <proc_1d>
##$AZFE= 0.1
##$AZFW= 0.1
##$BCFW= 1
##$BC_mod= 2
##$BYTORDP= 1
##$COROFFS= 0
##$CY= 11.3945322036743
##$DATMOD= 1
##$DC= 2
##$DFILT= <>
##$DTYPP= 0
##$F1P= 2.36226072786647
##$F2P= -0.459571619588291
##$FCOR= 0.5
##$FTSIZE= 0
##$FT_mod= 4
##$GAMMA= 1
##$GB= 0.15
##$INTBC= 1
##$INTSCL= 1
##$ISEN= 128
##$LB= 0.24
##$LEV0= 0
##$LPBIN= 0
##$MAXI= 10000
##$MC2= 0
##$MEAN= 0
##$ME_mod= 0
##$MI= 1.114404
##$NCOEF= 0
##$NC_proc= 0
##$NLEV= 6
##$NOISF1= 3.799351
##$NOISF2= 2.8
##$NSP= 1
##$NTH_PI= 0
##$NZP= 0
##$OFFSET= 15.70392
##$PC= 1
##$PHC0= -19107.65
##$PHC1= 12.40075
##$PH_mod= 1
##$PKNL= yes
##$PPARMOD= 0
##$PSCAL= 0
##$PSIGN= 0
##$REVERSE= no
##$SF= 200.130013532006
##$SI= 16384
##$SIGF1= 3
##$SIGF2= 2
##$SINO= 400
##$SIOLD= 16384
##$SREGLST= <1H.CDCl3>
##$SSB= 0
##$STSI= 0
##$STSR= 0
##$SW_p= 3612.71676300578
##$SYMM= 0
##$S_DEV= 0
##$TDeff= 0
##$TDoff= 0
##$TI= <>
##$TILT= no
##$TM1= 0
##$TM2= 0
##$TOPLEV= 0
##$USERP1= <user>
##$USERP2= <user>
##$USERP3= <user>
##$USERP4= <user>
##$USERP5= <user>
##$WDW= 1
##$XDIM= 8192
##$YMAX_p= 0
##$YMIN_p= 0
$$ End of Bruker specific parameters
$$ ---------------------------------
##NTUPLES= NMR FID
##VAR_NAME=  TIME,          FID/REAL,        FID/IMAG
##SYMBOL=    X,             R,               I
##VAR_TYPE=  INDEPENDENT,   DEPENDENT,       DEPENDENT
##VAR_FORM=  AFFN,          ASDF,            ASDF
##VAR_DIM=   8192,          8192,            8192
##UNITS=     SECONDS,       ARBITRARY UNITS, ARBITRARY UNITS
##FACTOR=    0.0002768,     1,               1
##FIRST=     0,             0,               0
##LAST=      2.2672688,     0,               0
##MIN=       0,             -956630,         0
##MAX=       2.2672688,     712457,          0
$$ Real data points
##PAGE= N=1
##DATA TABLE= (X++(R..R)), XYDATA
0 0 0 0 0 0 0 0 0 8 -8 8 -8 16 -24 32 -32 48 -56 66 -88 104 -121 145 -174 205 -241 281 -326 377 -435 502
30 502 -574 653 -743 841 -951 1071 -1201 1347 -1506 1681 -1872 2080 -2307 2556 -2828 3123
46 3123 -3449 3802 -4191 4617 -5083 5602 -6175 6812 -7525 8327 -9240 10286 -11501
59 -11501 12927 -14637 16724 -19341 22735 -27329 33923 -44239 62755 -106244 422639 -52784
71 -52784 -691973 206116 -185179 -173732 712457 373519 -569815 -159278 14925 -159860
81 -159860 364675 388282 -392287 -196139 137150 -197125 42408 416294 -178570 -355228
91 -355228 135888 71768 -112248 123880 -9083 -245733 -21763 141241 42678 12599 -125235
102 -125235 -224897 -5396 173970 127401 22278 -197162 -264403 -5124 179531 193818 107368
113 107368 -218282 -348662 -569 233650 174650 113721 -114985 -335503 -76416 232658
123 232658 174813 102917 -32352 -291604 -118992 237149 138626 10055 56343 -139198 -205758
134 -205758 131859 220919 -12205 -48928 -28073 -109426 12554 172422 42075 -80283 -40630
145 -40630 -58845 -6019 157864 80698 -144393 -108156 49926 33714 40335 121589 -51348
156 -51348 -240497 -16823 193155 64668 -3636 -18296 -170918 -95458 169529 131800 -14233
167 -14233 -17872 -141010 -151830 167467 188965 -86686 -29253 9994 -180724 6086 248486
178 248486 1583 -124131 28210 -59480 -74944 152663 68526 -110539 16339 -4544 -114822
189 -114822 100644 130484 -131205 -50638 85720 -68860 -13264 134350 -44205 -117912 45282
200 45282 23428 -15833 77409 -21961 -124759 33038 66580 -34628 42953 28945 -121601
211 -121601 -29207 99962 14085 -18405 12055 -47911 -32971 49387 21514 -5401 17162 -35939
223 -35939 -41270 51059 25644 -36972 17734 16378 -39007 2793 24818 -7289 9021 4073 -24310
236 -24310 9820 15608 -27003 8703 39849 -30153 -31391 38527 1202 -30967 26967 11752
248 11752 -28522 6199 1547 -17388 25484 14943 -32330 2157 17078 -33169 4068 60379
260 60379 -15735 -54619 17052 14245 -9580 36264 10948 -48923 -13611 21401 14800 32811
272 32811 7612 -59778 -25459 49641 23519 -226 18278 -35594 -56640 35138 61314 3418
284 3418 -16815 -30638 -35776 19191 51823 14878 -15639 -30160 -44745 4543 68590 25780
296 25780 -38575 -32283 -25309 -6519 49151 44571 -21738 -56392 -39145 11252 55949 39699 -25373
309 -25373 -58490 -34650 7654 51797 56631 -18909 -78640 -41516 25871 61322 43569 -19746
321 -19746 -64278 -46447 16598 69701 52431 -20524 -71575 -45072 28593 65071 41184 -12119
333 -12119 -60206 -51031 17261 71087 52798 -21738 -67111 -39534 16884 61080 54823 -13767
345 -13767 -67597 -49776 13730 69959 58490 -19006 -74026 -47439 18890 60680 57366 -4583
357 -4583 -81497 -62595 28767 69266 48398 -9337 -75592 -60806 24409 70993 48894 -10278
369 -10278 -72055 -65355 23857 81568 42965 -18405 -58787 -62525 11295 81462 52056 -17526
381 -17526 -63246 -60511 11562 75302 51345 -13512 -58021 -59486 473 72811 59900 -18072
393 -18072 -60796 -51568 -546 66760 57093 -18896 -56870 -50174 -3003 69419 59725 -28152 -65344
406 -65344 -37277 4698 55955 62860 -19076 -80890 -39409 19935 51741 57934 -9849 -82717
418 -82717 -47928 25963 53771 48974 2325 -69409 -66503 21798 69306 37394 -507 -42111
430 -42111 -68465 -1117 76246 44878 -12607 -31231 -49385 -18598 67415 60464 -28006 -36177
442 -36177 -16626 -27048 42596 81697 -30456 -67746 7619 -781 9005 76878 -3136 -95840
454 -95840 -5890 42100 -2127 47105 28134 -101138 -42699 72884 12153 9190 46805 -75815
466 -75815 -86208 68201 51729 -14854 33362 -31055 -104101 27760 83782 -9039 6328 1436
478 1436 -91773 -14436 88673 12026 -14087 10530 -59736 -36166 65560 30292 -16704 2595
490 2595 -33329 -30594 44888 25923 -18256 4294 -19216 -24590 44436 17563 -34758 9500 -5627
503 -5627 -26268 52849 23509 -60304 2947 18241 -36649 44854 59724 -71799 -37751 46611
515 46611 -27898 6161 91943 -39940 -86385 43208 3724 -30578 88528 17085 -107020
526 -107020 6136 40824 -44079 43780 69934 -79774 -48047 56790 -18835 -12764 74550
537 74550 -19649 -69854 33692 13592 -36512 38592 24746 -49979 2109 30598 -30631 -8094
549 -8094 37618 -9233 -19101 25991 -3654 -35672 10928 25303 -9115 1572 17119 -22795
561 -22795 -31332 23784 24883 -15615 11379 14187 -48441 -15094 49321 -1436 -15880 35594 -18506
574 -18506 -56884 31650 34460 -31270 20208 27039 -60459 -11835 51721 -20869 -9305 51504
586 51504 -26193 -47070 35240 4431 -28940 40304 19444 -46768 -2464 14977 -22941 18208
598 18208 36736 -22320 -18874 3121 -17178 10347 32820 -5121 -12134 -5569 -19583 6556 25082
611 25082 -1938 -881 1565 -24806 -2620 24862 -7016 -2750 19973 -20637 -15922 27866 -10911
624 -10911 -17028 34776 -6032 -28994 31308 -2218 -43976 30329 27905 -36354 16179 25189 -56853
637 -56853 -6547 57252 -16792 -10005 40455 -43512 -45576 58619 16919 -28923 36206 -9741
649 -9741 -71886 28446 56313 -28771 3486 27230 -57720 -21751 64421 2162 -25801 27688
661 27688 -18191 -43443 36066 27985 -28377 6851 11783 -34684 2635 36312 -16160 -17947 21779
674 21779 -7070 -14775 24346 -476 -29078 7771 16810 -5689 6522 4309 -26653 -11594 24619
687 24619 14937 -1694 -1336 -20586 -21566 17038 28542 6321 -8856 -20611 -19531 8202 28169
700 28169 15568 -8583 -20718 -17398 1749 23587 19209 -4345 -19292 -16646 2717 17686 13092
713 13092 2477 -12644 -20594 1818 20037 8350 -2421 -6863 -14817 -3668 19281 12315 -9265
726 -9265 -7964 -7594 -6135 18838 17410 -16220 -13961 1188 -3860 11840 22539 -11953 -27092 1262
740 1262 10113 5893 16226 -2431 -31016 -6551 18991 7259 9841 3127 -28983 -15088 21543
753 21543 13572 1398 3897 -16347 -23260 12880 24179 -290 -3509 -6857 -20248 3543 25149
766 25149 3663 -8482 -5135 -13699 -1467 22335 9972 -13839 -10085 -3500 -1169 16192 14666
779 14666 -13835 -17151 -1037 4223 14432 13933 -12555 -20900 -2450 9448 12656 11178 -6601
792 -6601 -22493 -7448 13131 12998 7687 -3950 -18979 -8716 10684 11811 7036 -2397 -15744
805 -15744 -9558 9330 13065 3405 -3752 -10035 -9925 6517 15398 3302 -6088 -10228 -9095 7384
819 7384 15881 2997 -7224 -10616 -8421 5677 16740 6526 -10106 -11984 -5266 4238 14862
832 14862 8185 -9721 -11019 -4354 3022 13006 7154 -8977 -9716 -2096 3422 8897 5606 -6557
846 -6557 -10033 -378 4942 5826 5302 -6369 -11098 1431 5959 4415 5520 -5285 -11881 -567 7578
861 7578 6099 4077 -4186 -11521 -3100 8126 6947 3265 -2358 -11871 -5033 9349 6428 1715 -810
876 -810 -10213 -5181 8019 6070 1018 -1538 -7498 -4236 6659 5526 -741 -932 -4706 -4844 6595
891 6595 5007 -4047 1334 -1801 -7567 6928 6718 -6657 900 2167 -8567 2952 9795 -5725
905 -5725 -3546 5876 -6734 -3155 13583 -2688 -10367 8301 -2056 -9453 13638 3530 -15448
918 -15448 5553 5850 -12277 6384 11632 -13667 -3521 13125 -7845 -5825 14182 -4729 -10038
931 -10038 12066 -1116 -11471 9023 2713 -8368 7272 2418 -12035 3085 7986 -4622 1608
944 1608 4787 -9361 -3246 8925 569 -596 2226 -6345 -2873 5133 1186 2736 31 -7609 146
959 146 3687 -1801 4883 2619 -10275 -846 7882 -4219 84 9385 -9696 -8586 14155 333
973 333 -8775 9935 -3762 -14222 13757 9272 -12803 2743 2244 -14966 8612 19402 -11476
986 -11476 -10332 6633 -9168 -864 23914 -686 -19974 -440 -319 -1767 17280 8115 -15087
999 -15087 -10699 -469 2778 10828 9441 -5789 -13205 -6090 5464 10267 4075 -1013 -5181 -12399
1013 -12399 691 17237 -108 -8613 5131 -7568 -8881 20424 5249 -20352 3485 6214
1025 6214 -12077 14231 16328 -27136 -11127 20939 -5415 1310 25923 -20804 -31757 22425
1037 22425 11690 -9201 22314 -3071 -41940 6397 28671 -7039 6645 12041 -33721 -15269
1049 -15269 31086 5839 -5412 12936 -18003 -24109 21261 15778 -7897 5653 -5952 -22679
1061 -22679 9302 22567 -5027 -6649 201 -12209 -48 20433 4107 -13051 -8060 -2669 6006
1074 6006 12310 3427 -7539 -14408 -6039 14914 14409 -1864 -7066 -12891 -10759 15052 21820 -4526
1088 -4526 -11400 -6318 -14011 5992 31283 1484 -21659 -3310 -6530 -5854 27094 16277 -22694
1101 -22694 -13234 1754 -5354 13930 23507 -13788 -22423 4205 884 2152 21990 -1626 -27649
1114 -27649 -916 13197 -585 7005 7116 -18536 -12612 16647 10919 -5407 -562 -6913 -12782
1127 -12782 10618 18535 -3940 -10546 -5487 -7311 6277 21025 2496 -17708 -7606 -1111 -460
1140 -460 18827 14339 -20010 -17460 5687 2103 6633 19155 -5788 -26844 -2133 13353 3427
1153 3427 8857 4804 -21064 -11733 14267 7965 2497 4453 -14172 -14368 12697 13207 -3354 -369
1167 -369 -4031 -15187 4323 20910 -268 -11715 -1697 -4653 -1888 14830 8089 -11023 -9885
1180 -9885 -990 2770 8768 8377 -6368 -12043 -1460 4270 5741 8204 -2246 -13378 -4633 7568
1194 7568 6693 2116 41 -7471 -9708 4724 12596 1454 -5127 -4407 -6383 422 11121 5762 -6335
1209 -6335 -6930 -2361 128 7118 8145 -5445 -8976 480 1267 2586 7551 -1445 -10173 -961 5547
1224 5547 416 1852 3313 -7014 -6067 7517 3716 -3711 2472 -1186 -7437 3365 7553 -2546
1238 -2546 -2704 910 -4020 -1083 8198 839 -5960 972 -1111 -3892 7240 4992 -7279 -2052 2661
1253 2661 -2655 1484 6348 -2647 -5913 2242 1499 -1559 3401 503 -4932 1537 1887 -2612 1335
1268 1335 1721 -2881 367 2159 -1882 -1967 2115 1052 -1024 846 -603 -2273 1101 1693 464 508
1284 508 -2151 -1945 1690 1311 971 601 -2196 -1766 726 1614 1571 254 -2339 -2880 910 2702 880
1301 880 588 -1376 -4418 236 4321 1744 -4 -2498 -4427 611 4813 2557 -546 -3326 -4615
1316 -4615 -423 6102 4597 -2296 -4150 -3939 -723 6297 5068 -1861 -4822 -4988 -118 6946 4695
1331 4695 -2038 -4746 -4429 -357 5874 5907 -1464 -6261 -4450 -20 5751 6274 -1501 -5908 -4421 -1193
1347 -1193 6158 7935 -1698 -7230 -5075 -641 6411 7940 -323 -7656 -6176 -442 6265 9076 80
1362 80 -9624 -5848 950 4825 8874 1454 -9710 -6634 1283 5668 8171 933 -9684 -6730 2300
1377 2300 5407 6309 2779 -8826 -9704 3080 7656 4900 1921 -7170 -9880 1629 7690 6584 2320
1392 2320 -7938 -10748 982 9124 6485 1389 -6284 -10726 -1362 9686 7904 946 -6635 -10744
1406 -10744 -375 9535 6377 1655 -5627 -11353 -886 10358 6612 174 -5519 -10479 -1322 11011
1420 11011 6352 -1693 -3145 -9415 -5252 13017 9587 -5362 -4347 -5613 -6674 9398 12846 -3274
1434 -3274 -7032 -5064 -5869 7264 14788 -2207 -10362 -2777 -4511 1953 15950 2844 -13700 -5716
1448 -5716 184 2270 11048 4641 -10522 -8164 86 3644 9650 5284 -9593 -9709 1620 4779
1462 4779 6469 4498 -6793 -9137 -1064 4915 8678 3203 -8627 -6952 578 2877 7350 5279
1476 5279 -7533 -9050 804 3912 6411 6251 -7753 -10798 3239 4308 2053 8741 -3564 -16177
1490 -16177 1205 10810 621 2523 1274 -12539 -4741 11419 4339 -981 1801 -9436 -8072
1503 -8072 11703 7619 -5530 442 -2337 -9421 4951 12122 -1983 -6234 -1492 -3075 1087 8675
1517 8675 2278 -6197 -3454 -1675 737 7201 4319 -5975 -6617 409 3683 2525 3309 538 -8203
1532 -8203 -5302 7506 5799 -1680 -484 -2975 -6185 3614 7976 -1191 -2577 -571 -6289 677 11077
1547 11077 -1309 -7886 3317 -945 -5924 8156 6242 -8980 -2748 4450 -2714 1353 6952 -4898
1561 -4898 -5503 4729 -889 -2095 7773 -914 -9853 2745 5333 -3746 1232 4401 -5560 -4462 5008
1576 5008 2683 -1417 917 -1936 -3738 2791 3267 -1674 154 353 -3541 -653 5182 1262 -4816
1591 -4816 -128 3262 -2628 -1314 4717 -602 -4310 1885 2230 -2455 342 2137 -2739 287 3461
1606 3461 -3362 -1892 5454 -1960 -4500 5742 1659 -7057 1982 5352 -4606 -1861 5218 -1781 -3653
1621 -3653 4008 60 -3568 3368 236 -4853 3795 3328 -5796 77 5369 -4026 -3141 6744 369
1636 369 -7013 1994 3714 -3251 1547 2987 -4699 -1927 3600 -678 807 3975 -4353 -5833 5313
1651 5313 4183 -4234 1648 2727 -7169 -1868 8087 969 -3865 479 -1704 -2779 3776 3178 -2306
1666 -2306 -584 -677 -4021 2824 6368 -3176 -4299 2431 -400 -2196 4616 3114 -5175 -3702 2568
1681 2568 2274 921 1390 -2638 -4014 1250 2765 1335 1739 -2488 -5847 761 6557 1548 -2983 -483
1697 -483 -2219 -3592 4831 6757 -2264 -4834 -1408 -735 2505 4727 -231 -4109 -1693 -806 769 6024
1713 6024 2020 -6843 -3317 3102 958 1717 3665 -2713 -6260 47 4789 3212 327 -3103 -4586
1728 -4586 -404 4121 2842 825 -1787 -5870 -2500 5825 5481 -1450 -4061 -2058 -1617 1176 6297
1743 6297 2593 -5322 -4701 417 2735 4007 1479 -3490 -3895 -173 1485 3320 3645 -3409 -6951 993
1759 993 4694 767 1213 96 -5693 -2703 4603 4255 615 -2218 -4871 -2091 4291 3907 -130 -787
1775 -787 -3822 -4719 4043 7027 -446 -3840 -2469 -1952 1501 4789 1712 -2385 -4067 -2289 2496 5302
1791 5302 687 -3770 -2113 -995 596 4226 2682 -2820 -4228 -1386 2892 4072 606 -2416 -2317
1806 -2317 -1934 751 4606 3004 -3031 -4585 -699 1885 3286 2216 -2194 -3250 -1902 674 4593
1821 4593 3141 -3586 -4653 -103 1884 2254 2475 -784 -4481 -2045 2180 3673 2195 -2397 -4362
1836 -4362 -548 2026 1713 2750 -323 -4603 -2110 2143 3112 1697 -1349 -2770 -1469 636 1849
1851 1849 2793 438 -4177 -2627 2625 2324 603 400 -2425 -2309 973 2037 1994 139 -3761 -2071
1867 -2071 2548 2053 -134 407 -1161 -3246 738 3475 745 -1076 -1671 -1974 1389 2349 -422 24
1883 24 -260 -3017 53 3701 370 -1945 -240 -734 -687 2091 1250 -1278 -377 -1364 -1152 2899 1819
1900 1819 -2559 -622 377 -1410 1292 2775 -639 -2332 -777 254 1476 1746 -1092 -1448 68 -780
1916 -780 104 2567 -108 -2404 -151 549 332 636 26 -244 -124 -1120 363 1614 -636 -1440 776
1933 776 439 -1103 761 821 -1396 165 419 -1060 1316 1065 -2161 450 1472 -1826 25 2392
1949 2392 -1217 -1732 1601 46 -1231 1345 243 -1549 1179 269 -1980 1558 1240 -2117 522 1406
1965 1406 -1862 -1072 2139 414 -1283 -103 -101 -812 800 837 87 -93 -1455 -678 1447 728 -380 -409
1983 -409 -667 280 621 -90 868 1 -1870 35 1971 -566 -991 1345 -626 -1774 2087 1132 -1990
2000 -1990 833 257 -2385 2030 2665 -2836 -641 1626 -2350 -228 4454 -516 -4135 987 698 -1420
2016 -1420 3274 1885 -4163 -1154 1440 -819 2099 2897 -3209 -3157 1992 692 -511 2783 231 -4445
2032 -4445 -286 3084 -327 194 1234 -2046 -1878 1907 1286 -632 312 -166 -2147 840 2879 -1188
2048 -1188 -1750 1040 -941 -890 2885 1052 -3145 -1551 1365 280 1110 2240 -2286 -3438 1243 1539
2064 1539 766 2189 -1106 -4749 -154 3140 1030 344 858 -3076 -2803 2707 2955 -685 -300 -958 -2806
2081 -2806 581 3375 263 -1212 -392 -1556 -929 2994 2338 -2288 -1207 655 -1150 706 3140 -864
2097 -864 -3143 472 1329 -296 1258 624 -3327 -911 3104 556 -622 914 -2594 -2632 3533 2831
2113 2831 -1757 -635 -561 -3169 1192 5240 -100 -3114 -275 -1509 -1105 4571 2520 -3082 -1526 -257
2129 -257 -1836 1910 4476 -1464 -3628 382 75 -713 3564 1520 -3882 -988 1611 -548 796 2135
2145 2135 -2267 -2546 2268 1271 -1413 921 162 -3046 1135 3732 -1368 -1971 529 -1329 -379 3691
2161 3691 883 -3169 -786 101 -783 2582 3033 -2828 -2658 550 -396 937 3413 -631 -3407 -804
2177 -804 659 363 1991 1159 -2379 -1852 659 758 995 1187 -1320 -2042 181 1209 744 264 -308 -988
2195 -988 -784 1238 1367 -1076 -1015 342 -179 201 1439 -185 -2125 -43 1433 -127 559 953 -2305
2212 -2305 -950 2056 428 -80 1440 -1514 -2527 1571 1784 -711 666 302 -2724 -91 2839 -203
2228 -203 -542 1091 -1881 -1421 2454 1010 -1157 396 -383 -1729 1023 1883 -954 -845 466 -822
2244 -822 -238 1819 -328 -1226 420 148 -300 534 419 -823 -623 770 138 -241 414 -346 -808 257
2262 257 611 -51 -23 -31 -486 -541 648 662 -399 -58 23 -834 209 1050 -347 -488 241 -395 -112 926
2282 926 315 -556 92 81 -401 668 344 -881 23 459 -463 100 666 -416 -98 423 -121 -81 301 71
2302 71 -146 143 -266 -336 483 252 -393 358 -210 -508 546 257 -336 426 -43 -513 577 146 -467 245
2322 245 293 -578 212 571 -584 -211 535 -616 -346 950 -265 -473 749 -651 -592 895 265 -652
2340 -652 291 -91 -726 749 878 -666 -282 219 -972 490 1139 -761 -542 141 -523 207 955 -382
2358 -382 -869 149 73 2 854 -41 -971 137 305 -117 582 33 -1042 37 222 -261 672 71 -815
2377 -815 -309 294 93 447 221 -768 -556 264 299 483 490 -896 -654 409 239 461 657 -960 -939 610
2397 610 378 250 345 -655 -946 308 598 37 188 -346 -929 370 930 -217 -145 -108 -925 159 993
2416 993 -42 -211 -199 -813 -277 920 456 -328 -121 -320 -423 842 752 -537 -413 -453 -377 588 423 -249
2436 -249 -201 -680 -319 753 646 -6 -409 -413 -143 588 521 -361 -238 -206 -344 642 745 -857 -405 354 -341
2457 -341 354 816 -732 -963 437 288 67 665 -84 -1480 10 840 -34 449 480 -1468 -857 1010
2475 1010 530 327 416 -653 -1305 275 1001 122 113 -38 -1262 -280 1288 400 -479 114 -338 -652 468
2494 468 1008 -449 -762 281 24 -252 593 -137 -1015 529 672 -526 -162 320 -1043 -444 1415 254
2512 254 -884 426 -209 -1267 922 1617 -857 -163 185 -1136 -58 1764 58 -975 304 -389
2528 -389 -1073 1306 1451 -1313 -530 445 -608 260 1599 -330 -1225 265 235 -496 628 544 -964 -27
2546 -27 1007 -525 -550 635 -428 -594 904 534 -1032 -260 551 -477 123 1340 -226 -1281 29
2563 29 112 -219 1128 729 -1289 -736 542 -188 351 1417 -267 -1802 4 717 -478 781 783 -1291
2581 -1291 -782 725 50 -324 897 114 -1359 230 734 -934 14 1229 -722 -752 1063 -305 -1117
2598 -1117 836 1071 -1020 164 785 -1453 -363 1602 -224 -728 1252 -710 -1616 1219 1070 -1077
2614 -1077 648 927 -1807 -435 2196 -80 -583 1288 -952 -1861 1393 834 -1100 849 574 -1675
2630 -1675 -41 1510 -700 -331 1473 -719 -1390 793 181 -814 1082 704 -1422 -288 564 -297 4
2647 4 993 -581 -1183 268 324 -433 714 561 -801 -464 344 -50 -438 640 381 -699 -187 495 -553
2666 -553 -333 990 -222 -476 435 -127 -759 616 955 -428 -197 472 -970 -547 1128 306 -457 606
2684 606 -479 -1463 644 1119 -198 96 160 -1284 -486 1633 676 -617 275 -730 -1167 990 1188 -320
2702 -320 -356 -208 -590 -159 1231 333 -800 -153 121 -226 352 900 -664 -733 538 173 -146 613 -21
2721 -21 -1324 309 1201 -68 -144 455 -1191 -554 1618 699 -801 1 -627 -1133 1342 1680 -946 -1047
2739 -1047 20 -919 631 2227 -235 -1551 -302 -584 75 1880 590 -1567 -753 109 26 1121 1146
2756 1146 -1262 -1275 251 375 742 899 -679 -1137 -2 651 980 511 -722 -1272 -577 822 1214 534
2774 534 -694 -1161 -367 804 1242 642 -903 -1589 -193 932 1069 842 -1108 -1782 -229 1028 1012 530
2792 530 -664 -1898 -546 1313 1091 209 -502 -1568 -839 1235 1198 43 -308 -1229 -736 987 1596 196
2810 196 -625 -1120 -909 745 1729 666 -942 -1277 -862 537 1699 556 -850 -1417 -823 739 1530
2827 1530 684 -698 -1514 -604 973 1305 594 -1043 -1480 -775 1013 1404 473 -959 -1189 -822 798 1679
2845 1679 288 -994 -1309 -716 699 1759 634 -917 -1371 -799 430 1618 926 -1144 -1234 -506 478
2862 478 1495 1044 -917 -1635 -351 476 1339 962 -783 -1470 -352 473 1408 848 -809 -1678 -574 760
2880 760 1241 649 -315 -1567 -665 614 938 844 -415 -1281 -522 568 976 643 -370 -1257 -815 696
2898 696 1195 540 -273 -1007 -841 720 948 284 -57 -1201 -857 763 1021 480 -297 -927 -969 657 1064
2917 1064 477 -495 -860 -845 502 1236 339 -488 -683 -650 117 1421 591 -581 -706 -390 148 755 760 -372
2937 -372 -734 -231 -28 669 583 -327 -784 -228 234 517 548 -34 -560 -636 252 544 128 39 -378 -417 316 747
2959 747 348 -227 -458 -440 171 545 394 -561 -257 227 -175 296 638 -384 -611 44 -10 -37 238 78 -376
2980 -376 -1 207 -344 138 487 -313 -358 340 -56 -185 635 305 -261 -129 174 -204 186 696 -4 -310
3000 -310 319 -150 -131 640 226 -351 -2 60 -625 38 1062 -133 -899 223 118 -101 610 177 -758 -190
3020 -190 348 260 71 122 -778 -783 780 410 -339 159 -432 -975 387 1126 148 -607 -298 -459 167 1058 768
3041 768 -653 -787 -411 11 937 1116 -636 -1314 -274 70 552 1152 420 -1377 -1197 693 892 567
3059 567 464 -1056 -1550 341 1229 549 280 -629 -1491 -38 1865 359 -739 -27 -727 -879 1641 1404
3077 1404 -1178 -1104 -179 -104 994 1456 -709 -1668 -111 330 782 1731 -278 -2428 -600 1069 797 1190
3095 1190 593 -1949 -1822 769 1865 889 16 -1271 -2151 172 1863 1210 19 -971 -1818 -558 2172
3112 2172 1622 -564 -1141 -879 -883 1115 2417 -229 -1953 -609 44 782 1499 49 -1951 -829 645
3129 645 811 1236 442 -2085 -1771 1316 1609 491 297 -1149 -2244 334 2226 968 -286 -1169 -1854
3146 -1854 -41 2173 1317 -512 -1129 -1745 -782 2306 2276 -590 -1697 -1195 -329 1242 1918 526 -1889
3163 -1889 -1763 -36 1284 1624 237 -1531 -1594 51 1331 1214 289 -1155 -1919 -166 2051 905 -550
3180 -550 -619 -1250 -734 1743 1867 -527 -1478 -1095 -122 1506 2102 -608 -1867 -688 -242 810 2524 2
3198 2 -2536 -1152 678 744 1556 769 -1795 -1967 205 1276 1528 860 -1561 -1956 576 1346 746 543
3216 543 -868 -2028 -245 1828 1434 -478 -911 -1014 -517 954 1510 110 -1050 -1120 -290 1164 1333
3233 1333 -157 -1200 -890 4 478 1185 765 -1481 -1656 273 1211 890 223 -701 -1557 -202 1074 981
3251 981 144 -766 -1638 -169 1301 743 -288 -471 -1065 -895 983 1410 -180 -1027 -607 -139 475 832
3269 832 166 -696 -742 -606 535 1342 -131 -952 -290 37 429 514 600 -280 -1075 -265 974 643 -114 -397
3289 -397 -279 -134 163 740 265 -477 -710 -75 642 553 -472 -549 176 -165 -202 755 499 -808 -417 344
3309 344 165 -116 243 -132 -282 -133 -58 236 457 -403 -545 485 58 -409 342 292 -376 -278 365 268 -188
3330 -188 -185 -107 57 -1 -234 205 324 -232 -187 377 41 -403 -145 416 134 -188 -204 295 78 95 117 182 -228
3353 -228 -540 326 503 -5 -292 -283 118 115 173 339 -23 -538 -469 648 719 13 -567 -212 17 192 425 253
3375 253 -358 -714 -269 543 713 -143 -447 -430 -197 194 776 678 -606 -1117 -151 550 591 79 -385 -562 -378
3396 -378 240 1116 596 -812 -1022 -74 767 681 251 -346 -652 -696 511 1250 415 -823 -1128 -9 692
3415 692 585 321 -458 -1137 -635 566 1251 476 -1001 -1041 -195 363 829 666 -353 -1482 -688 998 1097
3434 1097 305 -558 -904 -579 550 1099 926 -400 -1521 -723 1078 1358 302 -812 -927 -780 315
3451 315 1605 700 -1002 -1323 -420 769 1155 397 -529 -930 -483 487 1270 737 -883 -1581 -261 855
3469 855 1010 534 -285 -1371 -1013 661 1411 567 -840 -1122 -467 893 1134 403 -443 -1145 -1030 858
3487 858 1807 274 -867 -1068 -564 506 1234 859 -836 -1439 -594 603 1419 518 -952 -1215 -372 604
3505 604 1267 761 -409 -1593 -779 1071 1091 199 -320 -1144 -1134 526 1388 677 -685 -1115 -803 433 1424
3524 1424 590 -609 -730 -896 -69 1539 867 -1131 -1242 -106 334 772 792 -530 -1511 -352 705 918
3542 918 674 -516 -1388 -149 741 530 510 -58 -1101 -923 878 1357 67 -699 -723 -656 278 1284 533
3561 533 -615 -1021 -686 417 1143 448 -760 -1042 -177 2 792 1137 -439 -1548 -221 653 429 482
3579 482 68 -1078 -712 832 602 144 25 -998 -776 928 778 -224 -18 -143 -804 440 1256 -20
3597 -20 -823 -201 -318 -79 1045 414 -789 -421 -250 -104 930 718 -779 -609 75 66 135 750 -113 -1072
3617 -1072 -500 506 421 223 -28 -663 -448 422 419 188 -9 -395 -462 239 775 -35 -311 211 -66 -175 314
3638 314 448 -552 -170 292 44 -234 324 -336 -511 318 201 -191 511 -71 -789 11 380 -205 -102 299
3658 299 -632 -488 318 130 -186 105 -95 -557 226 144 -109 40 33 -346 -197 178 15 -275 227 167 -520
3679 -520 -3 250 -157 55 255 -88 -333 70 67 -210 55 185 -564 -321 380 69 -166 376 -188 -513 199
3700 199 419 -270 85 261 -250 -242 508 -213 -215 316 -21 -422 560 304 -516 24 298 -323 2 522 -210
3721 -210 -448 80 280 -11 422 -127 -622 7 241 35 269 -102 -658 -472 379 525 47 150 -380 -472
3741 -472 234 697 96 -231 -433 -229 89 496 352 -205 -448 -122 -7 287 482 -127 -415 -219 96 138
3761 138 410 173 -504 -283 384 277 125 267 -485 -367 395 283 170 -120 -386 -461 92 626 146 -381
3781 -381 -319 -252 -2 685 400 -421 -418 -208 233 563 287 -326 -544 -289 296 217 322 -72 -564 -238 235 251
3803 251 305 -78 -417 -409 130 585 143 -251 -337 -374 201 689 232 -366 -277 -274 192 521 274 -401 -562 -162 176
3826 176 449 457 -325 -662 -113 278 490 357 -381 -608 -165 283 540 371 -388 -590 -206 268 473 186 -159
3847 -159 -452 -250 260 415 98 -267 -526 -53 184 494 77 -498 -531 -137 186 404 313 -464 -448 -255 376
3868 376 515 54 -329 -570 -169 410 683 33 -346 -504 -1 366 488 85 -414 -444 -142 117 531 97
3888 97 -334 -321 -81 372 528 173 -316 -579 -111 306 250 197 -339 -587 -134 358 320 185 -199 -381 -29 266
3910 266 368 40 -404 -276 -237 240 428 -70 -159 -569 -216 311 326 12 -296 -291 -47 339 419 -80 -398 -270
3932 -270 20 146 419 67 -404 -324 32 96 440 -6 -313 -261 -7 -42 141 50 -328 -292 -94 253 176 27
3954 27 -97 -345 -175 -31 315 66 -322 -307 79 295 321 -16 -329 -95 109 129 219 67 -361 -192 104 182
3976 182 0 215 7 -449 110 171 -145 143 41 -232 27 255 9 -135 -9 71 -134 291 37 -221 -7
3997 -7 -101 -156 39 127 -85 -254 -15 60 -25 229 -83 -270 19 82 -22 -86 56 -137 -166 -17 146 -20 -132
4020 -132 141 8 -33 209 -135 -128 149 53 -67 106 132 -260 -37 337 9 -214 118 2 -164 126 53 -206
4042 -206 46 162 -226 108 187 -195 -126 160 -38 -187 348 -160 -310 36 254 15 -22 65 -392 8 272
4063 272 19 81 197 -301 -262 330 302 -259 -257 66 -86 62 451 -52 -325 -221 169 195 193 74 -400 -335 361
4086 361 69 10 142 -334 -448 98 301 -97 40 8 -336 -204 453 222 -308 6 -272 -353 493 437 -267
4107 -267 -214 116 -256 133 586 -89 -628 -121 47 123 567 47 -703 -136 284 268 243 105 -577 -494 262 401
4129 401 333 -69 -242 -560 148 752 210 -277 -337 -264 -139 621 549 -223 -447 -224 -157 300 660 40 -649 -164
4151 -164 133 241 667 147 -861 -628 457 195 142 237 -384 -778 328 560 32 329 -475 -511 46 657
4171 657 364 -226 -342 -441 -201 735 539 -372 -431 -267 -56 667 689 -216 -678 -224 55 310 654 41 -736
4192 -736 -549 207 377 368 134 -577 -645 308 662 329 -5 -298 -705 1 804 377 -156 -531 -474 -168 734
4213 734 480 -347 -565 -208 75 373 480 -100 -721 -134 42 332 645 -98 -688 -291 169 218 438 176
4233 176 -728 -605 269 480 345 141 -310 -683 21 739 526 16 -333 -565 -1 804 471 -207 -436 -365
4253 -365 -314 365 525 -130 -491 -363 238 346 467 -126 -459 -425 250 367 283 119 -463 -513 240 470 221
4274 221 -30 -444 -531 41 425 171 -117 -206 -253 37 599 260 -79 -223 -314 -15 465 524 45 -518 -163 81
4296 81 223 409 -23 -402 -88 178 335 310 18 -361 -295 81 239 197 111 -279 -422 34 448 174 -134 -248
4318 -248 -230 54 323 208 32 -282 -137 -39 38 263 -37 -202 -46 -46 65 285 47 -333 -99 215 73 237
4340 237 69 -106 -53 146 81 122 19 -235 -178 40 213 -32 -221 -52 29 -113 106 -4 29 104 63 43 54
4363 54 26 110 -60 48 124 -254 24 102 -58 158 94 -74 45 146 -4 63 -147 106 5 9 24 97 29 54
4387 54 -157 24 205 22 66 -107 21 -96 1 97 8 -193 -204 -102 139 283 -125 -206 -310 -281 207 318 65
4410 65 -16 -409 -107 244 332 -2 -152 -287 59 256 214 69 -208 -208 35 166 287 42 -45 -287 -174 259
4432 259 406 41 -237 -342 -289 404 419 -22 -378 -383 -172 259 456 135 -372 -436 -71 206 501 116 -364 -383
4454 -383 -53 431 547 77 -434 -469 -344 432 497 59 -370 -554 -128 434 531 18 -482 -411 -162 281 442
4475 442 169 -463 -543 -68 237 539 249 -335 -511 -239 397 555 235 -329 -717 -109 465 342 386 -372 -631
4496 -631 -130 564 586 169 -267 -767 -253 516 534 122 -217 -562 -398 627 678 168 -321 -631 -282 481 678
4517 678 219 -446 -730 -192 360 642 287 -396 -456 -73 315 652 295 -481 -514 -210 532 702 -13 -293 -632
4538 -632 -312 670 647 57 -312 -661 -177 532 844 299 -406 -526 -224 238 775 132 -761 -496 -194 96
4558 96 628 296 -418 -805 -55 211 477 393 -259 -903 -25 470 297 460 -161 -669 -202 484 292 265 -34
4579 -34 -505 -490 419 692 285 -286 -521 -358 295 652 98 -424 -451 -84 345 456 337 -528 -615 -93 300
4600 300 432 431 -205 -483 -124 309 396 119 -245 -426 -250 419 287 -138 -71 -441 -469 262 554 -32 -239 -294
4622 -294 -397 72 632 71 -257 -387 -369 -133 653 436 -478 -206 3 77 371 323 -247 -470 177 207 229 111
4644 111 -31 -423 -127 363 302 174 -24 -343 -177 248 376 -97 -90 62 -427 34 377 262 -306 -139 -100
4665 -100 -21 237 153 18 -239 -56 -48 228 324 -334 -513 147 100 -100 55 75 -369 30 164 35 -176 -95 -130
4688 -130 93 338 -28 -133 62 47 -167 167 180 -279 -115 103 101 -159 37 162 -339 -150 188 24 115 -40
4710 -40 -84 40 31 -67 -52 75 79 -190 -7 189 -152 -251 295 89 -42 187 75 -383 -49 46 88 83 104 -437 -114
4735 -114 447 100 -174 134 -137 -376 365 333 86 -202 -90 -108 -49 263 -91 -210 80 -115 160 188 185 -140
4757 -140 -9 68 41 64 120 -91 -281 15 221 120 44 -82 -349 36 30 176 84 -287 -189 -184 415 455 -114 -285
4781 -285 -219 -184 325 417 44 -218 -286 14 372 398 121 -325 -138 121 267 261 68 -309 -459 107 227 178 -46
4804 -46 -174 -148 -78 394 406 -69 -234 -279 70 288 250 107 -219 -332 -65 477 528 167 -400 -305 202 119 481
4827 481 157 -359 -422 -104 321 451 25 -298 -374 -37 252 312 32 -185 -499 -72 425 188 -60 -189 -334
4848 -334 -198 390 462 71 -448 -244 20 167 377 -4 -405 -362 -124 294 484 -90 -522 -197 19 267 323
4869 323 162 -192 -544 -74 350 387 22 -374 -357 -29 185 255 199 -248 -312 -111 350 368 36 -217 -281 30
4891 30 139 314 170 -405 -277 111 240 303 134 -237 -328 -158 134 225 192 -187 -305 -128 277 216 -107 -199
4913 -199 -288 -112 146 354 77 -360 -324 -21 332 153 15 -231 -301 -20 270 354 -81 -239 -279 70 143 223
4935 223 235 -125 -412 -228 453 223 31 -14 -411 12 228 -63 35 -2 -342 -151 349 199 -49 -136 -200 -141
4957 -141 -30 288 172 -54 -388 19 109 319 -218 -278 -102 -160 133 58 15 -187 -282 138 52 111 -86 -24 -88
4980 -88 -37 58 238 37 -264 -104 -3 203 -74 102 23 -205 -118 65 -36 -113 -189 -124 61 -30 -264 130 67
5003 67 -225 -41 8 222 60 -203 173 95 -171 68 134 26 -95 48 105 -196 -86 -216 -57 85 -28 105
5025 105 -51 -19 -173 -36 142 -107 -69 94 299 -93 -103 61 -165 -323 -6 -8 91 -81 1 160 78 -55 20
5048 20 88 -111 -166 -20 204 48 -13 -18 39 -2 168 265 -71 -373 -25 175 94 -2 -114 -345 171 -24 -259 166
5072 166 26 -190 -120 231 24 -75 117 -39 -237 15 175 -72 32 -242 -87 158 53 -101 -170 32 -143
5093 -143 -190 263 58 -349 -251 -22 67 251 60 -64 -156 96 112 183 30 -113 -218 -72 305 -69 -81 -12 -101
5116 -101 -111 4 136 -206 -144 -43 -21 61 299 56 -161 -103 -106 211 127 110 -329 -48 -24 -98 62 238 -155 -319
5140 -319 114 37 56 88 -56 -142 26 205 157 -8 -213 -221 -18 227 140 -269 -31 29 -113 -54 313 93 -73
5163 -73 -105 44 -186 9 41 -101 -166 -9 59 -116 134 -243 -74 322 87 -73 350 26 -237 -156 240 -68
5185 -68 -98 74 -63 36 16 136 26 -12 -55 -219 258 346 47 -38 -168 -199 10 114 187 -112 -93 -72 -75 58 -11
5210 -11 -107 -173 82 111 64 55 -70 -182 32 278 -70 -28 89 -74 -96 -90 37 -106 -115 69 -50 -66 64 130 -60
5235 -60 111 -130 -44 146 75 -339 -149 -16 -47 31 258 -112 -212 134 -133 102 145 -26 -162 -91 90 -31
5257 -31 9 107 -55 -47 137 90 71 135 84 -68 49 102 31 -59 -12 -125 -109 106 115 50 135 91 39 58 164 -13 -88
5284 -88 153 -103 51 71 76 98 38 -16 -38 -38 -25 -76 -166 15 26 -67 -69 -14 -9 -40 39 -99 -94 212 163 -114 3 69 -36
5313 -36 105 -14 -153 -84 -1 295 -28 -21 41 -173 101 -61 -1 104 12 -106 20 -26 -54 30 32 41 19 242 120
5338 120 40 -79 -14 29 110 -18 64 -34 10 126 43 -80 72 -32 -17 22 236 166 141 -118 -134 -174 -119 32 56
5363 56 76 -86 -58 116 -96 -19 -154 -87 37 176 -35 -42 169 -129 10 -102 -32 -42 49 3 42 89 81 -30 118
5388 118 -39 -84 109 4 -15 33 25 -58 78 16 85 101 -40 -94 138 187 104 -2 -170 -69 42 56 9 -43 84
5413 84 -364 48 215 -116 23 202 -72 -34 119 77 -6 -22 35 -160 23 -32 -86 -100 53 99 -30 63 13 -48
5437 -48 38 208 44 301 50 6 141 -169 -85 126 21 -32 -13 -57 -103 -32 11 -90 -103 -127 96 -47 -64 -171
5461 -171 50 -75 -81 -133 52 -108 -81 -44 -142 217 98 -145 -122 123 -35 -28 188 23 -19 34 122 76 -133 -107 50
5486 50 35 -2 118 6 56 10 -135 -16 99 -48 96 -21 -115 -170 -79 115 85 -160 -41 -49 -5 128 -23 51
5510 51 -13 -165 -35 -8 119 79 -3 -11 -86 200 128 30 -40 37 -26 -132 -45 -4 130 -7 -1 -78 75 45 -77 150
5536 150 101 -151 -53 115 -51 -69 -41 -159 -3 206 44 -111 30 -86 -120 30 127 -32 -121 243 53 -114
5558 -114 166 -76 -40 -48 32 -91 -97 0 -27 -68 140 7 -69 -119 186 19 -35 -12 -78 -143 129 13 -20 100 93 -169
5584 -169 -230 11 -9 135 14 -61 18 17 58 -42 58 220 -109 110 13 25 6 131 -4 23 171 -4 -159 -14
5608 -14 -135 45 74 99 83 -137 28 140 -90 101 -18 -131 43 123 95 -97 98 -46 -126 121 96 -57 -35
5631 -35 -4 -46 50 113 106 -68 -28 -20 65 133 -17 -67 170 145 -67 47 11 30 -172 -72 6 -91 -48 11 -259 44 74
5658 74 -10 116 148 -126 -46 119 30 128 158 -86 -115 -5 272 77 -22 135 -68 24 54 -2 -73 -74 -142 37 69 226
5684 226 -28 -214 183 120 22 215 111 -10 24 32 -107 104 115 43 -61 -36 129 -204 -15 37 -67 -33 -34 -84
5708 -84 -100 55 -115 -130 -104 -87 -38 96 8 -21 66 35 -4 28 104 34 -84 -30 69 5 6 45 -24 166 24 -25 -63 181
5736 181 90 1 4 -127 -51 143 115 -70 48 49 -96 82 158 -32 -13 97 135 -11 103 118 -151 -13 -45 -70 122
5761 122 115 -81 37 162 -67 -45 65 21 15 71 55 119 -204 -109 -47 -37 130 5 -87 -132 83 76 107 59 -59 -52 -61
5788 -61 -190 -4 9 104 -104 -91 210 -35 37 -15 -23 -65 109 261 -50 -30 1 -144 -73 132 51 -153 87 1 -1
5813 -1 69 18 -80 -105 65 163 101 52 -118 -106 -29 -42 -9 72 -8 -117 -217 43 133 -33 -146 -120 6 27 125 20
5839 20 36 -28 -56 25 2 90 -129 21 -7 -42 114 -40 -13 -29 -101 -2 114 85 -51 13 13 -139 47 143 -54 -18
5865 -18 -64 153 -25 123 -110 -24 -94 -78 176 -26 4 -96 -125 80 29 94 -142 -61 -137 49 82 -83 9 53 -150
5890 -150 12 190 201 131 -203 -160 82 150 236 92 -244 -46 -124 256 115 -174 -13 -115 127 151 -43 -1 63
5913 63 -128 -26 1 147 177 -71 -64 -71 65 235 -95 -309 43 -144 70 199 -99 -68 -88 84 54 80 78 -57
5937 -57 -169 -65 123 -26 195 -63 -181 26 158 35 -79 -119 -95 167 23 82 -80 -45 -89 -142 139 200 41
5960 41 1 -232 14 97 30 120 -123 -175 -4 202 63 78 -45 -105 57 115 105 82 -51 -15 72 168 28 -50 -89
5985 -89 -131 -169 92 213 57 -12 10 -202 227 93 140 -197 -13 -174 55 68 213 -82 -206 2 76 196 -201
6008 -201 -155 -16 -44 137 216 -265 -123 -253 164 227 48 138 -111 -164 19 46 77 46 17 108 -66 -31 35 -105
6032 -105 -20 22 -158 49 116 -189 -96 28 -190 -62 -64 121 -69 119 105 65 76 49 -42 -256 26 111 -80 94
6056 94 -130 16 -17 212 -75 23 26 -4 -113 150 -24 96 -32 34 43 3 166 -55 -71 57 -93 -102 12 -54 125
6081 125 -17 21 -27 244 -86 81 13 55 -121 -80 76 -67 -24 23 15 -40 -24 147 -46 88 -108 33 -5 59
6105 59 65 -56 55 -42 -186 -56 108 -129 -60 108 35 109 186 -75 -38 -183 -49 -113 167 147 2 -53 37 180
6129 180 -138 -46 -3 -383 -156 62 -42 -106 77 -193 -234 31 94 -19 -121 -70 -124 45 51 78 -100 -191 45 61
6153 61 141 9 -2 -130 96 -22 203 -22 -90 -93 -258 89 233 212 -71 -216 -28 7 52 60 51 -233 -125 6
6177 6 6 89 -55 -43 -186 123 150 151 -14 -36 -132 -92 215 107 -276 -242 -49 -70 128 289 -111 -192 -15 -16 99 215
6203 215 -71 -288 -101 146 101 -7 66 -159 -104 147 305 55 4 -344 -175 122 287 -45 -130 -199 -189 99
6225 99 244 219 -69 -154 -60 -21 265 192 -61 -162 -108 -2 158 239 -85 -133 -72 46 131 180 -19 -111 -160 106 134
6250 134 119 3 -209 -185 126 227 72 -117 -218 -71 -237 55 274 -47 -121 -257 -63 194 57 21 -214
6271 -214 -40 -96 -16 309 98 -98 -155 -5 141 57 -40 -351 -139 -60 97 207 -106 -77 -135 64 174 77 -116
6294 -116 -315 -185 -42 88 188 -68 -129 -128 -8 132 105 113 -178 -98 -3 33 99 -69 -325 -215 33 86 45 99
6318 99 -339 -46 97 167 -85 127 -227 -214 -126 100 233 64 -12 -90 -11 57 194 21 -46 -157 -68 157 106 -41
6342 -41 -193 -157 -42 -21 154 19 -201 -115 61 69 89 57 -132 -75 -189 343 223 -83 -48 -88 56 62 -7 82 -101
6367 -101 -28 -78 -22 280 -67 -6 -69 45 -29 80 94 -56 -95 89 113 199 -13 -144 104 -154 14 154 25
6390 25 -213 -162 -107 -9 74 12 75 -109 -86 -27 29 120 2 -1 3 -216 103 138 -96 76 -206 159 20 -52 11 -120
6416 -120 27 -15 59 60 -100 -67 -24 28 -13 -139 53 22 -16 82 89 83 160 48 -36 141 108 86 159 200 -2 -146 22
6443 22 -49 206 -17 -5 2 -39 -111 33 192 -112 -115 37 48 75 187 -26 -129 -149 89 202 128 65 15 -184 20
6468 20 -98 135 204 64 -108 -89 123 40 67 -22 53 -58 -141 127 -33 -112 -126 -82 69 108 -83 -77 100 -96 86
6493 86 138 84 83 -114 24 -7 24 -20 -31 -115 -144 65 243 -32 -169 -141 -104 53 171 97 -45 -33 -130 95 276
6518 276 -191 -154 -66 -142 -16 152 177 -67 -406 -163 245 100 102 -176 -282 3 -55 203 251 -93 -85 -109 6 171
6542 171 141 163 -198 -138 85 197 171 -59 -131 -73 78 101 109 92 -235 -94 65 222 166 -165 -267 -90 31 45
6566 45 -68 -1 -271 -199 130 91 267 -68 -284 129 2 119 220 -83 -166 -81 133 312 23 78 -84 -80 -42
6589 -42 231 149 -25 -253 -251 166 264 23 -185 -32 3 -6 331 156 -26 -237 -34 80 108 -196 71 -252 -322
6612 -322 -117 -80 66 -179 -71 -63 136 144 106 136 -317 -215 40 236 193 -131 -234 -158 -18 263 169 106 -102 -192
6636 -192 -27 200 157 -180 26 96 87 179 83 84 -171 -22 155 140 132 37 -191 -223 -178 61 192 -23 -106 -74 20 278
6662 278 28 133 -130 -93 -15 12 41 -18 -181 -288 41 281 106 48 -5 -90 27 41 27 -23 -168 110 -56 71
6686 71 87 202 -7 -204 69 156 63 20 -38 -18 15 -18 164 66 -189 -304 33 18 -138 46 -29 -79 -59 101 48
6711 48 60 9 -142 187 59 16 -87 12 -84 -172 96 189 -11 4 175 41 88 68 -161 -52 108 46 120 29 -120
6736 -120 7 75 -68 -84 21 166 14 -76 117 13 -123 -134 -6 95 -53 -89 119 -10 -40 18 -36 -54 85
6759 85 -39 -25 154 49 -76 27 0 91 21 130 -96 -137 53 -65 -58 128 -62 -64 103 -78 -74 9 -13 7 -110
6784 -110 46 90 -204 -102 -159 -82 -118 59 -96 -44 -79 -157 132 69 6 -17 -112 48 42 12 100 -53 -145 -206 87 28
6810 28 -76 -31 -63 -115 164 -13 -15 75 -27 -95 14 7 -267 -7 -5 -126 -67 95 71 -58 -60 -58 69 7 -2 -139 -9
6837 -9 -146 27 88 65 -130 -132 -89 141 -15 -16 -92 -100 17 31 157 115 -14 -84 2 92 211 14 -115 -174 47 -43
6863 -43 84 148 -42 7 -97 99 -121 -40 -119 -47 219 120 -2 -4 -40 -123 8 68 137 -80 -188 -65 -59 -115 165
6888 165 7 4 107 -56 32 87 -68 -169 -216 35 93 95 -26 24 -180 69 143 163 170 51 -88 38 85 -9 18
6913 18 -145 -86 46 -15 1 2 -151 -163 231 137 83 89 102 -150 12 23 86 61 -132 95 -26 111 161 -115 -68 -228
6939 -228 108 147 3 37 -172 7 -59 77 34 48 -73 -214 -24 184 27 36 -78 -4 -30 -29 94 -27 -28 4 -65
6964 -65 49 -17 -7 -60 -74 64 61 0 -1 -75 -36 -23 162 201 -67 35 6 -46 153 91 -126 -23 -57 98 134 145 -77
6991 -77 -104 -147 -7 94 6 -11 -12 -102 65 144 -11 -87 -123 -105 1 102 19 43 -107 17 11 38 -59 52 41 50 -62
7018 -62 39 -10 -109 113 -15 8 -70 -299 -81 -34 -63 2 9 177 91 -120 -140 152 -34 6 -42 -50 147 19 196
7043 196 -74 33 -64 -141 -21 207 71 18 -43 -150 74 -32 -63 128 -120 11 -4 83 162 -129 133 84 97
7066 97 50 -43 146 1 18 7 -3 -143 51 3 -108 71 151 -67 114 17 77 -6 9 190 -57 -28 -39 -62 -97
7091 -97 -101 -28 -182 -13 -40 -2 -143 95 56 -50 49 36 25 7 37 -78 47 -59 -20 45 -141 -132 34 -64 -155 -47
7117 -47 77 -62 -133 -23 162 -80 2 14 -40 -40 -36 -44 49 27 169 -34 -73 -22 -98 -32 52 -86 6 151 7 -108
7143 -108 44 -108 41 -101 -55 -142 150 -49 -35 26 -30 -2 154 5 -68 66 -49 97 67 -16 -87 -35 6 33
7167 33 129 125 89 -117 -83 82 -98 83 17 -44 109 15 97 -42 -181 68 117 -9 11 -48 16 180 -139 -2 42
7192 42 -97 -122 -71 -57 109 28 99 14 -67 35 -31 -128 -88 83 115 -41 90 -159 16 26 75 -94 -124 34 -19
7217 -19 -23 33 64 29 -153 92 -126 71 171 54 -128 -1 0 209 71 -2 -68 -63 2 15 62 20 -59 -30 -33 48 63
7244 63 -231 -110 -157 62 27 203 -13 -127 -122 -187 2 175 -105 71 -22 37 -38 80 -11 -122 -125 -65 54 262
7268 262 105 -80 -24 33 5 -32 -5 186 -113 9 -16 33 -36 70 30 -170 193 206 74 -36 3 -106 -97 140
7292 140 -70 -81 -137 71 -1 104 -20 -61 -114 -90 75 178 85 -212 26 67 6 6 -18 -173 15 32 196 82
7316 82 -132 44 -89 -55 164 55 108 -75 -63 -98 45 76 -101 37 -56 48 -25 177 -20 -51 -163 -18 136
7339 136 25 163 -62 -252 -113 45 -40 86 -150 -170 -37 42 -36 -118 0 -100 78 -47 190 4 -116 11
7361 11 14 90 216 -10 12 30 8 118 152 179 -26 -163 -15 -112 137 -43 -2 -91 -41 49 55 3 -43 48 15 122 137
7388 137 64 -82 -112 185 254 -63 -120 -183 -166 -117 35 -59 77 -130 -71 -55 9 -126 79 -4 -103 -123 -2 56 -103
7413 -103 -70 -34 23 45 15 117 34 -47 -107 -21 -69 186 0 -134 8 66 104 94 38 -89 -105 12 85 -64 -105 -12
7439 -12 -54 109 81 63 74 -61 148 52 -77 63 75 -119 -55 -153 54 -16 -132 26 21 -27 -22 -49 22 166 26 13
7465 13 -71 -84 33 136 -27 31 1 9 71 -78 80 -162 -53 -20 -123 11 -5 4 -42 97 -4 -15 -57 43 106
7490 106 -93 -24 76 78 -113 -34 26 112 22 -44 -10 -79 -46 148 91 33 -122 -17 -40 122 -22 -63 -116 -66 8 -16
7516 -16 166 142 -36 -10 -136 -56 -8 252 20 -100 -107 -45 -41 131 166 -111 -85 -48 47 -174 -159 -27 -41 33 -14 20
7542 20 11 -115 -92 -83 114 116 -58 69 -43 149 119 -4 52 -169 -30 93 33 40 -27 -165 -116 -30 -85 73 -27 -128
7568 -128 12 -8 44 199 60 -302 -193 87 86 -27 -9 -13 -55 -36 218 161 57 -347 -98 -22 62 117 40 -108 -177
7593 -177 105 -90 -7 -172 -229 -71 47 35 51 31 -76 -72 40 91 104 128 -67 -71 3 235 127 -202 -116 -41 97
7618 97 55 144 36 -136 -56 14 157 -95 -67 -135 -102 -32 146 97 -51 -86 38 -88 154 181 -11 -28 -113 -67 241
7643 241 95 79 -252 -10 148 358 30 -29 -90 24 -25 169 202 40 -140 -214 40 48 44 22 -21 -147 -50 101
7667 101 170 -67 -108 -114 8 94 186 4 -275 -105 81 187 -54 50 -24 -146 26 248 104 -118 -138 -147 -85 108
7691 108 57 78 -13 95 110 107 77 55 -151 -163 -139 52 62 -57 -102 -67 14 7 38 -14 -145 -99 29 71 -83 -27 -98
7718 -98 -77 12 116 -21 34 -111 -98 22 79 216 -45 -154 -62 -1 79 197 -70 -117 -132 -79 236 67 -59 -35
7742 -35 -204 -176 83 54 -1 -19 75 36 66 -97 -75 -108 90 -31 159 115 75 -149 7 23 77 76 -71 -126 -26 -70
7768 -70 27 121 -89 -221 -25 0 -58 55 -214 -20 -164 89 102 93 -24 17 56 15 -36 -207 18 25 -96 25 -57
7793 -57 -7 -101 179 95 15 -191 58 183 -19 2 -122 14 -80 -191 -84 172 -25 7 -8 -91 -103 43 -50 -69
7817 -69 -66 152 -30 85 44 -80 -35 -13 122 132 -12 42 -74 167 65 -18 151 -135 -168 -142 37 62 -81 70
7841 70 10 158 -11 107 47 79 -73 -74 27 98 -78 -138 -10 71 -8 104 140 -110 83 -147 -9 41 -96 -162
7865 -162 -225 -9 91 74 -15 -30 12 -38 134 -30 -23 98 -109 -59 4 125 185 -1 -205 -221 11 -8 -20 -199 -251
7890 -251 -24 159 146 142 221 -55 -60 158 -1 54 -27 -154 23 22 125 106 -167 -104 -97 -58 58 87 59 85 -59 10
7916 10 230 -53 -10 -65 42 33 123 242 125 -301 -93 102 42 81 -107 -73 -82 -63 85 209 -202 -110 -54 -36 65
7941 65 77 75 23 65 29 205 60 -162 -19 -154 194 131 4 -69 -221 -95 121 221 108 -106 -60 -27 -210 225
7965 225 216 -136 16 -238 128 -26 -2 -8 -103 37 34 172 87 148 -220 -97 57 57 -36 -18 -184 -1 -58 1 87 93
7991 93 -116 -24 127 63 -24 -30 -54 -130 -6 11 11 26 -103 -72 100 301 -98 -251 26 0 -6 131 37 63 -187 44
8017 44 170 117 -9 -77 -26 -65 136 91 -13 81 18 -39 35 201 -10 10 -127 -44 -2 117 -33 -25 -93 -7 -88 81
8043 81 0 -30 59 -140 207 130 108 6 -154 48 34 -52 120 48 24 3 213 88 39 -189 46 -81 -76 33 189
8068 189 -53 -166 143 -11 66 0 -113 4 47 15 -49 -48 -71 -15 -2 -44 -10 -37 62 -113 -30 -20 -14 -55 -72 -53 -26
8095 -26 136 75 122 29 48 4 65 82 43 -74 -26 -19 -116 128 -16 24 120 -52 -69 201 33 -96 32 -78 -67 -55
8121 -55 59 -31 -155 -119 29 -174 14 -71 -23 -21 138 9 122 1 -8 15 25 -48 119 11 67 48 -45 -34 -215
8146 -215 71 48 147 -6 22 28 59 15 115 -3 -193 25 -39 29 -31 182 -67 -97 31 -190 -84 62 -20 -78
8170 -78 -24 81 129 -100 14 117 103 42 172 41 -86 -90 32 134 10 153 -38 -118 -72 13 -145
8191a45
$$ Imaginary data points
##PAGE= N=2
##DATA TABLE= (X++(I..I)), XYDATA
0 0 0 0 0 0 0 0 8 0 0 0 5 -8 8 -8 16 -16 21 -24 32 -34 40 -50 61 -72 82 -94 109 -126 144 -165 188 -212 240
33 240 -270 302 -341 380 -426 474 -529 587 -649 719 -794 876 -967 1065 -1172 1291 -1422
50 -1422 1567 -1727 1905 -2105 2333 -2593 2890 -3238 3649 -4144 4755 -5523 6529 -7894 9853
65 9853 -12887 18101 -28724 58392 -301675 -956630 138263 224476 -175429 494031 277428
76 277428 -754328 -326065 274823 -16493 189202 293372 -453269 -361905 249336 -20197
86 -20197 -60133 324336 -147070 -438619 148986 206665 -144850 27964 36696 -212573 -2620
97 -2620 208054 22300 -74756 -96575 -131097 79960 235807 74524 -85602 -180502 -155302
108 -155302 127332 274944 124263 -37398 -226869 -246334 137792 350828 123616 -55563
118 -55563 -162804 -248456 32804 337815 163274 -61619 -115703 -221054 -47547 303069
128 303069 161255 -113821 -50841 -93582 -144347 154732 237866 -73288 -148264 -20866 -40901
139 -40901 24558 156556 13469 -143944 -52472 7263 19179 115867 40477 -168943 -108295
150 -108295 99721 81869 -1297 36660 -60660 -197783 20477 239032 48441 -109551 -55872
161 -55872 -98862 -38628 195156 131226 -103264 -92166 -74285 -72232 172372 195657 -134478
172 -134478 -129074 41095 -83795 4301 239444 -1513 -205713 6627 27808 -54919 122053
183 122053 80831 -147477 -34757 54941 -71923 58120 135263 -127158 -101280 114834 -11132
194 -11132 -50951 110771 -21431 -137874 50706 76164 -33321 30312 -4842 -112390 30599
205 30599 107853 -34181 -12877 32441 -91345 -28970 123889 24980 -61065 -718 -20127
216 -20127 -23834 58284 33377 -28643 -2087 -16813 -32382 48352 39695 -45315 -3681 27325
228 27325 -32682 -5257 36421 -6348 -7615 6690 -20334 1746 22519 -18541 -4195 34969
240 34969 -20750 -38746 36182 18057 -36525 15036 22393 -31776 -1677 17564 -12558 14088
252 14088 18656 -31505 -8053 27433 -15942 -5602 49810 -10589 -61812 18644 38572 -12706
264 -12706 13487 9766 -47945 -11600 40226 16180 5931 -5653 -51429 -18350 59929 28515
276 28515 -27587 -6550 -22361 -41436 39847 63776 -19461 -45353 -22991 -13344 27992 48466
288 48466 -4431 -41577 -29374 -17163 19386 61769 10613 -61671 -35725 4874 15155 43612
300 43612 27086 -42632 -57063 -9495 38895 54940 16329 -45874 -56322 -4797 40777 51601
312 51601 27838 -40215 -75121 -10579 60917 60716 13096 -45522 -61366 -13090 48751 68689
324 68689 21499 -50338 -69264 -13416 58162 65532 9243 -44028 -58696 -21302 46225 70059
336 70059 20184 -52430 -69270 -11066 48382 58220 21569 -44536 -71555 -20591 46523 68037
348 68037 24536 -52114 -76691 -17941 52866 63137 20817 -39639 -79745 -33217 62450 75240
360 75240 11439 -45416 -72134 -29927 57703 75844 14435 -47362 -70163 -30904 54883 84150
372 84150 11900 -57702 -59875 -25716 40652 83366 23069 -57370 -66760 -25803 42704 78399
384 78399 22925 -51795 -64683 -27474 34079 75402 33441 -52290 -70402 -20514 33780 67729
396 67729 33241 -49729 -66551 -18179 30935 67880 35123 -55434 -71300 -6345 40938 54718
408 54718 32408 -42985 -81212 -11391 58783 54150 22279 -35435 -79835 -20507 63136 60900
420 60900 15799 -29820 -67690 -37158 52939 79501 12669 -39407 -46828 -37710 25182 83452
432 83452 28243 -48749 -44952 -21786 8912 66366 45342 -52277 -56656 3903 6762 33543 59450
445 59450 -40727 -84590 18438 37072 2036 41337 -9385 -96897 -3736 75597 3636 999
457 999 12839 -84188 -40886 96251 32304 -35595 15078 -50527 -74322 80517 77873 -44444
469 -44444 -12638 -13205 -76705 34536 106231 -18148 -43535 2286 -55942 -7067 102902 16796
481 16796 -55931 -2246 -27860 -24663 72891 38590 -44052 -14767 -10876 -18613 45641 33514 -34114
494 -34114 -11288 -93 -16723 35625 25054 -43730 -4202 17902 -19821 31568 27993 -63102
506 -63102 -12590 44866 -19531 14246 51853 -65426 -55543 64867 8364 -20635 64461 -27380
518 -27380 -100920 44542 51688 -37748 47029 23951 -110047 -7813 81271 -24375 4001
529 4001 60759 -70238 -66507 73577 17107 -34549 52097 -5900 -81068 28252 45043 -36772
541 -36772 16297 32717 -49707 -12864 42091 -17557 -18648 37630 -846 -30560 17875 6683
553 6683 -32751 9553 33640 -9724 -12447 11367 -14435 -24788 25665 32033 -19452 -9488 13684
566 13684 -32606 -15751 54468 9867 -35212 17546 -3249 -50110 27776 51660 -32020 -8605
578 -8605 29645 -44927 -21534 62331 -2870 -32375 39004 -11189 -54907 33805 28959 -32728
590 -32728 20704 24477 -49346 -12505 33675 -9814 4178 33009 -24538 -31904 13808 688
602 688 5628 29693 -9794 -26185 -846 -5129 7492 26867 -3913 -15301 1086 -13953 -2586
615 -2586 28689 -891 -15520 14427 -10299 -21172 26853 4373 -24395 25395 6727 -36263
627 -36263 19279 15134 -40286 18357 40156 -36199 -7890 32472 -39608 -16222 64007 -4453
639 -4453 -37839 29295 -19162 -46664 57555 35814 -47537 8703 8139 -59108 22054 71293
651 71293 -29933 -29304 27738 -34875 -25880 67970 14035 -48966 12622 1632 -39053 30955
663 30955 39389 -34430 -11254 19946 -23470 -4411 38559 -9842 -28971 20371 5086 -20081
675 -20081 17151 7242 -28645 5640 25076 -7266 -5745 4073 -18277 -7459 29138 15049 -14547
688 -14547 -10101 -11098 -10146 22552 28568 -6013 -21375 -16453 -6022 17751 28011 4640 -20772
701 -20772 -21305 -5423 13341 24270 10376 -15924 -22013 -7796 12021 20356 6604 -8942 -15043
714 -15043 -13343 7980 23058 4079 -12331 -9330 -7434 2074 18855 8882 -15848 -12169 990
727 990 1411 14398 13261 -19612 -17990 9515 6049 6186 13932 -13820 -27502 7153 20918 3578
741 3578 3026 -5588 -26614 -2138 28391 8412 -5004 -3405 -22166 -9827 28427 16652 -10633
754 -10633 -6414 -10872 -14489 16745 26764 -6607 -15842 -4761 -9436 6402 25845 287 -18653
767 -18653 -5399 -3365 2634 20478 6273 -20154 -11624 5415 5553 11225 8572 -16931 -17932 7255
781 7255 12338 9116 5243 -15664 -19421 5708 17376 9221 889 -11631 -18955 -441 20183 12076
795 12076 -2886 -9801 -15434 -2809 17128 11900 -1654 -8202 -13324 -3905 14180 12776 -2787
808 -2787 -9714 -8144 -3325 9390 14246 -1908 -12290 -7705 -1802 10082 14429 -2482 -13348 -7967
822 -7967 -711 9743 14316 178 -15260 -10907 2618 9325 11626 2464 -14192 -11296 3062 7876
836 7876 9914 2518 -12660 -9695 3558 7353 6421 1276 -8812 -8800 3390 8433 3712 122 -6740
851 -6740 -9341 4416 9816 1758 -268 -5897 -9958 2947 11087 3834 -1974 -6316 -8750 834 11177
866 11177 6163 -2812 -5428 -8553 -1838 12219 6809 -4267 -4256 -7136 -2411 10557 6275 -3822
880 -3822 -4215 -4978 -1430 7954 5404 -4049 -3818 -2192 -2331 6373 5926 -6112 -2452 1130 -5148 4687
896 4687 8355 -7498 -3314 4823 -5075 581 10263 -4794 -7606 6246 -1513 -4852 10952 558
910 558 -13343 5683 4836 -9922 8605 7206 -15983 905 11433 -9456 274 12820 -10832
923 -10832 -8298 14583 -2267 -10315 12015 633 -13561 9159 4777 -12952 6064 7759 -9794
936 -9794 2647 5428 -10993 695 10982 -4083 -3646 4703 -6291 -4100 10138 2183 -5372 1088
950 1088 -3630 -2941 6896 2277 -1199 -287 -6096 -321 6701 -783 445 2493 -8352 -2358 10019
965 10019 -1452 -4444 7078 -5005 -9895 13009 5210 -12681 5016 2901 -13193 9798 12759
978 12759 -14799 -3782 8246 -9019 3859 18589 -11257 -16699 9587 1251 -3222 18353 -496
991 -496 -24739 -99 10695 138 10539 4677 -18702 -10413 7823 7983 7518 3420 -10183 -13048
1005 -13048 -181 10261 9943 -10 -6871 -5876 -6037 3064 16409 517 -14470 2271 699 -7689
1019 -7689 14992 7990 -22173 -1138 14629 -8220 3921 14974 -22744 -15335 26577 4104
1031 4104 -10570 16354 -12751 -31708 24119 24933 -16809 5144 2020 -35520 5546 39086 -6359
1044 -6359 -12120 9106 -23091 -14758 36461 12416 -19876 3246 -8095 -20688 22390 22427 -15609
1057 -15609 -5626 264 -15797 9046 24916 -7680 -15879 2302 -3283 487 18323 1626 -18210
1070 -18210 -6310 5459 8193 9022 -2038 -11650 -9592 1088 16531 11729 -9470 -12875 -6217
1083 -6217 -1275 15963 18333 -10734 -19630 -1938 -499 7763 25410 -2470 -30149 -3721 8410
1096 8410 -84 19364 11737 -28048 -17123 13038 5350 7850 15855 -15741 -26115 9262 13356
1109 13356 -368 11703 -2548 -27810 27 22142 878 -2782 3582 -14311 -10364 19279
1121 19279 13045 -11703 -6661 -1164 -6282 10265 17136 -8257 -16236 -1442 2051 7355 15666 -2518
1135 -2518 -21951 -6257 9369 4989 11442 7839 -21875 -18379 13748 11776 1855 9161 -7818
1148 -7818 -25460 1797 22374 4062 -2008 119 -17175 -9273 19767 11356 -6135 -2149 -9681
1161 -9681 -10739 15031 15401 -8449 -7496 -1109 -7960 4900 19907 -2200 -18165 -1478 3680 705
1175 705 11471 5130 -14455 -10026 5101 7437 5844 2962 -8465 -11649 2526 9460 4312 2253
1189 2253 -4964 -12133 -1402 11604 6690 -2540 -4384 -5923 -5230 6862 12572 -1549 -9942 -3616
1203 -3616 -843 3105 10028 2678 -9887 -7418 2048 4050 5529 4545 -7197 -9774 3077 5702
1217 5702 1495 3858 -2543 -10081 -18 8427 1165 -1844 1088 -5054 -5224 8050 5591 -6104
1231 -6104 -1001 1258 -5252 2805 8037 -3181 -5652 1505 -745 -803 6988 1088 -7986 -327 2729
1246 2729 -2332 4793 4755 -8013 -3828 5306 -112 -249 5110 -2451 -6731 2468 4120 -1937 1199
1261 1199 1341 -4625 466 3806 -2166 -32 2398 -2410 -533 2641 -1264 -2066 2361 1522 -1636 -128
1277 -128 88 -1784 1111 2246 -508 -737 -1480 -1507 2489 1920 -473 -428 -1746 -1438 2037 1952 500 -871
1295 -871 -2211 -1725 1799 3221 192 -1478 -1294 -2739 1058 4991 725 -2558 -2330 -2609 1994 5173
1311 5173 987 -2941 -3470 -2179 2039 6058 2620 -4890 -5264 -978 2302 5868 3284 -4728 -5701 -1789
1327 -1789 2646 6891 2684 -5067 -5425 -1624 2671 6036 3323 -4092 -7028 -1790 3720 5692 3623
1342 3623 -4239 -7132 -1414 2849 6216 5055 -4507 -8622 -1838 3907 6688 4925 -4152 -8977 -3293
1357 -3293 4172 7302 5469 -3616 -10685 -3472 6076 6262 4587 -2071 -10616 -4670 6175 7079 4152
1372 4152 -2763 -10425 -4282 6611 6856 2359 -1768 -8716 -7099 6751 10058 1077 -3342 -7190 -6868
1387 -6868 5314 10211 2728 -3265 -8552 -7338 5219 11338 3315 -4341 -7409 -6875 2951 11757 5566
1402 5566 -5164 -8260 -6976 3622 11877 3962 -4666 -6971 -7472 2622 12333 4308 -5861 -7172
1416 -7172 -5984 2381 12318 4559 -7325 -5938 -4536 -861 12641 8442 -10160 -8231 -572 -1053
1430 -1053 9022 10951 -7502 -11398 -1166 923 7387 11714 -5187 -14238 -705 3415 3058 11452
1444 11452 261 -16707 -5047 7541 4794 6492 1163 -12507 -7275 5785 6786 5519 922
1457 922 -10808 -8561 6329 8205 3104 -252 -7890 -7725 3488 8008 5305 -728 -9905 -5993 5218
1472 5218 5824 4010 1229 -8645 -8189 4707 7635 3316 1049 -7991 -9706 6111 9215 -518 2208
1487 2208 -3107 -14060 2673 15151 -40 -4390 -90 -8753 -3132 13500 5159 -6704 -1635
1500 -1635 -4871 -5273 11796 8748 -9534 -4145 1394 -5448 4552 12027 -3972 -10130 54 1625
1514 1625 1878 6777 556 -8379 -3149 2586 2641 5212 1916 -7684 -6259 3394 5900 1590 -320 -1574
1530 -1574 -6333 -3076 8610 6402 -5051 -3769 -942 -3004 3805 8032 -2604 -6093 151 -1808
1544 -1808 869 9748 -690 -10565 2141 3820 -4761 5284 6450 -9548 -4985 7256 188 -1423
1558 -1423 5153 -3435 -6984 5194 2915 -3452 4599 322 -9742 2190 8412 -3232 -2161 3934
1572 3934 -3721 -4554 5738 4015 -3390 -1142 -483 -2652 2697 3818 -2192 -1563 753 -1995 -279
1587 -279 4671 1136 -5135 -1066 4064 -1188 -2081 4004 506 -4783 1213 3474 -2310 -919 2539
1602 2539 -1712 -1081 3402 -1748 -2988 4649 173 -5233 4055 3186 -6699 222 6742 -3468 -3830
1617 -3830 5205 110 -4793 3328 2098 -4215 1877 2127 -4588 1949 4584 -5111 -1838 5830 -1906
1632 -1906 -4429 5506 1638 -7465 843 5896 -2529 -963 3219 -3739 -2446 4764 678 -1651 2239
1647 2239 -2919 -5174 5040 5724 -4842 -1698 3273 -4602 -2246 8293 1446 -6391 -341 985
1661 985 -1515 3048 3208 -3338 -2326 852 -1798 1968 5796 -3238 -5995 2833 2057 -2209 2901 2638
1677 2638 -5314 -3789 4176 3334 -929 -574 -1975 -2884 2294 3730 31 -828 -2435 -4015 1754 6914
1693 6914 645 -5115 -1504 347 -1488 3831 5751 -3849 -6528 352 2194 2554 3188 -1664 -5174
1708 -5174 -1059 2135 1760 3810 584 -7086 -3050 5276 2390 -607 1215 -2869 -5316 1689 6118
1723 6118 1899 -2495 -3527 -2811 1577 5184 1886 -1937 -2873 -3996 -171 6490 4410 -3881 -5388
1738 -5388 -794 1441 2161 4403 580 -6510 -4087 2969 4129 2339 -665 -4485 -2847 1954 3199
1753 3199 2151 846 -3731 -5797 2146 6602 159 -1852 -609 -4076 -1371 6143 3998 -2309 -3771
1768 -3771 -3025 255 5242 3569 -2399 -2848 -2429 -2351 4460 6578 -2422 -6037 -1208 754 2549 3902
1784 3902 117 -4162 -3338 195 3706 4335 -1088 -5175 -1801 1642 1673 3175 1052 -4189 -3711 961
1800 961 3948 3360 -1035 -4075 -1709 389 1979 3589 1239 -4429 -4263 1390 3778 2422 -51 -3168
1816 -3168 -3486 346 2403 3704 1601 -4680 -4486 1773 3423 1771 286 -2280 -3905 -359 3767
1831 3767 3233 -3 -3351 -3805 1002 3469 1245 651 -1441 -4129 -973 3765 3004 -42 -2622 -2779
1847 -2779 -167 2249 1855 1211 -903 -3908 -1831 3613 3017 -1021 -1177 -1864 -1629 1963 2649 556 -1119
1864 -1119 -3064 -1495 3408 2537 -1215 -1155 -858 -1827 1202 3686 -110 -2613 -1255 -668 1309 2676
1880 2676 -858 -1534 -9 -1691 133 3663 271 -3064 -513 632 -219 1659 1208 -1870 -882 -51
1896 -51 -298 2293 1662 -3103 -1268 1462 -297 480 2374 -1083 -2842 -110 1432 1161 1005 -1150 -1938
1913 -1938 572 421 18 2178 -96 -2785 9 1600 326 23 -228 -405 11 -352 333 1294 -611
1930 -611 -1605 693 878 -1154 433 901 -1245 -192 1085 -829 604 1133 -2014 -251 1910 -1234
1946 -1234 -754 2211 -511 -2233 1485 1038 -1496 754 778 -1767 458 1068 -1633 508 1627 -1852
1962 -1852 -373 1691 -1298 -1436 2189 804 -1833 -280 361 -302 679 921 -438 -474 -797 -116 1649
1979 1649 489 -1098 -408 -207 225 792 -61 98 27 -1445 88 2221 -403 -1634 930 286 -1844
1996 -1844 1519 1650 -2447 -239 1392 -1630 1092 2536 -2753 -2004 2366 -790 -1012 3476 -227 -4635
2012 -4635 630 2770 -1077 1436 1892 -4121 -1700 3060 499 539 1884 -3081 -3435 2897 2315 -1173
2028 -1173 1106 471 -3959 -302 4158 266 -1487 653 -1113 -1662 2123 1732 -1301 -467 137 -1225
2044 -1225 626 2801 -1016 -2446 976 626 -698 1924 904 -3301 -1304 2418 1028 66 983 -2087
2060 -2087 -3092 1995 2840 -270 315 -1254 -3931 404 4446 776 -1636 -382 -1951 -1968 3398 3399 -1839
2077 -1839 -1833 -413 -1320 1114 3580 -328 -2538 -692 -285 -276 2489 1750 -2692 -1873 1550 85 187 2304
2095 2304 -1028 -3495 768 2447 -483 -43 275 -2546 -891 3685 869 -2216 188 -1315 -1901 3696
2111 3696 3145 -3114 -2244 733 -1150 1083 4607 -703 -4707 -340 808 -408 3544 1862 -4431
2126 -4431 -2481 1696 16 1215 3433 -1913 -4466 859 2008 -426 1858 1277 -4032 -1392 2923
2141 2923 264 -279 1625 -1886 -2616 2183 2216 -1858 -219 942 -2228 696 3763 -1334 -3022 1112
2157 1112 138 -309 2868 640 -3761 -1087 1720 335 1466 2002 -3075 -3182 1814 1157 455 2264
2173 2264 -817 -3854 -123 2175 751 956 289 -2575 -1647 1489 1728 452 306 -1531 -1698 894
2189 894 1625 412 -524 -585 -614 -64 1339 994 -1113 -1181 538 526 216 658 -307 -1889 57 2212 -19
2208 -19 -340 589 -1638 -889 2361 917 -1276 500 -859 -2027 1580 2454 -1231 -891 399 -1881 -193
2225 -193 3212 238 -1958 284 -777 -1303 2458 1277 -1947 -393 380 -1112 934 2122 -1010 -1703
2241 -1703 776 -126 -459 1560 -63 -1604 299 700 -587 406 333 -862 -385 1031 314 -420 58
2258 58 -91 -651 277 796 -153 -356 -96 -348 -114 619 463 -448 -459 215 -435 137 1078 -566 -842 365
2278 365 134 179 658 217 -955 -127 449 -266 154 542 -661 -274 704 -387 -323 467 -404 -398 517 -124
2298 -124 -277 399 16 -122 156 -99 -494 445 339 -507 190 -88 -446 620 378 -562 25 53 -581 603
2318 603 348 -448 75 554 -422 -57 825 -335 -578 615 -254 -467 1015 -127 -804 555 -84 -479
2336 -479 813 380 -919 -1 286 -472 411 955 -751 -741 414 -245 148 1046 -662 -1036 588 80
2354 80 107 634 -339 -978 307 369 97 382 -24 -851 -90 730 -152 243 212 -1054 -91 703 -13 210 21
2375 21 -794 -272 544 104 139 -47 -548 -609 460 521 11 104 -771 -836 923 531 -83 114 -706 -579 793
2396 793 585 -171 -54 -550 -545 532 964 -431 -267 -29 -675 215 1125 -236 -542 -22 -576 116 1222
2415 1222 131 -704 -74 -326 -78 894 499 -646 -501 80 -105 648 866 -623 -671 -222 -106 901 606
2434 606 -595 -486 -302 94 784 478 -447 -516 2 133 503 253 -614 -610 182 -26 381 556 -741 -792 699
2455 699 101 59 527 -528 -932 561 743 -153 125 -192 -1032 -81 1223 21 -263 330 -1116 -798 1231
2474 1231 811 -368 -136 -653 -979 721 1428 106 -530 -97 -848 -142 1553 351 -1030 -162 80 -440
2492 -440 437 733 -375 -761 375 368 -503 333 146 -1011 335 947 -433 -305 416 -459 -417 1191 413
2511 413 -1369 -237 288 -1007 692 1276 -1186 -932 527 -479 -120 1659 -38 -1555 -171 426
2527 426 -626 1099 1273 -1615 -1151 939 -28 -74 1190 -410 -1348 415 731 -417 285 529 -886
2544 -886 -333 1109 -268 -817 514 54 -382 770 741 -1148 -665 796 72 -397 945 -299 -1519
2561 -1519 328 800 40 658 564 -1616 -853 993 594 -11 708 -131 -1834 277 1376 -207 -4 532
2579 532 -1200 -718 919 475 -421 424 -19 -1247 56 893 -717 -257 1114 -525 -1008 863 65
2596 65 -1067 683 1111 -972 -628 779 -764 -660 1720 32 -1363 630 -113 -1629 1160 1628 -1128
2613 -1128 -386 861 -1489 -664 2229 342 -1532 817 -163 -1686 1327 1411 -1383 22 738 -1559
2629 -1559 -368 1977 -62 -1034 1223 -82 -1660 708 1001 -1022 527 667 -1392 -728 1098 -77
2645 -77 -334 752 -441 -1157 384 840 -300 193 545 -842 -579 611 247 -271 140 334 -699 -401
2663 -401 746 -150 -350 979 82 -989 347 310 -754 493 1074 -598 -557 518 -611 -662 1374 630
2681 630 -971 192 -38 -1116 647 1340 -308 -481 -153 -805 -260 1607 597 -1130 -379 -149 -854
2698 -854 944 1382 -702 -816 -21 -288 -20 1001 177 -1083 -455 656 -94 140 674 -743 -714 707
2716 707 618 -461 185 -27 -899 -18 1504 -149 -774 264 -548 -466 1690 612 -1376 -293 38 -472
2734 -472 1258 1453 -1226 -1657 326 200 312 1755 -381 -2132 -69 737 164 1305 241 -1955 -838
2751 -838 855 496 703 482 -1325 -1190 833 835 220 265 -839 -1267 334 982 557 -33 -722 -1103 284
2770 284 1124 682 -146 -999 -1095 286 1242 941 -3 -1227 -1308 535 1423 626 -155 -1069 -1332 421 1553
2789 1553 645 -175 -1006 -1372 147 1673 786 -618 -840 -859 -149 1676 1201 -650 -877 -860 -111 1345
2807 1345 1319 -458 -1325 -920 -195 1217 1484 -135 -1534 -1119 100 1067 1627 -56 -1418 -1073 252
2824 252 1198 1326 -140 -1335 -1174 181 1430 1151 -272 -1355 -1151 -29 1259 1191 -148 -1476 -1007
2841 -1007 153 1220 1354 -147 -1718 -871 155 1046 1575 28 -1615 -1105 252 1090 1277 219 -1503
2858 -1503 -1540 -110 1080 1137 367 -1328 -1587 123 947 1219 286 -1374 -1505 197 1333 1070 48 -1010
2876 -1010 -1399 -68 1337 1014 2 -815 -1486 95 1452 894 -137 -778 -1168 -30 1021 1011 74
2893 74 -853 -1024 -200 1011 1001 -77 -738 -937 -415 1054 854 -148 -786 -1055 -244 1108 1068 -131 -886
2912 -886 -946 -229 825 1261 -46 -1061 -748 -92 850 1325 -169 -1296 -678 -179 459 1214 40 -891
2930 -891 -829 22 593 736 400 -539 -860 23 333 548 102 -461 -762 -8 549 629 293 -303 -459 -310 449
2951 449 736 -77 -378 -334 -197 472 586 -63 -411 -295 -1 184 466 265 -652 -386 455 142 -56 338
2971 338 -335 -626 196 259 -10 240 93 -465 -123 321 -117 -156 417 -285 -474 363 121 -248 209 275 -487
2992 -487 -245 268 -81 -185 532 -28 -504 -109 88 -228 386 379 -630 -79 270 -163 19 826 -83 -832
3012 -832 108 384 -261 140 255 -696 -253 657 210 -21 209 -517 -350 788 497 -417 -221 12 -686 477
3032 477 1094 -202 -907 -427 54 402 978 296 -1020 -880 99 491 886 545 -1036 -1285 68 940 509
3051 509 530 -280 -1470 -883 1226 1236 87 -295 -772 -1053 783 1472 7 -462 -673 -944 414 1797
3069 1797 304 -1370 -535 -209 -280 1580 919 -1506 -1174 471 511 769 678 -949 -1746 341 1256 503
3087 503 684 -716 -2252 -100 1956 834 149 -325 -1888 -1041 1491 2120 129 -1076 -1395 -1304 921
3104 921 2411 636 -977 -1331 -1385 482 2479 1391 -1361 -1677 -375 123 1236 1924 -739 -2388 -353
3121 -353 1150 978 905 -454 -1925 -501 1349 944 344 -54 -1762 -1301 1890 1844 -684 -708 -801 -1428 1033
3140 1033 2712 217 -1465 -1464 -907 803 2407 720 -1588 -1448 -562 101 2398 1683 -1592 -2222 -606
3157 -606 947 1524 1225 -633 -2138 -1300 989 1863 982 -541 -1715 -1044 1083 1678 672 -451 -1277
3174 -1277 -1339 487 2323 525 -1497 -904 -300 103 1754 1262 -1239 -1852 -223 800 1395 1094 -1210
3191 -1210 -2105 -118 786 1173 1479 -424 -2949 -776 1795 1338 773 -137 -2054 -1669 1149 1709 671
3208 671 -337 -1690 -1476 1308 1771 264 -383 -875 -1405 123 2201 1019 -1177 -1143 -491 397 1041 1000
3226 1000 -559 -1312 -774 427 1486 1009 -637 -1504 -394 666 918 649 22 -1651 -1256 984 1580
3243 1580 210 -613 -983 -1050 333 1573 804 -473 -1304 -1140 360 1709 567 -1003 -570 -645 -212 1174
3261 1174 1222 -475 -1284 -296 343 790 589 -76 -798 -470 77 647 1026 -126 -1260 -253 526 285 381
3280 381 -42 -481 -712 -30 1173 436 -697 -816 -155 182 403 542 -12 -765 -538 334 579 332 -569
3299 -569 -586 112 149 53 525 271 -727 -685 550 357 -197 99 34 -193 125 73 143 280 -313 -574 486 279
3321 279 -320 136 337 -286 -507 541 490 -315 -240 -27 27 50 -85 -5 377 -185 -355 223 86 -454 -147
3342 -147 430 98 -288 -82 302 5 -116 -75 12 -67 -320 286 572 -176 -632 -100 158 396 -46 -36 -60 -454
3364 -454 -156 536 595 -251 -746 -85 341 138 213 226 -224 -716 -85 648 500 -324 -768 -251 134 180 475
3385 475 145 -685 -1003 34 1027 382 -318 -536 -493 -77 352 891 160 -1093 -926 352 956 520 -257
3404 -257 -611 -374 -150 863 937 -340 -1189 -738 521 961 369 -41 -742 -1084 -178 1035 1053 -230 -1173
3423 -1173 -789 356 873 685 108 -835 -1167 -211 1290 1177 -438 -1093 -745 20 876 713 191 -826
3441 -826 -1193 -50 1519 1115 -348 -1178 -681 284 754 1399 179 -1411 -1192 281 1192 1086 -304 -1045
3459 -1045 -723 95 839 1000 228 -1112 -1391 305 1496 653 -232 -681 -1127 -237 1211 1157 -80 -1314
3477 -1314 -976 10 1216 1180 -153 -1057 -1015 -336 1176 1556 -313 -1538 -842 237 859 991 238 -1032
3495 -1032 -1407 159 1257 1221 -239 -1354 -1096 284 1045 915 132 -928 -1404 -163 1504 1107 -336
3512 -336 -918 -719 -367 957 1405 112 -1240 -1021 -210 994 1403 54 -1068 -694 138 356 1250 581
3530 581 -1513 -1153 460 818 585 196 -820 -1185 8 1066 687 -44 -889 -1263 275 1454 583 -117
3548 -117 -608 -1058 -362 1233 1322 -459 -1160 -414 -18 574 1239 177 -1080 -782 -1 876 978 151 -866
3567 -866 -1028 312 479 483 533 -599 -1465 50 1089 272 -169 -386 -838 -325 1091 764 -378 -227 -695
3586 -695 -405 996 817 -723 -409 198 -371 405 1153 -64 -1165 -98 224 237 668 110 -958 -557
3604 -557 380 171 567 550 -1022 -692 564 608 275 390 63 -921 -146 811 489 -181 -205 -512 -302 330
3624 330 371 -263 -338 -264 -297 145 625 -226 -547 270 201 -351 544 176 -608 -252 628 141 -185 392 -287 -582
3646 -582 469 325 -279 160 18 -609 233 706 -182 -336 249 -323 -465 588 501 -434 32 27 -382 313
3666 313 515 -155 -133 201 -81 -125 299 133 -389 -13 293 -415 -148 233 -108 -143 306 -168 -423 75 249
3687 249 -75 90 80 -447 -360 494 279 -164 323 58 -563 164 568 -113 -311 266 -150 -244 493 49 -627
3708 -627 201 188 -495 384 331 -621 24 241 -146 -55 364 -205 -576 278 415 -54 53 -42 -567 -5 513
3729 513 149 48 -184 -466 -140 451 451 -124 -123 -288 -317 385 505 -20 -442 -374 -77 144 505 104 -315 -438
3751 -438 196 220 251 271 -290 -639 10 331 284 123 -168 -460 -248 532 419 -110 -61 -384 -324 457 490 -2
3773 -2 -433 -270 -359 362 488 -40 -620 -335 147 275 542 53 -718 -481 91 344 423 172 -518 -551 26 422
3795 422 224 -41 -354 -670 -257 413 383 139 -244 -481 -214 485 536 -180 -384 -285 -157 284 522 34 -559
3816 -559 -292 -72 425 566 -66 -385 -562 74 371 547 110 -614 -618 268 575 291 47 -397 -422 5 418
3837 418 398 116 -486 -485 77 707 402 -82 -269 -336 5 608 535 -139 -390 -388 38 542 513 -45 -553 -409 190
3860 190 444 418 -82 -299 -394 -36 453 495 -45 -387 -198 -41 538 139 -169 -539 -230 -20 479 405 -62
3881 -62 -531 -196 46 554 387 -103 -479 -285 120 394 251 39 -282 -213 17 348 228 -7 -205 -459 65
3902 65 489 68 -140 -317 -335 133 349 312 -11 -438 -170 188 348 344 -206 -529 -272 366 438 311 -139 -302
3924 -302 -100 141 255 319 -50 -537 -288 284 374 324 -110 -357 -5 66 392 242 2 -349 -107 182 244 212
3946 212 -151 -317 -103 56 439 111 -130 -435 -257 44 382 212 -170 -469 -170 220 336 126 -199 -240
3966 -240 -91 244 178 75 -137 -378 -219 169 412 -111 -215 -83 -340 133 230 -164 -98 4 -238 -66 313
3987 313 40 -212 0 62 -135 233 296 -238 -295 32 -121 191 127 -296 -110 180 -131 89 313 3 -270
4008 -270 -69 195 15 -41 -69 -75 -97 164 260 35 -140 113 108 140 -13 52 -241 204 -10 -266 43 -62 -104 -47
4032 -47 223 72 -44 190 133 -63 192 180 -205 193 12 -189 61 347 -268 -76 238 -71 -47 104 55 -371
4054 -371 189 372 -192 13 65 -265 -61 348 75 -111 70 -70 -251 123 122 -335 -279 15 -102 164 295
4075 295 -131 -371 -100 196 214 52 95 -442 -142 264 247 -276 -133 -258 -275 186 443 29 -110 24 -188
4096 -188 -118 522 310 -315 -191 44 -96 390 358 -442 -409 275 66 191 444 -126 -626 -44 549 128 379
4117 379 -57 -663 -124 409 365 91 -110 -569 -301 522 458 -115 -374 -319 -307 324 644 28 -421 -405 -89 166
4139 166 457 409 -271 -561 0 390 255 385 -137 -456 -88 405 147 196 -90 -616 -391 619 498 -35
4159 -35 35 -365 -459 547 743 -206 -471 -152 -427 116 954 32 -542 -339 -33 69 844 194 -704 -440 155
4180 155 138 301 344 -491 -789 3 284 562 440 -90 -741 -168 569 536 74 -102 -570 -489 480 709 136
4201 136 -311 -448 -245 150 977 229 -542 -290 -463 263 694 148 -621 -531 129 312 542 507 -241 -956 106
4222 106 331 369 431 -172 -731 -59 492 507 299 -26 -486 -306 346 515 13 -335 -503 -480 445 858 70
4243 70 -278 -598 -322 353 687 196 -345 -513 -141 343 639 320 -281 -375 -123 404 476 309 -346 -487 -228
4264 -228 368 454 38 -124 -310 -314 305 515 -17 -389 -411 -126 233 688 182 -362 -283 -144 130 635 320 -495
4286 -495 -358 -210 213 515 385 -359 -610 -119 319 401 333 -260 -627 -190 251 313 284 -94 -298 -85 252
4307 252 373 104 -158 -144 -359 227 318 82 -149 -221 -59 77 363 112 -78 -264 10 69 233 148 -254 -282
4329 -282 -164 71 177 193 -138 -270 -72 -7 127 61 16 -264 -48 130 33 -157 -83 10 -47 223 275 88 -49
4352 -49 -102 125 -27 233 -13 -280 -41 -26 -36 65 -99 -89 281 149 105 -47 39 77 -36 46 150 -296 91
4375 91 135 55 17 -73 -66 -94 -28 34 74 -2 -12 -27 -130 168 62 58 -45 -280 -130 222 98 -9 -121 -266 -52
4400 -52 119 113 -110 -248 -286 153 162 215 -122 -325 75 57 236 216 -81 -313 -265 139 275 171 -28 -382 7
4423 7 157 497 217 -251 -358 -231 137 370 239 -179 -341 -201 72 278 343 -35 -403 -394 21 387 361 -111
4445 -111 -414 -398 123 370 237 -21 -357 -353 167 651 331 -238 -514 -295 227 524 345 -178 -633 -339 218
4466 218 541 486 -205 -438 -539 160 488 336 27 -575 -528 243 355 339 -30 -598 -455 127 680 379 -152
4487 -152 -467 -529 178 541 380 -131 -474 -563 90 928 228 -203 -292 -456 187 792 618 -300 -602 -445 -95
4508 -95 633 603 -384 -667 -161 15 594 631 -48 -723 -394 121 583 325 4 -448 -527 236 424 451 -38 -631
4530 -631 -600 39 660 424 -23 -412 -352 56 545 605 -200 -843 -402 13 516 570 -240 -772 -277 128 509
4551 509 541 97 -875 -463 248 467 405 189 -538 -716 48 580 229 151 -448 -672 150 567 256 9 -327
4572 -327 -643 -154 511 472 -103 -210 -539 -192 439 570 -149 -600 -372 -12 518 546 -124 -652 -416 -49 432
4593 432 374 100 -442 -229 339 572 72 -6 -408 -496 197 553 194 -155 -334 -340 39 674 478 -235 -297 -300 -99
4616 -99 454 551 -108 -455 -287 -49 308 328 78 -288 -284 40 269 369 19 -642 -377 305 232 230 99 -273 -359
4639 -359 252 530 215 -82 -82 -229 -41 352 160 -198 -229 -149 -144 336 473 -99 -173 -153 -100 -199 412 -238 -565
4662 -565 -76 112 -107 170 217 -255 -143 65 59 205 269 -235 -516 137 393 -261 -66 -19 -313 55 262 -85
4684 -85 -169 140 -50 -77 283 170 -239 128 104 -170 66 168 -234 -191 231 20 -12 -37 104 -213 -29 200
4706 200 75 -122 15 98 -133 69 29 -46 -53 274 -38 35 202 -136 -9 197 78 -220 22 -56 -137 -38 236
4729 236 67 -95 -29 -361 29 399 115 -321 -43 -122 -13 132 293 -229 -311 -7 227 74 164 46 -345
4750 -345 88 274 125 116 141 -232 -33 232 141 -104 -118 -151 -254 43 327 139 -202 -166 -140 -27 296 185 -126
4773 -126 -262 -12 69 312 388 -422 -338 -67 146 256 159 -59 -532 -20 304 264 185 -118 -228 -217 230 338
4795 338 167 1 -548 -243 218 421 77 -61 -318 -251 -48 391 134 -236 -513 0 49 274 33 -292 -396
4816 -396 -184 76 439 411 -171 -475 -171 313 166 173 -26 -341 -344 323 574 289 -130 -391 -62 252 386 195
4838 195 -252 -438 -295 124 583 62 -404 -261 -227 47 181 92 -137 -489 -238 161 488 149 -247 -159 -288
4859 -288 -61 498 275 -359 -351 -436 125 304 55 -102 -160 -282 -45 443 310 -71 -333 -138 374 356 414 -122
4881 -122 -142 -475 -73 353 282 -193 -486 -40 82 327 239 22 -320 -407 151 341 248 -62 -156 25 -49 262
4903 262 191 31 -388 -402 241 272 106 -160 -413 -74 4 303 351 -85 -357 -138 234 498 97 -70 -57 -125
4925 -125 189 331 195 -205 -497 -127 205 153 44 40 -169 -143 11 325 236 -154 -236 -191 238 170 31 254 -181
4948 -181 -361 58 334 147 -150 -212 95 10 233 287 -141 -283 -59 70 298 248 -176 -14 17 34 78 214
4970 214 -32 -275 -177 262 203 -134 -46 -199 -118 27 42 271 121 -59 -5 255 13 26 -124 39 27 -118 154
4993 154 80 0 -185 -162 -97 71 23 11 -12 -1 -96 101 100 -153 -332 11 228 84 107 -15 35 -127 -96 273 -157
5018 -157 -145 61 -55 7 106 -39 66 18 -67 -16 77 -123 -277 64 48 -86 -92 41 -51 -165 93 -161 -12 -112
5042 -112 -75 46 219 -76 2 85 -144 -34 -11 55 115 -303 -11 205 -21 -19 97 -138 -222 10 149 31 24 5
5066 5 -101 19 -38 -156 -58 137 -263 -289 156 -52 -314 -134 191 -31 -32 165 -43 -183 -90 67 -7 171 -158
5089 -158 -113 16 190 -40 91 190 -117 -203 252 108 -43 14 -151 -26 154 142 159 27 -212 16 132 173
5111 173 127 -192 -6 -71 -148 138 175 -4 -291 67 225 -115 92 -175 -41 124 146 -6 135 121 -286 -98
5133 -98 234 10 -32 215 -38 -126 240 399 -4 -119 -5 -302 27 246 -57 -12 -125 -396 33 202 143 -111
5155 -111 -209 55 -75 -74 385 -83 -293 -14 59 122 -13 8 -38 11 125 44 144 43 -254 -194 118 53 -34 -34 174
5180 174 -149 -59 99 133 -79 -251 14 -138 276 158 -265 -263 -124 -173 -6 225 -104 -254 -138 48 66 94
5202 94 176 -201 -212 134 137 -27 89 -239 28 -112 13 -93 78 145 -332 88 96 126 -99 142 -121 -157 53
5225 53 101 -200 -22 -81 -207 -36 -102 -104 -114 -97 16 -44 149 44 -229 -82 -1 -15 9 120 -99 -238 -32 411
5249 411 -44 -89 -118 -167 148 112 -64 41 38 -57 -89 30 110 -236 49 -24 25 -10 71 -99 -141 -43 45 -63 -106 40
5275 40 16 -35 -13 119 77 21 -99 -55 -20 -35 59 44 -38 -15 13 -8 -164 -131 93 44 -208 188 23 -44 21 22 -119
5302 -119 -7 -16 113 -50 176 -23 -312 75 84 58 33 85 18 -47 79 138 78 -4 163 -127 -24 -55 -86 -73 129
5327 129 -230 -124 -83 46 75 -49 232 -67 41 -47 180 -75 -25 -22 -31 73 -203 -77 32 72 0 71 65 -6 -36
5352 -36 26 94 -73 44 -111 -114 -21 -40 -154 209 -80 73 -65 192 -40 -67 14 -10 -126 40 135 -16 -4 87
5376 87 -87 60 74 74 -123 -67 83 -69 77 29 125 -8 -57 -42 129 -143 71 -42 -54 241 -124 37 7 -71
5400 -71 -122 -7 -27 -8 35 -47 57 80 73 -4 43 -34 9 26 0 30 143 18 -1 -119 39 -71 17 -67 212 -1
5426 -1 25 118 -123 -70 -17 15 -13 220 -39 -93 105 -30 77 157 -63 136 109 103 221 -8 -50 12 52 137 54 213
5452 213 -144 -70 57 201 78 -11 34 -63 27 -34 -54 79 100 7 -81 -46 -50 93 -44 49 42 -19 -19 -55 28 -40 -109 177
5480 177 155 3 123 148 -103 -95 24 -61 73 -86 -50 11 -15 8 156 54 6 143 2 -87 87 -114 -86 117
5504 117 -125 0 -110 75 -41 63 -213 18 71 -15 95 -115 85 -62 62 68 -71 -40 91 -55 26 -24
5526 -24 47 16 -94 236 -155 48 183 18 -63 -7 74 -17 118 162 28 23 -36 155 7 62 -59 49 189 71
5550 71 -68 95 -64 -44 107 22 51 -213 -21 -2 96 127 96 -102 -11 -95 -102 113 20 -92 -43 9 5 -50 58 -3
5576 -3 53 47 69 51 71 35 -218 -153 50 93 107 -6 60 -74 169 254 -188 104 -111 -126 127 147 -108 18 -110
5601 -110 -28 -9 -18 -55 -66 141 -20 -73 -99 158 -10 -167 0 -11 1 60 -63 -139 -6 -49 40 -100 -22 -120 -250
5626 -250 116 51 28 79 -59 -62 36 131 59 -60 -1 -64 0 200 116 -13 3 -84 -48 -7 6 14 -91 56 52 26 -6 28
5654 28 56 -122 75 8 23 184 -23 -53 20 -2 5 9 70 -48 136 124 7 -58 113 -21 27 61 186 -94 -142 9
5680 9 -65 98 44 -62 -35 96 -24 8 225 49 -122 -93 42 -21 41 -72 -237 -60 156 51 -84 6 -22 -218
5704 -218 -26 -82 74 -71 12 93 26 128 66 7 -29 100 98 2 78 45 -142 60 50 -60 14 -16 21 89 180 43
5730 43 42 67 -124 -84 74 103 -10 -40 9 -112 33 -2 -65 -114 -160 61 -66 135 -13 -9 109 60 -182 -40 -32 -92
5756 -92 -10 122 51 -19 98 -11 -32 102 78 -117 -190 -13 -16 -82 11 -33 -65 40 89 74 -208 82 -161 -41 -84
5781 -84 -40 2 46 36 -69 -21 115 -140 121 24 -140 -23 184 85 -66 16 -45 -113 -35 -116 4 7 -37 19 -31 72
5807 72 -82 -54 32 -55 97 78 -100 -24 -83 117 260 -38 48 -94 -58 12 8 -35 -30 -126 -155 100 54 142 100 -139 -119
5834 -119 89 72 202 -123 -86 -91 -49 18 119 22 -38 -88 94 30 119 -11 -165 -116 -77 189 81 82 6 -247 -99
5859 -99 0 121 -136 -76 -148 -160 221 37 39 -54 -238 -119 -49 59 -11 -214 -271 -71 33 136 -36 -79 -336 -47
5883 -47 78 77 -41 -104 -70 69 198 133 -21 -177 -112 -126 131 -1 194 -129 -226 -5 15 193 -63 -18 -204 267
5907 267 -99 235 106 -57 -271 -35 -63 60 -64 -343 -169 -133 251 51 128 -41 -208 -95 96 159 -50
5928 -50 -130 -199 58 150 196 23 -173 -154 119 116 182 15 -92 -64 -126 243 74 99 -54 -74 -166 54 118 18 34
5953 34 -138 -20 -15 18 41 44 -372 -48 -35 127 171 6 -169 -101 38 56 -63 48 -74 -35 96 212 117 -42
5977 -42 -16 -155 -104 65 41 -100 65 -24 49 47 -20 -158 -113 -55 38 101 65 -324 -145 -116 56 8 -96 29 -237
6002 -237 -279 155 78 76 -80 -84 -54 17 117 -66 -57 -79 9 94 107 -23 -78 -99 -25 -11 148 -61 -105 -23 -158 -56 12
6029 12 -44 -86 90 113 -60 -69 122 -59 -227 -74 -87 238 54 112 -234 -32 87 28 -55 27 -115 -26 30 -32 5
6054 5 -118 -48 70 137 88 66 -87 -154 58 -99 -97 -13 -60 -54 -4 -23 21 -24 -20 -208 129 39 -2 29 -83 -85 161 118
6082 118 -78 -70 -17 -164 -84 -53 -24 -68 68 28 20 201 -104 -1 110 -18 185 -78 32 9 110 160 205 6
6106 6 31 5 17 -69 64 -55 -99 -224 72 -177 131 -47 -136 -43 -11 204 -46 30 -114 -155 122 57 66 -19 -58 -173
6132 -173 34 7 75 43 87 126 -127 62 195 -45 -145 -130 -145 72 99 -89 -119 -180 -54 19 -52 53 -11 34 -4
6157 -4 -29 58 97 -50 -109 -34 156 40 74 -155 -150 -119 203 68 72 -127 -180 -67 284 97 16 -88 -59 -46 65 -32
6183 -32 65 -271 -76 -63 -18 323 222 -185 -108 111 165 185 26 -129 -134 52 97 25 -19 -231 -195 105 104 24 98 -213
6209 -213 -221 34 172 58 38 -137 -56 -181 207 3 -19 -39 -150 130 87 272 100 -114 -165 -53 26 98 121 -270
6233 -270 -249 -71 94 150 -50 -194 -392 208 108 256 104 -70 -229 -180 200 183 141 -247 -160 -44 79 179
6255 179 45 -161 -325 -35 27 193 -18 -218 -89 -22 351 66 32 -171 -117 -110 202 186 161 -114 -226 32 127
6278 127 132 62 55 -301 119 164 193 -31 -127 2 -45 28 151 22 -37 -5 -184 111 119 31 -163 -160 92 -17 308 161
6304 161 -106 -231 -118 -126 62 76 -23 -143 -98 296 298 187 -10 -90 -171 -173 -4 -84 4 -138 -151 132 51 128 70 -166
6330 -166 -22 -121 191 -36 -252 -48 -88 62 342 81 -85 -37 -111 -200 118 12 -157 -213 45 134 21 116 -64
6353 -64 -231 -110 -71 173 120 -68 66 -100 -35 59 -49 120 10 -65 2 88 91 27 -198 51 -133 28 150 -14
6377 -14 -124 -121 -67 48 139 49 -34 -28 -61 25 158 -17 -39 63 -14 37 12 11 -100 75 -4 67 -50 152 -21 -7 137
6404 137 -28 69 66 -21 69 -62 39 54 43 -168 100 119 -241 -147 73 -34 11 -52 -70 -110 23 -49 43 -17 -16 -105
6430 -105 93 173 28 -27 134 -97 -92 91 -105 -84 -164 94 65 277 16 -46 -54 -55 -41 -86 113 22 -109 113 54
6455 54 42 90 -18 -6 -83 29 157 -96 -41 -148 -124 -37 -27 -15 60 102 -175 0 -2 35 111 -17 -96 90 -74 180
6481 180 -109 -100 204 14 118 95 -11 -116 -108 34 117 -47 -69 -219 -193 44 314 3 63 -55 -168 23 258
6504 258 156 129 -80 -176 95 -47 138 -98 -59 -284 -145 278 24 24 -52 -49 5 163 -17 35 -104 -118 71 -7
6528 -7 75 -74 -305 -188 20 250 220 -33 -159 48 66 289 127 -33 3 -142 30 48 125 37 -196 -144 57
6551 57 84 5 9 31 -230 26 144 36 -137 -119 -185 13 169 113 -27 -209 -40 -108 -9 199 -32 -260 -353 -18
6575 -18 185 127 134 -91 -262 17 100 134 -69 -86 -39 87 78 203 53 -42 -156 -22 163 213 29 -322 -125 -121 20
6600 20 64 -58 12 -196 -47 166 76 73 -223 -119 -12 18 120 162 -46 -142 127 203 0 52 -113 -253 -81 203
6624 203 299 -37 -150 -242 -126 162 124 1 59 -129 -70 67 208 -23 -27 40 -83 -23 -58 163 -141 -123 -29 71
6648 71 81 -115 -235 -118 -146 133 16 199 -198 -193 -33 17 24 -74 -58 -59 -25 75 -18 142 -119 -186 -133 149 37
6673 37 -138 -76 21 -34 -84 184 81 -309 -54 -46 169 -31 64 -23 -206 -140 13 216 -13 -160 -215 -121 87 65
6697 65 96 16 -154 -173 144 63 4 -180 -79 -63 -4 62 100 48 -172 -300 183 133 -86 -142 51 32 14 -111 202
6722 202 -45 -125 56 157 197 -162 62 -44 -17 -180 -74 165 -179 -87 5 44 51 -52 -31 17 33 57 185 41
6746 41 -76 68 57 -106 55 -81 33 71 143 34 50 -101 -147 63 105 -100 -56 44 16 -73 16 -55 152 -44
6770 -44 92 103 -110 83 20 108 129 33 161 -64 -44 -21 43 178 107 -76 -137 -44 69 72 53 -88 -66 -101 -85 109
6796 109 159 -37 -204 -20 81 -45 -101 59 7 -56 -41 121 34 40 -56 82 11 -28 31 81 -57 -89 153 -27 25
6821 25 169 -52 -96 -131 179 -33 72 -52 -53 -29 129 -3 -87 -223 74 -79 -93 73 -66 -74 -4 219 4 91
6845 91 -84 -194 -141 246 197 -32 -13 10 -89 -55 53 190 48 -78 8 17 33 115 1 -161 -111 154 289 121
6869 121 -57 -38 101 115 252 -35 6 -9 -35 167 192 -10 104 -74 49 39 104 182 231 -115 -85 -128 114 46
6893 46 -136 -89 21 24 65 189 -88 44 -165 10 -19 -98 11 -245 -26 93 100 339 -58 -329 120 161 71 58
6917 58 39 4 55 85 116 -23 -130 -37 -37 117 -6 -113 -147 -117 16 228 43 -5 -6 -151 -35 49 223 79 -133
6942 -133 -133 135 -113 245 -16 -105 4 68 100 89 33 -136 -119 -138 147 219 74 5 -166 154 0 -1 19 -118 60
6967 60 32 -44 -139 -19 -86 -123 86 -95 87 227 -93 113 -90 -170 81 135 175 -172 -209 78 -50 -71 -37 -38 118
6992 118 30 25 -26 -63 -15 48 129 87 -46 78 -41 -80 -35 115 31 -67 -39 80 -26 -25 11 -46 22 -86 57 112 -35
7019 -35 94 -57 1 2 24 -32 -19 -66 21 45 159 93 48 -75 -104 129 -84 36 24 130 12 -122 34 -38 -32 -63
7045 -63 25 22 62 -69 2 53 132 19 12 -113 14 30 17 50 -88 19 72 70 -87 -57 -103 -58 -72 -61 69 14 60 78
7073 78 -114 -65 -31 22 -179 100 -131 66 14 -89 -134 -4 -171 -55 10 218 78 126 -38 24 12 -112 39
7096 39 67 -6 113 -13 114 58 -178 183 155 -141 11 68 -101 9 39 -17 -78 169 21 -105 2 -4 -31 135
7120 135 -20 99 -104 47 18 172 -93 -88 -117 43 -117 -35 54 -23 60 30 -44 -18 59 -80 -65 -123 -64 83 -19
7145 -19 -112 -125 72 -76 -111 92 -31 28 45 -85 -2 -56 51 32 -7 -39 -237 -34 -26 103 -105 6 -195 -29
7169 -29 5 -182 -53 137 -46 -32 -66 103 112 -19 104 36 -50 29 54 21 45 -194 -71 1 -19 35 -36 44 63 98
7195 98 -175 -173 65 35 169 158 -12 34 -141 184 22 -46 -131 -230 -97 5 155 -81 -104 52 -46 -222 124 45
7219 45 -42 -137 -29 188 -19 89 9 -93 -98 120 67 41 -122 57 -161 15 75 52 -131 -89 14 -66 -65 45 121
7244 121 -57 -69 -90 104 47 -95 -164 43 -57 145 182 -124 -384 7 107 163 108 -31 -194 12 -7 102 -19
7267 -19 -20 -129 125 170 122 210 -24 -67 -205 85 42 42 69 -21 -302 20 71 128 114 6 -121 53 29 -46 -126 -174
7293 -174 -1 -184 173 -31 -30 48 193 51 29 141 -101 -151 -86 -22 63 137 -45 140 -63 11 147 28 -194
7316 -194 -225 -148 34 116 -68 -110 19 38 14 37 70 39 -79 -36 8 117 148 14 -88 -173 -33 123 15 -78 54
7341 54 57 11 162 14 75 -55 -138 -103 -40 24 -32 -61 -45 -8 247 76 -33 -125 -79 45 147 147 -13 -116 -141 -14
7367 -14 61 103 -13 76 -83 28 6 -36 -31 -49 -114 128 -14 -45 -66 -135 -209 -5 122 35 -8 -55 -46 -91 208 -89 112
7394 112 -120 -58 -14 -2 -61 14 -61 -210 15 -70 109 -51 -295 -26 -29 -25 200 -240 -47 114 39 24 -78 52
7418 52 -161 -54 -70 -135 -74 -35 -66 39 76 47 179 -130 -2 -104 22 -68 119 -2 13 -76 52 27 114 50 0
7443 0 18 -34 -31 -79 -55 51 44 -58 -21 -131 -64 -41 -70 68 52 -189 -124 -167 13 96 -82 -108 30 -75 15 -15 115
7470 115 51 -28 -3 36 -51 -38 3 39 -181 90 30 -60 41 57 -13 -128 -96 -57 31 -19 73 168 97 -93 -3 131 -33
7497 -33 48 -18 -137 18 -72 34 39 74 -39 -82 -50 10 53 35 34 -150 -164 183 131 -23 -30 99 254 77 96 20 -66
7524 -66 -89 1 55 0 25 -56 -89 113 225 75 96 -115 -122 -110 -107 81 -103 -60 -234 -24 97 186 -73 48 -39 185
7550 185 -24 111 167 107 -128 96 154 40 109 -45 -4 -32 -83 153 181 -116 -85 -274 143 81 12 -102 -131 -83
7574 -83 -7 98 -93 -74 -109 99 157 45 -7 -155 -115 -41 20 105 59 -35 -211 110 -40 121 63 -106 -80 117 79
7599 79 8 125 23 -139 -135 110 67 -50 46 -125 -190 70 110 145 -43 -69 -97 -38 318 -103 -60 -184 -46 149
7623 149 82 62 -161 -159 -141 58 227 66 -92 -286 -8 94 201 -74 -162 -87 35 38 -56 18 -116 -39 48 258
7647 258 197 43 -44 -136 -101 121 327 11 13 -182 -9 214 158 28 -140 -29 -74 106 142 129 -108 -143 -50 83
7671 83 14 -11 -112 -180 -175 85 213 74 -54 -173 -26 115 205 -74 -33 -72 98 99 150 72 -132 -114 -92 155 55
7696 55 171 7 96 -42 79 19 -46 15 -131 15 309 164 107 6 -280 -88 -5 22 -17 -67 -50 -142 133 126 7
7721 7 -63 -185 -15 -25 25 146 -136 -192 -88 41 73 -54 -55 29 138 7 136 25 -30 -32 -67 83 -34 103 -19
7746 -19 -150 -92 -18 -122 59 -74 -35 -102 249 95 14 -74 -70 -63 53 -19 67 -56 -55 -38 16 134 88 -24 4 79 125
7773 125 52 2 -22 6 61 179 -135 73 -47 -85 66 36 115 38 -152 -74 106 -133 92 78 107 -65 5 46 -72
7798 -72 -166 39 43 -94 210 -119 -81 -109 -84 -67 -110 -96 -131 131 7 56 -66 19 35 59 65 14 -9 26 -87 -246 80
7825 80 223 131 -49 72 -71 -106 2 80 85 30 -4 -52 82 -77 -130 -82 33 -62 176 -83 -6 33 23 128 1
7850 1 -47 -47 -140 -37 25 26 -132 -32 47 181 59 71 -90 -178 31 -107 179 33 27 -148 -97 137 92 172 -5 -157
7876 -157 71 58 23 38 -64 -232 18 -9 96 -9 -31 -73 -90 -60 2 97 -51 -320 8 -45 77 35 44 27 11
7901 11 11 -46 42 -175 -185 -161 136 -9 -61 170 -182 -95 -59 74 176 -75 3 5 4 145 -82 -146 -216 -136 29 19
7927 19 151 152 79 -122 -48 148 -159 152 -47 -86 -127 -37 115 9 -86 -58 -21 34 234 -86 -70 -90 127 185 136
7952 136 -8 -295 -123 13 105 -14 -139 -143 -102 86 54 63 -108 -13 -185 -53 176 4 30 -74 -29 -65 18 34
7976 34 51 -139 -205 -72 1 105 40 -75 -34 264 171 125 29 -73 -4 -25 37 117 50 -98 9 233 42 195 -80
8001 -80 -30 -181 63 -72 193 39 -211 -148 47 169 88 18 -125 -171 7 29 146 37 -114 -21 -93 65 64 -118
8025 -118 5 -100 79 -75 -6 30 -198 -129 -82 119 90 -58 -200 83 56 103 91 68 -100 21 -45 119 -156
8048 -156 -3 -201 -32 82 91 72 -12 -71 31 -30 166 20 144 -43 35 81 -112 134 -19 32 -34 -20 -103 141
8072 141 -160 -6 -71 -15 160 -1 -95 -162 8 207 86 176 108 56 7 188 124 -64 -32 -105 102 -19 -113 -22
8096 -22 74 -51 146 -9 30 5 -18 -95 -43 47 -60 77 107 -108 132 76 -53 128 -101 -10 -29 -15 -12 -48 68
8121 68 -8 81 11 87 -34 -53 -95 47 95 54 -30 -8 -146 -144 84 159 -77 -111 167 51 146 20 15 -46 95 0 34
8148 34 22 46 -20 62 56 -17 52 213 43 -19 28 27 138 -45 -18 19 0 186 -47 55 -82 161 126 102 -3 -16
8174 -16 -99 -38 -27 133 23 -39 -28 -16 -55 -45 -23 -31 -123 -24 -119 9 -84
8191h4
##END NTUPLES=NMR FID
##END=
