##TITLE=1H_3E1503
 DMSO-d6
 8 sc, 
 16.3.2023
##JCAMPDX= 6.0         $$ Bruker NMR JCAMP-DX V2.0
##DATA TYPE= NMR FID
##DATA CLASS= NTUPLES
##ORIGIN= UXNMR, Bruker Analytische Messtechnik GmbH
##OWNER= root
$$ XWIN-NMR		Version 3.5
$$ Thu Mar 16 13:52:26 2023 Russian Standard Time (UT+4h)  she@DPX200
##.OBSERVE FREQUENCY= 200.13135
##.OBSERVE NUCLEUS= ^1H
##.DELAY= (6, 6)
##.ACQUISITION MODE= SIMULTANEOUS
##.ACQUISITION SCHEME= undefined
##.AVERAGES= 8
##.DIGITISER RES= 18
##SPECTROMETER/DATA SYSTEM= spect
##.PULSE SEQUENCE= zg30
##.SOLVENT NAME= DMSO
##.SHIFT REFERENCE= (INTERNAL, DMSO, 0, 15.7039)
##AUDIT TRAIL= $$ (NUMBER, WHEN, WHO, WHERE, WHAT)
$$ ##TITLE= Audit trail, XWIN-NMR		Version 3.5
$$ ##JCAMPDX= 5.01
$$ ##ORIGIN= Bruker BioSpin GmbH
$$ ##OWNER= she
$$ F:/spectra/data/she/nmr/H-F/1/audita.txt
$$ ##AUDIT TRAIL=  $$ (NUMBER, WHEN, WHO, WHERE, WHAT)
(   1,<2023-03-16 13:51:17.06 +0400>,<she>,<DPX200>,
      <created by zg, POWCHK disabled, PULCHK disabled
       configuration hash MD5:
       00 E9 B6 7A A2 85 ED C7 34 08 36 98 17 FE 4E 26
       data hash MD5: 16K
       AE 15 84 1E E3 D2 55 73 1C 17 09 1D E2 5E 57 EA>)
$$ ##END=
$$ 
$$ hash MD5
$$ DD DB DC A0 99 B9 CE 73 4A AE 8C 51 C3 84 94 40
##$RELAX= 
##$RELAX= 
##$RELAX= 
##$RELAX= 
##$RELAX= 
##$RELAX= 
$$ Bruker specific parameters
$$ --------------------------
##$DU= <F:/spectra>
##$EXPNO= 1
##$NAME= <H-F>
##$PROCNO= 1
##$TYPE= <nmr>
##$USER= <she>
##$AMP= (0..31)
100 100 100 100 100 100 100 100 100 100 100 100 100 100 100 100 100 100 
100 100 100 100 100 100 100 100 100 100 100 100 100 100 
##$AQSEQ= 0
##$AQ_mod= 1
##$AUNM= <au_zg>
##$AUTOPOS= <>
##$BF1= 200.13
##$BF2= 200.13
##$BF3= 200.13
##$BF4= 200.13
##$BF5= 200.13
##$BF6= 200.13
##$BF7= 200.13
##$BF8= 200.13
##$BYTORDA= 1
##$CFDGTYP= 0
##$CFRGTYP= 5
##$CHEMSTR= <none>
##$CNST= (0..31)
1 1 145 1 1 1 1 1 1 1 1 1 1 1 1 1 1 1 1 1 1 1 1 1 1 1 1 1 1 1 1 1 
##$CPDPRG= <>
##$CPDPRG1= <>
##$CPDPRG2= <>
##$CPDPRG3= <>
##$CPDPRG4= <mlev>
##$CPDPRG5= <mlev>
##$CPDPRG6= <mlev>
##$CPDPRG7= <mlev>
##$CPDPRG8= <mlev>
##$CPDPRGB= <>
##$CPDPRGT= <>
##$D= (0..31)
0 1.2 0 0 0 0 0 0 0 0.06 0 0.03 0 0 0 0 0.0002 0 0 0 0 0 0 0 0 0 0 0 0 
0 0 0 
##$DATE= 1678960276
##$DBL= (0..7)
120 120 120 120 120 120 120 120 
##$DBP= (0..7)
150 150 150 150 150 150 150 150 
##$DBP07= 0
##$DBPNAM0= <>
##$DBPNAM1= <>
##$DBPNAM2= <>
##$DBPNAM3= <>
##$DBPNAM4= <>
##$DBPNAM5= <>
##$DBPNAM6= <>
##$DBPNAM7= <>
##$DBPOAL= (0..7)
0.5 0.5 0.5 0.5 0.5 0.5 0.5 0.5 
##$DBPOFFS= (0..7)
0 0 0 0 0 0 0 0 
##$DE= 6
##$DECBNUC= <off>
##$DECIM= 32
##$DECNUC= <off>
##$DECSTAT= 4
##$DIGMOD= 1
##$DIGTYP= 9
##$DL= (0..7)
0 120 120 120 120 120 120 120 
##$DP= (0..7)
150 150 150 150 150 150 150 150 
##$DP07= 0
##$DPNAME0= <>
##$DPNAME1= <>
##$DPNAME2= <>
##$DPNAME3= <>
##$DPNAME4= <>
##$DPNAME5= <>
##$DPNAME6= <>
##$DPNAME7= <>
##$DPOAL= (0..7)
0.5 0.5 0.5 0.5 0.5 0.5 0.5 0.5 
##$DPOFFS= (0..7)
0 0 0 0 0 0 0 0 
##$DQDMODE= 0
##$DR= 18
##$DS= 0
##$DSLIST= <SSSSSSSSSSSSSSS>
$$ [...]
##$SUBNAM2= <"">
##$SUBNAM3= <"">
##$SUBNAM4= <"">
##$SUBNAM5= <"">
##$SUBNAM6= <"">
##$SUBNAM7= <"">
##$SUBNAM8= <"">
##$SUBNAM9= <"">
##$SW= 18.05172834244
##$SWIBOX= (0..15)
0 0 2 0 0 0 0 0 0 0 0 0 0 0 0 0 
##$SW_h= 3612.71676300578
##$TD= 16384
##$TD0= 1
##$TE= 0
##$TE2= 300
##$TE3= 300
##$TEG= 300
##$TL= (0..7)
0 120 120 120 120 120 120 120 
##$TP= (0..7)
150 150 150 150 150 150 150 150 
##$TP07= 0
##$TPNAME0= <>
##$TPNAME1= <>
##$TPNAME2= <>
##$TPNAME3= <>
##$TPNAME4= <>
##$TPNAME5= <>
##$TPNAME6= <>
##$TPNAME7= <>
##$TPOAL= (0..7)
0.5 0.5 0.5 0.5 0.5 0.5 0.5 0.5 
##$TPOFFS= (0..7)
0 0 0 0 0 0 0 0 
##$TUNHIN= 0
##$TUNHOUT= 0
##$TUNXOUT= 0
##$USERA1= <user>
##$USERA2= <user>
##$USERA3= <user>
##$USERA4= <user>
##$USERA5= <user>
##$V9= 5
##$VALIST= <valist>
##$VCLIST= <CCCCCCCCCCCCCCC>
##$VD= 0
##$VDLIST= <DDDDDDDDDDDDDDD>
##$VPLIST= <PPPPPPPPPPPPPPP>
##$VTLIST= <TTTTTTTTTTTTTTT>
##$WBST= 1024
##$WBSW= 4
##$XGAIN= (0..3)
0 0 0 0 
##$XL= 0
##$YL= 0
##$YMAX_a= 812642
##$YMIN_a= -944814
##$ZGOPTNS= <>
##$ZL1= 120
##$ZL2= 120
##$ZL3= 120
##$ZL4= 120
##$ABSF1= 10
##$ABSF2= 0
##$ABSG= 5
##$ABSL= 3
##$ALPHA= 0
##$AQORDER= 0
##$ASSFAC= 0
##$ASSFACI= 0
##$ASSFACX= 0
##$ASSWID= 0
##$AUNMP= <proc_1d>
##$AZFE= 0.1
##$AZFW= 0.1
##$BCFW= 1
##$BC_mod= 2
##$BYTORDP= 1
##$COROFFS= 0
##$CY= 11.3945322036743
##$DATMOD= 1
##$DC= 2
##$DFILT= <>
##$DTYPP= 0
##$F1P= 2.36226072786647
##$F2P= -0.459571619588291
##$FCOR= 0.5
##$FTSIZE= 0
##$FT_mod= 4
##$GAMMA= 1
##$GB= 0.15
##$INTBC= 1
##$INTSCL= 1
##$ISEN= 128
##$LB= 0.24
##$LEV0= 0
##$LPBIN= 0
##$MAXI= 10000
##$MC2= 0
##$MEAN= 0
##$ME_mod= 0
##$MI= 1.114404
##$NCOEF= 0
##$NC_proc= 0
##$NLEV= 6
##$NOISF1= 3.799351
##$NOISF2= 2.8
##$NSP= 1
##$NTH_PI= 0
##$NZP= 0
##$OFFSET= 15.70392
##$PC= 1
##$PHC0= -19104.32
##$PHC1= 5.800737
##$PH_mod= 1
##$PKNL= yes
##$PPARMOD= 0
##$PSCAL= 0
##$PSIGN= 0
##$REVERSE= no
##$SF= 200.130013532006
##$SI= 16384
##$SIGF1= 3
##$SIGF2= 2
##$SINO= 400
##$SIOLD= 16384
##$SREGLST= <1H.CDCl3>
##$SSB= 0
##$STSI= 0
##$STSR= 0
##$SW_p= 3612.71676300578
##$SYMM= 0
##$S_DEV= 0
##$TDeff= 0
##$TDoff= 0
##$TI= <>
##$TILT= no
##$TM1= 0
##$TM2= 0
##$TOPLEV= 0
##$USERP1= <user>
##$USERP2= <user>
##$USERP3= <user>
##$USERP4= <user>
##$USERP5= <user>
##$WDW= 1
##$XDIM= 8192
##$YMAX_p= 0
##$YMIN_p= 0
$$ End of Bruker specific parameters
$$ ---------------------------------
##NTUPLES= NMR FID
##VAR_NAME=  TIME,          FID/REAL,        FID/IMAG
##SYMBOL=    X,             R,               I
##VAR_TYPE=  INDEPENDENT,   DEPENDENT,       DEPENDENT
##VAR_FORM=  AFFN,          ASDF,            ASDF
##VAR_DIM=   8192,          8192,            8192
##UNITS=     SECONDS,       ARBITRARY UNITS, ARBITRARY UNITS
##FACTOR=    0.0002768,     1,               1
##FIRST=     0,             0,               0
##LAST=      2.2672688,     0,               0
##MIN=       0,             -944814,         0
##MAX=       2.2672688,     812642,          0
$$ Real data points
##PAGE= N=1
##DATA TABLE= (X++(R..R)), XYDATA
0@%%%%%%%Qj6J6j8K6m0N6o4Q0j04J20j50J90k24K64l18L79m45N20o06P02q12R37
30E01j074J226j394J580j788K018k269K545k848L180l546L946m380M856n377N943
46C119o561P239p980Q791r686J0669j1755J2964j4312J5826j7538J9492k1748
59a1480K4385k7514L1299l5988M1976m9932O1070p7886J06526j68036N24922m73029
71e3687o17061Q33567l73779K14492Q09110o51559q73288O13339J41886j11567
81f8547M92559k54372p36451L82820L22398j71886K16612o6267n08058K82990
91a08202L89803k26336o1888N9868k20270J28225K98165q7716k04959j28927q330
102a70567K73842J18991j56013r1396j88988r4904M13804J86965l00872n3746
$$ y = [0, 0, 0, 0, 0, 0, 0, 0, 8, -8, 8, -10, 16, -24, 32, -32, 48, -56, 64, -86, 104, -120, 144, -174, 205, -240, 280, -326, 376, -436, 501, -573, 653, -741, 839, -949, 1069, -1200, 1345, -1503, 1677, -1869, 2077, -2303, 2553, -2824, 3119, -3442, 3797, -4183, 4608, -5078, 5591, -6164, 6800, -7512, 8314, -9224, 10268, -11480, 12905, -14609, 16690, -19298, 22678, -27254, 33816, -44070, 62456, -105580, 419342, -53687, -670748, 162819, -210960, 3532, 812642, 161083, -712205, -98866, 43020, -68547, 424012, 169640, -566811, -183991, 138407, -33479, 183133, 116866, -391192, -108202, 281601, 55265, -6623, 53245, -167025, -38800, 259365, 171649, -33310, -162237, -170567, 103275, 222266, 66253, -25143, -214131, -309035, 104769, 291734, -9138, -62884]
112f2884m5863k18075L27952L63736k87774j55133N4045k19329J80855M34625
122C72155k39395k54686J72380j64638p8919M48327k6355m00746J16954P4165
132A9242j96180K32554J76492l45716o2839K40350p5948k5786J65258j46331j52339
143a71243K07545Q1958j13131M0639m9696j64425J68308K24236j60661j44754
153h1224M8425q0074L9423K87152n1571l10332J7575R1913l4655J97698J08412
164B32742l27028j39930K11707N8235L5057J01091j94483j88657J74097J23135
174H5966k9770M2284r8135j66009J18286J51664m5684l6390n0113q1118R0454
185a8565J17508n0963p2632l2685j40Q5659M5814n0071l8698n4144r5J39079K8970
$$ y = [-62884, -108747, -326822, 1130, 364866, 77092, -78041, -23996, -243325, -62470, 372155, 132760, -121926, 50454, -114184, -193103, 255224, 228869, -171877, -54923, 19242, -176938, 55616, 232108, -113608, -176447, 63903, -12045, -37831, 127427, -18904, -171243, 36302, 118260, 5129, 45768, -3928, -168353, -45, 224191, 63530, -81224, -32799, -112873, -73450, 213702, 162131, -148201, -130626, -38713, -73368, 124330, 232742, -94286, -234216, -22509, 35726, 70783, 171874, -22609, -211266, -37169, 85966, 56196, 98480, 345, -165664, -47378, 104286, 58602, 22212, -27901, -109019, -18565, 98943, 47980, -24652, -57337, -57477, 28182, 73996, 23925, -14773, -68917, -69012, 70067, 99037]
198I9037j20512j5682j244k8203J30523N1357j62503j4210P2475o3716O6270J10628
210A24220j47540o7845J21676m1485j6649J29590r2706j18461J41718J3184j08924
221f3222R9712J6653j34433P8461O9155j20782L8223Q3471j09514Q311J03206
232F9241q9846l5765J06457l8478m8272P3381l7569n4091Q9278L767p5166M0130
244C067J3087n0736M5607K8099n9066O014K2585k8370L1025K9346n8092j5013
256c2447L7455k452J1133J2635m6612j2800L7690P59O022J6133m5548k6599M3834
269g97J9129L50P433m5860l0072N5341K9266j8551L160k7052m0915M1776M6728
282C9936j7179j0403k3992m5709L7850O7887k0799l8498j0594k4613K2716O7240
$$ y = [99037, -21475, -37157, -38401, -66604, 63919, 115276, -47227, -61437, 11038, -52678, 13592, 124220, -23320, -91165, 30511, -10974, -27623, 101967, 9261, -109200, 32518, 45702, -63222, 36490, 53143, -81290, -2829, 66326, -54456, -16233, 67238, -42276, -33965, 69241, -20605, -56370, 50087, 11609, -36663, 36718, -851, -54942, 34336, 38103, -37063, 3067, 16154, -34582, 11025, 39124, -19942, -13928, 8657, -19713, 11312, 40658, -17434, -32447, 5008, 2556, 13689, 26324, -20288, -33088, 4602, 5361, 11383, 27516, -18032, -44631, -797, 18332, 18682, 26115, -19745, -49817, 5524, 34790, 16239, 19399, -7653, -48568, -6792, 39936, 22757, 12354, -11638, -57347, -19497, 48390, 27591, -10907, -21501, -46114, -23398, 43842]
294D3842o291m9726j3502r853J9262O8454N513o8887k8881J6034L0637M9467k664
307E3405p3101l4153L0144L7421L3660n915p1507m5455M0298O2120K8172k7682
319B7407p3172l3197N7324P2781J3151m3063o3890k2390N7227P5790Q965o0993
331A5940o9689j0807O5130P3359m984q0418o6663J4042P1650N6192j4396p7419
343b8063o0158K7484Q2643N0041k5121p9315n4600M5747R7474L2562n1436p4840
355c7582l6023N0285R1980J8462o7839p2489k3345N3010R0322J0172q4272p0292
367g7611M52O5170Q1014l831q8896n4323K1957O4827O8808r611r1235m8510L5224
380c6565O6340N7692k4403j03276l7763N7193N7481L6542k7346j06121l2478P9292
$$ y = [43842, 37551, -12175, -25677, -35530, -16268, 52186, 57699, -11188, -40069, -24035, 6602, 56069, 53405, -19696, -53849, -23705, 13716, 47376, 41461, -30046, -75501, -35203, 26917, 55089, 27407, -45765, -78962, -21638, 51143, 64294, 21231, -42659, -65049, -7822, 67968, 76933, 15940, -53749, -64556, 574, 73933, 68949, -11469, -78132, -64090, 7560, 63752, 49356, -28063, -88221, -60737, 21906, 71947, 46826, -32489, -87089, -41342, 56132, 88694, 37258, -37582, -73605, -23320, 68660, 87122, 19283, -53206, -76551, -23541, 66781, 76953, -7319, -77611, -77159, -11989, 69025, 65194, -23702, -78025, -56068, 8759, 77567, 67956, -23279, -71789, -36565, 29775, 87467, 63064, -40212, -77975, -20782, 36699, 73241, 45895, -60226, -92704, -13412]
392a3412N2764J5773j7695j02900m1579J06499O6676j8866k0303p7773m9688J12246
404A1742Q2413n2563l3373l9678n6220Q9148J04665o4737o8523p997l2121N9834
416g410J05551n9318r7192J3017J0363L2203Q3551l8073j08372Q530N0177K8554
428B1581M7712l0091j02716m702P6292M3925P217m3764p5677n508O8820N9938
440F3027j642o8740o1247J3781N7016N8134Q727q5111o7808M5703N9369K5210
452D6419J2957o6957p9608N3069P6695m593l869l5409p7193L9991R8516j5723
464D4295m4529j0870m0755J8016R3701k054p7715j4897Q845J0254O1009K0791
476F6091q1312n2505M1999M3856J6868J1840m7535p8240L1165R0658l43k6488
$$ y = [-13412, 39352, 55125, 37430, -65470, -107049, -550, 66126, 47260, 26957, -50816, -100504, 11742, 94155, 41592, 8219, -31459, -87679, 1469, 106134, 41397, -27126, -35123, -67244, -7410, 98141, 38823, -58369, -45352, -34989, -2786, 80765, 42692, -65680, -57150, -6973, 21581, 69293, 39202, -63514, -68216, 8076, 52001, 59218, 15454, -60223, -65731, 3089, 63027, 61385, -7355, -68602, -54821, 2195, 60329, 69056, -16055, -83863, -38160, 21209, 46419, 59376, -7581, -87189, -34120, 42575, 37982, 34113, -1296, -78489, -38498, 60018, 44295, -234, -11104, -51859, -33843, 59858, 57804, -19911, -34808, -25963, -15709, 45300, 66091, -15221, -67726, -25727, 18129, 34997, 46837, -698, -78938, -47773, 42885, 42542, 16054]
488A6054n882o7929j4357J17189K6115p5920N250j9594n5981R8492P1685j05507
500a0385j9126M5002o7679L3699J10929q5711p0829Q1902k6303l3606J01155l2535
512B6513j00621P4288L2374o2404N0845J0490q8114M3188O2858n0175M863J4880
524A8985o0532K4247O2915k7354j5733m879m0169K9706M6918k1605j358j6710
536e569n0333M6154M7018l9971J7101K666p8718M3516P4473o5763N363N0743q9836
549d3156K370J05275o5911l5050R3542o5293n6987J17365l1635q8451J05381o80
561C6770j05909Q7583K7436j17990O9955P1776j10858K3002P4627j00880N592
572c8896J07324o7103l7259P8460n2953m4523R4418q365o3773M8826k404n8961
$$ y = [16054, 10172, -57757, -72114, 45075, 71190, -4730, 520, -19074, -75055, 23437, 95122, -10385, -29511, 15491, -52188, -18489, 92440, 6729, -64100, 17802, -8501, -42107, 59048, 26513, -74108, 180, 32554, -29850, 20995, 31485, -56629, -13441, 49417, -758, 4105, 18985, -41547, -17300, 45615, 18261, 2528, -2351, -42520, -12814, 34104, 12499, 11141, -5569, -55902, -9748, 37270, -2701, 14400, 17066, -61652, -18136, 56337, -9426, -4063, 46680, -43156, -40786, 64489, -1422, -36472, 57070, -8223, -65210, 52155, 20520, -67931, 37450, 36770, -69139, 18444, 45880, -72110, -2155, 69621, -41237, -18235, 56392, -44488, -38896, 68428, 1325, -35934, 42526, -10427, -54950, 39468, 31103, -32670, 16156, 13752, -45209]
584d5209M5721L3393m4172P286J9302l4378j878L0300N28q334M12j753j0753r504
598a9039K3197K1340k4604o830J3825l0861P28N5623j4237l6908K7010j4815l3531
611c9102N7787K2136n8247J1400K0512m7651K4668N6365n0506k5745M8216k4598
623d765k6008N9035p357n8305L7499K6980m8846J4385L4469m7531j734N9188k5868
636A1142l9213L6492o575k9583N3289J4685o6255M515L2488k9398K3181M7516
648E2284n9443m1185N0489P56j2955N0046k1543p0637L2600L9979k2793K0231
660A7829J0666o1748J74N5473q646j0361J6289l4213j8158M7474R172k7277M370
673A044p014j6346K8036K0089k6091j6384O382N076J2643J1108j3074k4357k893
$$ y = [-45209, 512, 33905, -10267, -2981, 16321, -18057, -19935, 10365, 10893, 2559, 2971, 1218, -9535, -19039, 4158, 25498, 894, -5936, 7889, -22972, -22244, 33379, 19142, -17766, 9244, -5571, -39102, 18685, 40821, -17426, -6026, 14486, -33165, -8497, 47868, -2638, -28383, 19833, -4765, -30773, 28262, 20905, -37400, 99, 27079, -21767, -7382, 27087, -20444, -22178, 37010, 11142, -28071, 8421, 1846, -27737, 25552, 40237, -26018, -21503, 10985, -18413, 4768, 52284, -7159, -48344, 2145, 2901, -10054, 39992, 18449, -52188, -19588, 20391, -2402, 17829, 28495, -33253, -33079, 22394, 13748, 3387, 19676, -14537, -32695, 14779, 23951, -3326, 1044, -5970, -22316, 5720, 25809, -282, -16666, -10284, -5208, 7435, 18543, 5469, -18888, -21781]
686b1781K5668J8898r873j3132j1729j3488K3781L6276j7545l0144J880o649Q054
699i784M3229q049m7397M166J2804n457L3073R827n3912p874L5703n787O867K2493
713B9902m1123k6891M4822J2167j9399J4396j5254l4236L4332L2573k7664q011
725d386L658k3907J7539M1595k1061l0002Q691l800N378L5541q756m1016J138
738a9388J5223M210K0876q23l8726r103K4944J2475P158k821k8914j2350K4057
751c182K0138J921j0192k2978q174K1505K0037L09j4420k1733l280K1265J5906
764A7122j569j4555k0821k89K3989J1973o306j0716j6535j125K6590J1869j3928
777E699r109p718k243K2936J3832j9164j3122J246J73J5604J3744k0553j8539
$$ y = [-21781, 3887, 22785, 12912, -220, -11949, -25437, -1656, 34620, 17075, -13069, -11189, -17838, -9784, 33445, 25396, -22001, -17835, -5031, -10488, 22585, 32412, -21500, -29374, 6329, 542, 7409, 29902, -11221, -38112, 6710, 18877, -522, 13874, -1380, -35616, -1284, 31289, 3625, -4386, -728, -24635, -7096, 34499, 13438, -16564, -7873, -11673, -6295, 29246, 20490, -20526, -19388, -4165, 45, 20921, 20098, -18628, -27731, -2787, 9688, 16846, 14025, -14889, -27239, -3182, 16956, 18877, 8685, -14293, -22467, -962, 19075, 19384, 4964, -16769, -20049, 1216, 17122, 15553, 998, -19823, -20112, 3877, 15850, 9544, -1172, -17707, -18832, 7758, 19627, 5699, -3410, -11128, -13371, 9565, 23397, 4233, -8889, -7643, -7470, 8134, 21878, 1325, -17214]
790a7214P838O334Q754J0938j7067k1896J0121J4902M934O129j2712k1719Q886
803a1772K0475M355p46r589j8696M610K1829M930o326r266j4061K680J8872N150
817A2445q675q807q469K765J5772M952q560p873l679N163J2274K493q231o500
831d930o41O378R713j329r713n607J327P414P443m107j1266m032K612Q790P187
846I239o084j1147k386M480Q641P603n951j1256p72N232P081O677n460j1508k02
861e813N441M745M119m877r544M2M670L270L104m776p862L017M074R85L792m371
877A6p596O047N035k892L620j897r659O781Q176p024J164J760j1485M843J2180
892I069q704l154O422j0591J03J6134p248q586R973n732o821J6535p73j3888Q530
$$ y = [-17214, -9376, -3042, 5712, 16650, -417, -22313, -12192, 2710, 7644, 13773, 1061, -20658, -11772, 8703, 13058, 12312, 2723, -15973, -11363, 10466, 15396, 9070, -196, -14257, -11577, 7295, 12445, 3770, -5037, -13506, -10741, 5031, 9983, 1423, -6450, -10129, -4966, 7308, 9801, 1570, -4930, -5571, 807, 10520, 9191, -522, -6129, -4802, 2612, 10055, 5948, -5318, -9350, -6738, 2052, 9239, 3155, -7992, -10378, -5898, 2743, 10346, 4395, -6861, -7633, -2401, 4680, 11357, 5897, -5611, -5813, -372, 4373, 8492, 3615, -5929, -5887, -1217, 2053, 5157, 381, -7481, -4464, -390, 595, 4387, 16, -7580, -1533, 3502, 610, 4230, 2333, -7326, -545, 7631, 607, 1771, 3531, -7954, -3111, 9069, 365, -2789, 3633, -6958, -6855, 9279, 2031, -6555, 3418, -2314, -9135, 7400, 6627, -7261, 1269]
907A269J930j0585J0196O019j3269K327O621q566K867P704p867k036N292l649
921a747J67M388k983r62J260k109K375R74l196L718j64n674N314J531p166O445
937B171K421j0336N615N609j1184N198Q447j3943J832J2930j2558k189J5497j0932
951a422p246J7156o370j1832J5206r04j3450J2396L760j5397O320Q418j0455K549
965a271P888r241l278Q120m37k911L182m23n287l08O440J951n959J585K459r318
981f808M253J2252j0441n043J2815r633p719K0766n134j7334J7471J206k0725
994a4074J7583R354k5765J0763J6922k4754K918K1933k1562l896K6098j5185j3718
1007a3383K2863p614j5321K2843O96k1183J1371N773j5308J0290J1016j4937k481
$$ y = [1269, 3199, -7386, 2810, 8829, -4440, -2113, 4508, -4058, -1191, 6513, -1354, -3390, 1902, -1747, -1580, 2808, -175, -1137, 123, -1986, 389, 1363, -1833, 1885, 1721, -3953, 1361, 2892, -4274, 2171, 4592, -5744, -129, 5480, -5704, -506, 7941, -6002, -4170, 8760, -3798, -5987, 9510, -1422, -8668, 8488, 2118, -9714, 5492, 4588, -8862, 3534, 7294, -8103, -1783, 6635, -3820, -1271, 6617, -2624, -5902, 2218, 1781, -1130, 2052, 1629, -3658, -3966, 2474, 4425, -1534, 51, 2510, -6808, -2555, 9697, -744, -5787, 7028, -2605, -10324, 10442, 5308, -12026, 5445, 6651, -14074, 3509, 12863, -12902, -2139, 14783, -9971, -7053, 14880, -6682, -10578, 15520, 335, -13383, 9480, 1866, -13455, 9388, 10084, -11099, 272, 6045, -9263, 1027, 12043, -2894, -5375]
1020e375P575n284P80Q561k893o716j291L445K444k090L125K363j0901Q25J2677
1035G245q028m264J5265r528j2725J9840j737j8647J8568N664k4792J2695J3316
1048A2872k5646P150K2480k2956l970K3377j8745r532K8519q443j8361K1569l876
1061D438k1144K1537R381k3117Q500J1761k1378L199K1206j3097q911J4592o723
1074B44j1402J4276M541j2708L057O434r837r04J1619k279p412N946R25q794N424
1089h70Q897q314k311Q642p629n390J3662j172j1640Q545J684j3649Q613J0565
1103I633j4612n82J2510j1114m385J7046n277j3207J2985K435j3432J0071P988
1116A0059j6485J841J4023j0366m249J3998p831j1488J5055K789j4785P682O008
$$ y = [-5375, 2200, -3084, -2304, 6257, 3364, -3352, -4643, -1198, 1246, -844, 2281, 4644, -6257, -5432, 7245, -783, -5047, 10218, 690, -12035, 7805, 6068, -12579, 5989, 11653, -13139, -444, 12872, -12774, -5624, 16856, -6100, -10070, 13307, -5438, -14970, 13549, 5106, -13255, 8314, 4438, -16706, 4831, 14212, -8905, -405, 11356, -10022, -6823, 14383, 1286, -7625, 6967, 244, -11158, 3118, 7659, -5049, -1992, 4442, -5395, -6299, 5320, 3041, -4371, 1575, 2500, -6294, -870, 8027, -287, -2598, 6044, -1585, -6975, 6687, 5515, -6125, 2420, 4104, -9545, -932, 9633, -4979, -5561, 6949, -4165, -8550, 8496, 3219, -9988, 2997, 5432, -8000, 2071, 10059, -6426, -4585, 9438, -928, -5177, 8821, 990, -10498, 4557, 7346, -7439, 243, 6251]
1129F251j5731M505J5783j2250o665J3901o425r307J6587J451j6561P625P708
1142F872j3022N101J2102j3258m820J3052n426o284J1889l072j1771R008M571
1155D942j0223M558O470j1175K68J1931o196o603R558j107q712Q304N078j1109
1169d016R72Q856o586l104R581l946q513Q466K616q961M205M975r272J337R380
1184E990o843l653Q255l607n459R337k1r380N290M030p189L393N857q729k030
1199d759Q728l078l627O104k226p046N551M704n960O96L639n516p17P756j852
1214B397n303L788L19m793M573L714o727m38N002l751q87O436l621n365N960P36
1230B040n279M252K037o847K358N528n248o02N165m444k194O203j379m406L894
$$ y = [6251, -9480, -4975, 10808, -1442, -8107, 5794, -631, -9938, 6649, 8100, -8461, -836, 6872, -6150, -1049, 11053, -2205, -7025, 6027, 601, -5683, 6206, 3134, -8637, 371, 4942, -5281, -723, 5747, -5428, -5160, 6771, 575, -6028, 3530, 2423, -6289, 2015, 7093, -4016, -3044, 5812, -774, -3878, 5703, 1757, -6756, 1710, 4326, -4635, -430, 4545, -4727, -3390, 5990, -853, -4506, 3749, 142, -5317, 4020, 3999, -5381, -91, 3939, -3250, 143, 6000, -2729, -4759, 3969, 891, -2736, 3368, 1142, -5904, -353, 4351, -1609, -913, 2726, -2790, -3507, 4249, 2397, -2906, 882, 1201, -3592, 981, 4695, -2032, -2470, 2532, -1219, -2106, 4330, 709, -4656, 1304, 2040, -3239, 1013, 3050, -3797, -1439, 4089, -1159, -1761, 3404, -1040, -3234, 2969, 1590, -2816, 1078]
1245A078J49l904L321J565l823N70K522k431O6K450j877j218K225J75j562N45
1261a49R85q15m82J469n60j688J190J493j985l39K023j906o21L157j143k496K325
1278D58N9k232L005O55m079J302K360k544J263K178l775o56L594r61p11J975k673
1295g82j938L527P90j562O56j387j727K713J901j643o68j010p70K411J741j304
1311I48j548j253M21K593O72j015j295j970J056L406K90k124q75j462M78M334
1327B656L76l454j044m48M63M187O48m596j180Q09L87L928Q12n236j592K265J040
1344B1K746R21n456k136L401J521J741M13n176k460L923K516Q50n93m753k007
1360d528L976K850O77j237n049j332M962K605l26j062n305r99O117K762j938j407
$$ y = [1078, 1227, -2677, 644, 2209, -1614, -1044, 1478, -953, -887, 1563, -314, -1532, 693, 868, -694, -149, 836, 21, -461, 1008, 448, -1240, -50, 1443, -542, -881, 1142, -764, -1385, 1772, 629, -1867, 458, 517, -1715, 1290, 1945, -2134, -832, 1528, -1016, 247, 2425, -1350, -2006, 1588, 627, -84, 1891, -782, -2720, 807, 1597, 35, 691, -696, -2423, 290, 2191, 548, -120, -1130, -1900, 511, 2252, 948, -600, -1853, -1432, 1161, 1833, 818, -477, -2447, -1391, 2015, 2305, 181, -694, -2156, -1678, 2656, 3032, -422, -1466, -1914, -1451, 2736, 3384, -1212, -2392, -1583, -1196, 2732, 3544, -1692, -3284, -1019, 21, 2767, 3688, -1768, -3904, -503, 1018, 2759, 3172, -2004, -4464, -541, 1975, 2825, 2232, -2521, -4528, -552, 2298, 2975, 1738, -3311, -4643, 319, 2924, 2598, 1536, -3769, -4768, 1349, 4111, 2173, 766]
1376G66m136j410O897K741l373j401l542j227P339K824n319j942j231j331O973
1391B628L707o625l272J142n30N365M762p063n065K581J411L566L893n936o064
1406e500K550L309K850J902n491n253K309L848L118O41n993m232L675L651K401
1421C785J98o532l380N231L394J153j76o746l241P021L468j782M23o065m163Q500
1437A088M854m651o84k968n098P707P743o212l915K79l876N117R135n135p173
1452c789P59q1K827P423k739q641m90K973K683M167j608p108j695L772M455J549
1468D457k973m463j552L067N483O59n175l112R00J754M857J462p234l301M081
1483a090J664K159K609p115n368O499L868j316J520m139o868N645P605l018j751
$$ y = [766, -3370, -4780, 2117, 4858, 1485, 84, -3458, -4685, 2654, 5478, 159, -1783, -3014, -4345, 2628, 6335, -290, -3562, -2420, -2950, 2415, 7177, 114, -4951, -2370, -959, 2607, 6500, 564, -5500, -2950, 359, 3209, 5111, -380, -5633, -3324, 524, 3642, 4283, -1710, -5942, -2267, 1384, 3785, 3983, -2549, -5929, -698, 2696, 3849, 3673, -3073, -6314, 707, 4175, 2393, 2816, -3249, -7412, 1088, 5942, 1291, 607, -2361, -7459, 248, 7991, 1779, -2136, -1857, -5733, -616, 8519, 3384, -3789, -3030, -3111, -284, 7139, 4400, -4241, -4731, -1758, 925, 5092, 3484, -3624, -5319, -1547, 2908, 4457, 1484, -2979, -4531, -1464, 4019, 4678, -497, -3609, -2709, -955, 3902, 5364, -1870, -5171, -1090, 574, 2733, 5342, -1773, -7141, -642, 3226, 1910, 3430, -709, -7577, -1932, 5673, 2655, 904]
1498I04j408n533K664R555j659n783n11j873L17P654J717p203l090J910J358L486
1514B505K765m916n961K749M634N06P76j757o264R03P526K44l596K79k955k452
1530e014P653L020o754r22J298l095M430N954o796m378M447n25J16N979l355p511
1546e453L660L699k052K943K32p222M91O127p87j329J427l763k234N239K135l200
1562h7m99M97k242J539L936j720l369J119J120j141K041J133l939o47L984j277
1578D48j750K993j289l532L699K181m448O87K645l519O24M808l814k806M629r38
1594F18k994M537J22n524K729L158m286J009L905m623j387N048j770l243M535
1609A834n11m170L419J624m616K277K912m300ML823l182j057M670j637l440K936
$$ y = [904, -504, -6037, -3373, 6182, 4523, -1260, -1771, -3644, -3327, 4327, 6044, -1159, -4249, -2339, -981, 2505, 5270, 354, -5607, -2858, 1776, 2282, 3058, 1301, -4963, -4060, 3466, 3710, 114, 393, -2562, -5014, 2639, 5659, -1095, -2017, -719, -3814, 616, 6570, -226, -4604, -157, -682, -566, 5413, 2058, -5453, -1793, 1906, -146, 2797, 3029, -4193, -3702, 2425, 1638, 309, 1736, -2027, -4261, 978, 3113, -87, -586, -89, -2331, -792, 3144, 1424, -1945, -826, 294, -847, 1194, 2327, -1612, -2259, 1725, 448, -1302, 1691, 402, -3130, 569, 2750, -1698, -1011, 1634, -1885, -1261, 3547, -267, -3073, 1556, 618, -2376, 2161, 2283, -3241, -512, 2646, -1640, -631, 3274, -1349, -2736, 2312, 542, -2701, 1834, 1323, -2847, 572, 2196, -2420, -143, 2769, -1531, -1527, 2296, -886, -1943, 2727, 1090, -2350, 586]
1625E86J39k896L391J279m162J79K383j384N85J691k116j725J975Q01j83J22q63
1642a98j391R16K012M8j762n70O44N5P50J914k538k613K363J299j036K474j275
1659A092n282K454M516k023k61J481n266j07O710j007l215K411l444k244P004
1674B819J528o057P85M15l200N380L764o686j618L021j881K012M685m676m609
1689d318L367J478P3K929k860m966K289L551K69M02k071l810J498L802J467j137
1705A963k977k691J899L809J603j855l888j698L124K999N97r85m255k138M242
1720b51L471o39j657l204k437M551M698k229k903j547j433L163N135j840m635
1735a757q75N2K609M560j418n826r02K304J793K979n81n422j932L632K699J170
$$ y = [586, 725, -2171, 1220, 2499, -1663, -1484, 899, -485, 100, 1791, -325, -2050, -75, 726, 543, 665, -198, -1589, -673, 1339, 1387, -375, -945, -301, -246, 504, 2418, -120, -2733, -370, 929, -107, 2367, 1092, -4190, -1736, 2780, 757, 496, 1977, -3289, -3396, 3314, 2307, -908, 1503, -1941, -4185, 2819, 4347, -1710, -925, -510, -3710, 1670, 5434, -1252, -2870, 151, -1730, 282, 4967, 291, -4318, -951, 527, 600, 3529, 669, -4297, -2008, 1543, 1812, 2214, 143, -3667, -2169, 1633, 3100, 1963, -1014, -3705, -1806, 2003, 3606, 1751, -2137, -3835, -711, 2288, 2885, 1900, -2355, -4493, -251, 3220, 2581, 924, -2280, -4717, -166, 4532, 2303, -600, -2147, -3580, -417, 4718, 2878, -1757, -2632, -2580, 29, 4589, 3171, -2655, -3557, -1253, 540, 3519, 2938, -2484, -4416, -784, 1915, 3085]
1751C085r52m329k549L968M326o40k659k753j272L292M565j048l885k029o9K677
1767b72M618r68n129k049J651L129L033q02n451k309L011L342K006j089m838k503
1783d620L098L958J367j808m627j870L581L896M27k433l668j254L691L275j04
1798B909k557l164r00M157L257j421k633k888L00M418K463k474k727j546R8M164
1814A456K953l262l652l25P32M142K494l788m019P15J633K852K212l398m106Q32
1830b529K252K272J710l135m456J409L114J572P98k808l997J453L368R94J49k270
1846a04l354J405L767P21r73k078k588J680L726K40j917j520j672J557L337J08
1862B335k183j695j109J858L470l62k669j337l19J716L017r85k562p96mJ323K772
$$ y = [3085, 2133, -2196, -4745, -777, 3549, 2909, 250, -2503, -3775, -483, 4082, 3034, -851, -2880, -2949, -272, 4346, 3378, -1751, -3800, -2149, 980, 4013, 3211, -2240, -4549, -1538, 1804, 3810, 2721, -2117, -4620, -1522, 2436, 3803, 1995, -2632, -4502, -921, 2975, 3402, 969, -2699, -3953, -262, 3013, 2909, 352, -2812, -3712, 445, 3702, 2281, -352, -3240, -2940, 1478, 3941, 1467, -1260, -2806, -2708, 1456, 4409, 1147, -2505, -2830, -2098, 2044, 4538, 750, -3269, -2554, -921, 1931, 4143, 745, -3361, -2529, -277, 1995, 3705, 570, -3886, -2477, 637, 2209, 3007, 199, -3798, -2345, 1023, 2017, 2166, -104, -3458, -2053, 1714, 2435, 1462, -616, -3204, -1524, 2202, 2442, 525, -995, -2667, -1110, 2227, 2335, 152, -1543, -2652, -794, 2676, 2314, -355, -1692, -2011, -295, 2722, 1737, -825, -1621, -1625, -302, 2470]
1879B470o58k859q10P27J446J905p59l022k25J188J082J224o45k351n50J548Q82
1896E93J127p61k393l03J838J103P2q10j799J31J391Q85J44r28j673J4J532O67
1914H30K85j286j347P72J557o2l28l30j192M97J455j73m81l7j146K07J851j22
1932I50j256K69n55j27J562m0j447N15Ko08J010M78j069q5L36k86N90N97j362
1951e26L5P72l60k86P01J04q03L38n1j38M46J82l77l52L31l61J92M65J52m19o67
1972f22K96O31Q2j16l93m02K85M44K22p9j77o85j65R46O42q33o78o7K86Q10M39
1993H66n78r60J40L75L51O23j33j780K8J085N62L63m68j647l06K057L73o34L04
2012F21j360j051K060J184j079l44n40r69J810J455j362j234M11l15Q87J584j189
$$ y = [2470, 1812, -1047, -1857, -1130, 316, 2221, 1462, -1560, -1785, -597, 485, 1709, 1064, -1287, -1837, -289, 593, 1720, 959, -1434, -1737, 101, 1204, 1276, 466, -1333, -1202, 189, 1074, 1218, 290, -1383, -1369, 163, 830, 1115, -171, -1518, -746, 811, 749, 421, 91, -1101, -604, 851, 678, 197, 160, -986, -779, 1072, 950, -306, -37, -592, -719, 843, 803, -644, -129, -127, -735, 275, 753, -316, -401, -65, -351, 239, 836, -526, -491, 281, -79, -365, 336, 440, -363, -25, -76, -214, 232, 414, 37, -315, 16, -345, -153, 312, 464, 45, -622, -326, 305, 387, 271, -122, -524, -239, 205, 427, 348, 171, -514, -679, 267, 909, 76, -602, -669, -383, 427, 866, 288, -672, -532, -157, 194, 817, 684, -1096, -1068, 17, 579, 942, 474, -1173, -1479, 578, 951, 317, 621, -739, -1790, 270, 1454, 375, 31, -509, -1478, 332, 1787, 425, -809, -398, -713, 174, 1758, 569]
2029E69j767M49M76N37J348q34k281M25J232P78M98j012k142M40J672O27L06q58
2047D63k135Q6J973J326k67j689j547M47J903J100l93j571j159J97J978P50l98
2064A064j288j587P14K147O38j319j199o19O40K044L63j698q29k36N45J861L67
2081A608j859j445Q49R66J367K06k296j690J617J549L82l9j474k241J368K619
2097A487K11q24j379j888P67L361J41j746o28j343K14L078O19k116p48o01L7K836
2115A478P60k488r89M53J62J671Q36k498q94J013L65J018P16k261j577J949J000
2132G14L01K26k024j395K010J357j26K9j909j571K289J542k58l72j707j726K512
2149a08J839r49m43j001j606K080K070j199p04m87j265J553K252j160j582L85
$$ y = [569, -1198, -749, -273, 264, 1612, 778, -1503, -1078, 154, 932, 1430, 418, -1724, -1284, 388, 1015, 1321, 463, -1672, -1586, 387, 1713, 1446, -243, -1790, -1343, 560, 1660, 1267, -304, -1463, -1266, 712, 1462, 1064, -224, -1811, -1097, 1050, 1688, 369, -830, -1449, -809, 1235, 1598, -100, -929, -1165, -620, 1241, 1608, -251, -1696, -847, 119, 1486, 1692, -604, -2294, -677, 872, 1254, 1215, -259, -2500, -1132, 1487, 1698, 874, -505, -2393, -1626, 1735, 1876, 130, -498, -1841, -1627, 1451, 2070, -46, -794, -1395, -1358, 1478, 2238, -250, -1239, -786, -624, 1047, 1883, -615, -1509, -496, -131, 887, 1603, -658, -2235, -286, 714, 1015, 1241, -783, -2178, -168, 1189, 1063, 1092, -817, -2388, -99, 1443, 1185, 813, -894, -2620, -108, 1731, 782, 339, -662, -2268, -188, 1882, 683, -21, -508, -1773, -220, 2032, 872, -710, -325]
2165c25p02N84K493j447j883J023n4j6J971r66k311P95J154j11J073p00k483Q34
2183a071K073l19K93m82k221L44K203J6K3l21k075k08K463O78r38l80j427Q5K142
2202H78M94j234k47p76k47J641R40j299o11j12j75J345O39j331o38M29O9N11O74
2221I50r05p82K79K93O94N17j175r54N45O52N73J09r84o38K39J021J75N5o40p24
2241g00N2J027L32m53l15q02M62R31k3m45j62k31j05P39K30m61k47j42L4O04K98
2262F23q43k07M52P2j51O05n33m04M52O6j15L01l76n66N67M83m46K77%r77O14
2283a06O57p00K20M02j084J21J132o38j17L62m84l53J195l74n74O96l21n85Q06
2302B55O6o69M27P7o86O95M08r93M57J45n68K82N14o36K19J95o77L17P24p63O4
$$ y = [-325, -1027, -443, 2050, 603, -1280, -257, -311, -327, 1644, 678, -1633, -838, 316, 205, 1278, 578, -1905, -1071, 1002, 683, 976, 494, -1727, -1383, 820, 836, 859, 538, -1537, -1745, 718, 1396, 458, 78, -1349, -1264, 878, 1372, 138, -109, -885, -1132, 509, 1449, 150, -461, -573, -748, 597, 1236, -95, -733, -304, -235, 276, 950, 45, -737, -458, -165, 529, 1046, -129, -1083, -538, 114, 687, 796, -188, -826, -587, 434, 609, 664, 24, -700, -648, 379, 711, 258, -57, -859, -397, 534, 511, 66, -96, -327, -432, 307, 537, 76, -171, -313, -279, 325, 623, -220, -427, 25, 97, -54, 551, 18, -386, 66, 132, 17, 318, -58, -624, -57, 426, -20, 257, 257, -720, -106, 551, -149, 71, 473, -611, -490, 642, 4, -113, 249, -235, -588, 607, 233, -341, 355, 34, -551, 255, 321, -348, 79, 156, -530, 165, 573, -420, 37, 182, -386, -104, 410, -226, -7, 188, -489, -172, 552, -211, -147]
2323a47K55k93K0M00k10l38N99l01n83Q86j07l20L55j24o11P42Ln26K68j01j25
2344b58L32K98o38K37K9q6J81L05n50j68M54j58J32K41l76l89L97j80K54L04l46
2365A5n03M79L05k25P0j74m47L11L93L7l0l24l79L91M61o5j43j28n03L65L27P7
2387C10l05l92r6M77L74j58n3p09J54M41L16J1l09m56K57J19N11k21n03mo9L66
2409F1L25j56m34m5n6N10J62k47l89j25L32L73P3k25l65k19M63L47l3l25k46j34
2431c53K71O87k99l17j20j16N6O07n5m23l42J96J11M64j72l59k46K38M20P2M3
2452C63n61j76L96L56Oj79l70m19N05O59k44m60j16j53L18M26j1m86k24J58j52
2473c64N12M01o54n08M83K48K61ll48n98M43K78N8J30k75o71L50M34j8j47R3l69
$$ y = [-147, 108, -185, -165, 235, 25, -313, 286, -15, -598, 288, 181, -139, 216, 92, -519, 223, 226, -300, -32, -133, -258, 74, 372, -266, -29, 0, -86, 95, 400, -150, -318, 136, -22, 110, 351, -25, -414, -17, -197, 57, 361, 15, -488, -9, 296, 71, 141, -33, -480, -169, 224, 261, 231, -93, -472, -81, 380, 315, 172, 44, -459, -94, 233, 310, 5, -387, -483, -6, 368, 210, 157, -552, -398, 43, 359, 370, 61, -395, -138, -19, 492, 271, -232, -236, -305, 61, 386, 230, -204, -249, -305, 205, 367, 120, -269, -394, -62, 311, 384, 159, -206, -425, 38, 385, 352, 27, -219, -353, -82, 605, 306, -11, -131, -247, -191, 416, 361, -62, -404, -208, -97, 367, 195, -164, -410, -172, 248, 320, 363, -198, -374, 22, 378, 384, 205, -165, -584, -79, 580, 336, -124, -240, -393, -75, 351, 340, -146, -370, -212, -364, 148, 549, -105, -613, -130, 118, 379, 376, 28, -570, -127, 151, 209, 339, 64, -607, -257, 177, 159, 12, 105, -264]
2495b64k5O70j39l20N3k18L40L6N3l30j04J49J35K99k93p9k79OM35N30n20l77
2517b42q3n3M67N37m40m83l8J8K58O50k21r01M18N2j70N79K22r31q3L83j02L42
2539A79K95o62k55N71J1m45K13K80m12L39J61o20J25L30r8j3N87o59m45M56K78
2560B16m8K89j70p10M6O06r0M7J20o29k21N07M67m58L73k92n23K19O69k52j60
2581FJ46m14p3N30p2k72L97j92l09K35J80k41j27K56l3n1j10K7J14L3K98j35o29
2604d36K16R9O1N42q6p68j85O05kP5O08p78o53N78J83j32O11p3j184M79L59k63
2626a44M48M35j175k01J077o31l3Q54n32q20Q63j4n00P93j15o85M84J49o42M41
2646E2K28o29K35M08n73j61O41k3k29L11m87j38L78J03N5K20n08r2j02K53L98
$$ y = [-264, -289, 381, 242, -78, -25, -243, 97, 133, 186, -144, -248, -99, 36, 335, 42, -37, -316, -310, 125, 655, 135, -242, -325, -378, 89, 626, 186, -297, -335, -317, -59, 591, 370, -531, -113, -61, -231, 348, 570, -361, -444, -61, -163, 179, 474, -188, -443, 128, 139, -306, -93, 187, -225, 114, 275, -345, -220, 110, 12, -1, 586, -73, -518, -62, 216, 168, 457, 287, -423, -377, 229, 139, 186, 306, -323, -544, -37, 430, -28, 345, 53, -470, -251, 418, 166, 6, 152, -262, -335, 195, 123, -149, 248, 56, -253, -18, 162, -79, -206, 50, 17, -34, -144, -117, -3, 30, 328, 193, -436, -220, -121, -60, 482, 396, -372, -557, 48, 46, 121, 729, -49, -702, -124, 59, -73, 538, 465, -719, -240, 119, -144, 304, 739, -436, -637, 440, -191, -224, 630, 98, -722, 141, 127, -373, 420, 305, -380, 104, 253, -389, 52, 280, -349, -114, 294, -279, -440, 201, 178, -51, 260, -227, -365, 13, 116, 171, 391, -117, -209, -311, -58, 340]
2667C40j21k79j86J63k11L63M05n21k26K28q0o2N98l84l74L98j85j39N19N1o52
2688c55M55K76q46M21O10o19j5N61n83k65O60m09o2O42j96o20L65L4j77J69L93
2709D39q00j30N90Nj75M65l82n31L25K00Q0J54Jm65j65N79p4j35J59k73j51L36
2731E2r2R1J86j70m34K32K84m9k19K72j71r9K02j00j04J75k1O5p8K1j47j33K73
2754C6K95k83l21J07N9MN30k14m80N6L15k96M43J4m85L0L14k64M6M35k82m77N85
2777A67l2l44M52p7p19N71J46l25J67K74m72K2M31k88K0K93l57r2M23r2l33P4
2799i1R5k22K95K2k38j05J88Q0K32o1k50j91K10J32O4l4l49J35r7K43l3P2j53
2822e6Rr5N2J76j4j65n9K31j52J7K37j60j57K33P7o0j34J13k34L00P5l72K68j82
$$ y = [340, 219, -60, -246, -83, -294, 69, 474, -47, -273, -45, -125, -187, 411, 27, -347, 51, -134, -273, 246, 297, -355, 100, 376, -470, -49, 561, -58, -73, 488, -95, -360, 300, -109, -171, 471, 275, -345, 20, 54, -123, 46, 439, -361, -491, 99, 104, -71, 394, 12, -519, -194, 6, 86, 240, 241, -224, -389, 190, 116, -19, 140, -133, -284, 52, -40, 51, 237, 67, -367, -135, 149, 100, -119, 153, -18, -117, 85, -15, -119, 56, 35, 100, 22, 43, -104, -237, 36, 331, 48, -273, -166, -107, -103, 427, 213, -267, -211, 104, -192, 251, 265, -220, -190, 124, -140, -94, 341, 59, -418, 167, 135, -209, 243, 166, -553, 18, 164, -161, 6, 280, -192, -170, 261, -27, -7, 286, -71, -163, 260, 168, -165, -91, 4, -218, 77, 99, -139, -244, -56, 24, 256, 195, -55, -246, -36, 96, 160, 126, -223, -88, -185, 58, 25, 97, -56, -47, -142, -90, 86, 72, -93, -152, 79, -73, -56, 181, 21, -136, 97, 174, 114, -20, 93, -141, 159, 234, -138, 130, -52]
2846e2k5Q8J63n1j38n0j20P9J35m4j11Q1J43j91L03j3l66K7K85k17N9K39k17J
2870Hj97Q8n1K64r2k15J22Kr9K50o3j69N6J42M5k03J81k38L6J54J70j21P5l32
2894a87K47N9N9j54p9p1K48q3P3M2j61j14J82j73K21o1j07p2J1J16N8q0K3k1j90
2919b14L70j36j70M4R4j22L03L4k91kJ63q8P4R3k18oP1M5k4Q4j10j30K8K89q6
2944I5p0j9j67k0K38O7R6m34J29p5K49m4j48L8j4o4J11L35k91r7J9J74j94J36
2968E0J35j51q1J56j63j05K49m5k15L26J54l77n1J55k25J60Q0N9j04k04J51k2
2990f8L58k40j96Q5J20j01J46K58m75j11J83P9J83j28m0j96Q7J64K27k98l0J22
3012A29n11N25M2k86O1L0k7J75Q2n70j29P95k48k32M12k95m63N48K07l43J23o8
$$ y = [-52, -77, 11, 174, 123, -15, -65, -185, -106, 29, -15, -126, -45, 98, -93, 210, 197, -169, -142, 143, -74, -15, 224, 7, 8, -189, -101, -152, 112, 20, -195, -73, -71, -170, 80, 17, -152, -96, 46, 91, -112, 69, -169, -133, 21, 191, 70, 145, -187, 60, 119, 178, 24, -55, -126, 122, 39, 112, 154, -7, -121, 61, -112, 109, 48, -59, -131, -120, -4, 54, -26, -3, -24, -214, 156, 20, -150, -106, -12, -134, 169, 203, -88, -90, 73, -15, 59, 152, -66, -72, -1, 44, 20, 104, -6, -136, -108, 181, 95, 25, 6, -161, -181, 57, 124, 220, -214, -85, -160, 89, 45, -103, -65, -79, -143, -32, 303, 12, -85, -66, 108, -86, 50, 185, 34, -47, 109, -54, -159, 90, 45, -170, 156, 310, -67, -118, 37, -188, -28, 52, 111, 7, -197, -46, -68, 290, 50, -146, -61, 59, -42, 104, 362, -113, -224, -41, 38, 221, 93, 53, -143, -56, 108, 335, 37, 7, 129, -382, 143, 185, -101, -40, -10, -37, 138, 220, -350, -479, 316, 68, -164, 248, -47, -510, 38, 245, -98, 25, -43]
3034d3k79J23N80j80l42K71l33n8L90K39l15j62Q8k72L6O34k73l72L23m6j84L25
3056A50l2k93O7K47j11j77L25k35k32M96r8l83L20l8k93L26K21l90j14M46k51
3077d9J3L96k60l97L76o9m9K10K47n36j93O25k08j3J35l37l62M94K49l85K04k8
3099F3m22J25M33j32j86L50j78l00L19K00n33oO42n38k4N64l22m10O75k32l14
3120b26K71J28n34K58M69l50j66N26o08k25J004m05l58L44r4k60L94K13m85rL45
3141B32m95K13L90k17l70L71j31q1K39J38k67j89K89k17N7K17j11k90J60K86j90
3162C4l4L72m54P4J60j33L9K4M8m36L38K11n22J62M08m05p7O11p22J4L99M7l83
3185b25M27j07o21N65K04m10J35M34n45o2N00k71k00K64o9l22K25L83l82q7L32
$$ y = [-43, -322, -199, 381, 201, -141, 130, -203, -261, 129, 368, 53, -109, -21, -293, -257, 377, 104, -268, 55, 9, -175, 150, 118, -175, -108, 139, 28, -149, 176, -59, -291, 205, 107, -276, 44, 6, -287, 39, 260, -130, -244, 202, -49, -36, 360, 100, -297, 79, 10, -39, 171, 418, -118, -311, 314, 106, 93, 228, -109, -471, 23, 272, -113, 91, 63, -359, -234, 199, 67, -119, 231, 53, -247, 72, 272, -261, -267, 375, -163, -187, 377, 55, -355, 320, 88, -226, 45, 173, -361, -103, 366, 16, -150, 376, -232, -457, 547, 142, -216, 128, 34, -226, 168, 381, -104, -113, 232, -263, -50, 340, 123, -247, 124, -7, -88, 151, 289, 22, -167, 122, -95, -38, 179, 68, -222, -62, 224, 34, 0, 372, -82, -8, 152, 19, 58, 82, 130, -306, 32, 243, -279, -117, 291, -114, -191, 420, -302, -288, 111, 158, -225, 202, 95, -526, 39, 243, -167, -32, 402, -143, -205, 295, 24, -176, 88, 19, -303, -78, 305, -77, -164, 168]
3206A68l61N6M17j77l16J08j28k3L99J85m83p2L59j41j31L99j72k37L11Q6l84
3227a37O8J95k83Q4K16q4j02M0j3J1L16L3n22R7M1j53J41L84l82j46J57O4l8L56
3251C43k15n21J93L27j03m5L01l17k81N28l2k60J00rj79K00K19m35m4L82k31j34
3273b13M01j68l26J83J86p9J63n2l53J72K35p4j7L1k59oM34q1q6q7j9k32K64K60
3297B77k53j44M9j08J70K10jm75J76J72j1jp9j23o9K39O7j98J34r3j31K48L1j55
3321f8O6P3l14J27J58k1o5pN6k06K13P4j91NJ93p9j3J53n4m31L22J81j57J54M5
3346B14k57P7oL8p7P7L3m02L73N1k04P3l7J1P9O7j65K5J74j19m0J91k10j4k8R3
3372A7J0q4K11j36j03J64N4j65J66r6L7j13J9n5j5L8J87k55j4J75k58J59K08l43
$$ y = [168, -193, -137, 280, 103, -213, -105, -233, -256, 143, 328, -155, -227, 132, -9, -140, 259, 87, -150, 161, 247, -137, -69, 126, -157, -73, 143, 59, -43, -3, -16, -5, 311, 344, -178, -81, -40, -193, -52, 332, -50, -196, -39, 25, -13, 343, 128, -393, -200, 127, 24, -21, 280, -37, -318, 210, 178, -82, 18, 9, -170, 30, 249, -186, -230, 152, -79, -213, 188, 20, -306, -123, 63, -16, 147, 95, -258, -86, 149, 75, 58, 89, -170, -176, 258, 177, 91, 4, -15, -247, 17, 277, 24, -120, -71, -179, -9, 201, 200, -275, -99, 73, 62, 61, -18, -141, -210, 29, 96, -102, 32, -61, -192, 56, 87, -68, -2, 71, -243, -116, 42, 21, -44, -51, 5, -201, 12, 86, -105, -100, 93, 14, 1, 154, 100, -331, -9, 172, 15, 169, 214, -43, 34, 28, 66, -11, 66, 99, -303, 70, 121, -83, -10, -47, -36, 43, 110, -55, -30, 144, 25, -15, 176, -34, -48, -76, 17, 27, -57, 154, 18, -85, 79, 133, -32, 134, 38, 75, -38, -19, -74, -89, -51, 136, -119, -133, 42, -216, -57, 151, -192]
3396a92J66Q%R2o5j17O1R0m5q2L1O9j61N5K49j34k9J49k65RN1J59j31j35K27j67
3422a07R3R2j55N1J67j79J06J8r6j22J66o2n7N3J46k83K44J14l22L0R1r0r1K92
3446I9k7k93O6N2L6K03l9j12k35K60J79j78O4j62k4R3L16k11j26Q0k59K30K82
3469B94k67j22J22j44l4L11j6l53j5K47j10J89Kj16l54K81K64j61R7Jm53K54M29
3492C46l09j5j01N5j83L90P3l68ON6j57L77L33n66j52J45K84j42J56k48k33J74
3514g9L54l76K69k00k67PO90k88q2J56k99k45N91J50l84k11K42k66L61J87k71
3535C9l47J63K00j96M18n6n75r6N36k0L3Mk76l46O96J22m10J52j44l30N13L10
3557C90m06j28M3j88J26P20n13m79J88K53r3K26Q6o71K07N00j77j23K98m69k17
$$ y = [-192, -26, -18, -18, 74, 9, -108, -47, 43, -2, -84, -53, 16, -145, -90, 159, 25, -4, 145, -120, -111, -60, 99, -32, -167, 60, -107, -14, 78, -77, -26, 141, -38, 68, 86, -10, -132, 34, -28, -85, -32, 114, -169, 75, 189, -133, -103, -12, -102, -193, 99, 72, -221, -155, -103, -67, 136, 97, -15, -250, 10, 189, 11, 75, -87, -111, -18, 298, 87, -39, 41, -218, 12, 294, 27, -95, 27, -117, -151, 160, 144, -209, -224, 23, -87, 102, 104, -12, -366, -85, 179, 18, 115, 116, -337, -83, 346, 37, 22, -79, -24, -207, 183, 256, -112, -106, -50, -207, 170, 503, -63, -215, -70, 214, 72, 228, -20, -253, -79, 275, -101, 168, -32, -299, -292, 398, 110, 28, 184, -115, -360, 231, 381, -3, -214, 28, -238, 123, 310, 39, -308, -145, 55, -141, 277, 221, -354, -450, 86, 66, 99, 103, -173, -519, 177, 299, -111, 41, -103, -433, 80, 390, -16, -144, -101, -289, -163, 557, 44, -435, -247, 6, -87, 139, 225, -446, -239, 261, 84, -39, 259, -210, -427]
3578d27N87K69o07O3J30k86K26L53q1m56K30j09r6O09j95m97N6L89j44J63J82
3599C59m87l39N55J41k31L24k23l97K20M56k94l10L70m43PQ30j70p37M30j25j43
3620b07M16K58p71j32O62k62P6M05l52o69O06J89k44k9L07o04J16M40j33m07L87
3641E2j30l25O35Q6m28P5P7j49M0M76m21k11K70l1k50O49k44m65K44K97l49k9
3663a31K80k64k60O07J2n29K91J50l81L45K59o09o7N04k30m9L53j96l84M94J02
3684B97m92K70K43n41O5M91k82k56L29j55r1M88k77k60J51K76m83K08L26m44j61
3705b98M68p6l47L22m2l36M39J80l82j08K45j24o8K40Ll90L58K19n53L03O8m27
3727c06L56L81n12n3R2R4j52M96j53l99j27L34p4p5M39m59j04Q2L35l78M38j30
$$ y = [-427, 160, 429, -178, -115, 15, -271, -45, 308, 227, -229, 1, -108, -204, 405, 210, -287, -231, 158, 14, 177, 359, -128, -467, 88, 229, -2, 322, 99, -298, -78, 378, 84, -226, 144, -299, -292, 538, 368, -369, 61, -64, -207, 209, 467, -304, -436, 226, -36, 40, 445, 93, -576, 30, 219, -25, -54, 253, -351, -235, 205, 72, -335, 52, -78, -403, 232, 318, -110, -35, 42, -107, -67, 409, -12, -223, 47, 16, -234, 415, 171, -294, -50, 247, -102, -131, 149, -115, -375, 232, 244, -285, 6, 156, -225, 120, 379, -230, -297, 207, -23, -72, 281, 85, -299, 195, 297, -195, 75, 318, -223, -158, 333, 51, -205, 124, -31, -122, 366, 89, -171, -20, 256, -227, -19, 307, -137, -298, 170, 94, -253, 69, 27, -309, 130, 310, -72, -180, 65, -59, -127, 113, 116, -274, 84, 303, -250, 53, 121, -306, 50, 431, -81, -134, -42, 52, -100, 396, 243, -156, -283, 51, -23, -98, 341, -118, -222, -140, 195, -183, 255, 125]
3749A25o08L38L56j55j39O1k13N6M41O0m40R5j35K8K89M00p05l3J14M9J89N6k54
3772b5l06K13K90l4J66l31k98K02L30J19k47r7j76k05M58K95m19j65P6j20M08
3793A34K50l99l20K31N1K33K00k97n11M8M01J89R0l14l83J30M01J37j8k97j69
3814b13j64M54K58l70j99M8l1M07J58j3o91j15L53L27J80j68n34oL88K38j51j11
3836D5k60l16N59K39L0m04l06J25L52M61j14m76k23L3K91K87rn70k42L40K52K71
3858C65o1o84m1K12O17O0k77m85j96K58N82J16l97k69k72M23N59k3n60l46J30
3879b89K27N14q4n20k49JL80K04J48n43l07L07N03J01k11k96l60K50O10K9k95
3900A20l16k57J77O27J09o04j85j6K67M21J01n28m46L17J78J85J86l05m67J68
$$ y = [125, -483, -145, 211, 56, -83, -22, -235, -179, 262, 322, -118, -23, -158, -130, 159, 559, -146, -179, -65, -16, 173, 229, -25, -331, -118, 172, 138, 304, -27, -325, -123, 207, 326, 79, -18, -194, -399, 59, 354, -65, -230, -154, -274, 134, 384, -15, -335, -104, -53, 180, 380, 83, -428, -380, 21, 210, 300, -14, -397, -267, 134, 271, 253, -44, -213, -377, 77, 335, -35, -234, -186, -217, 190, 348, 335, -356, -471, -118, 209, 389, 221, -313, -319, 69, 307, 156, 45, -215, -531, 28, 267, 297, -107, -413, -288, 64, 525, 411, -65, -288, -255, 36, 323, 314, -256, -498, -158, 94, 365, 304, -380, -421, -209, 408, 468, 191, -294, -490, -232, 350, 466, 69, -200, -472, -49, 510, 487, -73, -419, -289, -62, 452, 368, -152, -401, -400, -20, 184, 332, -211, -518, -211, 292, 393, 182, -114, -474, -224, 386, 415, 120, -196, -453, -276, 351, 460, -144, -329, -345, -78, 343, 444, -84, -530, -213, -35, 150, 336, 31, -436, -268]
3920b68M48J12N2k70k61r9M19J98k20l62oo8M39K19k55l32m8K84J65K41m36k53
3942c01J73J40J61J79l39l66R8L93J23l1o2m44L1M83J67k75l67O3o1L39M19m15
3964A08j29k45J38J43L43j65m21j24L54J30Kr7l59p9M71J07m0J6k87j97M30K61
3986C60k75pp7j61J34K09M0l58N6J99k06K65j6k31j76K79j28R1J77k14k59O06
4008C08j69k43K40j54o3J53J66k05k29K66j04j88K40P2j01L2J41l27J72J69k93
4029a17P6K06L5m21M33L1m64K20J0l14K39L49l76Q2R2k68J03K29K82o68K84K7
4051G0l81L25K19l95p2K80q2k7M19k32n21M32N1l22L19J7k79r0N81j64j24J96
4073B20l19r7L12K20n09q5K18j81K70J55k06l25J93J47q7M06lq10J68N56j18j24
$$ y = [-268, 180, 292, 344, 74, -187, -286, 133, 331, 111, -251, -257, -325, 114, 333, 78, -254, -302, -18, 147, 388, -48, -301, -128, 12, 173, 352, 13, -353, -255, 138, 261, 230, 168, -276, -245, 238, 405, 130, -237, -174, -235, 104, 523, 108, -21, -266, -128, 15, 358, 193, -228, -352, 2, 132, 134, 37, -322, -401, 70, 177, 137, 153, -134, -331, 99, 360, 85, 78, 1, -160, -26, 183, 223, -135, -79, 120, -86, 179, 163, -68, -244, 35, -93, -2, 175, -39, -298, 308, 139, -104, 136, -18, -81, 72, 238, 33, -196, 70, -34, -222, 18, 90, -11, 21, 162, -165, 7, 176, -117, -41, 165, 200, -221, 212, 243, -221, -1, 9, -305, -66, 283, -93, -11, 81, -187, -84, 145, 427, -241, 43, 70, -311, 14, 233, -162, -234, 46, -36, -63, 356, 124, -397, 35, 86, -236, 83, 100, -179, -269, 312, 148, 24, 220, -99, -196, 116, 336, -173, -258, -40, -221, 49, 204, -2, -327, -134, 13, -74, 332, 329, -481, -313, 243, 125, 1]
4095AJ45m39j94P25J48l95K30m11j98L25O76m30n32L82m71K45O35j22q59L26J54
4116e9j7M14P2o91j38N77J65l14K13m58l95P64K91k79k50L1l49J83Q24j64q24
4137d04J68k29L12O91L5r46j39K93K18M37J65p38o25N88M37oJ15m24o21M67Q13
4158F07k92m01L4m15K10P97j8p62j0K39l02P37K11r44l52N52K42J5N48q38n75
4179g17M44P72j78k1l12q99M16J004n0m22K8n42O1P25K08m86n03J85P8N08N15
4200H14p35o78K97L55Q4M06l34p74O5P72o9n3n0o18n2R39K13m71m11j16J13N55
4222B52M70n91n61J05K57Q3O40l14p57Q3N25o1J47K2q07J50N88M5k3q5o34jP91
4245C24J80l50j34j69j90M61N39m52n00j63L21K28M07q4q26L0L53K53P5J9p16
$$ y = [1, 146, -293, -487, 238, 386, -9, 221, -190, -388, -63, 613, 183, -349, 33, -438, -193, 442, 320, -539, -213, -59, -76, 338, 410, -281, -419, 158, 323, 9, 222, -236, -631, 133, 424, 145, -105, -74, -423, -240, 584, 420, -404, -236, -465, -153, 538, 573, -373, -512, -219, -1, 436, 601, -137, -762, -174, 263, 257, 372, -52, -673, -206, 607, 315, -86, -52, -467, -257, 540, 522, -240, -250, -11, -313, 424, 635, -309, -661, -109, 133, 148, 696, -142, -717, -273, 499, 321, 300, -12, -911, -495, 509, 459, 37, 65, -477, -416, 309, 517, 31, -472, -287, -209, 299, 814, 79, -599, -302, 53, 137, 543, 209, -565, -500, 272, 203, 150, 100, -518, -570, 369, 582, 111, -300, -416, -303, 252, 722, 131, -430, -325, -68, 15, 655, 341, -416, -333, 192, 131, 278, 300, -507, -357, 231, 276, 253, 168, -466, -467, 324, 504, 154, 20, -149, -339, 122, 661, 209, -291, -454, -133, 95, 502, 418, -408, -378, -25, 228, 303, 322, -394]
4266c94j30O24K46j45j58k91r6N07K64k36k95r0J4J09N31pq05P8K88J65K72p2
4288C79o08j87M92nm5K13m56l16L64M45j08j43n7l90K53M73K0m48j26J90m9K39
4310A30J10l12k5LK0L27L6l54k23L12L2j27K58j01l63J58M30j54k1j62j66J7K35
4333F0J32k38O5k03m4K44K58k61j26Q6QQK46j75j63n9K87q1J12j56K8o6J38j32
4357c2k3J12o8j07O4J58j16M1K43l20j77K55k5J08J60k09j86PJ68k10J44J00k53
4380a66J17N5Q7p2n4L0k81K93K22k43J6o3j56J34K57k01n6qJ15l5K41o0l44O4
4404a08Q3k7J93P9j97k35J34K50k16J07k25j17K39K60j33k6k56n2J87K18j04l2
4426B2k84J28P0J91M4l28r7O8M39m8k7k22n00M24M30j53j90n1k55K12M04k21n7
$$ y = [-394, -524, 100, 346, 201, 43, -248, -344, 163, 427, 191, -104, -194, -180, -71, 460, 453, -352, -274, 14, 179, 451, 379, -229, -416, 76, 71, 26, 239, -217, -533, -169, 276, 168, 25, -32, -422, -169, 304, 324, -124, -250, -60, -109, 130, 240, -72, -97, -94, -74, 253, 289, -65, -288, 24, 56, -71, 187, 86, -277, -119, 311, 157, 136, -26, -192, -175, 60, 192, -46, 19, -184, -228, 16, 274, 13, -113, -27, -19, -11, 235, 60, -103, -162, 125, 44, 156, 0, 28, -38, 100, -32, -55, 57, -11, -118, -54, 104, -12, 29, 272, -48, -225, 30, 5, 113, 273, 64, -122, -115, 53, -157, -13, 87, -166, -49, 6, 93, 21, -33, -3, -284, 9, 231, -12, 4, -59, -215, -81, 176, -25, -81, -89, 26, -9, 232, 172, -172, -108, -25, -52, 141, 220, 23, -212, -78, 172, -44, 63, -162, -279, -40, 220, 87, 61, -195, -247, -60, 158, 54, 22, -262, -134, -64, 127, 171, -157, -254, -186, 253, 205, 178, -44, -544, -120, 310, 157, -33, -84, -339, -127, 277, 56, -1]
4449aJ2k49K3P29r2n38J05m26N33J86R2m88l23J71K53L14L7k23o28L13L66K08
4471C74k10j87l61R4M65K06k65j68k14J80K47K62k11l97j39K11M27J68l93m82
4491c93J62K82N1K42l52o38M38K15J63J09k34l45K9M03L91l87k54j33m1N65K18
4512D91m58l20L6J11L16M10k29p91N9L98P2L38l68m95j03O54K04j18k23k91L9
4533b68L31K99l15k06j62j60K68Q37l81o13o1K61J25L92n2o39k5L40K84J9P4n29
4555a81k91N48M97k92q6m76j95L70N91l41l44p3k4J30N95o2o44N0J91l1L96K29
4577E57o97k23K71J31R2L15l26p12M92L48j58M9k24k56K59O38l74k65p1J11J9
4598b4L65O3n50j61J19R6K77M4k12m00J60K22J1L43j75o80M00L91j52K2l48k23
$$ y = [-1, 11, -238, -215, 514, 422, -116, -11, -437, 96, 282, 374, -114, -437, -266, -13, 301, 338, 115, -513, -200, 166, 374, 164, -23, -384, -290, 175, 381, 116, -52, -266, -86, 161, 423, 212, -185, -324, -113, 314, 482, 89, -393, -231, 51, 102, 344, -8, -646, -208, 7, 170, 279, 45, -300, -271, 132, 523, 136, -118, -251, -292, 273, 491, 33, -287, -251, -140, 176, 586, 357, -434, -375, 23, 95, 433, 65, -430, -533, 121, 325, 207, -16, -307, -268, 63, 362, 47, -159, -321, -481, -213, 624, 243, -370, -431, -170, -45, 347, 295, -344, -369, -29, 255, 274, 348, -181, -472, 76, 573, 281, 195, -281, -476, -106, 485, 144, -200, -273, -297, -167, 428, 366, -278, -228, -37, -68, 328, 557, -140, -363, -92, 39, 131, 446, 120, -592, -100, 248, 90, 139, -85, -341, -82, 556, 182, -83, -154, -43, -24, 341, 404, -146, -307, -188, -92, 185, 229, 17, -383, -223, -1, 10, 353, 178, -502, -102, 289, 137, 159, -189, -412]
4620d12K21M52Q0l22j6j37q4L88L22n86j22K85n7j0K58k50m16L67J04j26K20k7
4642A32n70J73M67K7j85j3o1k84M53P6l86j1J85k77K07L29n24j7L30N6l58M89
4664B38n5m65K33K49k73J06J6k70OL65Q7m54L26j27k00J81K35l11R3P5k10m4M66
4687B67l64j03K59O0k00k4L48m78nL63r6k03K39L7l74L20O0k92K69r7O2j22L55
4710B81k99j15M99k38m24L79l3j29p4K52l58L39J1j74K8K23m3l76L08P8k15Q7
4732GJ34m01M8L86o6k80L23j86j28L04J1l53J07Q1L1q2L82l46j98J81J24j43L00
4755B36l21j23K63J4j8p5K35k66k34L16K24k49O0M0l21K13M19l26k74J65J02r6
4777a6J00j11j38m8K44j01J89j82j70o6M92r2j89K62l58J4L46K25l64j86J50j44
$$ y = [-412, -191, 261, 341, 19, 3, -134, -218, 170, 492, -94, -216, 69, 12, 2, 260, 10, -406, -39, 65, -61, 159, 132, -438, -265, 202, 229, 44, 31, -30, -314, 139, 215, -171, -182, 3, -274, -67, 262, -262, -279, 51, 107, -251, 238, 183, -282, -49, 200, -73, 33, 49, -221, -215, 150, 237, -217, 109, -18, -218, -37, 198, -113, -20, 55, -155, -199, 267, -97, -200, 59, 119, -81, -105, 243, -235, -240, 123, 27, -176, 63, 100, -274, 46, 106, -186, 83, -14, 48, -74, 281, -18, -133, 366, 128, -296, 83, 50, -79, -153, 99, -259, 80, 91, -83, -55, 168, 125, -251, 57, 135, -80, 7, 141, -260, -212, 174, 108, -172, 151, -35, -163, 141, 152, -201, -94, -13, 18, -64, 318, -28, -226, -45, 79, -64, 236, -85, -208, 55, 69, 51, -24, 211, -55, -289, 27, 251, 2, 62, 102, -219, -6, 413, 87, -187, -22, 80, -16, 84, -27, -165, -213, 31, -70, 119, -63, -233, -299, 193, 101, -88, 174, -184, -170, 176, 401, 37, -149, 1, -143]
4799a43J28K62k58m9L6N6p6L02j78j98R1Q5m6J62m1l78k9M83m4p8j3jl62M52J13
4824B76j91k14N2j16K04K78K5n65K5J61J39K24k04j43k14L24N7P2k05k7j15K81
4846A24J32k10p7J7l44K70K12R9k90M9q4R4K72J07n04m1J78j7J32j94m1j66J2
4869b70L43K9P9j72j90J9K95O3j33m4k08P2K05Q3k09k7o8J9J31K53k65j57M4J20
4893A2J62K5j91p8n7J25R8j09j01j09J76J25R2l7j56j59J34L7K03k07K9k59K77
4916C2J7l0K33l66Q5N5N8N3j24j44m0J27J46r1j7j06j2J29K26l06Q4j05m7K08
4940F5L8j82r6j2O4N7J55p8j56J29o5J24M8r5p6r3K20q5J38J5r5j65J64L2M6o8
4966B9k9k15L34Q4q9k93QJ04J10l8pm6J9J47j47J05q9L4k8J22j96m3L96j25k58
$$ y = [-143, -15, 247, -11, -60, -24, 32, -44, 258, 80, -118, -27, 58, 12, 174, 133, -245, -274, 209, 165, 87, 74, 73, -289, 163, 276, 85, -129, -77, -193, 11, 289, 314, -251, -226, -65, 74, 298, 94, -49, -263, 61, 118, 190, -15, -42, -157, 124, 256, 46, -31, -14, -358, -88, 124, 223, -67, -18, -102, -8, 264, 371, -133, -174, 4, -13, 119, -75, -116, -282, -270, 73, 102, 181, 9, -181, -162, 133, 196, 63, 19, -189, -117, 88, 171, -38, -65, -133, -114, 17, 270, 5, -152, -108, 12, 174, 199, 8, -70, -127, -2, 96, -13, -114, -223, -47, 78, 170, 133, -23, -182, -48, -11, 192, -15, 14, -245, 32, 49, 19, 252, -114, -29, 26, 84, 137, 13, -131, -171, -44, 102, 11, -6, -112, -124, 5, 231, -75, 9, -96, -143, 65, 103, -79, -175, -187, -123, -66, 89, 11, -145, -16, -81, 43, 91, -4, -80, -173, 47, -38, 100, 115, 20, -145, 19, 51, 97, 29, 0, -215, 119, 203, 114, -179, -171, -67, 43, 5, -2, -48, -29, 118, -29, 76, -13, 21, -7, 115, -81, -124, 272, 147, -111]
4991a11J58L5n2m9R3k18K70n8j00m4J96j13q8J40J46j32j22J16r1KJ30q1j10J79
5015I6R3j1p1m7M3j29L5k6rM9j14o0R4J40k02J17l0j35K11K07k06r3K30r3k04
5040a15O6k5j09L12j05j05mJ49ok82L44j59l0J72L4l27K11J43k0n0j3m3k18K51
5064G1j19M9M1q1MN9J24l11J31J62j68j08J97j1o6J24q3r0K50L7l10j4J83J1j20
5089c8P3j83J56K13l08q7K81O6l15K33N0k32J90L3k36k4K09J71l59J68K2j48O
5112e9J81k72J31r3M3r1L07j49N5j24J43k68J96O0j80j8J97J80l57R1K7j00J62
5135F2q0K2j4K5j89l4K46j60J4K38k0l54L85k3k78O5K77j90QJ41k12o2J85L4k36
5160a50K31p7k77L12O8j58o8N6M8r9K21pj52J83j30k6RJ00k90K31P1n2j94K30
$$ y = [-111, 47, 82, 30, -19, 74, -144, 126, 68, -32, -76, 120, 7, -81, 59, 205, 73, -49, 67, -24, -22, 108, 27, -83, 96, 189, 178, 107, 60, 103, -26, 9, -17, -26, 23, -91, -151, -57, 83, -119, -2, -32, -167, 44, 251, 45, -48, 182, 89, -115, -49, -74, -183, 129, 24, -81, -85, 64, 58, -224, 120, -39, -69, 103, 137, -190, 21, 164, 144, 94, 81, 38, -180, 71, -48, 1, 42, -39, -35, 24, 148, -163, -32, 130, -38, -146, 51, 40, -26, 98, 15, -75, 175, 212, -98, -112, 71, 82, -38, 35, -148, 8, 221, -87, -174, 107, 173, -142, 91, 141, -91, 99, 132, -104, -128, 81, 252, -107, 61, 83, -65, -59, 122, -150, -19, -112, -69, -160, 147, -2, 53, -71, 72, -196, 0, 60, -120, -138, 59, 239, -118, -27, 0, -100, 62, -18, 4, -10, 15, -174, -208, 38, -122, -108, 130, 110, -244, 141, 118, -160, -95, 182, -8, 0, 141, -71, -133, 52, 86, -150, 81, 4, -273, 39, 107, -51, -119, -63, -15, -114, 107, 100, -52, 131, 1, -25, -16, 84, -206, 25, 96, 44, -150, 80]
5184H0j29rl6l3q1J22J80r9r5P2J24k22Q2J33j65J06R2j80Q2M9j40M3r6N4M6J61
5210A41k67P1J44J06j20j98R8j70R1K25Mj83J32n8n5J53k23j01J46J8J8Q7j7p9
5234c7j06Q3K2J6J29j39k41K7L24q9L3Ln3J4J04j22q9J14J8k03K01J38k14O6P
5259Fj6J04L1k07o0J77j04M9k6R9k64P4K16pr6J29l9j65K17L0k10J01K1r5Q4J71
5285B20j02k21p8O8jK68k05r3J56J47L0j72P1j28k3J85M8j12L8j27J7QJ35j31
5309bPr9R7L8j2J19k31p0J24L8N9o9j99K42r5LK8L8q4K2k1J62okq6j12M4K27j87
5338b7k43K81Q9p7J87k80R8lj19K2J42l1r5j01L41k21J7J30j39o6J91k8k6O6j12
5363dM2j49J40j07J2K4p7J01J1J5r7j5N1j6J62j41M8pJ7r3N3M6k2j55J79j17R2
$$ y = [80, -49, -58, -94, -127, -208, -86, 94, -5, -100, -28, 96, -126, -44, 89, -76, 30, 122, -58, 24, 73, -67, -24, -120, -66, -20, 141, -126, -55, 89, 195, 75, -123, -25, -195, -104, 121, 125, -58, 74, 16, -39, 114, -109, -210, -64, -46, -28, 59, 42, -37, -143, -60, -38, -22, 107, -32, -273, -246, 78, -11, 22, 25, -28, -14, 90, -32, -121, -7, 11, -192, 9, 147, -67, -1, 6, -10, 94, 125, -82, -142, 35, -69, -20, -46, 53, -211, -137, 79, 72, -24, 105, 66, -99, 118, 148, -62, 39, 60, -35, 49, 220, 118, -103, -181, -113, -114, 154, -51, -144, 12, 159, 189, 17, 88, -40, -63, 122, 170, 58, 96, -31, -14, -6, 129, -2, 5, -94, 3, 41, 29, 148, -83, -153, -29, 9, 68, -1, -200, 42, -53, -50, -22, 16, -68, -46, -67, 95, 89, 87, 1, -111, -67, 160, -27, -270, 11, 100, 23, 210, -70, 28, 25, -94, -72, 70, 39, -56, -157, 184, -37, -20, 110, -29, -95, 96, 68, 42, 108, -4, 38, -111, 29, -78, -66, -42, -119, -18, -7, 8, -89, -104, -53, -69, 93, -48, 0, -7, 10, -83, -30, 16, -6, -161, 18, -99, -7]
5390gN8K4j29K03j34J77j1k54M2M5OK2k6n7N4o6N3P8j76K2P2qn5k8R8l8N1l3K5
5419Hq8J00j20K13L4p5j24L5L4n6j15J97n3M9p7J92j45k23L60l22J79J31j95q9
5443a50J48J07P9j34J33k35O8J01j62J04k21K75j31K05m1j53J88j62l7L1P9j36
5465d4K2m1P9l0K2j40k5J90O3n7O7j67l9O6J36J52k28j04P8j6J77j7l33J93m2
5490c8O4J02Q0j68j41J06LO2l7o6l7L9P5j2Oj26P9j04K08p1O3j52j51J97R7k7
5516E1j44J66q8j7J21Q9j95k2q2J84J27rk78o4j4K37K17l29kk8l6J29J02q5p2
5541d2K1jJ64R6j14j91m7n2K96J9o5k62j3K58j1O3m6l17K4M11K04k79j83L5j62
5566a94K74J08K4l86J43j46Q7J87N1j62k33J02L51j2j03l55j3J91K72J10k78l52
$$ y = [-7, 51, 75, -54, 149, 15, 192, 181, -73, -31, 14, 20, 42, 16, -41, 13, -53, 0, 78, -98, -76, -4, -12, -67, -95, 3, -35, 16, -17, 8, -80, 20, -100, 113, 147, 72, -52, -17, 17, -39, -154, 43, -10, 39, -38, 154, 9, -214, 146, -176, 3, 134, -61, -150, -2, 105, 184, 50, 183, -52, 16, 117, -45, 59, -162, 113, -18, 187, 146, -7, 181, 19, -18, 13, 92, -44, -22, -63, 16, -14, 8, -132, -157, 33, 96, 39, 106, -61, -100, -34, 102, 254, 26, -78, 0, -16, 161, 144, -189, 4, -38, 26, 128, 208, 40, -101, 5, 8, 70, 33, -33, -70, -31, 44, 32, 38, -88, -9, -113, 95, 24, 87, -65, -216, -19, 78, 51, -93, 73, -15, -32, 89, 178, -17, -39, -121, 63, 190, 181, -97, -161, -175, 62, 279, -50, -52, -80, -116, 13, 115, 30, -42, -21, -22, 142, 238, 124, -67, -114, -166, 130, 149, 84, -178, -191, 67, 56, 119, 73, -244, -220, 191, 395, 116, -67, -32, -194, 80, 188, 212, -174, -31, -177, -90, 97, 148, -14, -247, -145, 206, 194, 91, -264, -277, -86, 186, 296, 18, -334]
5588c34J41K00J20J7j97j14L6N8L27Pk31m5j32J91J79r9k16m0j6J75J40Q7k29
5611B5J8m2K33k94K78l03j91K46J48p4J87m02j2K0L56n7q8j53j19P5K00O8k29
5634a10l4K23j04k9J97j76q2O1J51n6K7j4j34O3J72j32r2O8j63J79J05L9j82j05
5658a28R2K7J76J06k29k7k07K46N0K8n4l05K90O4o8N7m1k04j6K71J00k28p3k6
5682i9LO4J51l85K74k9n4J71O1k48j11K07k5j02L10j27m9J68j71J00j07J12k13
5705i9n6J68m6J23P8p4j17j1j62J35l3P8M8j11J83k78M3J82j8r6J19qm3K0j26
5730a01J96m1j55P7nJ52q5p2NO8j6o4R0k5j53J45K6p5l6R9n6O0k0p6O5Q4j65P0
5758hJ79k56j07L01K9j44j03R5N5j25j4K7P8r7QK57j6j71j7l2L4k0M6K27j21k74
$$ y = [-334, -193, 7, 127, 144, -53, -167, -131, -73, 254, 261, 30, -15, -147, 44, 223, 124, -92, -132, -148, 27, 167, 254, 25, 43, 1, 234, -60, 218, -85, -276, -30, 118, 44, 231, -171, -183, -163, 193, 136, 48, -105, -224, -149, 51, 119, -110, -144, 79, -25, -54, 143, -33, -115, -54, 97, 41, 68, 54, -80, -17, 155, 23, -69, -1, -164, 15, 120, 159, -23, -128, -36, -9, 167, 273, 44, 17, -190, 56, 106, 134, 80, -225, 65, 129, 61, 118, 77, -127, -143, 128, 228, 0, -73, -99, -96, -32, 119, -266, 8, -21, -75, 96, 157, -91, -202, 5, -20, -122, 188, 61, 12, 180, 9, 109, 2, 114, -99, -155, 13, -33, 90, 168, 94, -23, -34, -196, -61, -94, -16, 32, -79, 104, -174, -131, 51, 33, -63, 56, 48, 5, 25, -101, 95, 54, -101, -24, -29, 123, 38, -34, -29, 39, 23, -41, 49, 24, -129, 16, 42, -33, -69, 30, -26, 34, 14, -62, 3, 87, -78, -8, 171, -85, -192, 109, 138, -6, -109, -14, 41, -84, -98, -71, 7, -90, -82, 175, 159, -12, -29, -61, -27, -47, -1, 226, 105, -169]
5784a69L06n0j26M1NJ2l7J27j06P6k10L5KJ60j19k4n9o5J51M7M7L6j18N0j13J5
5810h6J2R9o5p7J82n5J22q9M8k12Q6J31P1k50j48K15J50J8k5j49j68J20N5R1m6
5835C0k48J70p1K24J80k30j95lJ44M4j45K30j06j0J83j03m8pj58J29K00k2k99
5858a11O8L5j57q8L99j21q6L8j48K27O7jk37L0m0K14J39j43k64l7K36KJ63j58
5882B7j36J17j15L03j38p6j81Q8J32J77j28j1q4j6q3L28N0l26j69J22O8J69j6
5905A02l89J45L0L57J08k46l39QJ82J56j59L7k15j8J71M16r8k55j25j7L77j00
5927A28K6l03j75K04K62j4j72o0j12K33P3J03k23p8J1k4K81l3j44j53J89m4M8
5950B3J43k25o4r1K50J76n4j70J4q7K97o6j59j23Jk6L20j2j90r7m4K11RR6j95
$$ y = [-169, 137, 87, -39, 2, 7, 19, -18, 109, 3, 79, -131, -96, -94, 66, -53, -77, -136, -201, -50, -3, 44, 80, -38, 12, -101, -86, -74, 25, -40, -117, 65, 10, 132, 43, 91, -121, -35, 96, 167, -83, -231, -16, 134, 152, 127, -22, -190, -70, -15, 76, 30, -218, -48, -119, 105, 285, 55, -140, -143, 1, 45, -100, 130, 24, 14, 197, 94, 46, 39, -119, 10, 210, 188, -111, -43, -8, -165, -253, 146, 25, -61, -23, -171, 56, 123, 122, -115, -85, -125, 89, 228, 85, -179, -216, 20, 22, 185, 27, -109, 8, -107, 196, 58, -18, -199, -111, 21, 198, 70, 59, -25, -41, -124, 204, 254, -72, -241, -119, -51, 118, 102, -287, -142, -112, 245, 353, 107, -232, -224, -42, 114, -45, -8, -223, -241, -70, 346, 248, -7, -132, -149, 228, 128, 154, -149, -324, -120, 142, 128, -44, -104, -216, 17, 90, 193, -30, -108, -97, -121, 160, 127, -17, -170, 19, -25, 23, 166, -59, -123, -214, 36, 212, 158, -12, 2, -85, 212, 146, -13, -136, -135, -161, 159, 147, -43, -140, -184, 27, 36, 132, -63]
5975f3l7P5J5N1m6P9k25L2K79L9o7k31r2K8P6K80rk31j44K0P7K30p7p6k26K48
6001EJ49qj01k88K81j21J84o6J36j08j87K63j31J48j73j27J6Q5K06Oj71n8M7%
6025a3J14r4j35j3Q9R2k7Pm2q5L0J9J78j68J1K07j38J73k17Q7r3j11J03J41L0
6050A45j10j82pJ47P1q6o9J62j19K48k93Q1j6o1j54K88Q4j21j09n4K12N4r6K55
6074B70j49r4j64J97QJJ62j97k13K46l4n2r8J55j47N3R7p8R9l2r0j5K6p7K03K5
6100A02k53r7L16k23K86R4k49m9K5K33j42M9k22O4k4O6N2j3j6J6k79K75J11j52
6124c0J46k57R8O5N2J25k52k4K5J52M3j01p4j37P0R1k1O2p6p4J64l2p3K14K6l06
6150a24J10J69M4l05J08J8N7l0l5J15j54j3K07j59N8j24l5N2O2kr3o3Q6K33m2
$$ y = [-63, -100, -25, -10, 41, -5, 74, -151, -119, 160, 199, 132, -99, -191, -163, -87, 193, 184, -47, -191, -171, -94, 136, 59, -17, -243, 5, 154, 146, 45, -243, 38, -83, 101, 35, 171, 63, -124, 139, 8, 156, -17, -144, -128, -43, 163, 169, -2, -60, -13, -13, 101, 7, -128, -141, -52, 40, 13, 20, -22, -107, -77, -58, 120, -48, -37, 170, 32, 205, -12, 75, -18, -129, -26, 115, 145, 35, -147, -154, -7, 64, -22, -91, 71, -48, 200, -93, -12, -28, -89, -243, 45, 129, 8, -101, -155, 57, 111, 15, 270, 121, 27, -137, 60, 68, 69, 231, 34, -179, 67, 33, -19, -117, 38, -109, -56, 41, -37, 62, 30, -60, -75, -49, -126, 77, 102, -151, -248, 68, -155, 131, 225, -24, -73, -48, 185, 43, 92, -130, -66, -90, -24, 28, 15, -1, 15, -264, 11, 122, -30, 116, -141, -43, 22, 74, 199, -53, -77, -52, 100, 143, 42, -32, -169, -99, -8, -29, 33, -43, -117, 47, 15, -58, 156, 182, -124, -14, 155, 199, -106, 2, 20, 77, 47, 12, 127, -27, -40, 167, 8, 66, -58, -93, -41, 21, 19, -74, -137, -51, 182, 140]
6175A40j79l5Mk9L23j5j76p4j3P9NQk16q7J88L2P9n3p5N5r8J08M0Q7j59j13M3
6202a31J46K79j92r3j36N1K06j73K62l64o1J10K69k4L0k69J17p9K28j8r0m3p1
6225d6J02RJ41k04p5j03K89Q0n6k82q6J01J08R1J0n2j05P7L8MR7j88j50J80Rj28
6251a39J33L1j44R4M3R5j26j74l7J62J63P5n6k67p3K25N5K9j01Oq8J24MP7o7k42
6277a98J74O1N4J1q3k6j27K62o8n3m7K0j04M17k08o1k07O7R2J21r2L8j86O6J26
6302D9j0P2J3r1j05o9L22J1k70LM7J40N2j81n8J36p7K28k14P7r3j22J30J40O8
6327A98k11K5L2M2M3m1j4j28J9n9K59j66k5r0j24K09%J90k08m8m9J77M8j77J46
6352D8k23K52Rn0K6j04k38K54K17l86K83r9j7K4J38m4k4k1r0O5j03K60j42K1j71
$$ y = [140, -39, -74, -70, -99, 224, 209, 33, -41, -54, 25, 30, 38, -178, -265, -77, -45, 34, -19, -94, -39, -137, -29, 11, 98, -61, -174, -131, 15, 294, 102, 9, -127, -76, 130, -43, 219, -145, -206, -96, 173, 149, 179, -90, 27, -52, 176, 158, 68, 25, -46, 56, 65, 206, 2, -73, -176, 113, 193, 137, -145, -231, -130, -22, 69, 79, 27, -78, -1, 37, 41, 138, -50, -200, -20, -11, -139, -6, 25, -119, -25, 18, 113, -13, -187, -224, -62, 101, 176, 120, -147, -220, 5, 60, 89, -12, -6, -94, 30, 34, 111, 44, -198, -24, 37, 91, 102, 19, -7, -134, 128, 60, 7, -40, -20, -124, 293, 85, 24, -183, -116, -24, 97, 5, 43, -143, -77, 49, 39, 111, 124, 33, -72, -141, 181, 192, -78, -75, -28, 112, 164, -17, -75, 61, -16, 212, -2, 75, -18, -140, -10, 130, 198, -13, 12, 44, 86, 129, 88, 74, -54, -35, -94, 165, -1, -26, -116, -240, -31, -31, 159, -49, -97, -146, 31, 79, -98, 48, -175, 77, 86, 36, 62, -42, -280, -26, 191, -195, 88, -11, -28, -4, 134, 90, 66, 45, -45, 20, -83, 177, 35, 56, -115]
6377a15J11J15j16j17L9n2J24J1N1j13k5p2K13j18P6r5P4N8oj48K8N4m4Q6n9J87
6403A47j54K5j21K02Jj43P3l07L33j97O7P8K8j13l0J37j28J97j40L0L3j9p6K24
6427A47k40P5k9J77j49m8m3J58kj72J10k4P7q6J2j37J32K9m0J24k17K20l6RL3
6452H0j29J07M3j39Nj6K11j84M3j02L7Q5R2j71N3Q8J6k33O9O9j05J4K20j0j32
6477A1L5K4P5k85J23l0L3K2J4O2j21m5J25O8j16J02j04p4L0NN1pJ06p5l0L7n2
6504a6qJ1j44Q5NJ2J7N7j39K79r1O4j30j19O6l7J46K6j92k5J86j81L70j87j19
6529f4R6j08J7J2J08K6j84O0Q2j53J60p5J30k13p3K22p3n8N1l6J79j06nl6r6J11
6555b6Ln6K78k70k38K81m2K14k8K0l14K68K3pj09m1P2k7O5n5L5q0J10n9J9J18
$$ y = [-115, -4, 111, -5, -122, -83, -135, -11, 0, 51, -62, -87, -159, 54, -64, 12, -83, -9, 49, 43, -105, -77, -23, -67, 19, -40, 147, -7, 18, -103, 99, 100, -43, 30, -277, 56, -141, -74, 4, 32, -81, -111, 26, -102, 95, -45, -15, 18, -1, -77, 147, -93, -18, -47, 130, -19, -67, -110, 48, 46, -126, -16, -40, 37, -49, -37, -174, -42, -13, -53, 71, -146, 74, 38, 47, 80, -49, 58, 101, -38, -33, -49, 162, -22, 21, -81, -44, 41, 133, -38, 15, 103, 119, -114, -45, 24, -81, -67, 153, 143, 11, 46, 70, 145, -140, -17, -47, -14, 8, 22, 84, -37, -82, 43, 111, -5, 97, -7, -81, -51, -46, 5, -2, 104, 29, -1, 36, -16, -24, -13, -157, -72, -67, -55, -38, 19, -120, 159, 68, 132, 2, -117, -51, -88, 58, 84, -108, -133, 53, -128, 242, 55, -64, 32, -76, -59, -47, 61, 87, -97, -37, 45, -108, 52, -23, 107, -106, -179, 43, -30, -88, -37, -73, 106, 0, -5, -41, -137, -26, -23, -79, 199, -71, -309, -28, -70, 144, 116, 136, -178, 90, 113, 106, -3, -44, 28, 1, 66, 11, 46, -34, 76, 17, 36, 154]
6581A54j76K8j22K08j27R3J10j40M1j99K55K9j90o9o3J60K12k60Q6o2n2J33N2
6604A01n8j78K49j78l6rK40l9m6j46K2J70j77o9k8J01J95k35J70j54m0J50j93
6627a88L06k23KJ12R5l2N5p1j90j5J83m1N4k09R6M7P6Oj56P6O4r8N7Q3l0j30j70
6654b41J40L6J91j97J50r1j12J89n7k51K61m0K2R1N3k94K16o0p7R5n2K00j60P2
6678H4j7q5J3j7n7M0N7Q7q2j23j55J36K21m8j97L2p5K11k8j53p9J06O0MK87l43
6704a21J94k42N3L2R7J91k04Q5j41M9o2J96J38l48R7j47J4J94l1MRJ8o2nM7pJ3
6731F1P0j35J59r9L4j72J27J42k01M8k54K53j18J8K1q2J67o3M9J33j06q5J71j2
6755A26k81N3N6R8k5j07K21k17o0Pj9J57j2rJ07j71N4j49M8J35j42J86r9K2M4
$$ y = [154, -22, 6, -116, 92, -35, 58, 168, 28, 69, -130, 125, 154, -36, -105, -168, -8, 204, -56, 30, -32, -84, 49, 101, 43, -135, 114, -64, -100, -109, 131, 92, 46, -100, -78, 92, -85, -154, -182, -81, 114, -121, 49, -105, -145, 5, -188, 118, -105, -103, 9, 104, 72, 127, 56, -134, -149, 34, -7, 47, -162, -66, -19, 57, 63, -93, -17, 47, -51, 6, 89, 59, -71, -241, -101, -65, 126, -71, 79, -12, -124, 65, 8, -243, 18, -22, 0, 91, 144, -150, 66, 6, -71, 24, -28, 172, 12, 84, 67, -18, -5, -22, -79, -39, 18, 105, 23, -100, -255, -119, 102, 54, -143, -111, -186, 25, -3, -156, -235, -129, -69, -65, 222, -121, 73, -169, -116, -84, 13, 204, 0, 85, -56, -7, -69, 127, 265, -83, 14, -133, -119, 75, 44, 48, 57, 75, 13, 8, 55, 48, 61, 131, -4, 155, 56, 90, -82, 45, 187, -14, 34, -220, 33, -85, -67, -46, -128, 39, -24, 25, 158, 52, -33, 138, 126, -155, -102, -46, 52, 27, -80, 141, -76, -136, -129, -148, 9, -3, -12, 95, -76, -22, -171, -123, 12, -130, 56, -43, -21, 23]
6780B3j33P5o9rR5JK5k0p5J16O2j49J9k1Onl0J11q6O9lo8M8J58l46K38Q8J7j35
6809BJ4Q7j62J09p8l9Q8j22P8O2N1l1j79N3j17J75L7J6n3j1L9k3o4nK9J7LJ95
6837A71j87L3q6J09lRj19J22J1j02J40p3mJ68j69Q7j49M8p3P0J03j07l4O4J5j24
6863h0K55p8j35K1O5J5q9P1P9k28J53p9mj7j5Q4j85Q7M1m6J36q2J00j13J50k17
6889a11j0K10o7k9o6O6R4K1j35k8P0Q7M4j65N4J1nM4j08j4J04k5p1J08r7K61j28
6916A15k09K3J18k90M43k11o3J66k40oJ3K46M2j22J61j79O8J90j99n4R4m0j02
6939c6j7N9j16Q6o4K49j75k5p6Q0j45L23j92O0l5k5J06l3M4r3m0N3N5p2J56K5
6965A52j25N4o8qp6kp8K58j31J3k16K64Q3j4K3n0M7j02l1M0Q6j66k1J05l8%r2
$$ y = [23, -110, -35, -104, -113, -18, -17, 8, -12, -87, 29, 91, -58, -39, -60, -54, -59, -89, 22, -64, 5, 2, -66, -18, 140, -206, 32, 120, 137, 2, 16, 103, -59, 50, -28, -67, 21, -101, -23, 39, 90, 59, -120, -67, -184, -9, 28, 44, -9, -20, 19, -4, -68, -73, -44, -27, -24, 171, -16, 17, -69, 40, 37, 46, -73, 49, 60, -42, 98, 25, 21, 189, 20, 107, -42, 6, -67, 3, 106, -1, -35, 29, 44, -80, 175, 97, -38, -17, 48, 63, -26, 45, 124, -104, 49, -30, -34, -51, -66, 18, -167, -80, -39, -85, 51, -31, 69, -44, 106, -111, -121, 89, 22, -7, -73, -7, 87, 108, -27, -55, 15, 102, 146, -19, 35, 46, 41, 85, -23, -37, 67, 42, -29, 79, -18, 243, 115, -94, -71, 47, -243, 200, -11, -74, 92, -148, -154, -141, 105, 147, 25, 186, 7, 75, 265, 66, 12, 106, 66, -36, -53, 6, -110, -24, -88, 161, -14, -39, -115, -35, -180, 143, -49, 11, -24, -49, 57, 24, 68, -25, -65, -12, 43, -29, 127, 152, 27, 81, 13, 5, -71, -73, -151, 107, -24, -11, -227, 37, 120, 106, 129, 79, 126, 24, -7, 33, 119, -47, -68, 37, -1, -1, -93]
6992i3n0l0J82j28J01Pl5R0m6m2J89k3J18p6k72J1J37J05k63J0M7J28j42J18J8
7017F1J3l9p6M1L5j35M4J26l6o4o5P3k4j9M6J46q6J7R6k63K52j03j46J9O2N1R0
7044A16J24r2j84L9J19j01p7J78j27N6o6p2J95J12l84K00rj2J02j75PJ97j72J9
7068gR5j89KJ14J16j23j09J38j6r2J16K9j04m9J26q7J63M8k00Q7lrM3j47j7j8
7094i3PJ18M7k48J97K32j71lj60lJ17o8J9K21k41p3J43j8j06J79j58l1J52l7L1
7119E3M1%l8qPJ02j25q3O4k61K79q9J02j48M6P3j42K27k20L43j44N8J0k26J45
7144F6l6K9r5l4M6P2J7k4j45Q7M1p6P2j03J6J3lJ63M3k73Q1M0j41K56k91K34L2
7171H7j29J91j55q5K70l85L76j27M8k03M1L6J50m4m3o7r4M8M0J43j35LJ8K1L5
$$ y = [-93, -143, -173, 9, -119, -18, -11, -46, 44, -2, -44, 145, 122, 240, 164, -108, -97, 40, 145, -118, -108, -61, 67, -75, 43, 61, 74, 35, -41, 0, 35, -100, -56, 70, 34, -30, -95, -22, -46, -65, -19, 127, 41, 58, 154, -109, 143, 40, -106, -87, -25, 26, 116, 240, 148, -36, 3, 122, 21, -56, 122, -5, 51, -15, -87, 108, 220, -164, 36, 27, 15, 117, -58, -51, 146, -26, -7, 88, -101, -99, 15, 131, 8, -101, 37, 21, -71, 45, 74, -30, -79, 47, -40, 123, 171, -29, 58, 55, 46, 89, -58, -75, -93, -86, 32, 79, -169, 28, 260, 89, 86, -74, -77, 40, -28, -9, 212, -29, -102, 41, 23, -83, 96, -62, -93, 59, 22, 53, 94, 94, 56, 48, 55, 157, 32, -51, 13, -248, 31, -58, 44, -104, -58, 15, -127, 100, -120, 223, 79, 137, 147, -79, 66, 30, 59, -36, -70, -24, 48, 65, 41, -104, -17, 24, -52, 20, -83, -67, -54, -57, 106, 149, -124, -43, -3, -144, 112, -179, 55, 87, -42, 149, -6, -91, 179, -206, 170, 43, 91, -112, -71, -35, 115, 71, 28, -39, -133, -85, -45, 98, -37, -34, -16, 5, 40]
7196D0j06J8n0K64k59O6M7r5Q5K9JJ44j39l7l0j13J07M4l4j32J80l4m3j11J02
7221e6R4p4R9j06m9M6j38L05q5j7j63N7J62j63R6Ql6M3j08J07O5p3J81j08j57
7246g0L0J47k52J93O1k14R3j21P2J18o2M6j7M3mk51P0K25j90P6q2j8J55q4l5O9
7272b%O4K2P3r6J49k8k97R3J12m7Q4q0q5R6o5nj13J63p5J7j60L19k57J13P4r3
7299b4M7J5jO8o1q4K6oj6R5n0p2m1Q1P1m1M4J24j01N0k10O3j2Q6L5j60k9K05j53
7328e1%J43k26J40K2q4N4k9k4P6J2QK0r8r7J15p6J73r3J0o2J74n6q3O8K9j03J06
7356F8J6R1k37J25j03K1J23o2k2J0N4o2J06j2j61n8K05j12mN8p4n9J03j76K01
7381C9N0o6J42k42o6J50O3j34K79j37q7K8m8K7j06K9K51r3r5Q1k8K8k4m3J59j50
$$ y = [40, -66, -48, -98, 166, -93, -27, 20, -75, 10, 39, 40, 184, 45, 8, -22, -135, -28, 16, -18, -150, 30, -4, -47, -158, -56, 38, -36, 63, -43, -92, -46, -184, 121, 36, 19, -144, -87, 75, -88, 8, 16, -20, 23, -85, 22, 87, 14, 195, 87, -70, -40, 107, -145, 48, 109, -105, -12, -133, -61, 57, -5, 41, 24, 67, 63, -188, -118, 107, -83, -7, -89, -107, 48, -36, -71, -2, -2, 62, 84, 157, 61, 210, 182, -115, -22, 90, 43, 127, 47, -38, 58, -7, -12, -125, 38, -37, -20, -180, 139, -118, -5, 69, -24, 23, 38, 37, 105, 44, -40, -14, -20, -36, 59, 9, -63, -104, -23, 48, 7, 51, 175, 74, 124, -86, -23, -35, 51, 86, -74, -103, 102, -51, -51, 92, -134, 6, 28, -56, -2, -31, -55, 21, 33, 41, 61, -37, -134, -19, -95, 78, -15, -5, -67, 107, 51, -32, 36, 65, -38, 68, 84, 175, -62, 63, -40, -19, 104, 42, 20, 30, 84, 22, 128, 116, -45, -103, 102, -10, -14, 44, -30, -89, 14, -162, 39, 89, 23, 165, -77, -143, 7, 70, -64, 215, 78, -9, 19, -29, -2, -108, -79, 172, 79, -16, 65, 37, 65, 41, -2, 157, 7]
7407GR8p6RPj08P2O3m4j13J77j70L4J07J12rj62l5J77j76QJ2j33K86m3p2m8J71
7434A51j78k3K38k04Rp7P4L0J64Jj59J31j61j97N4K36j04j38J97r1J22o1j25J57
7458D6j22J38l8M7j53N2Rj43J94K6NK5K5L5j63j17J15n9J58j26o4K49k71Q2M9
7483aJ47j46J1L2pn4L9r9K50q7j42P7k09K03j7m1j22M5L15k57J22qL6k09L03j51
7509C0j35J97j99P7L6J44r4j64M5Q8j15Q8m1J0l2M4J12j52J83j73J70m0n2M9j6
7534F0O5l11J01R5k3K6j42J66l6om8m3J47k43K38j4n5K17k79mL9n7K43j51l5l1
7560h1Q9r5J39j01np9K14M5o7J7j81K06k93K49L7k07K05j07J8k3q7K9j4J61n0
7585A9Q6n9J3l0j10r6J90o4J3k6J67rr5OR4q1j2P5l3M6j01N1p5Q3k0j07j5K06
$$ y = [7, 105, 29, 38, 45, -63, 9, 72, 28, -85, 92, -78, -44, 63, 175, 166, 4, -31, 146, -30, -22, -10, -143, 143, 100, 28, -20, 151, -27, -50, 188, -16, -7, -84, -10, 20, 184, 185, 26, 157, -4, -201, -147, 89, -15, -153, 44, -47, 75, 14, -111, 46, -76, 62, 24, 71, -82, -30, -21, -164, 30, 56, 61, 86, 111, 146, -17, -134, -19, -78, 80, -46, -110, 139, -132, -50, -1, 146, 0, 11, 43, 36, -18, 21, -78, 172, 85, -57, 20, -189, 14, -3, -44, -166, -121, 194, -63, 59, 51, 87, -122, 181, 30, -105, 92, -107, -30, 6, 150, 56, -108, -63, 25, -90, -2, -43, -33, -65, -21, 91, -61, 122, -51, 119, 79, 27, 76, 60, 125, -186, -85, 10, -13, 13, -129, 37, 1, -5, -53, -96, 51, -192, 46, 32, -23, 194, -85, -89, -50, -107, 136, -15, -50, -81, 8, -87, 52, -49, -54, -133, 81, 126, 59, 76, -105, 101, -192, 57, 94, -113, 92, -15, 3, -20, -107, -78, -92, 69, 19, 105, 46, 59, 29, -81, -177, 13, -51, -38, -64, 103, 94, -1, 5, 99, 18, 6, 81, 48, 94, -7, 44, -31, 52, 32, -75, -90, 116]
7613A16j91M9J18k22k9J08L7P4m9K4J34k03P4l3Q8Nj46P0K8K0J9Lm4m0RL0k6l0
7641gJ48j18j11K13j03K3k0Q4j35Q1n4r8J43k3l3JQ9j08j08L00j42q9P4mrJ34
7667A28k26J49j07J30J9j96J39q4k7J16p7j76M5K93pk08J56j22j10K19q4J03K3
7690I6n1P8j65J5m8J05L5o6J14n5j91L0J09J6j02N3k6M4n0K41j54q6L0l5LK1Q3
7717D4j83M1P7M2p8M5m4J15j04k7O4j5n2J79mj25J52k95R1J42n4N3M2k43j7R6
7743e8P5p9J14j96J99m6P5k5k89L74j11qJ50k40l6K6M3K02o2l0p2J22p3j57J13
7768A1Q6j18j34J12J14J7l0J39j37q0R7k8k2j2j63oK43k66J70k07K53qJ6Qj5r1
7794e1L0jm1j2o6o7K21k0l1Rr5P2J36j33J49j99J13n9R6P4j94P9K9n1n4J07j36
$$ y = [116, -75, -26, 92, -130, -159, -51, -14, 60, 11, 35, 169, -34, 40, 7, 95, 100, -46, 24, 52, 72, 91, 94, 50, 10, 19, 49, 23, -7, 141, 23, -88, 125, 22, 45, 25, 109, -26, 55, 1, -97, 46, 23, -10, -9, 80, -28, -136, 164, 22, -67, 7, 3, -6, 128, -98, 51, -56, 74, 93, -103, 36, -48, -75, 41, -36, -212, -167, 126, 119, -89, 67, -55, -165, 54, -30, 73, 96, 45, 123, -42, -27, -75, 30, 65, -1, 113, 58, -133, -103, 6, 22, -80, -27, -53, -9, -59, 182, 28, -58, -28, -63, -60, -39, 44, -139, -98, -21, 21, -57, -12, -56, 59, -45, -72, -8, -23, -75, 104, 100, -25, 127, -168, -77, 65, 11, 64, 106, -137, -154, -58, 17, -62, 52, -144, 55, 9, 84, 59, -230, 144, 33, 25, 175, -65, -101, -75, -32, 170, 108, 78, 6, 128, 55, -102, 11, 97, -21, -155, -43, 71, 88, 58, 197, 60, -20, 77, 49, 27, 15, -148, -154, 89, -177, -7, -214, 39, 31, 47, 55, 40, -51, -21, -22, -63, -75, -141, -208, 13, -7, -38, -29, -124, -52, 84, -49, 100, -99, 14, -45, 51, 125, -69, 10, 39, -12, -66, 41, -95]
7821i5J15K2p6P1j28M0J4PL5K01k34R7R5r2q7k7P2O1j9j57P9P5K1r3k79L40r1
7848c3Q0n0l8j8o9J27n9K22j82j54J99Lj02P3R6j44K0P9mK7Qj29J67j44k5J20
7874G0LM9r5k19K88o3n8J62j74n5J92j11K9j8j36J27K1j03K65j68J8n5Q6k15K44
7899H4j26J1O1o3p6J89j3j86N7P2M1q8Q0p0R9m0m6L1J2o0J88j71j55J77L8l9j03
7926i6N7pPK6L2O1m0l3n4l4j8J94j10l7J3L0K5J7O8j98J86l0Q5r4j49J5P5M0P3
7955A04o0o9J8j63J85J04K2k36L7m9M7K8k3L4j24J87k4R4j10r7P4k6J40l06R6
7980a17N6J0P8m0m9Q1o7p6J31o1J06J1l8m5P2R4q1j6j3j64J40n2Q7Rj1l9J18j73
8008d9pJ14k9j5jo1J65qk60P5K44o5n3j05N8K4k6m6R4q3oj69K31q4J4J74k82L49
$$ y = [-95, 20, 42, -34, 37, -91, -51, -37, -30, 5, 206, -28, 69, 164, 72, -15, -42, 30, 91, 72, -85, -6, 69, 90, -3, -282, 58, -33, 47, -3, -41, -59, -128, -1, -60, 162, -20, -174, 25, 28, -74, -1, 95, -49, -29, 50, 46, 73, 81, -48, 119, -25, -50, 70, 73, 122, 27, -192, 96, 33, -25, 137, -37, -92, 100, -11, 18, 0, -136, -9, 12, -91, 174, 6, 24, -31, 55, -160, 84, -42, -31, 30, -33, -109, 80, 67, -119, -62, 10, 51, -37, 43, -27, 72, 32, -14, 17, 29, -31, 157, -14, -169, 8, 46, 7, -96, -39, -46, -39, -13, 19, 80, 40, 7, -47, -81, -99, 95, -15, -52, -39, -9, 16, 33, 101, -97, 89, 59, 144, 50, -99, -84, -9, 31, 104, 44, -25, -7, -170, 15, 119, 141, -95, -58, -107, -60, -32, -55, -21, -145, 42, 18, 112, 2, -95, -21, -47, 93, -213, -117, -61, -51, 27, -13, -62, 19, -48, -124, 7, -54, 52, 63, 25, -20, 52, 146, 65, 49, 36, -128, 12, -40, 47, 56, 45, 6, 124, -49, -56, 58, 29, 14, 13, -48, 117, 109, -151, -76, 168, 103, 50, -55, 3, 27, 1, -45, 49, -34, -40, -209, 22, -62, -48, 126, -156, 193]
8036A93j99J8m1O4p1j96J52M6J94m2j39N9k3J08o4Om4n2P6o5P6J7m5nk5RJN0P
8065F5N7j09Oo5M4Q2r7O2o4j16J18J93k17Q4j58K62k54O6M1K4J7r6P6O3j01q4
8091a01K9M2K2J19rN6j32J9M5j62KnJ25p8J2j01P9R0q6N2p4p1R3J54j26P6j02
8118c2k9M2j4J44k63J76r2k8j8J66M8j85L6K29j46l3J32j21o0r5J54O0j12l3J23
8143D9j32J96k01J4Q8J20j23q2K27j14J54k12n4Q2l1%l6J25O3k58K57k45J06j07
8167a14J93qk8N3o5kL3k9K6o6k6K8O2j67J48n3j3Q3j31K5R2j9j70J96
$$ y = [193, -6, 12, -29, 35, -36, -232, -80, -34, 160, 118, -21, 38, 15, 123, 59, 65, 21, -31, 45, -20, 56, 73, 28, 23, -2, 7, 8, 58, 65, 122, 13, 19, -46, -2, 80, -17, 45, -19, -135, -17, 176, -41, 43, -115, 147, -107, -41, 0, 24, 41, -55, 21, 84, -17, -101, -72, -30, -8, 111, 102, 158, 26, 45, 90, -72, -70, -75, 50, -28, -16, -117, -38, 52, -34, 18, -56, -127, -34, 120, -6, 70, -32, -61, -19, -33, 111, -152, 24, -68, -96, -114, 52, 100, -85, -49, 180, 34, 1, 133, 12, -48, -143, 11, 71, -41, -74, 49, -83, 113, -88, -74, 14, 134, 11, -71, 156, 42, 196, -16, -70, 12, -19, -19, -55, 70, 133, -125, 132, -113, -7, -114, 79, 71, 43, 96, 31, 29, 62, 33, 59, -7, -33, -5, 57, -110, 38, -15, -28, 55, -76, -51, 41, 22, -148, 48]
8191D8
$$ Imaginary data points
##PAGE= N=2
##DATA TABLE= (X++(I..I)), XYDATA
0@%%%%%%Qq%mNrJ6j6K4l2M0n1N9p2Q8j04J20j40J64j88K16k52K92l34L82m33M88
33B59n51O21o98P81q73R72j082J205j335J477j633J803j990K196k421K664k933
50a538L231l560L928m338M798n320N918o614P430q401R585j1059J2949j5469J8992
65A0532k4256L2908m9422R1087l70477o35186J095617R1385k55354O29461m81138
76A35157r46076P18307N42925l74867J95195j02690p13802L54552N66673l07688
86F7686n5974M8424m22923J96329M88856k77661k32584J64142r1648O2111K94263
97B41021j27356k63436j136J05137K32411Q2219k52888j32122j1410k946L28556
108A98050J55343m10312j59815J31605q7120K12329L23381l48658l00017J86077
$$ y = [0, 0, 0, 0, 0, 0, 0, 8, 0, 0, -4, 1, -8, 8, -8, 16, -16, 24, -27, 32, -40, 48, -56, 64, -76, 88, -100, 116, -136, 156, -178, 204, -229, 259, -292, 329, -369, 412, -461, 511, -571, 634, -701, 776, -857, 946, -1044, 1152, -1269, 1395, -1538, 1693, -1867, 2061, -2277, 2521, -2799, 3119, -3495, 3935, -4466, 5119, -5940, 7009, -8460, 10532, -13724, 19184, -30238, 60849, -309628, -944814, 150803, 242188, -13166, 616295, 135157, -810919, -92612, 450313, 75446, 270641, 167951, -545851, -191299, 375374, 67686, 11712, 60136, -362787, -166458, 322398, 44737, -187847, -23705, -115353, -53242, 241021, 113665, -149771, -150907, -45770, 186641, 268860, 15972, -116150, -127560, -130506, 198050, 353393, -56919, -216734, -85129, -172249, 40080, 363461, 14803, -285214, -99137]
118i9137k6583Q4828L75655k24996l85487K22194N8764j20747L47013K9108m68425
129b07813P1497K52784j67020R2524J95535l24903j34127L10253j3536j40436
139f5242J28754p2939j69864J96243J25451j73855k1153L7360j01394J25984K11497
150B20842j78448k02926J11819M4232M113J96705n6937l32322L1106K22366j9043
161D1507N6672O6843k94947j37816K96035J14077r0504K0719j34586j60618K08229
172a4389J76770j07255m3066m2872j17153J23613J77129r0047j00878n784k9235
183g3167P9654J10597q0557j03494R839L5504O7568K8964q0009m8264K485K1167
195b9713J05668J8985j45213k7771O8187n149P2224M5620j63117m0946J29601
$$ y = [-99137, -125720, -40892, 334763, 109767, -275720, -53526, 5238, -115509, 231504, 260612, -207813, -136316, 116468, -50552, 41972, 237507, -87396, -221523, 88730, 75194, -65242, 63512, -9427, -179291, 16952, 142403, -31452, -52605, -15245, -116639, 9345, 220842, 42394, -160532, -48713, -4481, -368, 196337, 139400, -192922, -161816, 60550, 41507, 98179, 165022, -129925, -267741, 28294, 142371, 51867, 72586, -62000, -222618, -14389, 162381, 55126, 12060, -30812, -147965, -24352, 152777, 62730, -38148, -43932, -73167, 6487, 117084, 36527, -66967, -57128, -21624, 45944, 74908, -5101, -53365, -50880, -29713, 75955, 94940, -50273, -78044, -9857, -15006, 57218, 102838, -60279, -101225, 28376]
206B8376k3637k348R5856j18856j01269J47939J7195p4277R5020m1977j38273
217a16251J27487P3760j34829M8640O6942j30103L4021J11560j09139j5812J11272
228F7548q2498m1243J15807n4644p4162J08570m228q4528O3064M762o9552P1077
240A9973L0688r0234K1473M7217n0265J9835M2518n9254j0694M5272j9674N171
252B026L1473m9612k3241N3414O049j4109Q671l3160j4162M8237P614j8618P095
265A1677k9707k3513N0603K5116k5612p809k5880k0404N7032L4425m0382j5158
277i612m809k2861M0682N0475l2908l2825l893j8260L5208O2701l3503o0951L086
290b7470O605J8586N0333j8312o7553n419K2457J9512M3769q211p5932j7192M9326
$$ y = [28376, 4739, 2391, 98247, -20609, -121878, 26061, 43256, -31021, 63999, 22022, -116251, 11236, 84996, -49833, -1193, 65749, -64354, -30333, 81227, -27912, -43724, 67548, -14950, -56193, 59614, 4970, -69192, 39378, 35150, -49378, 13686, 18448, -51104, 19973, 50661, -39573, -18100, 29117, -21148, -1313, 41205, -18049, -28743, 16529, -3145, 2026, 33499, -16113, -39354, 14060, 20109, 6000, 14671, -18489, -32651, 15586, 23200, 4582, 11677, -18030, -41543, 9060, 34176, 8564, 755, -25125, -45529, 11503, 45928, 5546, -9612, -14421, -37282, 3400, 53875, 20967, -11858, -15751, -34011, 1197, 63898, 30395, -30556, -27470, -20865, -2279, 48054, 29742, -37811, -43230, -20773, -1261, 42508, 34297, -41635, -58827, -9501]
303i501L5746K0816j7780o7223j5922N9281M1670K417k6499o0694k1823O1878
315B366N8158r831n3263n9018m407P2261N8373k5425o5856m3741J3494P1099N7424
328G1634k5470p5308m1864L1269P8972M9032l9268q6013l4830N2281P7183K2561
340H0179n1314p8834k8494N7216P8578J0081o3455p4614j6326P0820Q6074n641
352F4270q2280n8808J1415P3806P5415j5718q8663n0389K6479P2295O4076k5445
364F6453j00155m7556M5466P4245M3318m1053r8805l1320O1100O7183K6370m1960
376B3286q9983k0652P4100O7481J4582m8572q8631n985R2619N5841j1387m8055
388A4644q0730m213J03646M8077l8711m3572o8488j4795J15850O0546p1102n1586
$$ y = [-9501, 26245, 47061, 29281, -37942, -53864, 5417, 47087, 49504, 23005, -37689, -59512, 2366, 60524, 50693, -2570, -61588, -65995, 6266, 64639, 39214, -26642, -70383, -56889, 14210, 71634, 46164, -29144, -71008, -39739, 39233, 88265, 48997, -37016, -71846, -19565, 57618, 80179, 28865, -49969, -78463, -21247, 57331, 67412, 3957, -70657, -86983, -16163, 69911, 64270, -18010, -76818, -65403, 8403, 83818, 68100, -20563, -70952, -44473, 27822, 91898, 66453, -33702, -81258, -35792, 38453, 81771, 40718, -58087, -89407, -28307, 38876, 65246, 23286, -66697, -87349, -13249, 54232, 68814, 20242, -68389, -74374, 18245, 74086, 62699, 14644, -66086, -70299, 33347, 81424, 42713, -859, -69347, -84142, 31708, 92254, 21152, -30434]
400c0434l3788j5068J07435P6366r0091o5527P410r617P5029R1398q4827r6969
412f8683L0347K0938L9543P6112o7779j14779L7872N8727J1300M0042m1609j07981
424h5950K5858Q8073J2552o10l4474q3352J6675J00709K7776l6753m9828m7621
436f6945K3754Q2792L5789m0005p2581l5996M6873O8501K3529k8947q0144m4154
448h7534P2525P3422j0299k7548n2058n1899O6883Q8946l0304m5831j9208m0357
460f3262M2304R7575l0046p9448P37J516J7439P4760j1774r4509p487M7221J6835
473A1861L0286L145p8723l8696O7814N4633j1571k0846l8083m8491M3781R3106
485F8216j5501o7166p861k2271l139J02189K4426j07139j5663L1228l0884O6489
$$ y = [-30434, -64222, -79290, 28145, 104511, 14420, -51107, -43697, -53314, 21715, 113113, 28286, -68683, -38336, -17398, 22145, 98257, 30478, -84301, -46429, 12298, 23598, 63640, 22031, -85950, -60092, 27981, 40533, 39923, 5449, -77903, -61228, 39481, 67257, 30504, -19324, -66945, -43191, 39601, 75390, 35385, -37196, -73192, -26319, 42182, 65711, 36764, -43380, -87534, -15009, 58413, 48114, 20566, -31492, -83391, -16508, 72438, 42134, -3697, -22905, -63262, -20958, 76617, 46571, -32877, -32140, -30624, -13185, 61575, 49801, -44708, -52195, -4974, 11861, 42147, 45292, -33431, -72127, -4313, 50320, 38749, 17903, -20180, -68671, -24890, 68216, 52715, -14451, -22312, -44583, -47722, 54467, 78893, -28246, -43909, -12681, -43565, 22924]
497B2924P2559j11494n2470Q1966k4194m246R9097o5713j01520R0594K4141o2687
509c1043P0114q55j12327N7909P1724p5980J1268L9402p7777K0137Q3312n2879
521C005l0174L6970l6518Q316P0474l0888m2926J4029j5190K0606N1173l1073
533A7804k9171L097k8971L3752N6958m8882k0627K3699n3446K1329Q7467n8703
545D306m0282O4407n1891k7158J09975l4743p8043Q7259j6255q3518J00997J5758
557E0812j13431P4390M7508j17381M7794P2880j12681K3703J03329j00511k6959
568e0547J01408o8290l5762J15215m1076p9088P9920r528o5469Q3119J8623q6951
580c8426L1992L1120n8735K9416M9719n0372j3102L2018k4834q061L5759q8j9701
$$ y = [22924, 95483, -16011, -68481, 13485, -10709, -14955, 84142, 18429, -83091, 7503, 31644, -31043, 39071, 38216, -74111, -16202, 55522, -20458, -9190, 30212, -47565, -27428, 55884, 3005, -27169, 9801, -26717, -18401, 52073, 21185, -21741, -7712, -22902, -2296, 48877, 17804, -11367, -8270, -37241, -3489, 53469, 4587, -16040, 7659, -45787, -24458, 63009, 4306, -35976, 28431, -23460, -50618, 59357, 24614, -53429, 33830, 17575, -65943, 35054, 50812, -62619, 11771, 59279, -58102, -10308, 62572, -50109, -26406, 76923, -23588, -50547, 50861, -17429, -53191, 62024, 20948, -58140, 21780, 12252, -53217, 29902, 48525, -38426, -6434, 24686, -34049, -4633, 45086, -5286, -18388, 13630, -11204, -19265, 16494, 16406, -3295]
593c295r93N71m732j743J7835J7505k5578j8392K0409j0827o647M7620q047n2120
607b8434K0738J2912l1656M0189L0783o3805p315M2539l1009L614N7065m0861
619D760m5358N2439R41l9065M5335R677o3284K3221M5417m6779o587M4533l3141
632g891j8997N6841j3926n3144L3922J8620l4066L2441K3046o5304n409N4567
644B0700j6249m577M0466m6231m8929O0275K4026l3751K5457o885o6605K9606
656b2697O1357k9424j0912J6734m6196m740O5339m182l4911J3151j4109j8055
668b8645M6109J4837m0403k488J0083j1195J9854J9293l0493j9529J7098J1345
680E866M122K464j5817j8684O336K7201J2588j9590j8721j129J520K0047K7708
$$ y = [-3295, -4288, -3717, -8449, -10192, 7643, 25148, -430, -18822, 1587, -9240, -15887, 31733, 23686, -28434, -7696, 5216, -26440, 13749, 44532, -19273, -26588, 15951, -15058, -11444, 45621, 4760, -40598, 11841, 12782, -26283, 19052, 28729, -34555, -11334, 34083, -12696, -19283, 25250, -7891, -26888, 29953, 16027, -37117, -3195, 15425, -18641, 13800, 36846, -28458, -33867, 20700, 4451, -126, 40340, -5891, -54820, 5455, 29481, -4270, 21187, 14302, -52303, -22697, 38660, 9236, -1676, 15058, -31138, -35878, 29461, 25279, -9632, 3519, -10590, -28645, 17464, 32301, -8102, -10590, -507, -11702, 8152, 27445, -3048, -22577, -5479, 5866, 9988, 12452, -3365, -22049, -15713, 11488, 24076, 4486, -14235, -15364, -13844, 6203, 33911]
693C3911k2719l7456J0342J3975M532K7152r256n0922N789L3793m279J1067P877
706B3806m8547j0171M9260K029j5354J5020k6886k6797M7218K1825l4623N91J399
719a230k6222K7988L6668l4361k2657J6476q210Q511L5615k1735l9250J6237J4879
732B709r43K1957q347m2497N509L1144K787L119l946l3582m457L5364J1965r864
746A0918r255k1181n360L0266J8121j2323j7098j4172J374K5933J6377j1790j9135
759g325j2163O534K4749J1366j3048j7618j0996P647K4938O796j7583j3524o528
772a6755N298K3741P418k2684j2166L243M757J7475R450k3028j4729J2088Q112
785B220Q639P852j9958j8011J5733J4116Q7J864j5097j9024J4763J9978l356n371
$$ y = [33911, 11192, -26264, -15922, -1947, 2585, 29737, 20481, -30441, -24652, 9141, 4862, 15929, 23806, -24741, -34912, 14348, 16377, 1023, 16043, -10843, -37640, 9578, 31403, -3220, -2629, -1230, -27452, 536, 37204, 2843, -19814, -3338, -11548, -3037, 32578, 10843, -28407, -12170, 2709, 1766, 23723, 15376, -27121, -21612, 9532, 12319, 15438, 11492, -22090, -26547, 8817, 20782, 10918, 1663, -19518, -24878, 5388, 23509, 11186, -5912, -20084, -18710, 7223, 23600, 11810, -7325, -19488, -12954, 11795, 23161, 10113, -7505, -18501, -10854, 14084, 20880, 3297, -10227, -16755, -11457, 12284, 19702, -2982, -15148, -11905, -7148, 10327, 19777, -3251, -17980, -5892, 2220, 10859, 18711, -1247, -19258, -3525, 10591, 10678, 12542, -2555, -21579, -6816, 13162, 9806, 4435]
799D435j0678j6058J2322K4016k259j1763p399j0169R302K3538Q22j5107p932
812f930m235P070J9004J353j5547q545q62O120J3212N20j3984p732J989O903Q782
827G118j345j1287n069M704P732O505l676j0556j728O778P755L633o343j0492
841f271r7P544P038J899q613j1219J405Q486N996J398q681j0800K750R710M945
856E490J055o860r663L155J0090L204o1n006p839K562Q367J691r98m855o781L661
872b788O648j439n16l004o865N412P328m782j002Q20p156N023J0593p508l478
887b714M739o553J755J3235p265q858Q219m075l651J4334l790j4123Q992J542
901A787r220J2002L265j6764N000Q982j0223M739R330j2885k034J1029n845j664
$$ y = [4435, -6243, -22301, -9979, 14037, 11778, 15, -7384, -17553, -8251, 15287, 16109, 1002, -6930, -11165, -4095, 14909, 16262, 715, -7830, -8692, -2572, 10640, 11160, -2824, -10556, -8567, -1664, 7118, 5773, -5514, -10583, -5879, 1853, 8358, 4682, -5874, -7602, -824, 6931, 10564, 4221, -6271, -6368, 1176, 8214, 10113, 1500, -9719, -8314, 172, 6168, 7566, -1115, -11915, -9165, 545, 5490, 6545, -315, -9978, -6823, 3267, 6471, 6410, 1404, -6435, -3873, 4494, 6185, 5187, 332, -6449, -2788, 3860, 2421, 1905, -1099, -7964, -2552, 4776, -6, -1008, -188, -7344, -2321, 8272, 764, -2714, 2025, -4528, -2773, 10462, 3197, -5661, 2558, -1517, -5168, 9166, 5376, -8747, 245, 1787, -7433, 4569, 7834, -8930, -3930, 5052, -5171, -432, 8898, -3987, -6021, 5008, -837, -2501]
915b501R113o120n615P483j353k821M737k299k849K553j309N64K230l375J226
930c36K036n118K920M308o520K144N615r262J519R098r057l70J0590j0409l941
945f783J4811p666q400J5223m734j2698J5519M19j5645J1761O104j5953P506R177
959H641j5169K003J2834r487k691R634o897n565R484J154n587K116M05m342N97
974b870O171J318o685n90M403n238Q86J1715p832r977J2633j941j1203J6239J979
989I008k0913J1723J0289k0929R092J6719k3505N64K3190j9660p598K5669j3265
1002C84j4350K6019o375k1875K0818L189k0601J6857Q379k4313O357J4702j4361
1015e170K994J4231j4422o791J2184j657k979P599k837q098O73N156K621k651
$$ y = [-2501, 6612, 492, -5123, 2360, 1007, -1814, 2923, 624, -2225, 328, -981, -417, 1813, -1562, -336, 1700, -3418, -498, 3810, -2710, -566, 5049, -4213, -2694, 6404, -2653, -3023, 7567, -2842, -6783, 8028, 362, -8038, 7185, 2451, -10247, 5272, 5691, -9954, 1807, 7911, -8042, -536, 8641, -6528, -4525, 8309, -1178, -3869, 5765, -1132, -6697, 2787, 3941, -1646, 470, 875, -3467, -2870, 3301, 4619, -2066, -2656, 1747, -3491, -2605, 9110, 1278, -8699, 3934, 1993, -9210, 7029, 9008, -11905, -182, 10107, -10822, -1730, 14989, -8516, -7952, 15238, -4422, -12020, 13649, 384, -13966, 12053, 5678, -16197, 4621, 7810, -12791, 4066, 12445, -11868, -5511, 9191, -5170, -2176, 12055, -2367, -9158, 3026, 1369, -1610, 5989, 3152, -4946, -4273, 883, 3504, 853]
1029H53p51K349p257j602J3069m297r406J2351k472j5236J5615O756k0649J0894
1043B17J3546k3750L787K0965k0546l384K6088j6747j4518K4842p933j8321K5796
1056A0042N11k6132J6291P847k3230J4054J6973k4343n56J9008j5892l938K3017
1069A3652q640j5770J4596R45j3612J1635Q130j4523r88R351o794l460J0792r16
1083D398j0203L805M452p909K544J0107p084o230R107k511p207J1704K695j3469
1097e801M992P133j1764L764J2915j2532o546J4300n831r103J4969q41j6512R629
1111a228Q353j4127M230J1733j4161l211J6853o345r728J3255j714j3345J2423
1124B988P646j6046K402J1006j2562j042J6532r115j2340J3579L20j2338J2041
$$ y = [853, 102, 2451, -4806, -6408, 6661, 2364, -7042, 5309, 2837, -12399, 3216, 9972, -10677, 217, 13763, -9987, -6200, 14765, -5781, -9165, 16923, 176, -14342, 10500, 2567, -15754, 10042, 10553, -15579, 712, 8559, -14671, -617, 16356, -7987, -8543, 10465, -5427, -9365, 13652, 5012, -10758, 3838, 4783, -8829, 2806, 10936, -3587, -4575, 4776, -2018, -5478, 5314, 4398, -5805, -2000, 2452, -5457, -2913, 7194, 110, -6120, 2987, 476, -6731, 4973, 7668, -5801, -809, 6324, -5440, -1676, 11239, -1293, -7839, 6461, 630, -8473, 6496, 5655, -10857, -1228, 7125, -7002, -2772, 8961, -5200, -8411, 8442, 2097, -7631, 5624, 3910, -9435, 2988, 10634, -5412, -3010, 7996, -4566, -5608, 10924, 1809, -10531, 3048, 3368, -8970, 3071]
1137C071N636j7737L459J3037j0916r32J3645r939q755J4240n0j0205R458J410
1151E422j2879O757Q597j0713n0Q687q522l259J2042l626r782Q446K620r622N275
1166f07P263j0190j973J0778l883o144Q741n56r665O686O192r374M88P379p159
1181b024j901R569m475p099Q022o4p150O801K822r897L016P278o771j63O898o430
1197a568m087R605p42o400M813N56p158M347O337o319k222M857l283k159P047
1212C624n88o945K779L059m459K541M503o317k091O438j797l202N690j611o455
1227d831M916L577o175K056M023o517K15O948m141l331N670k103l780N544N31
1242B602n352K627K375m146J756K688l728l78L339j766j211K581j232k043K208
$$ y = [3071, 8707, -9030, -5571, 7466, -3450, -4382, 9263, -676, -9431, 4809, 4759, -5446, 4012, 5422, -7457, -700, 7897, -2816, -2866, 5821, -2701, -5960, 6082, 2456, -7326, 1120, 3740, -5882, -607, 6656, -3534, -5507, 5271, 1388, -4756, 3985, 3429, -6236, 450, 6642, -2732, -2244, 5135, -2024, -3925, 5644, 1169, -5930, 2092, 2028, -5122, 1679, 4501, -5396, -2380, 4898, -1873, -2036, 4862, -1568, -5655, 3950, 3208, -3192, 1621, 2177, -4981, -634, 5703, -616, -2838, 2019, -1264, -3423, 3624, 3036, -3909, -1130, 1929, -2530, 11, 4514, -1803, -3894, 2544, 747, -2455, 3235, 1624, -4831, 85, 3662, -2513, -457, 3566, -2951, -2736, 4212, 71, -3260, 2410, 307, -3473, 2071, 2602, -2750, -123, 2252, -1894, -138, 2550, -1178, -1556, 1783, 17, -1194, 1387, 155, -1888, 320]
1257C20O05j911M35J317p96o90R48L71j632R23J523j603j001K279r00j394K542
1274A336l23k954J946J285k577J575J495l831L88L486k069n25K619k897j434M268
1290A788k97k410J591r45k083L354J334k936l7K08j220K369J654k205j493L75
1306i53j36K035J180j698j965k95J138K277M18k402j133k83J149K982M8l373q44
1323a855O57O65K993J01l959j050J783Q25K480J61m864j089L163Q66J538K52n158
1340b491j551M179J574M83k9m886j783N055K302q99o93l958j725N354K898j696
1356B134j763l390q14N013K865j974k370l295lN562K234l197k123k628P3O276
1372B600K199m412k249j305o5O413K341n891k342K39n9O173K192o948l034K342
$$ y = [320, 925, -986, -551, 766, -30, -720, 228, 599, -1033, -110, 1413, -190, -1191, 1088, 188, -1206, 1336, 1013, -1941, 5, 1290, -1287, 288, 1783, -2048, -1660, 1826, -243, -768, 1851, -1046, -2480, 1788, 1491, -919, 672, -273, -2356, 998, 2332, -604, -641, -433, -1653, 716, 2370, 165, -1328, -953, -1089, 946, 2126, 428, -1537, -1832, -694, 1583, 2001, -401, -1534, -1817, -668, 2314, 2362, -1011, -1855, -1198, -533, 2460, 2561, -1398, -2448, -665, 160, 2640, 2801, -2063, -3152, 11, 877, 2415, 2667, -2491, -4042, 137, 1711, 2194, 2165, -2721, -4504, 551, 2853, 1954, 1261, -2697, -4422, 932, 3830, 2134, 371, -3019, -3833, 1180, 4045, 2071, -299, -3594, -3597, 1965, 4199, 1002, -1121, -3749, -3676, 2600, 4799, 387, -1862, -3167, -3232, 3181, 5522, -369, -2711, -2472, -2531, 3642, 5834, -1114, -4148, -1806]
1388a806L77M756K601p647l902M224J595K452K740p061n180N413L465R15J208
1403D150n475n229M761N230L21o90n021l972M497N005M50j824n354k964N714M330
1419C929o30j890n314j999O743L809k208j925m228k121P893M047m721k076k301
1434b992k510Q095N251p532l498Q46k185O132O871p767o430L263J01L081P082
1449G808n495r362L248M285J111M435l382q869J326O294K023P46k552o506qO050
1465A152L385j225m089l500O35M482L968j495n782k136L168K934K304j60o973
1480c332k561O353K932j138J76n031m432P594N460m554j483j767m671N751Q106
1495G403m672n377Q62k262K577Q566k569q424J31K154R47N225P23q469k512M898
$$ y = [-1806, -1429, 3327, 5928, -1719, -5621, -1397, 198, 2650, 5390, -1671, -6851, -1438, 2027, 2942, 4150, -1325, -6554, -1793, 3437, 3758, 3068, -1953, -5925, -1428, 3577, 4027, 2203, -3151, -6115, -401, 3929, 3299, 1409, -3905, -5904, 839, 4648, 2440, 515, -3713, -5834, 2059, 6106, 1385, -691, -2992, -5502, 2593, 7844, 312, -3186, -2340, -4525, 1607, 8478, 711, -5719, -2456, -2355, 726, 7808, 2313, -7049, -3801, 484, 1595, 6030, 2648, -6221, -4895, 1399, 3422, 4168, 1616, -4890, -4898, 1152, 4537, 3312, -777, -4277, -3642, 840, 4808, 3313, -2469, -4605, -1437, 1497, 3801, 3641, -3332, -5893, 460, 3392, 2254, 2430, -2601, -7033, 561, 6021, 1467, -16, -1783, -6454, -703, 7403, 2731, -2646, -1784, -4046, -1469, 7097, 4528, -3896, -3765, -1611, -664, 4561, 5284, -3185, -5697, -799]
1511g99K537J263L42m644m719M216N684r11k281j444l729J589P433j12o032k67
1527a874K84j423O153K854q037k216M364r96J713M903o228n944O029K424k215
1542b09L467j933p420M079O063l065n36J461n711K03P435o06m118Q69j252j801
1558c074M722K440m582j641J903j129J175L178j874l890J373K509j308P06J347
1573A855l340j029M206Ml246K219K97l363K561L033m391q15L961k702p99M462
1589B913k405m044M118J334m120K940J561n213J450M653l697j240M545l116k812
1604c133N157j2m703L402J480m849K228L044m093K97L937l543j529M331j800k392
1620b178M174m28m335K534J898l070K055J797m080m34L436r12q11J805j625j999
$$ y = [-799, 1738, 3001, 3343, -1301, -6020, -1804, 3880, 2969, 688, -756, -4485, -2896, 4537, 4425, -1607, -1874, -1590, -3013, 3140, 5994, -2043, -4259, 105, -891, 822, 5725, -503, -6447, -418, 2006, -209, 3258, 1325, -6095, -2016, 4047, 982, 446, 1907, -3804, -3601, 3834, 3228, -890, -21, -1273, -3074, 1648, 4088, -494, -2135, -232, -1361, -186, 2992, 1118, -2772, -1399, 1110, -198, 508, 1855, -1485, -2514, 1692, 1696, -1550, 669, 966, -2397, 164, 3197, -1194, -2009, 1952, -750, -1549, 2913, 508, -3536, 582, 1916, -2204, 736, 2297, -2916, -1466, 3187, -510, -1750, 2795, -321, -3133, 2024, 2012, -2691, 711, 2191, -2658, -430, 2614, -1479, -1182, 2755, -788, -2317, 2014, 214, -2178, 1996, 1568, -2767, -233, 1665, -1405, 650, 2447, -1633, -2067, 1369, 457, -354, 1451, -174, -2173]
1636b173K290J206j162j55l78q45J070J548k93k047l45J041O43K83R33k107k346
1653b837K793K167j919M27j74l814J742N604k684k670J943k608r33O651o19n566
1669b497J748K55k540N680K242p399n35L571k082K817L798o496l238N268O5n42
1685A15L644l837n218M753L250j776P23j760m225K918M595j118j718j332k507
1700c493K099M477l4k844k387j046K898L534q5l438k755o4L984K715j380k351
1716a70k960m10M885L185l121k842j154n35M180M094l944m193K68J137K428L840
1732D688k909n468M53K643K135K617k185o035K39M314J836O61j531m956p27N040
1748H15K747j473j999l003q30M520L728k604l630j267O60L426L464k709m463o53
$$ y = [-2173, 117, 1323, 161, 6, -372, -1217, -147, 1401, 1108, -939, -1284, -243, 400, 683, 1616, -491, -2837, -44, 2123, 204, 631, 457, -3357, -1615, 3989, 1305, -1365, 578, -2030, -2963, 3688, 3069, -2497, -749, -494, -3034, 2646, 4888, -2511, -3046, 525, -1557, 1260, 5058, -1438, -4676, 592, 657, 115, 3759, -78, -5296, -543, 2707, 931, 1654, -106, -4331, -1413, 3182, 2064, 346, -986, -3493, -1394, 3083, 3049, 205, -2182, -3228, -330, 3204, 3119, -319, -3074, -3138, 846, 3561, 2181, -170, -3130, -3540, 1345, 4530, 1409, -1433, -2587, -3122, 1058, 5152, 1208, -2985, -2717, -1580, 848, 4688, 1779, -3689, -3236, -593, 1542, 4159, 1974, -4061, -3822, 492, 2328, 2989, 1458, -3498, -4225, 815, 3562, 2089, 90, -2913, -3743, 777, 4505, 1901, -1729, -2996, -2336, 1090, 4554, 1845, -2618, -3271]
1764c271K207K688K518k222n438o33L850L084Q64k360m853o86M767L062n02k593
1780D82m115n12M480L694q83l459l377o1M955L000j754l483k490N62M195K671
1796C905k168l132j851P77M317K137k926l225r59J648L999J474l867l100N35J810
1812f26L150J469m138l643J503K390K574J064m460l681K344L384J125K72l484
1827g57l502K419L675Q97l03l258l566K585M404J07j303k526k543K367L926o4
1843B558k092j737j739J755M001j98k600j740r70K280L563r60l075r05K8J803
1859b8K908q40l130q55K85K119K730j530l331n84J206J930J932j598l214o6J331
1876g35J513J419j028l304j8J878J526Q08j332k849M22K329O34K17j089k072R4
$$ y = [-3271, -1064, 1624, 4142, 1920, -3518, -4151, -301, 2783, 3647, 1287, -3566, -4252, 515, 3577, 3075, 482, -3633, -4145, 335, 4029, 3146, -313, -3690, -3751, 1204, 4204, 2450, -1033, -3523, -2961, 1234, 3905, 1737, -1395, -3246, -2469, 1848, 3985, 1059, -2166, -3125, -1477, 2522, 3996, 129, -2971, -2436, -626, 2524, 3993, -145, -3788, -2285, 105, 2679, 3743, -717, -4398, -2054, 1330, 2455, 2727, -757, -4259, -1840, 1835, 2732, 2429, -829, -4395, -1810, 2594, 2701, 1398, -1128, -3671, -1304, 2622, 2558, 466, -1271, -3010, -1255, 2746, 2548, -52, -1792, -2762, -482, 3081, 2121, -954, -1859, -1831, -28, 2880, 2040, -1090, -1945, -1660, 459, 3189, 1659, -1672, -2256, -1050, 880, 2812, 1214, -2000, -2066, -735, 778, 2197, 1169, -2135, -2153, -275, 1251, 2059, 727, -2122, -1700, 629, 1263, 1480, 391, -1681, -1587]
1893a587K099P53j17j160j824K31K603M93q65p47j459N71K104J36n51j143q11
1910a274M01J815K41p55j133o24R75J604k84j249k54m66M69J683m21j174J41m34
1928g39N7K002l79j430k7L36k2Q34K19j485K90N12n49P43N04j405l94J077o2J14
1948A96L90q03n36P78J3l60P84Nr52J88N25k68K75J05m95k05L47nRL59j65m68
1970b83n68O11P46m0l09n10k62N80P21k13n08o0l76P5Q55K20o27o85J75O17N59
1991G18m0o61q67L99P56J01O03q36j383K77J611M70q60m77j133K97J773O40j291
2010I7m80k27o21J849J222j728r10J87p7J283J096j648j479J046M03K10J217j084
2028C56j924R87J042K38O05j037k079O39K169K12n04r83j421O39K348J92j189
$$ y = [-1587, 512, 1265, 1148, -12, -1836, -1605, 998, 1491, 626, -121, -1580, -1009, 1095, 1231, 680, -463, -1274, -873, 942, 1183, 428, -705, -1329, -354, 1250, 966, -283, -537, -1003, -534, 1149, 728, -446, -305, -739, -682, 1320, 941, -489, -516, -180, -202, 632, 851, -634, -344, 168, -381, 362, 866, -539, -933, 144, 82, 196, 586, -217, -753, 25, 38, -322, 462, 467, -485, -297, 228, -40, 235, 340, -155, -360, -13, -18, -9, 350, 185, -283, -851, -240, 506, 466, 157, -353, -615, -35, 686, 473, -35, -95, -471, -396, 459, 679, 52, -633, -458, 159, 718, 678, 17, -850, -451, 305, 406, 1009, 173, -1210, -933, 678, 1148, 288, -189, -1322, -1025, 748, 1388, 97, -383, -610, -1231, 618, 1840, 112, -798, -611, -688, 595, 1691, 43, -1436, -390, 13, 223, 1440, 356, -1568, -581, 461, 699, 1304, 267, -1812, -1173, 996, 1208, 704, -279, -1700, -1061, 1287, 1479, 290]
2045B90q12j070L93K494O70j395j716p87J212K054L28j240j510n67J218K009o5
2062A506j108j534l88J245J939j94j879o82j97J265J760l22k266o08Q55P13J192
2079A297k01k030p51J454J359R9m04j918r80K020J883q54o34j445j037J760K545
2096B163o18j924p88q37J445K906m58k718o14K43P33K518j33k747q96J018N31
2113a76J533P80l121j048J838O52P55Ok122j095K094Q19j94L8j691j055K123J270
2131A406m98o96j531m70K293J310j199q15r28o68K290J610j415r11r16o84K396
2148E74J901j850j525L4n97J709K137j974j516L95k12R32K265j569k345R66M72
2165b03K51J448j029k422J415J102m44R34m38k344R62J954p28k5j74k156R83K410
$$ y = [290, -522, -1592, -1199, 1295, 1965, 570, -1146, -1933, -721, 1333, 1661, 421, -1089, -1656, -438, 1571, 1506, 398, -1136, -1524, -279, 1660, 1466, -413, -1095, -1292, -27, 1733, 1411, -855, -1463, -608, 105, 1297, 1096, -934, -1685, -231, 1128, 1227, 823, -1095, -2075, -55, 1828, 974, 340, -1105, -2142, -382, 2163, 1545, -379, -1167, -2004, -559, 2347, 1889, -829, -1443, -1200, -467, 2051, 1918, -829, -1725, -707, -176, 1357, 2137, -984, -2032, -194, 458, 1213, 1219, -903, -1998, 96, 915, 721, 759, -932, -1987, 136, 1406, 908, 212, -1319, -1789, 504, 1814, 615, -200, -1128, -1796, 494, 2104, 689, -222, -1138, -1822, 574, 2475, 625, -900, -866, -1463, 246, 2383, 409, -1107, -712, -924, 8, 2273, 704, -1641, -675, -203, 48, 1496, 467, -1955, -540, 562, 118, 1052, 614, -1730, -768, 1186, 458, 433, 259, -1897, -914, 1496]
2183A496o44q63k2j537O50K434k64j232k06j072L3K723K31j844m32m08P0J825
2201I38P14j895n58J43N6J214P23j486p88M49J44R51N36j462q45R09M22K36J98
2220E99q57q10P98P18R1K0p92r71Q00J160j29l66n34n94P44Q36r5o52l39n66N24
2241d15J153J2q02l05k97K29J132j15o93m48M02j43O73L81r92k48K67K8N48J60
2261E27p57m65Q22l3L5K86l04o59N69M01l71J31j7o61L15Q80p31j92L86p35M40
2282a33Q82n69l99K21l25o0R32k88o62L96nl02R24l38p59N97mo13N31M44q40M15
2304D5K40p26N26M03q95J89M69n02R6O50m99j17M82o28J23N10k54o64P81k85l54
2325d10O58j54l04K81K6k87N27j29o21L47N3k83N12J75p80L21K41k28K26L90q69
$$ y = [1496, 852, -11, -33, -1570, -920, 1514, 1250, 18, -188, -1260, -1227, 1496, 1727, -117, -549, -957, -887, 938, 1652, -243, -801, -658, -602, 612, 1335, -151, -939, -490, -346, 605, 1141, -321, -1166, -257, 165, 401, 599, -258, -1068, -270, 448, 539, 559, -233, -1204, -404, 756, 627, 261, -273, -867, -123, 713, 618, -34, -373, -939, -415, 738, 750, -52, -357, -654, -425, 707, 592, -101, -549, -147, -290, 383, 764, -228, -476, -209, -181, 367, 527, -230, -695, 127, 94, 129, 415, 111, -548, 21, 422, 51, 182, 165, -496, -181, 699, -32, -224, 162, -573, -133, 749, 180, -219, 2, -323, -383, 549, 261, -401, -5, -10, -312, 612, 274, -485, 112, 108, -505, 26, 470, -370, 45, 285, -441, 85, 488, -407, -218, 251, -251, -155, 495, -4, -121, 361, -267, -144, 366, 112, -552, 229, -56, -410, 248, 94, -210, 71, 97, -190, 337, 208, -413, -66, -13, -296, 216, 391, -389, -68, 173, -55, 171, 561, -308]
2346c08KN23l95L81J63n17l01N25J76k83K58k11m11L79K07o2J16k40n12N30K98
2367C18l74l1K02m28K28M43l35j25k0j09J55M86nm51k88O3K49L44j18l40k27O
2389c57L63L82l18j78k14M6N18K28l32l87j12K83L88J91k98m53p5K34L59J85m43
2410A0k32j02L26L81j1k49m84J06L59K51j11n37j70J90M74K52j27n83k6K04mO46
2432E63l58m86j01K52L99J21j86m98j69N65K10Q8k21m87k56N08L81m3j71k26j18
2453b33L36L07l14k69j59P2K29M06o2p71J16K21K52K58j12o02j37N04J40Q0J09
2474C71m27o28Q07K43k80J50l13o41O16N65j13l30j83l8j40Q18k18l49j15J0K10
$$ y = [-308, -306, 217, -178, 203, 366, -151, -452, 73, 249, -34, 224, 13, -398, -19, 188, 126, 242, 2, -510, 20, 318, -56, -87, 115, -313, -85, 358, 23, -102, -122, -231, -76, 410, 405, -46, -334, -271, -22, 322, 204, -136, -363, -357, 6, 388, 70, -108, -322, -276, 242, 470, 138, -249, -361, -78, 310, 501, 203, -250, -325, -91, 268, 453, 10, -222, -324, 2, 383, 372, 123, -361, -255, 104, 355, 244, -293, -463, -273, 201, 453, 326, -257, -283, -79, -83, 563, 205, -281, -382, -130, 269, 390, 204, -294, -463, 102, 312, 400, 179, -308, -564, -56, 325, 282, 111, -115, -233, 103, 410, 96, -173, -332, -260, -31, 375, 313, -458, -342, -121, 131, 389, 277, -325, -462, 42, 182, 262, 371, -56, -684, 123, 366, 86, 236, -77, -718, -102, 463, 350, 20, -163, -201, -341, 477, 259, -90, -205, -195, 15]
$$ [...]
8191A36
##END NTUPLES=NMR FID
##END=
