##TITLE=1H_3DPAA1312
 CDCl3
 8 sc, 
 14.12.2021
##JCAMPDX= 6.0         $$ Bruker NMR JCAMP-DX V2.0
##DATA TYPE= NMR FID
##DATA CLASS= NTUPLES
##ORIGIN= UXNMR, Bruker Analytische Messtechnik GmbH
##OWNER= root
$$ XWIN-NMR		Version 3.5
$$ Tue Dec 14 12:01:33 2021 Russian Standard Time (UT+4h)  she@DPX200
##.OBSERVE FREQUENCY= 200.131346
##.OBSERVE NUCLEUS= ^1H
##.DELAY= (6, 6)
##.ACQUISITION MODE= SIMULTANEOUS
##.ACQUISITION SCHEME= undefined
##.AVERAGES= 8
##.DIGITISER RES= 18
##SPECTROMETER/DATA SYSTEM= spect
##.PULSE SEQUENCE= zg30
##.SOLVENT NAME= CDCl3
##.SHIFT REFERENCE= (INTERNAL, CDCl3, 0, 15.7039)
##AUDIT TRAIL= $$ (NUMBER, WHEN, WHO, WHERE, WHAT)
$$ ##TITLE= Audit trail, XWIN-NMR		Version 3.5
$$ ##JCAMPDX= 5.01
$$ ##ORIGIN= Bruker BioSpin GmbH
$$ ##OWNER= she
$$ F:/spectra/data/she/nmr/H-F/1/audita.txt
$$ ##AUDIT TRAIL=  $$ (NUMBER, WHEN, WHO, WHERE, WHAT)
(   1,<2021-12-14 12:00:14.57 +0400>,<she>,<DPX200>,
      <created by zg, POWCHK disabled, PULCHK disabled
       configuration hash MD5:
       00 E9 B6 7A A2 85 ED C7 34 08 36 98 17 FE 4E 26
       data hash MD5: 16K
       10 C2 F4 29 AE 52 E5 A7 9B 86 B5 C7 DE 0B AF 18>)
$$ ##END=
$$ 
$$ hash MD5
$$ 38 7F 4F AC E6 71 47 3E B2 21 5C 00 41 EB 90 1F
##$RELAX= 
##$RELAX= 
##$RELAX= 
##$RELAX= 
##$RELAX= 
##$RELAX= 
$$ Bruker specific parameters
$$ --------------------------
##$DU= <F:/spectra>
##$EXPNO= 1
##$NAME= <H-F>
##$PROCNO= 1
##$TYPE= <nmr>
##$USER= <she>
##$AMP= (0..31)
100 100 100 100 100 100 100 100 100 100 100 100 100 100 100 100 100 100 
100 100 100 100 100 100 100 100 100 100 100 100 100 100 
##$AQSEQ= 0
##$AQ_mod= 1
##$AUNM= <au_zg>
##$AUTOPOS= <>
##$BF1= 200.13
##$BF2= 200.13
##$BF3= 200.13
##$BF4= 200.13
##$BF5= 200.13
##$BF6= 200.13
##$BF7= 200.13
##$BF8= 200.13
##$BYTORDA= 1
##$CFDGTYP= 0
##$CFRGTYP= 5
##$CHEMSTR= <none>
##$CNST= (0..31)
1 1 145 1 1 1 1 1 1 1 1 1 1 1 1 1 1 1 1 1 1 1 1 1 1 1 1 1 1 1 1 1 
##$CPDPRG= <>
##$CPDPRG1= <>
##$CPDPRG2= <>
##$CPDPRG3= <>
##$CPDPRG4= <mlev>
##$CPDPRG5= <mlev>
##$CPDPRG6= <mlev>
##$CPDPRG7= <mlev>
##$CPDPRG8= <mlev>
##$CPDPRGB= <>
##$CPDPRGT= <>
##$D= (0..31)
0 1.2 0 0 0 0 0 0 0 0.06 0 0.03 0 0 0 0 0.0002 0 0 0 0 0 0 0 0 0 0 0 0 
0 0 0 
##$DATE= 1639468813
##$DBL= (0..7)
120 120 120 120 120 120 120 120 
##$DBP= (0..7)
150 150 150 150 150 150 150 150 
##$DBP07= 0
##$DBPNAM0= <>
##$DBPNAM1= <>
##$DBPNAM2= <>
##$DBPNAM3= <>
##$DBPNAM4= <>
##$DBPNAM5= <>
##$DBPNAM6= <>
##$DBPNAM7= <>
##$DBPOAL= (0..7)
0.5 0.5 0.5 0.5 0.5 0.5 0.5 0.5 
##$DBPOFFS= (0..7)
0 0 0 0 0 0 0 0 
##$DE= 6
##$DECBNUC= <off>
##$DECIM= 32
##$DECNUC= <off>
##$DECSTAT= 4
##$DIGMOD= 1
##$DIGTYP= 9
##$DL= (0..7)
0 120 120 120 120 120 120 120 
##$DP= (0..7)
150 150 150 150 150 150 150 150 
##$DP07= 0
##$DPNAME0= <>
##$DPNAME1= <>
##$DPNAME2= <>
##$DPNAME3= <>
##$DPNAME4= <>
##$DPNAME5= <>
##$DPNAME6= <>
##$DPNAME7= <>
##$DPOAL= (0..7)
0.5 0.5 0.5 0.5 0.5 0.5 0.5 0.5 
##$DPOFFS= (0..7)
0 0 0 0 0 0 0 0 
##$DQDMODE= 0
##$DR= 18
##$DS= 0
##$DSLIST= <SSSSSSSSSSSSSSS>
$$ [...]
##$SUBNAM2= <"">
##$SUBNAM3= <"">
##$SUBNAM4= <"">
##$SUBNAM5= <"">
##$SUBNAM6= <"">
##$SUBNAM7= <"">
##$SUBNAM8= <"">
##$SUBNAM9= <"">
##$SW= 18.0517287032376
##$SWIBOX= (0..15)
0 0 2 0 0 0 0 0 0 0 0 0 0 0 0 0 
##$SW_h= 3612.71676300578
##$TD= 16384
##$TD0= 1
##$TE= 0
##$TE2= 300
##$TE3= 300
##$TEG= 300
##$TL= (0..7)
0 120 120 120 120 120 120 120 
##$TP= (0..7)
150 150 150 150 150 150 150 150 
##$TP07= 0
##$TPNAME0= <>
##$TPNAME1= <>
##$TPNAME2= <>
##$TPNAME3= <>
##$TPNAME4= <>
##$TPNAME5= <>
##$TPNAME6= <>
##$TPNAME7= <>
##$TPOAL= (0..7)
0.5 0.5 0.5 0.5 0.5 0.5 0.5 0.5 
##$TPOFFS= (0..7)
0 0 0 0 0 0 0 0 
##$TUNHIN= 0
##$TUNHOUT= 0
##$TUNXOUT= 0
##$USERA1= <user>
##$USERA2= <user>
##$USERA3= <user>
##$USERA4= <user>
##$USERA5= <user>
##$V9= 5
##$VALIST= <valist>
##$VCLIST= <CCCCCCCCCCCCCCC>
##$VD= 0
##$VDLIST= <DDDDDDDDDDDDDDD>
##$VPLIST= <PPPPPPPPPPPPPPP>
##$VTLIST= <TTTTTTTTTTTTTTT>
##$WBST= 1024
##$WBSW= 4
##$XGAIN= (0..3)
0 0 0 0 
##$XL= 0
##$YL= 0
##$YMAX_a= 292904
##$YMIN_a= -324260
##$ZGOPTNS= <>
##$ZL1= 120
##$ZL2= 120
##$ZL3= 120
##$ZL4= 120
##$ABSF1= 10
##$ABSF2= 0
##$ABSG= 5
##$ABSL= 3
##$ALPHA= 0
##$AQORDER= 0
##$ASSFAC= 0
##$ASSFACI= 0
##$ASSFACX= 0
##$ASSWID= 0
##$AUNMP= <proc_1d>
##$AZFE= 0.1
##$AZFW= 0.1
##$BCFW= 1
##$BC_mod= 2
##$BYTORDP= 1
##$COROFFS= 0
##$CY= 11.3945322036743
##$DATMOD= 1
##$DC= 2
##$DFILT= <>
##$DTYPP= 0
##$F1P= 2.36226072786647
##$F2P= -0.459571619588291
##$FCOR= 0.5
##$FTSIZE= 0
##$FT_mod= 4
##$GAMMA= 1
##$GB= 0.15
##$INTBC= 1
##$INTSCL= 1
##$ISEN= 128
##$LB= 0.24
##$LEV0= 0
##$LPBIN= 0
##$MAXI= 10000
##$MC2= 0
##$MEAN= 0
##$ME_mod= 0
##$MI= 1.114404
##$NCOEF= 0
##$NC_proc= 0
##$NLEV= 6
##$NOISF1= 3.799351
##$NOISF2= 2.8
##$NSP= 1
##$NTH_PI= 0
##$NZP= 0
##$OFFSET= 15.70392
##$PC= 1
##$PHC0= -16028.29
##$PHC1= 10.0008
##$PH_mod= 1
##$PKNL= yes
##$PPARMOD= 0
##$PSCAL= 0
##$PSIGN= 0
##$REVERSE= no
##$SF= 200.130013532006
##$SI= 16384
##$SIGF1= 3
##$SIGF2= 2
##$SINO= 400
##$SIOLD= 16384
##$SREGLST= <1H.CDCl3>
##$SSB= 0
##$STSI= 0
##$STSR= 0
##$SW_p= 3612.71676300578
##$SYMM= 0
##$S_DEV= 0
##$TDeff= 0
##$TDoff= 0
##$TI= <>
##$TILT= no
##$TM1= 0
##$TM2= 0
##$TOPLEV= 0
##$USERP1= <user>
##$USERP2= <user>
##$USERP3= <user>
##$USERP4= <user>
##$USERP5= <user>
##$WDW= 1
##$XDIM= 8192
##$YMAX_p= 0
##$YMIN_p= 0
$$ End of Bruker specific parameters
$$ ---------------------------------
##NTUPLES= NMR FID
##VAR_NAME=  TIME,          FID/REAL,        FID/IMAG
##SYMBOL=    X,             R,               I
##VAR_TYPE=  INDEPENDENT,   DEPENDENT,       DEPENDENT
##VAR_FORM=  AFFN,          ASDF,            ASDF
##VAR_DIM=   8192,          8192,            8192
##UNITS=     SECONDS,       ARBITRARY UNITS, ARBITRARY UNITS
##FACTOR=    0.0002768,     1,               1
##FIRST=     0,             0,               0
##LAST=      2.2672688,     0,               0
##MIN=       0,             -324260,         0
##MAX=       2.2672688,     292904,          0
$$ Real data points
##PAGE= N=1
##DATA TABLE= (X++(R..R)), XYDATA
0@%%%%%%%%JkRj6J6k4L2m0M8n6P2q8J04j21J45j76K08k41K80l24L74m28M89n61
32b99O38p23Q18r23J036j160J298j450J618j800J998k215K449k706K989l296L632
49A904m003M410m856N351n904O520p210P993q888R922j1134J2576j4325J6502
63H858j9296K3027k8291L6329n0241Q0926k65803P4612K53679m38060K67927K25046
75A68713l18441R3227L49405k57215l5745K48647j69065j28127K26992r1865j33106
86d6580J11698n7081j04486R3538l6829m4226O1454l6355Q21O8159p8225L5175
98c2937J07191j07472m190J19269j28368j1748J82531j17093r0492K04675p0990
109E0376j45832K20997N748k09027J56780M0835k26616J22855R8923k31571L4380
$$ y = [0, 0, 0, 0, 0, 0, 0, 0, 0, 1, -1, 8, -8, 8, -16, 16, -24, 24, -32, 40, -48, 56, -65, 80, -96, 112, -129, 151, -173, 201, -227, 262, -299, 339, -384, 434, -489, 547, -613, 685, -765, 853, -947, 1051, -1164, 1285, -1421, 1568, -1728, 1904, -2099, 2311, -2545, 2806, -3098, 3422, -3788, 4205, -4683, 5239, -5895, 6681, -7644, 8858, -10438, 12589, -15702, 20627, -29614, 51312, -214491, -139879, 113800, -324260, -56333, 168713, -149728, -56501, 292904, 35689, -56, 248591, 79526, -48601, 178391, 86526, -46580, 65118, 8037, -96449, -2911, -39740, -83966, -22512, -58867, -58046, 10113, -68112, -32937, 74254, -33218, -37408, 81861, -46507, -58255, 124276, 7183, -83309, 121366, 50376, -95456, 125541, 131289, -77738, 79042, 119877, -106739, 16116, 115039, -116532, -82152]
120h2152J29208j68511n778J57046r0535m0341J32056m3398m5967J17590J738
131F0956m6093M9596j5261k0990L4831k7615j0459N457o9784L740L3561p4390
143g6451J9335O7570r1910p08J17149n4239k6396J14228m3564o3835J10420j2742
155E8857r1099R5742J4298j18240N9892L9379j03664M1324N0732r4583P348N5430
167A5416n3476J576N0969l4640j6029L1722j5461M586L2087k0203K04K0275j8926
180a900K4555K4104m2011J7141K6121n5004J6498M1475o6029j85N2157o9547j6153
193d8778P2213n2963l8082P7435k5286n3325P5206O865o0605O3173K5280p1333
205c0200M3483M2258o2374K3784L9404n6700L913L8097l7457r562K6298k7749
$$ y = [-82152, 47056, -121455, -127233, 29813, -60722, -101063, 30993, -12405, -58372, 59218, 60956, 14863, 64459, 49198, 28208, 63039, 35424, 24965, 30422, -39362, -35622, -2061, -76451, -57116, 10454, -81456, -82164, 34985, -19254, -45650, 68578, 25014, -38821, 71599, 58857, -32242, 63500, 77798, -40442, 19450, 58829, -44835, -3511, 47221, -47362, -40014, 15416, -38060, -36484, 14485, -20155, -36184, -4462, -19923, -15337, 16750, -3453, -3249, 17026, -1900, 22655, 46759, 4748, 21889, 48010, -6994, 9504, 50979, -15050, -15235, 36922, -32625, -48778, 23435, -29528, -67610, 9825, -15461, -68786, 6420, 13285, -47320, 15853, 41133, -30200, 13283, 55541, -6833, 16951, 56355, -345, 3568, 41665, 4208, -5354, 20944, -6805]
217f805j6824K2092j3190r832J8075j5173n180K0678j2794L106K2518j8266M045
230g550K6679k0305M429L1730k7683o550L5581k8590j8133L9120k1382l1156L6023
243A2213p005l6940L3343R569m2543K5817K2961m3719J8311L2428m1357N929L5227
256B4234l1329o666L3860j5055j8195K3619j685k1699J5248N670k1153Q478J0443
269E770j3283L276J0503k202j104J668L708j438o736O049J343j4050P533J1349
283A2386j7997J538J9392j6090j0820J9708p855k0460J7207N376k5634J3843K0440
296A1034k5163M747K5635j9341m649K2313j1032j2277J7837L360j7246Q737J5797
309A9752j6471m503J5888j1495j2204R040n002j3386M811O663r445j218J4960
$$ y = [-6805, -23629, -1537, -14727, -24559, -6484, -21657, -26837, -6159, -18953, -15847, 6671, -11595, -7550, 19129, -1176, 3253, 34983, 7300, 750, 36331, 7741, -10392, 28728, 7346, -23810, 12213, 5208, -31732, 1611, 11180, -31363, -5546, 17415, -26304, -7993, 24435, -16922, -10993, 24234, -7095, -13761, 20099, 5044, -13151, 10468, 8783, -12916, 2332, 8002, -13151, -4673, 5770, -7513, -4237, 6266, 4064, 2960, 4628, 8336, 6898, 162, 6211, 7554, -6496, 1037, 12386, -5611, -4073, 15319, -771, -11591, 8117, 262, -20198, -2991, 2385, -23249, -9406, 11034, -14129, -9382, 16253, -3088, -7737, 14576, 3544, -8733, 9104, 12464, -4782, 3955, 19752, 3281, -1222, 14666, 3171, -9033, 7, -4995, -18381, -13570, -6907, -16352, -17570, -2610]
322b610j928q194J4140M217j3108R147J0505j3200K839J6231p071n830J3348P99
336A9285j2596L836M532j5950j985R321j4396m522J3361o927o243J0439J000p772
350h617L633P374q627j465J3949o355o183J5052j097q924P862J540r694K33M673
365C354p679m260Q631k638o503J0209K733q799N894M751j0452K69P152p566n531
380a0435P847R64q438N409R562r418O5J3570r057m636J4619m647q566J1073J518
395I430j2084N767J0521j4165l590J5971j1449r011J8584m026j2582J2055K416
408G837j0771N456O227j0270m119O685n215o933O238J26p825K596O878k404j807
423g301Q491N211p321J813J3305o918o936J6268o017j6953J5174K49k0619J0989
$$ y = [-2610, -4538, -12732, 1408, 5625, -7483, 1664, 12169, -1031, 1808, 18039, 10968, 5138, 18486, 19285, 6689, 10525, 15057, -893, -2878, 6443, -7953, -12475, 886, -6041, -12284, -1845, -845, -8617, -4984, 2390, -6237, -7702, 6247, -108, -6291, 8761, 7664, -1260, 6602, 8142, -1552, -1319, 3354, -4325, -8585, 46, -2592, -9095, 1114, 3847, -4952, 942, 5693, -4759, -4490, 2662, -4904, -10435, -2588, -1624, -10062, -4653, 4909, -4509, -4444, 9126, 69, -4567, 10052, 5405, -3161, 7912, 9430, -2654, 3113, 13634, -531, -4121, 11850, 401, -8610, 9974, 5948, -6634, 5421, 7837, -2934, 2522, 8749, -1521, -5640, 1045, -4170, -11103, -4865, -4739, -12564, -9968, -3090, -5494, -7301, 1190, 6401, -920, 893, 14198, 7280, 344, 16612, 10595, -6358, 8816, 9065, -11554, -565]
437e65Q447k2027O31J8532j3893p758K3164q648j7188K3606O94j9511J8147O799
451A0430j9859P075J1803j1176J261J2658p595p491R653J440l771M869j632o295
465A370q69m02J881K18o844j606k076o015J0655N182j5060N116J0525j1824N774
480c975J7088j0631o634J5868l165j2969J5380L623k0800R828R108k1902N019
493d162J5412j4773j912J3300j0961j0505J4990N303j2547K512L929j1598M688
506f324J4708n799o688M688k079k852Q044M693p900o181M163J188k208P354N98
521E405j1001L323N801o706K352P218n380n687N212K856n430N797P326j1495m151
536d560O608n196j645O657k953q797L79Q643l58q44R727n360j2234J0617O922
$$ y = [-565, 7882, -14145, -13514, 5018, -8875, -16633, 6531, -2117, -19305, 4301, 4995, -14516, 3631, 10430, -9429, -2354, 9449, -1727, -466, 12192, 4597, -2894, 6759, 8199, 4428, 9297, 7665, 1370, 501, 99, 1980, 2198, -4646, -6252, -8328, -14343, -3688, 1494, -13566, -8450, 2075, -9749, -3975, 13113, 2482, -4152, 11716, 8551, -4418, 10962, 14585, -6215, 3613, 12721, -9181, -4162, 11250, -3523, -5435, 7865, -3096, -13601, 1389, 6692, -5855, -3343, 586, -11012, -6324, 8384, 2585, -4103, 585, -1494, -4346, 3698, 8391, 491, -5690, -1527, -339, -2547, 4807, 5405, -5596, -2273, 3528, -3178, -826, 6392, 1012, -4675, 537, 3393, -2037, 3760, 11086, -409, -4560, 2048, -3148, -4793, 1864, -1089, -9886, -9507, -864, -1222, -2066, 7661, 2301, -9933, 684, 7606]
551G606j0100M069P842j2602l147J6874j239r039J1249k241j8163R170R216j5019
565e524M192Q282j8956p16J6337o306l101P591r058p394J0522M280l387N885m94
580B153o113R401M064k406Q922o604j0950R789l907q832J1384m317j3577R632
594a361L66j3213J3157Q826j9191L128J1279j7843N706K3511j7524q395K1363
607I809j1131q734K6080n168j9894J2526j845j2265J7445M929j6704M713O353
620F114r383P256P390j4890Q11N507j4035O497J0600j3662M813P378j5220Q049
634b775J3504j5793J440J5656j4835n591K0384p320j0142J9233p797j9032J9422
647F354L623j8227J2443L710j9122R713J0353j3934N103Q388j4274o12J0009m637
$$ y = [7606, -2494, 1575, 9417, -3185, -6332, 10542, 9303, 264, 11513, 9272, -8891, 279, 9495, -5524, -1332, 6950, -12006, -12722, 3615, -2691, -5792, 1799, -7259, -14653, -4131, 149, -3238, 2647, 2153, -3960, 5441, 9505, 7099, 16021, 9417, -1533, 8256, 4349, -4483, 6901, 2584, -10993, -1361, -995, -14208, -1051, 7775, -11416, -8288, 2991, -14852, -9146, 14365, -3159, -11554, 9809, -1322, -10056, 16024, 10856, -9038, 3488, 1643, -10622, 6823, 11752, -4952, -239, 6114, -3269, 3987, 11377, -3513, -2702, 2805, -11230, -4733, 5867, -7795, -2982, 4396, -10824, -2775, 10729, -5064, -3624, 12032, -2803, -8394, 11990, 4670, -5472, 13761, 5964, -13068, 6354, 9977, -8250, 4193, 7903, -11219, -1506, 8847, -5087, 16, 8404, -5870, -6482, 3527, -1110]
661a110k13L558q840j362P907m610j104P457p043r18R333p222K563J2656j1166
676a14l980J2196o496l511J2539n429j0211J0903l3j3479R551O484j5305K443
690d442P385j0680M414J0080j0837k408R065m862k335P304k129k950L994r61j912
705a274M353K339l859j834K392J029j73r23N48J950l616r89K736m966P14L976
721B403q106j030O764l425j676M785j530l270M029J480m306L630M829n308p57
736a488N234m60p50K49j522K09o4j1R13k110O89K451n247j198N853l865l944M839
754b22j942l522O230N60p275M144N629r127M53R352p112j466R786n642k343R676
770G179l202o057N496J580n632J560L397m109P09M020m498j443L446k281k566
$$ y = [-1110, -1323, 2235, -6605, -7967, -60, -4670, -5774, 1683, -5360, -6278, 3055, -4167, -1604, 11052, -114, -4094, 8102, 1606, -1905, 10634, 5205, -5006, 5897, 5864, -7615, 1936, 8420, -6885, -4442, 2943, -7737, -3323, 6757, -4080, -6488, 2577, -2285, -4620, 2684, 555, -2395, 1599, 638, -1274, 3079, 5418, 1559, -275, 2117, 3146, 2973, 2050, 2598, 4548, 932, -57, 2679, -2287, -1573, 2403, -5703, -6733, 31, -3394, -5070, -285, -1815, -5085, -1056, 424, -3882, -252, 4577, -731, -1488, 3746, 3286, 2536, 2785, 1263, 1472, 1408, 1397, 2310, 200, 889, 3340, -1907, -3105, 2748, -1117, -5061, -222, -2164, -5686, 544, 1104, -6171, -2027, 3602, -5525, -5072, 4280, -2832, -4298, 5488, -154, -2497, 7179, 3977, -2080, 3416, 4996, -636, 924, 4321, 212, 921, 4941, 443, -1000, 2446, 165, -2401]
785b401k01N0P73j852k95L725j117j309M329j550k639N501l39n125L752K600m749
802h47J397M670m836q90P383n244m723Q636l316p612N801l97n688L267J300l920
818e019J621L631l568j141M659k767k103M799j487r86M856l10q16L020k17j055
834C117J54j260p82K07j063LP71n5Q5M46p00j131K36r85k745J476L66k682L081
853a461P32k703M153N59l503L058J277l047Q76K958j489j217L797p97k871L785
869D107j125m057L450j222m349K759N45l490R13J934j502o83J730k9j282O11M64
886a226q76M75O17j4J110M29N90J156n28J297O41k267J831L27l815J881J502l316
904a86n54J138j407k097J400M11l549J568K158l080J821L229k085R7K079J8n38
$$ y = [-2401, -2602, -2552, -1779, -3631, -3926, -201, -1318, -2627, 1702, 152, -2487, 3014, 2675, -2450, 1302, 3902, -847, 550, 5220, 384, -506, 6877, 1633, -3090, 5546, 2230, -5382, 419, 22, -5666, -2399, -1099, -5019, -3398, 233, -3335, -4476, 183, -2584, -4687, 112, -1375, -2361, 2495, 2185, 1369, 4389, 4172, 3117, 3271, 2011, 1229, 1436, 373, 376, 1147, 1092, 1177, 1623, 923, -208, 28, -957, -3702, -2226, -1860, -4542, -1461, -729, -3432, 721, 1280, -2223, 835, 2112, -935, -59, 2899, 1410, 193, 3990, 3193, 322, 4107, 2982, -1075, 2375, 1153, -3196, -437, 108, -3382, -2469, -535, -2037, -2720, -990, -1019, -2301, -1690, -1226, -2102, -1627, -1010, -1024, 86, 515, 1105, 2261, 1733, 3030, 3671, 1404, 3235, 3562, -253, 1628, 3130, -186, -740, 398, -1009, -3106, -1706, -1295, -4844, -3276, -1118, -4198, -2377, 852, -1233, -1136, 943, 961, 423]
921D23P87J031j426l76K219j090j393K241Lk109P56P52j386J50J522j039k445
938a380J048J057k747M46J719k931k91J755o07J341O43j043J64M41J346q0p26
955A55J014o46n69J020L68P23j348k74J566k443L7L431k815j989K847j247k204
972b374K666M05l153Q25J034l318J058M090l209j977M437j369k099N266pk990
988g15K865J5j684K329Q74r14m64n90q67L04Q99j189l81r06l432K080J386l452
1006c842K913n3o067L775L910l863K613L130n649P50P165k634k073O337l259n890
1022b737P188J094o323M476R48p795L530L174o125K344K360o568K09L351k881
1037c755M42L334k120j635K780m89P22M095l307j818M057l330O21O446m406k075
$$ y = [423, 1210, 2241, 815, 439, 2658, 1568, 175, 2416, 2419, 310, 1066, 1818, 432, 582, 2104, 1065, -1380, -332, 725, -2022, -1576, 143, -2788, -3079, -1324, -1931, -590, 53, -990, -826, -385, 961, 881, 155, 1169, 523, -46, 974, 1342, 2065, 717, 443, 2009, -434, -397, 3034, 219, -1770, 1077, -170, -2374, 292, 697, -2456, -1631, -597, -3915, -2857, 1233, -1976, -3953, 484, -885, -2984, 2282, 2275, -715, 2150, 2165, 481, 2810, 3684, 2770, 2306, 1716, 849, 1153, 2052, 863, 482, -424, -3856, -1776, -390, -3842, -929, -982, -7049, -3274, 636, -3227, -614, 2516, -3133, -2383, 4782, 2148, 75, 6412, 3153, -2737, 4451, 5545, -778, 3698, 4646, -3149, 381, 3555, -2570, -226, 2134, -4434, -4225, -874, -3755, -3313, 21, -2099, -3734, -954, -1443, -721, 3374, 67, -1751, 2306, -1024, -403, 6043, 1637, -438]
1053d38M443m060q99O356l684n541M554j330n985O649L067q655K786N169p212
1068d780K232P370o654j741O375m558j917P731r12m341L222N56l693K296L464
1083D650l408k232K225j688m82L835O18k035j968P28J302k061J630J447o453m52
1099d344M813k245m09L813k284l641L129J941l262J871K250n167K22N367k278
1114b24j381N026n02m044J517K477j824m76L068j807n372L181L478n034J669L352
1130C104p777j468P213k531l703N954j164p341O975O376p608K489N873q223J145
1145f86Q362n366j990N410l894l158N044m68l796K231q86l665K081P0k215K185
1161g41j805k335L596j721j736O292k456m708P439m62n323P921J248p942N355
$$ y = [-438, 4005, -55, -954, 5402, 1718, -3823, 731, -599, -6584, 65, 3132, -5523, -2737, 2432, -4780, -2548, 4822, -1832, -3573, 2802, -1756, -3673, 4058, 3146, -1195, 2027, 2583, -1110, 1186, 4650, 1242, -990, 1235, -453, -935, 2900, 3518, 1483, -485, 243, 1545, -516, 1114, 2561, -3892, -4344, 469, -1776, -2185, 1628, -656, -4297, -1168, 773, -2489, -618, 1632, -3535, -3313, 2054, -224, -1605, 3421, 2919, -1125, 392, 2869, 1045, 569, 3637, 1830, -3542, -361, 3117, -1917, -248, 3104, -4673, -6141, 1072, -1459, -5162, 792, -372, -7713, -738, 5638, -1970, 519, 6392, -1831, -686, 7676, 2310, 320, 5730, 1836, -1322, 3722, 3254, -542, 1689, 803, -2862, -781, -711, -2926, -741, -2546, -4881, -1285, -3006, -4742, 1550, -906, -5614, 1825, 1363, -3960, 3961, 5209, -2733, 2622]
1176B622L731p933K967O166q388j102P472p461k715R554n985n480Q483l690n278
1191g037Q430k41n975M523J279m255M177K683m882J291J806l873K946K635m600
1206a093J591J918l980L303K545n503K113K394n768K332L705o120P79M567n231
1221b448j163N688l273k983N861j919m428O243m51m639O207j61n752M544J375
1236B701m340K637J171l960J124K847k384p4K627k120l52K564j831l27J813k475
1252c79m42J396k102R5P98k281J078J386k466J112J932j757J040J940k013M51
1268b12L161j255j717K875l92k551K528n27k342K431j343k493K764p17j978J411
1284c57q01j104J406j31r74Q53L35r15J067L10j325J885M87k476K249J791k297
$$ y = [2622, 6353, -1580, 1387, 7553, -835, -1937, 5535, -1926, -4641, 4913, -1072, -6552, 1931, -1759, -7037, 1393, 1152, -4823, -300, 979, -3276, 901, 3584, -1298, -7, 1799, -2074, 872, 3507, -1093, 498, 2416, -1564, 1739, 4284, -1219, 894, 3288, -2480, -148, 3557, -2563, -1784, 2783, -2448, -3611, 2077, -1196, -4179, 1682, -237, -4665, 1578, 1127, -3512, 2695, 2534, -3218, 1326, 2701, -1639, 998, 2169, -1791, -667, 2180, -204, -278, 2349, 229, -123, 2441, 610, 283, 2096, -379, -821, 575, -1527, -1432, -634, -2915, -1837, -451, -2917, -1805, 127, -1630, -590, 1350, -663, -212, 2949, 1694, -23, 2852, 2460, -91, 2437, 1910, -432, 1999, 656, -1837, 927, 210, -1768, -357, -1158, -2262, -856, -987, -1961, -1108, -773, -1688, -621, -311, -1636, 249, 736, -1740, 509, 2300, 3]
1301CJ644J057k482J993Q45l632J366J552l334M79J639k123Q0J674k148p30K452
1318C35j537j656K761j064q63L597j887j184M250j676k078L241j263j832K568
1333A712n85k253K741P92l211J608J817l187R68J342l618J153K225l623J91K427
1349D99k342J03J567k170O93J811k462K65K279j468k99K291j036n80L328r67k129
1366f17L583m95k719K901p91k650L081n24l161K239R35l025J07J235j924k54J522
1383e57j936mK640j345m0K389j131J62J953j559M1K138j317n44J642r24l46R88
1401B250j469j166J310q51k085J105L11k037R89M71k233J784Q25k367J634J295
1417b34j428J376J024r56J004J090j240k44J875p92j161J868q72j307J956r24
$$ y = [3, 1647, 2704, 222, 2215, 3060, -572, 794, 2346, -988, -509, 1130, -993, -913, 761, -1387, -2117, 335, -1202, -2858, -97, -1161, -2024, 1573, -314, -1498, 2752, 1076, -1002, 2239, 976, -856, 1712, 1127, -1126, 1615, 2407, -804, 804, 2621, -566, 402, 1744, -1874, -721, 1504, -2119, -1928, 499, -1843, -1740, -173, -2343, -1650, 161, -2301, -2036, 243, -1225, -1524, 767, -269, -849, 2479, 1512, -617, 2966, 2471, -248, 2653, 1862, -788, 2293, 1769, -1392, 847, 1782, -1243, -1136, 99, -1825, -2079, -557, -2493, -2497, 143, -1202, -1242, 1147, 16, 178, 2131, 572, 613, 2751, 1434, 890, 2532, 1608, 1262, 2250, 781, -385, 925, 74, -2011, -906, -595, -2632, -1643, -1172, -3405, -1621, -796, -3163, -1529, -234, -1662, -286, 738, -218, 786, 1876, 636, 392, 2267, 1475, 314, 2182, 1310, 3, 1959, 1035]
1433A035j885J695o17k005J048L05j224Q25O29j245K13J574j81p52R27M60o58
1450A44M32L89R4J25q27J16J08q27Q54k73j569J263O4j496J571O84j368M50J216
1469A150r09o32J938n63k441J380j2k072J151N43j598O48P03m81L38J052K63p58
1487c00nJ226J4l56J217J58j659M56J323j453r03J731j269k531K857P91l326K210
1505A81J651m233J303K563l344j37K534k290j460K919k22j874L029O28k605K200
1521H43J573j140J686M60j672M01n73l48J014j913j983P57j515r87K754q83k656
1538d182K404P39k232L560K252m591J768M180m573O29N159m871j785N252l325
1553C84k920N047r05l979L556Q85m465K624K824m394Q38K227m464M05L343k596
$$ y = [1035, -850, 845, 228, -1777, -729, -424, -1648, -823, -194, -1439, -1226, 348, 167, -585, 342, 802, 144, 576, 965, 1059, 1184, 357, 473, 581, -246, 608, 335, -1234, 29, 93, -1403, 168, 852, -516, -66, 1150, 241, -391, 1547, 984, -1457, -77, -89, -2161, -1010, -467, -2065, -1417, -714, -1195, -857, 195, 458, -300, -305, 921, 935, 579, 1796, 1954, 295, 751, 2074, 621, -282, 1449, 180, -2351, 506, 1297, -2029, 181, 1832, -2401, -1098, 1465, -1879, -2016, 518, -1772, -3232, -313, -535, -2409, 620, 1248, -1357, 843, 2416, 1276, 2962, 3422, 1750, 2151, 1578, 1230, 2244, 331, -1652, -895, -2410, -3397, -643, -1526, -4182, -1778, -1039, -3271, 289, 2541, -2050, -282, 3898, -675, -46, 5113, 242, -1543, 3709, 384, -2536, 2511, 1606, -2373, 1183, 2068, -2397, 227, 3051, -1343, -505, 1722, -2742, -2337, 1006, -1590]
1569a590n25J537j793M65K237j20K02N73r41P49J315r55K53Q25k562k58K344k018
1587b62p82K566k683j842L863j374j973M074p86l248L137J281k744J617J420l658
1603a394o59L124j837j323K772j600j669K813J73j006J471K03j062R9J160K17
1619A482q84O91O04j582m01J226k68r25N13k70j956L12K009p16r74Q02j310n59
1637b206K365n6j090M65n10q3J356P38K74q87j81J431k26l52R04n98j509P02O84
1656A221k219l17K176k192j351K979k058j897M070l78k877K811K38k673K985K150
1672B668l287L86K276k183M73L226k139j693K201r33q08K087j509j451J228j342
1688h00j03J652j842m05J541j559j22K131j274j111K767q21k294L685M24l791
$$ y = [-1590, -2115, -578, -2371, -1906, 331, 211, 413, 986, 45, 794, 2109, 1154, 1407, 2232, -330, -588, 1756, -262, -1044, 1522, -1161, -3003, 860, -514, -2487, 1587, 801, -2447, 690, 1971, -773, 844, 2264, -1394, -2053, 1071, -766, -2089, 683, -917, -2586, 227, 400, -606, 865, 1068, 6, 105, 1265, 1482, 598, 1289, 1893, 311, -90, 1136, 868, -57, 456, 186, -1770, -1458, 551, -165, -1139, -337, -1647, -2206, 159, 103, -987, -522, -1032, -1115, 241, 979, 1253, 366, 185, 1616, 1390, 1038, 1942, 1344, -165, 537, 1221, -998, -1315, 861, -1331, -2682, 297, -1761, -3658, 412, 34, -2843, -32, 206, -2467, 518, 2668, -619, -233, 2043, -140, 333, 3559, 1420, -273, 1928, 995, 187, 2274, 765, -686, 542, -800, -903, 749, -1093, -1498, 43, -1516, -1638, 493, -781, -1892, 875, 54, -2240, 1445, 1869, -1922]
1704a922L180J303m500K288K267m041Q67K637l376K6L359k202j161K956j386k047
1720a752K565m07k214J958R3k083J567L26j315J629k78j413J387k68q79J765l77
1737C04j179J485K65r62J400P75j979M34J338j801N92J199k442K93J503k097K50
1754f22J428j858n47J373r25n78J195k78o65J211J87o07J095L01p91Q95L07j013
1772A08P76L23o74M65j98m60N82m09m15L55p39k43j3l92L3n9l00j04K71J79k24
1793a138N79L46n72J040M09m61J054L7n15R26m24n89Q47p50q55O61m98r76O71
1812b08j64j066O23M09j070P53R48j287P09J420j669L86J589j855n4J629j569
1829d76l96J603p41n84J237m5o48P80J89p65P52Qj103R47k10j280J024l44j118
$$ y = [-1922, 1258, 2561, -1939, 349, 2616, -1425, -558, 2079, -1297, -1271, 2088, -114, -1275, 1681, 295, -1752, 813, 406, -1808, 150, 243, -1840, -273, 53, -1262, 367, 89, -1324, 63, -205, -1084, 681, 304, -875, 610, 875, -87, 1313, 2088, 109, 543, 1881, 80, 672, 1871, -571, -278, 1225, -872, -622, 806, -1052, -1599, -226, -1151, -1729, -534, -812, -1477, -266, -79, -686, 409, 710, -81, 814, 1121, 108, 884, 1207, 533, 998, 800, 340, 922, 513, 98, 453, -286, -529, -542, -934, -901, -960, -1260, -1364, -1093, -914, -1138, -559, -213, -785, 255, 664, 203, 1257, 1294, 779, 1705, 1281, 692, 1539, 789, -66, 595, 97, -879, -208, -372, -1438, -815, -406, -1476, -723, 225, -1062, -353, 1067, -602, -216, 1373, -482, -536, 1093, -476, -872, 731, -10, -594, 643, 598, -50, 730, 919, 154, 906, 914, -189, 758, 548, -732, 292, -52, -1170]
1848a170R42m66p35J141k58o55J285P2r13J213N65j439N59R31j583N4J178j407
1866f86j19J616j193j42K019r66m21J498o04n43P61n45o80J70l90p80O4j01p81
1885a823M54J37p00J091L89n99J277M67m00R92R0m27N64m6n73n1j22l42k52j39
1905a3k78j9J27l13r4K83j40J13j15m33N05J15r71O13L51q41O72L46k52Q47L21
1926H24j16N36P8l6K56q6p14j41K12r25m74N13p77j92L42q50M86Q06j029L73R57
1947D3o23L42O98n72K89O33p29k89P37n44l36Q52n41m64J373j84q90J654l35j530
1967d16J346l55j476J481l42k033J311O59j350N83J070j386M4J681j370m17K102
1984A132j136r66J933n17p20J283n16p24J051j85p24O95J10l58K99k42l85M76
$$ y = [-1170, -228, -694, -1429, -288, -546, -1201, 84, 156, -757, 456, 1021, -418, 141, 1072, -511, -457, 721, -686, -805, 811, -382, -524, 1495, 529, 108, 1606, 1002, 459, 1220, 675, -5, 165, -225, -1005, -941, -1042, -1823, -1369, -1232, -1932, -841, -452, -1051, 226, 693, 293, 1285, 1375, 948, 1512, 1466, 893, 842, 720, 378, 126, -13, -291, -310, -183, -496, -590, -307, -447, -334, -449, -882, -377, -262, -1233, -620, -269, -1110, -438, -92, -344, 503, 824, 708, 1244, 1322, 1286, 1542, 1456, 742, 601, 813, -112, -586, -73, -850, -1042, -700, -1550, -1064, -258, -1287, -914, 43, -580, -238, 460, -112, 177, 810, 81, -208, 529, -15, -351, 501, -40, -504, 869, 685, -205, 1449, 1114, -416, 930, 575, -901, 580, 238, -1795, -484, 175, -1175, -592, 478, -908, -864, 817, -553, -970, 1132, -4, -970, 963, 446, -274, 1009, 493, -231, 820, 635, -89, 606, 716, 358, 657, 415, 30, 506]
2002E06k19p70K75m20r66J094j46j382J576L86j791J579J236j557O02J038j239
2019a98K12J401p88r22J393j00j468J289N48j389N63K06j277K99N94l50o55k68
2037i10L76k52k30O39k20p29N80L64k54O61O82n25j87J164J11r00P29J16j089
2056A26M85J84j295M60O17o47l03k3J2n9J15O21m19q74N41K67j28K87P2r23n61
2077a445J489M25j122J166m1j499J911J008k001O17J108j798J45J601j250r13
2093e99J365p68j164J384m12j415J399L07j478J035M12j106J182K83j160N27K7
2110a81k98R39k26o87P19O9n04R73O15j389M77J019j619O39J339k352l8J614k100
2129i91k80K012j597j079J877p12j188K106K40j864J293R20j648J168J484j767
$$ y = [506, 287, -483, -208, -628, -1594, -500, -646, -2028, -452, -66, -1857, -278, 958, -599, 3, 1041, -198, 14, 1415, 627, -295, 1098, 998, -470, 819, 1367, -22, 541, 747, -530, -231, 363, 13, -642, -910, -534, -786, -1016, -377, -597, -1326, -746, -382, -636, 25, 707, 182, -5, 1159, 1270, 370, 1099, 1215, 126, 611, 795, -500, -40, 577, -70, -373, -396, -384, -443, -328, 293, -126, -1000, -459, -192, -320, -33, 39, -884, -1445, 44, 469, -653, 513, 472, -1027, 884, 1892, -109, 508, 1616, -182, -37, 1564, 314, -599, 766, -2, -1166, 218, -194, -1609, -210, 97, -1381, -346, 66, -1040, 142, 425, -735, -208, -181, -479, 460, 234, -453, 266, 335, -169, 804, 1419, 30, 507, 1526, -93, 546, 1885, -467, -505, 1109, -991, -1271, 741, -856, -1935, -58, -770, -1958, 148, 388, -1476, -183, 737, -911, 257, 1741, -26]
2145b6J07J231j169K22J115j099j50L68m99J92J25l92p9r8m58J18K03n98K6P48
2165a13r14l65J485q45l12J838q55q75J707m3o83J286N0j485N47J056j214j73
2183I2J090j137r43J533k07j173P29L2j055L70N13m37j90M64J54n89M57N98p27
2202d26K79O70p54n8O49N2j31K47L56m66j18P05m12m52L66n22l86L33k2j81k61
2223e32RK83k02M6L57n28j11N80j89k38O05P2m25L25O23n19j65Q99o12m53J058
2244H83k49p49R52j09p06M13r1n89Q4J26o92l38O19k50l83Q11q3l50O89j26m8
2265a86N16l01K3L17j69k4M98j12l26L81Q0n11K51K40p16J18L41q75K26O05j054
2286f78J15P16r58n7P93o46j69P83k01l33P72L12p77P57L21r40P91L69j118P41
$$ y = [-26, 81, 1312, 143, 365, 1480, 381, 231, 599, 100, 292, 417, 25, -54, -152, -610, -492, -289, -887, -861, -113, -1027, -1392, 93, -752, -1064, 774, -81, -956, 751, 708, 25, 1311, 1361, -124, 423, 1479, 265, 92, 1182, 45, -898, 635, 428, -745, -16, 16, -1039, -669, -156, -593, -783, -319, -165, -754, -297, 301, -426, -147, 523, -231, -289, 360, 412, 281, 528, 884, 418, 300, 1005, 593, 141, 507, -15, -401, -68, -90, -271, -532, -523, -240, -442, -396, -39, -567, -678, -98, -287, -525, 80, 152, -273, 52, 675, 156, -9, 890, 278, -175, 883, 634, -115, 837, 728, 22, 435, 344, -245, -161, -35, -727, -1065, -446, -696, -1079, -268, -351, -701, -12, -138, -186, 330, 29, 52, 369, 200, 176, 674, 562, 236, 617, 697, 186, 437, 677, -39, 79, 420, -455, -229, 376, -678, -563, 153, -805, -862, -69, -715, -884, -101, -302, -635, 137, 449, -328, 429, 750, -190, 601, 970, -148, 593]
2306E93M09j140M66N40j012J94M84p16k42O01n08n51Q62m43o12R36k61o39J034
2325ej07o11Q87N4n30Q19n4m77O52j04l86N41k9n88K97L10p19Q5O10r06L2N84
2347C55r70J47O40j005K01N45o94K6O51l83j14N86P8l31N41J97l63O10M8l77M42
2368H30l6o41M30r4o62L54j77m50L62q9l17K79o3k19K06J25j40p6K64j61j64M06
2390c3j83o7K55j57L55O5k24N87pk58N03j03l87L19j53n17J2Q0n20j45K85m18
2412g11k09N87k87k12P60k19j79O21oj87M18j47o7K32k32O9J14j50P0J54j1L4
2434D42M9N4k69K23k60n34M32k73p78N99o4p63O18J41n44N17L21m28L16N63l50
2455A2J03P44m25j51P06m18l43O79n28n86N51l33n03N50j29m73M24Rk88K30J5
$$ y = [593, 1002, -138, 328, 868, -144, 50, 534, -182, -424, 177, -331, -882, -20, -463, -1075, -139, -400, -1039, -5, -112, -723, 164, 218, -312, 507, 453, -24, 628, 524, 138, 679, 650, 62, 359, 669, -50, 35, 645, -261, -229, 355, -615, -468, 172, -833, -632, -87, -781, -755, -104, -487, -601, -15, 63, -268, 273, 470, 107, 717, 765, 388, 830, 794, 153, 583, 489, -173, 181, 4, -446, -84, -173, -490, -211, -274, -493, -287, -162, -302, -378, -114, -275, -439, -33, -216, -283, -28, -185, 170, 235, 11, 598, 591, 333, 836, 733, 346, 665, 512, -5, 7, 87, -433, -578, -293, -711, -920, -333, -620, -832, -72, -291, -470, 151, 145, -42, 376, 229, 162, 394, 162, 231, 345, 195, 265, 419, 408, 442, 491, 545, 276, 499, 239, -295, 137, -136, -914, -315, -379, -1142, -524, -383, -927, -410, -89, -517, -201, 362, 12, 115, 859, 434, 283, 989, 571, 228, 907, 379, -207, 344, 11, -492, 58, -71, -544, -120, -111, -399, -169, -154]
2476a54l56j1K03k41J45M14m18J74O31m36K84L16m28K85L02m75J72L77m81qM24
2497G19m10n65M12j25o87M61n2p85O36K90o39N43L81p95K70O46l89j34M02k09
2517c0j19M99J00k63J40O7j78K69r3l07K20k00k35L96l25j82L81m10j85M70k58
2538b43l79L85J52n57K01O31o24J21R32p06k51R21l41m19P39r5n86M77K15n17
2558E6J70M42o04l71O22j65n34M20r6n35K88J97k75m2K09R6m22J10O00k99J3L05
2580A85k26Q1L90j4j47pL20k20k41M87n1o15K78P6n24P3K29l58k80L68M4o46K72
2603e26N41n92J10N70n95Q7R03l48l72O74k7m89N00L85o55Q3M19o90K8P74p43
2624C7l30O15n33q8M10m31k37K48p0l38L66J59l05J99K45k73M26J71l95M75J51
$$ y = [-154, -510, -521, -318, -559, -414, 0, -418, -244, 387, -49, 235, 551, 123, 408, 710, 235, 407, 784, 303, 295, 719, 309, -256, 156, 31, -656, -195, -247, -1032, -396, -106, -745, -202, 179, -616, -346, 300, -89, -223, 179, -30, -149, 350, 450, 187, 327, 394, 216, 485, 392, 85, 305, 105, -130, 266, -59, -241, 140, -270, -455, 15, -243, -622, -237, -85, -642, -441, 190, -434, -313, 619, -87, -338, 583, 242, -177, 562, 467, -119, 358, 573, 56, 226, 668, 64, -307, 315, 150, -384, 36, -60, -595, -307, -110, -385, -427, -218, -122, -544, -434, 166, -133, -120, 185, -41, 40, 430, 416, 269, 262, 582, 362, 121, 608, 557, -58, 220, 296, -228, -155, 74, -284, -564, -196, -152, -798, -526, 15, -577, -467, 103, -492, -405, 498, 150, -222, 452, 425, -64, 436, 821, 166, 249, 668, -22, 6, 780, 37, -293, 322, -211, -299, 111, -320, -557, -309, -379, -717, -351, -192, -497, -298, -53, -326, 100, 271, -124, 351, 502]
2645E02m32M39P2n65M95J17q06K32L94n43j09N29n64k77P49l71n53Q43k27q79
2665i54R28J64r52P86K23q88O09M50m97oN17k34j25O00k03k76O98l56l87M70l76
2686A91k82K89l90k37K85m21K3M25k46j45M34k02j01N34o4n69L85L06o58M60N31
2707E48p85K13O78o69J49O60n52j92M99q2m12K47J03n79nL34p23j15L42k78l9
2728f58J78L4J43J29K67J67j52K38J27l01K32J41m19k1L02j53j30K19p2m54K03
2749B0J83l35r7K41k30l0J45j58K1n7j32R2j79J18L16k79K34L63j67J44L81j49
2771D45j19K21O9n21J57K27o67R3M09o29P9L87n15Q8L87l72l0L11k43n9L96j86
2793g2k29L15l5k69L87Jm73M86J19l88N68K6n38N70J32m91K03J39n08k0K20k43
$$ y = [502, 70, 509, 581, 16, 511, 628, -178, 54, 448, -95, -204, 325, -239, -516, 233, -138, -691, 152, -75, -954, -26, 138, -814, -28, 195, -693, -84, 366, -131, -137, 380, 146, 21, 621, 418, 142, 840, 484, 97, 567, 191, -91, 198, -192, -429, -144, -565, -542, -117, -363, -508, -74, -276, -377, 157, 93, -476, -91, 215, -443, 17, 548, -237, -24, 654, -15, 134, 794, 242, 50, 549, 467, 55, 302, 405, -174, -179, 155, -568, -683, -341, -619, -658, -480, -446, -303, -174, 93, 260, 108, 346, 473, 172, 404, 545, 126, 105, 407, 254, 124, 343, 271, -183, 20, 203, -132, -229, 12, -218, -248, -103, -261, -240, -297, -429, -337, -516, -398, -82, -361, -127, 236, 69, 213, 594, 445, 326, 547, 616, 95, 252, 479, -188, -95, 314, -315, -236, 151, -364, -276, 111, -261, -291, 20, -223, -282, 114, -72, -301, 14, -21, -290, 97, 98, -375, 111, 230, -158, 410, 436, -102, 468, 600, 109, 312, 451, -57, -77, 143, -100]
2815a00k09L09k93j52M49l34j69M67k73j37M71j92r4L52j45JK79j11k4K17K4j65
2837A71J98M2k35N8K10l39n8J89l85K0J14m12J05J37l61J53Q8p7O5J11O2K6Q1
2860c7J66r7K17J06j64K22k3j52J90p0j72Q1r6m7r8j25Jj40m3N4j78j1J72j56
2884d00K9K46o3jJ99N6n6J44J13j57N4K77k57o8K91k81l3L04k84n0J56k38pMj08
2909a30k8L3p3j04Q5L1j91J43O3j69K25M5j32L19n6k03L78Q2k93K55J01k42J70
2932C09O2k28K9J33k13j31J38j97k02L14j85j91K79k50r9L26k27m3J94j11P6K44
2954B7Kj8K04L4j20K00J60m15K67J73m53J89K22m83Q8J87m61L5J37l39j16K29
2976b51j48j71L65O2j95K25J52k54K76J08j57K42R1j51J50Q5j49O9m1p7o3r7k7
$$ y = [-100, -309, 0, -293, -445, 4, -330, -499, -32, -305, -442, 29, -163, -257, 95, -50, -49, 230, 119, 95, 312, 336, 171, 369, 411, 176, 234, 444, 105, 47, 236, -149, -129, -15, -427, -322, -185, -546, -393, -305, -382, -317, -206, -144, -118, -37, 129, 32, 249, 355, 191, 413, 390, 238, 428, 358, 186, 267, 171, 124, 26, -99, -98, -238, -281, -227, -405, -416, -244, -400, -371, -125, -188, -189, 10, 66, 10, 154, 267, 110, 164, 441, 184, 116, 407, 126, 93, 397, 113, 63, 219, -19, -26, -22, -130, -158, -125, -198, -302, -217, -186, -377, -234, -171, -340, -115, -70, -202, 117, 61, -142, 236, 318, 25, 280, 381, 139, 309, 371, 143, 172, 305, 92, -39, 99, -98, -300, 14, -171, -362, -83, -333, -432, -106, -333, -376, -182, -293, -217, 27, 29, 11, 215, 249, 129, 329, 489, 74, 341, 514, 61, 250, 472, -11, 77, 264, -197, -162, -25, -364, -480, -251, -399, -570, -205, -143, -338, -113, 39, -215, 61, 169, 12, 254, 345, 194, 344, 429, 280, 349, 308, 231, 168, 71, 44]
2999D4j78jl8n6O5r8n0K02j82m7J58p3JK18j01N3J71M9oJ36k6n5k1J68j64k4K25
3026C70k07l7J61j59j60K07j56k37N1J4j93k3K38j12k59M72q3l03M72nl65L76
3048F2J57k65P9L34j82j29L72j00l02L11n0k73K21k6k94K20j10k36J36q5j23J36
3070a47j97JJ06q7n5K45M9j99K83K96m78K49N31n28J07O20o68j4N57m25k56M06
3092C96k75l91L58M3n43J66K11n67J59M32m88J29L06l56L09K48k77J11K17j82
3112FK02K08k47R0K28j98j06L01l55j70M05k46m49N50l56m89O49j57m64L71M5
3133a82l46L66K84l90n0L74o6q8L45j06k30M53p7j80K57j30j47J75j8m0j20j54
3155g0J61j33r4R2j43l8l0R2Jj25R5O8n7Q8M8j28J58L4q2J35O6pNP8J30j17n7
$$ y = [44, -134, -135, -173, -229, -164, -262, -312, -110, -292, -339, -181, -254, -253, -35, -136, -83, 88, 137, 131, 267, 241, 186, 165, 333, 169, 145, 370, 163, 126, 287, 128, -32, 175, 19, -218, -167, -153, -346, -369, -131, -243, -502, -30, -113, -416, 56, 51, -314, 62, 219, -46, 33, 367, 185, 56, 428, 328, 26, 337, 287, 14, 235, 209, -85, 135, 25, -211, -75, -160, -283, -147, -344, -343, -237, -324, -379, -134, -85, -284, -1, 295, -183, 66, 597, 69, 176, 796, 128, 114, 671, 246, -10, 396, 121, -270, 88, 131, -412, -246, -35, -602, -443, -11, -499, -370, -64, -420, -111, 137, -140, -29, 188, 6, 208, 416, 169, 259, 487, 289, 183, 484, 129, -41, 364, 118, -331, 219, -137, -626, 23, -134, -598, -227, -182, -528, -162, 122, -268, -318, 56, -10, -98, 247, 141, -89, 364, 287, 107, 364, 234, 87, 262, 244, 204, 84, -70, 91, -42, -136, -44, -187, -225, -255, -163, -162, -287, -192, -124, -181, -93, -45, -173, -15, 19, -63, 72, 138, 131, 136, 214, 344, 227, 170]
3182A70J88j28j51K66k05j90J78j18k06J08Jj82p7J38k92oM90l08o5M33j46m0
3204a42M74k00j68L20M3j94K50j1k05N8J17j81J3J33l78p2J95k70q9J46k86J42
3226c05Q5j64P1J42j59K79R5k19J18K17o6%L55j34k12M00r9k35K93j74m20L07
3248A75k7l64R2J06k73M9Q0j00j56J95l7j46K55J03j28J27J17L6J13p1J4Q3r0
3271A53Q5j3j13J20N3j84mK1n3j05l8Jj14p0J63j81o6J95m3j11J49M0lm3R8N8
3297eo6K11l8j15L30n4r0J23Q5k10L9L2k07j6R9n0k17O6j2j81Q5oj77K14o4q1
3323c05K12m1OJ87j84J69O8j5K7L8N7m1J19N7k20J66O8k61n2K13l78mQ5k67M4
3348b52M7j68k3P5PJ1J5J28K8R3J55j09J09J68j15J30O4k06J80q2j44J13n2j64
$$ y = [170, 358, 230, 79, 345, 140, -50, 128, 10, -196, -88, -87, -269, -346, -208, -500, -506, -16, -324, -389, 44, -102, -142, 332, 132, -36, 284, 327, 133, 383, 372, 167, 225, 342, 161, 174, 307, -71, -143, 52, -218, -307, -161, -447, -305, -220, -384, -313, -171, -330, -51, 44, -175, -57, 160, 94, 94, 449, 315, 103, 503, 404, 169, 462, 288, -132, 175, 148, -216, -124, -18, -291, -242, -162, -262, -418, -223, -260, -406, -151, -48, -176, -49, 68, 104, 217, 146, 160, 243, 153, 238, 225, 112, 232, 285, 101, 97, 118, 65, -40, -78, -77, -191, -261, -98, -279, -345, -150, -193, -304, -155, -115, -118, -161, -63, -5, -71, 140, 102, -13, 317, 263, 173, 296, 381, 171, 210, 242, 35, 19, 118, 68, -149, -83, -95, -276, -191, -197, -374, -160, -224, -305, -93, -134, -128, 59, -125, 44, 112, 97, 124, 162, 219, 178, 297, 354, 134, 300, 368, 107, 55, 268, -110, -114, -29, -296, -252, -205, -373, -396, -321, -314, -303, -288, -160, -132, -39, 116, 7, 116, 284, 169, 299, 363, 157, 337, 255, 111, 224, 172, 8]
3372HMj9pj44j1M9j05m4J06j13MQ8m4M1JO0M0J8J52Q1m4R5lqJ35nj35J30j55l6
3402A39j7o0rj31j16R3p4j7k1k1Q3n2mR8j06J08mj02K64M4j91J73O0q3J32P8n3
3429B11L0L7j8j22Q1l1j51O1q2j86J48k04r5J60j64n7J97o6n2K23o3l0J85J00
3453A12j43J28J41j07pK09k05o4L54k23r7K26j72j54J49p1k29J7jj15K0N9j82
3476c55N8J19j18P7J96q9M9J31j5J51N0j10J91N3k25Q4J05k11j7R3k12n7J44j69
3500g7j59K38j24k60K86j50j54K42o9j50K31O6r2J62P8q4K5K50j09o1K89j54k9
3523A95J80j88j27K21j95j04Q5r2q9l1m7m3J5O8m2PM2m5O3K7mJ6J35m6Q2J26q2
3550A27N6P1m2%l8L2M1j37L6q6j28J53j59qL0j11o4k6J8j8J13m9l8L0J82q9M5
$$ y = [8, 12, -7, -14, -158, -169, -120, -225, -269, -163, -276, -272, -184, -228, -187, -186, -126, -86, -68, 84, 165, 121, 216, 213, 205, 340, 335, 200, 330, 175, 139, 122, 62, 53, -78, -194, -101, -175, -192, -213, -234, -151, -203, -207, -109, -215, -107, -111, -213, 51, 95, -96, 77, 137, 54, 186, 264, 211, 241, 278, 260, 138, 219, 188, 37, 98, 16, -170, -22, -226, -321, -161, -325, -382, -185, -251, -303, -80, -143, -173, 12, 112, -31, 97, 238, 131, 124, 333, 128, 64, 418, 195, 98, 324, 152, -2, 147, 76, -153, -136, -137, -252, -232, -173, -355, -297, -178, -296, -219, -23, -112, -63, 68, 53, 204, 254, 144, 335, 388, 163, 247, 352, 141, 124, 217, 5, -52, 92, -77, -236, 2, -122, -382, -96, -246, -400, -158, -227, -377, -146, -80, -172, -10, 68, -16, 9, 259, 150, 89, 378, 224, 195, 375, 187, 60, 281, 86, -18, 67, -25, -114, -145, -192, -235, -220, -152, -194, -187, -145, -190, -127, -100, -104, -88, 47, 1, 83, 209, 127, 183, 254, 212, 212, 174, 206, 247, 110, 146, 60, -68, 85, -74, -82, -52, -163, -227, -253, -235, -253, -140, -189, -227, -197, -15, -104, -59]
3577e9J67j34K9K00n0r0J92n3m1J43j41m4O6j11lj5j09o5j2l5j35J21m0q4J54
3602a49K2k60L68m0j66K66P9k32J48K23k11J26J52j15j17K72p8l03K85j1l56K31
3624A34l4l77J31M9k05Q2k5o7K7Q3L4j07J13P6N2Q6M4k3J23o6J12J62k60N0J14
3649C08j78P8M0k07l9M3j6j60J0M4k14P2J93k91l5K28k08R4K61m2j44J93J9J0
3673E9R3R5q8n6K63j62p1J44j22j18Q3o0n8or1K5kr1l4Ljn3M7J6PP1J25k12K40
3702D6O5k20K27J49k38J42J59k25P3R6j27l7J86j95j97J89q6k59J83ml18J48Q9
3725a54j80J51J18k38J37J28r3P1J74o5NJ31M1j78J66K3j56J66j6j64J34j32p2
3748cJ17j23p2mr6m3j6Mp8J45J3r2J68O8r1P0K20j66M9K01k02N7J57j30k4R1n3
$$ y = [-59, 108, -26, 3, 203, 153, 63, 255, 202, 161, 304, 163, 119, 185, 74, 71, 56, -53, -118, -130, -165, -300, -179, -219, -303, -149, -127, -387, -19, -59, -225, 41, 120, -112, 36, 259, 48, 174, 326, 211, 94, 366, 288, -15, 270, 259, -97, 134, 100, -277, -146, -97, -302, -220, -245, -312, -285, -202, -168, -275, -162, -86, -34, 52, 96, 73, 196, 130, 242, 404, 144, 194, 308, 130, 208, 248, 41, 2, 45, 29, -131, -121, -77, -291, -219, -26, -317, -352, -124, -332, -238, 23, -19, -163, 30, 49, 59, 152, 247, 159, 103, 366, 204, 133, 277, 155, 37, 120, 60, 2, -4, -95, -70, -72, -163, -197, -194, -195, -248, -201, -185, -178, -107, 18, -194, 46, 111, -109, 118, 267, 29, 171, 330, 105, 178, 274, 147, 110, 296, 101, -96, 93, 7, -252, -69, -73, -391, -243, -154, -334, -183, -65, -303, -166, -38, -131, -60, 114, 49, 54, 185, 226, 48, 214, 237, 81, 247, 231, 67, 201, 69, -3, 114, -9, -81, -85, -181, -224, -240, -236, -314, -169, -156, -248, -80, -12, -103, -33, 187, 21, 70, 271, 69, 126, 283, 153, 129, 220, 167]
3775A67q6L4K2r4o2K0o5j00J23r3o2J02q9l7K7J9K6q5J40J29n6Q5L7o2L9P0N7
3802B06n7J1M5m2l9M5j00M9J5j38n4M5j44J6Qj39P4K8q8P3j2m2J72pl5R6J11k2
3830G5M4J49j00PJ62j40j00K84k59r8J42j36j37O8q2p4N4k5q9N8M9j04J7J33j43
3855b45J79P8j39J82J23k01J17J91j92J48J20k09K6J14j94K1O9k26j11J26r3k07
3877c23K55j19j57K38j4j30K10j4j43L18j15p3J41L3p3Q0P4j15J2J55j49nJ37
3900B23o7o1J60k33o7K14k39m7J00j57o3Q0m7NO4r8J01P3M2m8M5N9k5J21J8j09
3926D4J90q7o9K22j14j09J36m3j31R9l9r2j4m9r0jL4q9n9R8j13J45J1p7R4J14
3952A1j51J96J09q9J32M7j51J20J7q1J0J8j02j1O3j71j36J65q5k04J49m2j68K17
$$ y = [167, 81, 115, 137, 43, -19, 1, -64, -164, -41, -134, -196, -94, -183, -220, -193, -174, -148, -233, -93, 36, -20, 65, 102, 40, 79, 149, 206, 149, 160, 205, 163, 124, 169, 69, 118, 133, -5, -59, -14, -158, -142, -134, -273, -199, -171, -259, -186, -198, -240, -68, -75, -110, -14, 97, 75, 119, 268, 168, 175, 337, 197, 97, 381, 122, 24, 166, 30, -107, -39, -121, -195, -141, -166, -255, -197, -148, -252, -235, -102, -245, -66, 12, -127, 55, 178, -23, 94, 285, 93, 241, 361, 152, 178, 292, 98, 119, 188, -38, -149, -23, -116, -323, -68, -187, -344, -106, -120, -250, -40, -54, -197, 121, 6, -67, 74, 107, 34, 114, 188, 73, 85, 240, 91, 86, 223, 156, 95, 255, 22, -45, 169, -70, -117, -17, -174, -237, -157, -204, -199, -135, -233, -132, -59, -17, -65, -20, 39, 14, 135, 153, 44, 234, 147, 78, 300, 186, 77, 213, 170, 39, 138, 99, 7, -7, -56, -146, -147, -113, -202, -261, -163, -276, -131, -120, -197, -103, 11, -140, 56, 165, 76, 208, 255, 104, 224, 241, 160, 170, 188, 86, 75, 138, -33, -169, -4, -89, -293, -144, -186, -354, -137]
3976a37j01o4K10l5q4K76m6m8J42J1MJ38l6n7O2Jk12J61P1l08J18P8k92P6J07
4001C5l15R6Q1k25P8J62j14lJ31J7j35J60Ml2J73q1K6K13n3j11K50j90j14K54
4025C07j58j68K14j46j76J38j4j84R1O1j48K7R5j68k4K55k12L5K37k26Q6K32j65
4048a1j0K06l8m6J59Jj88J20M6j70J21l6k50J47N5l10J94J1l22J73Q1k22J04P9
4072a06j47J15J32n8l4J82n4k3K14k7r4J85o4j00K14j59j56J57o4j33N9k3j65
4095a49K6N5j56n4J12o3j8J57j01o8K03LO9J13n2k4J38o6Q2jo7P2Mk7k6k6p6l3
4123B7J4qk07N7J4j75J46k7j09J12%k2oJ16J8J4Q5Q7p0JJ62o1k7Q1o6K9j2J7q6
4152A04n3L4l1j73J02r3j46J74Lj50J62j9j10O8N4j13L4J15kk0J41m4j1J87n1
$$ y = [-137, -238, -302, -92, -127, -211, 65, 19, -29, 113, 124, 128, 266, 230, 173, 235, 236, 24, 185, 256, -52, 66, 144, -148, -72, 35, -280, -184, -103, -328, -250, -88, -202, -205, -74, -57, -192, -32, -28, -60, 113, 32, 58, 271, 218, 107, 357, 167, 53, 307, 149, -19, 195, 49, -127, 11, -3, -187, -96, -35, -183, -156, -61, -229, -253, 2, -210, -175, 62, -164, -78, 154, -11, -21, 185, 147, 101, 260, 261, 73, 193, 239, 69, 190, 154, -96, 51, 106, -204, -10, 1, -321, -148, -67, -289, -185, -106, -253, -138, -6, -64, -98, 84, 30, 7, 221, 194, 100, 285, 221, 121, 335, 176, 20, 177, 113, -20, 39, 16, -149, -123, -68, -224, -278, -166, -229, -247, -90, -191, -259, -56, -53, 16, 129, 77, 53, 191, 125, 207, 206, 139, 211, 215, 188, 162, 136, 60, 27, 41, 33, -174, -117, -103, -278, -132, -159, -268, -156, -156, -178, -184, -68, -50, -36, 49, 136, 66, 67, 229, 168, 141, 222, 156, 185, 173, 190, 104, 51, 85, 54, -119, -17, -110, -256, -82, -79, -229, -67, -86, -196, -128, -74, -187, -153, -38, -40, -60, 81, 37, 26, 213, 162]
4177A62n6K14j83N2J33k31M6M2k20l4J31k17n7J82q1j46J67Ok05J94P1k73K40
4200f3J96l63K25K19k57J23J70j56k0J71n8q8J38m0j46J57q0j98J53j07k42K01
4222f5p5j79K01j04j65K53L9j20J75M3p0J03J25j23J56P5j35QK00k31j2J78j80
4245I7n4J58k55L9P1j19j01M6o1q9K31j28j23J28O0j41J51J33j80J36J30j32J22
4268A19J04q1P5N9j14J7L8q2n6k4k3k1L9r8p2P0m9j0J1n2m2J24r9J5J32l1p2J68
4296D5p2J3J22n0R4nL3Nj1Q7j62R3m4j15J06j00j20O9o6j22J18l4j31J27J1r9
4322b08K4Q8j5K0Q6n1K7J34o3K1K05j24K5J14q4o8J22j42j7K7r5k7k6j46l0O3
4348a40j22KO0Jn3J42M4j50K18L2j20J92J9j24J83J05j96J33N2j26rM5n3q4M9
$$ y = [162, 106, 320, 137, 189, 322, 91, 137, 179, -41, -75, 56, -161, -218, -36, -117, -263, -96, -90, -295, -101, -30, -303, -63, 133, -230, -5, 214, -43, 80, 250, 94, 74, 245, 187, 99, 237, 197, 51, 208, 128, -70, 83, -24, -266, -65, -140, -319, -118, -222, -387, -134, -95, -215, -40, 3, -67, 36, 161, 38, 194, 269, 134, 142, 342, 111, 99, 277, 97, 43, 201, -54, -15, 56, -63, -164, -118, -179, -268, -37, -165, -288, -160, -100, -241, -90, 43, -137, -1, 129, -3, 119, 223, 142, 217, 276, 162, 179, 217, 135, 79, 55, 32, 11, 50, -48, -120, -50, -99, -109, -98, -150, -192, -68, -167, -152, -20, -51, -123, 45, -27, -14, 108, 58, 152, 147, 180, 185, 174, 261, 99, 192, 148, 33, 139, 39, -81, -12, -78, -200, -82, -116, -247, -120, -109, -208, -184, -96, -111, -91, -5, -56, -29, 105, 42, 63, 268, 144, 169, 283, 199, 131, 253, 111, 94, 121, 26, -1, -27, -173, -203, -140, -262, -260, -200, -199, -252, -110, -66, -216, 2, 34, -86, 106, 125, 1, 184, 289, 93, 226, 278, 152, 143, 188, 135, 51, 100]
4373A00m1j46K5l7q7L2q6m8J75j14j5J51o5O5J29pq6J49J8pM9J10j01L4K3j43
4399G7K2M3r0JN4j06n0N6j13k5Rq9L0j4L1nJ7L9n9R7Q9k8R8rj9Q4rk8Q7oo7R3
4431B10p5m5J8p4Oo6Qo5j10Q2l2n3P8o7M7K1m5M8RM3J7J6P0K7k2M4J06o1N6lk2
4462A66P7o0r1K6j31Kk9j23P0n5OK2o8K2j0n4Q5L6L8O9p2Q1J6k1J12L5p5R6j0
4491A60nJ19j54L7k2l2p3O0q5o5l1q1j1m3L1k4%P6PQL6oJ28J8lJ05k4q1J82q7
4521A40o5J09L0q8K7r2k6l1P5m7j66J53j61l0Q7r1m4O6o9M6L7k3M7R0O0J8L1O5
4549A48j3OR5k9l2O9j30J5L2r9o9L3j92K7P9j00J8N6j06L6Q4n4l7R3L2r4J13L5
4577A6p4J38J5j17K12oq4J04L5j69M4J04j56l6Q3j67k6N9j33oO0j08j9K23j65
$$ y = [100, 59, -87, -62, -99, -186, -154, -240, -288, -113, -227, -242, -91, -156, -91, 38, 31, -55, 94, 112, 105, 154, 264, 163, 197, 220, 77, 99, 142, 52, 53, 107, 1, -49, 7, -106, -131, -122, -211, -181, -195, -164, -169, -152, -113, -172, -75, 14, -14, 84, 75, 56, 140, 131, 103, 190, 184, 117, 210, 135, 90, 108, 34, 40, -26, -18, -83, -193, -111, -143, -196, -118, -185, -138, -117, -162, -114, -105, -62, -45, -29, 41, 68, 46, 90, 196, 135, 191, 188, 166, 243, 183, 92, 118, -13, -11, -40, -163, -93, -148, -142, -120, -188, -166, -176, -230, -145, -109, -71, -2, -74, 7, 23, 2, 114, 149, 74, 170, 160, 155, 274, 120, 157, 135, 103, 30, 90, 5, -60, -91, -172, -183, -226, -195, -219, -219, -143, -136, -128, -92, -98, 30, 48, 45, 150, 126, 45, 227, 140, 75, 184, 214, 126, 153, 61, 35, 4, 79, 32, -134, 19, -142, -172, -85, -176, -220, -154, -223, -177, -140, -163, -116, -26, 34, 52, 83, 148, 135, 141, 236, 207, 175, 244, 114, 129, 161, 62, -7, 26, -166, -139, -60, -160, -142, -86, -192, -156, -72, -126, -163, -70, -38, -132, -19, 16, -58, 80, 95, -22, 190, 184, 100, 204, 239, 70, 114, 218, 62, 26, 109, -58, -84, -25, -158, -164, -104, -212, -231, -8, -173]
4602a73k4J57o3m6K13p8k4J76m3m9J40oj27Q3O8m6q1J43j67OL7j40L0Q3k17k3
4628a71Q9j34J8k9M3K9j4K5qQ7Q8o0J09M2q3J40j9KM2m2o6J00n6l0J9m2j15L8
4656Bl1j20M9j4l7p0O8m2mQ8K5r3J21K1NN2K2O1pN3O6j21R6K4j63Q5L1j50L8O0
4686A15j08j05L5o1m7M9L7j29L6O8l5K8M5r9J20J35j04O7M7O7j1k7kJ6N6k1o7
4713A05k4m2j5N3j15m9O7p0p0J74j42p5J22p3k7J14qj0K1k9L6J00J21n7m5J21
4739A83j8LJ14j13o1J1p4k5K9j04mj1j8n4NJ7k6QN4q5O8lq1J51R1j44J14O4n6
4768C5P8J3qP2K9n5l4L4J6r5o0K4j19Jm8j11Q8oj14P7N4n6RQ7mJ5Q5J20j79J52
4798A00L2j30J50j9j08J48m5m6N6n3l5K3j1l5p9pMl7K2l4j30J03n9k3Q3l2M1J18
$$ y = [-173, -197, -40, -103, -149, 64, -14, -38, 138, 95, 46, 186, 180, 53, 136, 204, 158, 77, 220, 53, 59, 96, -44, -14, 69, -148, -171, -82, -216, -198, -227, -184, -155, -169, -144, -152, -65, 23, -37, 72, 114, 31, 171, 152, 154, 196, 154, 88, 188, 132, 102, 121, 79, -36, 2, -29, -149, -100, -114, -151, -221, -153, -195, -199, -111, -86, -179, -58, -37, -32, 20, 42, 103, 96, 149, 215, 94, 190, 214, 51, 136, 167, 17, 55, 115, 7, -98, -63, -124, -171, -122, -85, -214, -178, -110, -145, -117, -72, -171, -51, 84, -20, 47, 94, 161, 150, 123, 121, 137, 193, 172, 105, 81, 39, 24, 77, -38, -87, -20, -90, -160, 14, -128, -203, -81, -154, -181, -67, -75, -85, -64, -93, -57, 43, 164, 107, 62, 183, 165, 168, 282, 169, 108, 119, 45, 20, 49, -55, -59, -70, -88, -142, -137, -120, -146, -138, -84, -169, -101, -104, -185, -34, 57, -87, 27, 91, 35, 113, 126, 118, 190, 219, 164, 130, 164, 180, 85, 25, 49, -70, -69, -117, -228, -140, -146, -260, -183, -129, -185, -176, -89, -93, -78, 7, 127, -52, 100, 132, 2, 152, 133, 25, 173, 128, 82, 138, 85, 50, 73, 62, 27, -52, -59, -55, -92, -70, -104, -234, -131, -190, -213, -130, -162, -121, -3]
4826cJ4lN7R7l3O8J2l7KJ6j46R1K0j52k8M1j26l8J05r3L7K4m6o1J28l5l6j1M1
4855i5RK5N0k1K8J00m4M9R3p9O7k2j08J31Rj01K8m1j24n5O6p4m4L9n6p8J49q6
4883a85OJ21m5k4J59j8m5J45j18N2J05k9j8rP5l8O3n6k9m3M2j01MJ5j22L8pj28
4911a90J03o8j07J16j4k5R9NJ8J16m1LM4J07n7L5O3j00m7J24j46l9J14j32N0P5
4937A06j81l7J22j18j07J65j03m2J00m7o2J22K5p9J04J20j46J31J07j48R6N4j35
4960D7R3P7j92O0O1j24K9O6j89j9P8j25k6J18j31m3J54j30m3K55r9j08K48m8l
4985FJ17j2l0J28K1j49J27rj13P3J5k10O8M8k33J09O9k43J19J7j43P3J34j62J5
5010a65J03l6%O6J0j5J42l4l6J70o0j9J27r4p1J22n3j41N0m1j01J17p7j66R6k2
$$ y = [-3, 11, 8, 65, 162, 129, 197, 209, 172, 174, 190, 44, 135, 155, 3, -25, 16, -110, -148, -43, -136, -99, -75, -121, -182, -54, -89, -125, -136, -95, -86, -61, -11, -32, -4, 96, 52, 101, 194, 115, 182, 160, 52, 183, 192, 91, 119, 78, -46, -101, -35, -109, -153, -114, -170, -248, -99, -185, -179, -58, -103, -127, 32, 14, -31, 114, -4, 48, 153, 124, 106, 97, 172, 134, 197, 141, 112, 69, 111, 10, 14, 29, -93, -55, -62, -190, -87, -155, -262, -146, -160, -185, -86, -81, -63, 53, 12, 15, 59, 166, 109, 144, 207, 107, 60, 184, 38, -1, 113, -19, 31, 106, -75, -112, 10, -108, -215, -50, -153, -195, -95, -142, -204, -82, -57, -136, -32, 88, -58, 73, 180, 32, 128, 182, 47, 140, 217, 25, 85, 146, 22, 51, 117, -72, -91, -13, -138, -164, -46, -177, -220, -66, -196, -239, 16, -83, -191, 57, 9, 6, 123, 111, 81, 209, 230, 81, 208, 199, 86, 159, 174, -36, 32, 80, -153, -44, 25, -218, -99, -82, -225, -152, -18, -180, -165, -62, -98, -98, -32, -22, -37, 105, 71, 35, 205, 145, 126, 253, 159, 88, 210, 157, 16, 66, 25, -76, 41, -36, -202, -106, -128]
5036a28j30J07O3j03J2J67j16M7J24r8J22J3k7pQ7o4L9M7m8L8k0j8j4N4q4p1J4
5063Fo4o8J16j44q6J12p0nJ00l0J2N3PMJ07K9l4R5n5N4j4L9p1L7j1j11J08l8j00
5092b2N9J0j96Q7J3j45J03j2j19J69n6k7K6J43n7k7J36k2n5J02Po9J53o3k6J25
5118B37q6o5Q8j04m8O2q0q1L7j06L1%J8r5N7O8j19O5R5j17M4J28j37J77J09j87
5144iJ28Q3r3K6R8r9m0Q3p8j05J35r4j78J41q2j50J76n1q1J17l3j30J29M8o5J04
5170b0M7p4O0N1l7KJ44q8m5K11q5j05J89k17k1J39k05MP2q1r3R8r2r3J52Jj12
5197a98N9J15j78J76R3j58Q8J05o0R7O4j75O9J51j40j9N0l6j0j2m5r4M4j5j14
5222a43Q4o7j38J48j9o5P8M1n7J51k7j5N9M1N4J0j4J6l6J00j24j9J10p1j1k9q4
$$ y = [-128, -258, -151, -88, -191, -179, -12, -128, -81, 43, -55, 67, 80, 53, 46, 133, 69, 108, 155, 107, 145, 125, 107, 93, 147, 63, -8, 6, -58, -126, -10, -154, -240, -128, -198, -203, -103, -133, -121, -68, -61, -57, 50, 79, 45, 140, 85, 139, 125, 164, 93, 130, 119, 8, 116, 78, -22, 37, 47, -149, -62, -49, -194, -91, -103, -222, -53, -109, -136, -110, 33, -24, -51, 85, 63, 8, 110, 117, 48, 201, 138, 112, 237, 151, 86, 174, 70, 22, 84, 4, -77, -40, -146, -115, -115, -97, -192, -135, -67, -186, -121, -26, -143, -99, 29, -108, 69, 178, -9, 119, 202, 109, 135, 233, 134, 94, 177, 99, -6, 129, 35, -143, -2, -84, -234, -58, -109, -190, -73, -106, -236, -107, -59, -124, -20, 27, -47, 13, 64, 27, 29, 173, 85, 40, 251, 166, 61, 250, 33, 12, 151, -54, -50, 22, -59, -152, -54, -146, -239, -87, -86, -198, -139, -24, -202, -26, 67, -91, -3, 102, 42, 139, 203, 28, 97, 248, 108, 89, 139, 103, 93, 81, 36, -58, -14, -29, -143, -59, -126, -264, -116, -135, -200, -122, -81, -138, 13, -14, -29, 30, 71, 125, 135, 121, 137, 101, 201, 77, 58, 168, 97, 86, 57, -27]
5249b7J3k6k3l3k6j5L8p5K6R5q4L8P4m1k5J30Pk8J4J32r5L4P6q9j1R5j26mJ25
5278A69j05l5rj19M9J9l3j7l4J9r4Q0L8r0R2L4j04J17M4o0J39oo7Q5K1l7Q7p1
5306A12L9m6J8j7j31P5j2j05R7j00q4J28j40n7J42j09k2J28k9l9R4K3mK5O1lQ1
5333A25O6o3j8J68j88pJ25j23j11J63j54p1Q0j41k4O7j9p4P1L1j5M7P2m4%J61
5359A24j34O7J19j41J43Kj44J47Mq1kO9j38q2N0J4q8P0m1j30M7j6o1Q3k9m9J25
5386g2l2J7J09k9l1J50m6RO2L5j12J46m9j34O6Q4j98Q6K6j40O1J0j31P8k1p3L8
5413i1K8n2m4N7PL4RJ7J7L0K0OK4L7o4K08p7p5J26r1r6J15j92K2L3l6p2L0l1j5
5443a16J4l0n2Q8J7l1M2P8j33J55K7j32K15k0j32J75K9j24O8N0j01LL2j04j4M8
$$ y = [-27, -14, -40, -63, -96, -122, -137, -99, -174, -148, -53, -137, -99, -25, -66, -91, 39, 46, 18, 32, 164, 69, 103, 179, 90, 79, 174, 48, 44, 169, 64, 29, 20, -99, -50, -31, -64, -81, -115, -96, -190, -110, -72, -162, -70, -36, -140, -23, 21, -39, 100, 94, 27, 112, 133, 96, 183, 112, 151, 105, 123, 106, -25, 50, 38, -67, 30, -70, -154, -26, -166, -223, -81, -190, -212, -84, -113, -152, -58, -35, -39, -14, 47, 44, 125, 191, 128, 110, 278, 90, 83, 208, 85, -26, 137, -17, -88, -8, -149, -173, -106, -125, -199, -128, -97, -112, -65, 7, -37, -37, 124, -10, 57, 176, 35, 178, 180, 36, 183, 187, 106, 104, 173, 35, -47, 3, 17, -71, -1, -42, -172, -125, -141, -202, -119, -148, -197, -72, -104, -87, 22, -7, -38, 112, 66, 75, 137, 172, 60, 206, 157, 23, 89, 173, -25, 61, 87, -53, 8, 18, -113, -35, -56, -129, -91, -63, -115, -159, -102, -95, -61, -52, -35, -18, 12, 32, 38, 62, 99, 35, 243, 166, 91, 217, 126, 30, 145, -47, -25, 8, -28, -100, -70, -101, -116, -102, -132, -184, -96, -79, -110, -68, 10, -123, 32, 59, -73, 142, 122, -10, 165, 194, 70, 138, 188, 87, 90, 122, 18, 4, 52]
5469E2j28q3J31q6n1J14j30n5J92j25J7J71m5%Q6n5MP1O9n4Q5k7o0J0M9p6pO9
5497A38j95Q5jr4j5K5r6R1Kr6K7M7l2J8L3l7J2J06J2q7J55j1l3J24q4k1J16j12
5525G7m8J26p8m0N1n6p2M0Kj06k3R2q7m8Q7j03L5J20p2L0P7l0P2j9Q8K6j9m2L6
5554A16M6l2Nn1N7p9k2or2Q4n8p8P7q4k5P2q4j0M1K8O9p6O3M8j7M7nL1M1M9pk7
5586A21K1qK4r0l3J7p9ol0k1N4m6j01R5r9L5J7k2L2M1qL3MM9K4M7L2J0m0J06j06
5617G3J5N2j13O5J1j18J7k7o0J9l3rn5Q0Jj12P9k9J9K6M2k5N2O9j1M4K3K0K5R
5647A49p3J01l8j4o2Q0l0j75J15r0o7Q8p2q6J39j09l7M1ol3R0J4j5L4N1NO0N7
5675A17o6j4J04j22P7O0q4k7Q9j14J6M2j27OO0j13K8l2Qr6N3j7K3K6J6j9O0P0
$$ y = [52, -76, -159, -28, -114, -165, -51, -181, -236, -44, -169, -152, 19, -26, -26, 60, 5, 9, 80, 149, 95, 180, 153, 93, 103, 152, 76, 69, 138, -57, 28, 27, -67, -82, -57, -153, -62, -60, -156, -129, -82, -114, -96, -63, -100, -88, 18, 30, -57, 98, 87, 54, 178, 94, 73, 189, 77, 29, 155, 77, 37, 88, 32, -40, 0, 2, -104, -127, -35, -122, -170, -83, -186, -151, -31, -103, -73, 4, -26, 46, 27, 115, 141, 122, 80, 116, 162, 130, 135, 84, 141, 62, 40, 34, -58, 26, -32, -110, -33, -117, -142, -70, -154, -164, -123, -95, -26, -102, -39, 9, -8, 39, 34, 65, 106, 155, 148, 121, 142, 134, 158, 68, 35, 52, -27, -33, -63, -84, -30, -76, -177, -82, -181, -146, -129, -151, -119, -78, -86, -53, -49, 0, 24, 71, 103, 113, 73, 179, 73, 88, 140, 27, 92, 103, -15, 2, -25, -85, -66, -99, -108, -163, -83, -82, -194, -115, -144, -125, -99, -57, -82, -30, 39, 28, 72, 95, 115, 140, 149, 76, 177, 139, 125, 63, 143, 113, -62, 53, -37, -104, -16, -88, -174, -35, -144, -181, -140, -146, -179, -89, -75, -90, -56, -5, 0, 60, 117, 51, 37, 141, 19, 96, 156, 72, 45, 134, 20, 36, 78, -49, -43, 17, -96, -68, -100, -92, -188, -135, -152, -129, -103, -87, -106, -46, 24]
5703B4q7O7M0oN1N5M8n0p9P1j12Q9o2RKp1r8O0Om9k2j9l1j3P3q5J42pl7j4R7j3
5735b1nQ3M4l9J17m9n4Q3p5J5jj4m9q0J3N7j32L7k5k4N9k0n0J8K4k9M0O5J5k9
5765b6j2Q2Q8n6k2Q4l5OjNm6k0P5n8j7Op4n7j3nRn9k2Q5m3M3l1j0R5j7n2J86o2
5798B6%N2QL4J2k6J3M1p6J7l6j2k6Po4k2k0J4p5O8m7j3J1N4o4J5Q9l3j0J13q3
5829c3L9K3O5l2N9K1m8J5RM7r2j1p8N3p5m0M2q1m6N7J8o0L1j3L0K8k5M1k5Q3K5
5860B7l2Q2pp5J18L6p6K5j1N4l1o5Ro4K8q7k1O4o2m7Q2q6O8qm8P5K3n7K1M7L6
5891A8k6L4k2N7PL1M7p0Ol0O3kl4l7j4l1J1n9J5k2j05L8J1o0J08l7l1R8L5k1%
5922b2J7P2k3M7Ok6P0j9j16R1l2o9O0n0KM8q3j6K3m2j01J02j6l9lJ8j3K7O6o8
$$ y = [24, -63, 4, 44, 38, 89, 144, 192, 142, 63, 134, 22, 111, 49, 58, 60, -11, -109, -49, -43, -92, -114, -133, -164, -177, -104, -189, -47, -54, -91, -105, -8, -21, -26, 57, 101, 62, 179, 130, 76, 159, 84, 99, 98, 84, 35, -45, -32, 25, -107, -70, -95, -119, -60, -80, -130, -112, -88, -117, -77, -12, 3, -26, -38, 44, 132, 76, 54, 138, 103, 109, 108, 113, 67, 47, 122, 64, 47, 53, -21, -78, -91, -96, -87, -146, -168, -83, -126, -83, -114, -124, -29, -46, -98, 88, 26, 26, 78, 86, 120, 132, 106, 119, 160, 84, 101, 65, 53, 27, 34, -30, -52, -72, -58, -133, -65, -112, -125, -114, -60, -124, -109, -20, -53, -63, 50, -33, 6, 29, 94, 62, 121, 142, 94, 109, 118, 165, 73, 62, -16, 37, -38, -78, -36, -117, -163, -106, -88, -148, -117, -130, -100, -72, -97, -56, -81, 2, 27, -5, 77, 70, -5, 113, 149, 73, 98, 87, 141, 110, 45, 54, -10, 18, -69, -90, -26, -88, -135, -53, -139, -71, -79, -127, -52, -29, -86, -65, -18, 18, -8, 26, 4, 61, 68, 99, 146, 76, 82, 52, 115, 113, 79, 42, 28, -3, 8, -51, -36, -58, -163, -125, -114, -174, -66, -103, -134, -36, -1, -22, -22, -5, 67, 44, 91, 97, 71, 141, 122, 6, 97, 65, -4, 56, 6, 8, 56, -27, -43, -20, -62, -163, -61, -77, -116, -119, -101, -114, -87, -21, -89]
5952h9Q3P9n8M5N4m1J6M9m6M0or2O8n4Ko5J1m2K6jm3m5K9n3l8Q2j7RQ3n5m3J05
5984gJ7OL5N3p6M8J5k5J8N9o9Rm1l1L1j7q1J6l2o6L9O7j18P5M2o8K6M3m4K3L4
6015a9J2L0K7N9j5rL2r3J02op4O0o7qO4l4n7kp8k3Q8p5rL2k1l8M0M8p3Q0N0r9
6047g6O4K0k1J16J0l2nM8m7Lj5L5k8Lo9K6r0N2m0l6kk9Q4j07jJ03m0M4Q3q3MP1
6079D5j12J31K6o0qQ0l8J4J6jn8N6j7r4N7K2j15jQ1k01J12K1o3J7L4n2L0O3j02
6108a17Q8J10m7m3N2L2m9Q5Nj01Q9K5q0K6rm8O1j05j8O1r7j7l2L9n6O8J3m4mJ09
6138dr6K6R9j12J30P4r2K9O4o7K4O0L3j02N0l2p4L5l1o7P2m7p1M3rr2N6J5m5R9
6168c2o3L1Q2l3M1K0j5JK2P9j19N2K1p6M4L0o9j6O4n7k3N0j36N5J0o0M2l9N9m0
$$ y = [-89, -6, 73, 15, 60, 114, 73, 89, 138, 92, 132, 126, 34, 102, 48, 50, -15, -4, -46, -20, -21, -64, -109, -80, -133, -171, -89, -106, -97, -14, -69, -112, -7, 10, 16, 51, 104, 28, 76, 91, 66, 84, 143, 74, 83, 42, 11, 42, 25, -56, -40, -72, -138, -99, -32, -150, -75, -33, -101, -75, -32, -76, -53, -19, -7, 23, 50, 109, 94, 85, 117, 24, 126, 120, 46, 106, 39, 31, 95, 61, 4, 2, -76, -99, -11, -86, -95, -63, -84, -122, -82, -34, -107, -27, 23, -76, -12, 8, -13, 103, 113, 81, 76, 124, 77, 80, 65, 100, 72, 75, 6, 32, -58, -6, -46, -82, -84, -113, -29, -136, -137, -34, -74, -30, 53, -30, -26, 45, -67, 64, 90, 30, 22, 102, 64, 78, 94, 93, 35, 91, 74, -20, 37, 59, -56, -57, 24, -177, -65, -44, -107, -90, -56, -108, -78, -15, -117, -29, 81, 34, -9, 43, 75, 26, 111, 116, 15, 104, 129, 49, 75, 66, 18, 79, -26, -44, 17, -80, -97, -129, -90, -146, -78, -65, -109, -113, -4, -100, -74, 25, -87, 43, 117, 25, 54, 118, 51, 75, 135, 168, 66, 116, 84, 10, 45, 14, -53, 19, -28, -99, -56, -65, -157, -101, -86, -131, -32, -95, -64, 18, -15, 26, 46, 31, 32, 54, 133, 14, 66, 87, 11, 55, 85, 16, 0, 64, 7, -16, 34, -102, -47, -37, -97, -55, -94, -35, -75]
6198g5J8J3l5O9Rl7P8n6L4P4k0k7P4j06Q6J9n7k4J2m9lLj11N7j7N0m1j4K0q0P6
6229f0P0j14J09Kp3O9N1p7N3J00r4L1Q9p0j8P8j11j1J12r8l5J7p8p5J48j02pJ20
6257B6q0o7M7n7mP3LNP5J4nJ7k2m3Q7P5l5PK4r2O7M0k14L7Q7j38K6P4j10k7M2
6288f8j07J04L0j6p6K3N7k5R8K1q6J34l1m1Q3L0l4k8K6m9M1l6j9lj6l5m5O9q3
6317h2j5k0j4J5J0K1k1J29q5QM8kRO7kj2L5Rk7k0M6l3j4K1r6P8k3p7Pj4p1L4Q
6350h3MJ7n4K5j4M2J4L6O0k9l7N9L0j1L8K3m7Q3j30O2M4j05j2L3j5o6k5J0l0K1
6380e7kPo9lL7L3%k8MP2o3P6O7n5qK9L3qJ7j2N8j9m2n6N5m2k3qL1q3K7j1j25M3
6414a25M7p8J20o3m5J47k3k8L5M9q5R8j3JN9om8M1L2p6J4N9r6MK3j41O7J0r4K8
$$ y = [-75, -57, -44, -79, -10, -1, -38, 40, -16, 18, 92, 72, 45, 119, 13, 99, 118, 61, 37, 49, 0, -3, 0, -111, -54, -71, -21, -62, -76, -56, -136, -60, 10, -104, 5, 7, -66, 3, 54, -23, 30, 130, 36, 67, 156, 86, 68, 146, 35, 24, 136, 38, 3, 20, -58, -133, 15, -87, -94, 26, -54, -121, -74, -131, -135, -62, -59, -54, 21, 35, 30, 47, 25, -18, 69, 144, 109, 116, 140, 48, 115, 155, -59, -22, 65, -73, -47, 27, -83, -110, -68, -175, -71, -41, -57, -133, -110, -53, -78, 20, 41, -45, 89, 58, 17, 100, 130, 96, 68, 94, 45, 86, 50, 31, 28, 12, -23, -68, 1, -82, -97, -117, -131, -116, -106, -85, -106, 23, -62, -54, -6, -8, 1, 68, 66, 54, 89, 98, 71, 51, 97, 64, 50, 71, -25, 53, 30, -47, -40, -54, -125, -91, -83, -79, -62, -116, -91, -105, -63, -49, -13, 47, 18, -19, 40, 70, 59, 97, 120, 73, 156, 26, 88, 132, 27, 15, 48, 33, -33, -58, -48, -78, -57, -59, -52, -121, -124, -87, -54, -54, -82, -78, -6, -69, 7, 74, 19, 11, 40, 73, 65, 82, 70, 128, 109, 67, 11, 66, 24, 1, -7, 24, -59, -32, -43, -168, -125, -78, -156, -36, -99, -144, 3, -20, -48, -13, 36, -49, 49, 36, 37, 96, 90, 42, 83, 115, 39, 53, 112, 16, 20, 43, -98, -31, -21, -115, -87]
6444h7M6o3l6O0J2l1O5j2l7R4L6o1Q0L2q6R1K4o3R3r0l6K6Qn4OK7p4m4j5oJ4K8
6476e3k6l6Q7j07K8P9l7j5J18m5L6J01o8j5K1K2J1l2Pq3J46q6n7L3m3o2J7J0o0
6505a09P4m2l8PO9k0k7RM1L3j4O1k4M6%n4Q5m8PM8l7QM5j35N3Rp4l8K7j3K9q4
6537a06L6l0L2j6j2L1k6k4R8L7n8O4j3M1K0n0L3N1m3l8M3pp5N4j4j4m1O1p8q4
6567a28J03m4p6O1j3oR7nk9R9o1m3J00p9O7O3k5oo7R2p3R6o4n1M8K3p6OL1j07
6597f7K3L0q6J1K0k9OM1nL0Kj5L4O4k0m3R1k4j5N6jo3R9j04k3L8rm9J9j8n8O4
6629am9n8j0P1p7K2J6JN1j2jJ2J04p7J6K0k8N7L6k5J2ml5j6K8l5m8O3r0k7P7n6
6661f3o2R0q6M3Onl3P7L3l0K2J2LL2J6j1j5L8moP9q5P1q1k1n4M8l2O2p9j9kj4
$$ y = [-87, -41, -104, -140, -80, -68, -99, -34, -46, -83, 11, 47, -14, 66, 98, 12, 103, 127, 64, 157, 67, 31, 57, 65, 11, 17, 44, -30, -74, -89, -95, -81, -53, -79, -115, -28, -135, -107, -28, -65, -80, 38, -7, 29, 130, 62, 47, 68, 90, 101, 69, 76, -7, 139, 53, -4, 29, -14, -76, -59, -49, -109, -35, -77, -115, -108, -39, -59, -86, -77, -36, -3, -17, 44, 20, 66, 66, 12, 97, 49, 56, 104, 67, 75, 120, -15, 38, 47, -27, -65, -38, -51, -22, -106, -70, -100, -68, -84, -96, -65, -91, -115, -17, 20, -38, 26, 13, 54, 74, 24, 57, 108, 65, 27, 70, 63, -12, 42, 28, 14, -27, 34, -44, -128, -25, -69, -145, -84, -97, -103, -6, -11, -40, 59, -2, -45, 55, -24, 43, 106, 81, 75, 8, 100, 27, 123, 59, 8, 56, 79, 3, 9, 40, -67, -44, -14, -100, -89, -69, -98, -92, -51, -56, -26, -24, -39, -5, 59, 39, -4, 87, 63, 48, 104, 103, 40, 139, 35, 12, 50, 41, -8, 11, -7, -65, -1, -50, -108, -118, -47, -124, -102, -86, -85, -34, -46, -47, -35, 69, -8, 8, 28, 0, 57, 93, 68, 80, 76, 41, 25, 53, 18, -30, 33, -57, -84, -7, -63, -125, -35, -121, -78, -72, -77, -110, -33, 0, -30, -8, 4, 7, 39, 55, 44, 29, 67, 63, 57, 136, 51, 122, 41, 20, -34, 14, -18, 44, -35, -54, -56, -70]
6694g0n9J7K6J7J5L9K6n2P1Ml5P9m8nJ07o6Kl9J6M9o6j3Qk0l3J5l6K5l4MJ7m3
6726h2l2P6o3M9K0l0R2K2p5K2J2K4KL1L8o7L9l7L5K9r2J0K6l4No7L2k4k8k9PO5
6758b4l4M3l4oJ0QL8l4K9K1j7K8M3p0R8m0o4O3Po4R2ko1l0Ln7J8j9m7P6on9m4
6791a35M9%K7K9K8j2LM0k0R7q3ON7Kj3nj4mkk1k9%K8j01M7k9J9j8N9o5O9j6m7
6824e4j4Pk5N8P7n0n0Q9k8rL6M1J9m7nJ8l8P7j17k6N3k6K8m8j4J8o2RpkM9N0n
6857BN0r1L8R7o9O8r6P0Pj3m2L9L9m5L0k0m7k7K2k1L7o4J6nn0lk9O0j3K1l9K3
6889e5P4r0N9N5J2j9O0l7M2l4K1L1r9K9n5J4l4K1qK0n5nO6j46L1mN2QJ9K%M1q4
6922f8O6J03q1nj2O3l3K6K1q3N5J0J3n4J3r2K8N1o2Po7N6J9o7N7L8m9K2J3J6M8
$$ y = [-70, -129, -112, -86, -69, -54, -15, 11, -41, 30, 34, -1, 78, 30, 25, 132, 66, 68, 29, 45, 94, 28, 15, 23, 3, -30, -15, -51, -26, -60, -56, -39, -82, -114, -38, -101, -52, -32, -62, 30, 52, -23, -1, 11, 35, 37, 68, 106, 39, 78, 41, 76, 105, 13, 23, 49, 15, 20, -47, -15, -39, -67, -96, -89, -24, -58, -15, -49, -55, -45, -37, 1, -33, -4, 17, 0, 28, 71, 1, 99, 59, -5, 58, 65, 1, 93, 91, 30, 0, 3, -54, -36, -55, -102, -26, -32, -91, -135, -86, -86, -59, -30, -2, -14, -11, 29, 9, 106, 23, 29, 86, 88, 75, 70, 56, 52, 50, 29, 0, 0, 28, -73, -26, -55, -36, -54, 5, -60, 9, -7, -54, -68, -61, -86, -28, 49, -1, -51, 38, 10, 1, 37, 78, 97, 50, 45, 63, 25, 102, -15, -41, 12, -14, 14, -34, -48, -30, -92, -83, -90, -92, -43, 7, 2, 52, -39, -1, 96, 27, 95, -1, 69, 76, 63, 21, 60, 99, 54, 84, 64, 17, -10, 12, -9, 28, -36, -20, -25, -75, -78, -107, -47, -60, -39, -78, -55, 19, -71, -12, 43, 55, 36, 96, 59, 101, 67, 88, 119, 20, 49, -6, 8, -26, -5, -13, 7, -48, -53, 13, -133, -102, -106, -54, -46, -27, -25, -25, 16, -68, -2, 101, 20, 15, 3, 66, 33, 59, 80, -3, 52, 62, 75, 21, 34, -58, -30, 21, -41, -34, -101, -45, -26, -93, -36, 2, -47, -25, -12, 4, 52]
6953E2n5J7j2%M8l0N3l0N3o9Lqo1Q1l5pl5OK7n9N4n5jK2j8J9qQlL2NKN0j6m6N2
6989C6J1o0K9m6R9Oj6M0q6m1J5L3l5n7M6k2j6Rj4Mnk3N9J4nM4n2n7J16rL9o3M2
7022C5K7m1P5m0M7n7p3K7rK6m5k5J6L9L1q7N5p6M8l4L3o6M9L8l5mk2P5K8Rk9N
7054B0J02k3j19O4m7M8l0j6ql5mL0K6n4M6m4l2K9m5R6n1O3kJkk1N0k4N7o8k1O9
7086E5Lj05Q6l9KM8m7K5j3M6o0q4N8m0j7P4n4M2j5j7K1J4L0J4j5L6q5O2J4oJ0
7117D3kl6N5n9L8K8l7m7Nk8KJ9pn4nKN7n5O5%k9K7rlM5ml3N0kJ6QK9n3J1J6j1
7153D2j7K8q3M1qk3L9qk6m6O3l2k7JJ2Mj4L5J4JN8L4m6k9K1MJ2n9J01p5NN5m2
7186C5N3q9q4O9J7l3m3O6n7K8K2rn5M2kL3K2n8L9kM0L4r4N9k9O0L9o8k1RoMq5
$$ y = [52, -3, 14, 2, 2, 50, 20, 73, 43, 96, 27, 30, 22, -39, 42, 7, 0, -35, -29, -2, -61, -7, -62, -63, -41, -59, -40, -48, -40, -43, -11, -6, -4, 46, 30, -16, 36, 47, -13, 16, -30, 69, 75, 59, 99, 13, -28, -13, 20, -15, -72, -26, -48, -64, -55, -69, -65, -70, -93, -34, -20, -25, 19, -33, -90, 26, 17, 56, -7, 35, 62, 21, 96, 56, 103, 46, -27, 0, -9, 17, -28, -53, -37, 2, 33, -54, 1, -75, -27, -61, -28, -94, -45, -7, -42, -46, -68, 7, 35, 44, 15, 20, 122, 99, -20, 44, -3, 45, 15, -1, -9, -44, -48, -18, 8, -46, 0, -44, -76, -47, -92, 4, -47, 16, 14, 15, 13, -8, 42, 18, 75, 7, -14, 55, 58, -47, 39, 0, 2, 50, 3, 28, 15, 61, 1, -83, -25, -65, -82, -8, -62, -20, -35, -52, -31, -17, 13, 27, 12, 48, -37, 25, 39, 33, 43, 41, 5, 60, 1, 39, 67, 30, -17, -12, -40, -38, -19, -26, -80, -85, -83, -26, -81, -16, -16, -45, -18, -27, -30, 15, 11, -22, 28, 26, 42, 50, 79, 26, 37, 53, 42, 25, 53, -30, 11, 3, -20, 19, 11, -15, -61, 2, -30, -57, -56, -44, -40, -54, -19, -5, -4, 54, 88, 42, 13, 34, 38, 50, -9, 92, 17, 22, 77, 35, 88, -1, -85, -16, 1, -32, -75, -9, -66, -38, -16, -25, -80, -38, -40, -7, 15, -43, -4, -6, 34, 68, -26, 33, 4, 64, 103, 35, 14, 23, 17, 21, -64]
7219f4P6j4o5N5k9J5M1om4J%K6m4J1M8m2L7k2J4O3k2l2L9j5oML5n9K0M4p4M3m7
7252a3JJ2n1Lj2N5j6qO1p1jO8j8l1M4j9m1K6L2L5l3N2p7N4M9r1K4j1l7O6p2n4
7284g4R9l6j2K6J4q4NJ3j0N4k6o2P5J0m7O7J6m3P8n1j1O7l4K5j2J4o3j2N4p4O3
7315B9o4k9L8l4M8k8j8L3k6j3LK7J7j9Q3J8n3J7qj1J3JL0mk6M5l2k6l3O2r8P3
7347A5Pn4K9n8L2kk0j2KN1J2j8N2L6l8ok0J3K8l3K0K2j5L6mo1L2Or7M6K7m4l1
7380d7M1j5k0j4M9jq0P3j3M0pl9N4j9PKmJ9O5p2oQ5p8K4Lp0J0M2l2L8m4m%l7K5
7415b5k6j4M3m8P6k4j2M0J1J7Qo3L1k1M1K3m9M4L0m9pj9Ll3N8r1J1J7K3k9k0K3
7447c1p9O1k0O8Km9L1M5rj4M5o1j0O8j6k3P7m5n1M8k0m3K5k1K5k5k7K8j2l6rQ
$$ y = [-64, 12, -2, -67, -12, -41, -26, 15, 9, -35, -34, -34, -8, -52, -41, 7, -35, 2, -20, -6, 57, 35, 3, 42, 27, 21, 25, 60, 1, 21, 65, -9, 34, -13, -12, 0, -51, -48, -60, -5, -21, -29, 32, -39, -40, 28, 10, -21, 23, 4, -37, -11, 21, 56, 23, 75, -2, 52, 101, 10, 34, 23, -14, 52, -20, -74, 25, -11, -23, 3, 17, -67, -62, -49, -59, -5, -31, -93, -18, -8, -55, 12, 28, -15, 63, 12, 1, 68, 34, 59, 47, 61, -2, -14, 40, -34, 29, -35, -64, -26, -60, -12, -40, -58, -25, -51, -64, -61, -34, -17, -36, 47, 65, 12, 29, 21, 10, 23, 24, 54, 50, 24, 69, 37, 11, -22, 40, -58, 15, 22, -32, -3, -61, -29, -31, -51, -63, -61, -10, 2, -16, 36, 72, 34, 28, 8, 21, 49, 16, 36, 58, 43, 79, 75, 14, 46, 52, -45, 1, 28, -16, -47, -6, -21, -41, -55, -6, -7, -87, -14, -27, 13, 6, -33, 21, 2, 9, 11, 7, 26, 91, 19, 13, 98, 20, 44, 47, -23, -13, 29, -3, 35, -9, -13, -13, -50, -25, -51, -65, -22, -70, 6, -18, -30, 10, 21, 38, 46, -17, 14, -7, 34, 57, 8, 52, 82, 33, 26, 7, 10, -23, 35, -56, -45, -28, -5, -34, -54, -31, -110, -49, -69, -1, 1, -48, -17, 28, 19, 5, 50, -11, -21, 47, 31, 8, 85, 40, -11, 37, 17, -26, -1, -22, 3, -22, -49, -21, -33, -69, -78, -70]
7479g0N2p3R9l0M0oO4q0J6LJ2J9l1K6Nm6jLL7kk9j4j0K4p2M5n5NqP4Km1m2J06
7513B2o4L8Jk1J9j5L9K6m2O0l7jK4Nj6k6j6N4m2j6PK0k7rpnj8j7Q2l1l1N7o8N4
7547aj2Jk8kO8K8O5j04M7l5k4M5ml4M2k7k8n0K0M1l5J9n3L0L7j31J00J2n4R2l8
7578a3m8O3Qj8J3L4j3J9k7R0m6m4M2l9k0Ol5K1Kn4P5o5jjPJ7jl6M6j2O2n0L6J9
7612C7k1M4m7oN4M4r7O2jl5o0L0rk7O6o8J1%j5j7k3K3L2j7M3n7M9L5l4l8L7k7
7644c2O6k7j3O3pL2m7j4k2L3J3Jk1j5Ln8Oj8J2OK7J8K9m8l1J1NL1J3l6M7JMM9
7678H1l5l2L9l5j5K9n7M3j7M5p3k8N1jj8K2Ol6j7RN5n3K6l0RN3l6J6J2L7l0Q0
7710A00q4pM4j1K6p0m3L6PL1p9M3j8J1m7K3J0k0n4R2k9M0o7K3N4l8M4NrN0l9%
$$ y = [-70, -18, -91, 8, -22, 18, 12, 76, -4, 12, 15, 27, 46, 15, 41, 46, 0, -1, 2, 39, 37, 8, -6, -16, 8, -64, -19, -74, -69, -77, -3, -1, -42, -84, 22, -42, -4, -3, -24, -5, -20, 19, 45, 3, 63, 26, 25, 49, 54, 38, 12, -4, 50, 8, -8, -1, 19, -8, -17, -24, -29, -47, -64, 18, -13, -44, 13, -55, -1, -13, -12, -40, -42, 26, 54, 119, 15, 62, 27, 3, 48, 44, 10, 52, 25, -3, -53, -33, 8, -27, -8, -61, -31, 6, -125, -25, -13, -67, 25, -13, -61, 2, 10, -8, 5, 39, 26, 45, 18, 108, 62, 18, 60, 21, 1, 7, -28, -7, -5, -59, 16, -49, -50, -51, -44, -27, -28, -64, -18, -30, 32, -18, 18, 37, 16, 60, 13, 7, 61, 105, 8, 70, 69, 34, -26, 4, -5, -32, 34, -34, -23, -23, -38, -55, -78, -55, -23, -40, 3, -54, -5, 30, -4, -42, -5, -32, 34, 7, -6, 57, 50, 82, 35, 21, -1, 32, 45, 46, 25, 10, 13, -45, -39, -57, -45, -39, -12, 6, 35, -13, -44, -33, -28, 3, 16, -20, 27, 28, 32, 81, 46, 14, 53, 18, 3, 32, -25, 18, 1, 46, -27, -55, -4, -5, -23, -1, 5, -31, -48, -39, 16, -37, -11, -41, -32, 21, -15, 1, 13, 50, 20, 100, 16, 9, 53, 42, 68, -2, -45, -9, -2, 29, -50, -7, -25, -14, -61, -38, -28, -48, -102, -10, -39, 1, -66, -43, 11, -27, 17, 22, 13, 63, 24, 24]
7742B4P6k1n9l4L5n2K4N3p4L4L1n5ko2J5O0Nj03J03om5pR1k1j2%NMkM5j2J6J4
7775F8k3jJ3r0L4rm8K7K5o4L6k1j9N7oPlm3M2k4L4%Mj8J02k7j3Ll2J7%o9J11r5
7809b5M0K4j5j6l7K6l0K3k7k3PJ4L3n9Q4p1M6%j2%N9j4k8M9n9R7r3P5m1L1l9m
7841A5NK3m1Rj2n5k2L3M6j8m1Q8K7j08N6LK2k0K4j7k3M8Rk4j1Q3m1k1k2J4k9N3
7873E3p3K9J3n0%J1j1K2m6M4j2j9K3l9N7l3k9N5K0j3N4j4mk8J2k4P3m2k6L3j9
7904A7J4j5k9N2k6L6l6l9K3k4%m4P7j2JrL3k2J0M3m0Kk1M6j7rkJ9j7p0J28q7k6
7937d4rM3j7K3j15O2L4L9o5J1PJ1Lol1L0M7K8k2L8o1J7K1k0L4m3k2J0k3K5lL7
7969C9m3l4L6%j1oj5m1M5K7On3L3J0k0K3K8j8M6j0k1P5j0q1L7l3MOK3Oj9n6Qr
$$ y = [24, 100, 79, 20, -14, 21, -31, -7, 46, -28, 6, 37, -18, -20, -82, -67, -7, -2, -105, -2, -8, -53, -60, 31, 10, -2, -2, 3, 7, 5, 50, 38, 54, 68, 45, 44, 57, -33, 1, -8, -56, -29, -4, -68, -32, -53, -72, -15, -21, -14, -17, -60, -18, -42, -8, -8, -4, -22, 80, 53, 40, 43, 11, 28, 28, -41, 70, -25, 15, 39, 24, 8, -29, -3, -33, -10, -37, -60, -53, -39, -6, -65, 19, -52, -6, -6, -18, -18, 41, 27, -1, 48, -11, 86, -7, 68, 27, 58, 19, 15, 20, 43, 2, 11, -1, -56, -78, -45, 1, -17, -58, 30, 57, -51, 5, 8, 30, 10, 34, 17, -6, 42, 51, 27, 16, 99, 58, 37, 15, 29, 0, 53, -20, 9, 22, -28, -28, -17, -28, -6, -52, -8, -20, -39, -16, -55, 2, -31, -60, -5, 15, 2, 56, 42, 38, 10, 22, -2, 71, 29, 3, 36, 17, 31, 16, -13, 39, 13, 49, 13, -26, -3, -27, -27, -71, 6, -6, -5, -14, 19, -3, 7, 50, 10, 12, -9, 37, 20, 11, 9, 28, 11, -59, 69, -18, -44, -53, -10, -27, -4, -119, -57, -23, 16, -49, -38, -31, -20, -17, -23, -54, -24, 23, 51, 29, 67, 6, 23, 44, 24, 58, 15, -7, 3, -20, 5, 2, 39, -4, -38, -2, -2, -13, -19, -34, -75, -30, -3, 3, -50, -17, -7, -27, -4, 24, 6, 52, 42, 21, 96, 86, 5, 42, 9, 13, 19, 42, 48, 29, -27, -19, -28]
8003b8M5l7m4N7j7N%L1ol0Lp5J07K6n6M1qj1M6nn5j8J1O2j3j8Nl3oj5J3m3L6M4
8037A4qr2N6j0O6j9m9J16l6q5P8j2m1K3j3J7Q7q4N0m9n0j0L9%j0J1k9OO3m1n0
8068f2M2nJ0p7M7j4O1J8K0l5k9L6rj2P6o1%K7qL3o9K1l2M8Kk1jj6J5k6m2M0rJ4
8102a8j2K4nQjp%m8P9qlJ3l7M9K2n0J3M2m7oj5K8l5r0J01Nm6lqL3k2m1Q9p5M5
8137b6K8LN7j3o1JooN3M2m2nl0OM2k7nj4l1O3lk3k4K4j6k6K3k1L2nl2k8N0OK4
8172A0J9m5K9mJ3N7l5q4M1M0o0N7Nr7N5k4J8k9l3
$$ y = [-28, 17, -20, -64, -7, -24, -19, -19, 12, 6, -24, -21, -96, 11, 37, -19, 22, 14, 3, 49, 44, -11, -29, -18, 44, 31, 13, 18, -15, -21, -36, -23, -66, -30, 14, 6, -86, -30, -40, 26, 7, -42, 74, 38, -47, 31, 19, -22, 1, -12, 5, 92, 8, 58, 9, -41, -51, -12, -12, -22, -11, -40, -34, 29, -12, -62, -20, -25, -15, -92, -45, -59, 2, 20, 40, 5, -24, 12, 3, -9, 67, 6, 6, 33, 25, 58, -11, 10, -22, 26, 28, 7, 6, -10, 5, -21, -63, -23, -32, -18, -30, -6, -11, -3, -4, -11, -11, -59, 20, 12, 9, 22, -15, 34, 56, 6, 19, 61, 14, 8, -7, 21, -14, -104, -3, 2, -44, -47, -55, -22, -44, -85, 4, -71, -26, 2, 5, 62, 49, -12, -11, -17, -23, 30, 72, 30, 25, -5, 1, 43, 16, 11, -3, -34, 29, 26, 3, -21, 3, -13, -39, -16, -37, -5, -10, -42, -70, -20, -14, 10, 29, -16, 13, 9, 22, 79, 44, -40, 1, 41, -19, 38, 43, -54, 1, -23, -5, -34, -67]
8191f7
$$ Imaginary data points
##PAGE= N=2
##DATA TABLE= (X++(I..I)), XYDATA
0@%%%%%%%%%%%%%%%%%%%%%%mQqQqQqRj0J1j1J1j4J8j9J7j6J7j9J9j7J8k1K3k3
47a1K4k7K8k9L3m0M7n4O4p7J01j35J77k41L33m72O91j046J665k855N499j3205
69i530O7423J88073m52788j3346L21139l37507o6238L78228j72197j67257L17781
80E3781l6637j58869K59936L9325j78764J25439K8858j33744P4715J1220j00969
91a5709M2560j6834n3300N6808m7408k5927J07479p5960o6103J28651o5032p6154
103a06929J70570n6013j53985J74137J6889j85370J67802R6354k23372R7132J53566
114A50781j97206N8613J85743j95341l6290J86232j28933q7276J56000p4573j28241
125a10491J03275j9955j03532R1581K7932p7856M9863L5056j7665N6077J3342
$$ y = [0, 0, 0, 0, 0, 0, 0, 0, 0, 0, 0, 0, 0, 0, 0, 0, 0, 0, 0, 0, 0, 0, 0, -4, 4, -4, 4, -4, 4, -4, 5, -5, 6, -5, 6, -8, 10, -9, 8, -8, 9, -10, 9, -8, 10, -11, 12, -11, 13, -14, 14, -15, 18, -22, 25, -29, 35, -42, 59, -76, 101, -140, 193, -279, 412, -634, 1031, -1824, 3675, -9530, 57893, 245966, -206822, -220168, 100971, -236536, -302774, 75454, -96743, -264000, 53781, 17144, -141725, 118211, 157536, -21228, 104211, 133069, -675, 74040, 85260, -15709, 26851, 10017, -43283, 13525, -33883, -59810, 47669, -28291, -94394, 34257, -30775, -106929, 63641, 7628, -146357, 27780, 44669, -140701, 27101, 123455, -99917, -2785, 150781, -46425, 12188, 197931, 2590, -33700, 152532, 23599, -63677, 92323, 17750, -110491, -7216, -27171, -130703, -39122, -11190, -89046, -39183, -4127, -21792, 34285, 47627]
136D7627j4497L0986l1149q055N2448n4558k7782O2105p6908n5631J01607l8551
148a2358q5270R0402p364r1636R3921M0631r7267P1461O9325j08698L2637R1331
160H7115q9462K951Q2480q1298k5631P7270m1034l1535N2290k8226m0828L3116
172b792n444j8227K5610j7351k0365K5058j0328L580L0872l1936Q1M6455l1707
185f494R42O1808l9316k1211O7194l8125m1195P3557k6503o8416O2855j917p8832
198e5653M8234K7243p8385K8027M6815p2710J3986O7723n3756k314O2977l9478
210g291j1258N7699k0294k1380L7129j0797k3259K6569j727k1807J3569q864j9543
223a1254J5389r911j5569J7281j4343j2345K6372j1680j0587L3273j2904j7536
$$ y = [47627, 33130, 64116, 32967, 24912, 77360, 22802, -4980, 57125, -19783, -75414, 26193, -12358, -97628, -7226, -14590, -106226, -12305, 28326, -68941, 2520, 71845, -36853, -4216, 87115, -2347, 604, 83084, 1786, -23845, 53425, 12391, -19144, 33146, 4920, -35908, -2792, -8236, -26463, -853, -18204, -38569, -13511, -23839, -20259, 10613, -21323, -21242, 25213, -6494, -5552, 56256, 16940, -4271, 62923, 24798, -16397, 57160, 30657, -37759, 25096, 23179, -55653, -7419, 19824, -58561, -30534, 16281, -56429, -42443, 25280, -28476, -30790, 32187, -7291, -18549, 39150, 18856, -2524, 34605, 23808, 549, 27118, 25391, 3584, 17153, 8289, -11254, 4135, -5776, -21345, -4064, -18407, -30752, -4380, -16060, -26647, 6626, -6278, -23814]
235b3814L9797p457k6218M0583L84l7459L1645J2015m1385J9497K2702m4413N130
248h993L3502m0749m411M1737l3663j3693M3311k0062j9871L7407m355k6197K1322
261E285Q258k4531Q812J3872k1132J164J6376j2986l038J2525m285n431J918J910
275a283k53m743M208O437q832M404J5977j2068n177K0491r755j6959J8119L73
289A0939k2279J2001J3194k3389L233K4204k2431j0382K6157j5298j7355K2097
301F91m649j7160J7138J0048j5108N667K0230j0641q931J9106l248j4753J1154
314I544K310j2636M016Q147r395p056R349l424j5611N449M288j6310J841J3295
328f193j0333j616J8678k326q181J3918N918j0899L260J0658q991k860J4852o209
$$ y = [-23814, 15983, 8526, -17692, 22891, 23275, -14184, 17461, 29476, -11909, 7588, 30290, -14123, -8993, 24509, -16240, -20651, 21086, -12577, -26270, 17041, -3021, -22892, 14515, 10160, -16037, 5285, 13543, -10988, -2176, 11696, -9436, -8272, 8104, -4882, -7920, 4605, 320, -5111, -3193, -1283, -1536, -6279, -2071, 4366, -4466, -62, 15915, 3847, -1330, 19161, 9406, -7553, 10566, 10939, -11340, 661, 13855, -9534, -6301, 17903, -4528, -14910, 11247, -4051, -21406, 691, -3958, -21118, -3980, 6068, -9040, -3373, 16857, 6216, -2715, 16391, 13143, -1610, 9544, 11854, -782, 3234, 11381, 1986, -5070, 4279, 855, -14756, -9307, -5019, -21329, -19488, -6193, -16526, -18142, 536, -1790, -9971, 3947, 9865, -1034, 2226, 12884, 3893, 1033, 15885, 9676]
342I676p872J4642l326j2369P050J23j2192j446N326p093n649J2579j072r606
356a1229J3831M438j1180O593N831q990l89P059m415n188P997N63q625O444M774
371G514j0528J521P267q685k035R711m049o404P754K637r157O67P937r092p145
386a2087J1511n232r937J3918R48j0807J0497O686j0227L109J2380r900q439J5762
400H182m429j4345J6288K296j6690R900Q485j0949L391R820p226m505R211o02
414H827p789M828J655r739j143M751n229o402L683K533p933j332J2337j388q429
429a0770J5210M202j5610J3594J1249j8661N976J4725j9060n892J9391r307j6284
442a1237J7704j538k3381J6872R515k3756J0137J3930k0839J052J6810r865n021
$$ y = [9676, 1804, 16446, 13120, 751, 7801, 7924, -4268, -5714, -388, -7481, -13130, -551, -1623, -11229, 2602, 7040, -4140, 2453, 8284, -706, -1095, 5964, 1549, -3639, 4358, 4921, -3704, 2740, 7514, -3014, -1493, 5774, -2911, -4946, 4765, 716, -5688, 2066, 4703, -4454, -3787, 4150, -4942, -12087, -576, -5808, -15745, -1827, -879, -11686, -1189, 5497, -4730, -1621, 10759, 859, -7580, 8182, 3753, -10592, 5696, 7992, -8698, 1202, 9687, -1262, 2129, 11949, 4723, 218, 9429, 8827, 1038, 5866, 7521, -2218, -3361, 1390, -3839, -10241, -6558, -4025, -11958, -13290, -953, -2341, -10770, 4440, 8642, -6968, 6626, 17875, -786, 5190, 19915, 855, -5037, 14354, 5047, -11237, 6467, 4929, -18452, -1580, 7935, -15821, -5684, 8246, -12593, -11541, 5269, -4596, -9617]
455i617J2552m943j0109J0466N721n650L850K364m516K855M709K211J367n378
469E882k442J830m291M007M060j6656l181J2098j0532l216J5521q534j1727J5300
483a881L881j3184J1523J1093j8235M120J7366j6869j694K0456j1649r555J4323
496I695o026j2577J3312P827j5175k263Q335p741N24J3982o494j1819N091K010
510a319l387N944L934q105n242O768M966k594L238J373j0700M38Q695o063k029
525d083P064m645o285O119N715l944K157P563r019o266J0240q38m374N957k143
540C218q605J087Q360k89o241L852l188j2734Q381J0673j0530j111R927p884m710
555i794J6781K136j3267O517L970j5199O955J6205j2142k310J3261j2459m782
$$ y = [-9617, 2935, -2008, -12117, -1651, 4070, -1580, 2270, 4634, 118, 2973, 7682, 9893, 11260, 5882, 3440, 5270, 979, 4986, 9046, -7610, -10791, 1307, -9225, -12441, 3080, -5454, -17181, -1881, 2000, -11184, 339, 11432, -6803, -2683, 14683, -2186, -3880, 16576, 4927, -4628, 9695, 3669, -8908, 4404, 12231, -2944, -5207, 3128, -4613, -4089, 9893, 3399, -8420, -3329, -1319, -4706, 1238, 5172, -2933, -8175, -1407, 3559, 965, 4203, 5576, -5124, -4686, 4009, -2054, -4083, 2981, -1664, -7949, -1830, 3885, -59, 2098, 9661, 642, -5624, 4616, 3778, -596, 5361, 3218, -5387, -4300, 4060, 3771, -2470, 1382, -1806, -14540, -6159, 4514, -6016, -7127, 2800, -5084, -9794, 6987, 9123, -4144, 2373, 6343, -8856, -1901, 14304, 2162, -148, 13113, 654, -4128]
568d128J9041m565j2148N256o302r976R045M824q442N4J487o474O674P737n543
583c460M581j1r884J1256O353q927J0064L147j4073P230O943j3650M919R988j9813
598e337n591J5324j1840l717K2691j2274j7574K1771p79j5959K0944J541k5692
611a6492J0233R772j3198J1881R653j8385O38J2945p210J239R794j2355m029J1838
625F324q298K69J4122j2343m465J1035j2690q31J5236j3854p082J7037q309j0626
639a4475K0337M84j5978J5155K094k0660J5385J2622k0757M901J1655j7902L686
652c453J6342j3342k450J2301j0932m051J3833k441n241M368n345l446Q741k405
666B479o205N939m313o169Q878l751m673J1197p512r007J3917m55p294J1651j35
$$ y = [-4128, 14913, 10348, -1800, 3456, -2846, -12822, -3777, 1047, -7395, -7341, -5854, -12328, -5654, 2083, -3460, 1121, 1110, -8774, 2482, 8835, -92, 9972, 13119, -954, 6276, 13219, -431, 4488, 14476, -5337, -10928, 4396, -7444, -11161, 11530, -744, -18318, 3453, 2674, -13285, 7659, 9200, -16492, -6259, 3513, -9685, 2196, 11849, -6536, -5898, 7047, -163, 1076, 10870, -1485, -5514, 6324, -1974, -1705, 12417, 74, -4391, 6644, -6046, -6877, 8359, -5495, -12577, 4460, -3849, -14475, 5862, 6346, -9632, 5523, 7617, -13043, 2342, 14964, -5793, -892, 10763, -7139, -3453, 12889, -453, -2903, 9398, -1534, -5585, 8248, 5807, 566, 4934, -411, -3857, 4884, 2479, -3726, 2213, -2100, -8269, 609, -3142, -7815, 3382, -4130, -13137, 780, 325, -6969, 4682, 4547]
681D547j1289R299O236j2645N209J0782j4011k562J2081p877j950J0979r375p305
695g881J0367k074o146O745m74n676L542P68k965L065K105m290j907L759K078
710A016m60K8P46K303j400j530M217j868j475N048n152l383P683k270n265L536
726A774j272n209K112K159m489R13N086m505k448O207L23k570J020l22O64J595
742A038R2J076o02k75K700k871k267O047j545n506M586Q48m855L913J588p674
758c707Q51O415p449l451J0042m130o157R610k416o518Q628p36q223N108M157
773B024n146Q32N580k196q25N099k557k816M353j036l299J068N13R7j153j523
789i85K524p88l592K540l58m179L705J322n535K592M503m001p3N529k574k758
$$ y = [4547, -6742, 2557, 8793, -3852, 1357, 12139, -1872, -4434, 7647, -230, -2180, 8799, -576, -7881, 2486, 412, -5734, 1011, 537, -5139, -1597, -829, -3794, -729, 1376, -2914, -4821, -1062, 1016, 556, 584, 1330, 3633, 2233, 703, 4920, 3052, 1577, 6625, 1473, -1910, 5773, 3503, -1762, 1774, 502, -4707, -2595, -436, -4925, -4012, 1074, -3431, -5879, 328, 651, -1919, -899, -1221, -557, 1038, 1130, 2206, 1604, 1329, 4029, 1158, -1109, 4938, 3393, -2113, 2473, 3321, -1534, 2379, 3967, -3707, -2856, 3559, -3890, -7341, 2701, -1429, -7586, 2024, -392, -6910, 1718, 982, -7241, -2133, 2024, -3122, -2290, 3290, 1094, 269, 5368, 2811, -5, 4348, 3312, 13, 1081, 1594, 1691, 538, -985, 1539, 751, -2841, -301, -659, -4838, -1133, 189, -5346, -2754, 1749, -2252, -2325, 3204, 630, -2128]
805b128O995j682o612P798J049q650N515L770o263K382L250m416l32K985l792
820a31l881L437j700m462M009K55l043M139O16k605K450M83j884P10K63M5J537
837B38M12N44J491L65k19J51n50j173K2Jj971J033J745k709J198J780m067J229
855d80J314m958J000K225l281K44L391n02j438L381J241l203L070J499m253K922
871B172J644m386K330K407l532K44K384j642j761J185j36k065j51M61j204k54
887b304O45n30J95K25m78N94m20J91J295j550J289K545k374J808L664k322n73
904A900K323o96j828N49P31l535m54K590l418q09L111k716j621K135l0q49N86
921b031J133o71m77K268L9j795J986P99k237P41J768q18Q9J675l59j763J036J855
$$ y = [-2128, 4867, 3185, -3427, 4371, 5420, -3230, 2285, 6055, -208, 2174, 5424, 1008, 676, 3661, -131, -4012, -575, -2275, -6737, -2728, -2473, -5516, -1377, -761, -3366, -916, -433, -2317, -1607, -1344, -1299, 238, 650, 1194, 2685, 3050, 2831, 2982, 2432, 1259, 1281, 1282, -689, 344, 2089, -620, 578, 2358, -1709, -480, 834, -4124, -3124, -899, -4180, -3936, -545, -1047, -2485, 896, 2137, -1066, 2004, 3503, -750, 2172, 3816, -570, 1760, 4167, 635, 879, 3263, 1621, -140, 1045, 909, -1156, -1307, -846, -2050, -2304, -1659, -2189, -1994, -1769, -2247, -1653, -2073, -1882, -587, -2137, -848, 1697, -677, 1131, 4795, 2473, 1900, 4223, 3527, 1699, 2248, 2979, -556, -1010, 1580, -1838, -2647, 464, -2252, -3873, -1738, -1768, -2617, -2031, -898, -1569, -2046, 222, 261, -1534, 452, 1251, -986, -245, 1523, 705, 794, 2469, 2110, 347, 1383, 3238]
939C238k050o31K193k475j495K255q07n54L60j944k39O45N55J37j107Q70K97o34
957a386J452N47O2n87q93J864r44q57L494j311k855L303N49k504K140J339l353
974F0j36J966k597m51L570k833l916L668R8l846L564J023m765J862J837k097K109
991h84J788j264j2O88N82J120J444m79p59M50j747J167K594l644j54J351n873
1008c632J334N026m947j235L375m804j267P009j489m695N113J6n963O383M692
1023D916o667K542M573o351J815O341n364m23M283n528j507N021k273j951K747
1038B174k219l207K173M06j720K419k219l674M506j92j625O236k259m459N600
1053A940n52k624O040j370o514M289K420n558M010M727q838q52P078n954k178
$$ y = [3238, 1188, 557, 2750, 275, -1220, 1035, 228, -326, 34, -1910, -2149, -1504, -949, -812, -1919, -1049, -752, -1386, 66, 613, 675, 88, -805, 1059, 115, -742, 2752, 1441, -1414, 1889, 2438, -66, 2074, 3413, 60, -76, 1890, -707, -1158, 2412, -421, -4337, -669, -571, -4417, -853, 170, -4595, -2733, -896, -2993, -884, 904, -360, -372, 316, 898, 2018, 3462, 2983, 2224, 2674, 927, 2094, 4688, 1044, 890, 2241, -3632, -2298, 2728, -2219, -3454, -79, -4883, -6150, 859, -630, -5325, -212, -196, -6159, 224, 4916, -1751, 791, 5364, -987, 828, 7169, 1805, 1382, 5665, 137, -1370, 3651, 1378, -573, 2174, -45, -3252, -1079, -673, -2393, 26, -2193, -5867, -1361, -1553, -3178, 3058, 799, -3660, 1940, 1388, -1236, 4804, 3434, -3080, 1209, 3629, -1929, 2081, 6808, -2030, -2882, 4196, -1758, -3936]
1068c936P604n386n311P175j451m062P204N89o291K534K529l499J183L741l003
1083c80l003L152N57j095L548N45k934j029J195K116j046j80J972m393j197O192
1099D020j079k858K913j616m365K485K689l613m46K778l848j300N817j250l499
1114c172L844K01m732J293L556j251j039K832K6l943K972N424m030j189M151n516
1130e73l078P684j278o483L604O10p462L838P383p981k530P556n651k059R878
1145C458l120m877O714o72l798N600J738m344J653J598l244J704J931k846Q52
1160B347j17l502K523M6m000L610o94o733M885K237p183M818L876q368K879P009
1176C633o414M23Q324n427l453R103l125n738R393k139q970P491L12q159O392
$$ y = [-3936, 3668, -1718, -7029, 146, -1305, -5367, 1837, 2426, -3865, -1331, 1198, -2301, -1118, 2623, -380, -3383, -231, 326, -769, 2779, 3324, 390, -639, 556, 2672, 1626, 1446, 3418, -975, -2172, 4020, 2941, 83, 2996, 1380, -2985, -500, 2189, -1424, -1870, 908, -2940, -4240, 1577, 327, -3172, 672, 873, -3859, -2566, 990, -261, -1300, 1532, 1558, -2385, 587, 6011, 1981, 792, 4943, -573, -3651, 4033, 2755, -3728, -124, 486, -6976, -3138, 4245, -3736, -6266, 1290, -4361, -6420, 3458, 338, -4539, 2175, 1503, -2295, 3305, 5043, 699, 2352, 3950, 706, 2410, 4341, 1495, 2347, 2230, -1272, 1251, 1297, -2703, 907, 213, -6520, -1635, 602, -6581, -1763, 2113, -6255, -3376, 3633, -2781, -2358, 5966, 539, -2914, 6189, 3064, -2674, 6719, 4580, -4390, 3101, 3413, -4746, 1646]
1191A646J942q279K548L541m785J744L890m928o48L963k857R01L971m261n73L863
1207A678l098Q55L977m859j53M754m033K43N547m507j537N759l479l293N490j541
1223A803n281M499L24o051M375K358o178L831K707o506L041L947m824R87K824
1238A856l676J12L581j993j605K780j076j509K983n80j323K502r60r97K434r05
1254A624r07J552j770m28J609k592q03K040k154q23J974j847o69L001m12k244
1270b849K633J253k498K040J686k589J971P45k836K457R39k834J207L28j640J093
1286A106J64j583J86M48j345M2M94j536N53J012k466J009K541k423J72K207k084
1303a503Q81K268k748N84L302k220k88K884j512q86J788j631j646J971p91k690
$$ y = [1646, 3588, -4691, -2143, 1398, -3387, -1643, 2247, -2681, -3329, 634, -2223, -1322, 2649, -1612, -2185, 1678, -1420, -565, 3412, -1447, -1600, 3154, -879, -636, 4911, 404, -1133, 4626, 1147, -2146, 3344, 1803, -3478, 1021, 1345, -4706, -331, 2027, -4151, -320, 2387, -4119, -1078, 2869, -1955, -968, 1856, -1820, -1708, 1873, -120, -1725, 1055, -21, -1530, 1453, 873, -450, 2052, 1092, 95, 2529, 1624, 717, 2269, 499, 71, 1680, -912, -1715, 325, -1829, -2652, -678, -2525, -3194, -193, -605, -2849, -216, 1037, -1461, 579, 2265, -324, 1647, 2392, -444, 2013, 2952, 118, 1325, 1653, 13, 1106, 1270, -313, -127, 321, -1024, -982, -488, -2024, -1471, -459, -2925, -1916, 625, -1798, -1626, 581, -1503, -622, 1646, -1102, -518, 2784, 564, 276, 3160, 1648, 762, 2550, 919, -727, 1244, 453, -2237]
1319b237K096K75k365K657m57k870L488j99l555K946M45k548K407Q02k313J949
1335E21J843k995M34K908k570m07K773k485j62L397k514j200L380j762j485K092
1351A768j694r57J859k120j181K264j077j439J842l92j539K233R2k913K585J268
1367E99l289K386J608k806K790J567l149J868K146k851m65J905j468j203J436
1382A074j204j293K107j110j949J953q09j412J752q04q09K501l42r85K205J87
1398A062n44J470l22q72J610K82j756R67J190k066r7J015k358J76J264k867PJ727
1416a12k001R9J157j341J51J108r25k71J944J41j274J817O38j532J857M16k116
1433b44J512O23k065Q86J032j527L5O28j419n41J094m53j278N39N53n94K48Q53
$$ y = [-2237, -141, 134, -2231, 426, -31, -2901, 587, 388, -3167, -221, 224, -2324, 83, 885, -1428, 521, 2364, -631, -197, 2711, 141, -266, 2507, 22, -140, 3257, 743, -457, 2923, 1161, -324, 1768, 74, -883, 976, -1144, -2325, -61, -1138, -2577, -735, -1127, -2666, -433, -341, -3254, -669, 599, -2690, -304, 1304, -1502, 1288, 2855, -294, 1574, 3720, 869, 404, 2309, 841, -362, 1074, -130, -1423, 684, -426, -2375, -422, -1231, -2643, -891, -1695, -2504, -3, -345, -1330, 875, 1062, 518, 1988, 1666, 794, 2404, 2686, 930, 1897, 3087, 1021, 924, 1939, -419, -243, 1021, -1846, -1839, -112, -2113, -2014, -857, -2198, -2047, -939, -1864, -2135, -191, -50, -1324, 493, 1131, -401, 1456, 1872, -244, 1268, 1891, -174, 712, 1744, 217, 252, 880, -539, -1080, 14, -439, -1717, -1178, -625, -1219, -971, -118]
1451a18J30K53j88J01P42m15K92L92j615O32P19j764O89J115j637q6J542m72q09
1470d97J673L45k215J136J445j959O56J184j882l11Q41j147m94M18l32j002k20
1487b361J196M42m66R76P95j255M55J795q20j101J682k41k223K083J925l432P01
1504A51K729l575j34L672k578j437K917j429k333K360K04l065J204R57l340P98
1520b899K413j615P00J613j305J078J508K19J585l52j558J380L1j541J601q12
1536B046l976Q00J220l122J101K426m360j61N245k819j528N890k608l599N846
1551B401q20m419M658R70m978K321K560m159J052M196l700r29L748k981r01M230
1567C249k058k467J818j350r15J909p60j475L73n82M43J735l73l5J493j071j72
$$ y = [-118, 12, 265, 77, 178, 920, 505, 797, 1189, -426, 206, 925, -839, -150, 965, -672, -758, 784, 312, -497, 1176, 1521, -694, 442, 1887, -72, 584, 1768, -114, -425, 416, -731, -1225, -807, -1139, -2141, -2361, -1165, -723, -1189, -213, 582, -673, -218, 1577, 757, -344, 1338, 1097, -1126, 957, 2882, -550, 151, 2880, -695, -829, 2843, 265, -1172, 1745, 316, -2017, 343, 547, -2518, -1314, -357, -3697, -2899, -486, -2101, -1401, 212, -1093, -15, 1493, 1712, 3297, 2945, 1387, 2767, 2798, 1257, 2858, 2046, -1930, -1130, 90, -3032, -1931, 495, -3865, -4026, 1219, -1600, -3128, 2762, 154, -3445, 2401, 1581, -2838, 1820, 2790, -2188, 133, 2693, -1466, -414, 3782, 82, -847, 2901, -80, -981, 3249, 1191, -1276, 542, -808, -1723, 186, -574, -2049, -1676, -2258, -1815, -80, -453, -488, 1005, -66, -238]
1584b38K958p68j947K132j240k921L184M8l537K815N60l991K384K624k867M57
1600c47K343k739r94L819p15k610K363n57k800K301N37k308O37L64j243J77J410
1617c62M93p49N01J174r75k71J733J70j151L17J90j256L07K014n88j711N95l29
1635A02r52J812O1k196rkm26J027K36n34o97k19J607L70o37J011K79q64R24J386
1655B279j226o55K311j082k395K509o51l140L029M27m199J435J479l018J419K612
1671A134l353q25L135j219p29L274j198k517K641Q27j486K051k93j907J802J52
1687A489q30J719j235j443J591r38j269J783q93k051J970K65k692K434J781m001
1703b320J559K931m054O68L846l504o23L593k302j234L547j098k473K756j87k670
$$ y = [-238, 2720, 1952, 5, 2137, 897, -2024, 1160, 1208, -2329, 486, 1046, -2945, -561, 2063, -804, -347, 1996, -743, -1737, 2082, 1367, -1243, 1120, 563, -2237, 64, 601, -1707, -1070, -706, -1949, -1772, -362, 131, -618, -117, 1057, 82, -189, 1544, 1714, 563, 880, 1070, -186, 121, 2135, 1547, -164, 431, 102, -850, 962, 1023, -1173, -1182, -1184, -1610, -583, -347, -881, -1578, -1797, -190, 180, -457, 554, 833, -31, 893, 2279, 1053, 398, 2709, 1627, -768, 1741, 1090, -2050, 979, 1406, -2793, -1358, 121, -2897, -1478, 1134, -2219, -3044, 91, -1128, -1857, 1417, 219, -2298, 343, 1170, -316, 1735, 1442, -465, 1337, 1489, 659, 2378, 1143, -300, 1291, 353, -916, 867, -26, -2077, -107, 158, -2534, -100, 1681, -2320, -761, 2170, -1884, -1216, 2630, -874, -1497, 2096, -206, -1440, 2107, 1009, -1464, 1292, 1105, -1565]
1719a565K180Q20k599J444J145k328R06J273j853O66M34j985R34M52j408J139
1735c45K39j686J060Q06j159O64J059j697q0K053r62k07J960j397l30K395j324
1752A049o95J901j336j259J513n38j338Q95j03j254N64L72j071M62M59j012M27
1769i64P27r25N06R59o17L50M52l14P37Q2m51O39k34k78M26k24r9m6m01k63l5
1790B7j81o17o3J26r52L12N12q33N55N66o56R22M36m83J170K32o82R39J93q81
1810F42N53J53j172Q0N15j280KR71j216l12J505j139m92J889j101q71K095q62
1828d0j073J740m50j210J071P9r56M14M94o63M72P77q15P52P78j099P54N13j418
1847A20N94J33j395O63L9j246O96L78j156P02R57j252J32J389j000m76J544q83
$$ y = [-1565, 615, 1435, -1164, 280, 1425, -903, 3, 1276, -577, 89, 523, -1462, -528, -76, -1484, -345, -106, -1792, -732, 74, -1085, -421, 638, -1059, -1139, 914, -48, -255, 1705, 308, -22, 2373, 1049, 354, 2255, 919, -340, 1173, 635, -703, 192, 89, -1165, -601, -229, -1300, -838, -379, -1391, -964, -237, -1162, -656, 303, -314, 36, 488, 174, 911, 993, 542, 1181, 947, 669, 1095, 871, 772, 726, 325, 62, 27, -154, -771, -834, -708, -1660, -1348, -836, -1669, -1114, -548, -1204, -282, 154, -329, 841, 1073, 391, 1330, 1523, 642, 1195, 1348, 176, 256, 771, -509, -507, 464, -752, -1064, 441, -698, -1190, 699, -402, -1273, 822, -40, -1113, 627, 177, -1033, 38, 117, -839, -425, 69, -594, -122, 655, -160, 592, 1370, 271, 1025, 1538, 120, 714, 847, -548, 115, 154, -1092, -396, -18, -1174, -472, 485, -767, -635, 754, -246, -722, 822, -61]
1865f1q83J501q64j071J741n28j235J582L2p73J236K48l13P44K58m45R4J12p55
1884F20l43O3j266M4K23j258K62N74p94N88N83m32Q03O24k05L25M63l2K6J37j78
1905H27j35L6k56k76K22L4j72K8l76K52K76q92P3M95j001m0L91p79K31K31m61
1926a292M22K78N7N38L53JL14P88q2l22P23k93p19K86p62l85O24j250m19J024
1946a16n96k91Q67l66r6P75m19m34P42j26o24O49j31q17J069K96j160J118N47
1965H87j707J090Q20j456J179O14j961R00J316j656k96J078j386p24J642q47j156
1982a663J958k93j681J990K35j482J051N5j132Q93J79q37N80O15m10K54M00j94
2000E18N28K12o96K02J34q11N64K90j655M80Q51k032L92J565j701m00J369q76
$$ y = [-61, -944, 557, -307, -1378, 363, -165, -1400, 182, 214, -559, 677, 925, 612, 1356, 1614, 1169, 1263, 1375, 620, 277, 340, -926, -882, -659, -1917, -1655, -1081, -1875, -1287, -704, -1136, -333, 291, 86, 411, 874, 842, 868, 1005, 827, 692, 728, 472, 196, 418, 452, 280, 308, -68, 184, 460, -432, -359, 136, -865, -905, -514, -1293, -1062, -831, -1292, -870, -592, -535, 3, 356, 357, 671, 1459, 1377, 1055, 1778, 1485, 766, 1052, 290, -95, 529, -721, -1140, -116, -712, -1003, -136, -502, -598, 177, -242, -676, 66, -60, -684, -35, -166, -983, 86, 382, -778, 340, 887, -820, 270, 1090, -366, 813, 1427, -534, 366, 1682, 26, -270, 808, -578, -1302, 340, -507, -1663, 295, 2, -1679, 311, 546, -936, 115, 170, -962, -69, 110, -727, -147, 468, 58, 312, 712, 518, 1046, 1258, 562, 764, 898, 87, 651, 941, -714, -234, 617, -1415, -1023, 542, -1159, -1559, -190, -1066]
2018a066k58J541l77j042J262O60j447Q88J164j479J59R91r74K18R98l25n54J4
2036C73M75o9o18K30k36j012R3L89o84J25M78n85m24J095M12q93N93Q23p75L74
2056A64R88j007J80J127q07n13J55n0J21o0K38k08r03M32O77l41j23L9p05m95
2076a091J186M78j535K20O47j592J038J670k044m3J905j095k71K067n82j199J396
2093A155Q0j363R57K63j641P59Q03j768L50J016j249L64P33j343J85O74n68N67
2111b6m7j054N47L76o07M14P16j188N4J572q68j9J890j454p04K322j072j046K184
2130A990r22j951J685j36j928J267O61k378M81J432j493J15J836j510n56J808
2146D01o95l76J506o48n93J003j27m6N05l12l2J18k49J18K02l80k58M81p04q02
$$ y = [-1066, -1324, 217, -160, -1202, 60, 720, -727, 161, 1325, -154, 5, 996, 22, 240, 1238, 913, 359, 373, 848, 779, 161, 391, 155, -857, -764, -375, -1059, -934, -456, -1041, -1465, -370, 42, -851, -258, 565, -210, 164, 1152, 145, 325, 1452, 645, 132, 287, 237, 358, 298, 536, 328, -575, -143, 534, 193, 70, 109, -596, -1091, 95, 573, -962, -742, -95, -1687, -649, 1021, -1023, -1066, 839, -256, -527, 1540, 958, -241, 1155, 1235, -128, 829, 1092, -549, 210, 1013, -755, -405, 611, -638, -274, 459, -884, -699, -25, -593, -26, -73, -1127, -580, -204, -811, -397, 319, -869, -815, 757, -111, -130, 1760, 306, -398, 1924, 852, -194, 1990, 1068, -883, 802, 666, -1262, 5, 666, -1712, -1231, 201, -1292, -1177, 659, -851, -1407, 401, -294, -670, 836, 188, -405, 598, 471, 425, 930, 618, 586, 704, 455, 573, 775, 395, 137, 618, -86, -888]
2166h88J140l93j187J215l45j432J319N49j187Q74M63j227M50J565o96n03J436
2183A153m01j054J439M01j546M15M34j033J14P19n08m32L07J62n92N8M95p12k46
2202h27O93n41l39Q12Ok84J89L53k07j11P06k7n09N60K2l29N54R5k57j81j04K25
2224D99k74l14K90n04l64N16n4l88M59J41n65L6N92m14m48P34k05o79R68L07p88
2245d55R05L79p44M41L40m13R2K94m73l14M51r8p35N37m2r06L84K6n59L39q5k34
2267h70N09j13Q4M61p4k76L24J91l24J16N04m52K6P40n44k9Q86p33m14R50p03
2288B59n82Q39n37o31O16j36o74M04L37q31K93O81q58K84R07r37K19J058r75K17
2308d7J004p65o4Q63n34l51O63j19p21O22J1r41N96P2r23N27J66j046N86K62q06
$$ y = [-888, 252, -141, -1328, -113, -458, -1890, -571, -22, -1209, -335, 128, -1099, -649, 916, 220, -283, 1153, 752, -302, 1137, 1538, -8, 407, 841, -192, -78, 641, 133, -299, 8, 170, -422, -364, 131, -581, -827, -134, -675, -1014, -202, -196, -480, -291, 62, -145, -256, 450, 423, -86, 474, 496, 167, 721, 816, 559, 378, 274, 499, 225, -89, 201, -303, -667, -151, -205, -593, -134, 7, -558, -522, 70, -344, -792, -58, -263, -942, 26, 333, -455, 450, 829, 85, 526, 866, 453, 545, 839, 366, 52, 503, 405, -330, 207, 165, -741, -357, -331, -890, -551, -636, -870, -361, -474, -390, 71, -3, -279, 45, 236, -88, 28, 532, 80, 106, 846, 302, 273, 1159, 426, 12, 962, 259, -323, 516, -21, -652, -36, -172, -846, -442, -105, -936, -643, 38, -820, -536, 371, -566, -347, 711, -264, -47, 957, 192, 128, 991, 457, 106, 769, 650, -71, 551, 562, -379, 217, 289, -634, -107, 59, -987, -401, -139, -945]
2329i45N30K43n92M72L25m79M35K99m55K47N59m23j51Q17n68l46R38o14l19R51
2349I24p31l51Q21o57m83O15l69n59L76Q1n29J78L37m43L08L74l89N04L39n18
2369a72N22L64n08L30K10m73K52P0m76J19J2k97RJ58j59j02J57n0k08J98j03k60
2391d07J82j83p4J76l06J93K32l53M42K81l66N51L04l27K12M04k28k44K63l08
2411D44n23L77l06o26M92n0o57N33Ql42L48M8k11L16j41OK70j71k5K36l4j8K01
2434A75J20r5J31K66l32L80K73p39L96L17r80K60L13r65NL02o62pM73l41j43O01
2456b52l0l03P49Q5n30P21O5o83O07K39o25N03J40o44L08J51l80J5O6l99k7L00
2478G6k18j91L55l24k58N42l86k79M66m22pO51l98Q9P32k35m6O23j75m60M77J84
$$ y = [-945, -415, -172, -764, -292, 33, -446, -11, 288, -167, 80, 639, 216, 65, 882, 314, -32, 906, 292, -27, 924, 193, -158, 663, 6, -477, 138, -231, -790, -414, -333, -862, -684, -347, -790, -482, -108, -497, 7, 346, -172, 350, 714, 206, 536, 746, 273, 525, 595, 119, 238, 250, -47, -38, 120, -39, -141, 16, -34, -242, -44, -147, -407, -225, -408, -482, -306, -612, -419, -187, -540, -98, 183, -183, 368, 672, 345, 557, 961, 733, 489, 752, 444, -79, 298, -8, -634, -142, -192, -849, -316, -308, -650, -302, -254, -465, -149, -290, -284, -14, -185, -210, 26, -8, -26, 175, 295, 200, 331, 597, 265, 645, 918, 179, 575, 892, -88, 172, 485, -480, -475, -173, -835, -842, -369, -710, -853, -252, -282, -585, 164, 249, -281, 440, 505, -178, 429, 668, 43, 546, 686, 42, 350, 501, 121, 136, 202, -197, -224, 76, -142, -333, 22, -302, -560, -18, -404, -683, -217, -639, -646, 5, -393, -304, 428, 193, 147, 770, 595, 135, 612, 796]
2500G96o32K10L02q63L52M93q81M5M90q84k8O41m39k95M17o5k04M79J23l73J62
2521a54J88j76J55J87l31K56K20l33M95Kl90M68k06l47M12j66n00K86J65n57j05
2542d31O06m68k67P52n17n68Q95r9o56O75J56o08M28N23m69K3N88l32l84O73M4
2563E64n80L04K77o02J38L53l59j74P7m6l47k4M73k82k82K72j62j32L37O6k22
2584c51KK72R7k27M69K68n75L01L59m34J56L98k95l64K66N8n39K4M60n43l14N06
2606fm65k52Q00l22o21O06J63m94L44N63n70q7P44l64j56R25l55n80O81l2l96
2627A26N62k20m67K55ql47L6J87m19j23K27l65Q7L05n09K23M17m99K95M21n15
2648c31L29M39n80J00P30l80k60N46k42m59O75p2p94N16J76r33O30M43j027L55
$$ y = [796, 164, 374, 676, -187, 165, 658, -223, -178, 312, -572, -600, 41, -398, -693, -276, -341, -545, -66, 57, -316, -154, 34, -142, 13, 200, -131, 125, 345, 12, 507, 509, 119, 587, 381, 34, 446, 280, -220, 66, 231, -326, -431, 175, -293, -560, 192, -325, -893, 2, -97, -753, -78, 78, -530, -102, 421, -48, -25, 563, 231, -153, 520, 564, -16, 288, 565, -37, 101, 454, 95, -79, -2, -48, -395, -419, 54, -228, -510, -238, -400, -532, -195, -129, -351, -349, -77, 20, -207, 262, 530, -45, 256, 615, 181, 337, 735, 440, 76, 342, 400, -139, -115, 345, -198, -512, -6, -471, -723, 77, -245, -866, -260, -97, -591, -247, 316, -254, -341, 403, 39, -117, 808, 453, -127, 554, 522, 126, 688, 468, 1, 256, 248, -99, -63, 124, -295, -418, -191, -556, -469, -164, -673, -450, -33, -532, -237, 184, -331, -2, 437, -143, -43, 687, 307, 47, 593, 351, -108, 567, 495, -299, 217, 393, -540, 90, 533, -494, -139]
2668a39M38r27J99O73o87k52N70j71k91N56j7l34N91R0m67N96J76m63L47nk58
2689B25L70l27j79L25k59l73J65r5k98L40R5n88K06N58n86J21N99p10j66P87n42
2710c32l07Q66l20l86P11J48k54K59L72l91QM48m04l44M08k74l35L4j19j02j12
2731d26%N6k65J15K36j83K12L10j49J0M52m1k04J50J7k39nL71k48k04M12j12j18
2754A47K40j13k6r8k99J33j87j45J66l04j16L56k68o3M26o2k30L70K16k86K09
2775F6N31l84m8N76m37k82N84m72k53M27l57k29K96m4j89L27Nl87K87M6l55J78
2797a14J15m97J87L31n34L01L25n62L60M29m58J68L91l86O0L69n4k79K49o7l07
2818B7L35j48m80L24m3m93M29p1l53L66l7k41K10l1j56J61Q2j13J23J59j21J41
$$ y = [-139, 299, -628, -429, 244, -443, -695, -125, -296, -587, -31, -48, -382, 209, 299, -168, 428, 604, 141, 488, 483, 225, 595, 268, 89, 414, 155, -218, -53, -148, -446, -106, -11, -599, -393, 165, -421, -300, 299, -411, -577, 210, -332, -639, 227, -93, -479, 232, 380, 126, 385, 757, 366, 374, 822, 418, 74, 482, 208, -127, -93, -212, -314, -426, -426, -370, -635, -520, -284, -467, -255, 55, -94, -84, 368, 327, 123, 273, 290, 51, 46, 417, 169, -35, 377, 265, 147, 387, 274, 248, 150, -149, -16, -203, -348, -182, -486, -602, -246, -514, -577, -151, -213, -443, -73, 143, -143, 66, 597, 213, 165, 741, 304, 22, 606, 134, -119, 308, -49, -278, 18, -26, -215, 112, 117, -270, 17, 63, -292, -114, 1, -496, -309, 22, -512, -211, 114, -448, -88, 341, -117, 51, 442, 56, 116, 485, 431, 152, 401, 334, 27, 362, 214, -266, 58, 15, -478, -49, -120, -473, -107, -144, -385, -175, -206, -362, -201, -119, -232, -109, 50, -71, 70]
2840G0K91j95J3L12j76j0K48l02l7K01l70j35J48k03m3pj04o9n4J07j07KK19j40
2864c41J42J63j79K79J31j93K36J18p8R8m5kJ0n1O0j67j30J20k43j19J14j25j39
2887c41R4j7r9R3P8r1J9K72r8j48L89r6j37L27r1j04K51j26m1J50o3o2L0j8j06
2912F5N6Q9k09q4J21k57J27M6l77K06J18m40L16J88l73K57K40l03J64K28j15n2
2934A1K73J5k13L47p9k23K44Ql51J88q0k84K32j63k01K07j37j63J95r2j39J48
2956b57K0k05J76J99k53J63M41l30N7M89k89J0L90l79pK54j90j99K33j55l03J47
2978A2N1l47q8K02k91n8K79j69L5K86j77J64J86j60Q2J46J0J7qJ12J5k4O4m3K5
3003C21n2j74O4j39k42J36j20o6J23p8n8Q8o5J3P1M1j20O1J61j9p9L37r4j73L44
$$ y = [70, 361, 166, 179, 491, 315, 305, 553, 251, 214, 415, 45, -90, 58, -145, -188, -195, -299, -368, -422, -315, -422, -420, -201, -341, -199, -36, -215, 64, 195, 2, 238, 356, 278, 376, 331, 329, 339, 288, 348, 181, 51, 171, -72, -191, -77, -202, -341, -247, -264, -363, -270, -192, -283, -264, 8, -90, -238, 151, 55, -82, 245, 154, 50, 301, 175, 134, 284, 221, 159, 189, 171, 65, 121, 210, 1, -83, 38, -219, -92, -46, -423, -217, -99, -539, -223, -35, -408, -151, 89, -214, -50, 178, 63, 11, 284, 299, 86, 433, 354, 131, 375, 383, 32, 220, 140, -144, 88, -75, -276, -69, -206, -369, -174, -266, -405, -257, -237, -442, -266, -67, -320, -157, 284, -46, 11, 500, 211, 221, 611, 232, 225, 479, 289, 90, 323, 168, -135, 12, 63, -284, -372, -170, -461, -519, -240, -409, -374, -88, -265, -101, 85, -75, 7, 153, 163, 180, 172, 284, 299, 275, 339, 296, 321, 269, 95, 159, 20, -222, -86, -206, -272, -149, -227, -285, -197, -262, -249, -178, -137, -257, -196, -35, -54, -133, 204, 110, -63, 281]
3028B81J04k69K00L4k41J06O3q9j23J35m8l05K21M0n35K64J44m93K22K23l09O7
3050c08L25r5k24K76J31l43K71J55k85K66J67k51J65Q7j56K00p0k25J76j23j34
3071ER1j31j99J30k7k74N5K58m19pN71l98k18P95l78j93P82k70k31N54p4l61L66
3094D27K22n53J2M02m71j05N34n81k45M32l52n1K52l06o0K54k40J46K27j86p0
3115c12L72q5p2L70p1k08M27M2m06L78N0n77M33J59p02K42J90m91J26K83m55j82
3137d89L52L2l18K68j8l05M19J30k57J79P5j76K16J08l2j6K4J03k8o4L6q8o1L9
3161A29L1p8j11M7mj54N0N4j96qJ11j72N7J67j58N9R6l4K3p1K10Ko1L15j02j01
3187A01K74O7k49J01P7j73j16J22j88k43L95k90l16L45r9l29L94Jm19L08Q5j71
$$ y = [281, 385, 116, 316, 350, 109, 215, 278, 189, 66, 201, 153, -152, 69, 109, -426, -162, -18, -511, -289, -66, -375, -308, 17, -78, -302, -26, 105, -238, 33, 188, -97, 169, 336, 85, 250, 337, 181, 381, 311, 86, 262, 139, 5, 96, -35, -234, -104, -131, -405, -350, -92, -511, -518, 53, -345, -563, 232, -146, -339, 443, 173, -58, 496, 422, 61, 427, 649, 96, 108, 510, 39, -66, 468, -113, -358, 74, -278, -329, -77, -383, -443, -189, -429, -283, -56, -242, -312, 60, -25, -97, 273, 202, -6, 421, 463, 57, 435, 485, -92, 341, 500, -202, 40, 230, -261, -135, 148, -307, -489, -137, -105, -423, -155, -173, -478, -59, 71, -186, -7, 68, -108, 108, 216, 184, 168, 192, 295, 267, 203, 239, 151, 90, 129, 160, 82, -29, 18, 14, -140, -90, -36, -232, -240, -129, -301, -244, -77, -235, -176, -80, -114, -91, -162, 48, 50, -11, 304, 202, 101, 375, 442, 193, 294, 371, 198, 82, 204, 16, -227, 168, -122, -438, -93, -192, -521, -127, -126, -545, -237, -152, -323]
3209c23J93K33j59R5K16K6l5J30j24p6K70j23j90J14j04p8J54k37q4M9l08J22
3231b39J01l08RJ65n8m3L25m0k55L08K47l26K43J55l07K70K70l52P6K83k47q9
3253A88J37j92j46l2Qj92LJ39j98J2R9q4L2J2p7J65oN6Q0q3J65J49j45P0P3j5
3279B18J6m1Q4q4r5O8o1p6J52j16j69KN7j15j07MO9j33J06L9j37J62P5j97J98
3304h1J88j39M6K27j40M6J76M4j47K6J23k11n6J15k92J17pk40J42r0j36J66r4
3327b17j43K41j83K4J38j6J1O6J05m2K8K45j54L6K82j10r1J88q7j42J02j54j39
3350a2J15j58j16m6%j18l5R5j05K4J79r5O9J77n3J37J01j29J18R3o4N9K6l0j3
3375B19k6O2q8r3J08j67l7L2p1r6k1K2l5p2mK3k6M9K9k6J72M3m7J47qM0J20o2
$$ y = [-323, -130, 103, -56, 39, 255, 281, 246, 376, 252, 176, 446, 323, 133, 247, 143, 65, 219, -18, -102, -53, -361, -239, -138, -446, -437, -272, -330, -373, -48, -88, -343, -35, 212, -114, 129, 284, -23, 247, 517, 165, 241, 524, 277, 188, 325, 133, -13, -45, -37, -229, -226, -87, -285, -273, -174, -258, -226, -214, -291, -126, -132, -76, 4, -79, 86, 235, 90, 160, 233, 218, 234, 193, 277, 193, 98, 166, 105, 29, 181, 65, -104, -102, -45, -160, -267, -263, -194, -327, -221, -182, -319, -157, -82, -279, -81, 107, -32, 14, 241, 101, 147, 323, 367, 220, 246, 369, 158, 102, 217, -75, 42, 35, -205, -63, -153, -289, -123, -217, -360, -119, -302, -278, -140, -156, -145, -79, 26, -16, 12, 257, 103, 139, 421, 311, 220, 408, 321, 179, 281, 127, -12, 103, -55, -171, -217, -217, -335, -370, -275, -380, -356, -177, -272, -203, -26, -79, 58, 159, 30, 148, 241, 177, 236, 262, 232, 219, 193, 255, 167, 74, 182, 15, -22, 10, -61, -157, -178, -156, -191, -263, -267, -244, -270, -221, -192, -218, -46, -3, -50, 97, 89, 129, 249, 187]
3403A87R7n4k1M5Jj56L5k2r4jj14O1j14J2P9k32R5R2j81Q1R7j42O3R2n6L3J19
3430BM0mJ07J07j57J57O8l5m4Mj30R7r5j45R5j12k43K12o8j82M1R1j35L8J74j02
3456b19p4L10o6j76L93j01j67L19K4k04J79J15j78Q9N6j23j6P5j47j21O9j90n5
$$ y = [187, 284, 230, 209, 254, 255, 99, 134, 112, 18, 17, -97, -36, -150, -138, -59, -291, -196, -104, -285, -204, -107, -249, -186, -94, -150, -117, 2, 42, 38, 145, 252, 95, 252, 320, 285, 241, 245, 115, 212, 117, -28, 67, -45, -288, -76, -144, -326, -285, -194, -329, -291, -117, -219, -293, 17, -49, -225, 168, 67, -100, 219, 243, 39, 218, 333, 155, 244, 300, 177, 161, 236, 89, -32, 37, -153, -208]
$$ [...]
8191d
##END NTUPLES=NMR FID
##END=
