##TITLE=1H_3C2610
 CDCl3,8 sc, 
 27.10.2021
##JCAMPDX= 6.0         $$ Bruker NMR JCAMP-DX V2.0
##DATA TYPE= NMR FID
##DATA CLASS= NTUPLES
##ORIGIN= UXNMR, Bruker Analytische Messtechnik GmbH
##OWNER= root
$$ XWIN-NMR		Version 3.5
$$ Wed Oct 27 11:14:23 2021 Russian Standard Time (UT+4h)  she@DPX200
##.OBSERVE FREQUENCY= 200.1313468511
##.OBSERVE NUCLEUS= ^1H
##.DELAY= (6, 6)
##.ACQUISITION MODE= SIMULTANEOUS
##.ACQUISITION SCHEME= undefined
##.AVERAGES= 8
##.DIGITISER RES= 18
##SPECTROMETER/DATA SYSTEM= spect
##.PULSE SEQUENCE= zg30
##.SOLVENT NAME= D2O
##.SHIFT REFERENCE= (INTERNAL, D2O, 0, 15.7039)
##AUDIT TRAIL= $$ (NUMBER, WHEN, WHO, WHERE, WHAT)
$$ ##TITLE= Audit trail, XWIN-NMR		Version 3.5
$$ ##JCAMPDX= 5.01
$$ ##ORIGIN= Bruker BioSpin GmbH
$$ ##OWNER= she
$$ F:/spectra/data/she/nmr/H-F/1/audita.txt
$$ ##AUDIT TRAIL=  $$ (NUMBER, WHEN, WHO, WHERE, WHAT)
(   1,<2021-10-27 11:13:08.09 +0400>,<she>,<DPX200>,
      <created by zg, POWCHK disabled, PULCHK disabled
       configuration hash MD5:
       00 E9 B6 7A A2 85 ED C7 34 08 36 98 17 FE 4E 26
       data hash MD5: 16K
       33 1A FC D5 76 52 0E 99 A4 54 E9 07 20 0F 7D A5>)
$$ ##END=
$$ 
$$ hash MD5
$$ 31 82 85 0F 61 28 7C 0A EC C4 95 92 8A 4A B8 87
##$RELAX= 
##$RELAX= 
##$RELAX= 
##$RELAX= 
##$RELAX= 
##$RELAX= 
$$ Bruker specific parameters
$$ --------------------------
##$DU= <F:/spectra>
##$EXPNO= 1
##$NAME= <H-F>
##$PROCNO= 1
##$TYPE= <nmr>
##$USER= <she>
##$AMP= (0..31)
100 100 100 100 100 100 100 100 100 100 100 100 100 100 100 100 100 100 
100 100 100 100 100 100 100 100 100 100 100 100 100 100 
##$AQSEQ= 0
##$AQ_mod= 1
##$AUNM= <au_zg>
##$AUTOPOS= <>
##$BF1= 200.13
##$BF2= 200.13
##$BF3= 200.13
##$BF4= 200.13
##$BF5= 200.13
##$BF6= 200.13
##$BF7= 200.13
##$BF8= 200.13
##$BYTORDA= 1
##$CFDGTYP= 0
##$CFRGTYP= 5
##$CHEMSTR= <none>
##$CNST= (0..31)
1 1 145 1 1 1 1 1 1 1 1 1 1 1 1 1 1 1 1 1 1 1 1 1 1 1 1 1 1 1 1 1 
##$CPDPRG= <>
##$CPDPRG1= <>
##$CPDPRG2= <>
##$CPDPRG3= <>
##$CPDPRG4= <mlev>
##$CPDPRG5= <mlev>
##$CPDPRG6= <mlev>
##$CPDPRG7= <mlev>
##$CPDPRG8= <mlev>
##$CPDPRGB= <>
##$CPDPRGT= <>
##$D= (0..31)
0 1.2 0 0 0 0 0 0 0 0.06 0 0.03 0 0 0 0 0.0002 0 0 0 0 0 0 0 0 0 0 0 0 
0 0 0 
##$DATE= 1635318787
##$DBL= (0..7)
120 120 120 120 120 120 120 120 
##$DBP= (0..7)
150 150 150 150 150 150 150 150 
##$DBP07= 0
##$DBPNAM0= <>
##$DBPNAM1= <>
##$DBPNAM2= <>
##$DBPNAM3= <>
##$DBPNAM4= <>
##$DBPNAM5= <>
##$DBPNAM6= <>
##$DBPNAM7= <>
##$DBPOAL= (0..7)
0.5 0.5 0.5 0.5 0.5 0.5 0.5 0.5 
##$DBPOFFS= (0..7)
0 0 0 0 0 0 0 0 
##$DE= 6
##$DECBNUC= <off>
##$DECIM= 32
##$DECNUC= <off>
##$DECSTAT= 4
##$DIGMOD= 1
##$DIGTYP= 9
##$DL= (0..7)
0 120 120 120 120 120 120 120 
##$DP= (0..7)
150 150 150 150 150 150 150 150 
##$DP07= 0
##$DPNAME0= <>
##$DPNAME1= <>
##$DPNAME2= <>
##$DPNAME3= <>
##$DPNAME4= <>
##$DPNAME5= <>
##$DPNAME6= <>
##$DPNAME7= <>
##$DPOAL= (0..7)
0.5 0.5 0.5 0.5 0.5 0.5 0.5 0.5 
##$DPOFFS= (0..7)
0 0 0 0 0 0 0 0 
##$DQDMODE= 0
##$DR= 18
##$DS= 0
##$DSLIST= <SSSSSSSSSSSSSSS>
$$ [...]
##$SUBNAM2= <"">
##$SUBNAM3= <"">
##$SUBNAM4= <"">
##$SUBNAM5= <"">
##$SUBNAM6= <"">
##$SUBNAM7= <"">
##$SUBNAM8= <"">
##$SUBNAM9= <"">
##$SW= 18.0517286264689
##$SWIBOX= (0..15)
0 0 2 0 0 0 0 0 0 0 0 0 0 0 0 0 
##$SW_h= 3612.71676300578
##$TD= 16384
##$TD0= 1
##$TE= 0
##$TE2= 300
##$TE3= 300
##$TEG= 300
##$TL= (0..7)
0 120 120 120 120 120 120 120 
##$TP= (0..7)
150 150 150 150 150 150 150 150 
##$TP07= 0
##$TPNAME0= <>
##$TPNAME1= <>
##$TPNAME2= <>
##$TPNAME3= <>
##$TPNAME4= <>
##$TPNAME5= <>
##$TPNAME6= <>
##$TPNAME7= <>
##$TPOAL= (0..7)
0.5 0.5 0.5 0.5 0.5 0.5 0.5 0.5 
##$TPOFFS= (0..7)
0 0 0 0 0 0 0 0 
##$TUNHIN= 0
##$TUNHOUT= 0
##$TUNXOUT= 0
##$USERA1= <user>
##$USERA2= <user>
##$USERA3= <user>
##$USERA4= <user>
##$USERA5= <user>
##$V9= 5
##$VALIST= <valist>
##$VCLIST= <CCCCCCCCCCCCCCC>
##$VD= 0
##$VDLIST= <DDDDDDDDDDDDDDD>
##$VPLIST= <PPPPPPPPPPPPPPP>
##$VTLIST= <TTTTTTTTTTTTTTT>
##$WBST= 1024
##$WBSW= 4
##$XGAIN= (0..3)
0 0 0 0 
##$XL= 0
##$YL= 0
##$YMAX_a= 160959
##$YMIN_a= -121085
##$ZGOPTNS= <>
##$ZL1= 120
##$ZL2= 120
##$ZL3= 120
##$ZL4= 120
##$ABSF1= 10
##$ABSF2= 0
##$ABSG= 5
##$ABSL= 3
##$ALPHA= 0
##$AQORDER= 0
##$ASSFAC= 0
##$ASSFACI= 0
##$ASSFACX= 0
##$ASSWID= 0
##$AUNMP= <proc_1d>
##$AZFE= 0.1
##$AZFW= 0.1
##$BCFW= 1
##$BC_mod= 2
##$BYTORDP= 1
##$COROFFS= 0
##$CY= 11.3945322036743
##$DATMOD= 1
##$DC= 2
##$DFILT= <>
##$DTYPP= 0
##$F1P= 2.36226072786647
##$F2P= -0.459571619588291
##$FCOR= 0.5
##$FTSIZE= 0
##$FT_mod= 4
##$GAMMA= 1
##$GB= 0.15
##$INTBC= 1
##$INTSCL= 1
##$ISEN= 128
##$LB= 0.24
##$LEV0= 0
##$LPBIN= 0
##$MAXI= 10000
##$MC2= 0
##$MEAN= 0
##$ME_mod= 0
##$MI= 1.114404
##$NCOEF= 0
##$NC_proc= 0
##$NLEV= 6
##$NOISF1= 3.799351
##$NOISF2= 2.8
##$NSP= 1
##$NTH_PI= 0
##$NZP= 0
##$OFFSET= 15.70392
##$PC= 1
##$PHC0= -15312.74
##$PHC1= 12.60082
##$PH_mod= 1
##$PKNL= yes
##$PPARMOD= 0
##$PSCAL= 0
##$PSIGN= 0
##$REVERSE= no
##$SF= 200.130013532006
##$SI= 16384
##$SIGF1= 3
##$SIGF2= 2
##$SINO= 400
##$SIOLD= 16384
##$SREGLST= <1H.CDCl3>
##$SSB= 0
##$STSI= 0
##$STSR= 0
##$SW_p= 3612.71676300578
##$SYMM= 0
##$S_DEV= 0
##$TDeff= 0
##$TDoff= 0
##$TI= <>
##$TILT= no
##$TM1= 0
##$TM2= 0
##$TOPLEV= 0
##$USERP1= <user>
##$USERP2= <user>
##$USERP3= <user>
##$USERP4= <user>
##$USERP5= <user>
##$WDW= 1
##$XDIM= 8192
##$YMAX_p= 0
##$YMIN_p= 0
$$ End of Bruker specific parameters
$$ ---------------------------------
##NTUPLES= NMR FID
##VAR_NAME=  TIME,          FID/REAL,        FID/IMAG
##SYMBOL=    X,             R,               I
##VAR_TYPE=  INDEPENDENT,   DEPENDENT,       DEPENDENT
##VAR_FORM=  AFFN,          ASDF,            ASDF
##VAR_DIM=   8192,          8192,            8192
##UNITS=     SECONDS,       ARBITRARY UNITS, ARBITRARY UNITS
##FACTOR=    0.0002768,     1,               1
##FIRST=     0,             0,               0
##LAST=      2.2672688,     0,               0
##MIN=       0,             -121085,         0
##MAX=       2.2672688,     160959,          0
$$ Real data points
##PAGE= N=1
##DATA TABLE= (X++(R..R)), XYDATA
0 0 0 0 0 0 0 0 0 0 0 0 0 0 8 -8 8 -8 8 -16 16 -16 24 -24 32 -40 45 -49 59 -72 80 -91 104 -120 136 -153 176
35 176 -195 220 -248 273 -305 341 -380 422 -465 518 -570 630 -694 766 -840 927 -1023 1125
53 1125 -1242 1373 -1518 1687 -1879 2102 -2365 2680 -3068 3557 -4191 5057 -6312 8301 -11951
68 -11951 20802 -88321 -47554 119637 -6704 31361 64070 -71566 -83108 58166 22500
79 22500 8225 60285 -47166 -121085 36102 71051 -23545 17602 46496 -47192 -27807 37523
91 37523 -1662 -20962 3056 -23902 -3362 52017 15959 -35818 -14589 1551 8448 25283
103 25283 7365 -23517 -33528 -33462 14104 65770 31913 -17672 -27403 -44940 -12385 60626 30685
116 30685 -29819 -4636 -18203 -50524 38036 80857 -14180 -33629 144 -38364 -5500 64727
128 64727 -5714 -45781 27920 -1128 -44903 48051 48230 -60755 -27043 34582 -13678 1257
140 1257 37511 -33241 -34314 42025 6948 -19460 42214 1969 -69973 -1317 47769 66
152 66 1013 8069 -33816 -10822 32837 4386 697 19190 -28635 -42777 21190 33689 -2030
165 -2030 -6119 -9338 -13383 8036 10953 1187 9252 -7588 -29391 1243 25641 7517 -2756
178 -2756 -8691 -13103 10213 13963 -9732 2642 10220 -23002 -12020 27764 9272 -11746 2082
191 2082 -8839 -9700 21172 4311 -21651 7996 7583 -23829 5343 27481 -10024 -14205 7315
204 7315 -6412 373 20087 -9613 -18501 16184 3291 -17520 15110 16605 -18692 -8624 8534
217 8534 -1738 6134 7569 -15130 -3854 14790 -7760 -9480 17089 3267 -16970 -741 5500
230 5500 -778 4424 -2877 -7693 9322 3921 -14955 1421 14546 -4412 -7526 5212 1285 -1081
244 -1081 1328 -4343 3165 10388 -8064 -11680 9648 7577 -6982 -1479 2815 -1626 -3 -1982
258 -1982 -2237 7737 824 -14340 11 14423 -817 -8288 838 174 -254 3369 -1304 148 4671
273 4671 -7269 -8482 12836 12674 -8822 -8977 1927 1138 2418 4140 -1214 -1742 -2992 -7839 3311
288 3311 15711 1946 -13910 -7223 2575 4275 4832 919 -4095 -3229 -3985 -1392 11400 10866 -8529
303 -8529 -14413 -603 8633 6730 1253 -3592 -4345 -2418 -6 6150 10094 -1148 -14923 -8793 8080
318 8080 11915 1604 -7218 -5495 -691 86 3333 8381 1775 -12538 -12242 4890 15035 5912 -7239
333 -7239 -8794 -1669 3673 4778 5775 2835 -7769 -13013 -966 15231 12598 -5396 -13447 -4456
347 -4456 4205 5531 5146 1917 -6414 -11666 -4456 10345 15087 991 -14799 -10975 3881 8885
361 8885 4971 802 -4694 -8844 -5028 6257 14863 6856 -11819 -14850 1061 11232 7025 217
375 217 -5169 -8275 -3713 4534 10283 8779 -5651 -18170 -5824 12766 10237 -711 -5141 -8444
389 -8444 -5650 5214 9497 6020 -475 -12788 -13638 8032 18209 1967 -8100 -5526 -5273 1469
403 1469 11377 6633 -2617 -6567 -11161 -3254 16471 12566 -10227 -11914 -171 1470 4266 8327
417 8327 -203 -9097 -7644 -2294 7700 13585 -420 -15686 -6788 7898 6605 2098 1833 -3598 -9495
432 -9495 -3471 8839 11547 1241 -9743 -9584 1053 10564 6562 -4374 -5342 -2197 -4794 858
446 858 13634 5916 -13276 -10737 2971 5846 6970 3676 -9789 -9151 3539 2497 2742 11756 -671
461 -671 -19021 -4627 13294 5479 255 1294 -8598 -7016 7339 4689 -345 5817 -3463 -14792
475 -14792 2328 14342 -1411 -7322 1470 -1609 -2837 5955 2252 -5346 -149 -381 -4257 6199
489 6199 9275 -7960 -11574 4555 7929 479 2198 752 -8332 -5372 4545 5630 5313 3181 -9633
504 -9633 -12596 5191 11726 -772 -1528 3628 -7385 -10493 5419 9200 478 -357 -3078 -7609 1986
519 1986 6821 -3993 -1290 9201 -2008 -10224 3695 5853 -5328 -179 6884 -49 -1919 -760
533 -760 -6425 -1177 10135 2955 -5474 1570 -447 -10127 -809 11390 4699 -3451 -3606 -5858 -3443
548 -3443 5460 5347 160 2032 -940 -10121 -4075 9689 6434 -2823 -367 533 -5342 -3148 3967
563 3967 3838 3021 2052 -5678 -6502 3581 2779 -3451 4065 7027 -6202 -8954 1671 3027 766 3984
579 3984 511 -4381 -849 -1939 -3784 6196 8335 -4338 -5763 2061 -646 -2591 3758 4023 95
594 95 -507 -3700 -4104 3581 4166 -2030 556 3014 -3516 -5396 418 3520 3171 592 -3313 -2533 283
611 283 -1271 -340 4905 3241 -3494 -4710 -914 2936 3338 -441 -974 1564 -1326 -3932 1555 4968
627 4968 365 -2832 -1517 496 1876 -234 -2677 1015 2795 -2365 -2284 2726 716 -2769 -1086 1049
643 1049 2308 1462 -3422 -3078 3043 1771 -2248 1775 2663 -3074 -2374 1248 1339 2927 788 -5000 -940
660 -940 4720 -1107 -2818 3646 550 -4739 207 2483 -211 1286 -1228 -4855 2502 4992 -3774
675 -3774 -2133 4364 -1719 -4447 3410 3326 -1585 -375 -1471 -2174 4041 2885 -4098 -223 3442 -2558
691 -2558 -2276 3884 1783 -2434 -1561 -440 1141 2462 -1273 -3078 1030 1287 -1605 244 1844 -420
707 -420 -2219 -1688 1627 3984 -249 -3822 -224 1767 -345 745 1959 -289 -1223 -1522 -1383 3423
723 3423 3875 -3559 -3448 2828 122 -2367 2384 1646 -2563 -733 -350 -1197 3113 1769 -4835 -824
739 -824 4495 -1439 -2709 3098 708 -2796 959 1155 -625 1753 -434 -3553 1769 3877 -1988 -1969
755 -1969 1944 -401 -1783 1062 1011 350 -45 -2622 -1253 3169 1095 -2626 -332 1207 -832 -796 671
772 671 1057 738 -1345 -2049 1914 2635 -1742 -1705 1616 808 -697 -23 378 729 -263 -2075 267 3310
790 3310 -146 -3305 -26 1616 -636 -225 670 -335 -214 -893 -1553 1739 2624 -1876 -2465 1422 1080
807 1080 -965 352 1126 -112 -529 -906 -99 2310 1019 -2115 -780 1547 20 -1140 358 996
823 996 5 -1205 -1235 749 1548 -805 -1578 825 947 -1176 -1004 798 1155 -117 -1161 -179 1243 366
841 366 -1179 3 1555 375 -1283 -519 1080 893 -674 -913 714 930 -1004 -1129 856 1150 -620
858 -620 -1435 -131 1060 99 -1217 -148 1299 148 -1652 -301 1534 741 -1047 -694 981 819 -867
875 -867 -681 1200 1144 -763 -1281 458 1465 -239 -1447 344 1419 -779 -1664 604 1272 -466 -1029
892 -1029 -249 345 662 -526 -1083 1111 1310 -1702 -996 1942 636 -1340 129 634 -50 466 -280 -778
910 -778 1376 755 -2049 -71 2128 -562 -1516 597 357 -433 231 -571 -443 1243 -454 -2049 1017
927 1017 1809 -1342 -1071 910 198 -437 24 140 865 545 -1421 -700 1671 549 -933 84 591 -97
945 -97 -529 -596 725 1536 -944 -1775 999 846 -1361 -205 982 -213 -56 -260 -1217 770 1319 -1719
963 -1719 -419 2673 -282 -2447 497 996 -149 1089 247 -1108 516 -407 -1908 1869 3127 -1712
979 -1712 -2296 591 -466 -343 1920 396 -739 -146 -2192 -1439 3131 1873 -1946 -447 427 -1603
995 -1603 34 1737 257 481 80 -2147 -4 2324 -690 -1176 1756 406 -1229 274 -476 -882
1011 -882 1486 556 -1103 1329 281 -3617 -651 3000 761 -210 199 -2114 -1504 1337 666 909 2295
1028 2295 -1404 -3961 335 2706 677 578 254 -1439 -821 -1 328 1907 970 -2209 -1103 1278 213
1045 213 -528 12 -338 352 698 -1044 -416 947 -1552 -1145 2951 1542 -1834 -879 -989 -972 2739 2343
1063 2343 -1592 -386 -163 -3298 565 5207 501 -2565 -250 -1727 -1355 3567 1838 -2112 195
1078 195 -391 -3612 1225 4248 -1249 -2296 1048 -700 -1040 2059 104 -1766 1226 533 -1562 1292
1094 1292 1453 -2493 -1099 2433 1275 -509 -448 -1116 -800 979 1172 688 109 -1522 -1958 -70 2026
1111 2026 1954 -789 -2452 -517 673 -344 1245 2006 -1700 -2484 612 835 668 1796 -1180 -2856
1127 -2856 1464 1815 -1542 917 1930 -3030 -1676 3207 861 -1182 785 -1424 -2221 2592 1705 -2314
1143 -2314 436 967 -3115 -281 3758 -177 -2149 413 -566 -737 2358 704 -2078 365 775 -1569
1159 -1569 775 2487 -1059 -2075 528 995 427 582 -479 -1231 -163 572 458 634 132 -1301 -1559
1176 -1559 296 2028 719 -1468 -711 128 -761 300 1889 2 -1208 -196 -464 21 2098 370
1192 370 -2112 357 1310 -1231 49 1890 -882 -1316 1120 49 -500 1087 -716 -1832 1417 1420 -1632
1209 -1632 -245 1020 -1448 -742 1713 354 -542 127 -1215 -650 1867 833 -1209 166 475 -1150
1225 -1150 -192 1481 554 -478 -597 -536 399 748 -293 -286 377 -286 -721 -16 525 293 -454 -718 405
1244 405 745 -661 -637 759 335 -570 163 217 -111 306 -187 -409 904 542 -1074 -117 1054 -277 -624
1263 -624 525 91 -250 178 -405 -320 731 -137 -963 501 577 -979 -402 622 219 -36 -33 -567 23 725
1283 725 -160 -180 783 -68 -958 170 868 319 -127 -501 -337 435 285 -262 265 220 -857 -591 647 593
1303 593 -65 -625 -733 176 782 41 -205 166 -381 -726 399 1122 342 -581 -778 -120 1018 763 -324
1322 -324 -285 32 -566 -93 1097 729 -647 -1187 -457 670 989 -92 -795 -353 -334 -331 737 1023 -286
1341 -286 -1260 -784 543 1311 486 -687 -692 -127 76 604 1013 179 -1127 -1013 189 1268 935 -527 -1236
1360 -1236 -544 244 582 714 222 -871 -1275 -273 1051 1161 -144 -1348 -962 303 954 715 146 -574
1378 -574 -1077 -451 925 1532 345 -1261 -1290 106 1231 913 -17 -591 -915 -682 488 1557 683 -1220
1396 -1220 -1671 -330 1029 1226 189 -962 -960 -393 286 1133 1164 -588 -1821 -703 1199 1589 460 -688
1414 -688 -1179 -522 449 1059 1044 -32 -1522 -1357 651 1726 771 -806 -1304 -601 206 805 882 120 -1135
1433 -1135 -1419 161 1498 1106 -403 -1417 -633 675 770 543 272 -736 -1332 182 1508 983 -211
1450 -211 -1213 -1237 408 1717 500 -584 -471 -1174 -845 1473 1818 -401 -1384 -1199 -648 1149 1901 -166
1468 -166 -1216 -433 -599 -168 1851 1284 -1254 -1339 -36 470 990 755 -784 -939 238 197 123 758 -42
1487 -42 -1489 -560 1233 927 -378 -923 -744 -119 740 896 125 -690 -941 -877 404 1922 1024 -1444 -1478
1506 -1478 162 368 503 1431 219 -1641 -769 237 322 1287 726 -1733 -1045 1103 -95 -685 1180
1523 1180 207 -1598 149 1090 -604 -51 442 -1134 129 1839 -509 -1557 726 274 -880 1168
1539 1168 1423 -1208 -1074 238 -177 682 1561 -579 -1514 125 154 -434 1009 1091 -1108 -1348 88 353
1557 353 261 538 -89 -744 -187 220 -133 100 745 -29 -966 239 988 -482 -631 751 288 -469 435
1576 435 134 -886 347 594 -783 264 1284 -1213 -1343 1374 419 -1148 530 506 -1186 53 753
1593 753 -783 270 1196 -1131 -873 1668 14 -1452 974 1016 -1112 -66 716 -595 -28 850 -549
1610 -549 -339 1025 -395 -1114 829 677 -945 -324 553 -121 -237 156 -109 -212 48 -56 42 423 133
1629 133 -660 -576 505 850 -67 -375 226 -272 -616 575 922 -147 -269 -336 -791 425 1153 -443 -639
1648 -639 558 -439 -993 852 717 -831 -213 250 -469 330 732 -938 -447 1185 -93 -706 839 18
1666 18 -1311 259 1061 140 132 -267 -1292 58 1321 179 -243 167 -855 -1231 577 1257 406 -375
1684 -375 -1063 -750 489 787 126 271 -256 -1027 -239 788 863 104 -660 -750 417 768 -40 -80 147 -532
1704 -532 -278 769 541 -203 -613 -804 51 1230 381 -829 -487 -231 -422 676 1190 -128 -1000 -790
1722 -790 -261 915 1365 -179 -1068 -278 -116 113 1117 650 -689 -941 -414 358 1114 431 -962 -763
1740 -763 179 135 375 593 -327 -890 -428 271 836 647 -805 -1154 189 716 237 356 -63 -839 -438 460
1760 460 782 683 -286 -1399 -437 1034 733 -4 -165 -621 -748 221 914 652 -77 -1068 -1065 548 1210 236
1780 236 -507 -518 -615 -94 717 826 71 -774 -1016 68 1221 703 -437 -547 -397 -154 477 770 333 -515
1800 -515 -961 -344 848 915 -226 -793 -343 -109 222 589 267 -360 -634 -475 439 1010 126 -867 -499 219
1820 219 412 396 241 -292 -469 -253 223 879 491 -668 -896 135 655 322 12 -303 -512 -298 133 531
1840 531 616 -290 -1064 -434 601 652 38 -322 -354 -321 -38 476 617 48 -750 -594 396 829 211 -332 -318
1861 -318 -81 -41 163 404 323 -443 -704 17 682 332 -419 -484 -91 95 24 83 215 -154 -529 -188 513 503
1883 503 -235 -490 -170 298 267 9 35 79 -155 -302 195 636 21 -600 -266 238 160 -27 -76 -132 -127 -134 -134 187
1907 187 307 -250 -597 92 479 -27 -231 144 120 -96 -14 138 163 48 -193 -200 332 408 -298 -346 285 210 -272
1930 -272 -128 159 -72 -130 -126 -15 284 76 -507 -228 459 111 -404 11 428 -57 -293 76 169 51 52 -59
1952 -59 49 260 -121 -519 185 706 -128 -488 162 148 -373 -29 441 55 -247 -341 -422 130 612 -116 -494
1973 -494 262 122 -592 32 682 35 -405 31 70 45 234 -139 -262 456 339 -592 -78 454 -170 -410 491
1994 491 427 -429 -389 -209 -64 485 469 -395 -401 26 -357 -208 801 665 -549 -703 38 231 314 538 37
2015 37 -317 -104 -140 -158 566 580 -586 -597 482 242 -389 56 195 -222 -62 175 -206 -38 93 -449 -80
2036 -80 894 157 -937 -212 352 -86 156 540 -168 -476 -179 -156 406 893 -86 -946 -131 358 -113 69
2056 69 441 -95 -629 -267 294 405 73 -411 -445 129 400 -23 -129 173 -115 -305 47 646 222 -513 -434
2077 -434 225 365 248 59 -267 -187 -18 -86 171 564 -116 -837 -164 475 196 -53 -78 -271 -139 72 -8
2098 -8 169 311 -406 -502 378 620 -219 -324 -79 24 298 269 82 11 -226 -537 66 754 334 -399 -423 -210
2120 -210 138 293 127 104 42 -568 -615 479 681 -256 -270 -15 -233 85 232 -154 224 311 -431 -227 606
2141 606 77 -658 100 537 -6 -48 -65 -378 74 252 -113 245 279 -598 -840 205 613 106 -47 -220 -344
2162 -344 -168 70 291 501 116 -528 -415 189 407 195 -92 -24 126 -221 -226 393 363 -239 -214 107 -94 2
2184 2 -4 -356 169 529 -393 -526 460 -2 -597 303 592 -248 -232 -69 -343 239 586 -327 -254 494 -290 -692
2206 -692 659 637 -393 -220 52 -306 77 293 -233 7 408 -500 -532 540 291 -412 -24 268 -99 -113
2226 -113 -63 -53 265 120 -265 -4 260 -57 -243 124 284 200 -259 -294 239 252 -249 -22 328 -135 -249 25
2248 25 6 128 189 -382 -199 481 -36 -545 259 349 -335 -84 288 -151 12 147 -243 32 531 -295 -465
2269 -465 508 316 -432 99 194 -232 -8 82 -173 204 244 -552 -280 486 14 -467 43 166 -162 -92 -51 -1
2291 -1 283 -123 -389 254 347 -213 -182 198 97 -66 14 38 273 90 -427 -113 408 5 -332 1 69 -123
2313 -123 -46 -35 -27 135 -166 -373 276 385 -239 -224 212 8 -62 121 23 104 112 -349 -77 524 56 -428 7
2336 7 234 -65 -53 62 -43 44 -42 -360 67 414 -267 -350 134 190 -168 -54 58 35 70 -97 -34 321 138
2359 138 -364 -101 289 98 -128 75 29 45 24 -177 154 357 -142 -417 92 263 -76 -101 -36 -8 -2 -172 -50
2382 -50 255 107 -396 -151 270 171 -77 -28 83 18 -60 -165 171 386 -76 -402 118 326 -105 -174 78 91
2404 91 -129 -138 -35 210 112 -365 -234 325 157 -194 -165 148 64 -163 8 147 152 -142 -258 43 357 21 -253
2427 -253 -15 156 -20 -82 74 196 -20 -195 -65 216 147 -129 -309 -25 146 -19 -102 40 60 -216 -204 223
2449 223 328 -51 -300 -147 123 273 29 -53 82 -73 -249 -44 382 286 -278 -413 -56 203 20 -4 78
2470 78 -70 -218 -215 107 281 75 -288 -279 260 168 -166 -15 213 2 -191 52 180 82 -132 -148 134 425 -2
2493 -2 -438 -112 192 -87 -51 279 74 -293 -355 28 324 298 -225 -388 -24 6 -96 93 303 -11 -304 -265
2515 -265 177 404 -9 -266 50 130 -134 -30 187 -51 -44 -30 -113 207 166 -396 -324 401 197 -185 -33 83
2537 83 -323 -60 192 44 177 101 -586 -208 522 138 -269 181 108 -317 12 296 71 121 -2 -321 3
2558 3 477 -62 -373 182 209 -321 -91 301 22 -277 -77 127 181 140 -166 -261 -13 217 -61 -26 273 55
2580 55 -484 -213 506 202 -226 112 81 -232 11 138 -143 231 242 -536 -228 532 -78 -567 397 385 -452
2601 -452 -77 184 -341 73 402 -266 -104 538 -369 -660 515 467 -410 55 339 -418 -159 357 -55 86
2621 86 420 -311 -564 281 275 -309 102 415 -337 -531 68 155 69 222 -11 -348 -82 103 -160 133 533 65
2643 65 -563 -66 345 -49 -116 357 176 -258 33 -29 -156 278 217 -424 27 461 -394 -560 474 350 -397
2664 -397 115 189 -529 -96 276 -154 190 562 -561 -709 481 357 -296 306 389 -596 -398 291 120 218
2684 218 356 -433 -467 346 150 -314 288 321 -524 -287 308 147 -95 17 -85 -52 252 46 -215 24 121
2705 121 -90 -27 295 213 -427 -311 216 321 119 42 -204 -321 5 192 113 244 58 -621 -348 499 342
2726 342 -148 -38 -60 -378 4 367 102 28 -79 -453 -104 669 233 -443 -70 174 -174 100 311 -68 -260
2747 -260 -142 -54 269 457 -298 -612 11 312 62 120 129 -304 -419 -65 295 419 71 -491 -345 220 348
2768 348 133 99 -21 -335 -234 250 551 203 -313 -437 -16 313 216 46 -145 -223 -189 15 325 279 -214 -555
2790 -555 -124 398 266 -9 -144 -224 -166 107 241 263 30 -390 -327 324 535 43 -215 -163 -82 83 239 211
2812 211 27 -254 -375 69 495 266 -296 -369 -86 85 207 236 16 -222 -296 -100 411 459 -133 -424 -180
2833 -180 164 285 175 18 -98 -248 -129 179 464 126 -485 -308 114 262 116 -77 -94 -200 -157 58 359
2854 359 223 -289 -481 27 393 181 -117 -91 -142 -105 105 251 238 -71 -411 -212 320 320 -17 -199 -107 -47 11
2877 11 135 190 15 -252 -293 159 355 72 -251 -204 3 74 128 58 11 -160 -194 -8 371 326 -170 -296 28
2900 28 186 159 41 -10 -37 -199 -84 232 279 -98 -271 -112 136 172 12 -101 -95 4 -100 -4 224 116 -223
2923 -223 -205 106 177 2 -47 -108 -4 76 13 25 109 -38 -269 10 301 96 -174 -64 84 -70 19 73 83 2
2947 2 -98 -209 86 287 -30 -244 30 222 -122 -149 160 100 -69 -27 -22 36 38 -113 -82 209 191 -189 -138 193
2971 193 33 -197 29 126 -49 -102 37 -17 54 85 -178 -121 241 70 -271 18 134 -90 -66 177 5 -88 49
2994 49 25 96 302 16 -457 -36 361 17 -151 127 -28 -369 -41 201 110 58 -119 -388 -37 349 22 -211
3016 -211 184 45 -334 59 445 7 -328 -19 51 111 298 14 -346 33 194 -109 129 387 -221 -556 97
3037 97 421 38 69 -27 -446 -83 343 15 37 215 -382 -502 320 537 -159 -248 55 -201 -89 369 98 -160
3059 -160 -22 -113 -114 452 412 -449 -453 186 133 5 251 -1 -532 -213 214 234 300 38 -514 -567 332 457 2
3082 2 -13 11 -475 -266 515 356 -48 -75 -223 -257 395 361 -362 -204 174 -164 -182 450 125 -533 -138 180 105
3105 105 287 107 -563 -307 411 190 4 348 -195 -865 -10 651 357 39 -105 -492 -238 343 330 87
3125 87 130 -322 -606 98 595 170 -299 -106 -143 -114 226 208 -5 -157 -30 -18 165 262 -190 -421 43 438
3147 438 165 -53 -46 -236 -247 201 461 132 -53 -386 -461 161 676 143 -238 -105 -267 -282 379 545 -57 -297
3169 -297 -258 -185 220 446 -64 -283 -8 -24 -152 301 266 -261 -216 99 203 139 36 -267 -114 209 131 71 75
3192 75 -99 -351 -152 294 293 23 -330 -339 49 216 143 141 -44 -330 -209 46 329 326 -148 -435 -58 246 76
3215 76 11 110 -80 -215 76 111 94 -20 -222 -175 266 267 -121 -100 25 -120 -50 225 96 -140 -167 -146 79 280
3239 280 62 -186 -91 51 -15 120 200 -10 -137 -176 -25 256 213 -117 -123 54 -17 -13 22 9 -62 -83 -117 69 207
3264 207 -120 -253 37 184 -56 1 14 -47 -44 26 42 139 150 -197 -128 241 134 -93 39 45 -76 -8 -7 -102 104
3289 104 -26 -158 -25 182 -55 -162 29 28 -29 -7 -27 -20 -2 -65 -71 119 93 -140 -144 147 123 23 -76 -39 86 27
3315 27 -82 62 130 -64 -117 61 81 -19 -69 -88 -6 133 2 -108 73 9 -130 15 181 24 -143 -115 -15
3338 -15 146 153 -120 -83 36 -54 -56 151 128 -89 -165 -88 32 152 49 -214 -96 78 -45 -24 156 17 -194 -109
3362 -109 80 122 94 -138 -166 54 88 39 104 120 -93 -201 65 179 112 -80 -246 -42 135 54 -40 50 -104 -132
3386 -132 50 147 160 -86 -257 -146 173 199 -42 -87 -39 -120 -37 213 143 -61 -213 -202 2 342 147 -168 -72
3409 -72 -46 -71 135 225 46 -178 -225 -5 166 294 -88 -277 -91 45 -27 110 89 -102 -185 -23 174 235 16
3432 16 -185 -170 97 123 42 32 26 -219 -176 171 287 46 -178 -218 -27 128 148 31 -102 -105 -128 -68 266 237 -209
3457 -209 -321 -41 140 122 -38 -32 -180 -87 72 24 167 80 -320 -163 262 271 -66 -91 -112 -99 18 196 57 -109
3481 -109 -180 -256 53 321 165 -193 -112 -3 -45 71 149 9 -188 -153 14 175 228 1 -256 -73 193 61
3503 61 -29 97 -46 -192 -23 252 116 -42 -112 -239 -41 237 86 -148 -23 -6 -166 15 292 63 -179
3524 -179 -116 -30 49 184 57 -94 20 25 -50 62 190 -63 -157 -30 171 5 -65 -26 -21 26 38 35 10 -9 -134 -222
3550 -222 193 263 -32 -248 -48 41 15 97 149 1 -101 -138 -13 159 246 -49 -199 68 43 -100 45 169 1
3573 1 -106 -48 -18 36 -53 -22 -5 114 21 -184 -47 53 82 -17 106 93 -104 -139 -50 107 162 41 -56 -88 6 -8
3599 -8 -10 141 121 -62 -224 6 85 12 -2 53 35 -53 -123 -78 30 173 26 -143 14 16 -194 -119 224 134 -59 -30
3625 -30 -22 -103 90 179 37 87 47 -175 -119 206 129 -19 -35 8 -134 -96 62 120 71 14 -105 -50 61 81 -103 27
3651 27 223 -25 -149 49 147 -104 25 144 77 -91 -78 -124 17 173 46 -184 -31 65 -194 -79 249 33
3673 33 -232 -37 -13 -59 113 97 -68 -56 79 -144 -45 179 27 -182 34 140 -52 -53 59 -25 66 161 17 -107
3697 -107 54 23 -88 76 208 -94 -173 -22 10 -12 89 9 -80 -47 -33 -68 30 194 -80 -266 54 138 -107 -34
3721 -34 117 14 -58 59 -5 -44 4 -82 -103 104 177 -144 -98 135 16 -85 51 67 -134 -37 -49 -13 73 71 -91
3746 -91 -59 123 -20 -87 108 128 -116 -140 28 63 38 12 -56 -16 123 -7 -63 48 71 -101 -85 103 81 -129 -43
3771 -43 -35 27 9 3 -51 -10 42 -55 -10 153 79 -114 -38 69 86 -40 27 -15 -26 -8 -20 -12 111 16 -131 -15 145 -30
3799 -30 -87 7 36 -57 -9 -2 18 27 -11 -84 52 103 -52 -72 -13 91 -11 -53 68 70 -34 -64 23 113 41 -92 -68 9
3827 9 26 -102 -32 48 34 -104 -39 74 71 -93 -57 24 63 -1 6 19 46 6 -18 14 81 6 -35 -26 44 28 -12 -16 18 34 -42
3858 -42 -57 32 129 -55 -47 6 11 2 -74 81 70 11 -51 -85 152 25 -33 -6 42 -11 -21 9 65 -1 -60 -31 91 60 -42
3887 -42 -55 17 36 -57 -33 -50 79 -25 -83 -93 62 51 -75 -27 3 -12 12 -54 10 29 -30 -37 75 109 -5 -63 -15 38
3915 38 -12 -49 2 30 -41 -133 -70 66 12 -99 -89 75 13 -68 -31 22 -27 -65 33 84 26 15 -57 -8 106 48 -51 -37
3943 -37 47 -70 -38 16 85 -23 -84 -35 13 82 -33 -62 -11 10 -16 -107 58 10 -54 -94 25 51 -26 -51 -13 103 30
3970 30 -25 19 62 59 -71 -12 76 100 -3 -5 17 35 -14 -31 45 45 -42 -91 -45 137 87 -37 -15 77 -34 -75 53 53 -40
3999 -40 -94 -62 -9 8 40 -51 -43 157 8 -123 35 15 -58 -55 17 19 -19 -104 -42 12 13 46 3 68 80 -173 -83 119 149
4028 149 -74 -42 20 -11 39 89 74 6 -6 -65 -51 139 125 -109 -94 44 -27 -105 111 99 -98 -1 -31 -70 57 53 -89
4055 -89 -78 107 58 -138 -42 97 -151 -46 163 58 -40 -53 -124 -69 175 171 -102 19 9 -139 -57 193 115 -123
4079 -123 -172 -41 -66 60 141 -29 -71 -14 -89 -125 131 79 -188 -13 172 -63 -26 91 -46 -33 123 38 -49 19
4103 19 -18 -127 17 284 -7 -168 0 0 -118 101 286 -72 -103 -45 -141 43 269 44 -184 -55 53 -129
4125 -129 34 273 30 -160 45 -12 32 126 -32 -167 3 156 -64 -38 90 -47 -166 74 132 -92 -49 -33
4147 -33 -99 127 167 -76 -149 -39 -29 -133 227 197 -88 -168 41 19 32 160 63 -194 -5 7 -47 151 163 -143
4171 -143 -220 93 74 -67 -8 34 -150 -53 123 21 -99 -34 -101 -118 209 124 -139 -89 104 1 4 221 88 -127
4195 -127 -87 -42 1 164 121 -150 -120 62 43 -89 79 51 -192 -108 95 17 33 -38 -79 -72 98 95 -82 59 17 -83
4221 -83 39 155 56 -139 6 28 30 101 51 -73 -65 13 -21 38 163 26 -217 -99 65 32 -18 32 -45 -47 7 20 27
4248 27 28 -29 -115 -48 150 76 -20 0 13 -57 41 18 -6 -49 -81 -9 60 129 -49 -168 38 48 -22 22 51 -14 -96 -47 31
4277 31 123 41 -54 -103 24 90 12 -24 96 -66 -103 58 122 1 -11 -50 -39 37 28 -28 -50 20 -54 -16 69 66 0 -108
4305 -108 -37 81 46 -10 -51 -26 25 -12 33 42 67 -54 -27 60 84 61 -39 6 14 4 -53 -33 17 -17 -47 -2 13 39 -47
4334 -47 -37 -2 39 -100 -50 5 29 -9 -56 -12 3 -3 -47 -9 83 7 -60 19 82 24 -27 11 26 -65 -20 -16 87 26 -30 -6
4364 -6 18 54 -22 -24 -6 7 8 -11 39 28 -106 -43 82 167 14 -16 15 10 51 44 0 -38 -39 -86 32 126 83 -51 -76 -13 31
4395 31 79 8 -2 -50 -66 -28 87 127 -1 -86 -34 -10 64 85 -32 -34 -123 10 58 60 34 -60 -91 36 106 28 -17 -37 -40
4424 -40 -43 -1 38 58 -102 -112 -26 89 134 -27 -112 -71 20 131 121 82 -16 -91 -31 63 126 84 -113 -102 12 72 46 36
4452 36 7 -118 -96 73 87 40 -79 -68 -28 119 88 -1 -75 -117 -131 -26 155 67 -95 -135 -44 8 154 81 -47 -144
4478 -144 -29 -1 60 155 -37 -207 -101 64 70 103 31 -88 -109 -12 67 111 41 -63 -123 -27 165 79 -72 -38 -148
4503 -148 8 117 177 -27 -76 -75 -28 105 247 -5 -191 -78 48 11 133 131 -101 -146 -34 70 101 157 -48 -168
4527 -168 16 138 17 18 9 -80 -167 99 119 -51 -46 -43 -70 30 158 -32 -107 -66 -65 -24 100 112 -109 -210 31 56
4553 56 85 124 -59 -137 -36 18 3 83 86 -113 -164 99 114 -42 23 -1 -134 26 30 40 18 17 -39 -73 142 145 -114 -52
4581 -52 115 -12 15 95 -5 -142 11 17 -8 83 12 -220 -46 73 106 51 110 -28 -135 -8 145 37 48 91
4605 91 -106 -60 112 65 -62 9 68 -21 -5 59 26 -104 13 -11 -58 72 -30 -84 -37 108 -34 -55 109 -48 -153
4630 -153 -27 105 44 -34 -39 -124 -49 71 -8 19 81 -25 -139 -2 109 0 -42 23 4 -53 82 34 -73 58 74
4655 74 -6 -34 4 -55 -83 44 30 52 1 -30 -9 -2 45 26 10 -17 -22 -13 14 66 -13 -20 10 13 -81 16 12 -48 -36 -18 -41 -44 29
4688 29 4 -63 80 34 -19 -15 20 -6 24 27 -21 1 -2 14 42 117 27 -66 -72 -6 -56 -28 -1 -26 -88 4 24 36 29 -25 -46 29
4720 29 14 -9 -34 -60 -48 40 55 93 84 -97 -58 2 81 85 40 -30 -18 30 56 1 108 24 -203 -82 113 77 -32 -36 -62
4749 -62 -46 48 109 44 -33 -29 -66 27 90 -28 -80 -41 21 -8 63 56 -30 -75 -51 -11 108 70 -45 -70 -35 107 76 17 -20
4778 -20 -97 -119 -1 73 38 -8 -76 -60 45 56 21 -75 -37 -26 -28 45 86 5 -87 -61 51 98 -17 -23 -83 -59 22 52 40
4807 40 37 -70 -137 -17 113 96 17 -57 -102 1 75 10 63 14 -52 -60 131 74 -38 -53 -56 10 48 78 5 -31 -15 -33 38
4836 38 68 26 -70 -82 -28 26 -13 19 -11 -58 -49 17 165 30 -75 -78 -1 61 78 23 -83 -6 -17 59 60 84 -32 -138 -60
4865 -60 60 105 22 -7 -71 38 40 -3 70 -18 -99 -63 9 29 56 -12 -84 -32 -11 30 10 56 -46 -47 -7 137 50 -63 -76
4894 -76 -16 40 43 -46 -7 -60 -53 6 54 81 13 -113 -44 48 70 -2 29 -11 -79 -21 51 89 -6 25 -11 1 65 70 -33 -13 -4
4925 -4 -34 11 59 -9 -31 -21 -1 -20 27 -16 -56 23 11 16 48 32 -20 40 -49 17 34 33 -47 -37 16 -20 -8 81 -4 -13 6 56
4957 56 13 29 -35 -12 -18 30 -41 -33 31 -30 -32 -99 55 24 -34 7 22 35 -6 -13 24 -39 14 -12 26 -31 29 -42 11 94 44 8
4989 8 -36 37 -15 15 68 -7 29 -9 -64 1 5 8 -39 -18 12 -51 -40 44 -21 -61 41 44 1 -19 26 -33 29 78 -25 -39 9
5020 9 -53 -37 -27 48 -12 -32 -46 -1 38 46 -2 -44 -4 6 -113 -25 23 -46 -6 10 9 -73 38 -3 -8 10 10 -61 -38 -2 -6 -64
5052 -64 79 75 -53 -43 2 67 7 67 -51 -28 20 31 24 79 74 -54 -88 30 49 -35 30 -32 -39 -58 -12 -34 24 24 56 -12
5082 -12 32 -21 -81 -70 44 45 -11 27 -12 -21 12 -34 -3 69 20 -81 -113 47 33 -5 -3 37 -38 -1 65 34 -10 52 42 27
5112 27 34 86 13 -21 25 28 -60 22 -8 -64 -4 70 -11 50 -20 -45 -87 52 19 8 -26 -20 -78 -46 70 74 -8 2 2 -64 17 35
5144 35 -21 20 -3 25 -35 52 75 -41 -43 49 -24 -16 29 -4 -11 -7 -23 -30 -20 -65 -47 -17 66 7 -72 67 -36 -46 17 43 0
5175 0 -13 7 -62 7 52 0 -26 -5 11 -43 20 95 -25 -80 67 -35 -34 3 -13 -3 14 6 -16 -4 13 -15 -29 63 45 -33
5205 -33 15 -23 -26 2 38 39 -30 36 21 -27 18 44 -45 -57 7 -19 -26 40 37 -21 -29 -29 -86 14 63 5 -15 45 27 -27 -3 42 -51
5238 -51 6 57 31 40 -23 -43 12 46 -4 -47 -24 59 -46 -70 -14 -24 -83 -39 -2 -35 37 33 -67 -15 0 -67 -26 59 58 18 -24
5269 -24 37 -38 17 87 -15 -39 71 4 -67 1 51 -11 -38 2 -17 1 37 72 22 -19 12 -44 11 45 -7 -30 56 21 -70
5298 -70 -5 12 -38 -42 -41 25 11 19 14 -23 -46 -44 23 -13 6 -16 -22 0 23 37 36 -25 14 13 66 13 -29 -37 -19 1 46 68 4 -16 5
5333 5 79 -26 -19 13 53 -18 15 -36 -57 50 -29 -3 44 -65 -39 -1 91 -48 -26 13 68 16 -11 -20 -27 -21 7 -39 0 10 -113
5364 -113 -43 25 57 -34 29 -2 18 54 -9 21 -21 21 -9 -78 40 42 3 -54 29 -36 -65 -4 -47 8 -41 -29 2 53 -9 -42
5394 -42 -31 -36 -3 -77 -8 -2 8 -35 42 2 12 25 -41 -5 30 -7 -10 -40 -11 -19 -22 48 51 -4 -39 -25 14 37 5 -63 -3 39 -52
5427 -52 5 50 29 -36 -48 -5 20 9 46 -9 3 19 -23 -5 106 -34 -9 8 60 65 11 -27 6 -15 -2 45 65 8 -72 35
5457 35 105 41 -22 -38 8 63 3 -10 -19 -15 -37 -71 5 6 -1 -1 -53 5 8 15 -3 44 32 -39 4 21 73 -46 -7 -26 43 18 -3
5490 -3 -31 55 22 -7 5 5 -30 -7 -27 9 15 59 -34 -67 -17 -25 -40 14 39 -45 -12 -59 59 9 15 -22 -84 -37 -27 13 69 39
5522 39 -29 -5 68 68 -17 -43 -20 -29 -59 77 57 3 8 -40 -1 40 -55 -20 -48 21 56 -16 59 -12 -50 -50 10 70 9 34 -4 37
5554 37 12 35 -7 55 -18 -48 -44 37 33 9 -9 -28 -15 3 -6 -6 -7 -10 31 8 7 38 -32 18 8 29 -11 34 38 5 20 61 34 1
5588 1 -25 -99 -12 68 25 -45 -42 -11 -29 33 -7 17 9 -25 -65 -56 -1 -9 -41 -68 30 -39 1 33 -3 19 3 8 8 27 -6 -54 6 19
5622 19 -37 -14 69 6 -13 9 65 -57 -4 -15 -77 -39 18 29 -21 51 -25 -50 -9 47 7 -77 53 -20 -44 -14 30 31 59 58
5652 58 -57 -36 45 -21 -2 8 -4 -46 -27 40 -43 -43 22 47 -17 31 -38 -33 26 80 -51 19 24 46 -46 9 45 -8 -37 -38 -59
5683 -59 21 74 -2 30 47 -1 -65 3 55 27 -6 -45 10 10 -41 -3 24 39 13 -54 32 23 -53 -6 29 93 -4 37 -1 40 -6
5714 -6 34 0 22 -54 -19 -3 3 26 -6 -43 13 -3 -51 19 46 35 -11 -66 -75 -8 14 -45 41 2 -12 4 3 64 16 29 -21 27
5746 27 24 -10 -42 35 11 -36 -37 -6 -5 -23 -74 -27 -9 15 -11 6 7 34 -3 -8 2 -21 -1 -2 60 7 20 6 19 -110 -15 23 39
5779 39 87 -10 -21 0 23 43 -13 -1 6 -34 -9 -20 -30 -70 -38 -39 6 4 -39 -69 3 64 94 -8 39 -25 18 1 88 76 15
5810 15 -25 4 26 4 -5 6 23 35 35 -3 -12 24 2 15 24 23 36 27 -16 36 15 -18 37 35 3 -10 -62 -1 84 4 -65 -31 26 -1
5844 -1 58 21 -17 -77 -11 20 42 -16 -11 -22 8 -59 -3 12 50 -14 -16 19 7 12 5 -24 -64 10 40 -43 19 19 27 -28 38 3 0 -15
5878 -15 30 -16 12 19 -41 -46 -23 -25 16 4 -16 -39 -59 3 21 24 -15 21 -22 3 -3 22 50 -5 29 10 6 18 -38 66 20 -41 13
5911 13 45 15 -15 -16 -44 26 39 -29 -62 -18 -34 12 -2 33 98 -16 -77 -28 22 76 -106 -62 56 -28 -23 21 -11 55 -65
5940 -65 9 39 37 60 -7 -10 35 70 -10 -6 -3 -21 -74 -66 90 21 -33 17 17 -2 12 15 -8 -40 10 0 35 37 -27 24 28 10 22 15 -23
5975 -23 -15 18 9 20 40 27 39 -12 60 -6 -23 -7 -3 16 15 -9 65 33 -29 -63 49 53 13 9 -21 9 -19 -39 0 32 1 -23 -5
6008 -5 -57 -7 10 -47 9 37 -34 29 39 13 -22 70 -49 13 -6 2 3 35 25 -10 -10 69 17 -12 22 38 62 63 10 -7 -12 2 20
6041 20 -51 39 -23 -39 -35 24 83 -47 16 -7 -56 -45 20 19 -14 11 4 3 20 -9 -37 29 26 39 -17 49 20 13 18 29 -6 51 2
6074 2 0 -18 28 -10 23 45 -21 -70 32 85 17 26 -14 -18 0 30 33 -31 43 -15 -51 60 15 8 5 -16 10 -73 75 41 27 -11
6106 -11 -14 9 -31 43 -36 -28 -3 5 -3 11 42 13 -22 8 9 55 -35 -1 10 54 30 -14 22 8 -26 -6 89 49 84 -12 5 -65 -71
6139 -71 33 -28 -28 36 -15 -57 36 39 -15 -3 2 -22 6 14 -29 22 28 7 3 31 -8 -22 -39 123 42 -30 24 -58 19 -7 29 -14
6171 -14 10 -43 -3 -46 48 -1 -5 -90 -26 7 -48 25 7 -8 -77 18 26 16 -16 25 33 72 -4 30 -40 7 -30 23 31 8 -29 -18
6203 -18 -3 -2 36 -35 -20 -12 9 -36 13 46 32 -13 -41 -51 8 31 9 -12 21 -21 45 7 58 75 -28 -51 57 93 -51 -21
6233 -21 2 0 17 -49 27 -39 -11 -1 -11 62 8 -35 -54 57 -16 -6 32 -2 -21 -35 54 38 -6 14 -32 -45 27 -36 -4 41
6263 41 43 -44 -76 -8 20 38 -36 3 33 43 -45 -40 22 11 -3 30 6 -9 -45 -74 -24 -5 4 -10 -6 29 42 25 14 -40 -24 4
6295 4 66 3 11 21 9 43 -7 -39 -50 0 -7 -8 -17 27 36 -52 -54 16 -3 2 9 -44 0 -19 -93 78 63 -47 -24 -48 25 55 -19 -39
6329 -39 -19 -44 3 -2 -42 -60 -31 20 -31 52 -20 -51 -16 -8 26 -11 29 0 -34 34 -11 -44 -35 37 -35 -21 14 -15 53 11 42 -64
6361 -64 10 -1 -5 3 -8 21 -2 0 -26 31 42 22 -22 -52 10 -20 -8 26 50 -41 -39 1 -50 -7 6 11 -15 25 -33 -56 -29 -15 -46
6394 -46 0 -33 -24 -34 7 -58 29 24 4 -14 -6 -2 17 -38 -25 -2 2 15 -18 3 -54 -50 20 -33 6 -40 -18 20 15 -39 -3 -5 -6 34 -87
6429 -87 -2 14 -2 6 47 26 2 -2 25 40 36 8 7 7 -9 -14 60 -38 52 -17 9 -20 12 -24 4 3 -7 25 14 -27 16 -41 4 -46
6463 -46 -3 16 -35 55 -46 27 -37 -42 8 -10 -46 -55 53 -61 30 -16 -9 -7 24 26 35 -9 -3 -67 36 66 -18 23 -4 25 12 9
6495 9 18 -5 36 -8 -13 -16 -10 -17 -32 24 -9 -43 -14 40 46 -6 14 11 67 24 -33 -11 -7 -1 -16 -50 -24 7 26 -13 40 51 -12 -52 8
6530 8 -11 24 -45 -11 -1 -6 -23 -3 18 -3 -44 0 11 30 0 10 -33 -42 6 -1 4 -37 -27 -3 43 -32 -43 -66 -14 -23 -26 20 6 36
6564 36 27 -4 15 9 -17 -16 -16 32 11 7 23 -33 -23 -26 -47 29 64 4 -42 1 3 -1 -70 16 -18 -47 8 -32 17 -35 24 64 -2 16
6598 16 43 -28 19 46 -35 -8 -2 -38 -60 -69 -3 3 -16 -37 -23 -21 -24 -32 -39 33 -43 -27 17 68 33 -11 55 3 16 -62 -29 -31 -35 16 24
6633 24 11 66 -48 -11 -19 33 28 -19 -9 20 26 -4 -8 -21 4 -61 -71 8 14 -44 16 19 13 -63 34 20 5 8 30 -36 10 32 27 -4
6667 -4 15 -12 11 -33 -14 20 -55 43 47 14 -45 -4 3 5 10 48 -11 4 -5 -34 25 68 23 44 7 -76 40 28 -31 36 32 25 -70 21
6701 21 40 -16 14 -6 36 -2 -10 -14 10 34 -7 -39 -7 64 0 -27 19 -4 9 -24 30 23 15 -44 -31 30 -7 -36 -14 18 7 -65
6733 -65 -29 37 -40 -28 -5 8 -36 24 -39 -35 30 9 -53 20 8 -13 34 -1 25 14 39 70 11 8 14 26 9 31 -35 -35 21 -31
6765 -31 -16 20 28 -28 -19 -25 25 -13 23 16 14 7 19 -2 16 45 14 -20 -48 23 -37 54 25 -21 47 11 3 -21 -27 18 -12 21 -9 -3 -64
6800 -64 -25 2 19 -33 -76 -26 57 -19 -41 -4 -5 -26 -26 33 53 44 5 19 16 9 7 -12 12 -8 52 27 -1 -28 -16 33 31 -10 -15 35
6834 35 7 -39 -36 -12 0 56 -30 26 31 4 20 0 9 21 18 -31 -19 55 11 -15 -18 -23 -56 14 6 34 -14 76 -8 41 -9 11 23 21
6868 21 1 16 -17 38 -36 5 -16 -7 38 -23 -34 -25 16 20 -53 24 13 18 43 -3 38 28 -44 -20 -27 3 43 -51 -48 -28 -42 13 4 -65
6902 -65 10 -6 10 5 -44 21 -15 -26 12 -36 14 -1 7 -29 -24 -41 29 -13 17 -39 32 -43 -64 -50 -30 -13 -20 -34 5 -27 -29 -6 12
6935 12 -4 -50 -37 68 25 0 15 -15 61 33 -36 -32 67 8 -26 -38 -13 45 -8 -22 -3 6 -19 -67 32 23 -30 -46 44 -40 -17
6966 -17 -45 -17 -14 13 19 -43 -20 15 35 37 30 -13 -33 15 51 56 23 -11 20 25 61 -29 11 -10 -19 22 16 24 10 7 27 -21 9 -48 -41 -41
7002 -41 12 -38 -32 10 62 36 -61 -24 35 -8 21 -37 -26 -13 17 -27 -44 -14 -18 -2 19 6 -4 6 7 69 -1 48 31 -7 10 48
7034 48 24 21 37 58 -13 41 11 50 72 17 -7 -49 -51 -12 7 -12 -24 2 45 -11 -87 -12 21 -75 13 -37 -4 15 -21 3 15
7065 15 8 35 33 -5 46 -59 10 34 16 -40 23 64 -16 6 -33 20 43 9 -18 -46 38 30 -16 7 38 8 -39 -30 -33 -73 -39 -20
7097 -20 5 -20 23 -4 9 11 44 -34 64 6 -16 -6 60 25 29 11 -12 -29 58 3 67 38 2 -20 -31 51 53 -20 10 12 -22 1
7129 1 38 12 6 8 -21 -31 36 15 25 -28 21 15 -25 24 -31 9 4 8 -2 48 2 -24 56 56 -1 -69 13 39 -60 -10 24 -31 -5 -22
7163 -22 -19 -33 23 -2 -40 -28 33 -37 5 -26 25 -61 -33 16 31 37 -14 -58 -18 2 -31 5 -40 -18 -30 24 -27 -23 -42 -26 -12 -36
7195 -36 9 -61 48 5 -39 -37 6 65 -24 8 5 17 14 80 0 -23 37 10 16 96 -13 -35 10 4 -12 -66 13 -40 -40 -28 -45 54
7227 54 45 -1 -36 36 32 25 17 28 43 10 -3 62 24 -61 -1 -33 8 11 37 31 3 39 20 26 17 -41 -63 -29 42 53 17 -31 -10 -3 12
7262 12 63 -15 -19 -29 -54 -10 35 -31 1 -7 -80 -2 -6 2 17 31 -42 -33 10 16 -16 -62 -10 23 40 0 17 -29 4 14 44 54 22
7295 22 -7 -20 18 15 -38 -68 -14 35 -40 -26 25 -46 73 -18 -34 -15 -10 -28 -33 -25 28 -4 -7 -40 30 13 3 17 -54 -13 25 39
7327 39 22 31 -27 22 31 -18 -13 -24 -15 28 -12 26 -1 18 14 8 -16 70 20 -53 -16 23 -53 -59 17 24 -14 8 -1 -36 56 -53 9 -11
7361 -11 -32 -24 -24 48 50 -4 -23 54 10 -40 -33 13 2 -24 19 26 5 51 15 48 -25 9 21 12 -22 9 -36 -5 -6 -22 18 26 -21 -5
7395 -5 -23 0 19 23 16 -31 6 24 14 -28 -17 31 -8 18 21 26 38 -11 15 -3 6 32 9 42 -12 -31 -50 -7 -10 9 -23 12 14 8 -36
7430 -36 -8 -6 15 -39 21 15 -20 -44 -24 -65 -49 -11 2 17 -23 27 5 48 63 -20 -28 29 23 -6 34 81 -9 -5 -14 -7 28 25 0 -37
7464 -37 -24 28 -29 22 -2 11 38 34 -3 24 -25 18 5 12 79 35 37 31 -14 -4 21 -4 -37 -23 -29 -55 26 79 -33 20 -21 73
7496 73 15 30 37 -52 27 -43 16 26 -24 -13 -38 9 12 50 11 36 -45 -61 -2 24 -8 -20 -30 -13 -38 -4 -8 -40 -7 3 -13 30
7528 30 25 -42 43 -18 9 22 43 -40 -57 36 -16 19 -31 44 -84 -12 90 -54 -4 -18 -9 12 62 20 8 -22 9 53 21 37
7558 37 14 -25 -6 -25 -13 9 -38 -17 26 -51 -25 9 22 -26 -64 -54 -21 22 17 23 10 38 -22 62 15 -37 -32 -6 5 42 -23 -15
7590 -15 -12 27 -21 -46 -5 -61 -78 -15 -39 35 -6 1 -32 0 30 18 4 14 -47 -9 24 62 6 -17 9 -51 -11 2 7 -5 10 -13
7622 -13 13 48 -30 -20 10 69 -19 -6 12 30 -27 -51 60 30 17 -80 -36 -35 15 43 8 -9 37 -46 35 48 8 -13 10 -94
7652 -94 10 30 24 48 11 8 5 -12 14 34 -81 34 -35 8 -17 20 -37 -39 -40 17 -18 15 6 -20 0 18 -31 -20 -10 -16 -6 14
7684 14 -8 23 24 31 10 60 24 45 -39 -4 6 -7 29 30 7 61 29 31 -28 33 6 38 0 4 -35 -9 46 -49 11 43 2 23 1
7717 1 39 -40 18 22 -13 36 -3 -1 -5 9 -26 17 -25 81 25 -5 7 -16 -26 49 32 -28 23 69 -38 27 3 -23 29 12 14 -3
7749 -3 21 17 7 2 -13 3 2 14 -11 1 -23 -22 -21 -19 -9 -27 0 2 -1 6 -8 5 -66 -11 41 -4 -22 -3 30 0 18 21 22 -72 -30 6
7785 6 19 22 -49 -37 -29 26 71 -49 47 -25 6 25 29 7 22 -8 -24 15 -26 42 -23 -18 -3 -9 -44 30 -40 -51 10 -13 -29 7 -21
7818 -21 -38 2 -12 -3 -3 -19 23 -52 21 53 11 9 7 -6 -22 -15 -3 -32 -41 -13 -9 33 61 -32 -15 23 -36 29 -15 -38 32 27 30 -30 -30
7853 -30 19 -30 -52 -5 25 -3 52 30 18 35 29 -16 -55 -15 17 -7 -44 23 13 -14 27 27 15 -11 7 -13 -24 27 19 34 1 14
7885 14 -41 23 -24 10 42 -44 7 0 -23 -10 27 43 12 -70 -5 15 28 -33 3 68 26 70 -26 -14 6 38 11 -6 -6 35 13
7916 13 30 -7 -38 -2 8 21 1 28 53 25 20 -37 11 -53 -34 -10 -31 -2 -22 76 44 -25 -38 36 -4 -4 -1 39 45 -12 -14 19 15
7949 15 37 13 61 17 2 8 -6 12 -6 1 23 -40 30 49 12 -35 -21 11 -21 2 -22 -1 -10 -11 -4 -20 -48 -38 -2 35 -5 38 -7
7982 -7 -16 -24 11 -13 48 10 99 39 30 -63 41 -20 32 41 33 -30 36 2 -25 7 65 61 -2 -13 -27 25 29 9 3 -9 55 54 -4 50 16
8017 16 4 13 -1 0 16 27 -1 4 -11 39 9 -63 -32 26 47 -16 43 -13 21 2 68 15 -15 -25 -16 0 37 9 -9 -10 -29 19 -1
8050 -1 8 -3 -12 6 -46 8 -15 20 9 -16 -3 0 6 28 17 -38 27 -12 4 -13 33 16 40 24 43 66 22 32 -16 16 -34 -19 25
8083 25 4 17 4 5 1 -14 50 -44 -31 53 -55 5 23 41 6 29 37 -54 -50 -41 -9 -48 1 6 5 30 44 -30 2 58 -17 0 58
8116 58 67 20 26 -16 -20 1 6 12 79 9 19 -22 37 8 16 58 -24 27 -13 -6 16 16 4 -8 4 26 -25 -40 45 13 -11 10 2 -35 1
8151 1 -12 42 23 -31 -11 2 27 26 20 20 42 -6 -10 -15 -10 18 -12 81 3 -20 26 -1 36 -18 47 0 -11 4 3 -1 49 36 16 -43 -11
8186 -11 -5 -15 29 3 -10
8191a0
$$ Imaginary data points
##PAGE= N=2
##DATA TABLE= (X++(I..I)), XYDATA
0 0 0 0 0 0 0 0 0 0 0 0 0 0 0 0 0 0 0 0 0 0 0 0 0 0 0 0 -1 2 -3 4 -5 5 -6 7 -7 7 -7 8 -10 11 -11 12 -12 13 -15 15 -17 19
48 19 -20 21 -25 27 -30 34 -39 44 -52 59 -72 88 -109 138 -183 249 -355 545 -914 1778 -4572 29096
70 29096 160959 21425 -44762 29737 -66292 -83485 76275 65081 -21114 21068 -34234 -104271
82 -104271 40382 102003 -30251 -26407 36144 -37270 -37037 49528 15194 -29730 4483 -2590
94 -2590 -5085 39602 8235 -48028 -14069 23080 16114 16587 -2000 -32446 -25568 -5285 27198
107 27198 56229 10130 -48769 -35442 -14734 10057 60385 25900 -51850 -25824 2794 -23150
119 -23150 34462 75251 -26116 -62799 6029 -3244 -2245 57958 1327 -61264 15726 24268 -36923
132 -36923 28373 50521 -58861 -40727 50285 5521 -18734 27015 -20480 -40051 41716 24487
144 24487 -32016 17669 8626 -61672 -889 63912 1022 -24165 4018 -20302 -9133 39735
156 39735 10937 -17145 6125 -18173 -33804 28181 42041 -11514 -20375 -4903 -5523 10420 15019
169 15019 -4253 -3077 -6782 -22332 4573 30263 3354 -15098 -8446 -6671 9717 15913 -10142
182 -10142 -7366 9562 -13688 -10913 28787 12479 -20765 -3297 1657 -6853 16571 8422 -23458
195 -23458 906 15327 -16557 -305 27753 -8943 -22904 9075 3380 -4564 14184 -5705
207 -5705 -21885 13239 12103 -17243 6972 17866 -18843 -13123 15117 3634 -714 5994 -11381
220 -11381 -6533 16472 -1013 -12097 13560 6250 -18574 -1806 11715 -661 -153 -776 -7451
233 -7451 5574 6005 -12968 -1540 15315 -3625 -11793 5004 3868 -3655 889 -1329 559 7862
247 7862 -5541 -11422 9896 10708 -8246 -4030 5220 -439 -1027 689 -1303 4742 1759 -11478 -451
262 -451 15152 -845 -12334 555 3603 -1041 2070 -754 -2612 2601 -3651 -6454 10970 11113
276 11113 -11715 -11567 5517 5361 1217 2746 -2067 -3608 -518 -2189 4281 12862 -1070 -16366
290 -16366 -5404 8568 6435 1928 -1808 -5827 -3087 258 1455 8169 5762 -11690 -14166 4031
304 4031 12506 4670 -3367 -5879 -3699 894 3501 5419 5230 -4402 -13505 -3633 13021 11893 -2586
319 -2586 -10183 -4566 3136 3673 2745 3967 -2136 -12083 -7460 9660 14806 624 -12235 -8893 2081
334 2081 6823 4213 1071 -2161 -8220 -8163 4789 15993 7810 -10888 -14397 56 9899 6637 1331
349 1331 -2395 -7125 -7275 2050 12782 10682 -5455 -16843 -7392 9604 11106 1067 -4830 -6456
363 -6456 -5979 402 9111 10796 -397 -15077 -12270 6725 14638 4157 -5564 -7096 -4989 1508
377 1508 8526 8413 1893 -9217 -14785 48 17158 9390 -6996 -8906 -5108 -472 8147 8797 -213
392 -213 -6798 -11014 -7232 11449 17641 -3042 -14612 -4895 1097 4457 10129 2988 -8346 -7832 -4258
407 -4258 2761 15788 9135 -14163 -13403 5049 7501 3325 4146 -3274 -10443 -4164 4186 8711 8484
422 8484 -4918 -16382 -4077 12425 7603 -2711 -3241 -4408 -6464 822 10570 8333 -4232 -11805
436 -11805 -5916 6078 11395 3775 -7695 -7009 754 1211 2939 10181 2319 -14917 -9287 8735
450 8735 9290 2443 -1397 -9881 -7916 7072 7150 77 4338 -2912 -17198 -2291 17601 6003 -6635
465 -6635 -2593 -5416 -4600 9397 7431 -3656 276 -1968 -10932 3427 15983 -1521 -11243 1324
479 1324 2710 -2245 4327 2620 -6578 -1669 2603 -2135 3281 6597 -8001 -11207 6645 10622 -1786
494 -1786 -3205 -753 -6283 -2971 7896 6793 603 -1775 -8424 -8368 8476 13951 -2189 -7022 1358
509 1358 -3921 -7358 7570 11133 -2417 -5391 -2744 -4735 2245 8032 -2548 -4354 6356 -927
523 -927 -10733 2765 8563 -4307 -2606 6577 -460 -5098 -434 -2056 452 9614 2797 -8312 -1374
538 -1374 2117 -5844 773 12190 2990 -8320 -5198 -2078 83 6735 5366 -2846 -2815 -1805 -6907
553 -6907 -1433 10995 6115 -6409 -4138 818 -3093 -1505 5891 4397 -366 -1232 -4958 -4873 5087
568 5087 5868 -2740 961 5071 -6074 -8782 4208 6684 65 886 -590 -5485 -1470 1308 -1243
583 -1243 4582 6472 -6001 -8079 2739 2453 -1920 3154 3710 -2357 -2757 -2162 -1904 4366 5219 -2440
599 -2440 -1858 2355 -2541 -4304 2636 5079 1670 -1513 -3924 -2414 1635 1009 105 3360 1458 -5089
615 -5089 -4575 1153 4050 2633 -1519 -2566 533 -369 -2694 1946 4935 -552 -3930 -897 1723 1831
631 1831 104 -2022 706 2933 -1664 -2632 2547 1371 -2950 -726 2037 1495 42 -3163 -2734 3112
647 3112 2651 -2709 -128 2274 -2909 -2649 2529 2078 915 -33 -4094 -1003 5320 346 -3618 2582
663 2582 1750 -4426 147 4016 -266 -696 -484 -3425 1865 5246 -3301 -4018 3982 -86 -4686 2866
679 2866 3980 -2964 -2156 -56 -1087 2969 2933 -4194 -1718 3985 -1120 -2664 3820 2140 -3299 -1390
695 -1390 1182 1508 1786 -1166 -2967 1142 2341 -1297 -496 1547 -742 -2255 -646 1856 2762 -1075
711 -1075 -4353 -167 2904 16 -351 1231 -858 -1827 -423 206 2773 3030 -3452 -3910 3369 2132
727 2132 -2339 1500 2185 -2795 -1289 1239 -261 1770 1585 -4293 -1648 4682 -432 -3892 2293 1545
743 1545 -3400 208 2105 -988 207 119 -2816 1213 4090 -1837 -2975 2122 844 -1772 1113 1540
759 1540 -467 -533 -1460 -690 3168 1275 -3098 -931 1795 -466 -1030 794 707 -197 -1300 -1624 1555
776 1555 2432 -1993 -2286 1737 1303 -1138 -245 606 312 -108 -1185 390 2928 -57 -3378 171 2699
793 2699 -213 -849 754 -264 -633 -290 -718 1281 2076 -2038 -2903 1527 1772 -1281 -382 1044 -450
810 -450 -970 -308 240 1791 751 -2256 -866 1990 563 -1055 424 1162 -189 -1033 -529 1064 1544
827 1544 -701 -1672 671 1151 -1087 -1071 917 891 -575 -1311 -240 1148 158 -1286 -164 1360 118
844 118 -1480 -324 1347 845 -755 -812 768 1070 -702 -871 1074 1218 -704 -1236 175 1239 126
861 126 -1206 -255 1137 21 -1621 -323 1472 415 -1508 -797 910 746 -956 -783 1128 922 -1017
878 -1017 -1140 724 1552 -190 -1330 343 1540 -480 -1442 770 1608 -573 -1165 88 516 366 -428
895 -428 -983 648 1145 -1554 -1246 1835 722 -1786 -321 1020 -141 -99 7 -617 883 958 -1725 -311
913 -311 2305 -199 -1847 782 1079 -485 92 -4 -389 873 41 -1795 641 1944 -1423 -1619 1027
930 1027 439 -881 -90 258 302 156 -1208 -626 1644 771 -1257 -204 859 -83 -390 0 707 1274
948 1274 -695 -1681 986 1444 -1246 -448 1228 -91 -630 -66 -775 361 1342 -1268 -1040 2188 -100
965 -100 -2868 423 1778 -400 120 234 -1359 38 574 -1029 1380 2840 -1844 -2960 1207 1064
981 1064 -178 1584 431 -1581 -437 -757 -587 2838 1781 -2766 -1513 961 -724 -166 1873 48
997 48 -859 -173 -1503 -168 2479 -114 -1741 1415 813 -1646 -16 503 -503 1238 1028 -1354 302
1014 302 614 -2650 -352 3672 769 -1769 -479 -1375 -1019 1992 1348 -286 595 -1580 -3564 945
1030 945 3695 385 -1045 -349 -1296 -580 1068 768 1158 525 -2141 -1160 1931 806 -796 40 102 120
1048 120 593 -860 -782 992 -540 -1054 2366 1226 -2899 -1506 351 -30 2193 1898 -2529 -1769 615
1065 615 -1439 655 4757 82 -4319 -529 495 -347 3154 2023 -3083 -1067 785 -1958 1084
1080 1084 4357 -1282 -3598 1174 625 -1256 1557 553 -2234 521 1074 -1610 319 1539 -2015
1095 -2015 -1248 2701 1265 -1557 -827 -340 -123 1395 1276 -49 -660 -1291 -1004 1061 2329 1143 -1511
1112 -1511 -2558 -71 1629 234 448 1131 -1808 -2597 1138 1819 19 452 -1066 -2633 1372 2568
1128 2568 -1502 -512 1761 -2144 -1792 3486 1540 -2270 -21 -123 -1563 2285 2279 -2558 -837 1657
1144 1657 -1943 -572 3715 -63 -3290 183 710 -705 1582 799 -2529 -292 1463 -1000 101
1159 101 2116 -1110 -2361 937 1668 109 -82 -468 -1012 323 1094 480 163 -249 -1152 -892 943 1971
1177 1971 246 -1909 -979 710 -64 113 1420 -326 -1820 -173 425 192 1426 203 -2294 -87
1193 -87 1822 -745 -526 1752 -479 -1667 1214 828 -869 636 -51 -1503 1167 1791 -1598 -979 1303
1210 1303 -732 -829 1671 469 -1381 -248 -452 -453 1605 827 -1697 -463 778 -744 -228 1511 420
1227 420 -995 -554 -57 591 838 -206 -462 405 29 -573 198 662 111 -516 -596 317 629 -557 -793
1246 -793 673 394 -788 -132 367 -254 5 16 -378 540 512 -988 -289 1165 -7 -773 526 384 -380
1265 -380 125 -35 -236 681 203 -906 248 690 -809 -525 834 225 -411 -272 -342 -73 646 -137 -476
1284 -476 464 -56 -901 167 1049 173 -509 -388 -108 594 442 -260 -74 227 -542 -342 855 603 -405
1303 -405 -674 -417 340 759 -113 -707 -3 -150 -567 351 913 -112 -990 -612 227 969 581 -634 -511
1322 -511 208 -80 120 1006 502 -956 -967 156 1089 836 -446 -1010 -278 183 107 531 609 -694 -1372 -339
1342 -339 939 1110 -71 -1144 -754 246 483 501 573 -234 -1170 -567 886 1361 462 -939 -1169 100
1360 100 919 740 354 -225 -858 -860 388 1340 804 -831 -1462 -573 839 1065 166 -557 -846 -728 99 1132
1380 1132 1119 -360 -1595 -958 826 1533 605 -607 -878 -562 91 960 1286 134 -1516 -1261 489 1558
1398 1558 890 -477 -1292 -782 264 768 835 394 -1071 -1727 -149 1687 1302 -346 -1329 -1016 147 1116
1416 1116 1004 355 -571 -1428 -734 1274 1790 170 -1391 -1173 12 900 852 333 -501 -1279 -938 654
1434 654 1516 501 -1078 -1464 -252 1101 830 -73 -323 -769 -840 576 1669 506 -948 -1201 -521 951
1452 951 1840 133 -1233 -644 -337 -88 1553 1471 -1102 -1868 -520 368 1304 1404 -848 -1895 -350 323
1470 323 235 1333 719 -1785 -1485 611 941 700 267 -930 -901 629 668 58 389 -67 -1141 -149 1564
1489 1564 759 -827 -1003 -291 451 852 591 -371 -1019 -717 -100 795 1476 194 -1970 -1470 759 1050
1507 1050 372 629 -294 -1709 -545 1093 733 687 343 -1652 -987 1574 725 -799 589 405 -1523
1524 -1523 -45 1390 -475 -594 549 -634 -221 1511 -348 -1956 619 1015 -838 505 1241 -1329
1540 -1329 -1380 855 626 394 1055 -695 -1701 373 1034 -145 588 803 -1202 -1358 652 968 146 143
1558 143 -254 -749 -163 488 88 -34 429 -113 -940 49 946 -280 -777 729 521 -604 137 372 -656
1577 -656 210 889 -575 -193 1126 -762 -1310 1423 1034 -1305 7 769 -1062 -305 1016 -476 -352
1594 -352 994 -825 -1234 1405 450 -1708 484 1295 -1077 -534 1009 -273 -384 883 -271 -597 896
1611 896 25 -1015 724 971 -917 -456 748 74 -393 169 -80 -298 58 70 -67 172 -52 -620 -396
1630 -396 501 757 -217 -704 63 30 -394 546 938 -319 -651 -70 -206 456 1097 -381 -967 551 159
1649 159 -774 765 943 -930 -555 550 -233 -32 644 -784 -678 1078 158 -1009 436 337 -1071 156
1667 156 1258 -95 -572 -242 -728 216 1558 215 -836 -68 -357 -713 896 1414 -79 -977 -881 -238
1685 -238 890 861 -216 -405 -404 -695 -3 930 554 -396 -856 -535 600 899 -209 -529 130 -241 -179 804
1705 804 490 -507 -557 -263 378 1181 164 -1163 -530 330 62 501 808 -523 -1263 -404 297 957 956 -678
1725 -678 -1461 -89 571 365 726 311 -982 -882 262 794 929 85 -1124 -688 643 523 159 254 -426
1744 -426 -846 -38 631 592 129 -914 -1058 476 955 75 -264 -344 -785 -232 767 707 60 -627 -1085 -58
1764 -58 1346 648 -463 -495 -380 -344 555 985 202 -618 -978 -466 921 1296 -235 -936 -461 -106 197 757
1784 757 493 -497 -1000 -629 477 1255 376 -888 -814 -66 252 516 539 -78 -726 -695 148 1105 847 -584
1804 -584 -936 -102 318 336 384 -20 -537 -559 -23 579 736 -247 -1099 -485 572 496 123 -109 -442 -413 10
1825 10 463 593 137 -847 -773 469 811 224 -233 -414 -335 49 431 477 255 -481 -890 -111 922 593 -381
1846 -381 -616 -269 -43 187 376 301 -277 -793 -332 608 782 -58 -634 -284 132 263 258 304 32 -406 -480 294
1868 294 758 165 -542 -459 102 319 61 -2 -65 -240 -509 -37 555 322 -386 -565 -25 350 281 -148 -160 17
1890 17 -81 -202 249 563 -54 -600 -141 497 266 -68 -133 -17 -20 10 -15 175 230 -219 -553 154 532 -98 -427
1913 -427 8 135 -87 -110 92 72 22 -133 -145 308 341 -354 -310 374 324 -257 -139 175 27 -85 43 82 186
1936 186 105 -388 -259 409 121 -489 -80 439 -133 -383 46 232 -11 -54 -37 0 147 -62 -402 171 729
1957 729 -130 -651 109 370 -192 37 502 -26 -416 -201 -65 242 533 -133 -649 86 249 -477 -27 679
1977 679 -48 -601 -36 191 -28 121 -39 -204 336 316 -508 -197 571 51 -388 396 459 -456 -455 103 203
1998 203 425 363 -477 -541 146 66 -87 567 483 -843 -825 263 448 139 117 -172 -513 -71 183 81 492
2019 492 450 -649 -639 567 510 -360 -53 345 -178 -114 232 -27 -155 156 -217 -97 670 61 -1057 -250
2039 -250 713 49 -108 317 -200 -573 -11 258 420 548 -211 -967 -31 745 127 -118 282 -180 -582 -44
2059 -44 537 301 -120 -429 -300 246 370 -24 -306 -36 18 -243 106 432 28 -621 -367 385 433 21 -204
2080 -204 -293 -142 170 145 221 352 -188 -764 12 758 211 -256 -98 -137 -58 182 31 -33 120 -310 -444 385
2102 385 574 -355 -500 67 205 153 161 -73 -179 -105 -202 242 778 196 -598 -355 127 324 435 62 -150 -77
2124 -77 -409 -397 634 707 -406 -465 -17 -51 27 203 -179 -76 190 -385 -345 551 224 -667 14 672 -56 -304
2146 -304 13 -126 154 389 11 4 199 -447 -634 447 802 -69 -376 -255 -217 -6 286 250 191 -165 -688
2167 -688 -311 401 459 19 -233 -116 32 -160 -116 477 376 -305 -276 173 79 -96 39 -129 84 385 -284
2188 -284 -554 403 299 -545 164 638 -327 -495 98 -49 142 585 -306 -581 412 -57 -567 555 734 -489
2208 -489 -452 265 -42 93 442 -195 -151 332 -320 -434 539 462 -472 -102 289 -47 -225 -11 84 119 117 -366
2230 -366 -152 294 -62 -281 89 317 -45 -293 -195 264 312 -256 -112 295 -35 -333 73 156 111 58 -253 -223
2252 -223 406 59 -566 131 476 -300 -339 295 -84 -137 161 -117 -93 395 -158 -498 389 436 -413 -43 352
2273 352 -179 -160 257 -57 105 265 -366 -282 521 133 -440 58 292 -194 -205 34 24 143 -112 -356 195
2294 195 336 -241 -284 197 134 -145 -21 54 87 109 -321 -100 489 117 -406 44 252 -98 -74 13 3 78 -149
2317 -149 -355 255 396 -335 -322 223 84 -205 53 53 -22 74 -199 -157 384 163 -517 -17 368 -41 -71 139
2339 139 41 -71 48 -209 103 396 -192 -437 246 276 -170 -131 67 64 -30 -91 -101 271 109 -366 -87 376 54
2362 54 -229 -20 108 74 -37 -45 93 246 -144 -305 81 396 -26 -195 25 0 -39 -66 -64 266 31 -459 -212
2385 -212 237 169 -229 -142 26 3 -44 -120 143 333 -39 -378 150 473 -85 -198 137 129 -45 -38 -4 211 116 -268
2409 -268 -162 343 171 -288 -240 186 93 -198 -104 146 87 -220 -197 78 285 -39 -278 -68 222 5 -101 92
2431 92 162 -90 -197 30 281 146 -76 -193 62 267 64 -182 45 86 -161 -171 232 302 -189 -326 -49 219
2453 219 207 -17 -158 -33 -70 -158 58 388 167 -343 -367 161 343 92 -32 40 -72 -145 -104 110 226 0
2475 0 -293 -228 229 203 -203 -126 207 15 -201 3 145 -54 -107 -104 138 360 -48 -412 -30 335 78 -68 160
2498 160 61 -342 -182 174 431 175 -317 -375 48 171 -23 31 234 -81 -352 -168 237 357 -140 -327 61
2519 61 200 -88 1 225 5 -77 62 -27 113 217 -309 -277 434 287 -365 -133 122 -198 -58 287 25 -36
2541 -36 -64 -455 -222 551 229 -441 -39 149 -308 -42 304 5 -162 -5 -249 16 438 -29 -413 174 327
2562 327 -258 -106 333 -19 -278 -94 180 153 11 -172 -219 78 222 -7 -187 159 5 -438 -150 603 186
2583 186 -397 -35 151 -168 16 275 -98 63 301 -413 -281 554 96 -602 305 434 -435 -212 322 -185
2603 -185 -67 467 -181 -291 434 -144 -609 480 616 -540 -223 417 -303 -251 451 129 -122 275 -251 -532
2623 -532 356 525 -296 -54 424 -290 -489 188 383 1 49 -62 -326 -63 121 -17 52 356 -46 -613 -79
2644 -79 526 8 -154 221 89 -360 -32 196 -41 212 332 -252 -150 498 -184 -541 558 442 -459 -86
2664 -86 282 -370 -177 394 -19 -45 285 -523 -698 500 546 -362 45 319 -535 -412 475 337 57 153 -383
2685 -383 -457 399 398 -258 88 273 -395 -351 440 286 -186 -109 -33 -54 185 51 -252 -13 140 -76 -107 201 65
2708 65 -385 -221 318 299 -28 -172 -150 -198 155 368 126 -6 -83 -467 -181 597 458 -339 -283 -32 -208 115
2730 115 423 20 -199 -100 -255 17 566 157 -506 -125 325 -21 49 267 -51 -245 -18 115 253 268 -278
2751 -278 -619 143 458 9 -92 66 -287 -268 166 355 254 -206 -585 -267 394 423 -55 -153 -122 -220 -56 321
2773 321 424 -74 -465 -371 276 479 170 -63 -241 -155 -28 189 324 148 -324 -474 14 487 254 -201 -252
2794 -252 -121 -48 166 189 29 -144 -358 -139 351 459 -128 -425 -146 80 101 254 95 -165 -233 -155 242 534
2816 534 112 -427 -314 110 233 191 69 -118 -278 -247 123 394 352 -280 -514 -87 330 247 -1 -93 -213 -172
2838 -172 28 259 383 -30 -488 -260 334 409 69 -170 -119 -115 9 163 311 91 -341 -378 121 441 117 -227
2860 -227 -231 -53 36 139 216 43 -207 -337 -3 445 314 -157 -249 -101 104 109 162 85 -169 -287 -123 250 333
2883 333 -93 -334 -194 115 182 48 9 -123 -229 -196 101 308 146 -278 -281 54 200 127 -64 -73 -4 -72 8 280
2907 280 203 -113 -239 -9 251 142 9 -72 -49 4 -5 33 174 9 -333 -174 214 199 -57 -201 -48 -26 67
2930 67 -61 -3 106 -77 -195 95 302 61 -255 -46 219 59 8 87 5 -30 -46 -149 81 232 -106 -255
2952 -255 29 186 -116 -176 131 103 -104 -124 5 -1 58 -56 -27 182 115 -182 -165 242 112 -211 -26 117 -105
2975 -105 -107 38 41 58 20 -121 -116 206 23 -257 -60 285 -47 -168 105 -7 -158 91 119 26 189 -110 -343
2998 -343 6 481 78 -236 46 44 -265 28 360 91 -124 -96 -242 3 356 28 -256 12 71 -311 31
3019 31 383 -104 -385 11 172 95 146 -12 -299 13 357 -29 -40 270 -182 -502 230 516 -38 -167 -82 -302
3041 -302 -19 387 12 -141 19 -251 -430 343 582 -231 -434 84 -43 -43 281 59 -318 7 54 -66 378
3062 378 289 -480 -455 402 362 -77 37 -60 -447 -112 457 325 6 -137 -539 -331 528 512 -142 -249 -88 -393
3084 -393 -135 563 338 -294 -273 -85 -64 331 378 -354 -328 267 -24 -94 336 124 -517 -97 422 172 43 -37
3106 -37 -505 -233 568 322 -139 -7 -222 -588 53 882 280 -388 -281 -390 -48 509 400 -113 -114 -181 -364
3127 -364 294 723 87 -457 -204 44 89 123 193 -146 -163 15 28 112 113 -170 -344 110 458 84 -291 -152 -122
3150 -122 -98 291 434 -59 -352 -272 -184 347 664 24 -518 -197 -48 -55 356 452 -227 -514 -146 0 267 370
3172 370 -204 -443 22 115 -91 131 194 -286 -234 221 183 61 -38 -247 -108 302 251 -90 -65 -80 -214 32 418
3195 418 272 -142 -395 -227 234 364 116 -88 -182 -278 -116 236 288 93 -273 -353 14 293 60 -103 30
3216 30 -171 -134 145 179 8 -78 -199 -87 273 271 -159 -135 117 27 -12 189 37 -168 -147 -2 102 337 0
3239 0 -304 -143 104 70 86 136 -85 -96 -55 83 271 138 -154 -207 79 104 -7 19 29 -49 -74 -39 52 154 -73
3264 -73 -299 58 230 -55 -103 37 -69 -39 85 -5 87 89 -209 -129 210 193 -163 -7 148 -34 13 86 33 65
3288 65 39 -94 34 237 -3 -227 71 81 -32 -25 -16 -39 15 -59 -64 54 90 -161 -79 125 137 -57 -34 32 89 108
3314 108 -143 11 191 25 -112 97 145 -42 -93 -75 82 159 -43 -150 -3 29 -114 3 167 6 -228 -69
3336 -69 6 118 119 -140 -120 64 45 -67 81 108 -131 -139 81 187 137 -15 -174 -45 169 19 -37 148 -27 -215
3360 -215 -54 211 133 50 -195 -144 120 110 -48 47 -19 -142 -114 57 216 53 -195 -201 30 190 46 -83 -76 -82
3384 -82 -29 66 228 96 -148 -192 -61 240 161 -46 -154 -39 -75 -1 206 94 -117 -213 -116 108 282 47 -210
3407 -210 -122 18 7 176 216 -1 -253 -161 54 241 176 -214 -269 -86 149 42 26 54 -192 -238 50 277 119
3430 119 -92 -282 -82 182 224 9 -43 -29 -94 -34 183 238 -79 -277 -125 96 213 121 -75 -154 16 49 89
3453 89 201 126 -263 -271 71 244 35 -65 -141 -167 8 114 32 -8 -78 -232 -134 312 232 -131 -168 -58 -36 113
3477 113 221 75 -121 -184 -102 78 342 130 -264 -174 115 24 36 171 -13 -233 -111 114 110 99 -62 -281 -35
3500 -35 193 149 -109 44 -6 -139 52 264 127 -161 -74 -90 58 216 69 -220 -14 -58 -111 102 258 7
3522 7 -293 -145 100 120 179 0 -187 -55 65 -77 38 202 7 -192 -1 209 2 -91 -8 28 78 68 25
3545 25 -29 -4 -90 -90 162 214 -89 -324 -35 80 3 90 59 -93 -187 -7 57 142 195 -43 -218 -4 65 -39 90
3570 90 214 49 -124 11 106 14 27 -56 -1 89 -13 -176 -145 125 46 -20 26 78 -125 -143 59 159 105 -18 -136
3595 -136 -143 88 113 23 101 66 -117 -212 92 244 66 -62 45 3 -60 -2 26 81 126 51 -156 11 26 -59 -47 243
3621 243 60 -122 -119 -42 6 92 117 11 -44 -28 -152 -97 251 111 -106 -50 -7 -26 -83 118 152 -7 -75 -65 -57 76
3647 76 39 -76 16 174 -24 -189 34 147 9 -45 105 13 -112 -19 -24 75 204 -1 -232 -72 123 -136 -24
3670 -24 274 61 -240 -90 53 -10 86 60 -121 -93 82 -68 -73 218 62 -262 -4 118 -44 -80 75 33 12
3693 12 115 -21 -101 56 64 -26 86 206 -90 -201 35 86 13 -11 -27 -115 -65 -3 -52 61 70 -105 -252 39 193
3718 193 -39 -73 89 4 -92 73 36 -51 28 -4 -81 102 210 -93 -128 176 56 -57 91 137 -66 -80 26 6
3742 6 69 62 -139 -72 138 65 -98 51 56 -128 -61 106 125 12 -60 -91 -31 83 -32 -87 16 132 -57 -38 141
3767 141 107 -66 -93 55 88 -66 -55 -71 -28 3 -51 -10 128 25 -133 -68 145 50 -97 21 7 -41 26 8 8 73
3793 73 -10 -192 -15 145 14 -147 -21 17 -48 -10 38 -52 29 -11 -98 71 123 -51 -126 84 102 -27 -26 53 29 11
3819 11 -43 41 116 71 -76 9 88 59 2 5 69 19 -66 -13 76 38 -76 -54 62 -7 -14 -74 63 31 -59 -68 -14 78 -5 -68
3849 -68 -5 56 -9 -27 15 23 3 -33 -20 39 109 -13 -49 47 74 -4 -26 11 50 0 -38 -82 23 31 -94 -90 40 28 -8 11
3879 11 28 -13 27 -32 38 104 -21 -32 -52 6 7 -5 -5 47 48 -50 10 155 38 -90 -41 27 67 -37 1 1 -41 -33 -80 76
3909 76 38 -39 -52 -8 51 20 -24 -22 37 -1 6 29 64 2 -98 -35 121 63 -36 -62 -19 4 -56 3 18 27 -85 -108 33 76
3939 76 -11 -94 -18 25 14 -35 61 113 47 -78 -13 36 77 5 -73 19 35 27 -26 43 68 -2 -66 25 33 -6 -69 -6 78 -32
3969 -32 -6 -19 -11 12 -57 -64 70 66 -95 -32 0 72 -33 -27 10 76 -27 -96 -1 146 36 -86 -38 -5 19 -40 -42 13 -6
3998 -6 -76 -11 18 64 -12 -67 -56 96 -2 -47 -4 93 -35 -77 65 96 -63 -84 23 36 59 80 -34 11 25 -75 6
4025 6 99 130 -107 -111 38 27 25 81 79 -121 -17 -57 -24 137 181 -81 -57 45 24 -125 141 95 -108 -14 22 -42 -11
4052 -11 67 -115 -149 118 54 -173 -57 101 -64 15 148 67 -103 -31 -37 -34 198 108 -146 -145 62 -85 68 206 67
4077 67 -157 -82 61 51 87 86 -35 -140 20 -58 -65 163 64 -204 -125 151 -3 -139 48 4 -52 69 46 -75 -33
4102 -33 16 -93 81 246 -10 -243 -40 120 17 106 154 -84 -137 11 -25 90 234 -36 -214 -47 86 -52
4124 -52 27 176 -80 -238 0 77 -28 116 29 -187 -12 128 -73 -102 138 16 -110 75 153 -84 -135 11
4146 11 -7 57 162 -85 -215 -1 85 14 168 199 -143 -250 31 112 64 111 19 -249 -42 105 17 41 166 -167
4170 -167 -172 117 192 -52 -53 33 -77 -84 131 8 -54 19 -69 -84 189 146 -163 -181 94 62 -41 130 18 -182 -53
4195 -53 100 80 89 42 -149 -96 139 136 -20 64 47 -118 -79 185 138 -20 -7 -56 -36 103 60 -133 -32 14 -113 -28
4221 -28 150 46 -161 -83 75 26 72 29 -133 -38 55 46 20 65 -64 -169 2 141 67 31 23 -68 -86 14 40 -13
4247 -13 -22 -93 -138 22 115 -16 -70 -44 -8 2 12 50 -11 -64 -98 13 26 94 -44 -140 34 108 39 37 62 -11 -46 31 83
4276 83 63 -36 -90 -79 73 99 -40 -101 30 -3 -116 -5 81 21 -85 -72 32 -11 30 -47 -52 3 -10 -17 58 12 -51 -78
4304 -78 27 126 -12 -60 -34 -59 -19 0 -47 29 9 -44 -15 -43 66 -37 -34 37 60 85 20 -10 18 -11 -51 -2 17 65 -5
4333 -5 23 18 18 -43 -20 -6 31 -64 -18 -21 3 -16 -40 -9 38 -5 -51 43 86 35 -125 -31 47 27 -60 30 77 -29 -20 23 95 39
4365 39 -4 -80 34 80 3 18 -65 -15 -48 10 36 39 -42 -97 -32 58 97 18 -22 -54 -62 -79 104 69 30 -112 -86 22 89
4394 89 34 5 -63 -19 -10 46 111 72 -37 -141 -2 60 133 -7 -1 -57 24 72 72 42 -28 -146 -71 72 154 44 -58 -108
4422 -108 -49 2 44 34 -18 -99 -111 53 131 67 -116 -162 -98 66 94 86 -44 -72 -94 23 82 78 -18 -112 -102 14 152
4449 152 7 -40 -75 -146 -19 135 135 39 -113 -84 -15 128 137 -25 -100 -60 -54 52 145 28 -172 -121 -13 47 94 31
4475 31 -148 -93 -6 61 75 129 -42 -191 -46 166 141 -6 3 -51 -91 117 169 26 -56 -66 -97 27 109 41 -199 -111
4501 -111 -60 43 82 36 -68 -140 -82 -9 107 168 -46 -184 -41 150 90 95 64 -109 -151 37 113 16 58 -58 -187
4526 -187 16 213 -15 -52 38 -64 -50 63 129 -114 -114 60 12 73 95 -43 -136 6 67 -1 92 98 -134 -119 53
4551 53 93 63 76 -114 -156 27 66 50 66 -9 -72 -166 100 171 -61 -100 -81 -68 -15 119 36 9 12 -44 -76 147 71 -81
4579 -81 -93 110 30 -35 50 -68 -105 -2 57 4 78 -51 -159 -95 129 78 21 -38 -22 -158 4 147 70 -1 17 -84
4605 -84 -106 125 130 -48 -40 49 -56 -63 124 44 -82 57 -17 -12 35 -7 -98 15 88 31 -96 12 -64 -161 19 114 46
4632 46 -52 54 -55 -67 105 37 -20 -9 -9 -80 37 127 20 -112 30 4 -49 12 45 -11 33 56 -16 -45 55 35 -83
4659 -83 40 63 -66 -60 -19 -38 9 71 14 1 -36 -52 0 12 67 -25 -91 56 -16 -59 27 55 -18 -20 0 -16 -21 2 63 -25
4689 -25 55 -3 -50 -50 -21 39 4 -22 -31 -81 -19 -7 5 67 17 -56 -57 36 49 25 25 58 -32 11 79 3 -56 -63 17 -4 30 9 -49
4722 -49 -57 13 13 -25 31 22 -74 -23 118 51 7 -6 -66 -87 47 61 8 47 -36 -69 29 152 26 14 -44 -68 -41 14 75 -30
4752 -30 -72 -8 -24 63 69 -49 -109 -32 0 51 34 -31 -119 -47 -12 74 62 60 -57 -67 45 96 131 -17 -29 -15 44 56 87
4781 87 54 -95 -88 -26 58 83 38 -106 -75 -42 32 50 85 -33 -147 -34 86 65 39 3 -86 2 55 9 8 53 -104 -104
4809 -104 32 152 -38 -87 -63 -91 63 85 30 -20 -68 -91 -16 154 137 -64 -82 -16 39 53 9 -49 -88 -29 -4 46 92
4836 92 -9 -98 -32 17 90 67 -118 -70 -39 -78 68 31 -38 -69 -74 -29 88 81 22 -68 -50 -26 40 62 54 -10 -49 75 72 73
4866 73 -7 -44 -78 33 68 -36 28 -63 -106 -72 30 31 -39 -43 -81 -6 82 34 -29 -30 3 -67 26 109 35 -22 -63 37 70 31
4896 31 -12 -37 39 -8 59 60 53 -52 -50 -24 94 37 -47 -53 -53 -34 -31 45 48 -20 -53 -7 -12 71 -9 -100 -29 9 -35 19 91 6 -31
4929 -31 26 3 30 -28 12 -9 -56 34 -3 19 -24 -45 -54 -15 33 -19 -34 -76 -51 33 11 -5 -32 18 -9 -33 20 42 10 -10 -36
4960 -36 -3 35 28 -32 -41 -1 -11 -44 14 2 -72 -80 -35 2 -25 -94 -23 -37 24 -13 -19 30 -31 -28 3 39 62 -28 -64 9 -22 -19 57
4993 57 6 -63 -12 -3 -39 19 -5 -75 17 39 76 -56 -6 -11 -41 -28 5 -19 -24 11 -25 -13 42 -64 -15 2 49 64 42 44 -9
5024 -9 -53 46 -3 -22 22 -13 -66 -3 28 -18 -38 36 -27 -12 2 -18 11 -9 22 -16 26 0 -34 -30 55 52 -46 26 24 -29 -76 112
5056 112 -17 72 6 -45 -35 37 23 -4 18 65 -62 -86 -10 30 39 -10 -21 -84 3 40 7 84 45 20 -12 -39 33 -41 -16
5085 -16 61 44 4 31 40 -24 -19 39 39 -17 -44 -69 -81 33 35 11 -25 39 -59 -30 35 70 1 -7 -22 -25 45 42 25 44 53 17 -80 59
5119 59 62 -36 37 35 21 -21 0 -72 -6 80 36 -30 -44 -29 -49 -11 115 -14 -73 -18 -68 -3 -13 50 48 -13 6 11 47 58 45
5150 45 -54 -23 -1 -44 -18 61 17 14 -47 18 -68 -10 4 -66 -42 69 -1 -64 21 29 -32 -14 52 -5 15 6 -16 45 106 -18 -71
5181 -71 36 49 -26 10 61 26 -65 30 13 -15 32 2 -18 -27 7 -12 -33 39 10 -46 74 40 21 15 -7 8 -59 21 -36 -50
5211 -50 62 -12 -51 63 119 -62 -56 8 46 -41 33 21 -45 11 14 -66 -29 98 -17 -68 -4 51 -43 -16 25 -11 -71 54
5239 54 -24 -26 58 23 9 61 -8 -105 20 56 -5 -5 81 -66 -83 -31 10 -7 -15 31 -66 13 63 -61 -46 -27 19 -63 0 16
5269 16 -26 -42 49 40 9 57 21 -2 0 58 2 -46 19 24 -69 32 28 -25 -53 -11 -6 28 19 -46 -41 3 -36 -76 -30 37 28 -32 38 -7
5303 -7 2 -48 -19 20 9 -17 -39 13 21 -8 -26 68 51 41 31 -5 -6 -14 -56 -4 6 31 -20 -87 -2 -3 -26 -27 -10 97 -56 39 -2
5336 -2 -50 -21 -9 13 -28 56 -57 -45 44 13 -11 -3 12 -38 -46 -39 -24 12 -8 -25 27 -2 38 -47 -23 31 -1 13 -16 20 15 11 -22
5369 -22 16 28 -48 -12 7 -33 28 35 35 43 -9 -15 -38 29 17 -64 -32 -30 -15 5 50 74 3 -20 -65 -59 -15 -28 48 10 -29 12 27
5402 27 -5 10 25 75 21 19 -4 -8 1 -12 29 -29 33 -11 5 -40 -82 6 55 -54 -58 -8 25 -9 -11 41 39 -63 -38 16 -14 62
5434 62 -21 -15 71 29 26 17 -15 -43 -13 -10 23 41 13 -61 -22 -1 -8 4 21 53 -58 -30 30 1 -37 -51 1 -6 25 4 -12 -11 -108
5467 -108 11 -15 72 10 -10 -7 -5 11 1 -5 40 -33 17 36 71 -18 1 -57 24 14 83 39 -17 -22 2 -17 14 3 -72 -43 23
5498 23 21 -11 -1 -7 41 -17 29 27 23 -30 -43 -90 2 -13 25 -48 -16 -56 5 23 -8 -6 -31 -9 -51 58 40 -36 -104 -52 28 -3
5530 -3 22 76 -3 31 2 6 -13 28 -2 -32 40 7 -55 1 24 -69 -76 -5 -21 16 -76 -75 25 21 -7 -7 -9 1 -52 1 47 17 -106
5563 -106 -56 21 22 -9 19 41 -8 -19 44 -57 32 -22 -61 -14 19 9 -27 -16 -37 33 -58 53 -16 -30 -20 -64 -40 45 15
5592 15 -24 -26 8 -26 -4 37 29 -16 -56 -50 -43 51 -36 -46 8 44 -54 15 29 -19 -39 -3 -37 28 1 35 -31 -24 72 16 -18 56 8
5625 8 -60 -4 24 -7 -3 -69 -46 -34 37 -50 -56 -32 13 -52 -19 27 6 -34 -20 11 -94 11 29 -30 -63 20 20 -43 36 -4 25
5656 25 42 27 -14 4 -19 5 -41 -38 -7 -38 29 -2 -85 14 19 -7 19 4 -53 -24 8 -4 -17 26 -41 -64 -7 45 -12 -13 41 10
5688 10 -35 19 67 32 -29 2 5 14 9 14 -34 43 10 -2 -29 -11 -47 -24 -9 4 -37 -14 2 -5 16 21 27 8 8 -12 -71 71 -6 -18
5722 -18 -44 8 47 -40 22 3 26 -53 -9 -46 24 -1 -4 6 -3 -13 -12 27 64 -11 -16 -49 11 27 -31 32 17 18 -30 -43 -29 28 -44
5755 -44 -38 44 58 -61 5 -77 0 13 -10 25 -42 -26 -77 -81 41 3 -41 -35 43 -15 18 29 19 -1 9 -25 -10 61 18 -32 -59
5786 -59 -13 -7 34 29 31 13 -55 -16 -35 4 -45 -71 -21 23 19 -5 11 -17 10 -4 -14 23 29 -16 -43 58 52 42 -16 -13 12 -26 0
5819 0 50 -4 -82 -65 4 17 -8 -22 -57 -5 11 18 -44 -29 43 -106 14 67 48 -1 -18 -70 -31 21 8 -6 -48 -25 -76 11
5849 11 26 -7 -81 -39 -18 -20 -25 39 11 -5 -23 -16 50 -11 -38 -63 35 36 7 -76 -43 -23 -9 34 27 8 -16 -23 -14 -9 36 37 -19 2 -3
5884 -3 13 -17 48 7 -54 -46 -18 7 -11 -26 -15 -29 -18 30 28 -33 -28 -41 -2 21 29 40 45 -12 -17 26 -3 2 29 -22 -38 14 -7 -26
5918 -26 -54 6 8 -39 -9 -28 -54 -35 -16 11 1 -40 -46 -30 42 -16 10 -24 -24 41 -44 16 20 1 -5 -36 -23 7 25 4 -3 -14 0
5951 0 -8 72 -5 -21 2 56 -22 11 -14 -32 -12 -7 -4 -67 46 -21 -40 2 -1 8 -58 -1 -24 45 -24 -47 4 -50 21 7 -13 18 -55
5984 -55 -53 -17 33 31 -52 14 9 4 -16 -46 3 39 6 -7 0 38 -15 -62 40 24 -15 17 -19 -27 -5 -21 -77 -12 66 -16 -25 -44 29
6017 29 -50 -56 -1 15 18 -4 -15 -10 49 -44 -4 9 -11 -25 9 6 12 -1 -28 57 -8 1 25 -7 -29 -25 -56 32 35 -68 -107 -27 -9 -19
6051 -19 -33 -22 -15 -62 -28 -23 -29 30 -37 -15 18 23 -16 -20 52 33 11 -6 32 16 33 42 -8 50 0 -33 26 15 -9 -9 25 -25 -22 -41
6085 -41 30 -6 -49 -25 -7 -18 19 -39 26 -19 6 -61 -99 34 11 1 27 8 16 -29 -48 -19 -14 40 -22 -8 43 1 -22 5 19
6116 19 -27 -41 15 23 3 -36 -10 -8 25 -13 -48 34 -37 1 -51 33 0 12 -14 -59 13 37 25 -19 -25 -40 -60 0 2 -22 13 -7
6148 -7 -5 -5 -39 -31 31 12 3 20 21 33 -41 11 6 38 38 -51 -77 16 1 23 0 -1 -16 -11 -17 9 -7 17 -31 -116 -32 -25 -28 39 2 -27 12
6185 12 -49 -23 40 -5 -29 2 37 11 -33 4 -49 -71 -5 48 -11 -27 -39 2 25 27 36 -60 31 -38 -29 -35 16 29 -54 -20 2 -30
6217 -30 2 14 -16 27 -1 -33 -5 -16 -13 22 -24 -12 9 -36 27 6 -34 42 20 -29 39 -6 -56 -5 58 16 -69 -1 -7 17 2
6248 2 55 31 3 3 11 18 0 53 -29 7 20 -39 -67 -20 25 -5 -8 25 8 -32 -58 57 29 28 -5 -59 46 15 -20 -15 38 5 -38
6281 -38 56 -42 1 40 -52 12 -44 -2 7 8 5 -5 -8 -5 -16 -52 -18 -47 -17 -45 -11 3 -28 -2 3 -29 -35 1 -23 -7 7 4 11 28 -4
6316 -4 -13 -26 38 54 26 -5 -44 -35 25 -15 -30 -30 -6 -27 -51 29 24 1 21 -33 -15 32 9 -8 -4 1 -84 23 27 17 35 -25 53 -27
6350 -27 14 -27 23 30 -25 -1 -18 -21 6 11 -42 52 -3 -52 -21 54 13 32 -64 -5 15 -5 -16 -23 54 -31 -29 -5 -33 -24 1 27 10
6383 10 40 33 -22 -10 -4 -17 -35 -2 -17 -9 14 -43 26 2 -41 -57 -14 31 30 -20 6 -25 3 -18 45 14 -21 22 3 43 -4 -31
6415 -31 -25 2 8 -28 -26 10 8 7 -29 81 10 -47 -31 -26 -1 -61 25 -5 42 38 35 9 70 -61 -80 -12 -26 -30 42 18 -6 -36 -33 -3
6449 -3 -27 14 38 -57 -39 27 9 41 23 28 0 -56 -15 -51 -17 -10 -13 11 17 18 -34 -46 9 -23 -33 46 -3 3 7 4 -15 1 42 5 6
6484 6 -75 -44 -39 44 -14 -27 2 -4 -47 19 -43 -21 13 -9 -4 -16 -8 29 -23 -13 5 -18 -30 -13 68 -17 -22 3 -39 0 -38 -31 -71 13
6518 13 -40 -40 35 50 -40 -46 13 10 -78 -46 5 44 -22 -30 14 -57 15 -33 25 29 -4 -37 -7 12 -18 32 -22 26 -9 -31 0 65 35
6551 35 -94 -28 -7 26 -7 0 -24 -51 -72 28 -7 14 19 -17 -5 17 10 -15 -4 12 26 -27 47 3 -7 -21 37 18 7 12 -10
6582 -10 8 -12 43 14 -27 3 -8 -72 20 -20 23 -8 -19 -62 -27 -15 -49 13 34 -9 -5 9 10 -2 -51 -45 38 40 -44 -26 -14 18
6614 18 2 10 1 -12 -53 12 -59 -9 -51 14 21 -20 5 -42 -7 69 -77 -20 -8 -7 -31 -73 62 75 -46 -24 6 2 -45 -22 -37
6645 -37 -13 -22 -20 7 17 -18 -7 -32 -19 -9 -12 -39 -21 34 -15 24 30 8 43 -41 19 33 10 -23 13 -44 -2 -48 6 6 -6 33 -60
6678 -60 -74 -9 -10 -122 -42 9 -50 -33 42 12 -14 -3 7 -44 -5 -10 -83 -72 39 59 -18 -36 51 0 -59 -12 26 -26 -10 -31
6708 -31 -31 27 -40 -9 -8 28 -15 -53 30 20 -26 3 5 11 -27 24 -11 -17 12 6 -39 37 26 28 -24 88 19 -28 7 8 -15 -8 14 -38
6742 -38 -43 -8 -55 -12 61 16 -34 -9 25 9 -34 -15 -23 -49 2 -54 -28 -40 -42 -23 -22 38 -48 -5 -25 2 -30 -46 13 -4 5 -30 2
6775 2 26 3 -6 27 33 35 -22 19 28 -2 -60 -42 -16 5 -21 -17 11 -10 5 -86 55 -12 -7 -4 -28 -27 36 -27 45 -31 -77 -11 -28 -116
6809 -116 -6 -18 -54 19 20 -34 -17 -11 -7 -47 22 53 9 11 -30 -14 13 56 -50 -61 31 -11 -34 6 -26 -38 -38 25 -16 35 40 -39
6841 -39 -11 0 -47 -42 -58 -29 -7 -10 -52 0 -39 16 -18 -41 28 -17 16 11 15 -42 37 48 28 -22 -24 34 -26 24 -45 -17 -10 -19 20 2
6875 2 65 -35 20 -24 -38 -48 14 -10 -50 -32 14 -35 -12 35 -23 -60 -53 -5 -27 20 -27 17 -45 68 14 12 19 -41 -32 -1 23 -16
6907 -16 -66 -36 -16 28 59 -24 11 13 -28 -23 18 41 4 18 20 -1 -36 -3 -9 20 -41 5 -1 -8 -2 -25 23 12 -41 -45 32 -26 -27 -25 -1
6942 -1 17 1 -49 -30 41 47 27 7 -19 -12 1 -26 5 3 -38 -64 -34 10 11 13 -37 3 -28 -32 -6 1 -43 -6 -83 -39 -1 -4 39 -28 -34
6977 -34 -20 -4 29 -15 -15 -19 -11 -15 -34 11 51 50 -14 -27 -5 32 -19 -1 -2 -11 -52 -3 12 32 5 -18 -16 4 -17 1 -45 -74 1 -46
7011 -46 -38 34 -77 -26 -35 33 13 -14 20 2 -12 9 -13 -28 -35 35 14 -43 47 -56 -12 -20 -10 -17 1 -32 -47 -31 -55 8 0 31
7043 31 7 -13 -19 -42 -4 -1 -58 29 -7 25 -64 -19 8 -39 -20 28 26 -17 -7 -38 -36 3 -18 5 -26 1 24 -8 -2 24 -22 25 26
7076 26 17 -41 32 49 23 10 25 -37 -29 6 -20 -73 43 -5 -24 -32 -13 -26 -11 45 -23 12 -17 -15 -44 -11 -32 -31 49 16 -62 -15
7108 -15 31 -7 15 7 3 -48 2 36 -35 -35 -30 -43 5 1 -46 -66 -51 12 -13 22 -15 -4 -67 -66 -24 -35 42 -1 1 -11 -1 27 -51 -33
7142 -33 17 -63 -6 6 -63 19 -34 -15 40 -6 5 -57 62 24 -64 -23 16 -21 -36 8 -68 -28 -31 31 29 11 9 -39 -16 -18 -15 -49
7174 -49 -2 -3 -17 31 -5 6 34 5 -17 19 -5 -32 -89 3 33 32 25 -5 23 26 9 25 -24 24 -85 -55 48 80 -51 -74 31
7205 31 8 -26 24 -52 -76 2 -14 -39 -6 -15 9 -9 5 -18 -51 -5 -14 -28 -6 -20 -30 -47 13 -57 -1 32 30 2 -25 -1 12 12
7237 12 15 -7 19 -38 6 -13 31 -41 -47 7 -14 -56 2 -20 -3 -40 -37 6 31 12 -61 -40 -13 15 -16 -39 8 3 -2 -19 11 14 -10
7270 -10 2 23 10 -49 66 27 -80 -87 -26 -27 20 51 -31 -16 30 48 -13 -13 -52 -43 -5 63 36 23 -40 7 -4 46 -49 -45 21 -32
7302 -32 12 -33 7 -28 10 -8 18 2 32 -4 -23 1 -35 -35 6 -10 -9 12 1 -19 12 -35 -8 21 40 58 -59 1 -11 -23 52
7333 52 -20 52 -31 -10 -66 -26 -18 -22 43 -15 -53 9 -13 -16 -6 8 -65 39 17 -39 56 -2 18 10 42 -23 5 -10 13 -10 2 -56
7365 -56 22 -6 0 34 7 15 64 6 -2 -3 -34 -31 11 -3 19 21 29 -15 34 -31 29 -32 10 9 -7 -11 20 1 71 28 -42 -17 -20 13 -16
7400 -16 66 -17 -26 -5 15 -9 -1 15 -10 23 -36 51 7 1 21 10 6 5 42 52 12 -16 -9 -43 -15 -12 12 -13 4 1 29 -20 9 25
7434 25 3 -25 -6 -15 -29 41 -31 85 -8 8 17 -2 -16 -3 -7 -6 33 -6 17 -9 -6 -7 -2 19 30 52 1 -16 -39 3 46 5 -74
7467 -74 -17 0 -16 -7 -47 9 32 -40 -18 50 8 3 -9 -41 -1 -12 52 -11 -63 -24 33 -36 13 24 4 -50 29 7 -60 67 41
7498 41 -67 -39 41 -13 -15 33 -5 -41 25 11 -62 -19 -31 5 -21 20 -21 -15 -8 -8 6 26 69 26 -38 -24 -1 15 85 -15 -38
7529 -38 -57 25 9 3 12 8 7 43 23 54 24 -38 -24 1 -17 0 -63 -12 -19 -52 15 -13 12 11 -30 -12 -21 41 12 -53 1 47 -8 -41
7563 -41 17 -14 -17 1 11 34 7 7 -23 -7 32 37 -16 -53 -21 3 47 -25 3 -35 -58 13 6 28 6 -25 11 -12 -46 37 28 -86
7595 -86 -23 0 -26 -6 -14 52 -61 -7 -1 -21 -20 47 -35 -63 26 -1 14 5 30 1 -9 36 37 -32 18 -34 -70 -5 -3 -24 -28 28 0
7628 0 -47 18 -14 -19 -13 43 -14 -20 -51 -80 -54 -29 46 -71 57 -6 -37 31 10 5 30 29 -26 -36 61 47 -42 25 35 24 -36 20
7660 20 28 -11 -41 -37 18 25 -53 -9 -16 8 20 -53 12 -34 -61 51 45 -10 -2 54 -6 -12 54 -15 -28 -6 42 -1 7 77 -3 -39 26 12
7694 12 -34 5 7 31 -48 -12 23 -9 0 -37 -45 2 -5 -47 -23 14 -16 -11 -24 -18 -10 -24 -34 -6 -11 -26 -31 -33 15 -31 2 -31 -21 -47 -50 -31
7730 -31 -6 -31 -1 -4 -10 -25 6 45 21 43 52 -23 25 0 -7 19 25 -9 -15 -6 -68 21 -15 -30 -27 -32 -11 -6 -48 12 -47 -52 -28 -43 30 30
7766 30 32 11 23 33 11 -20 -15 -45 -20 -31 -35 -15 -27 -38 -41 -17 14 -8 -1 -6 -3 -50 17 59 -24 -12 -97 -13 -18 23 -46 -20 -62 -15
7800 -15 19 -23 -7 -26 -5 -24 -21 26 -60 -17 -18 15 13 -19 30 26 4 7 0 -50 -10 16 25 -17 24 25 33 -5 -39 -29 10 48 39 9 -45
7835 -45 -4 2 -11 30 3 -20 -66 -27 23 -45 -45 -10 -31 -19 -33 -56 -41 -20 -17 -26 34 -16 5 -5 -28 7 40 34 5 53 21 37 60
7868 60 39 36 -14 -45 -30 -24 22 13 -42 -48 15 -17 -32 -56 -53 -55 -23 0 -2 2 -33 17 -21 -32 -25 -20 -14 8 5 -26 23 18 26 24 -8 -23 -19 25
7906 25 29 -31 -43 9 0 -6 5 -6 -41 6 -16 -3 -17 -24 -67 -15 17 -12 -4 -49 -66 -26 -52 -30 -14 -26 -15 -11 -22 -27 5 20 -52 -46
7940 -46 1 22 28 -45 13 40 -12 -31 5 -9 38 22 36 -16 -14 25 -29 -27 24 -8 -55 -35 -38 -34 17 -4 -11 42 -42 -17 -1 -17 26
7973 26 -4 -46 -57 21 7 -45 -74 -36 47 -49 -16 -36 -2 -8 6 27 9 -53 9 -10 17 -39 -34 -7 -33 21 -28 36 -60 11 30
8004 30 -9 21 -48 5 53 -84 -19 -7 -74 1 12 -9 -62 -26 42 16 19 28 14 -55 -10 -13 22 -12 -31 -7 -34 27 -40 39 44 -38
8036 -38 5 35 -78 -36 -34 -16 -38 -12 14 5 -39 -10 -30 -17 -30 7 -56 -10 14 -46 -45 42 -39 -73 -40 -12 50 -54 -4 10 -5
8067 -5 -20 26 -61 -11 11 -1 7 -32 28 -14 2 33 6 39 49 10 16 -13 1 -21 -11 12 -19 -34 -5 -12 44 -12 20 36 59 -19
8099 -19 -41 33 -11 -8 31 -32 -21 -12 -26 -9 -14 54 -26 4 2 2 65 -36 -39 1 -15 45 1 -36 38 -41 -7 8 -19 8 -33 -21 5
8132 5 -77 -57 66 -21 -34 12 47 -39 -42 30 -8 -23 -21 -7 20 -54 -19 -45 23 16 -21 32 -1 5 25 -12 26 1 0 -26 -37 -5 44
8165 44 -8 -25 -16 -51 -87 -69 6 6 -1 -7 37 -11 -20 -39 -47 11 10 5 33 -27 5 -69 60 13 38 -21
8191b1
##END NTUPLES=NMR FID
##END=
