##TITLE=1H_3C1011
 CDCl3
 8 sc, 
 11.11.2021
##JCAMPDX= 6.0         $$ Bruker NMR JCAMP-DX V2.0
##DATA TYPE= NMR FID
##DATA CLASS= NTUPLES
##ORIGIN= UXNMR, Bruker Analytische Messtechnik GmbH
##OWNER= root
$$ XWIN-NMR		Version 3.5
$$ Thu Nov 11 10:41:31 2021 Russian Standard Time (UT+4h)  she@DPX200
##.OBSERVE FREQUENCY= 200.1313468511
##.OBSERVE NUCLEUS= ^1H
##.DELAY= (6, 6)
##.ACQUISITION MODE= SIMULTANEOUS
##.ACQUISITION SCHEME= undefined
##.AVERAGES= 8
##.DIGITISER RES= 18
##SPECTROMETER/DATA SYSTEM= spect
##.PULSE SEQUENCE= zg30
##.SOLVENT NAME= CDCl3
##.SHIFT REFERENCE= (INTERNAL, CDCl3, 0, 15.7039)
##AUDIT TRAIL= $$ (NUMBER, WHEN, WHO, WHERE, WHAT)
$$ ##TITLE= Audit trail, XWIN-NMR		Version 3.5
$$ ##JCAMPDX= 5.01
$$ ##ORIGIN= Bruker BioSpin GmbH
$$ ##OWNER= she
$$ F:/spectra/data/she/nmr/H-F/1/audita.txt
$$ ##AUDIT TRAIL=  $$ (NUMBER, WHEN, WHO, WHERE, WHAT)
(   1,<2021-11-11 10:39:48.46 +0400>,<she>,<DPX200>,
      <created by zg, POWCHK disabled, PULCHK disabled
       configuration hash MD5:
       00 E9 B6 7A A2 85 ED C7 34 08 36 98 17 FE 4E 26
       data hash MD5: 16K
       18 2D 4A C6 4F E0 ED 2A AE 02 B6 1A 43 4B 2F 43>)
$$ ##END=
$$ 
$$ hash MD5
$$ DF 99 A0 01 62 83 AA C4 CC F5 C8 DB AD D2 C4 48
##$RELAX= 
##$RELAX= 
##$RELAX= 
##$RELAX= 
##$RELAX= 
##$RELAX= 
$$ Bruker specific parameters
$$ --------------------------
##$DU= <F:/spectra>
##$EXPNO= 1
##$NAME= <H-F>
##$PROCNO= 1
##$TYPE= <nmr>
##$USER= <she>
##$AMP= (0..31)
100 100 100 100 100 100 100 100 100 100 100 100 100 100 100 100 100 100 
100 100 100 100 100 100 100 100 100 100 100 100 100 100 
##$AQSEQ= 0
##$AQ_mod= 1
##$AUNM= <au_zg>
##$AUTOPOS= <>
##$BF1= 200.13
##$BF2= 200.13
##$BF3= 200.13
##$BF4= 200.13
##$BF5= 200.13
##$BF6= 200.13
##$BF7= 200.13
##$BF8= 200.13
##$BYTORDA= 1
##$CFDGTYP= 0
##$CFRGTYP= 5
##$CHEMSTR= <none>
##$CNST= (0..31)
1 1 145 1 1 1 1 1 1 1 1 1 1 1 1 1 1 1 1 1 1 1 1 1 1 1 1 1 1 1 1 1 
##$CPDPRG= <>
##$CPDPRG1= <>
##$CPDPRG2= <>
##$CPDPRG3= <>
##$CPDPRG4= <mlev>
##$CPDPRG5= <mlev>
##$CPDPRG6= <mlev>
##$CPDPRG7= <mlev>
##$CPDPRG8= <mlev>
##$CPDPRGB= <>
##$CPDPRGT= <>
##$D= (0..31)
0 1.2 0 0 0 0 0 0 0 0.06 0 0.03 0 0 0 0 0.0002 0 0 0 0 0 0 0 0 0 0 0 0 
0 0 0 
##$DATE= 1636612787
##$DBL= (0..7)
120 120 120 120 120 120 120 120 
##$DBP= (0..7)
150 150 150 150 150 150 150 150 
##$DBP07= 0
##$DBPNAM0= <>
##$DBPNAM1= <>
##$DBPNAM2= <>
##$DBPNAM3= <>
##$DBPNAM4= <>
##$DBPNAM5= <>
##$DBPNAM6= <>
##$DBPNAM7= <>
##$DBPOAL= (0..7)
0.5 0.5 0.5 0.5 0.5 0.5 0.5 0.5 
##$DBPOFFS= (0..7)
0 0 0 0 0 0 0 0 
##$DE= 6
##$DECBNUC= <off>
##$DECIM= 32
##$DECNUC= <off>
##$DECSTAT= 4
##$DIGMOD= 1
##$DIGTYP= 9
##$DL= (0..7)
0 120 120 120 120 120 120 120 
##$DP= (0..7)
150 150 150 150 150 150 150 150 
##$DP07= 0
##$DPNAME0= <>
##$DPNAME1= <>
##$DPNAME2= <>
##$DPNAME3= <>
##$DPNAME4= <>
##$DPNAME5= <>
##$DPNAME6= <>
##$DPNAME7= <>
##$DPOAL= (0..7)
0.5 0.5 0.5 0.5 0.5 0.5 0.5 0.5 
##$DPOFFS= (0..7)
0 0 0 0 0 0 0 0 
##$DQDMODE= 0
##$DR= 18
##$DS= 0
##$DSLIST= <SSSSSSSSSSSSSSS>
$$ [...]
##$SUBNAM2= <"">
##$SUBNAM3= <"">
##$SUBNAM4= <"">
##$SUBNAM5= <"">
##$SUBNAM6= <"">
##$SUBNAM7= <"">
##$SUBNAM8= <"">
##$SUBNAM9= <"">
##$SW= 18.0517286264689
##$SWIBOX= (0..15)
0 0 2 0 0 0 0 0 0 0 0 0 0 0 0 0 
##$SW_h= 3612.71676300578
##$TD= 16384
##$TD0= 1
##$TE= 0
##$TE2= 300
##$TE3= 300
##$TEG= 300
##$TL= (0..7)
0 120 120 120 120 120 120 120 
##$TP= (0..7)
150 150 150 150 150 150 150 150 
##$TP07= 0
##$TPNAME0= <>
##$TPNAME1= <>
##$TPNAME2= <>
##$TPNAME3= <>
##$TPNAME4= <>
##$TPNAME5= <>
##$TPNAME6= <>
##$TPNAME7= <>
##$TPOAL= (0..7)
0.5 0.5 0.5 0.5 0.5 0.5 0.5 0.5 
##$TPOFFS= (0..7)
0 0 0 0 0 0 0 0 
##$TUNHIN= 0
##$TUNHOUT= 0
##$TUNXOUT= 0
##$USERA1= <user>
##$USERA2= <user>
##$USERA3= <user>
##$USERA4= <user>
##$USERA5= <user>
##$V9= 5
##$VALIST= <valist>
##$VCLIST= <CCCCCCCCCCCCCCC>
##$VD= 0
##$VDLIST= <DDDDDDDDDDDDDDD>
##$VPLIST= <PPPPPPPPPPPPPPP>
##$VTLIST= <TTTTTTTTTTTTTTT>
##$WBST= 1024
##$WBSW= 4
##$XGAIN= (0..3)
0 0 0 0 
##$XL= 0
##$YL= 0
##$YMAX_a= 97848
##$YMIN_a= -69175
##$ZGOPTNS= <>
##$ZL1= 120
##$ZL2= 120
##$ZL3= 120
##$ZL4= 120
##$ABSF1= 10
##$ABSF2= 0
##$ABSG= 5
##$ABSL= 3
##$ALPHA= 0
##$AQORDER= 0
##$ASSFAC= 0
##$ASSFACI= 0
##$ASSFACX= 0
##$ASSWID= 0
##$AUNMP= <proc_1d>
##$AZFE= 0.1
##$AZFW= 0.1
##$BCFW= 1
##$BC_mod= 2
##$BYTORDP= 1
##$COROFFS= 0
##$CY= 11.3945322036743
##$DATMOD= 1
##$DC= 2
##$DFILT= <>
##$DTYPP= 0
##$F1P= 2.36226072786647
##$F2P= -0.459571619588291
##$FCOR= 0.5
##$FTSIZE= 0
##$FT_mod= 4
##$GAMMA= 1
##$GB= 0.15
##$INTBC= 1
##$INTSCL= 1
##$ISEN= 128
##$LB= 0.24
##$LEV0= 0
##$LPBIN= 0
##$MAXI= 10000
##$MC2= 0
##$MEAN= 0
##$ME_mod= 0
##$MI= 1.114404
##$NCOEF= 0
##$NC_proc= 0
##$NLEV= 6
##$NOISF1= 3.799351
##$NOISF2= 2.8
##$NSP= 1
##$NTH_PI= 0
##$NZP= 0
##$OFFSET= 15.70392
##$PC= 1
##$PHC0= -15423.49
##$PHC1= 13.80081
##$PH_mod= 1
##$PKNL= yes
##$PPARMOD= 0
##$PSCAL= 0
##$PSIGN= 0
##$REVERSE= no
##$SF= 200.130013532006
##$SI= 16384
##$SIGF1= 3
##$SIGF2= 2
##$SINO= 400
##$SIOLD= 16384
##$SREGLST= <1H.CDCl3>
##$SSB= 0
##$STSI= 0
##$STSR= 0
##$SW_p= 3612.71676300578
##$SYMM= 0
##$S_DEV= 0
##$TDeff= 0
##$TDoff= 0
##$TI= <>
##$TILT= no
##$TM1= 0
##$TM2= 0
##$TOPLEV= 0
##$USERP1= <user>
##$USERP2= <user>
##$USERP3= <user>
##$USERP4= <user>
##$USERP5= <user>
##$WDW= 1
##$XDIM= 8192
##$YMAX_p= 0
##$YMIN_p= 0
$$ End of Bruker specific parameters
$$ ---------------------------------
##NTUPLES= NMR FID
##VAR_NAME=  TIME,          FID/REAL,        FID/IMAG
##SYMBOL=    X,             R,               I
##VAR_TYPE=  INDEPENDENT,   DEPENDENT,       DEPENDENT
##VAR_FORM=  AFFN,          ASDF,            ASDF
##VAR_DIM=   8192,          8192,            8192
##UNITS=     SECONDS,       ARBITRARY UNITS, ARBITRARY UNITS
##FACTOR=    0.0002768,     1,               1
##FIRST=     0,             0,               0
##LAST=      2.2672688,     0,               0
##MIN=       0,             -69175,          0
##MAX=       2.2672688,     97848,           0
$$ Real data points
##PAGE= N=1
##DATA TABLE= (X++(R..R)), XYDATA
$$ [...]
$$ plain form
748 2058 -694 1168 557 -3311 -717 2669 648 338 432 -2633 -1425 2421 1283 18 534 -1815
764 -1815 -2077 1556 1855 59 166 -1247 -2107 905 1897 -64 46 -532 -2129 243 2081 -27 -421
781 -421 -3 -1504 -244 2053 349 -900 53 -751 -481 1897 734 -1432 -162 -70 -710 1508 1405
798 1405 -1562 -1117 245 -340 893 1677 -1038 -1851 104 100 310 1694 -24 -2094 -614 526 490 1250
816 1250 365 -1566 -888 404 434 1062 908 -1071 -1395 174 674 744 666 -546 -1063 -151 168 456 863
835 863 -175 -1131 -304 447 222 213 87 -380 -284 76 135 288 61 -490 -54 463 95 -158 -32 -25 34 226
857 226 213 15 -259 -354 120 431 139 -214 -315 -276 -1 316 223 -34 -345 -564 -17 467 163 48 -63 -426
879 -426 -203 392 353 91 -11 -328 -198 342 185 1 318 -228 -551 328 239 -352 226 174 -545 94 251
$$ packed form
748B058k752J862o11l868K594L386k021l10R4l065J208L846j138j265N16k349
764a815k62L633K99j796J07j413q60L012R92j961J10n78j597K372J838k108l94
781d21M18j501J260K297j704j249R53q04K70K378j163k166J270R2o40K218j03
798A405k967M45J362n85J233P84k715q13J955mK10J384j718k070J480J140l6P60
816A250q85j931O78J292L0O28j54j979l24J569N00P0p8j212n17R12L19K88M07
835H63j038r56Q27P51k25rj26m67R6L60N9J53k27n51M36N17l68k53J26PN9J92
857B26j3j98k74r5M74L11k92l53j01L9K75L17r3k57l11k19N47M84l04j15j11l63
879d26K23N95l9k62j02l17J30N40j57j84L17n46l23Q79q9n91N78n2p19O39J57
$$ plain form
900 251 -546 96 565 -590 -264 710 -485 -608 895 99 -636 657 -58 -967 750 606 -874 516
918 516 748 -1403 -127 1448 -555 -530 1163 -648 -1110 1183 96 -1009 1069 187 -1677 512 1045
935 1045 -1183 14 1264 -927 -662 1014 -330 -549 1035 -123 -743 775 -80 -922 745 611 -632
952 -632 232 281 -753 -4 517 -122 373 201 -887 -148 325 -399 494 682 -900 -450 317 -646 328 1268
972 1268 -614 -693 683 -848 -605 2020 156 -1498 1005 88 -1970 1339 1732 -1759 39 1313
988 1313 -1970 -357 2411 -995 -1244 2127 -706 -2286 2032 739 -2436 1250 1599 -2229 106 1684
1004 1684 -1874 -357 2435 -776 -1079 1700 -1018 -2011 2171 1341 -1426 658 169 -2323 286 2042
1020 2042 -141 108 308 -1999 -934 1661 735 101 489 -1223 -1630 399 990 905 589 -1046 -1085 122
$$ packed form
900B51p97O42M69j155L26R74j195j23J503p96p35J293p15r09J717j44j480J390
918E16K32k151J276J575k003K5J693j811m62K293j087j105K078q82j864K189N33
935A045k228J197J250k191K65J676j344k19J584j158o20J518q55q42J667j34j243
952f32Q64M9j034P49N21o39M95j72j088P39M73p24Q93J88j582M50P67r63R74R40
972A268j882p9J376j531K43K625j864j654K503r17k058L309L93l491J798J274
988A313l283J613K768l406k49L371k833j580M318j293l175L686L49l828K335J578
1004A684l558J517K792l211l03K779k718r93M182q30k767K084m89k492K609J756
1020B042k183K49K00k307J065K595r26o34L88j712m07K029N91q5l16j635l9J207
$$ plain form
1038 122 -128 678 1560 -535 -1220 495 -419 -627 1697 382 -1322 1056 313 -2306 618 1650 -1557
1055 -1557 512 2345 -2161 -2041 1791 -415 -672 3121 -69 -3499 370 635 -1461 2744 2601 -3432
1071 -3432 -1802 1520 -1304 567 4082 -849 -3509 496 -35 -789 3207 1460 -3129 -753 665
1086 665 -1468 1317 2876 -1613 -1983 909 -404 -519 1735 225 -1350 246 145 -565 615 174
1102 174 -780 567 841 -354 -442 -524 -374 803 762 283 179 -1408 -1634 1177 1666 -33 365 -622 -2595
1121 -2595 34 2302 250 268 535 -2668 -1578 2641 985 -785 1238 -874 -2924 1394 2293 -1164
1137 -1164 349 940 -2500 -366 2739 -686 -1210 1655 -762 -1613 2110 515 -2326 605 1069 -1354
1153 -1354 839 1381 -2165 -1026 1615 -117 30 1527 -1196 -2147 860 1074 129 1061 -160 -2064
$$ packed form
1038A22k50Q06Q82k095o85J715r14k08K324j315j704K378p43k619K924J032l207
1055a557K069J833m506J20L832k206k57L793l190l430L869K65k096M205j43o033
1071c432J630L322k824J871L515m931k660M005n31p54L996j747m589K376J418
1086F65k133K785J559m489l70K892j313j15K254j510j575J596j01p10J180m41
1102A74r54J347K74j195q8q2J50J177m1m79j04j587k26K811M89j699L98r87j973
1121b595K629K268k052J8K67l203J090M219j656j770K023k112k050M318Q99l457
1137a164J513N91l440K134L105l425n24K865k417q51L723j595k841K931M64k423
1153a354K193N42l546J139K641j732J47J497k723r51L007K14r45R32j221j904
$$ plain form
1169 -2064 -417 1197 760 832 57 -1569 -906 529 825 941 138 -1127 -796 -101 351 1112 345 -1237
1187 -1237 -417 362 -397 433 1025 -905 -846 906 -36 -381 969 -449 -1208 1163 717 -1077 446 431
1205 431 -1520 316 1781 -644 -731 653 -958 -544 1805 191 -1201 461 -295 -1276 1204 1291 -1137
1222 -1137 -376 404 -942 79 1486 -302 -793 403 -420 -449 1116 308 -789 128 122 -485 389 485 -414
1241 -414 -111 133 -272 188 330 -375 -68 214 -294 50 279 -357 -84 331 -268 1 434 -303 -266 467
1261 467 -114 -342 521 41 -446 368 133 -519 370 389 -497 110 258 -648 28 715 -340 -334 422 -426 -509
1282 -509 795 317 -501 98 -143 -557 539 618 -385 -105 46 -578 207 968 -50 -536 -44 -221 38
1301 38 752 218 -467 -237 -352 -56 854 385 -700 -494 -97 -29 560 563 -414 -663 -250 43 677 700 -487
$$ packed form
1169b064J647J614m37P2p75j626O63J435K96J16q03j265L31O95M52P61p67j582
1187a237Q20P79p59Q30N92j930N9J752r42l45J350j418p59K371m46j794J523j5
1205D31j951J836J465k425q7J384j611M14K349j614j392J662p56r81K480Q7k428
1222a137P61P80j346J021J407j788m91J196q23k9J565q08j097R17oo07Q74R6q99
1241d14L03K44m05M60J42p05L07K82n08L44K29o36K73M15n99K69M33p37L7P33
1261D67n81k28Q63m80m87Q14k35o52Q89J9q86O07J48r06O76O87j055OP56q48q3
1282e09J304m78q18N99k41m14J096P9j003K80J51o24P85P61j018m86M92j77K59
1301C8P14n34o85K30j15K96R10m69j085K06L97O8N89Lr77k49M13K93O34K3j187
$$ plain form
1322 -487 -801 -137 188 529 755 -165 -936 -439 254 621 737 -113 -1023 -516 339 595 682 37 -1031 -784
1342 -784 290 787 689 25 -955 -915 190 865 733 92 -872 -1039 110 1011 803 128 -752 -1099 -53
1361 -53 1055 953 66 -801 -1067 -216 1015 1119 62 -880 -1091 -351 873 1250 255 -1010 -1213 -279 833
1380 833 1223 399 -910 -1237 -320 788 1263 597 -851 -1364 -355 948 1130 458 -659 -1314 -567 857
1398 857 1243 509 -654 -1437 -692 955 1341 359 -627 -1213 -904 616 1631 680 -821 -1333 -744 588
1416 588 1496 827 -640 -1337 -819 486 1483 1026 -536 -1526 -906 654 1406 853 -335 -1303 -1179 377
1434 377 1598 892 -507 -1177 -1118 118 1585 1024 -641 -1150 -920 -118 1475 1421 -613 -1402 -620 -78
1452 -78 1098 1702 -252 -1775 -720 207 740 1552 336 -1836 -1204 474 662 1087 778 -1427 -1745 448
$$ packed form
1322d87l14O64L25L41K26r20p71M97O93L67J16q50r10N07Q55K56Q7o45j068K47
1342g84J074M97r8o64r80M0J105O75j32o41r64j67J149R01k08o75q80l47J046
1361e3J108j02q87q67k66Q51J231J04j057r42k11P40J224L77r95j265k03R34J112
1380H33L90q24j309l27R17J108M75o66j448n13J009J303J82o72j117o55P47J424
1398H57L86p34j163p83P45J647L86r82r86n86L09J520J015r51j501n12N89J332
1416E88R08o69j467o97N18J305R97m57j562r90O20J560P52n53j188r68J24J556
1434C77J221p06j399o70N9J236J467n61j665n09K30Q02J593n4k034p89P82N42
1452g8J176O04j954j523J055R27N33Q12j216k172O32J678J88M25l09k205l18K193
$$ plain form
1470 448 1078 586 593 -735 -1746 -32 1336 601 152 -380 -1380 -378 1429 968 -325 -568 -809 -374
1488 -374 1052 1186 -158 -961 -899 -157 970 1195 32 -1159 -1173 -69 953 1044 341 -804 -1577 -509
1506 -509 1303 1207 145 -371 -1196 -1070 906 1509 104 -284 -590 -1331 257 1814 220 -774 57 -667
1524 -667 -688 1420 824 -1198 -233 308 -697 541 1180 -1049 -991 853 34 -239 1043 -395 -1670 499
1542 499 1087 -256 436 216 -1578 -470 1431 456 -39 358 -984 -1169 855 1101 0 115 -374 -1204
1560 -1204 -17 1038 387 -99 -167 -625 -453 347 555 179 -247 -310 -133 -100 130 438 -19 -286 294 49
1580 49 -559 213 406 -432 233 722 -626 -545 605 -206 -295 1031 -11 -1188 336 398 -832 629 1020
1599 1020 -1059 -495 826 -604 -412 1311 -95 -1014 724 60 -1142 766 993 -917 25 750 -1066
$$ packed form
1470D48O30m92Pj328j011J714J368p35m49n32j000J002J807m61j293k43k41M35
1488c74J426J34j344q03O2P42J127K25j163j191j4J104J022R1p03j145p73J068
1506e09J812r6j062n16q25J26J976O03j405l88l06p41J588J557j594r94Q31p24
1524f67k1K108n96k022R65N41j005J238O39k229N8J844q19k73J282j438j275K169
1542D99N88j343O92k20j794J108J901r75m95L97j342j85K024K46j101J15m89q30
1560a204J187J055o51m86o8m58J72Q00K08l76m26o3J77L3K30L08m57k67N80k45
1580D9o08P72J93q38O65M89j348Q1J150q11q9J326j042j177J524O2j230J461L91
1599A020k079N64J321j430J92J723j406r19J738o64j202J908K27j910R42P25j816
$$ plain form
1616 -1066 -474 1233 38 -417 675 -426 -1115 601 760 -310 316 95 -1161 -267 922 200 -7
1633 -7 159 -637 -578 426 521 122 -46 -332 -387 136 407 241 -122 -427 -62 307 145 136 -20 -642 -153 757
1655 757 174 -264 77 -675 -650 1021 879 -602 -343 -271 -958 558 1591 -238 -818 -127 -797 -138 1839
1674 1839 617 -1239 -381 -177 -548 1195 1359 -923 -1014 47 -345 502 1467 -428 -1381 6 174 34
1692 34 1044 208 -1373 -472 591 267 502 273 -1102 -720 688 633 325 85 -891 -948 463 1074 492
1711 492 -187 -909 -901 324 1063 776 -88 -1069 -1073 233 1075 812 88 -1019 -1209 114 1064 759 227 -750
1731 -750 -1390 -118 1243 762 0 -431 -1165 -481 1241 1015 -167 -529 -873 -603 1054 1270 -236 -775
1749 -775 -680 -612 704 1515 24 -1157 -759 -347 498 1439 408 -1153 -993 -246 429 1304 740 -1059 -1281
$$ packed form
1616a066N92J707j195m55J092j101o89J716J59j070O26k21j256Q94J189p22k07
1633gJ66p96N9J004R5l99j68k86n5N23K71j66l63l05L65L69j62rj56o22M89R10
1655G57n83m38L41p52K5J671j42j481K59P2o87J516J033j829n80O91o70O59J977
1674A839j222j856Q58K04l71J743J64k282r1J061l92Q47R65j895r53J387J68j40
1692C4J010q36j581R01J063l24K35k29j375L82J408n5l08k40r76n7J411O11n82
1711D92o79p22QJ225P39k87q64r81mJ306Q42k63p24j107j90J323R50l05n32r77
1731g50o40J272J361m81p62m31p34O84J722k26j182l62l44K70J657K16j506n39
1749g75R5O8J316Q11j491j181L98M12Q45R41j031j561J60P47O75Q75n64j799k22
$$ plain form
1768 -1281 -164 567 1058 842 -629 -1360 -462 592 998 753 -508 -1305 -513 574 866 626 -318 -1166
1786 -1166 -637 518 914 555 -340 -1060 -569 535 868 525 -273 -1034 -607 518 971 556 -286 -1029 -693
1805 -693 539 1045 471 -293 -932 -802 384 1130 561 -346 -951 -841 242 1162 694 -345 -885 -827 48
1824 48 1081 838 -253 -893 -752 -55 941 912 -113 -764 -710 -81 733 883 3 -779 -622 -64 555 836
1844 836 120 -758 -711 -18 541 662 115 -603 -672 -78 481 594 167 -541 -671 -42 548 570 78 -499 -548
1865 -548 -83 453 611 177 -509 -602 -66 487 528 98 -427 -546 -180 360 542 175 -414 -589 -153 395 452
1886 452 141 -315 -488 -183 315 444 198 -196 -466 -220 326 427 81 -175 -278 -267 131 406 139 -216
1906 -216 -291 -128 27 262 185 -196 -264 -25 32 122 212 -105 -308 -44 156 67 57 18 -202 -106 218 104 -32
$$ packed form
1768a281J117P31M91k16j471p31Q98J054M06k45j261p97P92J087K92k40r44q48
1786a166N29J155L96l59q95p20M91J104L33l43p98p61M27J125M53m15q42p43L36
1805f93J232N06n74p64o39J30J186P46n69r07o05J10J083R20m68j039n40N8Q75
1824D8J033k43j091o40J41O97R96k9j025o51N4O29Q14J50q80p82J57N58O19K81
1844H36p16q78M7O93N59J21n47p18o9N94N59J13m27p08j30O29N90K2m92n77m9
1865e48M65N36J58m34o86r3N36N53M1m30n25j19L66N40J82l67n89j75M36N48N7
1886D52l11m56j73L05M98J29k46l94k70K46N46J01l46k56j03J1L98K75k67l55
1906b16p5J63J55K35p7l81o8K39N7R0R0l17k03K64K00q9j0l9k20R6L24j14j36
$$ plain form
1929 -32 43 -78 -142 156 170 -118 -62 70 -120 -36 186 15 -163 82 17 -149 13 75 -133 9 111 -107 -131
1952 -131 105 13 -61 220 100 -327 -146 213 114 60 133 -116 -339 24 275 102 63 -45 -419 -143 380 162
1974 162 -106 36 -164 -394 224 498 -93 -294 -22 -170 17 504 55 -399 -80 78 -62 386 313 -510
1994 -510 -404 284 201 118 319 -302 -697 65 483 196 150 -93 -727 -284 575 462 -7 -119 -492 -525 376
2015 376 732 137 -292 -350 -422 43 712 409 -382 -404 -141 -43 390 536 -261 -609 -51 244 134 328 -10
2036 -10 -725 -247 585 278 -83 -14 -536 -534 585 772 -139 -284 -330 -675 246 1180 218 -643 -325 -412 -108 1085
2058 1085 754 -627 -659 -272 -245 669 1035 -302 -955 -188 -63 190 883 253 -934 -500 201 163 444 326
2078 326 -580 -588 242 360 165 167 -288 -622 123 707 263 -257 -372 -398 0 626 597 -235 -734 -387 106 511
$$ packed form
1929c2P5j21o4K98J4k88N6J32j90Q4K22j71j78K45o5j66J62O2k08J42J02k18k4
1952a31K36r2p4K81j20m27J81L59r9n4P3k49k23L63K51j73l9j08l74K76N23k18
1974A62k68J42k00k30O18K74n91k01K72j48J87M87m49m54L19J58j40M48p3q23
1994e10J06O88q3q3K01o21l95P62M18k87m6k43o34M43Q59j13m69j12l73l3R01
2015C76L56n95m29n8p2M65O69l03p91k2K63R8M33J46p97l48N58K95j10J94l38
2036a0p15M78Q32l07l61O9n22KJ119J87r11j45m6l45R21R34r62q61L18q7L04J193
2058A085l31j381l2L87K7R14L66j337o53P67J25K53O93o30j187M34P01l8K81j18
2078C26r06qQ30J18j95Km55l34P45N84m44n20j15k6L98O26k9q32m99L47M93M05
$$ plain form
2100 511 705 26 -936 -654 223 466 583 414 -711 -1038 117 639 336 424 -186 -1071 -257 817 385
2119 385 98 123 -738 -630 714 605 -227 17 -228 -721 383 887 -296 -427 63 -369 -5 905 54
2138 54 -780 -131 52 -59 698 423 -835 -548 275 154 437 535 -456 -849 -30 391 440 478 -206 -829 -269
2159 -269 393 449 323 -76 -600 -448 104 509 436 -130 -517 -272 48 289 393 -32 -459 -179 91 102 325
2180 325 76 -549 -130 400 67 68 238 -449 -467 494 351 -140 86 -240 -659 283 664 -146 -125 32 -628
2201 -628 -106 825 122 -405 59 -284 -422 612 478 -385 -116 26 -399 228 617 -225 -314 151 -201 -80
2221 -80 509 24 -418 32 61 -115 263 100 -348 -62 150 -61 134 144 -349 -123 184 41 85 117 -262 -165
2243 -165 166 41 94 170 -233 -282 207 108 -37 210 -82 -318 169 131 -145 149 54 -365 29 277 -179 -64
$$ packed form
2100E11J94o79r62K82Q77K43J17j69j125l27J155N22l03Q8o10q85Q14J074m32
2119C85k87K5q61J08J344j09q32K44k45m93J104N04j183j31M90m32L64R10q51
2138E4q34O49J83j11P57k75j258K87Q23j21K83R8r91l93Q19M21M9L8o84o23N60
2159b69O62N6j26l99n24J52N52M05p3n66l87K45L20K41J04m25m27K80K70J1K23
2180C25k49o25M19N30l33JJ70o87j8R61j43m91K26l26m19R42L81q10K1J57o60
2201f28N22R31p03n27M64l43j38J034j34q63K69J42m25O27L89q42q9M65l52J21
2221h0N89m85m42M50K9j76L78j63m48K86K12k11J95J0m93K26L07j43M4L2l79R7
2243a65L31j25N3P6m03m9M89r9j45K47k92k36M87l8k76K94r5m19L94K48m56J15
$$ plain form
2265 -64 213 -237 -128 310 -92 -205 265 -40 -280 279 116 -343 123 216 -208 57 240 -254 -111 289 -100
2286 -100 -82 250 -171 -291 258 47 -188 116 -16 -272 103 189 -154 15 96 -208 47 298 -92 -98 108 -158
2308 -158 -29 265 3 -161 78 -24 -83 232 63 -234 11 24 -111 183 142 -273 -122 143 -64 84 206
2329 206 -188 -238 104 51 59 209 -135 -331 119 135 -22 172 22 -347 -16 243 48 70 46 -327 -123 274
2351 274 78 -24 72 -211 -265 190 254 -32 -40 -138 -206 170 247 -20 -38 -99 -223 42 346 51 -113 -62 -124 11
2375 11 289 103 -165 -89 -76 -45 218 167 -187 -207 -12 18 156 133 -142 -208 -77 69 199 146 -154 -259 -42
2398 -42 95 177 185 -107 -263 -52 118 189 190 -83 -300 -144 73 154 200 -8 -320 -216 118 172 138 12 -226 -240
2422 -240 39 159 74 50 -147 -230 51 266 85 -61 -62 -163 -62 231 160 -61 -140 -102 -45 178 210 -92 -205
$$ packed form
2265f4K77m50J09M38m02j13M70l05k40N59j63m59M66R3m24K65J83m94J43M00l89
2286a00J8L32m21j20N49k11k35L04j32k56L75Q6l43J69Q1l04K55K51l90oK06k66
2308a58J29K94k62j64K39j02n9L15j69k97K45J3j35K94m1m15J51K65k07J48J22
2329B06l94n0L42n3QJ50l44j96M50J6j57J94j50l69L31K59j95K2k4l73K04L97
2351B74j96j02R6k83n4M55O4k86qr8o8L76P7k67j8o1j24K65L04k95j64N1o2J35
2375A1K78j86k68P6J3L1K63n1l54k0J95L0J38k3k75o6J31J46J30n3l00j05K17
2398d2J37Q2Qk92j56K11J70P1Jk73k17J56K17Q1M6k08l12J04L34N4l4j26k38j4
2422b40K79J20q5k4j97q3K81K15j81j46jj01J01K93p1k21p9L8N7K23L2l02j13
$$ plain form
2445 -205 -58 -27 49 211 31 -274 -155 75 64 80 70 -205 -213 71 145 49 73 -78 -244 18 229 23 -47 26
2469 26 -140 -72 211 150 -116 -30 -64 -98 162 224 -116 -197 -15 -51 56 220 -20 -240 -111 14 53 135 85 -183
2493 -183 -181 31 91 76 111 -7 -168 -87 104 111 5 -13 -63 -151 7 130 25 -80 32 -18 -121 123 42 -144
2517 -144 17 112 -109 -15 172 -161 -160 210 93 -171 136 34 -309 53 280 -83 -39 114 -213 -122 312 43
2539 43 -157 176 -53 -373 123 247 -180 -17 145 -223 -139 230 -29 -78 186 -36 -266 117 125 -189 80 168
2561 168 -130 -66 124 -69 -44 170 63 -109 -21 -14 -105 63 119 7 -70 -63 -34 -39 44 138 -2 -159 -45 21 -86
2586 -86 80 189 -135 -156 70 -78 -94 217 78 -210 62 96 -228 30 282 -149 -114 182 -157 -229 236 70
2608 70 -214 169 41 -367 50 246 -175 33 278 -262 -253 237 -6 -100 267 50 -354 25 147 -142 106
$$ packed form
2445b05J47L1P6J62j80l05J19K30j1J6j0k75qK84P4r6K4j51j66K62K11k06p0P3
2469B6j66O8K83o1k66Q6l4l4K60O2l40q1J82l6J07J64k40k20J29J25L9Q2n0k68
2493a83KK12O0j5L5j18j61Q1J91Pj06j8n0q8J58J23j05j05J12n0j03K44q1j86
2517a44J61R5k21R4J87l33JL70j17k64L07j02l43L62K27l63M4J53l27R1M34k69
2539D3k00L33k29l20M96J24m27J63J62l68Q4L69k59m9K64k22k30L83Ql14K69Q8
2561A68k98O4J90j93K5K14j07j72Q8Pr1J68N6j12p7PK9nQ3R4j40j57J14O6j07
2586h6J66J09l24k1K26j48j6L11j39k88K72L4l24K58K52m31L5K96l39p2M65j66
2608G0k84L83j28m08M17J96m21K08K45n40RM90k43r4L67k17m04L79J22k89K48
$$ plain form
2629 106 210 -269 -161 189 -34 -65 234 1 -245 9 93 -91 27 98 -96 -46 48 -64 -41 51 15 -4 8
2652 8 43 -55 -74 19 123 27 -53 36 -95 -132 121 159 -33 14 3 -239 -25 246 -14 -84 98 -168 -220 209 178
2677 178 -112 35 -7 -313 21 298 -75 -101 135 -152 -180 267 107 -158 107 13 -247 94 218 -161 -62 143
2699 143 -127 -101 214 -60 -213 104 50 -84 129 80 -240 -39 112 2 2 102 -96 -160 107 104 54 4 -69 -136
2723 -136 -23 105 88 40 -67 -118 -66 49 133 67 -103 -163 -1 1 71 107 -70 -149 -25 47 41 96 3 -168 -43 151
2749 151 10 11 86 -134 -129 142 112 -43 11 -67 -175 102 218 -6 -45 -14 -179 -43 231 95 -131 -39 -111 -110 173
2774 173 191 -89 -79 -22 -58 78 185 13 -132 -44 -56 40 169 57 -141 -72 8 28 98 50 -93 -112 -7 25 67
2799 67 48 -95 -107 -11 59 71 18 -91 -108 -18 79 109 62 -83 -125 -15 88 89 78 -63 -164 -29 54 101 88 -53
$$ packed form
2629A06J04m79J08L50k23l1K99k33k46K54Q4j84J18P1j94N0R4j12K3R2l6j9J2
2652HL5r8j9R3J04r6q0Q9j31l7K53L8j92M7j1k42K14K71k60p0J82k66n2M29l1
2677A78k90J47m2l06L34K77l73k6K36k87k8M47j60k65K65r4k60L41J24l79R9K05
2699A43k70K6L15k74j53L17n4j34K13m9l20K01J51j10%J00j98o4K67ln0n0p3o7
2723a36J13J28j7m8j07n1N2J15Q4o6j70o0J62KP0L6j77p9J24P2oN5r3j71J25J94
2749A51j41JP5k20NK71l0j55N4p8j08K77J16k24l9L1j65J36K74j36k26R2p2JK83
2774A73J8k80J0N7l6J36J07j72j45Q8j2R6J29j12j98O9Q0K0P0m8j43j9J05L2M2
2799F7j9j43j2R6P0J2n3j09j7R0R7L0m7j45m2J10J03Jj1j41j01J35Q3M7j3j41
$$ plain form
2825 -53 -216 -90 85 102 61 -13 -136 -149 57 146 53 -13 -115 -135 29 154 44 -48 -45 -97 -2 145 90 -32 -72
2850 -72 -93 8 111 115 -2 -73 -88 -59 112 142 -27 -107 -60 -9 85 78 23 -112 -96 -19 63 100 19 -107 -83 36 72
2877 72 94 42 -91 -138 -5 102 86 20 -42 -101 -20 79 89 38 -47 -119 -35 61 54 20 -53 -84 -62 76 89 52 -34 -116 -20
2906 -20 63 78 17 -25 -78 -53 39 103 52 -16 -93 -57 65 90 21 -41 -34 -71 -32 111 24 -40 -38 -44 19 85 55 -80 -26 8
2936 8 -27 70 103 -11 -81 -4 9 29 81 11 -89 -32 10 19 63 57 -63 -71 18 6 -27 40 21 -73 -29 -9 4 7 33 -34 -44
2967 -44 11 17 -24 63 37 -41 5 43 32 -5 65 -6 -79 -23 54 0 22 39 -46 -64 30 3 -35 31 -43 -80 19 90 -35 -47
2997 -47 25 -42 -19 137 36 -112 -56 -30 3 73 133 -80 -119 -20 -19 51 132 -1 -163 -124 42 67 106 79 -123 -131 -1
3024 -1 108 84 80 -10 -176 -47 121 89 -10 2 -84 -95 82 177 -2 -74 -42 -88 41 215 -7 -200 -29 17 -7 139
$$ packed form
2825e3j63J26J75J7m1p4j23j3K06Q9r3o6j02k0J64J25j10r2Ln2R5J47n5j22m0
2850g2k1J01J03Mj17p1j5K9J71L0j69q0M7N1R4pn5j35J6P7Q2L7q1j26K4J19L6
2877G2K2n2j33m7J33J07j6o6o2n9Q1R9J0n1q5p2Q4R6pl4p3l1K2J38J3l7q6q2R6
2906b0Q3J5o1m2n3K5R2O4n1o8p7L6J22K5o9o2Pl7L9J43q7o4KoO3O6l0j35N4L4
2936Hl5R7L3j14p0P7J3K0N2p0j00N7M2RM4oj20qQ9j2l3O7j9r4M4K0J3LK6o7j0
2967d4N5Om1Q7k6p8M6L8j1l7P0p1p3N6P7n4K2J7q5j8R4k7l8O6p4l7R9P1j25j2
2997d7P2o7K3J56j01j48N6K6L3P0O0k13l9R9JP0Q1j33j62L9J66K5L9k7k02qJ30
3024aJ09k4mr0j66J29J68l2r9J2q6j1J77R5j79p2L2m6J29J74k22j93J71M6k4J46
$$ plain form
3050 139 89 -235 -187 48 54 84 149 -130 -295 6 147 100 131 -27 -328 -92 254 181 42 39 -201 -246 146 246
3074 246 72 -22 -127 -249 8 237 109 -116 -116 -125 -41 228 160 -122 -184 -54 5 94 155 -32 -216 -104 143 159
3098 159 115 -41 -194 -170 106 231 80 -40 -173 -271 32 344 143 -136 -141 -199 -109 263 307 -83 -211 -112 -106 136
3122 136 367 -9 -291 -104 -43 14 288 152 -293 -190 56 20 152 195 -190 -270 62 158 43 125 -45 -318
3144 -318 -12 242 53 9 -37 -262 -106 242 192 -68 -110 -187 -146 181 297 6 -164 -192 -100 153 297 117 -163
3167 -163 -234 -117 103 190 96 -95 -258 -141 88 188 110 6 -205 -202 107 206 38 -65 -98 -194 17 266 48
3190 48 -137 -47 -77 -16 247 139 -169 -129 -14 -51 157 272 -183 -262 -12 25 65 205 -21 -307 -110 72 51
3213 51 166 59 -281 -163 119 107 71 113 -109 -190 46 145 62 37 -82 -172 18 166 55 17 -41 -144 -42 132
$$ packed form
3050A39n0l24M8K35OL0O5k79j65L01J41m7L1j58l01K36L46p3j39lk40m5L92J00
3074B46j74r4j05j22K57K29j28k25%rQ4K69o8k82o2J30N9Q9O1j87j84J12K47J6
3098A59m4j56j53K4K76J25j51j20j33r8L03L12k01k79nn8R0L72M4l90j28R9OK42
3122A36K31l76k82J87O1N7K74j36m45J03K46l6J32M3l85q0L32R6j15Q2j70k73
3144c18L06K54j89m4m6k25J56L48n0k60m2p7M1L27J16k91j70k8R2K53J44j80k80
3167a63p1J17K20Q7r4j91j63J17K29J00p8j04k11LL09R9j68j03l3r6K11K49k18
3190D8j85R0l0O1K63j08l08M0J15l7K08J15m55p9K50L7M0J40k26k86J97J82k1
3213E1J15j07l40J18K82j2l6M2k22q1K36R9q3k5j19r0J90J48j11l8n8j03J02J74
$$ plain form
3237 132 100 -21 -89 -105 -16 57 77 -4 -80 -119 -19 109 64 -5 -75 -137 -72 113 95 -16 -17 -88 -96 110 146 -37 -38 -30
3265 -30 -82 29 139 -10 -82 -1 -37 -25 141 14 -98 3 10 -56 77 82 -73 -53 76 -30 7 87 -23 -78 57
3290 57 10 -32 66 22 -90 23 87 -31 10 15 -62 -18 28 -36 -29 16 -58 -19 72 -23 -78 10 -9 -26 11 -3 -36 34 19 -13
3320 -13 17 14 -83 24 57 -21 1 5 -72 -8 71 11 -20 -17 -33 -24 62 44 -98 -31 -56 -58 53 72 -45 -71 -8 -26 52 122 -32
3351 -32 -88 -51 -41 44 139 5 -121 -37 21 47 131 46 -108 -71 2 26 62 72 -96 -137 -8 63 103 36 -53 -119 -11
3378 -11 78 88 47 -70 -110 -40 100 62 41 -64 -118 -62 87 116 33 -80 -135 -52 127 113 18 -75 -149 -63 89 147 50
3405 50 -102 -184 -57 130 175 66 -73 -137 -113 66 202 84 -81 -157 -97 69 166 96 -90 -169 -86 41 171 119
3429 119 -73 -179 -92 25 141 150 -65 -193 -102 86 146 135 -29 -192 -122 65 138 113 -25 -176 -136 48 163
$$ packed form
3237A32l2j21o8j6Q9P3K0q1p6l9J00J28m5o9p0o2O5J85j8j11jp1qK06L6j83jQ
3265c0n2J11J10j49p2Q1l6J2J66j27j12J01Po6J33Nj55K0J29j06L7Q0j10n5J35
3290E7m7m2R8m4j12J13O4j18M1Np7M4M6o4PM5p4L9R1r5n5Q8j9j7L7j4l3P0j5l2
3320a3L0lr7J07L3p8K2Mp7O4P9o0l1Lj6RQ6j8j42O7k5kJ11J9j17k6O3j8P8P0j54
3351c2n6L7J0Q5R5j34j26Q4N8K6Q4q5j54L7P3K4L6J0j68m1J29P1M0o7q9o6J08
3378a1Q9J0m1j17m0P0J40l8k1j05n4N6J49K9q3j13n5Q3J79j4r5r3p4Q6J52N8r7
3405E0j52q2J27J87M5j09j39o4K4J79J36j18j65p6O0J66R7p0j86p9Q3J27J30n2
3429A19j92j06Q7J17J16Rk15j28R1J88O0j1j64j63P0J87P3k5j38j51M0J84J15
$$ plain form
3452 163 100 -21 -156 -166 30 200 141 -16 -159 -166 -14 155 124 -54 -165 -148 -23 140 171 12 -152 -115 10
3475 10 129 157 26 -154 -139 8 116 129 26 -145 -194 16 149 90 18 -113 -189 -58 149 135 -23 -126 -163
3498 -163 -62 128 200 -13 -165 -99 -67 67 188 68 -124 -175 -11 65 129 73 -87 -148 -33 88 87 74 -45 -166
3522 -166 -64 118 88 21 -48 -126 -83 112 143 1 -31 -136 -77 91 162 -8 -63 -64 -65 10 169 103 -111 -100 -47 8
3548 8 102 105 -64 -181 -57 56 69 67 -16 -153 -94 59 48 46 53 -97 -104 61 100 5 -14 -34 -82 8 111 50 -60 -55 -34
3577 -34 -4 80 64 -78 -92 13 18 44 78 -31 -112 -30 63 44 52 13 -88 -63 41 98 -8 26 -45 -117 31 87 33 -9
3605 -9 7 -82 -44 63 28 -53 49 -2 -75 31 43 -28 -56 46 10 -40 51 -5 -74 26 38 -10 25 6 -52 -50 79 22
3633 22 -21 -3 -42 -55 45 59 -16 -28 -5 -24 -14 31 12 -32 11 8 -33 12 43 7 -25 46 -10 -47 -15 30 -33 15 40 -27
$$ packed form
3452A63o3j21j35j0J96J70n9j57j43pJ52J69l1j78j11J7J25J63L1j59j64L7J25
3475A0J19K8j31j80J5J47J08J3j03j71m9K10J33n9p2j31p6J31K07j4j58j03l7
3498a63J01J90P2k13j52O6L2J34J21j20j92n1J64P6O4n6j60o1J15J21jj3j19j21
3522a66J02J82l0o7o9p8M3J95L1j42l2j05N9J68P1j70n5jjP5J59o6k14J1N3N5
3548HR4Lj69j17J24J13J3kq3j37N9J53j1kPj50pJ65L9r5j9k0m8R0J03o1j10NK1
3577c4L0Q4j6j42j4J05NK6L4j09q1Q2R3j9Ql9j01K5J04N7j06L4p1p2J48N6n4m2
3605iJ6q9L8J07l5q1J02n1p3J06J2p1k8J02l6n0R1n6o9J00J2m8L5j9n8KJ29n7
3633B2m3J8l9j3J00J4p5j2K3j9J0M5j9m4M3lm1M5L1l6l2P1n6l7L2M5o3M8K5o7
$$ plain form
3663 -27 -62 18 11 -9 60 -3 -55 -28 38 -20 49 45 -80 -72 17 26 -17 31 -2 -97 -12 65 -22 -9 -4 -60 -48 70 45 -70 -13
3694 -13 30 -57 18 80 -5 -71 -32 -7 30 38 -23 -76 -67 28 51 40 -36 -86 -104 9 52 39 -5 -61 -59 -26 71 24 4 -42 -59
3725 -59 -26 60 64 -16 -46 -66 -34 44 54 -8 -49 -48 -14 38 86 53 -92 -27 -19 18 83 37 -45 -110 -17 49 47 13 -48 -96 -25 69
3757 69 67 3 -40 -85 -57 90 110 44 -81 -86 -55 67 105 24 -57 -63 -47 40 73 49 -27 -94 -59 48 93 38 -38 -97 -25 40
3787 40 98 56 -34 -96 -59 16 75 60 -39 -86 -77 16 107 27 -42 -84 -51 30 88 55 -63 -104 -56 12 86 68 -50 -107 -45 20
3817 20 66 60 -3 -96 -54 30 75 57 -18 -65 -63 15 52 27 4 -94 -61 17 76 27 -31 -46 -57 18 81 60 -28 -91 -52 -2 64
3848 64 50 -25 -83 -86 -14 83 33 -5 -62 -61 17 42 68 2 -80 -78 -18 80 48 -10 -66 -70 -14 64 69 2 -49 -52 -11 35 54 -13 -76
3881 -76 -60 -24 28 29 17 -40 -22 6 43 24 -12 -59 -48 5 13 20 20 -73 -66 2 42 28 3 -26 -52 8 8 44 8 -26 -58 -33 51
$$ packed form
3663b7l5Q0pk0O9o3n2K7O6n8O9mj25QQ9Rm3M8l3r5Q5P7q7J3Nn6J2J18k5j15N7
3694a3M3q7P5O2q5o6L9K5L7Qo1n3RR5K3j1p6n0j8J13M3j3m4n6KL3R7m7k0m6j7
3725e9L3Q6Mq0l0k0L2P8J0o2m1JL4N2M8l3j45O5QL7O5m6q2o5R3O6kl4o1m8P1R4
3757F9ko4m3m5K8J47K0o6j25nL1J22L8q1q1oJ6Q7L3k4p6o7L5J07M5n5p6n9P2O5
3787D0N8m2r0o2L7P5N9j5r9m7RR3R1q0o9m2L3Q1N8l3j18m1M8O8P4j8j18n7O2O5
3817B0M6oo3r3M2Q4M5j8p5m7KP8L7k5k3r8L3P8N9m9n8j5j1P5O3k1q8o3L9N0O6
3848F4j4p5n8lP2R7n0l8n7JP8K5K6o6q2KO0R8l2n8n6mN6P8No7n1lM1M6J9o7o3
3881g6J6L6N2Jj2n7J8K8L7j9l6m7J1N3QP%r3PO8M0j4k5k9k6O0%L6l6l4l2K5Q4
$$ plain form
3914 51 33 21 -15 -22 -9 20 10 7 -21 -59 -41 -7 14 25 -33 -35 -12 7 2 2 -6 -45 -27 -5 21 2 -26 -27 -51 17 24 -4 -13 -13 -6 11
3950 11 4 -11 -23 22 -29 -13 58 12 -17 -39 7 7 -1 32 -15 7 -16 -1 11 -4 -43 -33 21 -1 -21 -32 13 -23 -33 2 23 -10
3982 -10 -9 -9 -7 -6 13 2 -24 18 -25 0 11 -3 -11 15 33 22 1 13 -19 -22 13 15 -30 -12 -12 -9 20 34 7 -25 5 3 7 33 5 -39
4018 -39 -33 16 -7 16 15 -34 -46 8 37 -4 11 -6 -26 -15 48 22 1 10 -37 -36 29 25 -32 -23 24 -29 18 37 -39 -45 -35 24 2 16
4052 16 -13 -51 -40 12 3 -6 30 -27 -63 -4 16 11 28 3 -51 -8 52 16 4 -7 -23 -13 26 31 -24 -16 -1 7 18 45 14 -9 -22
4085 -22 6 -16 41 42 -54 -49 34 23 -16 24 -26 -60 -2 24 -4 -27 3 -57 -12 35 32 -11 -20 -45 -49 30 62 5 -50 -12 -16 -19 47 39
4119 39 -13 -31 0 -40 18 24 -13 -24 16 8 -12 18 18 -68 -12 16 4 -11 -12 -14 -40 50 -1 -54 -11 -25 -45 7 42 -8 -36 4 -29
4152 -29 -7 24 19 -40 18 20 6 24 38 -5 -48 -1 -9 4 14 11 -48 -41 10 -4 13 3 -1 -2 29 7 -7 -10 -13 -26 -20 19 8 -18 -21 -13
$$ packed form
3914E1j8j2l6pJ3K9j0lk8l8J8L4K1J1n8kK3J9n%ql9J8K2K6j9k8jk4O8Pk8r%PJ7
3950A1pj5j2M5n1J6P1m6k9k2M6%qL3m7K2k3J5J2j5l9J0N4k2k0j1M5l6j0L5K1l3
3982a0J%KJJ9j1k6M2m3K5J1j4qK6J8j1k1J2l2lL5Km5J8%LK9J4k7l2L0kMK6k8m4
4018c9OM9k3K3jm9j2N4K9m1J5j7k0J1O3k6k1Rm7JO5mn7RM7n3M7J9p6oJ0N9k2J4
4052A6k9l8J1N2rrL6n7l6N9K0nJ7k5n4M3O0l6j2j1j6J0L9Nn5QJ5QJ1K7l1k3j3
4085b2K8k2N7Jr6NQ3j1l9M0n0l4N8K6k8k3L0o0M5M7lm3rk5mP9L2n7n5L8mlO6q
4119C9n2j8L1m0N8Ol7j1M0qk0L0%q6N6K8j2j5jkk6R0n1n3M3j4k0N2L5n0k8M0l3
4152b9K2L1nn9N8Kj4J8J4m3m3M7qJ3J0ln9PN1j4J7j0mjL1k2j4llj3OL9j1k6lQ
$$ plain form
4188 -13 -12 10 7 -32 -54 -25 -18 20 21 -1 -30 -12 -20 -9 38 20 -35 -38 19 20 -18 38 18 -11 12 25 -20 19 18 -42 -7 -15 -5 -42 20
4223 20 -19 -33 -39 37 -61 106 -40 2 -64 -30 -88 14 -32 60 40 21 54 -67 3 141 65 68 104 -32 115 -7 28
4250 28 -57 18 -1 44 11 46 -81 -77 -35 39 -23 -20 -52 2 6 9 48 -71 -17 -33 -63 -12 -8 1 15 -11 -18 -25 56 1 -4 9 3 25
4284 25 0 -14 -27 3 -9 8 13 31 -12 12 17 11 20 -3 -13 -7 5 10 43 15 -26 1 6 17 -1 4 -18 -8 -32 6 6 -27 5 -14 -19
4319 -19 4 -10 7 13 -8 20 17 1 12 2 -6 9 9 28 -5 -13 -5 2 26 23 10 -12 -18 -6 -10 28 25 -14 15 -9 -32 13 12 31 -12 -5 -13
4356 -13 -16 -14 3 -7 -31 -24 35 32 22 -4 -10 0 1 2 16 -2 -24 -7 16 16 14 -31 8 0 -5 8 -18 -22 3 -27 -4 0 -36 -11 -14 -9 -3 18
4394 18 26 -8 -7 -20 -15 10 -8 0 -13 -19 -13 17 32 20 -30 9 6 17 9 3 2 -5 -17 -4 4 -24 0 -18 -7 10 19 -2 -5 -24 -3 -5 24 18
4432 18 1 12 -10 -20 21 32 -15 -19 0 8 14 19 15 -32 -32 -20 -9 12 -12 -14 -23 -12 21 0 7 -8 0 -9 15 53 24 -18 -28 -23 6 6 14
$$ packed form
4188a3JK2ll9k2K9PL8Jk2k9J8qJ1M7j8n5lN7Jl8N6k0k9K3J3m5L9jo0L5qJ0l7O2
4223B0l9j4oP6r8J67j46M2o6L4n8J02m6R2k0j9L3j21P0J38p6LL6j36J47j22L5
4250B8q5P5j9M5l3L5j27MM2P4o2Ll2N4MLL9j19N4j6l0N1MRJ4k6ppQ1n5nJ3oK2
4284B5k5j4j3L0j2J7NJ8m3K4NoRk3j0OJ2NL3k8m1K7NJ1j8Nk2J0k4L8%l3L2j9n
4319a9K3j4J7Ok1K8lj6J1j0qJ5%J9l3qQPK4lj3k2oJ2mL8ll9K9k4k3M5jJ9m3Pq
4356a3lKJ7j0k4PN9lj0k6oJ0JJJ4j8k2J7K3%km5L9qnJ3k6mK5l0K3Ml6K5lNOK1
4394A8Ql4Jj3NK5j8Qj3oOL0J5j2n0L9lJ1qojpj2J3Qk8K4j8J1J7Rk1lj9K1kK9o
4432A8j7J1k2j0M1J1m7mJ9QONmm7%J2J1K1k4krJ1L3k1Pj5QrK4L8k9m2j0NK9%Q
$$ plain form
4469 14 -9 -17 -23 27 6 13 -4 -43 -17 7 32 -26 -43 -22 -39 -15 9 6 -22 -1 14 1 49 0 -31 -16 -2 12 37 -2 -35 -31 1
4502 1 25 36 3 13 -24 -22 11 -1 8 -3 -37 -8 27 19 12 -7 -4 -28 5 29 16 -9 10 -22 -6 11 21 -17 -48 -18 -37 11 22
4535 22 3 -20 -37 6 38 22 -10 8 -59 1 17 26 8 -38 -8 -14 30 17 -29 -19 -35 -31 17 12 -1 -11 -21 -31 -10 22 -1 -14
4567 -14 -22 -4 -16 5 0 -22 -40 -6 -1 14 -2 -3 -15 -1 22 -10 15 9 -19 -7 24 11 -2 9 -11 -48 14 41 -9 -18 -7 -26 0
4600 0 26 -13 -22 -29 -19 -37 19 33 -13 -40 -5 -20 -10 35 21 -27 1 2 -9 -1 -1 -13 -5 14 -1 -11 36 -15 -6 10 24 -11 -17 8 11
4635 11 -3 5 12 -35 -1 -10 -40 -14 9 -18 -29 7 -14 -26 18 9 -16 -19 15 5 0 33 22 -24 6 8 0 14 5 -30 -15 8 8 -25 27
4670 27 8 -4 -3 -9 8 24 -1 -4 -15 25 -41 0 28 -6 -38 11 6 -18 3 25 -25 -34 15 -37 5 -17 -18 -36 6 8 -4 -16 -19 -19 -20
4705 -20 6 3 3 -8 -12 1 16 20 3 -35 -11 -3 1 28 20 -14 -23 -6 11 23 3 4 -37 7 21 17 -22 -18 -11 -39 22 14 5 -3 -33 -39 0 2 -23
$$ packed form
4469A4k3qoN0k1Pj7l9K6K4K5n8j7K1j7K4K4lk8K1J5j3M8m9l1J5J4J4K5l9l3ML2
4502AK4J1l3J0l7KL3j2Rj1l4K9L5qpj9Lk4L3K4j3k5J9l2J6J7J0l8l1L0j9M8J1
4535B2j9k3j7M3L2j6l2J8o7O0J6Rj8m6L0oM4j3m6J0j6MM8nj3j0j0j0K1L2k3j3
4567a4qJ8j2K1nk2j8L4NJ5j6jj2J4K3l2K5ok8J2L1j3j3J1k0l7O2K7n0rJ1j9K6
4600@K6l9rpJ0j8N6J4m6k7L5j5J0M5j4m8K8Jj1Q%j2QJ9j5j0M7n1RJ6J4l5oK5L
4635A1j4QPm7L4rl0K6K3k7j1L6k1j2M4rk5lL4j0nL3j1m6L0KqJ4rl5J5K3%l3N2
4670B7j9j2JoJ7J6k5lj1M0o6M1K8l4l2M9nk4K1K2n0rM9n2M2k2jj8M2Kj2j2l%j
4705b0K6l%j1mJ3J5Mj7l8K4QMK7ql4rJ7J7J2k0Jm1M4J4ml9MPk8O1qrql0oL9Kk5
$$ plain form
4744 -23 -18 12 -21 15 0 5 -22 -29 -5 8 32 23 -26 -17 -9 19 48 11 -12 -39 -38 -7 40 7 10 -68 -33 14 41 -3 14 -2 -9 -132
4778 -132 107 -29 48 39 20 -28 -7 -16 -96 -83 -87 37 219 70 19 0 29 -76 67 17 -107 -47 -125 69 -36 32
4804 32 18 25 -113 -119 -22 -6 141 -62 -52 83 68 139 -84 -58 -92 7 -3 83 108 -65 -27 -29 101 40 -74 -72 -28 30
4832 30 -8 -31 7 -73 -67 -24 25 82 21 2 -47 32 30 -2 -20 10 -45 -69 5 59 44 -51 -22 -39 15 16 19 -39 -76 -31 13 43
4864 43 13 -13 -50 -21 24 41 53 18 -19 -31 34 49 30 17 -44 -27 5 41 29 -3 -30 -5 12 17 7 -8 -27 -51 6 8 25
4895 25 1 -47 -35 -3 31 -15 20 -32 -47 4 18 9 -18 -13 -18 -2 -5 22 -4 -6 -36 10 9 39 -3 -21 -23 -10 35 36 -29 0 -25 1
4929 1 28 22 13 -18 -39 -7 -4 6 5 -27 -17 -11 6 8 2 -30 -22 -8 47 31 15 -24 -25 -8 7 8 2 -4 -31 -3 -14 -2 -11 -31 -22 -10 -3 7
4967 7 -5 -5 -11 -20 9 14 -26 -8 1 -28 4 1 -23 -16 -28 19 2 -9 -1 7 -28 1 -24 10 8 2 -20 -3 5 18 4 9 -2 -1 14 6 26 22 11
$$ packed form
4744b3NL0l3L6j5Nk7pK4J3K4rm9RQK8K9l7k3k7JL1M7l3Lp8L5M7K7m4J7j6pj23
4778a32K39j36P7rj9m8K1rq0J3mJ24J82j49n1j9K9j05J43n0j24O0p8J94j05O8
4804C2j4Pj38oR7J6J47k03J0J35j5P1k23K6l4R9j0Q6K5j73L8kJ30o1j14KM4N8
4832C0l8k3L8q0OM3M9N7o1j9m9P9kl2j8L0n5k4P4N4j5r5K9j7N4JLn8l7M5M4L0
4864D3l0k6l7K9M5J7J2l5l7j2O5J5j9j3o1J7L2L6j2l2k7K5J7Nj0j5j9k4N7KJ7
4895B5k4m8J2L2L4m6L5n2j5N1J4rk7NnJ6lK7k6kl0M6jL0m2j8kJ3M5Jo5K9k5K6
4929AK7orl1k1L2LJ0jl2J0OJ7Kol2QJ4N5j6j6l9jJ7J5Jook7K8j1J2rk0RJ2PJ0
4967Gj2%orK9Nm0J8Rk9L2lk4Pj2M7j7j1QQl5K9k5L4kok2J7QJ3j4Nj1JJ5qK0mj1
$$ plain form
5006 11 13 4 17 8 13 -12 0 -23 6 -17 -3 5 -20 -8 3 6 -1 -9 19 22 -12 -13 15 4 -14 -18 12 -15 -12 12 5 7 9 -21 -4 16 2 33
5044 33 10 -16 12 50 -4 4 7 -2 5 18 38 6 -8 -19 8 3 15 14 -27 9 -27 -6 13 16 -22 -6 1 25 21 23 -24 -61 -1 -3 -1 -11
5080 -11 -4 -11 -6 4 14 -18 29 -3 -3 17 32 5 -20 -17 3 23 17 32 -54 -23 -12 12 51 12 -20 -32 -21 18 -13 20 -9 -34 -27 16
5114 16 11 18 -8 -27 -30 2 6 6 12 -10 -18 7 21 26 17 -8 -43 -1 30 19 -20 -14 -32 -13 19 -7 -18 -29 -16 0 24 1 3 -17 -47 18
5150 18 6 -22 -25 -34 -34 -14 36 17 1 -22 -32 -1 43 8 -4 -16 -40 0 51 10 7 -30 -47 3 33 32 -11 -24 -28 -24 20 31 -5 -10
5184 -10 -30 -11 0 8 15 -17 -37 -18 4 12 -15 -38 -45 -8 6 6 -12 -37 -10 -3 1 12 32 -37 -25 1 3 26 11 8 -21 -10 -7 24 27 -24
5220 -24 -39 -13 -8 23 42 10 -20 -22 5 2 -2 -25 -43 -40 -4 21 -31 -34 -24 -25 1 6 -8 0 -5 -24 3 -4 20 -20 -26 3 2 31 13 -21 -39
5257 -39 -3 4 9 31 10 -20 -28 33 6 -6 -16 -7 3 23 14 2 -1 -21 -16 -16 2 7 0 -11 -3 -16 9 7 -15 -30 -20 -1 -3 -17 -3 1 1 22
$$ packed form
5006A1KrJ3rNk5J2k3K9k3J4Qk5J2J1LpqK8Ll4jK8j1j8mL0k7LK4pKKl0J7K0j4L1
5044C3k3k6K8L8n4QLrPJ3K0l2j4j1K7nJ2jm1L6l6K1J9Ll8J6PK4mKm7l7O0kKj0
5080a1PpNJ0J0l2M7l2%K0J5k7k5LK0K0oJ5q6L1J1K4L9l9l2j2J1L9l1L3k9k5PM3
5114A6nPk6j9lL2M%Ok2qK5J4Nrk5l5M2L1j1l9Oj8J9L2k6j1j1J3J6K4k3Kk0l0O5
5150A8j2k8lr%K0N0j9j6k3j0L1M4l5j2j2k4M0N1m1ll7j7N0L0jm3j3mMM4J1l6n
5184a0k0J9J1QPl2k0J9K2Qk7k3pL7J4%j8k5K7PMJ1K0o9J2K6KK3j5lk9J1LL1Ln1
5220b4j5K6NL1J9l2l0kK7lmk3j8LL6K5n2lJ0jK6Nj4Qnj9K7pK4m0oK9jK9j8l4j8
5257c9L6PNK2k1l0qO1k7j2j0RJ0K0rj2lk0N%J8Npj1Qj3K5kk2j5J0J9kj4J4M%K1
$$ plain form
5295 22 9 -8 6 3 -9 19 20 30 19 5 -2 -13 -19 -17 1 -19 -11 11 17 -7 -22 -1 -12 1 -5 -14 -11 -5 -22 -1 -14 1 -17 -13 15 13 8
5332 8 3 33 -3 -15 2 -5 -16 16 2 -13 13 8 -8 -4 -27 23 30 9 -15 -33 -6 -26 -19 -20 14 1 -4 -18 10 0 0 -31 12 15 -3 -6
5368 -6 -2 -23 -17 10 -35 11 -17 -15 8 16 13 0 36 -22 2 1 9 -10 3 4 -34 -12 -21 16 2 -18 -30 -3 -3 -10 -1 -18 -6 10 3 6 8 -3
5406 -3 -26 7 -12 -10 0 -20 -8 17 -16 -1 2 -12 8 33 -6 30 -19 -24 10 -13 26 -14 -6 -14 9 -4 7 -17 -8 -21 -27 9 8 11 -20
5441 -20 5 -14 -9 8 1 6 -22 2 -1 1 -5 11 -35 1 20 23 -28 24 -7 19 25 9 11 18 3 -10 23 12 46 -3 1 5 24 -7 19 21 -18
5478 -18 10 8 13 11 11 -26 -25 -1 8 25 -24 -20 -6 -5 15 8 16 -3 -5 30 15 -2 -12 12 2 -13 7 10 -3 2 4 15 24 2 1 -8 -2 -16 1
5517 1 0 -12 -46 -13 18 42 20 -7 -9 -16 -3 -13 7 -18 -7 -17 -34 -11 22 4 -24 -13 -2 13 13 1 -1 0 5 7 21 7 1 28 5
5552 5 -8 22 2 -6 -2 -1 1 0 -1 -7 -15 -1 16 -22 -17 -3 -8 -13 -8 -3 -19 -26 -6 0 28 0 -12 -13 -13 -9 -5 -2 1 -16 15 23 -17 32 8 -7 -42 -9
$$ packed form
5295B2j3j7J4lj2K8JJ0j1j4pj1oKJ8k0QK2Ok4j5K1j1J3orLOj7K1j3J5j8MK8kn
5332HnL0l6j2J7pj1L2j4j5K6nj6Mk3N0Pk1k4j8K7k0PjL4j3nj4K8j0%l1M3Lj8l
5368fMk1OK7m5M6k8KK3Qlj3L6n8K4jQj9J3Jl8K2rL7j4k0j2K7%pRj7J2J6pLKj1
5406ck3L3j9KJ0k0J2K5l3J5Lj4K0K5l9L6m9nL4k3L9m0QqK3j3J1k4Rj3oL6jLl1
5441b0K5j9NJ7pNk8K4lKoJ6m6L6J9Ln1N2l1K6Oj6KPj5j3L3j1L4m9MMJ9l1K6Kl9
5478a8K8kNk%l7JK4RJ7m9MJ4JK0pQj9kL5j5j7j0K4j0j5K0Lj3NKJ1Rk2jrOj4J7
5517Ajj2l4L3L1K4k2k7kpJ3j0K0k5J1j0j7K3L3j8k8J1J1J5%j2kJNKJ4j4oK7k3
5552Ej3L0k0qMJKjjoqJ4J7l8NJ4nnNNj6pK0OK8k8j2j%MMLLj7L1Qm0M9k4j5l5L3
$$ plain form
5594 -9 -5 22 -16 12 -23 2 26 9 -2 -32 -31 -19 18 4 2 9 1 3 34 0 23 -18 -2 -7 -26 -7 0 -8 9 -11 -30 4 13 -13 3 4
5630 4 10 -4 27 11 -17 -8 5 17 15 7 -2 -5 32 -13 -16 11 -12 18 14 -12 -23 -10 -19 -26 -19 2 -30 -3 -10 -34 -41 -3 11 9 2 -8 0 9 -7
5669 -7 -43 -7 9 34 -14 14 -5 3 22 -6 46 2 6 20 -17 -3 -10 14 9 -12 6 -20 -12 -4 11 7 2 24 -4 -14 -22 -24 -11 -6 -21 -25 -9
5706 -9 10 9 7 -29 11 8 -5 15 -12 0 12 14 -6 16 -6 14 -1 2 -8 32 15 4 -20 -4 16 -6 19 2 -27 7 -23 23 5
5739 5 4 10 -3 -2 -4 11 -13 -4 -23 -9 -17 -15 8 -27 0 -2 -26 8 15 -17 -15 -14 -3 11 2 -21 36 12 -7 14 23 8 17 -13 2 -2 3 -26 -14
5778 -14 1 5 18 -2 5 12 10 1 -11 2 -21 -1 -1 4 -11 -20 11 18 7 4 2 -22 -16 5 28 -17 2 -2 -10 9 24 4 21 7 -9 0 1 -20
5816 -20 -4 16 -14 -6 -26 -10 -25 15 -11 2 -19 1 -6 25 -14 -2 -6 -9 -11 -29 5 -19 16 -26 21 -2 9 14 -22 -3 -1 -3 15 4
5850 4 9 26 -16 -5 -16 1 -11 -3 28 8 15 -45 -14 9 29 -28 -22 -14 -15 14 -2 0 -15 9 -15 5 6 23 -21 6 24 5 -14 19 21
$$ packed form
5594iMK7l8K8l5K5K4j7j1l0JJ2L7j4kPqKL1l4K3m1J6nj9J9PqJ7k0j9L4Rk6J6J
5630DOj4L1j6k8RJ3J2kqrlL7m5lK7k3L0mk6j1J3rpPK1l2K7pk4pL8J4kpj0QRj6
5669gl6L6J6K5m8K8j9QJ9k8N2m4MJ4l7J4pK4nk1J8k6QQJ5mnK2k8j0qkJ3Nj5mJ6
5706iJ9jkl6M0lj3K0k7J2J2Kk0K2k2K0j5Lj0M0j7j1k4J6K0k2K5j7k9L4l0M6j8
5739EjOj3JkJ5k4Rj9J4qKK3l5K7kk4L4Pl2KJJ1J4rk3N7k4j9K1Rj5Rl0J5mNk9J2
5778a4J5MJ3k0PPkrj2J3k3K0%Nj5rL1Pj1lkk4OK1K3m5J9mqJ9J5k0J7j4j6RJk1
5816b0J6K0l0Qk0J6j5M0k6J3k1K0pL1l9J2mlkj8L4k4L5m2M7k3J1Nl6J9KkJ8j1
5850DNJ7m2J1j1J7j2QL1k0Po0L1K3K0n7OQjK9j6Kj5K4k4K0JJ7m4K7J8j9j9L3K
$$ plain form
5885 21 -19 12 -30 12 -24 -4 6 -5 20 -18 -6 5 18 8 -14 -17 14 -12 9 9 -7 8 -5 21 23 18 -2 -6 0 6 -6 3 14 12 22
5920 22 -5 -6 3 5 10 25 9 10 -9 -1 16 12 9 31 -6 3 1 10 12 -14 -25 -4 5 20 4 -5 -4 -17 -5 6 -18 -20 -15 -1 -7 0 15 -9 5 14
5960 14 8 19 -28 22 24 25 -4 11 26 14 16 -13 -13 30 6 20 -6 14 8 24 26 11 7 4 12 -21 6 8 13 5 9 -40 -3 -7 -15 17 -7 18
5998 18 -25 -11 -1 13 -1 -13 9 -3 -3 -5 14 -9 12 13 15 28 -11 1 28 13 12 8 4 -12 -14 2 -1 4 2 -15 -12 -21 17 -46 -7 -2 16
6035 16 -16 -5 35 14 -15 -4 -2 -11 39 1 -1 -3 -1 2 5 -6 16 15 9 -41 6 9 -12 -14 29 0 11 17 5 -5 17 30 2 -6 -7 -3 -9 -15 -34
6074 -34 16 0 2 0 -5 3 30 -25 -7 6 5 -11 -13 16 -13 9 19 -7 -23 1 8 9 -30 -4 -5 24 2 21 5 15 12 -1 -7 11 -3 13
6110 13 -19 20 -10 13 -11 -10 -7 -26 -11 -26 -8 -6 13 -10 11 2 -8 -4 5 -27 0 1 -7 5 -1 29 15 -6 18 -8 14 18 30 9 13 6
6146 6 -21 13 2 1 6 -11 -8 -17 -8 12 20 10 27 -12 5 -8 2 -41 9 18 -1 -17 -20 8 -8 -6 -14 0 6 -18 -7 47 -10 12 4 14 2
$$ packed form
5885B1m0L1m2M2l6K0J0j1K5l8J2J1J3j0k2lL1k6K1%j6J5j3K6Knk0mOOj2RJ1kJ0
5920B2k7jRKNJ5j6Jj9QJ7mlK2l7RkRKk6j1K1RJ5j6rJj3J2J1k4kNJ4oPJ5k4J4R
5960A4oJ1m7N0KJk9J5J5j2Kk9%M3k4J4k6K0oJ6Kj5mlQl3K7KNqMm9L7mqL2k4K5
5998A8m3J4J0J4j4j2K2j2%kJ9k3K1JKJ3l9J2K7j5jmmj6kJ6lNkj7LrL8o3L9NJ8
6035A6l2J1M0k1k9J1KrN0l8kkKLLj1K2jon0M7Lk1kM3k9J1Oj2j0K2J3k8qjMooj9
6074c4N0j6KknQK7n5J8J3jj6kK9k9K2J0k6j6K4PJl9K6jK9k2J9j6J0lj3oJ8j4J6
6110A3l2L9l0K3k4JLj9J5j5J8KJ9k3K1rj0MRl2K7JqJ2oL0j4k1K4k6K2MJ2k1Mp
6146Fk7L4j1jNj7LrRK0Qj0J7l9J7j3J0m3N0Rj9j6lK8j6KqJ4Ok4J1N4n7K2qJ0j2
$$ plain form
6183 2 2 17 -18 -3 -21 -37 28 -4 7 -5 -5 -3 -5 7 -24 -16 -20 7 -25 8 24 -6 -1 10 -8 -7 6 5 -3 -2 -2 -3 -16 -1 3 -8 -18 -5
6221 -5 -13 7 21 -18 -24 25 11 -6 13 25 12 12 5 13 -34 -17 10 19 6 4 -5 -13 23 4 7 -13 5 3 -8 -13 -23 -18 -17 -9 11 35 5 -6
6259 -6 -8 17 -2 1 21 0 12 -6 -5 -9 21 1 17 14 8 1 -16 12 8 -6 12 -6 -17 9 -27 -5 -5 24 -3 9 -7 -22 -13 6 12 -10
6295 -10 17 -4 9 5 -21 3 -1 -1 7 28 17 -36 10 -3 -4 7 11 -2 2 -3 -21 2 18 16 2 -16 5 12 -23 -23 -33 -31 6 -33 -3 -11 5
6332 5 6 -24 -39 -12 0 -22 -4 -36 -6 4 9 -5 4 -12 8 15 -16 14 13 3 11 2 16 2 4 -7 -11 -4 12 -43 8 -16 1 -21 -8 -13
6368 -13 -9 4 -28 12 -16 -4 3 -12 -1 -13 3 8 -10 -21 -19 12 4 -2 22 9 -1 -4 -8 -3 4 9 -4 2 1 9 6 -2 3 9 13 -9 2 -39 3 -28
6408 -28 -15 14 -31 -13 -26 -23 5 3 -5 -22 -28 -29 0 -11 3 -8 -4 -21 -12 21 -16 2 -10 3 3 -40 9 -19 1 15 9 -5 31 17 11
6443 11 3 -1 2 -19 -4 6 -26 9 7 8 18 -2 20 -12 -12 7 -11 -19 7 -3 23 -6 -16 13 -16 19 -9 15 -3 -1 18 -11 -2 1 25
$$ packed form
6183B%J5l5J5j8j6O5l2J1j2%KkJ2l1QmK7l2L3J6l0NJ1j8JJ3jqJ%jj3J5Mj1j0J3
6221eqK0J4l9oM9j4j7J9J2j3%pQm7J7K7Rj3krqL6j9Lk0J8kj1nj0NJQK0K4l0j1
6259fkK5j9LK0k1J2j8JmL0k0J6lopj7K8mj4J8j8j1K6l6K2%K9k7J2j6j5RJ9Ok2
6295a0K7k1J3mk6K4m%QK1j1n3M6j3jJ1Mj3Mnj8K3J6kj4j8K1Pl5%j0KL7l9L0qJ6
6332EJl0j5K7J2k2J8l2L0J0Nj4Rj6K0Pl1L0jj0QrJ4j4Kj1mPJ6n5N1k4J7k2J3n
6368a3MJ3l2M0k8J2Pj5J1j2J6Nj8j1KL1qoK4j3j0lmNPNj3OjQlqNOMk2J1m1M2l1
6408b8J3K9m5J8j3LK8kqj7ojK9j1J4j1Mj7RL3l7J8j2J3%m3M9k8K0J4oj4L6j4o
6443A1qmLk1J5J0l2L5kJJ0k0K2l2%J9j8qK6j0K6k9j0K9k9L5k8K4j8KJ9k9RLK4
$$ plain form
6478 25 -6 -18 -18 19 26 12 33 -11 -7 10 15 7 9 2 1 3 -17 15 8 -6 -12 4 -3 2 11 5 2 2 -31 -12 -5 -1 -17 -13 1 4 -1 -19 13 9 48 6
6520 6 30 -30 -17 -4 -15 24 28 -31 -19 0 0 -20 -1 -7 -35 -15 13 6 10 -11 6 -13 -11 -17 -20 5 17 -10 -2 -9 12 -27 -6 -7 29 19
6556 19 -8 9 11 -3 34 6 1 2 10 -15 3 8 -24 8 8 -10 32 -9 -1 -1 -6 -27 -30 -7 -8 7 -13 -9 -10 -10 16 5 -12 7 18 -14 -12 8
6594 8 -19 -6 -18 20 4 -31 -9 -13 6 22 24 8 -2 12 -13 21 2 -5 -3 -1 20 -29 -8 -7 -11 -7 -17 -5 4 -13 -10 -18 -15 0 2 2 -5 -1 6
6633 6 0 -3 16 15 -23 22 10 -13 0 -21 -3 -20 -2 32 0 -32 -2 -3 17 14 9 -17 3 2 5 7 22 6 -1 -35 -16 -15 -21 9 0 -15 13
6670 13 19 6 -11 -23 -7 5 4 5 -8 10 -9 9 26 6 37 16 23 9 -3 6 24 5 1 -10 -10 16 5 16 9 -22 8 19 -12 22
6704 22 -17 17 3 -15 28 -11 8 -26 -19 -8 5 -8 -18 13 -4 -1 -2 -9 -2 -12 -14 6 22 -4 12 -2 1 -7 -15 12 41 26 -1 5 -2 -4
6740 -4 -15 -15 -9 -8 -2 -29 -2 2 -22 12 -5 -29 -26 -24 -9 2 -8 7 -11 -10 6 -18 -2 10 20 -2 -22 0 -6 15 -11 22 5 0 7 27
$$ packed form
6478B5l1j2%L7Pj4K1m4MJ7NqKpjKk0L2pj4oJ6pNRol%l3J9PMj6MJ4Lnj8L2mL9m2
6520FK4o0J3J3j1L9Mn9J2J9%k0J9ok8K0K8pMk1J7j9KolK5J2k7QpK1l9K1jL6j0
6556A9k7J7Kj4L7k8nJQk5J8Nl2L2%j8M2m1Q%nk1lK3jJ5k0Mj%K6j1j7J9J1l2KK0
6594Hk7J3j2L8j6l5K2mJ9J6Kj6j0J4k5L4j9pKKK1m9K1JmMj0J2Rj7LqLJ5K%pMP
6633FolJ9jl8M5j2k3J3k1J8j7J8L4l2l2L0jK0lnk6K0jLKJ5j6pl4J9JoL0rj5K8
6670A3Oj3j7j2J6J2jJj3J8j9J8J7k0L1k1Pj4j2RJ8j9mj1%K6j1J1pl1L0J1l1L4
6704B2l9L4j4j8M3l9J9l4PJ1J3j3j0L1j7LjpPj0kK0J6k6J6j4LqqK7K9j5k7Opk
6740dj1%OJOk7K7Mk4L4j7k4LKJ5J1j0J5j8JJ6k4J6J2J0k2k0K2oK1k6L3j7nPK0
$$ plain form
6776 27 -12 13 20 -3 10 9 11 4 -3 -25 -6 8 -21 -26 -23 -28 -8 0 12 -22 3 -27 10 -15 -14 43 25 5 7 -14 -12 4 5 -8 6 6 15 20
6814 20 -20 18 -6 -9 24 12 16 2 -15 -22 -11 5 -21 -22 -15 -25 12 -9 -18 6 -32 -12 3 -10 10 -18 -4 -25 6 -11 -24 -5 0 -5
6848 -5 -13 1 -30 2 17 30 1 2 -1 0 3 -10 -13 -21 4 -9 -7 -13 3 8 -19 -8 8 -12 16 12 -19 -24 4 27 -14 -10 0 -30 -27 -17 -13 -3
6886 -3 -3 7 20 -24 -5 7 2 -9 -11 18 20 -20 37 46 21 -8 -1 24 -8 39 14 2 7 6 -15 -8 24 -5 -10 -6 -29 -18 -9 7 19 9 -5
6923 -5 -30 -12 -17 -27 -23 19 -11 -3 -19 15 6 -16 -24 9 2 13 8 -2 3 -12 8 41 -3 26 -22 16 -9 -13 1 13 -18 -12 -2 -9 -13 -13 -5 -10
6961 -10 -7 11 0 9 -11 -4 10 -6 19 -12 9 -8 12 9 11 -20 -18 18 -1 0 1 -13 0 -16 10 -18 13 3 23 -4 -11 -2 -16 -8 -20 17
6997 17 -7 -18 3 7 -15 -1 12 -7 0 7 -5 -9 -12 -25 -17 -8 3 -7 -14 5 24 12 17 -28 13 -13 17 27 -1 10 18 -10 33 -3 -5 38
7033 38 -20 8 -1 15 3 -37 -27 -13 13 -6 4 -25 -21 -20 -13 -17 -17 -4 -20 -9 2 1 -5 -20 2 4 22 14 14 31 11 -10 9 -30 -4 -25
$$ packed form
6776B7l9K5Pk3J3jKppk2J9J4k9nLnK0QJ2l4K5l0L7k5JN7j8k0Kk1KJ6Jj3J4%RN
6814B0m0L8k4lL3j2Mj4j7pJ1J6k6jPj0L7k1rK4l8K0J5j3K0k8J4k1L1j7j3J9Nn
6848eqJ4l1L2J5J3k9JlJLj3lqK5j3KoJ6Nk7J1J6k0K8ml1nK8K3m1MJ0l0LJ0MJ0
6886c%J0J3m4J9J2nj1kK9Km0N7Rk5k9PK5l2M7k5j2Njk1PL2k9nMk3J1RJ6J2j0j4
6923ek5J8nj0MM2l0Qj6L4rk2qL3pJ1nj0Nj5K0L3m4K9m8L8k5mJ4J2l1OJ0pm%Qn
6961a0LJ8j1Rk0PJ4j6K5l1K1j7K0lKl1KL6j9JJj4J3j6K6k8L1j0K0k7pRj4Qj2L7
6997A7k4j1K1Mk2J4J3j9PPj2mlj3QRJ1j0pJ9J9j2Nm5M1k6L0J0k8J1Qk8M3l6kM3
7033C8n8K8rJ6j2m0J0J4K6j9J0k9MJPm%J3j6J1J1joj5K2KJ8q%J7k0k1J9l9K6k1
$$ plain form
7069 -25 -9 24 12 -17 -19 -15 -9 21 -2 -18 -5 -22 -11 11 -14 -15 3 3 11 -15 -18 -19 2 -4 18 -18 -13 3 4 21 -3 -19 -6 7 14 -3
7105 -3 18 -7 8 6 8 8 9 1 8 -28 0 -15 -1 -20 17 1 -29 -14 10 -30 8 -9 -19 -1 -12 -4 -3 10 -2 -16 4 -5 2 14 5 -9
7141 -9 13 5 -3 16 -23 0 -20 5 -9 21 -10 32 -10 0 -17 -38 1 16 2 -43 -14 -9 -12 -4 -10 2 3 14 -34 -26 9 -23 -32 -12 1
7176 1 -32 -8 -6 -6 -18 -29 -13 -2 -10 -7 8 6 17 0 -54 10 3 13 -8 11 14 31 3 -12 21 -4 1 0 3 -11 2 16 9 -2 11 -13
7212 -13 21 -37 -8 6 -15 -16 -16 -6 -22 9 4 -12 -3 -10 -24 14 -1 8 -12 -26 17 -9 0 2 8 -9 20 -13 -8 9 -29 -31 -22 2 -20 -15 -8
7249 -8 -23 -15 -3 -10 -11 -15 2 -20 1 1 -18 -7 12 10 6 -6 -7 -11 9 -1 3 -7 0 -21 14 2 -9 2 4 -13 9 -9 16 7 -19 -2 14
7286 14 8 12 -7 25 -19 -10 2 5 22 -15 -9 -19 -19 -4 -3 -8 -13 -42 -8 -13 -17 4 0 -1 -22 -31 -9 1 -1 3 16 -13 15 -5 8 9 1 -1 0 -1 27
7327 27 -11 28 -7 2 0 2 -2 -44 -1 6 9 -11 -5 -4 -16 -11 -8 -35 17 -9 17 -28 -12 3 -9 15 7 -22 -7 9 0 18 10 -22 -6 1 17
$$ packed form
7069b5J6L3j2k9kMOL0k3j6J3j7J1K2k5jJ8%Qk6ljK1oK2l6NJ6JJ7k4j6J3J3Pj7
7105cK1k5J5kK%JqPl6K8j5J4j9L7j6l0J5K4m0L8j7j0J8j1QJJ3j2j4K0rPJ2rj4
7141iK2qqJ9l9K3k0K5j4L0l1M2m2J0j7k1L9J5j4m5K9NlQoJ2JJ1m8QL5l2rK0J3
7176Al3K4K%j2j1J6J1qLJ5kJ1j7n4O4pJ0k1J9LJ7k8j5L3k5NjLj4J3J4pj1J3k4
7212a3L4n8K9J4k1j%J0j6L1nj6Rpj4L8j5Rk0j4M3k6RKOj7K9l3NJ7l8kRK4k2NP
7249hj5QJ2pjmJ7k2K1%j9J1J9kmj2jmK0j0Mj0Pk1L5j2j1J1Kj7K2j8K5rk6J7J6
7286A4oMj9L2m4RJ2LJ7l7Oj0%J5Jnnk9L4nmK1mjk1rK2J0kMJ3k9K8k0J3JqkJjK8
7327B7l8L9l5RkKmm2M3PLk0OJj2NLk7N2k6K6m5J6J5j2K4qk9J5J6rJ8ql2J6PJ6
$$ plain form
7364 17 -23 11 -9 -16 7 9 14 -21 -22 28 4 2 -11 -30 -8 -12 18 -1 -5 -17 4 -8 8 8 -11 7 1 -24 4 -18 -15 20 -4 16 -18
7399 -18 19 -2 4 14 6 4 12 -12 8 9 -29 2 -11 -1 18 -7 -11 -15 0 -6 23 0 -29 -5 25 -29 -31 3 -26 -20 -3 4 -6 14 -17 -12
7435 -12 5 -1 -7 -3 -24 -4 20 8 6 -9 21 -27 2 -13 32 18 -3 -4 10 24 1 0 1 11 2 -15 9 -12 -31 1 -6 -10 13 -1 -1 -22
7471 -22 10 -21 6 -15 -7 2 1 9 -25 6 -6 -21 -9 8 -18 -8 4 0 -4 22 -9 8 -2 -13 -9 21 5 -20 -12 5 4 -14 9 7 -1 -5
7507 -5 9 -7 -10 -6 1 -12 -6 -4 26 2 -23 -2 -31 -5 27 -15 -3 15 -5 7 28 -10 -1 2 -9 10 -4 -9 12 21 -9 -6 -2 -6 -7 -27 -10
7544 -10 -35 -9 4 3 -8 -7 -40 -2 -17 -13 -4 -14 12 14 4 -9 1 -2 -12 0 3 1 -4 5 -4 8 28 -12 -7 6 4 17 32 36 9 -2 16
7581 16 27 -5 -1 -6 0 19 -16 -30 -18 -24 -19 -18 -1 20 4 10 1 8 -8 17 -29 -7 -14 1 -5 -3 26 24 15 -2 -1 11 17 4 13 18 5 9 9 -14
7621 -14 -9 -17 18 -6 -3 -1 -3 5 4 -1 -9 -22 -15 -18 -22 19 15 -1 -21 12 -29 -3 5 19 -23 -12 16 17 -27 -1 1 11 -13 4 6 18 9 4 4 -14
$$ packed form
7364A7m0L4k0pK3KNl5jN0k4kj3j9K2mL0j9mj2K1j2J6%j9J8ok5K8k2LL5k4K0l4
7399a8L7k1OJ0qkQk4K0Jl8L1j3J0J9k5mmJ5oK9k3k9K4L0n4kL4k9OJ7Pj0K0l1N
7435a2J7ooMk1K0K4j2kj5L0m8K9j5M5j4k1jJ4J4k3jJJ0rj7K4k1j9L2pmK3j4%k1
7471b2L2l1K7k1QRjQl4L1j2j5J2J7k6J0J2mmK6l1J7j0j1ML0j6k5QJ7jj8K3kqm
7507eJ4j6lMPj3OKL0k4k5K1k9K6L2m2J2J8k0J2K1l8RLj1J9j4nK1Rl0LMmjk0J7
7544a0k5K6J3jj1Jl3L8j5MRj0K6Kj0j3J0lj0J2LknRrJ2K0m0NJ3kJ3J5Mk7j1J8
7581A6J1l2MnOJ9l5j4J2oNJJ7K1j6OrPj6K5m6K2pJ5oKK9krj7JJ2Oj3RNj3M%k3
7621a4NqL5k4LKkQjnqj3PlmM1mj6k0L3m1K6QJ4m2J1K8Jm4K6KJ0k4J7KJ2rn%j8
$$ plain form
7661 -14 17 -3 27 32 -20 -22 -2 -2 -6 -16 0 0 -13 -15 -22 1 0 -22 -18 -18 -24 6 13 -6 9 -1 -7 5 -15 -10 -23 -33 -27 3 -1 13 14 -13 -12
7700 -12 22 7 12 10 30 -15 -19 -16 -15 -4 -3 -9 -8 -19 -3 10 -14 -7 -10 -13 -20 -9 -15 -12 -15 -10 -12 -8 -2 -15 -21 -26 0 18 -1 16 6 19 -26 17 8
7741 8 -12 17 9 -5 -36 4 0 -17 -19 -13 2 -20 -9 0 0 -23 -21 -18 5 11 -11 -3 0 -32 -2 -23 -1 -5 -23 -15 -22 7 -7 23 -24 -11 13 4
7779 4 -7 -7 -6 13 -15 -7 11 -2 -6 0 8 7 11 5 -17 11 -7 8 1 13 -14 -6 -4 9 4 -1 -20 -19 2 -1 -2 3 -6 -25 -13 -4 5 -10 -7 2 -5 0 11
7822 11 -22 28 7 17 -11 -2 -12 -16 13 -8 4 7 7 -8 1 14 7 1 -6 20 -12 -3 6 12 7 -33 18 -28 -3 -13 -10 2 -15 -11 2 1 25 8
7860 8 -26 1 -4 7 3 13 -23 8 18 8 -17 -15 3 1 -11 5 15 -17 -4 -10 -10 -21 1 -3 -3 -6 -30 7 -5 -33 -18 -21 7 -3 0 -12
7896 -12 3 -19 2 16 -9 14 -21 2 17 2 1 -8 10 27 -13 14 9 -2 -12 5 -5 8 12 -4 22 1 6 -2 -14 9 -21 1 -10
7929 -10 -17 20 -14 -4 -16 -22 5 -12 -6 -29 3 25 1 8 9 14 18 -3 -3 -7 1 -14 -23 7 6 4 -12 6 -1 19 27 -5 15 -3 1 1 -13 2 -5
$$ packed form
7661a4L1k0L0Nn2kK0%mj0J6%j3kpK3jk2M%oL0Pj9J5j0oJ2k0Nj3j0OL0mJ4Jk7J
7700a2L4j5NkK0m5mLJJ1JoJj1J6J3k4PllpJ1oLlNkMOj3onK6J8j9J7j0J3m5M3r
7741Hk0K9qj4l1M0mj7kOJ5k2J1R%k3KLK3Ok2QLl2L0k1K2mj8QpK9j4L0m7J3K4r
7779Dj1%JJ9k8QJ8j3mOQjMok2K8j8J5pJ2k7QKJ3nnj9JK1ljNrj9J2RRj5LRpNJ1
7822A1l3N0k1J0k8Rj0mK9k1J2L%j5RJ3popK6l2RROnm0N1m6K5j0LJ2j7MJ3jK4j7
7860Hl4K7nJ1mJ0l6L1J0j0k5KJ8kj2J6J0l2J3o%j1K2m%lk4L7j2k8J5lK8j0Lj2
7896a2J5k2K1J4k5K3l5K3J5j5jrJ8J7m0K7nj1j0J7j0J3Mj6K6k1Nqj2K3l0K2j1
7929a0pL7l4J0j2oK7j7Ok3L2K2k4PJNMk1%mQj5rL0jkj6J8pK0Ql2K0j8M%j4J5p
$$ plain form
7968 -5 -27 -19 -29 2 16 14 -20 4 7 -25 2 -7 -3 -10 17 -15 -18 32 3 -18 -10 -1 24 2 -7 17 6 22 -9 -6 0 -16 -1 -38 1 -4 -2 5
8006 5 6 -3 12 -15 4 -7 0 -5 -14 -23 -10 -23 -23 -18 -12 -8 -49 15 -11 -15 8 1 -2 -33 7 0 5 -22 8 10 2 -27 13 18 21 -15 -6 -7 1 5 11 14 -1
8049 -1 8 -25 -12 35 -18 -9 15 3 -23 20 13 -8 4 21 -6 -39 -16 3 -8 5 12 20 -13 -14 12 -1 5 -1 -14 -1 -16 4 14 -2 -16
8084 -16 28 30 -2 10 -16 -6 -19 -22 8 12 -11 -18 4 2 -13 1 -7 32 8 -2 11 9 13 11 16 -12 -11 -2 -8 4 -9 31 -9 -3 0 -6 11 20 13
8123 13 7 15 -7 7 13 4 -11 3 -18 5 6 11 -16 4 -38 1 -23 -20 -13 8 8 11 -23 -16 -6 -3 23 -30 6 -85 57 -39 -3 -6 26 56
8159 56 -51 -95 -123 141 70 113 -16 34 -25 -30 19 21 8 47 -95 28 19 11 -4 19 -2 -18 -1 -6 18 16 -8 -32 15 17 2
$$ packed form
7968ek2Qj0L1J4kl4K4Ll2K7rMpK7l2lN0k9k1QRK5k2rK4j1J6l1LOj6J5l7L9nKP
8006EJrJ5k7J9j1PnrrJ3j3%NOMm1O4k6mK3pll1M0pNk7L0Kqk9M0NLl6RjQMOLj5
8049aRl3J3M7n3RK4j2k6M3pk1J2J7k7l3K3J9j1J3PQl3jK6j3Ooj3J3j5K0J0j6j4
8084a6M4Kl2J2k6J0j3lL0Mk3pK2kj5J4qL9k4j0J3kMkNk8JRoJ2j3M0m0OLoJ7Rp
8123A3oQk2J4Orj5J4k1K3JNk7K0m2L9k4LPK1%Ll4PJ0LK6n3L6r1J42r6L6lL2L0
8159E6j07m4k8K64p1M3j29N0n9nM9Kj3L9j42J23rqj5K3k1j6J7nK4kk4k4M7Kj5
8190Bk3
8191b1
$$ Imaginary data points
##PAGE= N=2
##DATA TABLE= (X++(I..I)), XYDATA
$$ plain form
0 0 0 0 0 0 0 0 0 0 0 0 0 0 0 0 0 8 -8 8 -8 8 -8 16 -16 19 -24 24 -32 40 -40 48 -56 64 -72 80 -95 104 -120
37 -120 131 -147 165 -184 203 -225 249 -277 305 -337 371 -411 451 -498 548 -605 666 -736 814
56 814 -904 1007 -1124 1264 -1432 1634 -1891 2220 -2667 3306 -4311 6102 -10298 41458 -8059
71 -8059 -69175 7921 -32819 -14357 73670 26688 -58166 -8036 -4518 -20106 53531 48842 -51835
84 -51835 -29035 14042 -23592 3462 50965 -11253 -35319 13397 8482 -2185 20252 -12418
96 -12418 -34638 8376 17456 -729 14614 -2194 -31647 966 29008 12488 1811 -19525
108 -19525 -35742 192 26236 16465 19385 -5018 -46584 -12971 32544 13572 7120 4530 -40017
121 -40017 -27566 31312 20045 4018 19986 -23901 -46309 21654 30240 -15249 8018 8226 -39146
$$ packed form
0@%%%%%%%%%%%%%%%Qj6J6j6J6j6K4l2L5m3M8n6P2q0Q8j04J20j36J52j75J99k24
37a20K51k78L12l49L87m28M74n26N82o42P08p82Q62r49J046j153J271j402J550
56H14j718J911k131K388k696L066l525M111m887N973p617J0413j6400N1756m9517
71h059o1116P7096m0740J8462Q8027m6982q4854N0130L518j5588P3637m689j00677
84e1835K2800M3077l7634K7054M7503o2218k4066M8716m915j0667K2437l2670
96a2418k2220M3014R080j8185J5343j6808k9453L2613K8042j6520j0677k1336
108a9525j6217L5934K6044r771K920k4403m1566L3613M5515j8972o452k590m4547
121d0017J2451N8878j1267j6027J5968m3887k2408O7963Q586m5489K3267K08m7372
$$ plain form
134 -39146 -340 43314 -4655 -13287 13737 -23204 -18861 38166 7472 -30274 10224 5284 -22352
147 -22352 23768 28409 -30586 -18439 11495 -10711 6652 31642 -13435 -27453 9807 2485
159 2485 -1572 27240 1552 -34883 -6749 11332 947 16291 12756 -20140 -13909 6265 2154
172 2154 9623 11125 -14824 -15209 5281 4266 6214 10727 -7251 -12334 1924 438 2052 9382
186 9382 -6849 -11990 8087 5056 -3712 8353 -1086 -15685 4569 10359 -6319 2967 4773 -14785
200 -14785 6 17558 -3546 -5785 8036 -10182 -11026 16604 6033 -11252 5212 307 -14376
213 -14376 7989 13302 -10001 -2485 6205 -11069 -1906 15275 -2954 -8009 7812 -2841 -8612
226 -8612 9698 3863 -9076 3660 3593 -7792 3144 6372 -6507 -45 6346 -5209 -2685 5817
$$ packed form
134c9146L8806M3654m7969q632K7024l6941M343N7027l0694l7746M0498m940k7636
147b2352M6120M641n8995J2147K9934k2206J7363K4990m5077j4018L7260p322
159B485m057K8812k5688l6435K8134J8081j0385J5344l535l2896O231K0174m111
172B154P469J502k5949l85K0490j015J948M513j7978n083J4258j486J614P330
186I382j6231n141K0077l031q768J2065r439j4599K0254N790j6678R286J806j9558
200a4785J4791J7552k1104k239J3821j8218q44K7630j0571j7285J6464m905j4683
213a4376K2365N313k3303P516Q690j7274R163J7181j8229n055J5821j0653n771
226h612J8310n835j2939J2736o7j1385J0936L228j2879O462O391j1555K524Q502
$$ plain form
240 5817 -2552 -2708 5623 -1266 -4463 2905 -851 -2645 4917 445 -5161 1564 1492 -2258 3097 1591
256 1591 -4854 -173 2144 -1556 3232 3149 -5853 -1968 4738 -636 -41 3437 -4485 -4955 4451 2870
272 2870 -247 2808 -3129 -7382 2974 5910 -1426 -220 -687 -6663 39 8394 2670 -1991 -2363
287 -2363 -6008 -1784 7496 4772 -1941 -2619 -4468 -2618 6897 7537 -1833 -5416 -4920 -3028 4956 8427
303 8427 672 -5457 -5065 -2271 4056 7823 1249 -6758 -6617 -1825 4025 7958 3567 -5103 -7201 -2272
319 -2272 4382 7232 2299 -5344 -6980 -2267 4569 8215 4020 -4740 -8197 -2880 4439 7027 2964
334 2964 -4652 -8018 -3023 5006 8296 3945 -4543 -9144 -4958 4358 8779 3667 -4400 -7718 -4326
349 -4326 3970 9636 5256 -4599 -9427 -5561 3272 9553 6119 -3727 -8367 -4665 2685 8871 6671
$$ packed form
240E817q369j56Q331o889l197P368l756j794P562m472n606O725p2l750N355j506
256A591o445M681K317l700M788q3r002L885O706n374N95L478p922m70R406j581
272B870l117L055n937m253J0356K936p336J206m67n976O702Q355n724m661l72
287b363l645M224R280k724o713o78j849J850R515O40r370l583M96J892P984L471
303H427p755o129L92K794O327L767o574q007J41M792N850L933m391q670k098M929
319b272O654K850m933p643j636M713O836L646m195q760l457N317P319K588m063
334B964p616l366M995Q029L290m351q488m601M186R316M421n112q067l318L392
349d326Q296N666m380r855m828L866Q833O281l434r846m640L702P350O186k200
$$ plain form
364 6671 -3783 -10023 -6090 2304 9074 7470 -2787 -9139 -5189 1730 7052 7361 -1927 -10711 -6173
379 -6173 3257 7703 7665 -65 -9951 -7144 2889 6686 6169 887 -9362 -8940 3739 9306 5686
394 5686 917 -7648 -10838 869 9704 5534 155 -5817 -10262 -760 11101 7257 -1318 -5341 -9317
409 -9317 -4254 9328 9988 -889 -5582 -6270 -3839 6375 10242 411 -6829 -6149 -3071 4504 9717
424 9717 2267 -6852 -5894 -974 3565 6742 2405 -6173 -7557 -1221 5621 7180 1706 -5420 -7115
439 -7115 -2106 5481 7575 1114 -5786 -6668 -2943 4910 10286 3118 -7393 -6948 -2029 2182 8537
454 8537 6267 -6198 -8834 -1406 2220 6134 7890 -3224 -10878 -2439 3340 2540 5772 1738 -8977
469 -8977 -4769 5008 2927 1517 2190 -5527 -6302 4611 5366 -1180 133 -1363 -5641 2189 8242 -178
$$ packed form
364F671j0454o240L933Q394O770j604j0257o352L950O919N322L09r288q784M538
379f173R430M446l8p730r886K807J0033L797n17n282j0249M22J2679N567l620
394E686m769q565l190J1707Q835m170n379n972m445R502J1861l844q575m023l976
409i317N063J3582O60j0877m693o88K431J0214L867r831p240O80L078P575N213
424I717p450r119R58M920M539L177m337q578j384O336O842J559n474p126j695
439g115N009P587K094o461o900q82L725P853N376p168j0511M45M919M211O355
454H537k270j2465k636P428L626L914J756j1114p654Q439N779q00L232m034j0715
469h977M208R777k081j410O73p717p75J0913P55o546J313j496m278P830O053q420
$$ plain form
485 -178 -4805 -1701 -2800 97 7988 4031 -5717 -4895 -1156 -117 5278 6701 -3284 -8232 -2070 1664
501 1664 3013 6248 1923 -7542 -5977 2069 3226 2693 3656 -2242 -7170 -515 4514 1252 1352 1558
517 1558 -4370 -3414 3860 1656 -2444 1786 1046 -3790 1280 3812 -3733 -2945 3435 252 -924 3507
533 3507 -1333 -6022 1113 3870 -305 2299 1793 -6571 -3875 4994 2622 95 2993 -2094 -6952
548 -6952 398 5006 942 1098 1331 -4776 -4171 3171 2727 -275 2046 -3 -5108 -1535 3337 355
564 355 -296 3061 -734 -4657 338 2164 -1561 1608 4038 -2601 -3777 1818 -165 -1536 4635 2448
580 2448 -4792 -981 1710 -3167 1198 6185 -1971 -4313 2319 -1138 -3643 4653 3276 -4422 6
595 6 2030 -4487 -277 5322 -1427 -2044 3765 -1859 -4960 3011 2739 -2189 2283 2288 -4853 -2222 2985
$$ packed form
485a78m627L104j099K897P891l957r748Q22L739J039N395J423r985m948O162L734
501A664J349L235m325r465J565Q046J157n33R63n898m928O655N029l262J00K06
517A558n928R56P274k204m100M230p40m836N070K532p545P88O380l183j176M431
533C507m840m689P135K757m175K604n06q364K696Q869k372k527K898n087m858
548f952P350M608m064J56K33o107O05P342m44l002K321k049n105L573M872k982
564C55o51L357l795l923M995J826l725L169K430o639j176N595j983j371O171k187
580B448p240L811K691m877M365M987q156k342O632l457k505Q296j377p698M428
595FK024o517M210N599o749o17N809n624l101P971k72m928M472Np141K631N207
$$ plain form
612 2985 160 902 3652 -2001 -4877 392 1782 462 2680 1276 -3850 -3234 929 1951 1574 1341
628 1341 -946 -3109 -1429 1813 1825 305 367 -841 -2661 514 3018 -687 -1309 1838 -663 -1994
644 -1994 2595 741 -3792 769 2934 -1667 511 2303 -4267 -2730 4595 1102 -1611 2605 -1953
659 -1953 -5958 2637 4870 -1324 766 898 -6021 -1616 6033 1156 -1143 1945 -3284 -4482 4164
674 4164 3729 -1791 795 -319 -4756 748 4745 -720 -1336 1074 -2385 -1476 3394 731 -2217 238
690 238 -248 -1006 1920 1007 -2035 -840 576 508 1576 528 -2061 -1337 160 1112 2631 728 -2664
707 -2664 -1743 -163 500 3077 1920 -2994 -2530 165 -196 2049 3535 -1916 -3974 136 395 526 3465
724 3465 -29 -4230 -307 1319 -564 2507 2001 -3955 -1965 2702 142 47 2423 -1850 -3137 2203
$$ packed form
612B985k825P42K750n653k876N269J390j320K218j404n126O16M163J022l77k33
628A341k287k163J680L242J2j520O2j208j820L175K504l705o22L147k501j331
644a994M589j854m533M561K165m601K178J792o570J537P325l493k713M216m558
659a953m005Q595K233o194K090J32o919M405P649m877k299L088n229j198Q646
674D164m35n520K586j114m437N504L997n465o16K410l459R09M870k663k948K455
690B38m86p58K926r13l042J195J416o8J068j048k589P24J497R52J519j903l392
707b664R21J580O63K577j157m914M64K695l61K245J486n451k058M110K59J31K939
724C465l494m201L923J626j883L071n06n956J990M667k560r5K376m273j287N340
$$ plain form
740 2203 1589 -896 1485 -556 -3665 1215 3263 -948 -529 519 -2580 -670 3326 748 -1332 -231
756 -231 -1740 -1014 2883 1576 -1292 -444 -1095 -1426 1987 2294 -781 -929 -772 -1276 1287 2349 -498
773 -498 -1077 -343 -1276 437 2351 -160 -1421 -64 -678 -191 1909 307 -1632 -226 42 -269 1467
790 1467 702 -1819 -479 798 -156 946 1175 -1648 -1365 1054 567 456 1132 -1105 -1988 599 1113
807 1113 164 833 -294 -2201 -380 1424 602 420 -159 -1703 -796 1096 784 437 218 -1216 -1289 723
825 723 1255 429 102 -702 -969 280 797 427 450 -354 -1123 -76 852 305 -82 -130 -428 -267 204 194 68
846 68 -95 -453 -121 487 51 -351 -83 46 50 192 141 -61 -196 -120 287 475 75 -341 -213 -26 207 406
868 406 137 -192 -334 -302 138 556 107 -322 -205 -318 -107 439 316 -156 -224 -281 -137 397 261 -138 101
$$ packed form
740B203o14k485K381k041l109M880K048m211M19J048l099J910L996k578k080J101
756b31j509P26L897j307k868Q48o51l31L413L07l075j48J57n04K563J062k847
773d98n79P34r33J713J914k511j261J357o14M87K100j602j939J406K68l11J736
790A467p65k521J340J277r54J102K29k823K83K419m87j11O76k237q83K587N14
807A113r49O69j127j907J821J804q22j82n79j544R07J892l12l47k19j434p3K012
825G23N32q26l27q04k67J249N17l70K3q04p69J047R28n47l87m8k98J61M71j0j26
846F8j63l58L32O08m36m02K68J29MJ42n1k02j35P6M07J88m00m16J28J87K33J99
868D06k69l29j42L2M40M18m49m29J17j13K11N46j23m72o8n7J44N34j36l99K39
$$ plain form
889 101 -88 -428 339 472 -303 37 315 -421 -29 500 -320 -97 616 -369 -530 647 -154 -742 746 339
909 339 -890 269 296 -904 440 907 -871 -99 842 -998 -449 1586 -159 -1023 958 -46 -1213
926 -1213 1035 775 -1152 499 651 -1501 124 1473 -918 -576 1283 -604 -1127 1001 102 -886 763
943 763 164 -1057 449 366 -919 485 872 -749 -185 547 -517 -99 797 -8 -29 245 -698 -180 750
962 750 -104 105 585 -809 -706 649 -91 -7 1031 -590 -1219 651 -87 -715 1537 428 -1961 371
980 371 896 -1588 759 2077 -1634 -907 1650 -1058 -848 2496 -245 -1957 1680 271 -2379 1520
996 1520 1684 -2360 292 2114 -1975 -850 2106 -1092 -1052 2346 -270 -2004 1280 23 -1915 1842
1012 1842 1829 -2000 -396 808 -1624 240 2512 -169 -1062 206 -1239 -597 2160 997 -835 -263
$$ packed form
889A01j89l40P67J33p75L40K78p36L92N29q20K23P13r85j61J177q01n88J488m07
909C39j229J159K7j200J344M67j778P72R41j840N49K035j745q64J981j004j167
926a213K248k60j927J651J52k152J625J349k391L42J859j887n23K128q99r88J649
943G63n99j221J506q3j285J404L87j621N64P32j064M18Q96q05k1K74r43N18R30
962G50q54K09M80j394J03J355p40Q4J038j621o29J870p38o28K252j109k389K332
980C71N25k484K347J318l711P27K557k708K10L344k741j712L637j409k650L899
996A520J64m044K652J822m089J125K956l198M0L398k616j734L284j257j938L757
1012A842j3l829J604J204k432J864K272k681q93J268j445O42K757j163j832N72
$$ plain form
1028 -263 -878 -1204 972 1511 287 -259 -1211 -1121 581 598 372 963 -677 -1601 507 502 -514 1240 679
1047 679 -1638 313 936 -1786 185 2294 -1033 -633 2052 -1531 -2432 2169 998 -1209 1886 161
1063 161 -3788 131 2340 -857 1199 2149 -3541 -2577 2661 437 -303 3005 -909 -4283 697 1992
1079 1992 -473 1977 1242 -3548 -1283 2087 -264 567 2463 -1670 -2694 1293 812 -656 1271 382
1095 382 -1785 -63 699 -530 273 447 -799 198 831 -625 -715 -83 93 863 766 -394 -460 -916 -911 1525
1115 1525 2001 -546 -817 -426 -1622 431 2864 253 -1190 7 -1707 -1181 2949 1531 -1859 16
1131 16 -190 -2340 1277 2917 -1333 -1101 1034 -1600 -748 2898 -71 -2098 1290 268 -1758 1532
1147 1532 1157 -2365 104 1867 -1053 -133 1431 -1686 -1319 2118 540 -860 824 -840 -2053 1158
$$ packed form
1028b63o15l26K176N39j224n46r52R0J702J7k26N91j640r24K108nj016J754n61
1047F79k317J951O23k722J971K109l327M00K685l583r01M601j171k207L095j725
1063A61l949L919K209l197K056R50n690R64N238k224p40L308l914l374M980J295
1079A992k465K450p35m790K265L370k351Q31J896m133j024L987m81j468J927q89
1095C82k167J722P62j229Q03J74j246R97O33j456r0O32J76P70r7j160o6m56NK436
1115A525M76k547k71L91j196K053K433k611j443J197j714N26M130j418l390J875
1131A6k06k150L617J640m250K32K135k634Q52L646k969k027L388j022k026L290
1147A532l75l522K469J763k920R20J564l117L67L437j578j400J684j664j213L211
$$ plain form
1163 1158 1788 -366 -33 -302 -1819 -115 1859 738 -129 -406 -1395 -513 1221 1049 345 -335 -1212 -560
1181 -560 613 678 728 18 -1331 -513 858 39 47 751 -779 -1087 970 402 -734 524 -17 -1158 845
1200 845 1048 -1199 -193 819 -1003 20 1852 -497 -1357 725 -115 -589 1592 439 -1646 91
1216 91 457 -910 862 1402 -1313 -972 809 -362 -144 1337 -261 -1289 342 134 -445 862 412
1233 412 -1063 -96 459 -292 242 556 -401 -283 316 -127 65 404 -294 -192 361 -129 -118 327 -231 -242
1253 -242 351 -118 -201 343 -158 -417 399 59 -438 333 179 -592 172 341 -457 173 552 -491 -167 458
1273 458 -388 -83 756 -170 -580 376 -80 -457 676 404 -740 -139 196 -346 393 631 -527 -397 186
1292 186 -237 154 837 -153 -854 24 178 97 601 115 -688 -211 107 129 719 250 -859 -497 309 288 367
$$ packed form
1163A158O30k154L33k69j517J704J974j121q67k77r89Q82J734j72p04o80q77O52
1181e60J173O5N0p10j349Q18J371q19QP04j530l08K057n68j136J258n41j141K003
1200H45K03k247J006J012j822J023J832k349q60K082q40m74K181j153k085J737
1216I1L66j367J772N40k715L41J781j171K18J481j598j028J631k08n79J307m50
1233D12j475R67N55p51N34L14r57J18N99m43J92L39o98J02N53m90J1M45n58j1
1253b42N93m69q3N44n01k59Q16l40m97P71j54p71P64J69p98O30L79j043L24O25
1273D58q46L05Q39r26m10R56m56l77J133k72j144O01L35n42P39K38j158J30N83
1292A86m23L91O83r90p01Q78J54q1N04m86q03M77L18K2N90m69j109L62Q06k1P9
$$ plain form
1313 367 292 -588 -729 70 358 502 364 -689 -898 143 582 400 327 -455 -974 -106 711 629 296 -398
1333 -398 -998 -194 836 682 261 -335 -969 -440 773 894 227 -438 -983 -536 642 989 253 -517 -966
1352 -966 -679 570 1134 370 -512 -937 -720 425 1222 560 -561 -998 -647 363 1230 809 -512 -1117
1370 -1117 -611 314 1152 938 -362 -1281 -827 417 1179 873 -277 -1229 -956 323 1154 887 -154 -1219
1388 -1219 -1134 272 1285 869 -260 -1061 -1035 64 1291 1083 -179 -1095 -1089 11 1395 1183 -295 -1170
1406 -1170 -929 -137 1076 1453 21 -1409 -1161 11 1111 1295 88 -1262 -1277 -76 1074 1351 274
1423 274 -1125 -1465 -209 1292 1353 129 -1006 -1261 -449 1018 1588 324 -1220 -1227 -381 769 1537 497
1441 497 -1296 -1290 -207 609 1361 822 -1219 -1643 -84 808 1009 1004 -740 -2010 -263 1184 914 825 -235
$$ packed form
1313C67p5q80j41P99K88J44j38j053k09J041M39j82p3p82n19Q68Q17q2l33o94
1333c98o00Q04J030j54m21n96o34N29J213J21o67o65n45M47J178L47p36p70m49
1352i66K87J249N64p64q82m25K17J145P97o62j121m37L51J010Q67m21j321o05
1370a117N06R25Q38k14j300r19M54J244P62l06j150r52K73J279Q31k67j041j065
1388a219Q5J406J013m16j129q01K6J099J227k08j262r16OJ100J384k12j478q75
1406a170K41P92J213L77j432j430K48J172J100J84j207j350j5J201J150K77j077
1423B74j399l40J256J501O1j224j135k55Q12J467N70j264j544pQ46J150P68j040
1441D97j793OJ083Q16P52n39k041m24J559Q92K01nj744j270J747J447k70q9j060
$$ plain form
1460 -235 -1923 -837 1315 1131 446 39 -1433 -1406 1056 1603 157 -286 -790 -1362 374 1727 369
1477 369 -708 -616 -899 1 1538 709 -958 -877 -325 116 1093 869 -657 -1223 -421 510 1150 791 -534
1496 -534 -1306 -676 644 1307 713 -410 -1099 -1095 185 1631 1025 -649 -1008 -818 -406 1207 1515 -425
1514 -425 -1096 -508 -577 510 1737 39 -1429 -194 59 -377 1188 848 -1395 -617 786 -234 141
1531 141 1020 -862 -1186 1020 539 -591 513 -132 -1491 496 1561 -438 -404 199 -1140 -357 1742
1548 1742 573 -805 -140 -565 -823 1097 1322 -414 -563 -294 -725 270 1310 254 -603 -379 -395 -174
1566 -174 595 583 -113 -484 -371 -35 109 180 268 -53 -375 132 167 -468 87 563 -313 -89 589 -447 -672
1587 -672 721 254 -430 692 171 -1222 155 877 -568 137 1021 -944 -903 1014 -52 -659 1061
$$ packed form
1460b35j688J086K152j84o85m07j472K7K462N47j446m43n04n72J736J353j358
1477C69j077R2k83R00J537q29j667Q1N52M41R77k24j526n66Q02R31O40l59j325
1496e34p72O30J320O63n94j123o89MJ280J446o06j674l59J90M12J613L08j940
1514d25o71N88o9J087J227j698j468J235K53m36J565l40k243P78J403j020L75
1531A41Q79j882l24K206m81j130J104o45j359J987J065j999L4O03j339P83K099
1548A742j169j378O65m25k58J920K25j736j49K69m31R95J040j056q57K24j6K21
1566a74P69j2o96l71J13L36J44P1Q8l21l22N07L5o35N55M76q76K24O78j036k25
1587f72J393m67o84J122n21j393J377P22j445P05Q84j965M1J917j066o07J720
$$ plain form
1604 1061 133 -1325 380 536 -985 403 1185 -912 -563 851 -615 -591 1337 356 -897 312 -12
1621 -12 -938 640 1084 -461 -230 158 -841 -138 1176 287 -474 -46 -411 -446 611 604 -204 -323 -288 -224 263
1642 263 445 50 -287 -329 17 423 154 -101 -88 -395 -35 799 201 -542 -83 -218 -317 963 849 -869
1662 -869 -702 110 -273 525 1395 -435 -1381 5 50 93 1486 381 -1728 -595 547 9 874 1102
1680 1102 -1176 -1298 513 416 327 1028 -509 -1596 184 851 64 505 68 -1368 -360 1078 408 -41
1698 -41 -29 -919 -573 1010 779 -228 -367 -686 -577 802 1154 13 -720 -801 -350 786 1166 289 -656
1717 -656 -1028 -529 776 1288 357 -553 -1074 -802 641 1316 364 -520 -904 -944 320 1473 488 -714 -749
1736 -749 -689 1 1347 869 -783 -898 -402 24 1158 1077 -715 -1131 -255 183 849 1230 -376 -1515 -438
$$ packed form
1604A061r28j458J705J56j521J388P82k097L49J414j466K4J928r81j253J209l24
1621a2r26J578M44j545K31L88r99P03J314q89p61M28l65l5J057pq08j19L5O4M87
1642B63J82l95l37m2L46M06k69k55J3l07L60Q34n98p43M59j35r9J280j14j718
1662h69J67Q12l83P98Q70j830r46J386M5M3J393j105k109J133J142n38Q65K28
1680A102k278j22J811r7q9P01j537j087J780O67p87M41m37j436J008J438o70m49
1698d1J2q90L46J583k31j007j39l19J09J379L52j141p33q1M51J136L80q77r45
1717f56l72M99J305N12r31r10n21K72J443O75r52q84l84m0J264J153r85j202l5
1736g49O0O90J346m78j652j15M96M26J134q1j792m16Q76M38O66L81j606j139J077
$$ plain form
1755 -438 520 768 998 -56 -1486 -843 503 849 919 141 -1360 -1158 460 1060 708 141 -980 -1243
1773 -1243 107 1108 868 124 -877 -1167 14 1065 809 89 -678 -1013 -185 932 887 59 -732 -961
1791 -961 -135 927 827 -4 -660 -891 -182 898 913 14 -733 -906 -191 913 1025 -18 -768 -814 -292
1810 -292 793 1131 117 -830 -896 -301 710 1144 230 -853 -936 -305 523 1079 436 -775 -1004 -326 468
1829 468 986 554 -595 -942 -366 412 869 610 -399 -949 -349 420 757 536 -235 -860 -462 440 729
1848 729 423 -237 -750 -474 310 649 349 -211 -698 -505 256 700 367 -301 -621 -366 212 578 404 -167
1868 -167 -621 -423 257 660 410 -193 -546 -340 200 538 407 -101 -544 -452 148 563 341 -117 -440 -415 48
1889 48 452 363 -97 -395 -390 -37 425 389 -110 -370 -263 -55 248 402 28 -343 -233 51 206 257 103 -275
$$ packed form
1755d38R58K48K30j054j430O43J346L46P0p78j501K02J618O00l52n67j121k63
1773a243J350J001k40p44j001k90J181J051k56p20p67l35Q28J117m5q28p91k29
1791i61Q26J062j00q31o56k31P09J080J5q99p47j73P15J104J12j043p50m6N22
1810b92J085L38j014r47o6N95J011M34r14j083q3O31Q28N56o43j211k29O78P94
1829D68N18m32j149l47N76P78M57k59j009n50O00P69L37k21p71o25L98R02K89
1848G29l06o60n13K76P84L39l00n60m87J93P61M44l33o68l20K55N78L66j74n71
1868a67m54J98O80M03k50o03l53K06N40L38j31n08m43R2O00M15k22m58l23K5M63
1889D8M04q9m60k98NL53M62l6m99k60J07K08L03J54l74l71J10K84J55N1j54l78
$$ plain form
1911 -275 -266 116 184 96 50 -137 -270 15 268 55 -65 -50 -164 -65 244 115 -108 -48 -57 -86 156 196 -110 -98
1935 -98 92 -29 -22 199 29 -200 52 115 -114 26 115 -90 -62 97 -78 -196 89 84 -115 54 69 -271 -118
1958 -118 301 134 -78 18 -107 -264 132 388 73 -120 -82 -245 -41 471 216 -274 -107 -43 -207 232 516
1979 516 -169 -422 14 -1 36 350 -3 -526 -89 242 7 154 161 -476 -402 414 380 -41 66 -246 -515 222
2001 222 713 113 -159 -189 -477 -33 759 472 -338 -370 -288 -209 507 697 -136 -557 -316 -64 199 645 181
2022 181 -603 -489 123 214 317 322 -367 -627 86 481 149 103 -88 -547 -146 722 304 -359 -182 -295 -266 649
2044 649 700 -413 -622 -145 -177 369 1040 -39 -1040 -335 160 202 901 517 -966 -799 204 287 565 721
2064 721 -534 -1136 19 500 251 552 16 -1020 -430 584 388 149 94 -633 -571 449 574 -36 -115
$$ packed form
1911b75RL82O8q8m6j87j33K85K53k13j20J5j14R9L09j29k23O0rk9K42M0l06J2
1935i8J90j21PK21j70k29K52O3k29J40Q9k05K8J59j75j18K85nj99J69J5l40J53
1958a18M19j67k12R6j25j57L96K56l15j93L8j63K04N12k55m90J67O4j64M39K84
1979E16o85k53M36j5L7L14l53n23M37L31k35J47Po37P4Q16l4m21J07l12k69P37
2001B22M91o00k72l0k88M44P92k87q10l2Q2P9P16J90q33m21K41K52K63M46m64
2022A81p84J14O12R1J03No89k60P13L95l32m6j91m59M01Q68m18o63J77j13K9R15
2044F49N1j113k09M77l2N46O71j079j001P05M95M2O99l84j483J67J003Q3K78J56
2064G21j255o02J155M81k49L01n36j036N90J014j96k39n5p27O2J020J25o10p9
$$ plain form
2083 -115 -280 -419 257 752 80 -493 -318 -63 260 621 328 -472 -730 -30 499 592 353 -324 -932 -350
2103 -350 644 637 227 -86 -761 -830 457 988 150 -174 -329 -848 -50 1064 386 -407 -166 -504 -406 798
2123 798 713 -499 -317 15 -414 373 925 -333 -712 193 56 13 713 36 -915 -93 491 64 357 230
2143 230 -883 -543 578 440 123 172 -559 -806 252 712 285 37 -398 -735 -2 709 469 20 -338
2162 -338 -552 -210 457 538 187 -347 -498 -100 290 338 219 -147 -481 -98 351 186 165 5 -496 -121 576
2183 576 197 -164 119 -279 -350 534 483 -309 -161 -63 -414 312 776 -215 -483 75 -277 -74 802 161 -657
2204 -657 -99 27 -254 478 483 -526 -345 194 -126 142 545 -207 -485 196 72 -42 421 94 -464 17
2224 17 262 -61 126 133 -348 -97 313 -20 -7 84 -254 -157 252 95 -61 -27 -229 -170 229 141 -31 62 -170
$$ packed form
2083a15j65j39O76M95o72n73J75K55L23L61k93q00k58P00N29R3k39o77o08N82
2103c50R94pm10l13o75o9J287N31q38l24j55n19P98J114o78p93K41l38R8J204
2123G98q5j212J82L32m29P87N52j258l79R05j37m3P00o77r51Q22N84m27K93j27
2143B30j113L40J121j38l17M9p31k47J058M60m27k48m35l37P33P11k40m49l58
2162c38k14L42O67Q1l51n34j51L98L90M8j19l66l34L83M49j65k1j60n01L75O97
2183E76l79l61K83l98p1Q84n1p92J48R8l51P26M64r91k68N58l52K03Q76o41q18
2204f57N58J26k81P32Nj009J81N39l20K68M03p52k78O81j24j14M63l27n58M81
2224A7K45l23J87Pm81K51M10l33J3R1l38R7M09j57j56L4k02N9L99q8j72R3k32
$$ plain form
2247 -170 -248 273 222 -93 48 -27 -284 195 308 -130 34 125 -276 -16 370 -106 -196 224 -83 -215 293 24
2269 24 -285 176 90 -267 173 162 -368 -19 335 -204 -104 257 -174 -182 314 10 -197 193 -28 -281 244 186
2291 186 -230 41 147 -213 56 275 -147 -105 137 -97 -17 256 -96 -210 139 0 -86 228 0 -253 49
2312 49 112 -43 158 101 -257 -43 185 -12 88 148 -239 -143 221 27 -50 115 -158 -275 160 168 -37 64 -124
2335 -124 -288 133 282 -66 1 -3 -265 -6 346 62 -73 -5 -225 -79 311 145 -155 -30 -126 -146 241 253
2357 253 -159 -143 -81 -134 154 260 -93 -212 -50 -125 42 280 0 -289 -84 -15 63 252 72 -239 -77 34
2379 34 53 180 111 -221 -171 117 156 120 56 -184 -185 66 149 153 43 -204 -247 79 204 153 33 -178 -271 -2 216
2404 216 178 53 -154 -268 -40 243 186 39 -94 -284 -84 256 228 31 -64 -215 -143 151 239 44 -81 -155
$$ packed form
2247a70p8N21n1l15J41p5k57M79J13m38J64R1m01K60L86m76r0M20l07j32N08k69
2269B4l09M61q6l57M40j1n30L49L54n39J00L61m31qM96l04k07L90k21k53N25n8
2291A86m16K71J06l60K69K19m22M2K42k34Q0K73l52j14L49j39q6L14k28k53L02
2312D9O3j55K01n7l58K14K28j97J00O0l87R6L64j94p7J65k73j17M35Qk05J01j88
2335a24j64M21J49l48O7mk62K59L52k84j35O8k20J46L90j66l00J25r6k0L87J2
2357B53m12J6O2n3K88J06l53j19J62p5J67K38k80k89K05O9P8J89j80l11J62J11
2379C4J9J27o9l32N0K88L9l6o4k40jK51Q3Mj10k47m3L26J25n1j20k11r3K69K18
2404B16l8j25k07j14K28K83n7j47j33j90K00L40k8j97r5j51P2K94Q8j95j25p4
$$ plain form
2426 -155 -143 116 297 32 -136 -65 -68 11 228 141 -108 -162 -22 52 151 133 -138 -211 28 84 71 121 -25 -266 -99
2451 -99 197 106 21 -20 -155 -152 119 175 -14 -22 -76 -203 65 262 42 -146 8 -55 -37 225 144 -152 -91 58 -9
2476 -9 130 195 -132 -208 48 97 56 151 -25 -283 -58 126 96 84 -5 -197 -173 54 148 75 5 -99 -147 -28 191
2501 191 121 -16 -60 -92 -59 62 188 40 -106 29 32 -50 89 114 -85 -35 150 -70 -79 181 -71 -165 202 92
2525 92 -212 16 81 -249 -9 311 -92 -149 109 -128 -139 306 127 -232 72 60 -266 72 345 -149 -158 121
2547 121 -141 -181 253 58 -168 115 26 -230 87 181 -127 17 179 -114 -115 178 20 -33 144 42 -161 -2
2569 -2 41 -47 57 108 -47 -129 -64 -13 52 32 63 -60 -170 -64 75 9 40 117 -108 -193 94 36 -120 187 140 -203
2595 -203 -48 204 -141 33 304 -62 -202 191 -34 -254 228 177 -236 72 134 -305 3 333 -119 -133 235
$$ packed form
2426a55J2K59J81k65j68P1lP9K17q7k49n4J40P4R9j8k71p3K39N6j3N0j46k41J67
2451i9K96r1q5m1j35LK71N6j89qn4j27K68J97k20j88J54o3J8K62q1k96O1J49o7
2476iJ39O5l27p6K56M9m1R5j76k58K25J84l0j2q9j92K4K27R4p3p0j04m8J19K19
2501A91p0j37m4l2L3J21J26j48j46J35Lq2J39K5j99N0J85k20rK60k52r4L67j10
2525I2l04K28O5l30K40L20m03n7K58k37j1M45j79l59L04j2l26L38K73m94rK79
2547A21k62m0M34j95k26K83q9k56L17R4l08J44J62k93jK93j58n3J77j02k03J59
2569bM3q8J04N1j55q2O5N1O5k0L1j23j10J06J39o6L1P7k25q5K87n8j56L07m7l43
2595b03J55K52l45J74K71l66j40L93k25k20M82n1m13L08O2m39L08L30m52j4L68
$$ plain form
2616 235 -177 -298 274 122 -221 99 65 -349 8 295 -109 -20 183 -212 -214 280 70 -106 161 77 -273 -3
2638 -3 192 -58 -1 65 -69 -70 76 12 -36 38 -2 -89 -18 -8 -46 -30 43 87 -45 -88 3 1 -93 92 155 -110 -108 -10 -108
2667 -108 -7 253 25 -175 37 -79 -169 197 226 -180 -44 70 -184 29 318 -48 -206 127 -49 -175 246
2688 246 147 -245 14 117 -182 27 260 -147 -137 182 -9 -129 161 12 -208 84 116 -107 21 67 -199
2709 -199 -87 174 9 -84 52 -87 -153 112 160 -26 -58 -65 -96 29 156 84 -19 -73 -61 1 126 124 25 -129 -102
2734 -102 52 77 43 29 -30 -171 9 89 -9 23 -28 -173 -40 146 30 -80 -11 -100 -95 159 147 -83 -61 -38 -105
2759 -105 132 234 -43 -143 -10 -62 37 267 70 -192 -65 22 -16 174 153 -164 -205 -43 19 79 132 -45 -205
2782 -205 -71 55 40 114 9 -183 -105 59 54 63 29 -92 -106 51 78 58 12 -96 -110 89 98 50 -12 -106 -91 24
$$ packed form
2616B35m12j21N72j52l43L20l4m14L57K87m04Q9K03l95kM94k10j76K67q4l50K70
2638cJ95k50N7O6j34jJ46o4m8P4m0q7P1J0l8J6P3M4j32m3R1kr4J85O3k65KR8r8
2667a08J01K60k28k00K12j16r0L66K9m06J36J14k54K13K89l66j58L33j76j26M21
2688B46r9l92K59J03k99K09K33m07J0L19j91j20K90j49k20K92L2k23J28M6k66
2709a99J12K61j65r3J36j39o6K65M8j86l2pl1J25J27p2j03n4J2O2J25kr9j54K7
2734a02J54K5l4j4n9j41J80Q0r8L2n1j45J33J86j16j10O9q9NK54j2k30K2K3o7
2759a05K37J02k77j00J33n2R9K30j97k62J27Q7l8J90k1l17m1J62O2O0N3j77j60
2782b05J34J26j5P4j05j92P8J64nRl4j21j4J57K7k0m6j08j4J99Rm8o2r4J5J15
$$ plain form
2808 24 126 80 -23 -129 -102 38 130 73 -13 -124 -142 14 119 98 34 -113 -151 -3 169 129 -27 -89 -102 -93 81
2833 81 146 -7 -119 -135 -59 66 136 26 -88 -70 -71 42 160 89 -80 -92 15 92 129 52 -44 -119 -26 43 126 105
2859 105 -82 -154 -37 60 74 65 -47 -173 -74 35 99 46 -21 -152 -83 69 99 39 -15 -147 -88 27 120 68 -31 -66
2885 -66 -43 34 116 96 -5 -76 -95 38 126 80 -14 -76 -83 5 81 95 -10 -90 -79 -11 83 78 -53 -96 -74 -41 80 58 -7
2914 -7 -61 -78 -22 85 87 -5 -22 -26 -3 20 82 32 -78 -37 15 18 70 17 -79 -30 29 30 8 42 -27 -100 -6 56 -3 28 3 -73
2946 -73 -19 55 -3 13 35 -69 -59 43 53 -33 14 -22 -62 -32 27 33 -11 7 -12 -45 -1 31 0 6 25 -45 -22 67 30 -3
2976 -3 66 0 -58 23 98 17 -11 45 -24 -5 53 38 -35 -22 -9 -39 54 65 -51 -86 14 -25 -15 83 19 -134 -73 24 -2
3005 -2 56 38 -93 -121 35 78 71 84 -26 -199 -52 136 106 57 -3 -106 -128 87 177 46 -16 -83 -147 -7 159 70
$$ packed form
2808B4J02m6j03j06K7J40R2n7q6j11j8J56J05k1o4j47l8J48J72m0j56o2j3RJ74
2833H1O5j53j12j6P6J25P0j10j14J8jJ13J18p1j69j2J07P7L7p7r6p5R3O9Q3k1
2859A05j87p2J17R7J4rj12j26R9J09O4n3o7j31O9J52L0o0n4j32N9J15R3n2r9l5
2885f6K3P7Q2k0j01p1j9J33Q8m6r4o2pQ8P6J4j05q0J1O8R4nj31m3K2L3J21k2o5
2914gn4j7N6J07Kr2j7mK3K3O2n0j10M1N2LN2n3r6M9N9Jk2L4o9p3R4O2n9L1k5p6
2946g3N4P4n8J6K2j04J0J02J0q6M7l6m0L0N9Om4J8j9l3M4L2l1OJ9p0K3Q9l7l3
2976cO9o6n8Q1P5q1k8N6o9J9N8j5p3J3J3l0R3J1j16l5J00l9J0R8o4j53O1R7k6
3005bN8j8j31k8J56M3pJ3j10j73J47J88l0m9o0j03k2K15R0j31o2o7o4J40J66q9
$$ plain form
3031 70 -98 -52 -80 -51 106 145 -59 -121 7 2 50 170 -26 -206 -19 93 35 97 85 -199 -136 162 146 21 31
3056 31 -135 -245 88 245 69 10 -73 -265 -73 318 167 -96 -92 -161 -130 210 292 -62 -132 -107 -126 97 269 45
3080 45 -191 -124 -63 49 200 84 -188 -201 32 69 103 86 -103 -207 -53 171 145 11 -81 -181 -91 211 208 -5
3104 -5 -148 -154 -90 135 339 114 -241 -168 -28 32 277 204 -226 -297 -42 32 176 284 -109 -372 -109 129 75 184
3128 184 68 -351 -190 191 136 88 72 -188 -236 166 233 27 -6 -65 -227 71 342 62 -122 -85 -145 8 284
3151 284 147 -159 -169 -112 -13 221 253 -100 -254 -128 23 176 185 4 -251 -205 29 212 186 16 -136 -209 -30
3174 -30 186 196 -28 -123 -181 -78 187 248 -26 -145 -98 -67 107 255 23 -231 -64 37 48 192 113 -235 -142
3197 -142 69 41 108 146 -177 -269 57 147 22 111 -38 -296 -72 225 78 31 22 -255 -153 200 162 -19 21 -132
$$ packed form
3031G0j68M6k8K9J57L9k04o2J28nM8J20j96j80J87J12n8O2j2k84O3K98j6j25J0
3056C1j66j10L33J57j76n9q3j92J92L91j51k63Mo9L1L40Q2l54p0K5j9K23J72k24
3080D5k36O7O1J12J51j16k72j3K33L7L4j7j89j04J54K24k6j34r2j00R0L02lk13
3104ej43oO4K25K04k25l55P3J40O0K45p3m30p1K55P4J44J08l93k63K63K38n4J09
3128A84j16m19J61L81n5m8j6k60m8M02O7k06l3n9j62K98K71k80j84L7o0J53K76
3151B84j37l06j0N7R9K34L2l53j54J26J51J53Rj81k55M6K34J83k6j70j52p3J79
3174c0K16J0k24r5n8J03K65O1k74j19M7L1J74J48k32k54J67J01J1J44p9l48R3
3197a42K11k8O7L8l23r2L26R0j25Q9j49k58K24K97j47m7rk77J02L53l8j81M0j53
$$ plain form
3221 -132 -186 110 195 21 -59 -62 -97 50 191 63 -84 -23 -81 31 159 78 -77 -87 -40 42 130 31 -67 -103 -105 -12
3247 -12 84 37 -102 -102 -77 -29 135 68 -99 -36 -31 -38 124 131 -45 -94 4 -15 53 157 -1 -121 13 32 24 132 42 -128
3275 -128 -10 83 -17 53 81 -82 -87 46 9 -22 46 -11 -106 27 44 -68 27 44 -116 9 102 -33 -25 57 -19 -37
3301 -37 42 17 -25 50 -33 -24 84 28 -45 26 44 -27 6 2 -10 40 16 -34 6 10 -35 16 71 -25 -49 25 -45 -1 85 -16 -60
3332 -60 -16 -23 -24 69 7 -81 -35 30 -14 53 64 -85 -95 -6 26 85 94 -57 -90 1 48 57 100 -21 -117 -9 63 85 88 27 -121
3363 -121 -30 71 79 72 1 -137 -104 36 94 65 -4 -121 -89 19 83 44 -17 -104 -119 33 153 29 -63 -83 -93 10
3389 10 140 80 -54 -84 -92 22 158 115 -30 -123 -84 6 167 164 -20 -156 -133 9 170 161 -38 -143 -94 -43 121
3414 121 167 -22 -193 -177 -17 113 132 2 -162 -139 -39 89 175 74 -117 -146 -27 105 164 83 -119 -148 -26
$$ packed form
3221a32n4K96Q5j74q0ll5J47J41j28j47O1n8J12J28q1j55j0M7Q2Q8r9r8l6kR3
3247a2R6m7j39%K5M8J64o7j67O3NpJ62Pj76m9R8j9O8J04j58j20J34J9qJ08r0j70
3275a28J18R3j00P0K8j63nJ33l7l1O8n7r5J33J7j12R5J7j60J25R3j35QQ2p6j8
3301c7P9k5m2P5q3RJ08n6p3P1J8p1L3mj2N0k4n0M0Mm5N1N5r6k4P4p0M4Q6j01m4
3332f0M4pjR3o2q8M6O5m4O7J1j49j0Q9L2N9Rj51l3R1M7RM3j21r6J08P2K2Lo1j48
3363a21R1J01Qpp1j38L3J40N8k9o9j17L2J08O4l9o1q7j5J52J20j24r2k0j0J03
3389A0J30o0j34l0qJ14J36m3j45r3L9R0J61lj84j36K3J42J61rj99j05M9N1J64
3414A21M6j89j71J6J60J30J9j30j64K3J00J28Q6j01j91k9J19J32N9q1k02k9J22
$$ plain form
3437 -26 118 151 69 -93 -189 -58 171 166 25 -82 -174 -76 167 189 72 -109 -162 -93 123 177 52 -119 -195 -71
3461 -71 65 151 57 -123 -187 -97 62 165 103 -81 -180 -57 126 166 88 -75 -171 -77 113 197 77 -61 -102 -121 93
3486 93 205 114 -93 -116 -61 72 219 113 -72 -155 -116 16 167 171 -91 -187 -112 46 136 141 -46 -188 -127 28 129
3511 129 97 4 -153 -126 60 164 93 41 -80 -137 30 172 98 -25 -66 -70 -31 158 141 -35 -104 -67 -12 144 172
3536 172 -45 -134 -69 3 44 142 12 -178 -107 42 75 96 75 -84 -127 27 119 78 31 -50 -123 -17 122 84 21 15
3562 15 -95 -33 95 144 12 -53 -45 -11 28 120 21 -77 -36 9 50 90 28 -77 -76 18 63 36 48 -56 -115 -3 85 29
3590 29 15 -9 -112 -52 61 83 -35 -15 -27 -91 10 126 22 -45 19 -39 -8 105 63 -36 21 16 -39 49 82 -30 -31
3617 -31 55 4 -21 28 6 -56 31 20 -19 -32 2 -72 -31 52 19 -63 -6 -42 -60 4 43 -20 -41 24 23 -15 20 55 -50 -1
$$ packed form
3437b6J44L3q2j62r6J31K29nj41j07r2R8K43K2j17j81n3O9K16N4j25j71p6J24
3461g1J36Q6r4j80o4R0J59J03o2j84r9J23J83M0p8j63r6R4J90Q4j20j38m1j9K14
3486I3J12r1k07k3N5J33J47j06j85q3L9J32J51Mk62r6P5J58R0Nj87j42O1J55J01
3511A29l2r3j57K7J86J04p1n2j21n7J67J42p4j23m1mL9J89j7j76o9L7N5J56K8
3536A72k17q9O5P2M1R8j30j90P1J49L3K1k1j59m3J54R2m1m7q1p3J06J39l8o3o
3562A5j10O2J28M9j32o5QL4L9R2r9r8M1M5M1M0o2j05JR4M5k7J2j04n9J12Q8n6
3590B9j4k4j03O0J13K2j18K0j2o4J01J16j04o7O4n8L1J13m2r9N7nn5Q8L3j12j
3617c1Q6n1k5M9k2o2Q7j1l9j3L4p4M1Q3l3q2N7l6j8O4L9o3k1O5jl8L5L5j05M9
$$ plain form
3647 -1 52 -14 17 29 -11 24 35 25 -59 19 24 -7 26 18 -23 -67 42 37 -12 19 4 -72 -23 36 -3 25 22 -48 -58 54 49 -19
3679 -19 -14 -3 -64 13 87 -9 7 15 -27 1 56 58 -37 -29 4 1 15 43 -29 -74 47 38 0 36 -9 -84 -36 51 65 -3 -3 -75 -46
3712 -46 58 39 27 -58 -71 -80 29 68 22 -41 -41 -25 -2 106 56 -53 -65 -15 35 92 85 -12 -67 -43 25 52 68 56 -101
3741 -101 -52 81 73 45 24 -49 -100 46 81 20 -32 -67 -86 -12 93 82 -48 -74 -52 -13 87 67 -26 -79 -58 -8 63 116
3769 116 31 -88 -54 22 66 77 30 -59 -57 4 95 78 -3 -53 -70 23 95 49 16 -64 -51 -16 80 89 -8 -68 -82 -31 53 106
3799 106 -10 -80 -59 9 49 93 36 -94 -67 -8 66 88 24 -72 -87 25 76 66 55 -50 -93 -26 96 92 28 -40 -80 -54
3827 -54 57 100 32 -28 -62 -7 93 57 30 -56 -78 -22 49 78 17 -39 -88 -16 30 76 49 -31 -66 -45 46 94 48 -45 -74
3856 -74 -15 64 89 53 -8 -70 -34 58 67 47 -27 -38 -23 -14 54 58 -28 -42 -9 13 46 58 -17 -94 -42 21 51 14 -20 -65 -36 26
$$ packed form
3647aN3o6L1J2m0L5J1j0q4P8Nl1L3qm1m4J09nm9L1j5p6M9N9l9K8lp0j0J12no8
3679a9NJ1o1P7P4r6J6Qm2K8N5Kr5QL3lJ4K8p2m5J21rl8L6m5p5M8Q7J4o8%p2K9
3712d6J04j9j2q5j3rJ09L9m6o3%J6K3J08n0j09j2N0N0N7pr7n5K4O8K7J6j2j57
3741a01M9J33qk8k1p3n1J46L5o1n2l5j9P4J05j1j30k6K2L9J00k0r3n3K1N0P1N3
3769A16q5j19L4P6M4J1m7q9KO1R1j7q1n0j7R3P2m6l3q0J3L5R6Rr7o0j4N1Q4N3
3799A06j16p0K1O8M0M4n7j30K7N9P4K2o4r6j5J12N1j0j1j05m3O7J22mo4o8m0K6
3827e4J11M3o8o0l4N5J00l6k7q6k2N6P1K9o1n6m9P2M6M6k7q0l5K1R1M8m6r3k9
3856g4N9P9K5l6o1o2L6R2Rk0p4j1J5RO8Mq6j4L3K2L3J2p5p7N2O3L0l7l4m5K9O2
$$ plain form
3888 26 61 57 -8 -51 -3 22 47 23 -1 -51 -35 27 79 49 20 -36 -34 29 47 39 23 -43 -36 34 49 53 -26 -36 -65 -14 32 30 -21
3921 -21 -37 -31 10 32 25 -11 -7 -21 15 49 32 7 -33 -10 24 17 46 4 1 31 20 55 36 -6 -31 35 39 36 37 23 7 9 30 16 33
3956 33 19 -10 32 29 11 -8 21 -26 -22 -10 31 33 -32 0 -14 26 17 8 -9 30 -7 -15 33 51 -7 -21 29 20 43 1 -4 -19 32 21
3990 21 -11 23 33 -2 37 31 17 -10 35 24 -4 12 11 -32 -7 -4 16 10 15 -18 -31 -4 2 -1 26 9 -42 -30 28 20 0 24 -23 -18 44
4025 44 60 -6 6 4 -11 17 63 22 -14 14 -7 -14 43 -8 -28 -17 42 12 -1 22 14 -48 10 36 7 14 -7 -31 -36 31 44 3 -10
4058 -10 2 -19 3 39 1 -5 -12 -26 -9 54 6 -34 2 10 -10 37 64 12 -12 36 -8 10 9 -16 -35 20 28 -1 4 6 -25 -11 30 8
4092 8 -8 -12 -35 -21 11 40 24 0 -11 -42 -17 65 53 -24 -27 -34 -31 14 69 -3 -45 8 -21 -4 52 21 -42 -3 26 1 14 24 -27
4125 -27 1 19 28 8 9 22 -20 -30 18 -33 -42 6 -32 -16 11 5 -28 -3 -4 -3 -2 48 5 -46 5 22 7 44 8 -22 -29 56 16 21 50
$$ packed form
3888B6L5mo5m3M8K5K5k4k4n0J6O2N2l0k9n6KO3J8qj6o6PP0J5Mp9j0k9N1M6kn1
3921b1j6OM1K2pl6Mj4L6L4j7k5m0K3L4pK9m2lL0j1L5j9m2k5O6MlJj4j6KK1j4J7
3956C3j4k9M2lj8j9K9m7MJ2M1Ko5L2j4M0rrj7L9l7qM8J8n8j4N0rK3m2nj5N1j1
3990B1l2L4J0l5L9oj4k7M5j1k8J6jm3K5LK0oNl3j3K7OlK7j7n1J2N8qk0K4m7NO2
4025D4J6o6J2kj5K8M6m1l6K8k1pN7n1k0J1N9l0j3K3qo2N8K6k9Pk1k4nO7J3m1j3
4058a0J2k1K2L6l8opj4J7O3m8m0L6Qk0M7K7n2k4M8m4J8jk5j9N5Qk9NKl1J4M1k2
4092Hj6mk3J4L2K9j6k4j1l1K5Q2j2p7lpLM5N5p2m2N3k9J7N6l1o3L9K9k5J3J0n1
4125b7K8J8Rk0JJ3m2j0M8n1rM8l8J6K7ol3K5jJJN0m3n1N1J7j5L7l6l0pQ5m0NK9
$$ plain form
4160 50 -36 -25 8 2 -10 20 -2 -38 -13 48 -13 -13 -3 -27 -14 1 16 -23 -27 4 -19 -16 31 18 -37 -2 -11 10 31 16 -31 12 3
4193 3 16 17 22 -10 -27 30 23 14 16 11 -39 -1 13 12 1 18 -17 -11 -2 29 -37 -15 -12 -33 -6 15 15 -56 -17 8 10 -11 27 -39 17 -80 -77
4230 -77 -14 57 -118 2 10 -11 -49 -110 56 -4 75 3 59 -20 -8 -20 -5 7 49 -3 7 -3 -40 21 45 0 -79 -44 4
4259 4 -9 24 7 -17 -16 23 -68 -16 -46 -13 31 36 81 24 7 25 -3 48 34 41 17 1 -10 36 7 14 -4 -10 32 -23 1 9 -8 3
4293 3 12 -19 0 -25 10 -36 -21 10 -5 -20 3 -19 -13 -13 1 -6 -2 -15 -1 -28 13 3 -30 1 -9 39 37 19 -14 -7 29 24 -5 18 -3
4328 -3 -9 -7 3 9 -4 12 -9 -21 12 15 -5 -21 5 10 0 15 22 -18 -23 -11 -2 29 -7 1 -38 6 -13 -12 6 -28 5 -5 15 14 17 36 5
4365 5 6 27 37 13 15 -2 35 -10 4 16 -1 -29 20 15 -13 10 16 -14 -5 13 -1 6 -4 -16 2 11 20 -7 0 -3 0 10 -11 5 38 22
4401 22 0 5 34 3 31 27 -8 -13 19 7 29 33 -13 -25 -6 17 11 8 -4 -25 -21 -5 22 -11 -22 -32 -25 -17 -9 -3 6 -16 -13 18 8 23 0
$$ packed form
4160E0q6J1L3oj2L0k2l6K5O1o1%J0k4J3J5J5l9mL1k3LM7j3n5L5rK1K1j5m7M3r
4193CJ3JNl2j7N7prKnn0L8J4jj1J7l5ORL1o6K2Lk1K7K1%p1L9K5Kk1L8o6N6r7L
4230g7O3P1j75J20Qk1l8o1J66o0P9p2N6p9J2j2J5J2M2n2J0j0l7O1K4m5p9L5M8
4259Dj3L3j7k4JL9r1N2l0L3M4NM5n7j7J8k8N1j4Pk4j6j1M6k9Pj8oM2n5K4Qj7J1
4293CRl1J9k5L5m6J5L1j5j5K3k2O%J4pMj3J4k7M1j0l3L1j0M8kj8l3PL6nk9K3k1
4328coKJ0Oj3J6k1j2L3Lk0j6K6Nj0J5Pm0nJ2RL1l6Ql9M4j9JJ8l4L3j0K0jLJ9l1
4365EJK1J0k4Kj7L7m5J4J2j7k8M9nk8K3Ol0RJ8j4Pj0j2J8RRk7PlLJ0k1J6L3j6
4401B2k2NK9l1K8ml5nL2j2K2Mm6j2J9K3olj2k1MJ6K7l3j1j0PQQORk2LL1j0J5k3
$$ plain form
4438 0 10 -19 12 21 44 -10 -3 -9 4 19 20 -12 0 2 24 18 26 0 -8 14 13 31 13 11 -32 -4 -4 23 5 -16 -18 -29 -17 13 -1 -4 -7 -47
4476 -47 -21 26 10 -14 -30 -17 0 27 42 13 -9 -3 20 28 34 37 -17 -10 12 38 2 -4 4 -63 2 36 44 -2 -6 -33 5 15 20 -1 -2 -52
4512 -52 -20 -1 34 7 -19 -26 -33 9 17 -2 -5 -23 -4 7 18 20 -3 -37 -3 18 47 38 4 -5 -10 38 44 66 1 -3 -14 37 67 -5 15
4547 15 -14 -23 10 -11 -5 -25 -56 -24 -17 35 29 -32 -32 -5 -12 32 28 10 -26 -18 16 23 14 13 -29 -24 13 30 35 6 -29 -32 19 28 26 12 5 -11 -30
4586 -30 23 25 -1 6 -5 -20 18 15 -18 -16 -32 -24 -11 20 -22 -41 -13 14 13 19 2 -30 -20 18 11 13 26 26 -26 -8 32 31 -14 11 -16 -33
4622 -33 16 25 -12 10 -31 -7 -1 34 24 -1 11 11 -3 -11 11 -20 -17 11 -21 0 -18 6 -14 -23 18 20 -1 -17 -32 -3 0 -4 23 23 31 -34
4658 -34 13 22 32 3 20 -15 1 14 18 0 3 7 -35 5 13 -23 8 -1 -39 -17 11 6 -37 3 -3 -29 -37 23 -11 -16 -5 -14 -10 19 3 -7
4694 -7 16 7 9 29 42 -4 -4 13 14 -12 40 12 -12 29 5 -7 8 26 -20 -15 13 -8 -8 -8 2 -18 -43 2 28 2 1 -5 -23 -5 46
$$ packed form
4438@J0k9L1RK3n4PoJ3J5Jl2J2KK2oQk6qK2jJ8j8km3K8%K7j8k1kj1J2L0j4llm0
4476d7K6M7j6k4j6J3J7K7J5k9k2OK3QOLn4PK2K6l6oQo7O5L4Qm6mk7L8J0Nk1jn0
4512e2L2J9L5k7k6ppM2Qj9lj8J9J1J1Kk3l4L4K1K9rl4rnM8OK2o5mj1N1L0p2K0
4547A5k9rL3k1Ok0l1L2PN2oo1%K7pM4mj8l6QL4Prjm2NL7J7Nk9l5lN1Rkj4pj6j9
4586c0N3Kk6Pj1j5L8ll3Kj6QJ3L1m2j9K8K7jOj7l2J0L8pKJ3%n2J8M0jm5K5k7j7
4622c3M9Rl7K2m1K4OL5j0k5J2%j4qK2l1LK8l2K1j8K4k0rM1Kk1j6j5K9LmK7%Qo5
4658c4M7RJ0k9J7l5J6J3Mj8LMm2M0Ql6L1rl8K2K8nm3M0ok6qO0l4nJ1rMK9j6j0
4694gK3rKK0J3m6%J7Jk6N2k8k4M1k4j2J5J8m6NK8k1%%J0k0k5M5K6k6joj8J8N1
$$ plain form
4729 46 2 -26 -11 9 -20 25 3 -2 -20 6 15 23 37 -7 -5 0 -21 22 67 14 -25 -3 27 26 22 7 -6 -11 21 -2 -5 18 -38 -70 -6
4764 -6 84 31 -52 -24 -33 -18 72 35 -81 26 -55 -12 47 -59 5 63 -18 32 93 105 -27 58 6 -66 -75 -87 43 -31 -23 -32
4794 -32 36 53 94 -206 -5 -6 36 49 19 -135 37 -180 138 20 -194 14 59 76 -103 49 119 125 -30 7 -98
4819 -98 149 -51 110 77 84 25 46 118 22 -24 -54 -104 73 49 57 -31 -17 -27 27 75 -2 9 -61 15 -2 58 -3 9 -66
4848 -66 -18 10 12 -19 5 -48 -51 4 7 -8 -74 -76 7 38 58 0 -13 -47 16 43 36 29 -22 -23 16 36 35 19 -20 -14 9 15 71 14 9 -29
4884 -29 -11 -7 52 -4 -48 -63 -18 13 40 8 -21 -29 -22 48 16 19 -28 -28 -18 15 51 14 -8 -18 6 44 56 2 5 -17 12 34 29 25
4918 25 11 -39 -13 -19 26 19 -20 -16 -25 1 7 19 -4 -21 -30 -23 -6 1 3 -31 -20 -5 19 16 -12 -13 -15 8 25 9 -6 -23 3 10 23 6 13
4955 13 -27 -7 23 30 47 -7 -18 17 19 12 23 -3 -2 -25 -14 2 32 -9 -6 7 -10 9 -14 10 -41 -11 -12 7 -15 0 0 -11 11 15
$$ packed form
4729D6m4k8J5K0k9M5k2nj8K6RQJ4m4KNk1M3M5n3l9K2L0jmj5j3nL2k3lK3n6l2O4
4764fR0n3q3K8rJ5R0l7j16J07q1M3N9j06O4N8q1N0O1J2j32Q5n2p2rj2J30p4Qr
4794c2O8J7M1l00K01jM2J3l0j54J72k17L18j18k14K08M5J7j79J52P0Oj55L7j05
4819i8K47k00J61l3Pn9K1P2r6m6l0n0J77k4Qq8J4j0N4M8p7J1p0P6j7O0o1J2p5
4848f6M8K8Kl1K4n3lN5Lj5o6kQ3L1K0n8j3l4O3K7ppn1jL9K0jj6l9OK3ON6n7nl8
4884b9J8MN9n6m4j5M5L1K7l2k9qPP0l2Lm7%J0L3L6l7k2j0K4L8J2n4Lk2K9K2nm
4918B5j4n0K6oM5pl9MrK6OJ2k3j7rPJ7PKl4J1J5K4lk8jkK3J7j6j5j7K6PJ3j7P
4955A3m0K0L0PJ7n4j1L5KpJ1k6Jk3J1J6L0m1LJ3j7J9k3K4n1L0jJ9k2J5%j1K2M
$$ plain form
4989 15 2 -2 -8 0 8 -1 1 -7 18 9 13 32 -10 11 4 17 3 21 -4 -3 1 -17 -10 -19 6 2 -20 -21 23 -21 -1 9 -8 3 21 -2 -25 10
5027 10 1 3 14 -14 -32 15 11 12 20 2 -3 -4 22 48 35 20 10 9 -8 26 -6 -19 22 0 8 4 8 -22 -34 -8 29 -4 -10 -13 -47 -9 18
5064 18 38 19 -28 -31 -21 2 8 -34 23 -23 -34 13 6 3 -1 4 -21 6 18 -9 4 -9 8 4 17 27 22 -38 -36 -11 -15 8 -6 -34 -44
5099 -44 11 16 -3 -4 -25 -42 -23 18 13 17 -25 -21 -6 38 19 0 -13 -3 -7 20 44 42 14 -7 -1 -6 46 -22 -4 -30 6 26 41 13 -31
5134 -31 -29 19 16 36 20 -30 -41 -25 29 7 -22 -40 -69 -27 23 -2 9 -18 -5 -30 35 29 26 -7 -6 -19 34 45 74 27 0 1 19
5167 19 35 37 -19 -27 -4 -1 49 27 -9 -35 -22 14 25 4 14 -43 -23 24 37 21 1 -27 -39 1 29 6 -38 -1 -27 2 37 33
5199 33 -1 -39 -8 -32 37 63 9 -8 -2 42 18 32 28 -31 -16 34 18 30 17 -13 -18 4 9 -2 -3 -19 -27 -10 37 22 -7 -26 -18 4
5233 4 9 -1 11 -44 -28 -5 4 6 19 -9 -18 4 12 22 16 -5 -12 -9 38 13 45 30 -29 2 27 12 31 -14 -3 -7 3 38 -22 -21 -29 -27 -1
$$ packed form
4989A5j3moQQrKqK5rMJ9m2K1pJ3j4J8k5JMj8PrK5mk2jM4m4K0J0j7J1J8k3k3L5
5027A0rKJ1k8j8M7mJQj8njK6K6j3j5j0jj7L4l2j3M1k2QmMl0j2K6L7l3oll4L8K7
5064A8K0j9m7lJ0K3Om2N7m6j1M7plmNk5K7J2k7J3j3J7mJ3J0no0KK5mK3j4k8j0
5099d4N5Nj9jk1j7J9M1nMm2MJ5M4j9j9j3J0mK7K4kk8k1OnN2o8J8k6L6K0J5k8m4
5134c1KM8lK0j6n0j1J6N4k2k9j8k9M2N0k5J1k7J3k5O5oll3Jj3N3J1K9m7k7JJ8
5167A9J6Kn6qK3LN0k2l6k6J3L6J1k1J0n7K0M7J3j6k0k8j2M0K8k3m4L7k6K9L5m
5199C3l4l8L1k4O9K6n4j7OM4k4J4mn9J5N0j6J2j3l0nK2Nj1jj6qJ7M7j5k9j9QK2
5233DNj0J2n5J6K3RKJ3k8rK2QJ0ok1pLM7k5L2j5n9L1K5j5J9m5J1mJ0L5o0JqKK6
$$ plain form
5270 -1 8 -19 -20 -28 -23 17 24 10 -21 -8 20 -1 6 -17 -1 15 -4 27 7 49 -7 16 16 16 33 3 35 11 1 22 15 -15 14 4 -11
5305 -11 -21 10 18 2 -7 -11 14 0 -6 -12 -43 -4 -5 -1 4 -21 -6 -15 -9 14 4 44 -14 -12 26 19 20 15 26 7 36 5 4 13 12 22 9 28 -10
5344 -10 7 -2 1 18 -4 -7 -17 -7 -26 -22 -26 -3 -35 -17 6 -7 -33 -7 7 -14 21 -27 9 2 8 -2 28 27 -9 5 1 5 30 23 -6 20
5380 20 9 3 11 33 0 8 9 -6 5 -4 -18 0 -31 -13 2 12 -11 -1 21 -10 -6 2 -4 -14 -17 0 0 11 -9 -23 22 39 18 11 25 -24
5416 -24 0 11 15 22 -3 22 22 10 4 9 -3 4 12 5 15 2 5 10 -12 -3 15 5 -2 -39 -15 -5 16 15 15 -37 -29 11 -1 18 -4 3 4 -8 -11
5455 -11 42 -5 -28 7 1 18 19 4 -3 29 3 23 28 -15 -25 1 14 29 7 -6 -18 12 -8 0 -21 -13 -5 -14 3 6 -6 11 -28 -21 -19 -16
5491 -16 9 0 21 12 0 18 22 -1 1 -7 -8 4 24 -16 -13 -13 7 26 17 11 0 14 11 9 1 19 -7 -20 -8 -2 -8 7 1 -4 5 -7 20 16 -2 -26
5531 -26 -20 13 -18 6 -11 8 -13 15 40 12 25 39 -10 20 18 31 0 18 -2 6 22 22 16 -3 -14 5 -8 7 6 -42 5 -9 -20
$$ packed form
5270aRk7jqNM0Pj4l1J3K8k1Pk3J6J6j9L1k0M2n6K3%%J7l0L2k4j0K1pl0K9j0j5
5305a1j0L1Qj6rmK5j4ool1L9jMNk5J5rOK3j0M0n8KL8pJnJ1j9K9l1jRjJ0j3J9l8
5344a0J7rLJ7k2lj0J0j9MmK3l2J8K3j3k6K6J4k1L5m8L6pOj0L0jl6J4mMK5pk9K6
5380B0j1oQK2l3QJj5J1rj4J8l1J8J5J0k3J0K2l1MQoj0lJ7%J1k0j4M5J7k1pJ4m9
5416b4K4J1MPk5K5%j2oNj2PQpJ0j3LNk2RJ8j0pl7K4J0K1j%n2QM0j2J9k2PJj2l
5455a1N3m7k3L5oJ7Jj5pL2k6K0Nm3j0K6J3J5k2j3j2L0k0Qk1QQrJ7Lj2J7l9PKL
5491a6K5rK1rj2J8Mk3KqjJ2K0m0L%K0J9roj1J4lkqJ8k6j3J2OoJ5onRj2K7mj8k4
5531b6OL3l1K4j7J9k1K8K5k8J3J4m9L0kJ3l1J8k0QJ6%oj9j1J9j3J5jm8M7j4j1
$$ plain form
5564 -20 -16 -7 -3 -10 6 24 -22 -20 -11 -15 5 1 -4 5 0 21 -6 4 15 -7 -15 -2 17 10 22 -6 22 -12 17 18 0 7 -6 -4 11 -7 -9 8 -20
5603 -20 8 -12 -1 8 -20 3 -4 11 20 -1 -25 17 7 16 -18 -7 13 -5 27 22 20 11 5 1 25 33 10 18 -1 -2 -7 -2 -16 0 -9 10 -4 -23
5641 -23 -9 -4 14 -40 -20 -20 8 -14 -13 -31 -10 4 -28 -17 5 -12 -27 29 -18 -18 24 14 3 16 8 31 21 16 14 33 39 17 33 -1
5675 -1 -1 -9 23 13 -13 3 -8 40 -8 -10 15 -30 -2 -8 -10 -21 -19 3 3 -19 -23 -4 -4 -21 -4 8 19 5 20 0 -19 8 3 25 29 12
5711 12 17 -8 -11 4 1 28 2 13 3 20 26 -1 -9 18 6 -25 -43 -11 -37 -19 -13 2 -2 -14 -16 -9 -19 -13 -8 1 7 -27 -20 -9 -18 9 16 2
5749 2 21 -18 -4 7 21 -15 -6 -7 31 7 -11 -4 -13 5 24 12 -9 13 -12 -14 -6 -9 -16 1 7 5 -9 -30 -19 -1 -23 -17 -10 -17 -7 18 2
5786 2 30 -2 13 8 -6 17 5 26 14 0 10 -10 17 0 -11 19 -7 28 0 25 -3 -6 -7 -6 -7 -19 -29 28 4 -7 9 -22 -22 6
5820 6 24 -21 -16 -7 16 5 -33 15 19 12 20 -12 11 17 -2 21 3 6 21 7 -1 3 23 -3 17 0 23 -16 -26 7 -18 33 -6 -11 5 -10
$$ packed form
5564b0MRMpJ6J8m6KRmK0mnRnK1k7J0J1k2qJ3J9pJ2k8K8l4K9Jj8Pj3KJ5j8kJ7k8
5603b0K8k0J1Rk8K3pJ5Rk1k4M2j0Rl4J1K0j8L2nkromK4Qk3Qj9jnNj4J6rJ9j4j9
5641b3J4NJ8n4K0%K8k2Jj8K1J4l2J1K2j7j5N6m7%M2j0j1J3qK3j0nkJ9Ok2J6l4
5675a%qL2j0k6J6j1M8m8kK5m5K8okj1KK2%k2mJ9%j7J7J2J1j4J5k0j9K7nK2Mj7
5711A2Nk5lJ5lK7k6J1j0J7Ok7qK7j2l1j8L2k6J8OJ5mj2kPj0ONROl4PJ1rK7Pj4
5749BJ9l9J4J1J4l6RjL8k4j8PrJ8J9j2k1K2k5kQlpJ7Okj4k1J1J8k2OPpJ0K5j6
5786BK8l2J5nj4K3j2K1j2j4J0k0K7j7j1L0k6L5k8K5k8ljJjj2j0N7k4j1J6l1%K8
5820FJ8m5NRK3j1l8M8MpQl2K3Oj9K3j8LJ5j4qMK0k6K0j7K3l9j0L3k5N1l9nJ6j5
$$ plain form
5856 -10 14 13 -5 -34 -21 -6 -45 1 -10 3 0 -3 19 12 -6 -47 21 14 23 30 1 15 18 3 37 22 32 25 22 12 4 5 3 8 -22 2 7 35
5894 35 6 2 5 12 -29 -2 13 4 -7 -15 -18 -14 -12 4 -49 -8 2 1 0 -11 1 1 8 -20 -7 8 21 10 16 16 9 14 17 -5 7 5 3 9 -8 16
5934 16 11 -5 16 -23 -32 -6 -24 -48 7 19 -15 14 -12 23 -1 -10 9 19 -14 1 5 -2 -1 2 7 18 15 -5 12 30 10 23 15 12 -1 3
5970 3 25 11 1 -7 -10 8 13 -16 -2 -4 16 -27 -15 -6 1 -8 -20 -22 -11 0 -15 -8 -3 8 -12 6 1 -8 -9 -10 16 -14 6 2 1 3 34 23 3
6009 3 9 19 4 19 5 13 9 1 -2 8 13 -5 -9 -8 -17 11 -8 -18 -7 -8 12 3 -6 -17 -19 -23 2 13 3 -14 8 -22 -10 -9 -1 -4 -35 -6 25
6048 25 -1 4 9 21 11 1 22 25 6 14 -7 -5 7 -4 3 -13 -31 -17 10 -20 -23 -3 -21 -10 12 23 -14 3 -20 -1 -10 1 -13 -11 -4
6083 -4 14 12 11 18 3 37 -7 43 28 8 4 10 2 16 4 2 -1 5 9 2 0 10 19 -5 -16 1 -6 -16 -4 -14 -7 -11 -21 -21 3 -10 -23 -21 5 -1
6123 -1 28 -47 5 23 23 6 24 16 22 7 -1 9 -2 -21 7 13 27 6 5 5 1 18 -2 10 -11 10 -5 5 25 -3 -16 -11 -9 -1 -13 17
$$ packed form
5856a0K4jj8k9J3J5l9M6j1J3llK2pj8m1O8pRPk9J4Lj5L4j5J0plj0qJkNl0K4NK8
5894C5k9mLPm1K7J5rj1qlMKJ6n3M1J0jjj1J2%Pk8J3J5J3j1O%pNLk2J2kkOj7K4
5934A6nj6K1l9rK6j8k4N5J2l4K9k6L5k4rJ9J0l3J5MpJLNJ1lk0J7J8k0J3qlj3M
5970CK2j4j0qlJ8Nk9J4kK0m3J2RPrj2kJ1J1j5PNJ1k0J8nrjjK6l0K0mjKL1j1k0
6009COJ0j5J5j4QmqlJ0Nj8mJrK8j9j0J1jK0rrj1kmK5J1j0j7K2l0J2JQll1K9L1
6048B5k6NNJ2j0j0K1Lj9Qk1KJ2j1Pj6j8J4K7l0lK0j8J1K2J1l7J7k3J9rJ1j4KP
6083dJ8kjPj5L4m4N0j5k0mOqJ4j2klOMpkJ0Rk4j1J7pj0J2j0Pmj0%K4j3j3KK6o
6123aK9p5N2J8%j7J8qOj5qJ0j1j9K8OJ4k1j%mJ7k0J2k1K1j5J0K0k8j3NKQj2L0
$$ plain form
6159 17 -6 -2 -3 -13 12 -1 27 14 16 6 -12 9 16 14 -3 12 25 -11 2 24 6 1 27 -2 9 -9 -23 2 3 -36 -19 27 -3 -26
6193 -26 -23 9 -7 12 -42 -12 8 -7 19 -17 -40 20 -30 9 12 -9 -5 -11 25 11 17 14 2 19 28 0 32 2 19 28 -12 8 31 20
6227 20 -9 -13 -5 -2 5 -10 -2 -23 -10 -16 -30 -27 -7 -52 4 26 -21 -9 -13 -2 -10 0 9 11 8 28 -3 11 5 41 -8 13 -5 -1 -4 22 9 -13
6265 -13 16 -4 40 3 17 -1 -19 0 9 15 -11 2 -16 -15 -8 15 -26 7 -13 8 -10 -19 -22 12 -27 13 -12 0 -2 17 17 17 22 31 4 16
6301 16 -4 -13 21 -6 29 0 4 37 -1 9 17 23 31 9 6 11 -6 -2 11 13 -5 -6 -18 -6 -12 -24 -26 -4 -15 -52 5 6 -4 -21 1 1 3 2
6339 2 21 12 -8 35 -2 43 20 1 9 15 24 9 -20 13 -13 -6 14 -7 -32 -40 -6 -11 18 -19 -32 8 -18 -2 10 -10 -24 -31 13 3 -19
6374 -19 14 2 -22 12 10 -21 22 23 11 -24 2 9 31 14 48 17 2 -7 27 24 -6 9 -2 1 6 4 25 7 -16 -13 -39 -30 -19 -10 -22 14
6410 14 -11 -11 3 -24 25 21 3 -7 -7 -7 -3 5 -2 9 -1 29 29 2 28 6 23 30 2 17 3 -8 -4 -10 -3 2 -18 -2 -4 -4 0 -19 -19 11 -18
$$ packed form
6159A7k3Mjj0K5j3K8j3Kj0j8K1Pkj7J5J3l6J3K2j8nK6k9J1j8j4K5Jl9J7M6l0k3
6193b6LL2j6J9n4L0K0j5K6l6k3O0n0L9Lk1MoL6j4Olj2J7Rk8L2l0J7Rm0K0K3j1
6227B0k9mQLPj5Qk1J3oj4LK0m5N6K2m7J2mJ1qJ0RKlK0l1J4oL6m9K1j8MlK6j3k2
6265a3K9k0M4l7J4j8j8J9ROk6J3j8JPK3m1L3k0K1j8rlL4l9M0k5J2kJ9%%NRk7J2
6301A6k0rL4k7L5k9ML3l8J0QOQk2lNj7MJ3Kj8jj2J2oj2kK2j1l7N7Jj0j7K2%Kj
6339BJ9rk0M3l7M5k3j9QORj5k9L3k6PK0k1k5qL4nK9l7j3M0k6J6J2k0j4pM4j0k2
6374a9L3j2k4L4kl1M3Jj2l5K6PK2j7L4l1j5rL4ll0J5j1LNkK1j8k3Lk6RJ1Rj2L6
6410A4k5%J4k7M9mj8j0%%MQpJ1j0L0%k7K6k2J7Pk8J5j4j1MoPNk0J6k%Mj9%L0k9
$$ plain form
6449 -18 -2 13 7 -20 -28 -17 -9 -25 4 -4 -7 8 -13 13 11 23 4 -3 14 -4 -5 4 -6 -5 26 31 12 -11 25 18 -23 8 12 5 1 -12 6 -3
6487 -3 -8 -11 -16 -14 16 14 -9 10 5 -19 -10 -9 -20 -6 2 -12 26 18 18 10 11 -11 1 6 55 20 32 -10 5 25 1 29 43 -15 -10 -1 10 6 -18
6526 -18 5 -10 -14 -31 -12 -25 -24 -27 -18 -27 -13 0 -7 -4 19 -1 -20 11 -20 -17 -7 -5 8 -21 16 -20 17 30 9 13 16 -4 14 11 -3 -10 10
6563 10 7 11 -10 -22 -11 -2 5 -20 -7 -2 -3 15 -6 -13 -5 8 21 -19 -27 -13 -5 7 28 -6 9 0 -1 3 6 -3 -7 -2 33 23 -10 -11 22 5 13 4
6603 4 27 22 25 7 -7 16 -8 0 0 7 -12 13 -12 -9 -41 -14 17 -7 -8 -29 -7 -2 16 2 -10 29 13 1 2 26 -11 23 20 29 29 3 12
6640 12 -4 -26 13 4 -6 0 15 17 1 -7 13 -9 4 -26 10 -2 3 -37 -30 -6 -23 -2 -34 13 -11 9 -15 -6 -30 10 -13 9 -1 -15
6674 -15 -12 14 16 -5 -22 -1 33 15 -12 4 24 2 30 13 -33 -4 -9 -18 -18 21 -9 1 -15 -18 -15 -3 -32 17 1 -23 -8 9 -16 -1
6708 -1 -8 -5 -23 6 -2 -3 22 -25 -21 15 -6 -5 1 27 16 1 1 -1 14 17 9 2 20 16 24 2 -8 -27 -31 -8 -11 -38 -23 -20 -7 -5 -26 -3 -15 -18
$$ packed form
6449a8J6J5ok7qJ1Qj6K9qlJ5k1K6kJ2j9pJ7j8jRj0JL1Nj9k3L6pm1L1Mpmj3J8r
6487cnlnKL0kk3J9nk4RJj1J4Qj4L8q%qJk2J2NM9l5J2m2J5K0k4K8J4n8NRJ1mk4
6526a8K3j5mj7J9j3JlRrJ4J3pLK3k0j9L1l1LJ0KJ3k9L7l6L7J3k1MLk0J8lj4pK0
6563A0lMk1j2J1RPk5J3NjJ8k1pQJ3J3m0qJ4QJ2K1l4J5rjMLrmNL5j0l3jL3j7Qr
6603DK3nLj8j4K3k4Q%Pj9K5k5Ll2K7L1k4jk1K2NJ8j4j2L9j6j2JK4l7L4lR%k6R
6640A2j6k2L9rj0OJ5Kj6qK0k2J3l0L6j2Nm0PK4j7K1l2M7k4K0k4Rk4M0k3K2j0j4
6674a5LK6Kk1j7K1L4j8k7J6K0k2K8j7m6K9nr%L9l0J0j6lLJ2k9M9j6k4J5J7k5J5
6708apLj8K9qjK5m7ML6k1JOK6j1j5%kJ5LqpJ8mQk2j0j9mK3lk7J5LJ3Kk1K3j2l
$$ plain form
6748 -18 -27 -8 -5 -19 -11 -13 -26 -15 17 -1 -10 17 18 5 25 19 3 18 11 12 19 -7 32 -10 23 -7 20 14 -4 3 3 5 -15 1 -37 -4 -43
6785 -43 -44 16 -35 -13 -20 9 4 23 11 -11 -7 11 -1 2 7 0 20 -6 7 14 7 -18 -2 0 24 9 -17 -6 21 -1 8 3 13 9 1 7 -17 -13
6823 -13 0 -20 -16 4 -12 -7 -4 -5 -7 8 -3 1 -23 5 -1 -16 7 -1 -14 -9 -5 -8 11 0 1 -3 -13 10 11 10 35 5 5 7 6 17 -11 38 21
6862 21 21 -9 -11 5 9 7 -10 -12 -1 5 -12 -3 -2 26 -12 -13 -8 -11 5 1 -11 -7 -3 24 2 11 6 -4 15 22 0 34 -18 27 4 11 11 -8 46 25
$$ packed form
6748a8rJ9Lj4Qkj3J1L2j8rK7Jj3K0oj6J5pJPk6L9m2L3l0K7oj8P%Kk0J6l8L3l9
6785d3jO0n1K2pK9nJ9j2k2MJ8j2LNpK0k6J3Ppk5J6KK4j5k6J1K7k2RnJ0mqOk4M
6823a3J3k0MK0j6NLjkJ5j1Mk4K8oj5K3qj3NMlJ9j1Jmj0K3JjK5l0%KjJ1k8M9j7
6862B1%l0kJ6Mkj7kJ1Oj7RJK8l8jNlJ6mj2MMK7k2Rnj0J9Pk2L4n2M5k3P%j9N4k1
$$ [...]
8191A2
##END NTUPLES=NMR FID
##END=
