##TITLE=1H_3ABDE0906
 CDCl3, 8 sc, 
 10.06.2021
##JCAMPDX= 6.0         $$ Bruker NMR JCAMP-DX V2.0
##DATA TYPE= NMR FID
##DATA CLASS= NTUPLES
##ORIGIN= UXNMR, Bruker Analytische Messtechnik GmbH
##OWNER= root
$$ XWIN-NMR		Version 3.5
$$ Thu Jun 10 10:03:47 2021 Russian Standard Time (UT+4h)  she@DPX200
##.OBSERVE FREQUENCY= 200.131506
##.OBSERVE NUCLEUS= ^1H
##.DELAY= (6, 6)
##.ACQUISITION MODE= SIMULTANEOUS
##.ACQUISITION SCHEME= undefined
##.AVERAGES= 8
##.DIGITISER RES= 18
##SPECTROMETER/DATA SYSTEM= spect
##.PULSE SEQUENCE= zg30
##.SOLVENT NAME= CDCl3
##.SHIFT REFERENCE= (INTERNAL, CDCl3, 0, 15.7039)
##AUDIT TRAIL= $$ (NUMBER, WHEN, WHO, WHERE, WHAT)
$$ ##TITLE= Audit trail, XWIN-NMR		Version 3.5
$$ ##JCAMPDX= 5.01
$$ ##ORIGIN= Bruker BioSpin GmbH
$$ ##OWNER= she
$$ F:/spectra/data/she/nmr/H-F/1/audita.txt
$$ ##AUDIT TRAIL=  $$ (NUMBER, WHEN, WHO, WHERE, WHAT)
(   1,<2021-06-10 10:02:25.70 +0400>,<she>,<DPX200>,
      <created by zg, POWCHK disabled, PULCHK disabled
       configuration hash MD5:
       00 E9 B6 7A A2 85 ED C7 34 08 36 98 17 FE 4E 26
       data hash MD5: 16K
       41 2D 7C 0E 49 19 6B D0 53 83 36 89 06 C2 4A 26>)
$$ ##END=
$$ 
$$ hash MD5
$$ 69 AF 4A B9 39 77 69 49 D0 D9 D5 5C 17 A7 DE 9F
##$RELAX= 
##$RELAX= 
##$RELAX= 
##$RELAX= 
##$RELAX= 
##$RELAX= 
$$ Bruker specific parameters
$$ --------------------------
##$DU= <F:/spectra>
##$EXPNO= 1
##$NAME= <H-F>
##$PROCNO= 1
##$TYPE= <nmr>
##$USER= <she>
##$AMP= (0..31)
100 100 100 100 100 100 100 100 100 100 100 100 100 100 100 100 100 100 
100 100 100 100 100 100 100 100 100 100 100 100 100 100 
##$AQSEQ= 0
##$AQ_mod= 1
##$AUNM= <au_zg>
##$AUTOPOS= <>
##$BF1= 200.13
##$BF2= 200.13
##$BF3= 200.13
##$BF4= 200.13
##$BF5= 200.13
##$BF6= 200.13
##$BF7= 200.13
##$BF8= 200.13
##$BYTORDA= 1
##$CFDGTYP= 0
##$CFRGTYP= 5
##$CHEMSTR= <none>
##$CNST= (0..31)
1 1 145 1 1 1 1 1 1 1 1 1 1 1 1 1 1 1 1 1 1 1 1 1 1 1 1 1 1 1 1 1 
##$CPDPRG= <>
##$CPDPRG1= <>
##$CPDPRG2= <>
##$CPDPRG3= <>
##$CPDPRG4= <mlev>
##$CPDPRG5= <mlev>
##$CPDPRG6= <mlev>
##$CPDPRG7= <mlev>
##$CPDPRG8= <mlev>
##$CPDPRGB= <>
##$CPDPRGT= <>
##$D= (0..31)
0 1.2 0 0 0 0 0 0 0 0.06 0 0.03 0 0 0 0 0.0002 0 0 0 0 0 0 0 0 0 0 0 0 
0 0 0 
##$DATE= 1623304945
##$DBL= (0..7)
120 120 120 120 120 120 120 120 
##$DBP= (0..7)
150 150 150 150 150 150 150 150 
##$DBP07= 0
##$DBPNAM0= <>
##$DBPNAM1= <>
##$DBPNAM2= <>
##$DBPNAM3= <>
##$DBPNAM4= <>
##$DBPNAM5= <>
##$DBPNAM6= <>
##$DBPNAM7= <>
##$DBPOAL= (0..7)
0.5 0.5 0.5 0.5 0.5 0.5 0.5 0.5 
##$DBPOFFS= (0..7)
0 0 0 0 0 0 0 0 
##$DE= 6
##$DECBNUC= <off>
##$DECIM= 32
##$DECNUC= <off>
##$DECSTAT= 4
##$DIGMOD= 1
##$DIGTYP= 9
##$DL= (0..7)
0 120 120 120 120 120 120 120 
##$DP= (0..7)
150 150 150 150 150 150 150 150 
##$DP07= 0
##$DPNAME0= <>
##$DPNAME1= <>
##$DPNAME2= <>
##$DPNAME3= <>
##$DPNAME4= <>
##$DPNAME5= <>
##$DPNAME6= <>
##$DPNAME7= <>
##$DPOAL= (0..7)
0.5 0.5 0.5 0.5 0.5 0.5 0.5 0.5 
##$DPOFFS= (0..7)
0 0 0 0 0 0 0 0 
##$DQDMODE= 0
##$DR= 18
##$DS= 0
##$DSLIST= <SSSSSSSSSSSSSSS>
$$ [...]
##$SUBNAM2= <"">
##$SUBNAM3= <"">
##$SUBNAM4= <"">
##$SUBNAM5= <"">
##$SUBNAM6= <"">
##$SUBNAM7= <"">
##$SUBNAM8= <"">
##$SUBNAM9= <"">
##$SW= 20.0188882624521
##$SWIBOX= (0..15)
0 0 2 0 0 0 0 0 0 0 0 0 0 0 0 0 
##$SW_h= 4006.41025641026
##$TD= 16384
##$TD0= 1
##$TE= 0
##$TE2= 300
##$TE3= 300
##$TEG= 300
##$TL= (0..7)
0 120 120 120 120 120 120 120 
##$TP= (0..7)
150 150 150 150 150 150 150 150 
##$TP07= 0
##$TPNAME0= <>
##$TPNAME1= <>
##$TPNAME2= <>
##$TPNAME3= <>
##$TPNAME4= <>
##$TPNAME5= <>
##$TPNAME6= <>
##$TPNAME7= <>
##$TPOAL= (0..7)
0.5 0.5 0.5 0.5 0.5 0.5 0.5 0.5 
##$TPOFFS= (0..7)
0 0 0 0 0 0 0 0 
##$TUNHIN= 0
##$TUNHOUT= 0
##$TUNXOUT= 0
##$USERA1= <user>
##$USERA2= <user>
##$USERA3= <user>
##$USERA4= <user>
##$USERA5= <user>
##$V9= 5
##$VALIST= <valist>
##$VCLIST= <CCCCCCCCCCCCCCC>
##$VD= 0
##$VDLIST= <DDDDDDDDDDDDDDD>
##$VPLIST= <PPPPPPPPPPPPPPP>
##$VTLIST= <TTTTTTTTTTTTTTT>
##$WBST= 1024
##$WBSW= 4
##$XGAIN= (0..3)
0 0 0 0 
##$XL= 0
##$YL= 0
##$YMAX_a= 471166
##$YMIN_a= -473394
##$ZGOPTNS= <>
##$ZL1= 120
##$ZL2= 120
##$ZL3= 120
##$ZL4= 120
##$ABSF1= 10
##$ABSF2= 0
##$ABSG= 5
##$ABSL= 3
##$ALPHA= 0
##$AQORDER= 0
##$ASSFAC= 0
##$ASSFACI= 0
##$ASSFACX= 0
##$ASSWID= 0
##$AUNMP= <proc_1d>
##$AZFE= 0.1
##$AZFW= 0.1
##$BCFW= 1
##$BC_mod= 2
##$BYTORDP= 1
##$COROFFS= 0
##$CY= 11.3945322036743
##$DATMOD= 1
##$DC= 2
##$DFILT= <>
##$DTYPP= 0
##$F1P= 15.9154993809931
##$F2P= -4.1035820241983
##$FCOR= 0.5
##$FTSIZE= 0
##$FT_mod= 4
##$GAMMA= 1
##$GB= 0.15
##$INTBC= 1
##$INTSCL= 1
##$ISEN= 128
##$LB= 0.24
##$LEV0= 0
##$LPBIN= 0
##$MAXI= 10000
##$MC2= 0
##$MEAN= 0
##$ME_mod= 0
##$MI= 1.114404
##$NCOEF= 0
##$NC_proc= 0
##$NLEV= 6
##$NOISF1= 3.799351
##$NOISF2= 2.8
##$NSP= 1
##$NTH_PI= 0
##$NZP= 0
##$OFFSET= 15.70392
##$PC= 1
##$PHC0= -11637.42
##$PHC1= 6.401014
##$PH_mod= 1
##$PKNL= yes
##$PPARMOD= 0
##$PSCAL= 0
##$PSIGN= 0
##$REVERSE= no
##$SF= 200.130013532006
##$SI= 16384
##$SIGF1= 3
##$SIGF2= 2
##$SINO= 400
##$SIOLD= 16384
##$SREGLST= <1H.CDCl3>
##$SSB= 0
##$STSI= 0
##$STSR= 0
##$SW_p= 3612.71676300578
##$SYMM= 0
##$S_DEV= 0
##$TDeff= 0
##$TDoff= 0
##$TI= <>
##$TILT= no
##$TM1= 0
##$TM2= 0
##$TOPLEV= 0
##$USERP1= <user>
##$USERP2= <user>
##$USERP3= <user>
##$USERP4= <user>
##$USERP5= <user>
##$WDW= 1
##$XDIM= 8192
##$YMAX_p= 0
##$YMIN_p= 0
$$ End of Bruker specific parameters
$$ ---------------------------------
##NTUPLES= NMR FID
##VAR_NAME=  TIME,          FID/REAL,        FID/IMAG
##SYMBOL=    X,             R,               I
##VAR_TYPE=  INDEPENDENT,   DEPENDENT,       DEPENDENT
##VAR_FORM=  AFFN,          ASDF,            ASDF
##VAR_DIM=   8192,          8192,            8192
##UNITS=     SECONDS,       ARBITRARY UNITS, ARBITRARY UNITS
##FACTOR=    0.0002496,     1,               1
##FIRST=     0,             0,               0
##LAST=      2.0444736,     0,               0
##MIN=       0,             -473394,         0
##MAX=       2.0444736,     471166,          0
$$ Real data points
##PAGE= N=1
##DATA TABLE= (X++(R..R)), XYDATA
0@%%%%%%%%%%%qJ6j6J6j6K4l2M0m8N2o0P2q8J04j20J36j59J87k12K37k67L06l49
34a85L89m34M88n47O10o81P58q37R26j027J135j252J381j520J674j845K030k234
52a171K465k724L015l345L719m152M663n275O016o937Q118r689J1882j5144K0477
67A1918l0558N5545k16747k72068P27509j90318l41569N57952j71708o03350N70015
78I6621K48083o11658K38050L08328o00376J71383O20735m93362k89641M96129
88A84292k33554k24726O04906j21598n84759L86800J98951m46674K71931K73230
98C08799n52053L7876M94687k90238j44090L61466k89825k49371N23073K4784
108B25108m18497K18430Q3835l49041K40945K75940l80297l9988K91426k05556
$$ plain form
0 0 0 0 0 0 0 0 0 0 0 0 0 -8 8 -8 8 -8 16 -16 24 -24 28 -32 40 -48 56 -64 72 -87 100 -112 125 -142 164 -185
34 -185 204 -230 258 -289 321 -360 398 -439 487 -540 595 -657 724 -796 878 -967 1063 -1171
52 -1171 1294 -1430 1585 -1760 1959 -2193 2470 -2805 3211 -3726 4392 -5297 6585 -8559 11918
67 11918 -18640 36905 -179842 -451910 275599 85281 -256288 301664 129956 -473394 96621
78 96621 344704 -266954 -28904 279424 -320952 -149569 471166 -22196 -311837 184292
88 184292 -49262 -273988 330918 209320 -375439 11361 210312 -236362 35569 308799
98 308799 -243254 -205378 289309 -929 -145019 216447 -73378 -322749 200324 225108
108 225108 -193389 25041 108876 -240165 780 276720 -103577 -143565 147861 -57695
118e7695m8334L27290j95901k77328K89830Q4175k00211J53355K7033k89375J12020
129g5141K34987j69865m2961J49827j47063p3009K30953j7509j84441P3351M4726
140B3855q4582J04884P3092j72847m4355J29970j1938l4830P8798l6930j11971
151h6854O2041Q8777n7742k5268L8333n2810j4108J17389m882j29838K4591P0427
163C0056n9446K7299R1053j02481p4889J20822l168q1271R8345k99j49782R2282
175a1479J21899j44355j9394J21506j09755l5801J85570o8708j45852J45540P303
186D6474j57755J43585Q6053k15029M2910J66575j55858k1775J82329j41223j03942
197a27656K26092l9100j78281J72051K8025k17700J33272J38598k14539K6509
$$ plain form
118 -57695 -106029 221261 25360 -251968 37862 122037 -78174 75181 102214 -187161 -75141
129 -75141 159846 -10019 -52980 96847 -50216 -123225 107728 90219 -94222 -20871 23855
140 23855 -60727 44157 117249 -55598 -99953 30017 18079 -16751 62047 25117 -86854
151 -86854 -24813 63964 6222 -19046 19287 -33523 -47631 69758 64876 -64962 -40371 30056
163 30056 -29390 -2091 88962 -13519 -88408 32414 29246 -52025 46320 46021 -103761 -11479
175 -11479 110420 -33935 -53329 68177 -41578 -77379 108191 39483 -106369 39171 46474
186 46474 -111281 32304 118357 -96672 -53762 112813 -43045 -64820 117509 -23714 -127656
197 -127656 98436 59336 -118945 53106 81131 -136569 -3297 135301 -79238 -52729
207e2729J74877j79073l6216K27102j26204j44479K19170j9647j88724J73469
217D7546N5211k26754J02927J45424k00793K2836J87082j75837o9647K26096q6608
228B7483j50080J92012n787j86423J53161P5550k09665P6366J44745j85045k35
239f7918J91200j37656r2596J93212n4326j41128J65446J3361j79382J18556R2564
250A01333j81890M1722J45127j48291l3553J69994q8616r8051J56089k4597j36182
261i6915J28403M4161j58898O7542J04816j38903J60J33474r7309n8543J36768
272F4756m3040j01906J17572J5427j28326P5523P3129j23062J5508J05411r0836
283a9844l5291J15497m9188p8823J05578K139j07201P3414N5222j09451K3266
$$ plain form
207 -52729 122148 -56925 -93141 133961 7757 -136722 82448 62801 -125923 47546
217 47546 102757 -123997 -21070 124354 -76439 -53603 133479 -42358 -112005 114091 27483
228 27483 -122597 69415 63628 -122795 30366 105916 -103749 -27383 117362 -67683 -67918
239 -67918 123282 -14374 -106970 86242 31916 -109212 56234 69595 -109787 8769 101333
250 101333 -80557 -38835 106292 -41999 -75552 94442 5826 -92225 63864 39267 -96915
261 -96915 31488 75649 -83249 -15707 89109 -49794 -49634 83840 -13469 -72012 64756
272 64756 21716 -80190 37382 52809 -75517 6 73135 -49927 -34419 70992 -19844
283 -19844 -55135 60362 11174 -67649 37929 40068 -67133 6281 61503 -47948 -24682
294b4682Q9584q6684k5418J03028n0893o5447J00388n321r7403P3663M4447j05396
306e0134L0210Q2552q7736j6314R9452n7749n8723J00526j4422r1475Q1721L4951
318E2859j05743M0343P4087r4734m592R7580o6788m7003J03467k8805q5069Q9187
330B4789J9926j03120N5411O3267r9428J0623Q9171p8552l2061J02775m2504p0828
342f0531R5504K147r7465O6503M6258r9344K8193P8927q5201j4744R5498n7384
354a639n5686R7443j4176q5020P7146K8641r7117M1493O3666q9450L364Q8544
366E7209o7042l8864R5401l1536p3615Q3253J2743r0029N4984M9656r1320J6973
378b2187P7051p4884k2650R2779m2719o0222Q5939l713q3531O3332L5793q8386
$$ plain form
294 -24682 64902 -21782 -47200 55828 4935 -60512 39876 34555 -62848 10815 55262 -50134
306 -50134 -19924 62628 -25108 -41422 58030 281 -58442 42084 27662 -63813 17908 52859
318 52859 -52884 -12541 61546 -33188 -37780 59800 -6988 -53991 49476 20671 -64398 24789
330 24789 44715 -58405 -2994 60273 -39155 -28532 60639 -17913 -49974 52801 10297 -60531
342 -60531 34973 37120 -60345 6158 52416 -46928 -18735 60192 -25009 -39753 55745 -1639
354 -1639 -57325 40118 25942 -59078 18068 46709 -50408 -8915 54751 -34699 -31335 57209
366 57209 -9833 -48697 46704 15168 -58447 24806 37549 -52480 2504 52160 -39160 -22187
378 -22187 54864 -20020 -42670 50109 7390 -52832 33107 29394 -54137 9195 44988 -43398
390d3398L1231O6604p9586r002Q4549n3764m6212Q7315j5654p2945O9305K0428
402C8871q5562M1488N4125q0657O070P7364o1667l2266Q3920l0330o2287P5058
414B4127P219p7709N2168L9042q2811J9745O7126o8167j5399Q0274m3234m8417
426d6036P7737r645p0605O1381K3892p8274L5989N3506p5195m15P2152n3397l0150
439c9060P7564k6319n8072O7046O942p1043M6594L6133p3561J7958O0575n9762
451a5005j5304O7186l7502l9330O8122p789n9524M9211J9035o3682K9634M3330
463C8382n9248j309N6365l8913k3483N6604k0130m4676N0067R998n1121K9450
475A986K5910n1940R294M6050l6989j6189M4678k0152k9651M4107J181m4722K5993
$$ plain form
390 -43398 -12167 54437 -25149 -34151 50398 -3366 -49578 37737 22083 -50862 18443 38871
402 38871 -46691 -5203 48922 -31735 -25665 51699 -9968 -42234 41686 11356 -50931 24127
414 24127 31346 -46363 5805 44847 -37964 -18219 48907 -19260 -34659 45615 2381 -46036
426 -46036 31701 22056 -48549 12832 36724 -41550 -5561 47945 -27250 -27665 44487 -8910 -39060
439 -39060 38504 12185 -45887 21159 28101 -42942 3652 39785 -33776 -15818 44757 -15005
451 -15005 -30309 36877 -625 -39955 28167 20378 -39146 10065 29100 -34582 -4948 38382
463 38382 -20866 -22175 34190 -4723 -28206 28398 8268 -36408 13659 23657 -27464 1986
475 1986 27896 -24044 -14750 31300 -5689 -21878 22800 2648 -27003 17104 18285 -26437 -444
488d44K1855l8266J1020L3178l6630j3338M1350j2854k4790L3112k166l7684K6058
501D01K3836l6696K281K9445k8101q827M0977j4726l3100L0590O634l2961K5019
514D772K0679m3748J553L9518k5492j4122L8780j9483l3035M2991R505m3744K1836
527A0K0406m4797J4289M4223m0434j8537M5345k0273k6619N0350o279n2530L6559
540A713K3479m7897K1089L3904n5141j930N8395l2340k6403M9929k1585m1624
552c8411N7426R486n9412L0520K6359n4822K1185M9498n6216j5171N7909k9365
564a014k6501N9303j9444n4974N2469J7869n5241L1478K7149o2418J4592N6402
576C9670m6889j6499N1863l2705k9022O2640r403n4106M0692J3959m8880L2939
$$ plain form
488 -444 21411 -16855 -5835 27343 -9287 -22625 18725 5871 -18919 14193 12027 -25657 401
501 401 24237 -12459 -10178 19267 -8834 -17661 23316 8590 -24510 6080 12714 -20247 4772
514 4772 25451 -18297 -16744 22774 -2718 -16840 21940 2457 -30578 12413 21918 -21826 10
527 10 20416 -24381 -10092 34131 -6303 -24840 20505 232 -26387 23963 17684 -34846 1713
540 1713 25192 -22705 -1616 32288 -22853 -24783 33612 1272 -25131 24798 3213 -38411
552 -38411 19015 28501 -30911 -391 25968 -28854 -7669 41829 -14387 -29558 28351 -1014
564 -1014 -27515 31788 12344 -42630 9839 27708 -27533 3945 31094 -31324 -16732 39670
576 39670 -7219 -23718 28145 -4560 -33582 29058 19655 -34451 6241 20200 -28680 4259
588D259L0360n8059M016M7303l5428r369M6297l0652l2116N0801o97l9326L1619
601I008O634m3853K6449L0719m1134m46L1142k8993n670M0436j9016k8264L0453
614G465L86k4076K5934N844l4647J2557K2524k2162J745J8904k1871p208K6470
627A1865n760j5180J4192l192j4290J5831Q271j6943K18R085p935K089J0063p832
641D82p764O753K833k281K251l53n529o34O741K661n911k222L872k380l65P908
657F062l474r816P273M754q816N409O620j5358Q53J6306r142p488J4462p223j2479
672a2057J9316J667k0334J2500R047k1395Q660J8406k2369l928K3557j4417j0836
685a2183K5801r132k2564K5031M425k6642J7100J3617l0169Q289K4994k5698m908
$$ plain form
588 4259 34619 -23440 -19424 27879 -7549 -16918 29379 -1273 -33389 17412 16715 -22611 9008
601 9008 15642 -28211 -1762 28957 -12177 -12623 18519 -10474 -16144 24292 5276 -22988 7465
614 7465 7851 -16225 9709 15553 -19094 -6537 15987 -6175 -4430 14474 -7397 -14605 11865
627 11865 6105 -9075 5117 1925 -12365 3466 11737 -5206 -4988 4097 -3838 -1749 8314 482
641 482 -7282 -529 2304 23 2274 1921 -3608 -4242 2499 5160 -751 -2973 899 -1481 -1846 6062
657 6062 2588 -7228 45 4799 -4017 1392 8012 -7346 -6493 9813 671 -6817 7645 422 -12057
672 -12057 7259 8926 -11408 1092 10139 -11256 -2596 15810 -6559 -10487 13070 -1347 -12183
685 -12183 13618 4486 -18078 6953 11378 -15264 1836 15453 -14716 -6427 18567 -7131 -12039
698a2039K8935j9026j5403L2631p657k7197K6731N661l0834J9604J6874l2971
710a4691O869K7305k7234n642L2118j9070j8848L2614n095k7587K6123O448l1469
723a8159J7829J8959l1568M586K7165k5098p828L1059j5103j9653K9244l269k5742
736a7578K3244Q463l0021J3740J9503k7533J415K5490k0685r570K7481j0989j8581
749a5621K4904n20k4400J8797J0260k5885Q787J8390k1590j674K2180j5463j0083
762a1918K2571o494j7263J9010K888k0562J1963J1036j9375L436J6118j5296m022
775g908J7889r276j1158J7056j173j5398J1973N884j5647N487J1035j3120j109
788e465J3605q782p097J3921k756j1702J0298M006j2289N232P977j1333L36J0752
$$ plain form
698 -12039 16896 -2130 -17533 15098 7441 -19756 6975 12636 -18198 1406 18280 -14691
710 -14691 -7822 19483 -7751 -13393 18725 -345 -19193 13421 8326 -19261 6862 13310 -18159
723 -18159 -330 18629 -12939 -8353 18812 -6286 -14114 16945 1842 -17811 11433 8164 -17578
736 -17578 5666 14129 -15892 -2152 17351 -10182 -8767 16723 -3962 -13532 13949 2960 -15621
749 -15621 9283 8763 -15637 3160 13420 -12465 -3678 14712 -6878 -8552 13628 -1835 -11918
762 -11918 10653 4159 -13104 5906 8794 -11768 195 11231 -8144 -4708 11410 -3886 -7908
775 -7908 9981 705 -10453 6603 5430 -9968 2005 7889 -7758 -2271 8764 -4356 -5465
788 -5465 8140 -642 -7739 6182 3426 -8276 2022 6028 -6261 -1029 6948 -4385 -4049 6703
802F703p812n211J1710l020r289R224K754j0904N147O503r608N14R383p510m056
817e472J0408k917q280Q580K075r648M913N897r231J178Q646p715l365J0179l609
832A639p733Q977J124r238N376N101r173J872P894q000k173R913m752o503R147
847C471m32q280O124L852r120K980P058q321r63R176n769m954Q990j439p600O989
863A762J958q429M281N257q153P50P739o362l134Q695l046o179O909P10p371M911
879B98L886p979K081O647o701k033P981l649n271P225m72o620N657K315p236K993
895h78N345o745n18O989m285l750O656j413n181N247J363o529L560M015o250L88
911a986N721m128k790N976j817m397N073O29n685L808K867n482P83M907m352j548
$$ plain form
802 6703 -1109 -6320 5390 2370 -6919 2305 5059 -5845 -698 5805 -3803 -3289 6094 -1416 -5472
817 -5472 4936 2019 -6261 2319 4394 -5254 -341 5556 -3675 -2497 6149 -1566 -4931 5248 1639
832 1639 -6094 2883 4007 -5231 145 5246 -3927 -2055 5839 -2161 -4334 5579 827 -5676 3471
847 3471 3039 -5241 883 4735 -4385 -1405 5653 -2668 -3631 5545 -224 -5178 3812 2373 -5227 1762
863 1762 3720 -4709 -428 4829 -3324 -2574 5165 -1197 -4331 4364 1318 -4861 2048 2758 -4613 298
879 298 4184 -3795 -1714 4933 -1768 -3801 4180 531 -4740 2485 2013 -4607 1050 3365 -3871 -878
895 -878 4467 -2278 -2796 4193 -92 -3842 2814 1401 -3780 1467 2830 -3699 -139 3876 -2374 -1986
911 -1986 3735 -393 -3183 2793 976 -3421 1652 2281 -3404 404 3271 -2211 -1428 3479 -873 -2421
927b421N375k437l216M701l97m670L911J892n393J818L844l977j098M553k310
942A75k612M304q28l854L729J209m285J707L178l948k91L732k227j909L722j184
958F18k746K973Q82l920J805K587l254k74L221k040j581L110q47k595K864P17
974A520l583J680K235k945k55K873j531j616K822n61k312K271P99l202J218K652
990B065k788o30L124j616j983L019q6k946K138J368l422J230K587l016n54L589
1006B079k000k153L608o42l090K891J374m076J553K801l657j00L943k530k063
1021b062L863j026l275L623R00m405K333K560m192M64L981l622j243M372j564
1036G07k970L930k81m078L290J816m305J112L405m158k27M533k877k280M140j017
$$ plain form
927 -2421 2954 517 -2699 2002 1605 -3065 846 2738 -2655 -837 3007 -970 -2068 2485 175
942 175 -2437 1867 1039 -2815 914 2123 -2162 -455 2723 -1225 -1516 2216 -11 -1920 1802 618
958 618 -2128 845 1727 -2193 -388 2199 -1055 -1329 1892 -148 -1729 1381 534 -2061 803 1520
974 1520 -2063 -383 1852 -1093 -1348 1525 -6 -1622 1200 639 -1673 598 1397 -1805 -587 2065
990 2065 -723 -1353 1771 155 -1828 1191 1105 -1841 297 1665 -1757 -527 2060 -956 -1510 2079
1006 2079 79 -2074 1534 892 -2198 693 2067 -2009 -456 2345 -1312 -1412 2531 1 -2062
1021 -2062 1801 775 -2500 1123 2023 -2382 -49 2511 -1681 -1217 2764 -858 -2101 2271 707
1036 707 -2263 1667 1386 -2692 598 2414 -1891 -779 2626 -1532 -1759 2774 -103 -2383 1757 740
1052G40l438L807P50m706K649K625m296R13L578l799q65M501k334k833M524q29
1068I87l930L575J657m499J755K511m017Q98L690l311j357L905j583k608M061
1083A734m31l489K378J792l733J509K382l539P5L478k067j691L299j421k278K869
1099H67O42k935J716J161k739J150K282k840n19K534j302r37K328r40k050J874
1115B92M49j519J281M15k085N40J974j266l39P51q25m24J443o9j345P12j88l27
1133e30O72N75j078j50N51j35L37J2k76m01M37j5L55k45n03J97J40K01J52k4j091
1154h19K15P66l61M02K76j251L15J043m09o14J025p91q94J640M85j755N00N73
1172C46j262Q76J628k306k99J865j114n52K101j255j660J946O62j614R29P60k487
$$ plain form
1052 740 -2698 1109 1859 -2847 -198 2427 -1869 -956 2622 -1177 -2042 2459 125 -2708 1816 987
1068 987 -2943 632 2289 -2210 -455 2056 -1961 -1063 2627 -684 -2041 1864 281 -2327 1734
1083 1734 1303 -2186 192 1984 -1749 -240 2142 -1397 -1322 2156 89 -1602 1697 276 -2002 867
1099 867 1509 -1426 290 1451 -1288 -138 2144 -696 -1215 1319 17 -920 1408 468 -1582 292
1115 292 741 -778 503 918 -1167 -627 1347 81 -258 493 -332 -756 687 618 -727 -15 -203 -530
1133 -530 142 717 -361 -511 40 -95 242 254 -22 -423 14 -1 354 109 -394 -197 -57 144 296 272 -819
1154 -819 -604 162 -199 203 479 -772 -457 586 177 -437 588 -203 -1097 543 1028 -727 -227 346
1172 346 -916 -40 1588 -718 -1017 848 -266 -818 1283 28 -1632 314 976 -638 291 1051 -1436
1189a436Q64K139j781n92K208j630j208L094q51k337J986L65k114J676J367k748
1205i98L77J962j950k7K377k239j173K944m82k193K041L44k857J879J650k646
1221i91M61J890k397N8K620j394j847K481k30j985J979P90k971J420J012k295
1237a399J141J467j917k66K055r79j126J727l49k040J834Q99k121R47J173k040
1253i94N23J708j527p43J374l88p66J578m47j615J449M24j669J130J097j653Q4
1270d35J171p89n12J328q91m31J208k5j194Q77o4q13N49P51p36j88O10m62l58
1289d04R52j80p85P37j7o20N62k15k32r1J33J95k67K39p7j74K40K40k16K29n37
1310b88K25k3j71J03l1J08L00k38N9k78M02l30l9M55l81j84K33J62k78M16j58
$$ plain form
1189 -1436 -572 1567 -214 -806 1402 -228 -1436 1658 807 -1530 456 821 -1293 383 1750 -998
1205 -998 -621 1341 -609 -636 1741 -498 -1671 1273 791 -1402 639 983 -1874 5 1655 -991
1221 -991 -530 1360 -1037 -979 1641 247 -1600 881 651 -1334 645 1435 -1536 -116 896 -1399
1237 -1399 -258 1209 -708 -974 1081 102 -1024 703 354 -1686 148 1047 -1074 -127 1046 -994
1253 -994 -471 1237 -290 -1033 341 -47 -813 765 318 -1297 152 576 -1093 37 1134 -519 -435
1270 -435 736 -53 -565 763 -128 -559 649 624 -570 307 243 -570 -21 730 -6 -194 416 -46 -404
1289 -404 548 368 -417 320 303 -317 245 30 -202 -293 -160 35 -232 7 -70 -244 -4 236 20 249 -288
1310 -288 -63 -86 -257 -154 -185 -77 223 -15 44 -234 168 -162 -201 254 -127 -311 -78 84 -194 222 64
1331F4l31K35J70l97j9N54m22P6N64n99J75J71l76m64P29j71k63M54K42o29L2
1352b05M89n02M2M62k91m48P75k88l95O42O9o73J46O18n89j18P26n50l69Q38m75
1373i6l44P50M4q11L47M50n19pN17n86n8O08k37m47O33p4m20M18l6n60J46P29
1395D47p53k6P22l14o64R12k18o84R47l53n20L46O83r53K10P97p60n0M63j65p47
1416f80M89L72p88L74O73r90K35M25m11P3N55k29m55M96m5m26K14J013p96j78
1436g9M55n12k41Q48k44q50N72J87l44p7Q47q48P1N08p31J74N06j83m53L40L06
1457B52n25j3Q76r51K96M32l70l41Q07l65p63J288k44n80L90M52q58n9M65j84
1477En78J046l03q05Q97n1o51N43L06n05o1M91o19q3Q89j56q07O44J49j086R74
$$ plain form
1331 64 -267 -32 138 -259 -278 276 -146 -70 494 -105 70 241 -135 -599 130 -41 -304 150 392 -237 -205
1352 -205 284 -218 -176 286 -5 -453 322 34 -361 281 350 -323 -177 441 -148 -266 460 -90 -459 379 -96
1373 -96 -440 310 354 -457 -110 340 -179 -186 331 -255 -313 295 58 -389 244 170 -250 168 132 -428 -282 447
1395 447 -306 -332 390 76 -588 324 106 -578 369 16 -504 -158 525 -428 -218 579 -181 -231 232 67 -680
1416 -680 -191 181 -607 -233 440 -550 -315 110 -301 -228 327 98 -357 139 94 -332 -118 895 99 -79
1436 -79 376 -136 -377 471 227 -623 -51 136 -208 -285 562 -286 -215 293 -438 -264 242 59 -394 -54 252
1457 252 -273 -286 590 -361 -65 367 -3 -344 463 98 -665 623 379 -201 189 641 -217 -276 189 5
1477 5 -573 473 170 -635 262 211 -440 103 409 -96 -157 334 -285 -368 521 365 -442 202 351 -735 239
1498B39J61p70K05O02q36J76O54n49n42J085j7q70R24j4j113P56K82j250L15J354
1518G92r42o62J085q9p25P24L11r87M54L87o11L78K66p53n9R19j96p73O89L06
1538E14j084K34P66j025P5J208r29l04O49j12n08P81K3j014K93Q59q43j17J204
1557F70n15q01R97j55n68R96n71n41N60N63j306L77J389j196k94J414j198o85
1575h64J452k85j026J029L59j654R88Q16j001n3R46r85o50J765o49j496J474M18
1593E84j660J394N33j636L00J348j623L04J743j503q79J864m98j174J286J91j554
1610i80N01J301j447K29R06q39j37J312p59j015J516k51j312J602J69j521M20
1627c05J097j072J13P45j014pJ139l14o91N51j22q60R43M42o94o9L48n45K56P55
$$ plain form
1498 239 400 -370 -165 437 -399 -223 431 -118 -660 425 408 -462 462 448 -665 91 373 -877 -562 792
1518 792 -150 -812 273 184 -541 183 494 -493 -39 348 -263 115 381 -372 -431 488 292 -481 208 514
1538 514 -570 -336 430 -595 -520 688 -241 -545 104 -8 -516 265 288 -726 -433 426 -417 -534 670
1557 670 155 -646 351 196 -372 624 53 -488 72 635 -671 -294 1095 -101 -395 1019 -179 -864
1575 -864 588 303 -723 306 665 -989 -1 815 -186 -239 707 -278 -928 837 188 -1308 166 584
1593 584 -1076 318 851 -785 -485 863 -760 -456 1287 -216 -1095 769 271 -903 383 574 -980
1610 -980 -479 822 -625 -396 510 -329 -466 846 87 -928 588 337 -975 627 796 -725 -305
1627 -305 792 -280 -167 578 -436 -443 696 382 -309 242 120 -740 203 645 -49 -118 230 -315 -59 696
1647F96n51p45P42m8o1K72k97n92K49O81P0l82p4j34j69M35N12n96o44N30K02
1668I6j11K94J80j167PJ417n96m56O46o05o67J761J66j967J017M78j295J000J330
1687A528k337m17K081j142m88K288j489j897K428M44k340J775N43k855J239K774
1703B135k696j69K316k464q17L807j528k677K658J08k737K740J411m234J115L038
1719B006l037K62L045l231j386M397j431k521L396o73l742L546J939m366J204
1734e92K678l741L97M228l304k058M187j454k436M229o33m422L030K032m150J940
1750f9K520m698N46M408k857j655L871k197k444M358j40l988K780R89l656K173
1766e9K594l967N4L452k518j070L446j914k431L552J20l152K470P69l362J757
$$ plain form
1647 696 145 -600 142 94 33 305 8 -584 -335 346 416 34 -40 -174 -343 92 604 8 -636 -106 96
1668 96 -15 279 459 -708 -701 716 120 -336 310 -295 -962 799 965 -1002 15 493 -802 198 1528
1687 1528 -809 -1226 855 -287 -775 1513 24 -1873 555 999 -1341 434 977 -1878 -639 2135
1703 2135 -561 -730 1586 -878 -1695 2112 584 -2093 565 673 -2064 676 2087 -2147 -1032 2006
1719 2006 -1031 -769 2276 -955 -2341 2056 625 -1896 1500 827 -2915 631 2570 -1796 -592
1734 -592 2086 -1655 -1258 2970 -334 -2392 1795 341 -2095 2134 1501 -2921 109 2141 -2009 -69
1750 -69 2451 -2247 -1701 2707 -150 -1805 2066 -131 -2575 1783 1643 -2345 435 1424 -2232 -59
1766 -59 2535 -1432 -1378 2074 -444 -1514 1932 18 -2413 1139 1259 -1893 577 1346 -2016 -259
1782b59K219k887J7K397k216o43L044j527j633K391k77k017K082O36k464Q19J253
1799I35j482J96J235j490k82J504k42q87M82J36n42O75K89r03J04L53j77Q8K86
1818B78l5l84N1K87P1m60K90M08p19l1R46r22o59J467l85q05J153j22j409J171
1838A91P44j985O70J546j996j8K321j683j295K745r98j961K895j04l158K227J345
1855A486k988Q88K601l110J79L081k284j815L663j209k679L480K06l982K690J895
1871B102m210J686K829l840k48M251k899k176M803k007l067M202K82m151K924
1886D81J602m396J924L144l954l05M095l114j807M629j558l558M219K39m404L246
1902D83J713m319J331L686l923n67M078k781k112M633j209l637L749M57m003K662
$$ plain form
1782 -259 1960 -927 -910 1487 -729 -1372 1672 145 -1488 903 626 -1391 691 1327 -1137 -318 935
1799 935 -547 -351 884 -606 -888 616 374 -513 -31 105 -437 238 527 -376 -272 81 -96 -8 278
1818 278 243 -141 -90 197 268 -192 98 506 -213 -244 702 -220 -879 588 203 -602 551 429 -980 191
1838 191 935 -1050 -380 1166 -830 -848 1473 -210 -1505 1240 242 -1719 1176 1072 -2086 141 1486
1855 1486 -1502 -614 1987 -1123 -944 2137 -147 -1962 1701 492 -2187 1293 1499 -2483 207 2102
1871 2102 -2108 -422 2407 -1433 -1681 2570 -329 -2505 2298 291 -2776 1426 1708 -2443 481
1886 481 2083 -2313 -389 2755 -1199 -1504 2591 -523 -2330 2299 741 -2817 1402 1641 -2763 483
1902 483 2196 -2123 -792 2894 -1029 -1596 2482 -299 -2411 2222 1013 -2624 1125 1582 -2421 241
1918B41K097m236Q97L407l249o73L657k142k215L811n23l370L068Q01l633J926
1934a36K181l351M21K608k483p95L198j250k241K763J32k815K126J125k889Q36
1950e70K073k160k45K410j475j553K573k22k181J657Q76k371Q34J806k216j90
1966i54K125j349j097K074j57k039J648P10j971P89J505j805n25K283j128j204
1982a095J868k43j830J659P22k052N21J686j889k24K106j168j165J907j55j853
1998a205J566P88k275Q72J844k363m0K287j703j061K417o28j978K033O20k501
2014a327J193J590k401Q2K525k056r83K708r18k051K558L9k589J797J348k788
2030a273P98K220k504n34K974j654j604K713k64k501K143Q82l018J501J835k595
$$ plain form
1918 241 2338 -1898 -1001 2406 -843 -1516 2141 -1 -2216 1595 1072 -2298 770 1571 -2062 -136
1934 -136 2045 -1306 -885 1723 -760 -1555 1643 393 -1848 915 1047 -1768 358 1483 -1406 -570
1950 -570 1503 -657 -902 1508 33 -1520 1053 831 -1350 307 1183 -1188 -354 1452 -764 -954
1966 -954 1171 -178 -1275 799 642 -1397 251 961 -1010 -221 1284 -521 -1046 1237 109 -1095
1982 -1095 773 530 -1300 359 1081 -971 -450 1236 -653 -877 1229 61 -1104 803 648 -1205
1998 -1205 361 1149 -1126 -254 1590 -773 -813 1474 -229 -1290 1127 499 -1479 554 1174 -1327
2014 -1327 -134 1456 -945 -863 1662 -394 -1377 1331 413 -1638 920 959 -1630 167 1515 -1273
2030 -1273 -475 1745 -759 -1293 1681 27 -1577 1136 872 -1629 514 1396 -1622 -121 1714 -881
2046h81p2K659k080j068K947j047k181K577J72k999K086J496k853P87K203k375
2062f29o44L031j768j396K540n44k263K147R50k944J268K002k658K6K658k118
2078c42j075K872r70k315K827P3k698J824J411k798N33K281k139n25K618j408
2094A69j470K549n74k376K100P46k579J161J673k243j93K468j778r71K401o08
2110D75j977J987M46k226J394J002k103K92J901j631o19K244r08j438J828J65
2126H32k047J350J095k077K64J806j428p86J814o82j277J736K9j796J168R68j751
2143g82M95J498j448o59J738m78j457J741J69j879R72J325k000K62J748j580q50
2160a185K328o58j806J898K85k084J328J472k691L25K239j935n60K487j369j842
$$ plain form
2046 -881 -953 1706 -374 -1442 1505 458 -1723 854 1026 -1973 113 1609 -1244 -457 1746 -629
2062 -629 -1273 1758 -10 -1406 1134 590 -1673 474 1424 -1520 -252 1750 -908 -882 1776 -342
2078 -342 -1417 1455 485 -1830 997 1070 -1628 196 1607 -1191 -658 1623 -516 -1041 1577 169
2094 169 -1301 1248 674 -1702 398 1144 -1435 -274 1399 -844 -1037 1431 -347 -1318 1083 475
2110 475 -1502 485 931 -1295 99 1101 -1002 -710 1191 -440 -1059 1185 277 -1161 667 832
2126 832 -1215 135 1230 -847 -583 1223 -205 -991 823 141 -1136 600 629 -1167 1 969 -782
2143 -782 -287 1211 -237 -896 842 364 -1093 648 817 -1062 -90 1235 -765 -503 1245 -335 -1185
2160 -1185 1143 485 -1321 577 862 -1222 106 1578 -1113 -788 1451 -484 -1044 1443 74 -1768
2176a768K740P1k659K098J016l067J250K300k932k85L020k290j246L598j034l102
2192b290L096M25l390K395J981l913P54L278l143o04L851k649k424M342m84l536
2208b311L335P89m418K514K739m276M80L520l439r01M569k325l151M527n96l618
2224b562L938P58m844K249L013m268P60L730l931j036N029k518k951M452p60m023
2240b964M107J202m691K199K555m260Q11M040l769j343M293j973k455M274r51
2255A075l946L583J230l916K274J920m211Q44L624l136j005M014k568j942M148
2270A988q09l253K876M32l251K245J988l934P24K796k682M5K788k074j534K946
2286A291j024j513K394l93k351J864J174k529J017J018j983M65J979j497p00J584
$$ plain form
2176 -1768 972 1043 -1616 482 1498 -1569 -319 1981 -951 -1236 1784 -506 -1752 1846 812 -2290
2192 -2290 806 1231 -2159 236 2217 -1696 -942 2336 -807 -1411 2440 -209 -2633 1709 1225 -2311
2208 -2311 1024 1813 -2605 -91 2648 -1628 -1148 2372 -1067 -1968 2601 276 -2875 1652 1056 -2562
2224 -2562 1376 2134 -2710 -461 2552 -1716 -956 2774 -1157 -2193 2836 318 -2633 1819 1059 -2964
2240 -2964 1143 2345 -2346 -147 2408 -1852 -1041 2999 -770 -2113 2180 207 -2248 2026 1075
2255 1075 -2871 712 1942 -1974 300 2220 -1991 -1147 2477 -659 -1664 2350 -218 -2160 1988
2270 1988 1179 -2074 802 1234 -2017 228 2216 -1718 -994 1802 -880 -835 1953 -121 -1655 1291
2286 1291 267 -1246 1148 755 -1596 268 1442 -1087 -70 948 -1035 -570 1409 -88 -788 796
2302G96j212m79J781l92j262Q72k8o79J177k2j272O66K98m69N49Q4j050M23L86
2321A67m15N45K38j016O5R93o19j69R82j273k29J699q64o69J210o39r99J589L42
2340I38j853J140L82j709J265J202j937M9J564j521l07K192j523j258K226k24
2356F26j936K265K1k442J557J273k442N96K005k520j05L178k148j390K780j109
2372B09j963K891j06k883J972R96k825J684K033l078J31K515k098j047L363j566
2388B28k194L169k86k585K212P67k826J308J982k805L55K455k370q41L055j438
2404A86j808K669l04k520K403Q45k945J422J660k744N37K351k416m85K374j195
2420C0j448K427m40j923J837N90k216J170J296k339N80J468j332o73K051j171
$$ plain form
2302 796 -416 -895 886 494 -768 104 76 -603 574 552 -720 -54 244 -225 324 408 -642 -219 167
2321 167 -248 297 535 -481 -416 577 -42 -211 771 -502 -731 968 104 -565 645 6 -993 596 938
2340 938 -915 225 607 -1102 163 1365 -572 -523 1041 -480 -787 1405 -118 -1376 850 626
2356 626 -1310 955 976 -1466 91 1364 -1078 -482 1523 -997 -1102 2076 -72 -1462 1318 209
2372 209 -1754 1137 1031 -1852 120 1116 -1709 -25 2008 -1070 -939 1576 -522 -1569 1794 228
2388 228 -1966 1203 917 -1668 544 1311 -1515 -207 1775 -1030 -675 1780 -590 -1431 1624 186
2404 186 -1622 1047 743 -1777 626 1471 -1474 -52 1608 -1136 -599 1752 -664 -1149 1225 30
2420 30 -1418 1009 569 -1354 483 1073 -1143 27 1323 -1016 -436 1032 -300 -973 1078 -93
2436i3j038J846Mj786J335L73j467Q87Q91j522K44J145j080k91J171n75p90J010
2454B64J85r71P68K43j273M79R45q17j35O98m80l86P47k8n68K99K15l36K90J36
2474B75l20j04M85ql84l4K74m62J25M03m06nJ47J5l66M80L09o67k49R45p58j23
2496d28O84l01m38N12O7l16L32P7p04L92M18j89l99P86p49m05J195k35r50O87
2516C6M25r07P21J73q31J05P87p81j00J088p62o00R04N4o12O69K02j193P58O45
2536G81j217L0J337j072m14J347m13r20O92J08r18N72N85j005L05Q01q21j97J015
2555E96p15l66Q41p4q48J012l3j043N77P81r61j70R57o21k99O88k04p03Q27J97
2575D39j104O05P13r97P4R06p99k72R94n82m38R05k66p64Q34J97p97L07M98p05
$$ plain form
2436 -93 -1131 715 719 -1067 268 641 -826 61 952 -570 -326 819 -261 -552 619 44 -746 264
2454 264 449 -522 246 489 -784 -305 640 -177 -312 386 -94 -480 267 239 -329 -30 185 -151 139 275
2474 275 -45 -149 336 328 -56 -90 184 -278 -153 250 -156 -161 -14 1 -365 115 424 -243 -492 453 -305 -428
2496 -428 256 -45 -483 29 96 -220 112 189 -515 -123 295 106 -293 493 -256 -661 534 299 -651 36
2516 36 461 -446 275 448 -383 -278 509 -272 -372 716 -46 -646 258 312 -300 369 571 -622 136 781
2536 781 -436 -406 931 -141 -555 792 379 -541 151 259 -659 -87 498 -507 -202 599 -222 -419 596
2555 596 -119 -485 356 282 -566 446 413 -630 -53 728 -233 -403 554 -67 -366 322 118 -585 242 439
2575 439 -665 -60 653 -344 -270 636 -163 -435 559 -23 -461 444 178 -586 248 445 -352 -45 453 -252
2595b52M4N96n21k98J030m04p11R18O2r71N49O6o91N63M74o90j83Q08n22j65O77
2616C79j12r37Q04L21j000O49K54p21J52Q24o22l03N69j16m45M40J86o22K61K87
2636B48n87J67N35m80n6M00n63R1N16n9m30N91k10m37L22J24k62j05L16j80r7
2657a56L59j61o2J45N4l69L49l7l25J40L02j02o2J6k32ML56r6j03j22J52j96J17
2680b9K28j22k69N6J71j00J10J15r9L9nl4r9Q0M2j30j13L74k72k03M18j8l16O80
2704E04l71m53L19J68n35L55L42n57K53P8k38j23M38k54k61N57j29k92M58R4n75
2725b22L74J33p59N08J69k70l95P08l80k57N96k68m03P25J64o39J11L61o06K03
2745a47N15o27J81N09m75l05P24k39n11N88R4n69J54M13n37K87L16o11J8M44l05
$$ plain form
2595 -252 -208 388 -133 -431 599 195 -516 402 464 -507 42 108 -583 -20 454 -236 -419 389 -133 -298 379
2616 379 267 -670 134 455 -545 104 358 -363 -211 613 -9 -312 257 141 -304 136 322 -300 -39 248
2636 248 -339 -172 363 -117 -173 227 -336 -245 271 212 -218 373 163 -274 48 172 -90 -195 121 -59 -156
2657 -156 203 42 -20 125 179 -190 159 122 -203 -63 239 137 75 91 -141 -137 219 123 20 -102 50 -146 -29
2680 -29 199 77 -192 -136 35 -65 45 160 61 100 95 61 -38 42 84 -46 -159 215 -57 -260 158 140 -176 504
2704 504 133 -320 -1 167 -368 -13 329 -228 25 103 -135 -258 180 -74 -335 222 93 -199 259 353 -222
2725 -222 152 285 -474 34 203 -67 -462 246 -134 -391 205 -63 -466 259 423 -216 -105 256 -350 -147
2745 -147 368 -259 -78 431 -44 -349 375 136 -375 213 307 -262 -108 305 -232 55 371 -240 -222 222 -83
2766h3k60P09k53k91L63P9p09N27J14m87J41M06m14rM74m61l3J95K9k21L35Jn68
2789d16N00K37k09j86K5J56j29K56L6m30J54J1j43P0j6J88j05r6J54k45L21l30
2811a97J86K26k25n0J92k80P8K12j77K90k80p8J14j40j31K36j4j36L19k59L06
2832A92l19J34j51J37K67m71J79K52j2k51M05j00k72K91J20o28K88L24m76k18
2852c09M39j6k34K98k18j15O8J71k16O0K99m60J24L28j16l30L73j37l51N26Ql81
2874a89K35K59k58k73N26m62K7N18m75k69M77j3j74L46j04m87M93L6o50L87M37
2895C87n98k7M17j10m52O22k77l22N44k1m29K20L08n52Q7N39m75n0M61j82l59
2916b69M14l5m47M69R7m81J92K99m88J44M11l81j38M01k07k48M75o7l86K94J41
$$ plain form
2766 -83 -343 366 113 -178 185 264 -445 82 196 -291 -150 256 -158 -167 307 -154 -187 8 37 -184 151 152 -416
2789 -416 84 321 112 -74 -49 107 -22 234 270 -160 -6 5 -138 -68 -84 104 -1 -97 57 -188 133 -197
2811 -197 -11 215 -10 -60 132 -148 -70 142 -35 255 -25 -103 11 -129 -260 -24 -38 -174 145 -114 192
2832 192 -127 7 -144 -7 260 -211 -32 220 208 -43 362 262 -10 281 401 -227 61 385 -91 -309
2852 -309 130 114 -120 178 -40 -155 -87 84 -132 -72 227 -233 -109 219 103 -227 146 9 -342 184 192 -189
2874 -189 46 305 47 -226 300 -162 -135 383 -92 -361 116 103 -71 275 171 -316 177 213 -437 -50 387
2895 387 -211 -238 179 69 -383 239 -38 -360 184 163 -266 -46 262 -290 -203 336 -139 -189 272 90 -269
2916 -269 145 110 -337 132 229 -252 -60 239 -249 -105 306 -75 -213 188 -19 -267 208 141 -245 49 190
2937A90l81K21K32m15k7L97k02k24L57r8k34K43J36l62K31Nk84J54K72k72kJ56
2959I3q4j49K85r4j79J59K9q5L5Q5j47j6J76j04QJ6n0J6O7n5q9O0j1K1O7K0q7
2986a3k2j2P9j9J6k3j1p4P8M9m7q4L7L2qR1q2j08J02O5j01J06L3k04J4J92p1j31
3014a16K38j39j38K04j4j42J55L9k25J86J10k37o6L30k34r7L51j23k75L32Ok63
3036a18J75J24l68J22L35l39J7K46k08j77L68j12k79L21J0k88K56J25l28P8K58
3057B18k90k5K80k11j92L76r3k46K74P9m27K35K19l37P4L20l39q7L69k37j73L15
3079A02ol41K66R2l02J87K34l06lK86k21j72L37q5k56K61L8l12K16J38k92K6K15
3102A02k40jK97j33j78K46l9j98J55J53k49L8K04k18j4K36j10k23K24K6k31K08
$$ plain form
2937 190 -191 30 262 -153 -180 217 15 -209 148 50 -184 59 195 -167 64 69 -215 -61 211 -61 -63 93
2959 93 9 -140 145 51 -128 31 60 -25 10 95 -52 -68 108 4 12 28 -22 -6 61 6 -83 -23 -34 -13 54 74 -13
2986 -13 -35 -47 32 13 29 6 -5 -79 -1 48 1 -83 -46 -14 -22 69 -13 -121 -19 46 -55 51 84 -120 -106 86 15 -116
3014 -116 122 -17 -155 49 35 -107 48 87 -138 48 158 -79 -145 185 -49 -146 205 82 -193 139 145 -118
3036 -118 57 181 -187 -65 270 -69 -52 194 -14 -191 177 65 -214 107 117 -171 85 210 -118 -40 218
3057 218 -72 -97 183 -28 -220 156 63 -183 91 170 -257 -22 197 -140 -66 254 -85 -172 197 -40 -213 102
3079 102 96 -245 21 113 -189 -2 232 -74 -77 209 -12 -184 153 68 -188 73 111 -201 15 153 -139 -113 102
3102 102 -138 -139 158 25 -153 93 54 -144 11 164 -85 -47 157 -61 -75 161 51 -172 52 78 -153 55
3124E5J06k72J9K31k26L4J45q9j27J91M1k08J39J95l25P0J51j74o9J94j12j20
3146a51K77r7j46J57P9k73J14J49j29o8J80j60p4K84q3k22K84J7l93K01K26k83
3168a11N7K66k71j95M52j67k42L28jk99K06J06k72J04K59l15m8L34k48j39L19
3189A23j3k61K22M3l05J27K29l11LL53k48j90L77j63k08L42ml48K61J68l56N9
3211a00L24k61m1K73k11j65L63j25k90L52Q2l81J82K39l73l0L81l14k9L49j34
3232I1l03L75j7l36J74K17m17J58K93l88K7K61j43j69L14o2l44L40J50l98K03
3253B6J23k86JL37k71n3L22j43k66L53J5l02J62J78l55J26J79k28m6K08j00j07
3275a27K33p6j70R3J23j71N8J95l26N8K62j76r4K74r5l07L36Rk46J06R7j03P6
$$ plain form
3124 55 161 -111 -92 139 -87 -53 92 3 -124 67 108 -100 39 234 -91 -21 130 -44 -113 81 -31 -151
3146 -151 126 29 -117 40 119 -154 -40 109 -20 -88 92 -68 -142 142 59 -163 121 138 -255 -54 172 -111
3168 -111 -54 212 -59 -254 198 31 -211 117 116 -183 23 129 -143 -39 220 -95 -143 191 -57 -196 123
3189 123 110 -151 71 114 -191 -64 165 -146 -143 210 -38 -228 149 -14 -222 120 116 -232 29 197 -159 -100
3211 -100 224 -37 -78 195 -16 -181 182 57 -233 119 201 -180 2 241 -132 -162 219 -95 -124 225 91
3232 91 -212 163 146 -190 -16 201 -216 -58 235 -153 -126 135 -8 -177 137 75 -269 71 221 -177 26
3253 26 149 -137 -136 201 -70 -123 199 56 -210 143 158 -144 18 196 -159 -33 146 -82 -128 80 -20 -127
3275 -127 106 30 -140 -47 76 -95 -37 158 -168 -110 152 -24 -118 156 61 -246 90 99 -147 -41 56 -47 29
3298B9J04k10l3K08m8j34Q9K6j52J31J15j58l8R2j35nK19o3j50P4J24j55J05P2
3322A07j98%J49k4j00J46J6k41K02J6j44M3J43k43J37J45j01j89J79L7j95J76
3344F1P1k38NK07j04o6K14k59p8L28j37j35K51Pl40K49J53l49N4K74k77j0L61
3367B42j99k03K69m0l44L59J87m92J65K68l23K0L05k96j13M38k01k57M02j8l54
3388a85K04K77m81J83K57l85q1M15j94k02M40k88j44M08On78L81R4k58J67K03
3409B39l38l1L91l97L8L44k05l58M48p9l05L79P5l72P7K22j88p9L36l11n7M00
3431B29j80j31MM9j79L51J06m79J95P1k46J19L44j60k05O8J03o9K68l63L6J08
3453C9J45j81N1Q6l09P9J95j24m4J03j90J74J98j48j66r6J71M4o9J86k96J29N2
$$ plain form
3298 29 133 -77 -110 98 50 -84 5 31 -121 10 125 -33 -71 21 -114 -119 100 37 -113 -39 85 -70 35 107
3322 107 -91 -91 58 34 -66 80 96 -145 57 73 -71 -28 115 -128 9 154 53 -136 43 80 -115 61
3344 61 132 -106 -101 106 2 -64 150 -109 -187 141 4 -131 120 127 -213 36 189 -160 -106 168 -109 -119 242
3367 242 43 -160 109 69 -275 84 271 -221 -56 212 -111 -91 214 -82 -195 243 42 -215 187 169 -185
3388 -185 19 296 -185 -2 255 -130 -211 204 10 -192 248 -40 -184 224 230 -348 33 127 -131 36 239
3409 239 -99 -130 261 -136 -98 246 41 -317 131 52 -253 126 201 -171 -94 128 -60 -139 197 -114 -171 229
3431 229 49 -82 -78 -29 -208 143 249 -230 -35 36 -210 -91 253 93 -112 -44 59 -10 258 -105 -69 39
3453 39 184 3 54 140 -169 -90 105 -19 -63 40 -150 24 222 74 -92 -188 -17 27 -42 144 -152 -23 29
3476B9J99o8k50O4n7Q8l5J2k0j13J20N7q5p8K39k28J33K34k22j01P9q0j5L92j12
3501A82k52n4J5N5L02l8j88k13K58j63J88M0k24j44K51P1m0K4k58m7J68M71o23
3524b19J98K16m11L39J90k88l28K70r1kL84om72J34J79j56J11M08p03J81L18p5
3546A77k25K06k32j00J80J49m07L45J64o15N22J6k65n3L21k64K51J99n32m9L29
3567A17N6j70L6J13k87l2L86k71k4N1k56j81O09K2k30K33k03q9O1K58m44K03J89
3590A47j54J43J34m51o8K53J31l38M09j97j38L8N6o7j3JO1l5K62K6k48m5MJ57
3614F8J28J3l30M4Q8J4l0J83k26j00L22p7k76J62J02k85P1JqP3K37l98R7K08j47
3639f6j3J42J82j40QP9l16L6J0K62j55j06J28j36J78j39O7J56qk36P2%J57l49
$$ plain form
3476 29 228 160 -90 -26 -83 5 -30 -18 -38 -151 -31 26 -59 -137 102 -126 7 241 19 -82 -3 -83 -98 294 182
3501 182 -70 -124 -109 -54 248 210 22 -191 67 -96 92 132 -92 -236 15 86 46 70 -188 -235 -67 404 -219
3524 -219 -21 195 -216 123 313 25 -303 -33 -124 -126 258 252 -220 -86 93 -63 48 456 -247 -66 252 177
3546 177 -48 158 -74 -174 6 155 -252 93 257 -358 164 180 -85 -138 183 -81 170 369 -163 -212 117
3567 117 173 3 39 152 -135 -167 219 -52 -76 -25 -281 -462 147 169 -61 172 -31 -120 -59 199 -245 -42 147
3590 147 -7 136 270 -181 -249 4 135 -203 206 9 -129 -91 -35 -102 -115 -114 -53 -88 174 200 -48 -93 -89 68
3614 68 196 209 -121 -77 11 25 -5 178 -48 -148 174 97 -179 -17 85 -200 -129 -128 -136 -63 174 -224 -127 81 -66
3639 -66 -79 63 245 105 113 192 -124 -88 -78 184 29 -77 51 -85 93 -46 21 177 169 -67 5 5 162 -187
3663a87J00K6l9P8O3j06n8O7OM5l7M6K07k21q5j35K13K46l38J09J24r2j81J84
3687C5r8j60J96j08K37j15J3m2j9J54k0k86M39l33p2N16n64L76j29J57l23K89
3709A43J58m73J7k2N0J10J8L7j70J50J44m19L12j70o4O5J16k31M4O4j17L81k54
3732a11J1J5K46j45l98K99R1J18l22K30l4k5J60j10R7k06K00j64J46J69l09j34
3754a76L18N7m20K24p3R8J44k82J87p3r8J24k12K22K18n31O21k66j99J17R5j61
3776f6L56l4k06J66j43n10K44J43k84K96K88k45J78l3m14J06J67L50m54M12k21
3797I6l16K42R4J75l31r0J25J87j6L1j1j69J46j85m69L67K45k13J48L26m94K11
3819I9p3k97J86O8M6k77K3k05M53J15j37j01K63j12l34Q0M31J72l61n2j93J18
$$ plain form
3663 -187 -87 -61 -100 -22 41 -65 -123 -56 -50 -5 -42 4 211 -10 -95 -230 -17 229 -109 0 124 32 -149 35
3687 35 -63 -223 -27 -135 102 -13 0 -42 -61 93 73 -213 226 -107 -179 337 -227 149 20 177 -146 143
3709 143 301 -172 -155 -177 -127 -17 1 38 -132 18 162 -257 55 -115 -179 -114 2 -229 -185 -121 -238 143 -111
3732 -111 -100 -85 161 16 -382 -83 8 126 -196 34 0 -25 135 25 122 -84 116 -48 98 267 -42 -176
3754 -176 142 199 -221 3 -70 28 172 -110 77 4 -94 30 -182 40 258 -273 348 82 -117 0 95 -66
3776 -66 290 256 50 216 73 -437 -193 -50 -334 -38 250 5 183 150 -264 -158 9 359 -95 317 96
3797 96 -220 22 116 291 -40 -130 -5 182 166 197 186 17 163 -22 -491 -124 121 -92 56 382 -112 99
3819 99 26 -271 -85 -17 29 -248 -225 -430 23 138 1 -100 163 51 -283 -203 228 400 39 -13 -206 -88
3841h8j22j14K69L22l01j46M23m62J29q8J9N02j49k68L86o9o0J67m64r9J40r3
3863a66J10L16k48l39M06J66q9p5m9O1m18L94k24j72N99k72j37J16l1K70l68k2
3885a72P4J41K55r1l75J42l4j24M53k48j32K50k76J45k8k6J46R9Rm91L2L71k9
3908I1k47M21q4m25K25j6q0NJ77o3j96K32J77k91L61k28MPl28J1K84K51k72j40
3932a24M44n58L35kl71L52J42j62l78L39n4j6K95k24qJ43M3n0j25L5N6j88N5j09
3956a30P3mJ31k8l8o3MJ43L3l6k95K19J50k17K86k90r7K9J15M7n3K11k87K10q
3981A05j41k23L56r8P3J58j59j64NR5J7p3J20o4j17L2J83k23J86j2O2j67J56n3
4005E4p7j4J44l78K04J64n2o9m5mO1J30k53J52j09O8M5j54K23j11j4J25M2k27
$$ plain form
3841 -88 -210 -324 -55 267 -34 -180 243 -219 -90 -178 -159 343 194 -74 312 243 183 350 -114 -213 -73 -166
3863 -166 -56 260 12 -327 79 245 156 81 32 93 -325 69 -155 -327 272 0 -137 -21 -52 218 -150 -172
3885 -172 -98 43 298 207 -168 -26 -60 -184 269 21 -111 139 -137 8 -20 -46 100 199 208 -283 -251 120 91
3908 91 -156 265 181 -244 -19 -35 -115 -110 67 4 -192 40 217 -74 287 59 63 70 -258 -247 37 288 16 -124
3932 -124 320 -238 97 95 -276 76 218 56 -322 17 -37 -53 242 18 10 153 196 146 21 56 112 -76 -21 -130
3956 -130 -57 -61 70 42 4 -59 -55 88 121 85 -210 9 159 -58 228 -62 -159 -130 -15 32 -21 190 -97 113 105
3981 105 -36 -259 97 -1 72 230 71 -93 -88 7 24 -49 71 7 -110 -78 105 -118 68 56 118 -49 107 54
4005 54 -23 -37 107 -271 -67 97 45 -24 -69 -73 -12 118 -135 17 -92 -24 21 -133 90 -21 -35 90 132 -95
4029i5J43j37K5J35Qk10K99l0j93P3L1j38M6K96k73L6J31k21M1j04K31q4j17J67
4053F0j83k19L08l4o6R1O1j61K76r7OO3j22j10J31J27j62K5P7j12M2R4j42p7K11
4078H7r2o2N1M2n7L4J94j54p6Q8j54Q4Q2n7j48K01k7r6J02lj26pJ66j26J6R3j50
4105i5K7J74k5r6N6l4l9J48J5j75K2K0qm9J04o7o6J34K2j38R9J13k43N1J51j12
4131a1L4Ll4m%Kj2L6m6J8K3M5j3j61J78r7L2oM9r8k9K51j23l3k0j6p0J41K1n8
4161Bn5K7l2O4J26k20j6J41Jq7K00j61m7J69n6j07R3L6j47k0J86j11j20J73r1
4186e2L2K9j3q6J04L2j03M1P8j58N2O8j09K6R7J4j01O8L1q6j1Q1p4L0Q0j28nJ02
4214C9l2j30K06J2j20J15K3k14N9J32j24m2J02j26m7K48m7j32O5M3l4j9Q4m1j19
$$ plain form
4029 -95 48 -89 -64 71 79 -131 168 138 -55 18 49 -89 -43 253 -20 16 147 -74 -33 -137 94 10 -107 60
4053 60 -123 -342 -34 -68 -134 -43 18 -143 133 36 42 105 -17 -127 4 131 -31 -6 71 -41 1 95 -47 -124 87
4078 87 -5 -67 -16 26 -31 3 197 43 -33 55 -99 -15 67 10 -138 63 36 -60 42 39 -87 -94 72 -54 -38 55 -95
4105 -95 -68 106 81 -15 41 7 -32 116 131 -44 -22 -2 -10 -59 45 -22 -88 46 68 -70 29 142 -101 -50 101 -11
4131 -11 23 26 -8 -12 -12 -10 -22 14 -32 -14 9 54 41 -120 58 -39 -7 -13 36 -62 -91 160 37 4 -16 -32 -102 39 60 2
4161 2 -53 -26 -58 6 132 -88 -104 37 38 -49 151 -10 -57 112 56 -51 42 78 -69 -89 97 -14 -134 39 -52
4186 -52 -20 9 -4 -90 14 46 -57 -16 62 -96 -44 24 -85 -59 38 52 -49 19 50 -36 -47 34 -40 -10 70 -58 -63 39
4214 39 7 -123 83 95 -25 90 113 -101 -42 90 -34 -76 26 -100 -147 101 54 -78 -13 30 -4 -23 61 20 -99
4239i9J27K0j66J12N3j36J12l4l8M5J38j96J47M9o9j34J40j16m7J67l9m1mJ71
4263A62j78r2J89q0o5J63q9jJ5K9j76K44n7j07O1Q4j29L8N4q4q6P9MJ0N1Kj29
4290h8L4J16j15P3N4j03J8J41j05n7R6jj60J30L8l0q2J27j61k5K44j42r1J93j02
4315Bj22K17n2q9M0P0j42N3J15j18l9J18p8r4K35l5j63J55l7j48J00M0k9r5J49
4340E3l0k7K7l8r2J29P5j37J03R9k53O8J32j89P4J10j56L3Q7kj49J03J2q9P9k
4366B0j46J20LJ0n7J70j17l8J00k8j33P3J32j54P0L3j6k9m2Kj5J16mj85P8K48
4392B11k69J21l8j45K0J50Qmm8O1k08J40jj6M6P8j25k9J48j16j3l8J06j54J33
4417A8R7j57j5PjJ35m2j5l1R4o9q8J5J66j18l9Q5p5J53j57O9nm0k8j13K66q2k4
$$ plain form
4239 -99 28 48 -118 -6 47 -89 23 -11 -49 -4 134 -62 85 134 65 -69 71 -45 -92 75 36 -5 -9 162
4263 162 -16 -108 81 1 -64 99 10 9 24 53 -123 121 64 -43 18 102 -27 11 65 -19 -105 -26 -22 -12 39 41 -88
4290 -88 -54 62 -53 20 74 -29 -11 130 25 -32 64 63 -97 33 71 41 -41 86 -75 -100 144 2 -89 104 2
4315 2 -120 97 45 -44 -4 66 -76 -23 92 -26 -65 53 -25 -119 116 81 -82 73 36 -112 -12 28 -1 -96 53
4340 53 23 -4 23 -15 -107 22 97 -40 63 162 -91 -23 109 -80 -6 104 -52 -19 68 66 -83 20 32 -57 22 20
4366 20 -126 -6 -3 7 -50 120 3 -35 65 37 -96 -23 109 -45 25 58 42 13 -29 -27 -42 74 70 -115 -37 211
4392 211 -58 63 25 -120 -100 50 58 54 6 67 -141 -1 -2 -18 28 106 -19 -48 100 -16 -29 -67 39 -115 18
4417 18 115 -42 -57 -50 -51 84 42 27 -4 90 21 -67 -52 114 -4 -43 42 -33 120 -37 32 27 -13 -41 -154 112 30 6
4445FP4j45O9M8K5q5L6k1M5q5l4J23q4O1Oj57J31J0J0r9k6J53j25Q4J0l0q6J03
4473A7n4rR6n6o1J33Mj22Q4n1j40J71M3l1oM3q2k1J38r8N2Kj2PKL5q7j1N0p9j0
4504e3O9K5kl7o2L0J13o9q4KN9r7M2R3o0l4J85j81Q7o3j00J26O0j23J01q0J71
4531A18j58L9J2OR7J3k08K3L2M5K8l1pj1NO7N0r0L6n3m6R6j01J20K7q9K0n8M2
4560B4o2QJ15j99J60k9N0p1J29j77M2N8Oo7r5R9K2p8J38q1JrJ4k0J90j64o2l1
4588h9J72p6k2J2r6ok0J73j47J45p7N7o8J04j15o9J98k4k06K06P2p7q9P6J15m9
4614A00L6k03J04J4kk1j2oL8j03k7M9o3J4N5L2R6p3j56K15j27J01J20r1k60K10
4640D0J4Kp2Q7j59M5J68p8j4j24Q7n8J02k5JM2o3%jJ46k00k2N9P4r4Q8Oj08J9
$$ plain form
4445 6 80 -65 4 52 77 -8 28 7 52 -33 -67 56 -28 33 39 -118 13 23 33 -66 -92 61 -64 20 30 0 -86 17
4473 17 -37 -46 50 -6 -67 66 70 -52 32 -19 -159 12 55 24 18 61 -21 -42 96 -2 50 52 40 47 49 84 -3 -14 36 -43 -53
4504 -53 16 41 39 2 -60 -30 83 14 -70 -68 -9 -106 -64 29 -31 -65 120 -61 26 -37 -137 -11 49 -74 27 -53 118
4531 118 -40 -1 11 17 114 127 -81 -58 -26 19 47 16 9 -2 3 70 120 30 66 13 -33 63 -38 82 109 20 40 -18 24
4560 24 -38 -30 85 -114 46 17 67 -4 125 -52 -10 48 54 -13 -108 -9 13 -65 73 -8 -7 -16 -2 -22 168 4 -58 -89
4588 -89 83 7 -15 -3 -99 -105 -125 48 -99 46 -31 26 -42 62 -53 -122 76 52 -154 52 124 47 -42 34 149 100
4614 100 136 -67 37 51 49 28 16 10 48 -55 -82 -33 -96 -82 -27 5 101 28 -128 87 -40 61 181 90 -170 40
4640 40 54 56 -16 71 -88 -43 125 47 33 -91 -4 -62 40 15 16 58 -5 -5 -6 140 -60 -82 -23 51 -43 45 51 -57 -38
4669c8J11p2j4j7m0O6L4L1j30J49j29k6J32k6m3J28o9mO5j8r3j01K34Kk98K59
4695I3k8k16J33l9K2o1O2p2J56%K9k33J56L1j02Q3J8Ro9j9J14r8J05j12k7R5k5
4722Ej15J97j30J1K1R8j30R6k5J5o9Q3n5L7rj41J86qo5l3Q2j28J05j94J64P7p7
4749bKo1o3K48r0j16K1O1J51j09J16j16j2J58j18k25K59J05j74J02%j60O6p4j59
4774a90J87k9L3qo0J36N0j06j7p1j5L2p5R2O7o7J61o6m6p3J14K2j50N4L7j12J90
4801I0P8p9j86n5L12j01p2k1J80k35K19q8Mj84N2P8L8k3oL3j04J56M5q0O9n2j73
4828a05J43j94L76j49j44kQ0k1l5J2J28l90K42J6j6n5K65j92K6J7j25L1K13j12
4852IO1k14J65Q6j56J56j64J43n3j68J26Q2J64k13j07L1K68k77J87k54L03j79
$$ plain form
4669 -38 73 1 -13 -30 -70 -4 30 61 -69 80 -49 -75 57 31 -12 116 47 43 108 90 -3 -104 130 132 -166 93
4695 93 65 -151 -18 -57 -35 -96 -34 -106 50 50 79 -154 2 33 -69 14 32 41 -28 -47 67 -31 74 -38 -65 30 5
4722 5 -110 87 -43 -32 -11 87 -43 53 28 43 -26 57 2 39 30 -111 75 67 2 -31 51 -77 28 -166 -2 75 -2
4749 -2 0 -61 -124 124 34 -82 -61 0 151 42 158 42 30 188 70 -155 104 209 35 137 137 -23 43 -31 -190
4774 -190 -3 -32 1 -7 -67 69 119 13 -4 -75 -90 -58 -133 -41 26 -41 120 54 8 -65 49 71 -79 -25 12 -100 90
4801 90 168 89 -97 -152 160 59 -13 -34 146 -89 130 42 46 -138 -86 -8 30 7 1 34 -70 86 131 51 120 68 -105
4828 -105 38 -156 220 71 -73 -75 5 -16 -51 -39 89 -301 -59 -43 -59 -114 151 -41 -15 2 -123 -92 121 9
4852 9 70 -144 21 107 -49 107 -57 86 33 -135 -9 73 237 24 -83 -52 216 -61 126 -128 175 -4
4874dQ5K2m9K9N9j13j38K23j00J74m36K04J50j21K10q5p4k53K44K0n8K78l51K41
4898A57n2l15Q8L35l59j04L13M4n7Qo4J2J9J30l03L81k62J50j99J25J38k31J45
4921I9j05p2K06j15N4n6J95n33K64L5R8q4l0K25k05j05o9m4N9K97k99N4K15k96
4945b12K63K24k26j4r5p5kJ13l0P1q2J71r1J46k38r3j0J09n7Q6J35L1k8j93J45
4970D8L6J38n5m9k36N9LN2k01j2K53k1m7L3N9j5k1j03J95k67K33k02J29M2n0Q5
4996H6n2N6J2j33k4R8j9r9pR4Nj03J17j28Ko1K61j27R1J37m90M95l01K3j05K04
5022C2q4J49J12l03o4J27J21j8m3j05K82j80l8J34o4K0k8k3J28j13qJ09l12k3
5046a92R4J33j63K6K38k62K31L5j30P4j44L0P9j0k25J36Q6J13j73qj6NK06j53
$$ plain form
4874 -4 81 103 54 83 142 29 -109 114 14 188 -248 -44 106 -15 195 110 36 -217 27 47 -11 267 -84 157
4898 157 105 -210 -122 213 -146 -250 63 107 50 58 -6 6 25 155 -148 233 -29 121 -78 47 185 -46 99
4921 99 -6 -78 128 13 67 11 206 -327 -63 -28 70 -14 -44 181 -24 -129 -198 -242 -183 114 -185 -131 84 -212
4945 -212 51 275 49 35 -60 -135 -137 -24 -54 17 -65 106 15 161 -77 -170 -180 -71 -128 -42 93 124 96 -97 48
4970 48 84 222 167 118 -118 -59 -56 -4 -205 -217 36 15 -32 1 60 45 24 -79 116 -151 82 -120 9 51 1 86
4996 86 34 90 102 -31 -55 43 24 -75 -82 12 17 -86 31 -97 -95 -156 105 -22 69 206 -284 211 -90 -67 -172 32
5022 32 -52 97 209 -94 -158 -31 90 72 29 -76 206 26 -12 122 58 78 50 27 155 42 34 143 -169 -192
5046 -192 -98 35 -128 -102 136 -126 105 140 10 84 -60 -30 49 39 -186 -50 36 149 -24 -32 -48 -43 163 10
5070A0n9K6k1O7n0j11J69J09j29K20j48l32L52j22j15J21j23P2k4k8J02r8m0N24
5094C72l24M1J3P3k41R9R3k80L45l12M3rK82l0k31j02L89l22Q0j34L0j28J14K15
5118G6l59K52L3QN9J02k57o6K11M7k89L74j27M7k20n9J62J7j21J59k51L08l23
5141b17R7J41J05Qj33L2n8N1J01L7q6j69rK08k6J20J14m44K87J21k64J40j88l9
5165g1Q2M8j76J4Q1J73pm5j4k19K94l3j52Q4L2k35J08k6J1J79k54R4j28Nj77K45
5191h7J86l35J77J78O0n2RL5m05K07Q8K6j49l3J49Pk67K02K57l26K6o6JK32K4
5216A44l22J44j17J28o6Q9J37k06J89l11L40l44M23n4nj76n5J21k54L26q7j34
5238i0q2m3R1oR8J40pj85PK09n4J17m76K91Q2r3k17L98l68J26nP4j65L26m9J38
$$ plain form
5070 10 -49 -23 -44 23 -27 -138 31 140 11 231 83 -249 103 -19 -134 -13 -136 -64 -88 -116 -14 -112 -152 372
5094 372 48 89 102 175 -66 33 126 -154 191 -121 -78 -87 195 165 -66 -168 221 -101 -21 -155 -125 -253 -139 76
5118 76 -283 -31 2 10 69 171 -86 -152 59 106 -183 191 64 111 -109 -168 -6 11 -110 49 -202 106 -217
5141 -217 -120 21 126 134 1 33 -25 26 127 164 78 -91 -100 108 82 202 316 -128 159 280 16 156 -32 -71
5165 -71 11 59 -117 -103 -22 151 144 99 85 -134 160 127 -25 59 91 -144 -36 -62 -51 128 -126 -32 -160 -155 -332 -87
5191 -87 99 -236 -59 119 179 127 136 171 -234 -27 61 87 -62 -95 54 61 -206 -4 253 -73 -47 -113 -112 120 144
5216 144 -178 -34 -151 -23 -89 0 137 -69 120 -191 149 -195 228 174 169 -7 -62 59 -195 131 44 -90
5238 -90 -172 -215 -124 -130 -32 108 101 -84 -77 132 78 195 -281 10 92 -1 -218 180 -188 -62 -67 7 -158 168 119 257
5264B57k36K1j86K35P2k85R1j72J15j2R7l0QK09J17n99K44L3n9P7r0J32j31K0
5288g2J11Nj95J75M3k07K15O4j30J98j51k08L56j32j00J02M6oj57M2m1J41NO2
5312A66k04L4p9N3m0K22J3l19R6r2K29K9k01R5K18m03L19J80p7k41j86J18j78
5335b48L7n4J8K73N3j3m5qj13R4J72k3o02L38p2J8J32R1L3k34J37J60L1j30Qn7
5361dJ27o4j43K18j38Q2q0N2r6L2K15k37j58K54j80n2o9K24j5J57j80j66K51j63
5385a33m1J41J34J6k74j1J48m9m6J37r5N9J45J00j01j21j70J87k09K56M2nm1j01
5409c2P0O8k18J36r5L1Q4o5J26k64l3M19k11K22k97R8Pl67K89J32j30Ol4L9pO8
5435D2r2R2Rj7K4Q1n9p3J45k02K7L02k96J09j31J64k61O8J63j88Q3p0K70k27J18
$$ plain form
5264 257 21 42 -144 91 163 -122 -31 -203 -88 -100 -3 -33 -25 184 301 -298 -54 -21 -80 -3 -93 39 -92 -72
5288 -72 39 44 -151 24 67 -140 75 139 9 207 56 -152 204 72 -28 74 120 114 -43 -1 -42 99 104 166
5312 166 -38 -4 -83 -30 -70 152 165 -154 -58 -150 79 108 -93 2 220 -183 136 316 239 -2 -188 -70 -248
5335 -248 -211 -265 -247 26 79 66 21 13 -100 -6 166 143 -459 -121 -193 -175 -43 48 81 -153 -16 144 175 45 53 -4
5361 -4 123 59 -84 134 -4 78 -2 50 -46 -14 201 -36 -194 60 -120 -172 -241 -17 -32 125 -55 -221 30 -133
5385 -133 -174 -33 101 117 -157 -168 -20 -69 -115 22 -73 -14 131 231 130 9 -161 26 -183 73 115 110 69 -32
5409 -32 38 106 -112 24 -71 -40 44 -21 105 -159 -192 227 16 238 -59 39 46 -321 -32 100 -30 -24 -58 -19 -26 42
5435 42 -50 42 51 34 58 139 80 7 152 -50 -23 279 -17 92 -39 125 -136 -68 95 -93 -10 -80 190 -37 81
5460H1p0N0j61N4n2J15K48l42K7J35N0J0j24l2r7P6n9r3K91n1k20K80O1j34j13
5485g0j8K9J50k16J27K6j05L06N0k28p9m2j8L34j74R2j09l15M63K1n40L18j45
5508a43MJ26l1j10J69j89K03j11J33Rk99J55O0J66k13J2j67K11q5P7L8K0j23L37
5532B49j05k38Q9N7O2o2J43j06p1j70K64q8n0L9J46j84J84j05q6l6K30q4J00r3
5556H5j64M5K06j21o5R8k59L35j64q7P8J27j83J45pj87j25J70n1j4L8rj81L28
5580C8k6j73K98k5j04%k4j71J51Q4O0k04Q4O7K9j31n1Q2J72j23j51J04j8Q4j47
5605i5J63j78L0J81q4n2K41l52K72j98j18J03K35k80q8L33k02k1L20j84j98J35
5627c7J85m67L06K28l32L10j81M2M2J07j24nJ06j15k44J18J2j08J72N7j40N2j48
$$ plain form
5460 81 11 61 -100 -46 -98 17 265 -77 -50 85 135 145 21 -11 -108 -32 -91 -184 107 56 -164 116 177 43 -70
5485 -70 -88 -59 91 -125 2 28 -77 229 279 51 -28 -70 -88 246 72 164 55 -260 203 224 -316 2 -143
5508 -143 -139 -13 -44 -154 15 -174 29 -82 51 60 -239 -84 -24 142 -71 -59 -226 -15 -100 -23 15 35 -88 249
5532 249 144 -94 -5 52 114 52 195 89 18 -152 112 24 -26 13 159 -25 159 54 -32 -68 162 78 178 85
5556 85 -79 -34 172 51 -14 84 -175 160 -4 -91 -13 114 -69 76 69 -118 -243 -73 -124 -138 -100 -109 -290 38
5580 38 12 -161 137 112 8 8 -16 -187 -36 48 108 -96 -12 55 84 -47 -98 -16 156 33 -118 -14 -32 52 -95
5605 -95 68 -110 -80 101 17 -35 206 -146 126 -72 -190 -87 148 -132 -220 113 -89 -110 210 26 -172 -37
5627 -37 148 -319 -13 215 -117 193 12 54 96 203 79 74 180 65 -179 -61 -49 -157 15 72 -68 -16 -164
5650a64J27M3j12k1J74k6L1n2R7k6p3QJ44m71L03J36k2n0K99l29n7m9j17R1K4
5675i2L5p1K92j92L6N0oj47K16j08k10K46k08K49jk1q7p3P3J64nj19j8j86O7Q6
5701c0l9m5P9J18j66Q3L1j54J30j32J02J89J2j29O1k45j07K76j33mJ10J00n7J3
5725F3n0l12K69J26k37L7K39j90P4m8O7r2J04o4R7N7r6N1j6m37K30L4J79j74J89
5750A00j67j06M56l32J61m3J01K5m53L39p7m2j0J21L3k46L06j98r4R3L8j34R3
5773c6j1k19K26Q3j48J28k00J63j70K57J6j81JL9j31J27nK31j01k05j83M18J20
5796B19k22Q0J76k02k94K31J79k34L56l90k24M13j86m7k3L35j24q6k48K42J1M68
5818D30l67l39K07J32J28l41K3K21qJ34k47j71J31q7P2J63n9j53J46l03K90j55
$$ plain form
5650 -164 -37 6 -106 -127 47 21 52 0 97 71 -2 6 150 -321 -18 118 96 46 345 16 -41 -90 -207 -116 -92
5675 -92 -57 -128 164 -28 8 58 52 -95 121 13 -197 49 -159 90 89 68 -19 -92 -19 145 140 21 3 -183 -116 -30
5701 -30 -69 -114 -35 83 -83 0 31 -123 7 -125 -23 166 178 49 110 -135 -242 34 -99 -103 7 107 50 63
5725 63 13 -299 -30 96 -141 -104 135 -55 19 -29 38 -54 50 -14 83 140 44 95 79 -358 -128 -94 85 -89 100
5750 100 -67 -173 283 -49 112 69 170 195 -258 81 4 -38 -48 73 106 -140 166 -32 -126 -33 5 -129 -36
5773 -36 -47 -266 -40 43 -105 23 -177 -14 -184 73 89 -92 -91 -52 -183 -56 -61 170 69 -136 -319 99 219
5796 219 -3 77 253 51 -243 -12 167 -67 289 -101 -325 88 -98 -145 -168 167 43 -43 -291 -49 -38 430
5818 430 63 -276 -69 63 191 -150 -127 94 86 220 -27 -198 -67 -154 -82 81 22 -131 15 -288 2 -153
5840a53qK41k33p2J05J24L69k02j66Mk94J33J47j80L46m21N67n34N30k41j16L65
5862C11j62n6j61Q3J36k27M3J91j92L22j51o1l08L45J72l85J8j71j69L99jJ43
5884A19l11L99k14k04q2QL71l28P7J93r7k03K19k73K2M44P3j16l10M18o12L82
5906b5j69J49M1l08K98j3K95j42k04J53j66o2O4K62j48M15m79k50L66O8n28N1
5928c32N74k79L28j35j92k95K47Q9m6k50M18l96K42P2M5l81R5K02N8K84k19k89
5950a60K72j89R1k88RkK84k48K02J64l79K84j03J88j58O8J65l00L1K73k89j13
5972a98K46J15n5J15r03N95J25J01r3RR4k15K95n2n6j86J9q2j32J80l15K99k22
5995c16M62m34K42K24m50P2k26M17j04k9Q3k48L51K1j32L53l35j54J80o8K61j11
$$ plain form
5840 -153 -161 80 -153 -225 -120 4 373 171 5 9 -285 -152 -5 -185 161 -260 307 -227 303 62 -54 311
5862 311 149 93 -68 15 151 -76 -33 158 -34 288 137 76 -232 113 285 -100 -82 -253 -422 -23 -24 119
5884 119 -192 207 -7 -211 -293 -285 86 -242 -165 28 -69 -272 -53 -326 -304 140 213 97 -213 205 -407 -25
5906 -25 -194 -45 -4 -312 -14 -27 268 126 -78 75 -91 -153 -89 173 25 440 -39 -289 77 145 -383 -332
5928 -332 242 -37 291 156 -36 -331 -84 5 -41 -291 127 -269 -27 45 90 -291 -196 6 64 348 129 -160
5950 -160 112 -77 14 -274 -265 -267 17 -231 -29 135 -244 40 -63 125 -33 35 200 -100 -69 204 -85 -198
5972 -198 48 163 108 223 -680 -85 40 141 48 57 151 -64 231 179 123 -63 -44 -126 -258 -78 -393 -94 -316
5995 -316 146 -288 -46 178 -272 -200 -426 -9 -113 -142 -59 -307 44 65 -67 286 -49 -203 -23 -91 170 59
6017E9j74K51r8r1L2J9p3L35j70j90N9j33m5J92J84k03L5L8on8J06m8l2j04J57
6042D2J04j18q9K5n1r4K62L9k7k01M00n35J36J46k62K41J04k28J07j16K12j3r7
6065a3j8J47K47m72J51L0k68J60Ln6r6L5m7K60j02J93k36K00r1r3J24j56J71Q5
6089A58k75k04M89j98q2J88n8l32K56P7r9K23Rj2j7J66k87p4J76L13n76J15o7
6112a11J14K5j4K9J0J82j10k76L75l63j5K78k04j3J53J47k04j18N7L74q7j11k76
6135a58L29k27J14p0j60L05l7l6k60J35m9L53l52qL08k62O4J66j21o4j38M41n67
6158b94K66K44j40Qq3M3j45J69r4M22m61K52n29J52J20oL74j15k53K68k17r6K54
6181A39r3k9R0J8j25k09L50j42J47j77K08m20M61M6n08L78k13J21p1p6k93L94
$$ plain form
6017 59 -115 136 38 -53 -21 -2 -75 260 90 -100 -41 -174 -219 -27 157 -46 -11 27 21 -37 69 21 -11 -115 42
6042 42 146 28 -61 -36 -87 -181 81 120 93 -108 292 -243 -107 39 -223 18 122 -106 1 -115 97 84 -13
6065 -13 -31 116 363 -109 42 72 -196 -36 -33 -89 -185 -150 -197 63 -39 154 -82 118 27 -66 58 -98 73 158
6089 158 -117 -321 168 -30 -112 76 18 -314 -58 19 -80 143 152 140 123 289 2 -72 104 417 -159 -44 -111
6112 -111 3 28 14 43 53 235 125 -151 224 -139 -154 124 -80 -93 60 207 3 -115 -58 316 229 118 -158
6135 -158 171 -56 58 -12 -172 133 96 60 -200 -65 -114 239 -113 -121 187 -75 -11 155 34 -30 -168 273 -294
6158 -294 -28 216 76 84 1 44 -101 68 -26 396 -65 187 -342 -190 -70 -76 298 183 -70 198 -19 -115 139
6181 139 46 17 107 125 0 -209 141 -1 146 -31 177 -243 218 264 -244 134 -79 42 -29 -105 -398 -4
6203dJ09L3j58o9L77m42L68m29J92O7J62k50J79k72R1J58l00K70j33K38k86N9
6225d0K18j49j41N0j0l1N5r3J54K81k10k10j7j51J87J80K01j99k10J36Q4q6m3
6248d4O6R2r0J04j15K54k80J64N6k57J92k26L8K61j05j20J25l45K84k87L00M3
6270A10Kq2j73j28K60j47q0J33p3j01J34j17K79J42Ln14N26k77R6J72j53J82J00
6293B94o75N85J6j27K15K62p63J19L83l82K47r2lo28L28L39j09J41k55K30j37
6314a2RJ65n70P4M05j69N24j52n34J09J62l38K80J76K39%k13k08l9k66N23k50
6336h5k31O58o28K11J13k82L23J10o72K21N02n90J79N09m25j18K59R8J38P4k90
6357G4Q7J9k16P1k69M84j64l58L10K6j54K29m66L09R2m11K50J92J20m67J58K01
$$ plain form
6203 -4 105 138 -20 -89 288 -154 214 -215 -23 44 206 -44 135 -137 -46 112 -188 82 -51 187 -99 -40
6225 -40 178 29 -112 -62 -72 -103 -48 -141 13 294 84 -126 -143 -294 -107 73 274 75 -135 1 85 -1 -44
6248 -44 22 114 24 128 13 267 -13 151 207 -50 142 -84 -46 215 110 -10 115 -230 54 -233 67 110
6270 110 112 30 -143 -271 -11 -158 -238 -105 -178 -279 -145 -262 17 159 162 -352 174 -103 -7 165 12 194 294
6293 294 -381 204 220 93 308 570 -193 -74 309 -73 174 82 79 -549 -221 118 9 150 -105 125 -12
6314 -12 -3 162 -408 -334 71 -98 426 274 -260 -151 11 -327 -47 129 368 368 155 -53 -92 -358 165 -85
6336 -85 -316 342 -286 -75 38 -244 79 189 -483 -262 240 -350 -171 338 -87 -205 54 152 290 364 74
6357 74 161 180 -36 35 -234 250 86 -272 38 64 -90 139 -327 -18 74 -337 -87 105 225 -242 -84 117
6379A17m0j55L47j89R4k33p5K60P0l73l34L96p6M55m04K96k04K04J71j57m56P44
6401D58n53O8K94l35L15K21m81j40L01o9m22M69o4q4L29k05k96LJ40j00J25K22
6423A96n9k5J53k50K72k64K07p3p0k95K43K5j95j09M4K00k79K56m9M7M79m70k20
6446b36P1L44j88K37j43J40l59Q6j39L97lk77J23L0j5n6K25n6k08k75L61m1r1
6469g3K52j05J81l05k0l57P10m24M6J29o8l13N69O0o17M65j87L10l90l79L08L19
6491A11m0K14o72K70o95Q33O04l08O0k19j27k98K55J53o6j74j13K09j29O0R3L92
6513D13o08K70r9j71K48m5k2j8q4L36m96N40K31j013N19J54l2j41J13j42J84J92
6535C29m09k3kR0J1K36j39K80Q7l81m08K55K57k13J28k42K06o5M3o2J68k54J69
$$ plain form
6379 117 77 -78 269 80 174 -59 -134 126 196 -177 -511 -115 -191 264 -140 156 -48 156 327 170 -286 458
6401 458 -95 -27 267 -68 247 468 -13 -153 148 79 -343 126 62 -22 307 102 -194 -191 -51 -151 -26 196
6423 196 137 112 265 15 287 23 230 157 87 -208 35 60 -135 -244 -200 0 -279 -23 -72 -25 454 -16 -236
6446 -236 -165 179 -9 228 85 225 -134 -48 -187 210 207 -70 53 83 68 12 237 181 -27 -302 59 18 -73
6469 -73 179 74 255 -50 -70 -427 283 -141 -95 34 -34 -347 222 282 -335 130 -57 253 -137 -516 -208 111
6491 111 71 285 -387 -117 -812 21 625 317 377 158 31 -267 -12 141 75 -99 -212 -3 -132 -72 21 413
6513 413 -195 75 -24 -195 53 8 -14 -32 -116 220 -276 264 495 -518 1 155 123 -18 95 -47 137 329
6535 329 -80 -103 -105 -15 -4 232 93 373 460 79 -329 -74 183 -30 98 -144 62 -3 40 -22 146 -108 61
6558F1l66L96J1l45L18j8k08M11l59P6J9J7K89j43r1J08k82J52j14p3J37J22O3
6581A81k43J45l09J39l2M48k49j75%K22o4K5r3P5Pp9K56l14j51l3K26K78j07j87
6605c4Q9J1j78r4J65j29K38j41lL6M3M4K9J15k72k3Q5J70j21n3j83K20j64Q2n3
6630a21L92r8j94O1j50j08K09J65l7k61M65j44j08q6K53p6q7m5J34j55J05k78
6652a64NK81k46L72j35j05n5Q9N5j10k86K95l19O67l63J19j51O9R3j30l0K33p
6675A77j34m1r0oj82M00j05J09r5j91K5M08l76K18n5l63J04ML55p5j75J39J3n0
6699A4Q6j08j4O2k16K65oj33j07K74n3l7J5J16j19K73n01L5L76j65k10L9q1J02
6723i3J11j0j7o5K8j33L13o0j24K2r4J27L7J21o9k3k57K35R3j96K46m30L49K0
$$ plain form
6558 61 -305 91 102 -243 75 57 -151 260 -99 -23 -4 13 302 159 68 176 -106 46 -68 -141 -4 118 181
6581 181 -62 83 -226 -87 -119 329 80 -95 -95 127 63 88 -5 70 77 -2 254 -60 -211 -244 -18 260 153 -34
6605 -34 55 66 -112 -206 -41 -170 68 -73 -76 -40 3 47 76 191 -81 -104 -19 151 30 -23 -206 14 -150 -68 -121
6630 -121 271 173 -21 40 -110 -218 -9 156 119 -142 323 179 71 -15 238 162 75 30 164 9 114 -164
6652 -164 -159 122 -124 248 113 8 -47 42 97 -13 -299 -4 -323 344 -19 100 -51 18 111 -19 -49 184 177
6675 177 43 2 -88 -94 -276 124 19 128 33 -158 -133 275 -101 117 62 -301 -197 -193 162 87 -88 51 64 14
6699 14 100 -8 -22 40 -176 89 83 -50 -157 117 64 27 42 158 39 312 -189 -154 222 57 -153 -114 -195 -93
6723 -93 18 8 -9 -74 -46 -179 134 74 -50 -28 -122 5 42 163 94 71 -186 49 142 -54 192 -238 111 131
6747A31n6j22m2Q4K29l13j10l14L80J07j57K32j72K31j70R4M80n76J08Q4m0r5
6769gJ21k20N2l82L40J25j97K52M0n37K04N4L02P0M7j29l24L6K51k21J89j32J49
6792H3m17L37K19J2m48K22L68m09Q6K50j70j70q8k8J27j83l1q4O81j60l43m3L80
6815A91m38J82K10q8k16j03K12K85k40k15R7k4J30n5n5j42J15K43k40m3K72l90
6837c12M65l60j00N88K01n86M41l21k22j03N43p7n67M98oj0k84L83k03r3J8N2
6859e5J28m35O6L20N9M31q77L13J39r5k51K58l9J67m00K50PJ17q5k85L44l61L25
6882D1j29L37k17j05L24p9n01j07N08M0k67J98k71M25K92o85K37o1L26m13O21
6903E14q41L42N7l25O55p18M08J4j83N15k50l44L18o63J15J12K69J72m3k33r1
$$ plain form
6747 131 75 -47 -89 -5 224 -89 -199 -513 -133 -26 -183 49 -123 108 -62 32 512 -64 44 128 88 -7
6769 -7 114 -106 -54 -436 -96 29 -168 84 124 -413 -209 -155 147 217 264 135 -189 -153 98 -123 66 -66 83
6792 83 -334 3 222 234 -214 8 376 -33 53 303 133 -37 -125 -153 -26 -209 -240 -324 357 197 -146 -189 191
6815 191 -247 -65 145 57 -159 -262 -50 235 -5 -220 -123 -147 -17 -72 -127 -269 -154 89 -151 -194 78 -312
6837 -312 153 -207 -307 281 482 -104 337 16 -206 -309 234 157 -410 88 82 72 -212 171 -32 -125 -107 -55
6859 -55 73 -362 -296 24 83 514 -363 -50 89 -6 -257 1 -38 129 -271 -21 -14 103 18 -267 77 -284 41
6882 41 -88 249 32 -73 251 172 -329 -436 72 112 -155 43 -228 197 489 -196 41 -20 306 -107 514
6903 514 -327 15 72 -253 402 -316 92 106 -77 438 188 -156 162 -501 -386 -274 -5 167 124 -109 -200
6924b00K97l79l1O24n79N04j5n03J70M02l33J30Q4n51L40J1N25k20n0j18j91K02
6946A19k73J77R5j37L63n50L27k1j20N8j25L9n0j51O2J44l01kO15m10M61l99l2
6969a11Q2M5J8O6j34q9j38K52l4N6q8L71j04n45J44j26R6K67m39L92rK5J59k70
6993a14O6k88J82K58l7P9p4k27K4J88l51O29k54l1p6J78j99J10k26J20K23K2r4
7016A08j75j55M46k18K23j90OK86l77J5Pj31N9m3J27o4N3J65l8j45L76l61R2j59
7040i3K04r0j20K40n8k80J86P5j79p4L4K99K5n04M00j04l0j06L10j31MK72l67
7063h7J03K10m05K18j23L5L11n20M29j08K35m34R4J24j21j43K18J29L3q1l75J49
7085a09j10K30P5l13M06j24O0j45J01j95J3J57k30K98Nq7q8q5J00L0p9J61n4j81
$$ plain form
6924 -200 97 -282 -313 311 -268 236 221 -282 -112 290 -43 87 171 -380 -40 -29 496 276 226 108 -83 119
6946 119 -154 23 118 -19 344 -206 121 100 -20 38 -87 -48 -98 -249 -187 -43 -344 -346 269 -141 320 -79 -111
6969 -111 -29 16 34 100 -34 -123 -261 -9 -43 13 -75 296 192 -353 -209 -335 -239 28 -411 -19 -28 -3 156 -114
6993 -114 -48 -336 -154 104 67 146 72 -155 -131 57 -294 335 81 50 -26 152 -47 63 -163 -43 180 202 108
7016 108 -67 -222 224 6 229 39 45 331 -46 -31 -24 -155 -96 -139 -12 -76 -23 142 104 -41 335 -26 66 -93
7040 -93 111 21 -99 141 83 -197 -11 64 -115 -189 -155 144 169 -335 65 -39 -69 -175 135 4 8 280 -87
7063 -87 16 226 -179 39 -84 -49 262 -258 171 63 298 -136 -42 82 -39 -182 36 165 198 117 -258 -109
7085 -109 -219 11 86 -227 179 55 115 -30 71 -124 -111 46 -184 114 119 32 -56 -141 -41 -11 -90 71 17 -164
7109a64r0n5K67N3j00J16J15m28K61M13m45k2r4j88K87K50J59m64m7L35j54k00
7131a95R9K11J93n53K97L0q6j78J21o6J73N0L40m42K3J06J29k34j83K56j47J80
7153A24k98J55L6q0r0L2K2P2J7J51o3j53L18o04M67l54J96j44K65k60L93k23l6
7176e7k75L46m7m68N90J4k55J46J65l31L18l58K62k24j52M79J58l96M1n3K93l01
7198a05J56j32J65j32j3PJ89J12m79K58L21n60J49J47K24l30j29J60J16L1j62
7219gJ63j72R1j73K78l42K39o8K7j84J64J75R7k75n1O5J78k96r3O46n78M0Rk04
7243b71L4k9K75l01K22L81l24m8o9K30j71j96J90j9L45j57p8M2J03Kl46J53l7
7266f9p7J21K03q3k16R4J76m3J03q9n61N98l30L12j30k24n5M04m61L69m64L3L27
$$ plain form
7109 -164 -254 -309 -42 11 -89 27 142 -286 -25 388 -57 -79 -173 -361 -74 176 335 -129 -176 159 5 -195
7131 -195 -96 115 308 -245 52 82 -4 -182 -61 -127 46 96 436 -6 17 123 252 18 -165 91 -56 124
7153 124 -174 -19 17 -63 -153 -121 -99 -27 -10 141 78 -75 243 -361 106 -248 -52 -196 69 -191 202 -21 -57
7176 -57 -332 14 -33 -501 89 103 -152 -6 159 -172 146 -212 50 -174 -326 153 311 -85 -44 -97 196 -105
7198 -105 51 -81 84 -48 -61 -54 135 247 -232 26 347 -213 -64 83 307 -23 -152 8 124 155 -7
7219 -7 156 -16 75 -98 180 -162 77 9 36 -148 16 191 288 13 -38 27 205 -91 -184 462 -116 -76 -67 -271
7243 -271 -237 -266 9 -292 -70 311 -13 -61 -130 100 -71 -267 -77 -96 249 92 14 56 159 161 -185 -32 -69
7266 -69 -146 -25 178 95 -121 -27 149 106 209 120 -441 157 -173 139 9 -215 -270 134 -327 42 -422 -389 -62
7289f2l3L6j30K31l02N62m7k82M08m33k57L68k67o6P6M95l62p2n5M02l80n7k38
7312d65N74j62%n8nj10L81l33j47K70J54j27j79L5K29J42q0j02L3N5j59J93j78
7335c9j45J90j29q4N39q5j34j73L90m11o9p4L22j24J20P3l15L81L0l84J51j76
7357a46M30j94l91M81m38J70J29L02m48M6J90l14N7R6K45m71N77n66M97J4n21
7378b55n3N89k30p8K2j53K65K38j65n02M57j47l8K16m35Q9K87k90M31r3J03j10
7400A48m09j14M41J42K42M01o23k36K09n01q9J36K12J73m49Q1M68j14k0k84p2
7421b58M34J3K0q41J049l28k16j35M38j37m65K15qJ10L52l87P0j93K69J98r3K04
7443C11k08j24J73l75O05o07J0K10o1K20j31K22l09J93n00L4J59L40Jj48j07L71
$$ plain form
7289 -62 -95 -59 -189 42 -260 302 255 -27 381 -52 -309 59 -208 -274 -198 297 -65 -137 -192 210 -170 -227 -465
7312 -465 109 -53 -53 -111 -116 -226 155 -178 -325 -55 99 -28 -207 -172 57 199 119 17 50 105 -54 139 -39
7335 -39 -184 6 -123 -207 332 247 113 -60 330 -81 -150 -224 98 -26 94 167 -148 233 263 -121 30 -146
7357 -146 284 90 -301 180 -258 -88 41 343 -105 -59 131 -183 -126 -30 215 -256 321 -245 252 266 -255
7378 -255 -308 281 51 -27 -5 -158 107 345 180 -322 135 -12 -50 166 -269 -180 107 -183 248 155 258 148
7400 148 -261 -375 66 208 450 851 228 -8 201 -300 -389 -253 -41 132 -317 -236 232 118 98 -186 -258
7421 -258 176 189 209 -632 417 89 -127 -262 176 39 -426 -211 -219 -109 243 -144 -74 -267 2 200 107 311
7443 311 103 -21 152 -223 382 -225 -215 -5 -66 154 23 245 -64 129 -371 -337 -178 162 163 15 -92 279
7465B79j64m69K93m6J9N5o4m01N50J89l73k9j76N2J95O1K09m37K02J57m5k45P7
7488a11M91m62j8Q7J0K31j93j43L56l99K46k21K68j93M56j71n95K85K7K18m02
7509b33M6J94j15J45o1N7J09m10M35k14j20J23K42n13L06m9n6K32M8j60L12k01
7531A17o4k30O1O82l53n90L06J35N0j39K81j16j74K2k2J27k53J03J95N0l32M10
7553B66k61k21N41P4l30J52m92K26K43k3j89J29n2l92J99L08j32k15K57j34j25
7574a71L5K21j32O4J37j86J53l34J10J95J9j70J38L60n83K3K86j85o2J82j64m4
7596a08K49o4j01Q4k37L3R3p3j00J38L22j17j54n6K2J26P0q4MJ6J3M7j31L6l40
7621c12L04J69j8J38j29k08K76J33l89K70m55QK28Q3k30N82m17J96k74mj01q7
$$ plain form
7465 279 115 -354 -61 -107 -88 -33 -97 -498 52 241 -132 -161 -337 -285 -90 -29 180 -257 -55 102 57 -188 -111
7488 -111 380 -82 -100 -13 -3 228 35 -108 248 -151 95 -126 142 -51 405 234 -361 -76 -49 169 -233
7509 -233 -187 7 -108 37 -24 33 142 -268 167 -47 -167 -44 198 -315 -9 -58 -114 118 166 6 318 117
7531 117 53 -177 -116 566 213 -377 -71 64 114 -25 256 140 -34 -12 -34 93 -160 -57 138 188 -144 266
7553 266 5 -216 325 399 69 221 -271 -45 198 175 -14 115 63 -329 -130 178 46 -169 88 -46 -171
7574 -171 -136 85 -47 17 154 -32 121 -213 -103 92 111 -59 79 439 -144 -121 165 -20 -82 100 -64 -108
7596 -108 141 77 -24 60 -177 -144 -51 -124 -224 -86 236 119 -35 -91 -69 57 127 43 47 63 76 123 -8 28 -312
7621 -312 -8 161 143 281 152 -56 220 353 -36 234 -221 -213 15 98 -132 450 33 229 -45 -49 -150 -237
7643b37q8L53O5l75J8K68m45J75L07K32k21K22k77r5k19J34K81l58N08l37N43
7664D54k98R0p3n8j04K22j12m16j3j95O91j74j35J86J16m13J10P3K33l78k94L81
7686a07N7J47k90N31r1k16J14k87L01m07J55l74N80n20M1J78J93Q0J54j70O2l68
7708b37J67J52n10M28l29O40m28Q2p8J11q3R4J27l84L66k90k7M67m66J37l19O01
7730B21l84m24N75m48M46M9N3n9k5k97M85l31M17l32J46J17k58L53k46k39K53
7751G2n7k96J2M15K28l95M22q39K53R0OL96m30J51p4j29N20j56k50L21o03Q9M22
7774A68k62J38J57m46J97J43j94K37k09N5J02l75J15O33p74L12j69M67j33m75
7794c13M92l03J1K79l64Q2N4l29O36j0n37O42n08L23k80j40N5J04M8J18RK35j06
$$ plain form
7643 -237 -325 28 93 -282 -264 4 -441 -266 41 273 52 274 -3 -98 -317 -183 98 -260 248 -89 454
7664 454 156 246 173 115 11 233 121 -295 -308 -503 188 14 -121 65 181 -232 -122 -49 184 -194 -488 -107
7686 -107 -50 97 -193 338 247 31 145 -142 159 -248 -93 -467 113 -407 -366 -188 5 85 239 69 131 -237
7708 -237 -70 82 -428 0 -329 311 -117 -35 -113 -2 -85 9 136 -248 118 -172 -199 268 -198 -61 -380 221
7730 221 -163 -587 -12 -460 -14 35 88 29 4 -293 192 -139 278 -54 92 209 -49 304 58 -181 72
7751 72 15 -281 -269 146 374 -21 401 -438 -185 -95 -89 307 -123 28 -46 -175 345 189 -61 260 -343 -254 168
7774 168 -94 44 201 -245 -48 95 -99 138 -71 -16 86 -289 -174 459 -315 -3 -172 295 162 -313
7794 -313 179 -124 -113 166 -198 -116 -62 -391 245 235 -302 340 -168 155 -125 -265 -210 -106 -58 60 69 304 198
7817A98p0Q7m73M11j3j28j37J46K35k82J62k35K52o2k58o6o9L73j57m06M76j25
7839a41J75J48l93L76l45m6J64n7M81l11q4P9l12J01K18j73J57R1j72j5L08j20
7861A29J19k42K38j53N9j20q8l27O06m4J54n00N4K94l51N2K52j69J01k67K20j55
7883a38K1J51K44k94R1J04n8q8J42k43J91l88L97p8k96oJ64J53J00k27j3p3K35
7906I1k40J53P8k25K68m9j4j22J00J11m1j93J55M1j70R6J59l20J00m2J44M5n1
7929G4j0K97m50L94l60J28r5L8N5k50M58l55q9K69k3q4o1m2l30N08j10J86k38
7952i0M7M69l34l04K48L9J44k22k43RJ01N13l40j46L40j51J73n93L31J28m72O8
7974b85K58PL3J99m69M5j74L63K1J3j19L97l4k33l44L66o9j28r1Q5k28L05J49
$$ plain form
7817 198 128 215 -258 153 140 12 -125 21 256 -26 136 -99 153 91 -167 -233 -302 71 -86 -492 -16 -141
7839 -141 34 182 -211 165 -180 -226 -62 -119 362 51 -33 46 -266 -165 53 -120 37 128 -44 -59 249 129
7861 129 248 6 244 91 150 30 -58 -385 221 177 331 -169 -115 179 -172 -120 132 -37 64 -203 17 -138
7883 -138 -117 34 278 -16 75 179 121 33 175 -68 123 -265 132 54 -242 -248 -84 69 169 -58 -71 -144 91
7906 91 -149 4 82 -143 125 76 62 -60 40 151 110 -83 72 113 -57 39 198 -122 -22 -64 80 125 74
7929 74 64 361 -89 305 -55 73 -22 16 71 -179 279 -76 -165 104 81 -3 -64 -106 -436 72 -38 148 -90
7952 -90 -43 426 92 -212 36 75 219 -3 -246 -237 -136 377 37 -109 231 80 253 -340 -9 119 -353 -285
7974 -285 -27 -20 13 212 -257 -212 -386 -23 -2 11 -108 289 255 22 -322 44 -25 -153 -244 -159 -387 -82 67
7997F7o5L48l73q8Q3l3K44l73J51o6k53K06k7J62l2L56l52l50L28N9Qk7r7k33
8021c57Q17n21K2Rp7J00P3k31L41M8p53J03M72K34j61l22M19m28k05N82k83K89
8043A71k92K26k76N30l50J98m70K87J47K04n93P1L4k2L58k19J93k46L91l15k19
8064a92K05L14q5l78L53j0k02k17L31K22k24l12K30J9r3M2O9l21M32J3L49r84
8086d39P96p15K17L97M6m63J00k00j73N33m6K95l35j2rj90J03k86P5L66J46n85
8108c79J13O76l10k38j9J29K68n08J83J68J42k20J32k76P60p76J17J66l06P87
8128F09m71K0n82O55j39j41k23P2N3l16O85n0n00L34N7j01N95o88o2n5M53l50
8150a45J15K2m20J127n93k57K6R2Ll8m8O7n02P16k41n30Q04j47L93o08J30J16
$$ plain form
7997 67 2 350 -23 -111 -28 -61 183 -190 -39 -105 -358 -152 -179 -17 -49 307 -45 -395 -67 -8 0 -27 -124 -357
8021 -357 460 -61 -39 -30 -107 -7 66 -165 176 224 -529 -426 46 280 119 -203 216 -212 -417 165 -118 171
8043 171 -121 105 -171 359 9 207 -263 24 171 375 -218 -147 -113 -135 223 4 197 -49 342 27 -192
8064 -192 13 327 242 -136 217 207 5 -212 119 341 117 -195 35 54 -39 3 72 -249 183 196 545 -439
8086 -439 357 -358 -141 256 302 -161 -61 -261 -434 99 53 348 13 1 -8 -198 -95 -381 -306 60 206 -379
8108 -379 -266 410 100 -138 -157 -28 240 -268 -85 83 225 5 137 -139 621 -155 -38 128 -178 609
8128 609 138 158 -424 231 92 -49 -272 -200 -147 -463 222 172 -328 6 63 -38 557 -131 -193 -248 205 -145
8150 -145 -30 -8 -428 699 106 -151 -125 -33 -30 -68 -116 -49 -551 165 -76 -606 198 51 444 -164 -34 82
8172H2j92L6k3K12o36K10J61l79K53L9M61J37j91j46J48j75m18O51l90
$$ plain form
8172 82 -110 -74 -97 115 -521 -311 -150 -529 -276 -237 224 361 170 24 172 -3 -421 230 -160
8191a60
$$ Imaginary data points
##PAGE= N=2
##DATA TABLE= (X++(I..I)), XYDATA
0@%%%%%%%%Lj1J6j6J6k4L2m0N3o1Q0j04J20j36J60j93K33k73L13l64M24m91N62
31B99o39P27q26R38j058J188j333J493j670J861k069K296k545K818l117L444l797
48a990M184m612N082n598O167o797P502q298R195j0214J1388j2761J4390j6356
62h718J8785k1876K5956l1628M0106n4288Q3751k43877L65492J57111o36115M47784
74A42483N1166o06658L81063M81931o56020J0022M85112m40181p9737O67416l76001
85F0596m86710N30118L8319l88337M63336M5303o45613K69530M26513m49759M8210
96h8494L84223m46999j24890N68898j83516l45097L49910p9772l25758M46946
106A55451J45054n10735J01408K65933l06369R4406L38624l39015j70246L62074
$$ plain form
0 0 0 0 0 0 0 0 0 0 3 -8 8 -8 8 -16 16 -24 29 -32 48 -56 64 -72 88 -105 128 -145 168 -196 228 -263 299
31 299 -340 387 -439 499 -559 629 -704 789 -881 980 -1089 1207 -1338 1480 -1637 1807 -1990
48 -1990 2194 -2418 2664 -2934 3233 -3564 3938 -4360 4835 -5379 6009 -6752 7638 -8718
62 -8718 10067 -11809 14147 -17481 22625 -31663 52088 -191789 173703 330814 -305301 142483
74 142483 193649 -413009 -31946 449985 -206035 -196013 289099 -151082 -230819 436597 60596
85 60596 -426114 104004 142323 -246014 217322 262625 -382988 -113458 313055 -136704 -88494
96 -88494 295729 -151270 -276160 292738 109222 -235875 114035 34263 -291495 155451
106 155451 300505 -210230 -108822 157111 -149258 -54852 283772 -55243 -225489 136585
116A36585r1866j80775K86896q4666l23642K67818J93982k63891L7802J15597
126I3840k42380N1569K85860j51302j48043J68560o0708j16299K05463K5937k22880
137a10383N1510J21992q3244L5032Q0504j52951o1805J62951J9832q3439M6710
148B6709p021j02036N4555J07047o2414o0234M9313j3561k5912Q8833M017j32495
160g3199J3431J08296m0028k2491P8409p0884r1312J19489M2004j07471N2478
171H722M4375j32743M7938J46661j26510p8088J42808m6493q4160J59735j7065
182F5180j81454J13059Q4610j61867P3381J32210j93516k4708K05754j06466j02384
193i6201J82443o3671j54733J98602L6177k18961J11969J11052k09449N7594J93241
$$ plain form
116 136585 44719 -136056 150840 66174 -257468 10350 204332 -59559 -21757 93840
126 93840 -148540 -96971 188889 37587 -110456 58104 -2604 -118903 86560 112497 -110383
137 -110383 -58873 63119 -20125 14907 95411 -57540 -119345 43606 63438 -20001 26709
148 26709 19688 -82348 -27793 79254 16840 -43394 5919 -7642 -33554 55279 59296 -73199
160 -73199 -59768 48528 8500 -13991 64418 -6466 -97778 21711 63715 -43756 8722
171 8722 53097 -79646 -31708 114953 -11557 -89645 53163 6670 -77490 82245 65180
182 65180 -116274 -3215 81395 -80472 -7091 125119 -68397 -93105 112649 6183 -96201
193 -96201 86242 22571 -132162 66440 102617 -116344 -4375 106677 -102772 -45178 148063
204A48063j87826o1353K09744j11387j13924K19636m8070k00574J86280O7377
214A07966k19950J04113J30871k16741K6592K01792j63842o6306K08903j07905
224E493j38577K16986r213k02297J50751P7039k04145Q6290J41068j96230M49
235g2386J91230j40649p7477K02423p5117j52848J79050J9940j79973J19283Q2840
246I6316j86365N7136J46486j62249k6786J76046j03129r5381J71875l0830j43948
257a00829J32396L8627j57051Q2940R6579j54758J3359J41309j11370n5272J46268
268G2198n3196j02600J25955P796j28097Q6808O2521j31908L2795J07452j06876
279b7152l0063J22533n7652p4951J10916q059j04240Q3169M3111j13765L8448
$$ plain form
204 148063 -39763 -101116 108628 -2759 -116683 102953 54883 -145691 40589 107966
214 107966 -111984 -7871 123000 -93741 -67149 134643 -29199 -95505 113398 5493
224 5493 -133084 83902 74689 -127608 23143 100182 -103963 -17673 123395 -72835 -72386
235 -72386 118844 -21805 -99282 103141 28024 -124824 54226 74166 -105807 13476 96316
246 96316 -90049 -32913 113573 -48676 -75462 100584 -2545 -97926 73949 43119 -100829
257 -100829 31567 70194 -86857 -3917 92662 -62096 -48737 92572 -18798 -74070 72198
268 72198 19002 -83598 42357 50153 -77944 8864 71385 -60523 -27728 79724 -27152
279 -27152 -57215 65318 7666 -67285 43631 35572 -68668 14501 57612 -56153 -17705
290a7705Q6787r8014j6777J06439n9410o1303J01834j3779r0216Q1194L2060j06116
302e5006M2238P5849r5838p351J00667o3195n3070J00229k2099q5261Q4967K4116
314D6246j02999N1561O7753j00632K720R6493p2608m2043J03595l3438p7826R1366
326C0188R758j01544O3420N6559j03122J9149Q9413q3325k8643J01459m7873o5225
338e9786R7676n369r3399P4154L8897j03768L4642P7257q9001r340R5790o1101
350c348n0376R6905k2912q1197Q3450K2352r8033M9258O0824r3958P111Q6404
362E6480p0386l2015R5722l7915o8489Q6878L924r0853O1927M6543r3100K3003
374a8281P4801p8930j7517R0410m9325n3264R0179j0892q2143O8957L0030r1003
$$ plain form
290 -17705 69082 -28932 -45709 60730 1320 -59983 41851 28072 -62144 19050 51110 -55006
302 -55006 -12768 63081 -32757 -40108 60559 -2636 -55706 44523 22424 -62837 22130 46246
314 46246 -56753 -5192 62561 -38071 -35351 61142 -11466 -53509 50086 16648 -61178 30188
326 30188 39946 -61598 1822 58381 -44741 -25592 63821 -19504 -48147 53312 5439 -59786
338 -59786 37890 32521 -60878 13276 52173 -51595 -16953 60304 -28697 -38037 57753 -3348
350 -3348 -53724 43181 20269 -60928 22522 44874 -53159 -3901 56923 -37035 -29924 56480
362 56480 -13906 -45921 49801 11886 -56603 30275 34199 -56654 5273 51816 -41284 -18281
374 -18281 56520 -22410 -39927 50483 1158 -52106 38073 27181 -54962 13995 44025 -46978
386d6978L6221O4149q1395k381Q3122n9711m0703Q8153k4175p0082P6095J6314
398C8629q6082M5771M9732q3400J1482P5213o5553k5794Q4870l6509n9085P8179
410B7453J031p8454N6772L7545q2200K4104O2586p2778j0498Q0920m7092m4346
422d4957P9851j4899o9627O5165K0760p9852L8523N0974p5133O466P0900o0395
434a2224k8682P9363k8451n4878P0731J834p3091N0036L5127p4500K1798N7476
446D4539o4651r396P2181m2290m0741O8175j1958n7204N7243J6704o8801L0849
458e350M1890o0843O130N7724m7961k3889O2328k0658m2950N1624J650n4499L8248
471C444K8966n4271J0507M0942m3661q607N2575k4802l3489M3822k540l9412L4575
$$ plain form
386 -46978 -10757 53392 -28003 -30384 52738 -6973 -47676 40477 16302 -53780 22315 38629
398 38629 -47453 -1682 48050 -35350 -23868 51345 -14208 -40002 44868 8359 -50726 27453
410 27453 28484 -49970 6802 44347 -37853 -13749 48837 -23941 -34439 46481 -611 -44957
422 -44957 34894 19995 -49632 15533 36293 -43559 -5036 45938 -29195 -22729 48171 -12224
434 -12224 -40906 38457 10006 -44872 25859 27693 -45398 4638 39765 -34735 -12937 44539
446 44539 -20112 -29508 42673 383 -40358 27817 15859 -41345 15898 32602 -36199 -5350
458 -5350 36540 -24303 -18173 39551 -8410 -32299 30029 9371 -33579 18045 19695 -34804 3444
471 3444 32410 -21861 -11354 29588 -14073 -22680 29895 5093 -28396 15426 12886 -26526 8049
484H049J6127m7773J3584L5773l4230n759L7818k6024k4430M1775J66l5167K4637
497D546J1915l8012J5231L2841l3675j1106L5018j6187k0450L7148l303l9912
509b5946K3944K1967l3661R339K8711l6929j0156M4466j4039k8844L4223k993
521A0082l8367L3735K2874m6762O499L4402l5582l306M8230k9494l4355M6059
533A4015n54l8729L8333J0790n5749K2861M1545m5249j913M4117m0990j9155O1174
546C0496j5973m5898M4054K421m9178M2989K7730o3250J0503M6617m5295l018
558a7802N6037m1777l5268O2046p520m5757M8017L321o1713L9126L9690n8318
570a9918O939M4429n0405o961O4614l3171l9912N3425q829m3428N1622J0339o3322
$$ plain form
484 8049 24176 -23597 -10013 25760 -8470 -14229 23589 -2435 -26865 14910 15076 -20091 4546
497 4546 16461 -21551 -6320 26521 -7154 -18260 16758 571 -19879 17269 13966 -25946
509 -25946 -2002 19965 -13696 -4357 24354 -12575 -22731 21735 7696 -21148 13075 10082
521 10082 -28285 5450 28324 -18438 -11939 22463 -13119 -16425 31805 2311 -32044 14015
533 14015 13461 -25268 13065 23855 -31894 -9033 32512 -12737 -14650 29467 -11523 -30678 30496
546 30496 14523 -31375 12679 15100 -34078 8911 36641 -26609 -16106 30511 -14784 -17802
558 -17802 38235 -3542 -38810 23236 15716 -30041 17976 21297 -40416 -1290 38400 -19918
570 -19918 -12979 31450 -18955 -25916 38698 5527 -34385 19040 10211 -33217 18405 28744 -34578
583c4578K7201L6625m8428J0885M2614m9589j4227N7171k1170l1066M4590j1855
595H173m2280M4199J6927m8719J7240K4914m0748J1015M0158l6589j6797L9031
607A6524j5696j9553L7599p582l6877K7004J4816k9159J4305J5856l3231M119
619a1875L0889j8584j1011K1701j3212j3559K6570N7k2294J0454O358j4769J0618
632A343J1786j8051l621J3503m521k965R470n989r071P643N617m888J69N45m262
647c292J74O474J751o319l034M758N23k149N203j314j0059N850Q171q633mQ378
663F478j1035l488J7152n139j2722J2357L27j4663J4299P831k1433N362J5987
676A1313j7883l99K1365j6666j2132K4673n227j8850K1704J116k6050J8288J4806
$$ plain form
583 -34578 -7377 29248 -19180 -8295 34319 -15270 -29497 27674 6504 -24562 20028 8173
595 8173 -34107 10092 27019 -21700 -4460 20454 -20294 -9279 30879 -5710 -22507 16524
607 16524 828 -18725 18874 11292 -25585 1419 16235 -12924 1381 17237 -15994 -11875
619 -11875 19014 430 -10581 11120 -2092 -15651 10919 10976 -11318 -864 5494 -9275 1343
632 1343 13129 -4922 -8543 4960 439 -2526 6944 955 -8116 -473 5144 256 425 970 -3292
647 -3292 -3118 3356 5107 -1212 -4246 512 1035 -1114 4089 2775 -7284 -1434 6737 -1896 -1900 6478
663 6478 -4557 -8045 9107 3968 -8754 3603 3930 -10733 3566 11397 -10036 -4674 11313
676 11313 -6570 -6969 14396 -2270 -14402 10271 5044 -13806 7898 9014 -17036 1252 16058
689A6058k8060O346K2422k5710l062L0023j8465j6526K9844p522k3922K7596M392
702A3414l2352J8641J7877l1139P539K5806k8318n721L2536j8019j7889L1943
714A4318p342k7256K7722P590l2396J6675J8153l0864O021K7085k6365p809L1543
727A7075j6061j8814L0552m043k7352K4026Q827k9866J4253J8571k8577K631K6596
740A7818k2101r535K8591j2047j9027K6357j178k5056J9621R495k6455J0589J8559
753A5631k4101n10K3694j6709j0653K4046p969j7415K0898J591k1480J3893J0925
766A1841k1206M917J6742j6993l809J8975j0243j0777J8105l044j5498J4218M988
779H216j7142P138J1348j5046L1J4329j0123o366J4305m286j1031J2360K198j3615
$$ plain form
689 16058 -12002 -5656 16766 -8944 -12006 18017 -448 -16974 12870 5348 -18574 9022 13414
702 13414 -18938 -297 17580 -13559 -6020 19786 -8532 -14253 18283 264 -17625 14318
714 14318 6976 -20280 7442 15032 -17364 -689 17464 -13400 -7379 19706 -6659 -14468 17075
727 17075 1014 -17800 12752 8709 -18643 5383 14210 -15656 -1403 17168 -11409 -8778 17818
740 17818 -4283 -13818 14773 2726 -16301 10056 8878 -16178 3443 12938 -13517 -2928 15631
753 15631 -8470 -8980 14714 -1995 -12648 11398 3429 -13986 6912 8503 -12977 916 11841
766 11841 -9365 -4448 12294 -4699 -8508 10467 224 -10553 7552 4508 -10990 3228 8216
779 8216 -8926 -1788 9560 -5486 -5455 8874 -1249 -7615 6690 2404 -8627 3733 5931 -7684
793g684P025Q226j2325Q56J0925q797m107J1853m444q469J0650J128j1353O368
807a48O585j0747J440R045p842l154J0166m067p568R755N32r877O340N220r843
822d163J675Q463p722k498R376m500o332R459m15r263O274N185r680K155P555
837E569p765j608R099n283n378R338j405q555P195L583r567L401O605q157l26
852c254Q530o193l837R127k622p440P735J674q596M269N497q358J046P357o427
867a492k319Q212l758n689P708M36q068N427L874q023K372N858o999q86Q012m602
883F3m618P699r18o675N671K051p175L378M669o750N19O426n014l199P483k281
899A329n266N660R79o270L709L421o295J258N429n222j804O697k682m300N282
$$ plain form
793 -7684 -659 7567 -4758 -3902 7023 -1774 -5881 5972 1528 -6941 3709 4837 -6516 -148
807 -148 6437 -4310 -2870 6175 -1667 -4821 5345 1278 -6290 3465 3997 -5880 460 5680 -4163
822 -4163 -2488 5975 -1747 -4245 5131 631 -5701 3758 3343 -5920 354 5539 -4141 -1986 5569
837 5569 -2196 -3804 5295 12 -5366 3972 2567 -5988 1207 4790 -4777 -1376 5229 -2928 -3254
852 -3254 5276 -917 -4754 4373 1751 -5689 2046 3720 -4876 -607 4890 -3468 -2422 4935 -1492
867 -1492 -3811 4401 643 -5046 2662 3098 -4970 457 4331 -3692 -1320 4538 -2461 -3347 4665 63
883 63 -4555 3144 2226 -4449 1222 3273 -3902 -524 4145 -2605 -2086 4340 -674 -3873 3610 1329
899 1329 -3937 1723 2702 -3568 141 3562 -2733 -1475 3954 -1268 -3072 3625 943 -3357 1925
914A925K75n511L937K661o017J852M485n003j244N834k910l352M993j90m631L692
930G96J591n155K431L305m655m06N006l075k578M655m67m113L623Q48m258K317
946a35K590m271M19M044l301j709M143j071l154L581J79l617K224K407m194P90
962a075L390k814j635L904j188k566K768L01k938J935J739l075J64L066k172j605
978a801L339q68k503K549P90k902J490J591k756j2L058j957j732L158m41k737
994a734K543P62l208J276K234k966N5L120k237j786L472l91k892K556P32l306
1010a770J653K382l691J96L682l015j728M028r61l263L404P37l824K507J834m107
1026a936P26L764l394j180M337k187k725M299l11l823L064J466m627K274L087
$$ plain form
914 1925 2200 -3311 626 3287 -2730 -878 3607 -1396 -2640 3194 284 -3068 1925 1735 -2896 796
930 796 2387 -2768 -337 2968 -1687 -2093 2913 -162 -2740 1915 1448 -2665 958 1806 -2452 -135
946 -135 2455 -1816 -1397 2647 -654 -2363 1780 709 -2445 1136 1315 -2302 -78 2329 -1865 -1075
962 -1075 2315 -499 -2134 1770 582 -1984 784 1085 -1853 82 1821 -1254 -1090 1976 -196 -1801
978 -1801 1538 670 -1833 716 1506 -1396 94 1685 -1071 -1083 1975 18 -1714 1444 1003 -1734
994 -1734 809 1571 -1637 -361 1873 -1093 -1038 2082 -155 -1941 1531 1140 -1752 804 1536 -1770
1010 -1770 -117 2265 -1426 -1230 2452 -563 -2291 1737 776 -2487 917 1654 -2170 337 2171 -1936
1026 -1936 -1210 2554 -840 -2020 2317 130 -2595 1704 1393 -2430 634 2100 -2527 -253 2834
1041B834m354k32M490l165j971M707j382l811M248L84m300K833K032m615J209
1056a093L928l629j093M382k575k600M730q84l592L459Q71m431K349K854m185
1071a509J26L799l254p04M105k230l016M131Ql568K894J201m123J520K923l133
1087h30j24K968k636j247L915j268k518K504K66k773K262J409l184P68K093k462
1103h57K33K710k314j688K812k98j962J911J10k283J635J407k022K86J258j833
1119h95L18J795r84j291J296l15o10J241K02j521N33M33n75M66N35j086k04P19
1137E7k8J54j05k78j42K06L86o5l85l98K63M93k74L11K4p75J48R91l53k30K60
1158B60p51o2J276l33j001Q15k8q11J106O61j810K97J008r53J1J535j485j071
$$ plain form
1041 2834 -1520 -1752 2738 -427 -2398 2309 927 -2884 1364 1748 -2552 281 2313 -2302 -1093
1056 -1093 2835 -794 -1887 2495 -80 -2680 2050 1166 -2426 1033 1904 -2527 -178 2676 -1509
1071 -1509 -1383 2416 -838 -1542 2563 333 -2683 1448 1456 -2112 782 1983 -2140 -620 2303 -830
1087 -830 -954 2014 -622 -1869 2046 778 -1740 764 1030 -1743 519 1928 -1256 -488 1605 -857
1103 -857 -624 2086 -228 -1916 896 598 -1364 547 657 -1626 9 1416 -606 -320 938 -895
1119 -895 -577 1218 234 -1057 239 -76 -686 555 757 -764 -231 202 -373 93 628 -458 -662 57
1137 57 29 183 78 -200 -342 -136 250 185 -200 -598 -335 158 -116 195 219 -556 -408 583 230 0 260
1158 260 -491 -553 723 390 -611 204 176 -635 471 1132 -678 -381 627 -326 -315 1220 -265 -1336
1176a336K270l75j426J940l03k218J399J463k032L69J384k276M23K591j912j135
1192a174K052q63j139K390o9k755J475J202k034P14J843k768K3K391j195j205
1208a112K527j337k129K821O13k762J617J306k956Q89K327k071r37K477j745r87
1224a459K857r25k319K340L18k171J639R29k431M44K293j947l68K072j607j283
1240a618K467P3j890J199M22k005J329J283k218J84J719j560j18J985q51j631
1256a230J882k70j407J615K87k082J142J099j681L90J343j494K0J248p37p67R65
1273C23l95n64Q02L50j199M84R07r15O3O86l52n08N98k53l38M53K74q05K02M42
1293B55m27J33L32m20J23j54M0j32K53J06j78J57j75j00N6j29K23j2M5j97r1J38
$$ plain form
1176 -1336 934 559 -867 1073 770 -1448 -49 1414 -618 -249 1135 -1141 -718 1873 -39 -1174
1192 -1174 878 15 -1124 1266 1197 -1558 -83 1119 -915 -201 1642 -1126 -1103 1288 93 -1112
1208 -1112 1415 78 -2051 770 1383 -1379 238 1544 -1412 -523 1804 -267 -1204 1273 -472 -1459
1224 -1459 1398 473 -1846 494 812 -1359 280 1209 -1222 -778 1515 -432 -800 1272 -335 -1618
1240 -1618 849 922 -968 231 653 -1352 -23 1260 -958 -774 945 -615 -733 1252 401 -1230
1256 -1230 652 382 -1025 590 877 -1205 -63 1036 -645 -255 1088 -406 -386 862 125 -642 323
1273 323 -72 -636 166 516 -683 -199 708 -207 -144 542 190 -318 280 27 -311 142 416 -389 -187 255
1293 255 -172 -39 293 -127 -4 -158 -118 -250 3 109 -69 88 -87 -187 -131 -260 -37 -49 -4 -201 -292 -154
1315a54J70J10m25L06mj1l49N22k79m75M47J53J38k20K37m27P9M01o44K36N07
1336C18l92k04P95m66l23Q82l25m85N76J10p31J20M07n91J13K48r6j77O45l53
1356G1m95Q25r4o79M13O00p49k56R62n11m97J005p34l57O06J80p65L55M14o42
1376c48J92P26p42k35O38l50j01K86K83r66P64J93q34J74N83o09m8Q40n42m45
1396e41J015k54q13P82M85j127J34O28q90M75O44n82m50P40k04n75N09N37j109
1415e96M42P54r92J66P32o58n5O74m50n03P80J09q70M35O46j050L00O54m14j90
1435h6M03l63m03N79J22o10L25N46m50m12P46m89k80Q55l70o12P32K31o02m3O55
1456D74p70l8Q64p66J22P41l88n95P69p5p99L97P55j392N31L58m40l26J127n27
$$ plain form
1315 -154 16 126 -299 7 3 -8 -357 165 -114 -589 -142 11 149 -71 166 -261 -182 219 -425 -189 318
1336 318 -74 -278 517 51 -272 610 285 -200 376 486 -245 -125 282 -309 -196 52 -44 -221 424 71
1356 71 -424 401 307 -372 41 641 -108 -364 598 87 -410 595 -139 -496 110 290 -475 -120 294 -348
1376 -348 -156 570 -172 -407 231 -119 -220 66 349 -617 147 340 -494 -320 263 -346 -394 446 -96 -541
1396 -541 474 220 -593 189 674 -453 -319 309 -581 -106 538 -44 -494 246 42 -533 -24 513 -596
1415 -596 -154 600 -392 -226 506 -152 -207 467 17 -486 294 403 -467 -32 614 -436 -136 518 104 -86
1435 -86 317 -46 -449 130 252 -358 -33 513 63 -349 397 -92 -372 483 113 -499 233 464 -138 -181 474
1456 474 -296 -334 530 -236 -114 627 239 -356 413 338 -461 -64 691 -701 -170 188 -252 -578 549 22
1476B2o88Q36N0n90M23L05r77L86M50o97J08J005p24m53P13O3q15N50N61j109
1496e81N97N81r68n0J089m28r50J195l38q18Q09j1k66P6O97q12O2O73j075o9R65
1517C78j13q37Q39K99q80Q2N72o29l48J404o43m31P08L4j042P87L21j019O50Q30
1537I62j091k34J114q96o76J291k01o98R86J9j045N79L44p32O3P68o00p02J520
1556G71m84j031J301j42j320N65N87o69J95O75p52K3J565j547o67J629m38j152
1574h91J406J26j734J381N74j219l70J446j073n20J550n87j176J801j90j339Q96
1591H1P70j690P52J247k123N80J355j186o24J825j073j144J827j7j454R94M99
1608F19j394N28J400j663k76J442q84n33J515q16j021J456Kj066P48P25j464M8
$$ plain form
1476 22 -666 170 220 -370 53 358 -619 -233 217 -480 -372 633 -91 -544 169 232 -583 -33 528 -581
1496 -581 16 597 -371 -421 668 240 -710 485 147 -671 138 127 -139 -63 634 -178 -116 557 -518 -587 378
1517 378 265 -572 267 566 -314 -232 340 -289 -637 767 124 -307 401 435 -607 180 501 -518 132 962
1537 962 -129 -363 751 -145 -821 470 269 -429 557 576 -469 110 454 -278 -215 553 -47 -749 771
1556 771 287 -744 557 415 -905 -340 247 -422 -227 448 -304 -281 1284 -263 -930 699 261 -891
1574 -891 515 641 -1093 288 862 -357 -727 719 -354 -874 676 89 -1087 714 524 -815 81
1591 81 851 -839 -87 1160 -963 -383 972 -214 -838 987 -86 -1230 597 580 -874 120 619
1608 619 -775 -247 1153 -510 -786 656 -228 -761 754 -62 -1083 373 375 -691 57 782 -682 -634
1626f34J714j260j05O13m37n64J379l27j185Q28L2n46O98M71r40q0P00k73J5K75
1646C74n92k59L32L54r3k44J31l17J31M68K2n74M3j10M03jL50l62o83L87P21m46
1668C5m0L58r08m4J429n36p12M35k85n42J427K89j918O65Q75j058L88J419j590
1687c13j081K445o74j253J698k77k452K299J336k756O82J613k719P09K979k546
1703c10j307K682r85j711L124j58l503K094J644l087J312K667l949j5L636k345
1719b11j305L437j983k490M167K88m052K481J223m058K341L016m325k16L718k864
1735h33q49M204j989l504M208L01l876L222R32m819K525L209m213J74L543l419
1751a184j012M784k038l017L635j74l640L533J387m472J431K876l514O06L165
$$ plain form
1626 -634 1080 -180 -285 328 -109 -673 706 379 -806 22 54 -492 206 677 -263 -343 357 84 99 374
1646 374 -218 -477 -145 209 116 -128 3 -314 -183 285 307 -267 -224 -334 69 68 418 56 -627 -240 481 35
1668 35 -5 353 -555 -599 830 294 -418 17 -268 -810 617 906 -1012 -347 528 -530 -142 1277 -313
1687 -313 -1394 1051 377 -876 822 545 -1907 392 1728 -1028 -346 1267 -1452 -743 2236 -310
1703 -310 -1617 1065 80 -1631 1493 1335 -2168 -74 1570 -1517 -205 2462 -1487 -1502 2134 -211
1719 -211 -1516 1921 -62 -2552 1615 1903 -2149 332 1555 -2503 -162 2854 -1471 -1687 2031 -833
1735 -833 -1682 2522 533 -2971 1237 1538 -2338 884 1816 -3003 -478 2731 -1482 -1308 2235 -1184
1751 -1184 -2196 2588 550 -2467 1168 994 -2646 887 2274 -2198 -767 2109 -1405 -799 2366
1766B366l215j356M120j457k547L629o78l344L169J218l661J363K089l165N28
1781i41L068k366j348K870j148j420K672m76k691J961J098k157Q25J158j974j17
1797i86K276j280o00J530r92j106J964l96r76O61M37j060N25P10q45k03O89j18
1815B30l30J89m9k10j74P32q1o50R8M79n30R6O47l99q56J165J07r66Q52M42j713
1836i21Q10J305j986J2J773j276p35K374r68k153K564N7k434J954J109l145J178
1853d82K422k793k81K973k377j038L205j121k636L138K53l223K507J413l939J320
1869f59L024l467k1L678k976j878M721j716l149L714M2l918L119K006m574J465
1885e89L276m125j8M393l290k193M640j224l362M010lm278L163K101m448J431
$$ plain form
1766 2366 -849 -2205 1915 458 -2089 1540 862 -2482 687 1905 -1756 -393 1696 -1469 -941
1781 -941 2127 -239 -1587 1283 135 -1285 1387 911 -1780 181 1279 -878 -53 1105 -869 -986
1797 -986 1290 10 -590 940 -52 -1158 806 410 -566 95 532 -528 -3 707 -138 -341 348 230
1815 230 -100 89 40 -170 -344 388 307 -343 -245 234 -296 -200 447 48 -808 357 464 -502 350 792 -921
1836 -921 -111 1194 -792 -780 993 -283 -1018 1356 388 -1765 799 856 -1578 376 1485 -1660 -482
1853 -482 1940 -853 -1134 1839 -538 -1576 1629 508 -2128 1010 1263 -1960 547 1960 -1979 -659
1869 -659 2365 -1102 -1123 2555 -421 -2299 2422 706 -2443 1271 1313 -2605 514 2520 -2054 -589
1885 -589 2687 -1438 -1456 2937 -353 -2546 2094 870 -2492 1518 1515 -2763 400 2501 -1947 -516
1901e16L326m341L0M366l144k067M223j314l254M029M42m336K676K094m080J158
1917g08L312l865p40M259k381j984L783q10l320L292R90l825J922K109l510L25
1933a151L438k982j068L500j649j954L141j36l257K323J461l106J030K274k760
1948h96l30K800j709j240K452o55j977K136P03k429Q12J761k207J95K050j654
1964a88r53K291n77j849J634N75k114J035J489j929o1J872j433p92J875m66j589
1981a180J723M18k088Q69J433j810j43K016j377r72K097n24j918K065M25k302
1997a268J023J492k056j59K263j432j093K409q64j760K105L05k348J300J451k465
2013a097K56K398k043p69K532j033k005K665n6k493J912J146k767Q75K063k382
$$ plain form
1901 -516 2810 -1531 -1501 2865 -279 -2346 1877 563 -2691 1338 1780 -2556 120 2214 -1866 -708
1917 -708 2604 -1261 -2001 2258 -123 -2107 1676 866 -2454 838 1828 -1997 -75 2034 -1476 -1151
1933 -1151 2287 -695 -1763 1737 88 -1866 1275 1139 -2118 205 1666 -1440 -410 1864 -896
1948 -896 -1226 1574 -135 -1375 1077 422 -1555 581 1284 -1145 -333 1428 -779 -584 1466 -188
1964 -188 -1141 1150 573 -1276 358 933 -1181 -146 1343 -586 -647 1225 -208 -1000 875 409 -1180
1981 -1180 543 961 -1127 -258 1175 -635 -778 1238 -139 -1111 986 462 -1456 609 1034 -1268
1997 -1268 -245 1247 -809 -968 1295 -137 -1230 1179 315 -1445 660 965 -1383 -83 1368 -1097
2013 -1097 -841 1557 -486 -1255 1277 244 -1761 904 848 -1645 267 1413 -1354 -479 1584 -798
2029g98j53K675j767j716L030n80k460K419N44k696J401J787k678K57K509k147
2045c73j065K844j012k210K911k6k728K020J247l095Q51K400k539l76K879j776
2061d8j714L068n32k574K405O96k894J425J899k905K56K709k189j083K996j223
2077B92k084K797o6k521J839J384l065Q12K287k409n31K801j489j518K535k91
2093G73k346K046N93k526J277J759k485J13K367k033q55K381r19j681K364J3k257
2110a416J435J196k354P56J828k002m55K127r97j347K091k89k021J718R13k054
2126h71N55J466j654k74J881j048j157J795j72j599J384Q22k033K74J690j479
2142d20k55J646r42j115J617Q5j485J001Q22j936N08J682j498n56J814q80j310
$$ plain form
2029 -798 -951 1724 -43 -1759 1271 691 -1769 650 1194 -1502 -101 1686 -992 -735 1774 -373
2045 -373 -1438 1406 394 -1816 1095 1069 -1659 361 1608 -1487 -636 1764 -775 -1151 1728 -48
2061 -48 -1762 1306 774 -1800 605 1301 -1593 -168 1731 -1174 -918 1791 -398 -1481 1515 292
2077 292 -1792 1005 939 -1582 257 1641 -1424 -612 1675 -734 -1265 1536 47 -1471 1064 773
2093 773 -1573 473 1066 -1460 -183 1576 -909 -796 1571 -462 -1317 1064 145 -1536 828 841 -1416
2110 -1416 19 1215 -1139 -383 1445 -557 -1012 1115 118 -1229 862 573 -1448 270 1183 -871
2126 -871 -316 1150 -504 -778 1103 55 -1102 693 521 -1078 306 1128 -905 -631 1059 -420
2142 -420 -675 971 29 -1086 531 616 -869 132 954 -982 -474 1208 -290 -846 968 88 -1222
2159a222K020J7k161J385J076k127P29J718k087o76K738j168j470K234m47k290
2175a731K121J070k818J051J938k571k82L277k144j777L266j105k305L120L19
2190A429l629K206K042l797J055K873l107q47L972j908k287L625j012l332L753
2205A036J084m283K013K405m215J146L710l759j158M260k263k297M477r23m242
2220c009L647J448m374K352K658m786N69M356l534j249M290k528k565M764o01
2235A438m134L575R13m288K596K835m683K74M121l545r41M553k588l017M424k17
2251A316l875L719Q98m668K317K845m221O90L332l588m31M156k306k396L665q27
2267F26l101L856L78l887J939J992l411J167K651l325l72L098j583j287K974j259
$$ plain form
2159 -1222 798 815 -1346 39 1115 -1012 -283 1435 -652 -1328 1410 242 -1228 1006 559 -1731
2175 -1731 390 1460 -1358 -307 1631 -940 -1222 2055 -89 -1866 1400 295 -2010 1110 1429
2190 1429 -2200 6 2048 -1749 -694 2179 -928 -1775 2197 289 -1998 1627 615 -2717 1036
2205 1036 2120 -2163 -150 2255 -1960 -814 2896 -863 -2021 2239 -24 -2321 2156 1233 -3009
2220 -3009 638 2086 -2288 64 2722 -2064 -1495 2861 -673 -1922 2368 -160 -2725 2039 1438
2235 1438 -2696 879 1792 -2496 100 2935 -1748 -1474 2647 -898 -1839 2714 126 -2891 1533 1316
2251 1316 -2559 1160 2058 -2610 -293 2552 -1669 -979 2353 -1235 -1666 2490 184 -2212 1453 626
2267 626 -2475 1381 1759 -2128 -189 1803 -1608 -441 2210 -1115 -1487 1611 28 -1259 1715 456
2283D56k560K836L49k491J619P87k536J104K137k335m4J678j497m59K201q97j406
2300a058J674l43j093J411L2j580P37R42j169O99N01j347K11Q68m87M4N86j211
2318e83J50R04m62j71O87p59k53J222m75o01O85o04m04J320j61j238Q98K59j327
2337i13J259P32j704N09R59j281j29J830j565p81K236j279q09J985p56j866J995
2354D22M29k076J336R97k456Q23K294k567l48K618j839j237L072r38k353K519
2370F96J83k465K013J125l063R72K260k706o2L115k728r04L199j254k320L047
2386A108k91k651K400Q35l036J574J600k887N73K659k239r26K990j744j705L012
2402A272n44k525K348N78k581J533J597k807K78K524k346l79K513j549j586K724
$$ plain form
2283 456 -2104 732 1081 -1410 209 996 -1540 -436 1701 -634 -678 1000 -497 -956 1245 348 -1058
2300 -1058 616 273 -820 591 623 -957 -220 722 -447 252 753 -594 -383 485 -2 42 628 -583
2318 -583 -433 471 9 -162 525 -234 -487 735 260 -341 344 -260 -664 656 495 -743 155 414 -913
2337 -913 346 1078 -626 -117 842 -439 -568 1262 -303 -1084 1152 -127 -936 1049 293 -1573 422
2354 422 851 -1225 111 1108 -1348 -525 1769 -798 -1146 1472 -367 -1604 1468 530 -1823 696
2370 696 879 -1586 427 1552 -1511 -539 1721 -985 -1047 2068 -660 -1564 1635 381 -1939 1108
2386 1108 817 -1834 566 1401 -1635 -61 1539 -1348 -775 1884 -355 -1281 1709 -35 -1740 1272
2402 1272 728 -1797 551 1129 -1452 81 1678 -1129 -851 1673 -673 -1052 1461 -88 -1674 1050
2418A050l39k121J898N11k237J202J470k288K9K012j690l77K195j352j001J822
2434G84m62j535J591N06j836Q26R49j504K12J357j299k83J431n79p48J104j74
2451C40j121Q11N90j113N73M16q95K83O63n75m61O86j88n04O55J59n99j30N98
2470A88m58N43Rn77k29N19K20l71L60M9m47K4O07l45k87K63K24o51L45N66o70
2491a18k02M72p6l44Q70n28n24M26M02q72K12N91p22L11N54l41l39N23q7o49O90
2512B49K24j037L90O26o90%P59p07q3P15m70n37R91k40j053R55M52j047L42O35
2532D74q47Q1R48q85j20J011k73r97J075j74j023P21N09p92J58P97q75n8R81o82
2552B9n08R20k96o17Q00P5r18L62Q35j162Q3R85p89j26R95o42n09P68N4j090O71
$$ plain form
2418 1050 711 -1410 488 999 -1238 -36 1434 -854 -825 1187 -503 -880 1315 -37 -1038 784
2434 784 322 -1213 378 884 -952 -126 823 -681 -469 888 -411 -694 737 158 -590 514 340
2451 340 -781 30 620 -493 80 496 -399 -116 547 -28 -489 197 9 -495 160 319 -280 -410 188
2470 188 -270 273 282 -295 -524 -5 215 -156 204 253 -194 -170 437 92 -195 68 292 -359 -14 552 -118
2491 -118 -320 152 76 -268 602 74 -450 -24 378 -494 -282 309 -413 -102 452 111 -228 295 208 -441 249
2512 249 473 -564 -174 452 -238 -238 521 -186 -269 446 -24 -561 430 190 -863 92 544 -503 -161 474
2532 474 -373 -292 656 -229 -349 662 389 -608 467 293 -730 -9 500 -292 -134 663 -212 -270 711 29
2552 29 -479 441 145 -472 328 403 -515 -153 682 -480 -397 588 -201 -327 668 26 -483 285 339 -751 -80
$$ [...]
8191F0
##END NTUPLES=NMR FID
##END=
