##TITLE=31Pdec_LR-783-OK1
 CDCl3
 24 sc
 4.3.2024
##JCAMPDX= 6.0         $$ Bruker NMR JCAMP-DX V2.0
##DATA TYPE= NMR SPECTRUM
##DATA CLASS= NTUPLES
##ORIGIN= UXNMR, Bruker Analytische Messtechnik GmbH
##OWNER= root
$$ XWIN-NMR		Version 3.5
$$ Mon Mar  4 14:27:17 2024 Russian Standard Time (UT+4h)  she@DPX200
##.OBSERVE FREQUENCY= 81.013821
##.OBSERVE NUCLEUS= ^31P
##.ACQUISITION MODE= SIMULTANEOUS
##.ACQUISITION SCHEME= undefined
##.AVERAGES= 24
##.DIGITISER RES= 16
##SPECTROMETER/DATA SYSTEM= spect
##.PULSE SEQUENCE= zgpg30
##.SOLVENT NAME= CDCl3
##.SHIFT REFERENCE= (INTERNAL, CDCl3, 0, 248.564)
##AUDIT TRAIL= $$ (NUMBER, WHEN, WHO, WHERE, WHAT)
$$ ##TITLE= Audit trail, XWIN-NMR		Version 3.5
$$ ##JCAMPDX= 5.01
$$ ##ORIGIN= Bruker BioSpin GmbH
$$ ##OWNER= she
$$ F:/spectra/data/she/nmr/P31/1/pdata/1/auditp.txt
$$ ##AUDIT TRAIL=  $$ (NUMBER, WHEN, WHO, WHERE, WHAT)
(   1,<2024-03-04 14:25:53.98 +0400>,<she>,<DPX200>,
      <created by zg, POWCHK disabled, PULCHK disabled
       configuration hash MD5:
       00 E9 B6 7A A2 85 ED C7 34 08 36 98 17 FE 4E 26
       data hash MD5: 32K
       E9 A4 AA F5 95 14 6E 53 7B 7E 9E 57 ED F1 32 AC>)
(   2,<2024-03-04 14:25:58.95 +0400>,<she>,<DPX200>,
      <Start of raw data processing
       efp BC_mod = 2 LB = 10 FT_mod = 6 PKNL = 1 PHC0 = -12864.96 PHC1 = 64.08345 SI = 64K 
       data hash MD5: 64K
       4D B3 73 CE 43 6F 74 90 C1 06 1C C3 35 72 6A 6C>)
(   3,<2024-03-04 14:26:31.17 +0400>,<she>,<DPX200>,
      <pk PHC0 = 7.550748 PHC1 = -14.8 
       data hash MD5: 64K
       76 DA 54 C7 97 73 C9 42 11 94 17 08 8A 39 2F 9B>)
$$ ##END=
$$ 
$$ hash MD5
$$ 4B 00 06 5B E6 52 FB 33 67 58 D1 E6 2B C1 D8 58
##$RELAX= 
##$RELAX= 
##$RELAX= 
##$RELAX= 
##$RELAX= 
##$RELAX= 
##$RELAX= 
##$RELAX= 
##$RELAX= 
$$ Bruker specific parameters
$$ --------------------------
##$DU= <F:/spectra>
##$EXPNO= 1
##$NAME= <P31>
##$PROCNO= 1
##$TYPE= <nmr>
##$USER= <she>
##$AMP= (0..31)
100 100 100 100 100 100 100 100 100 100 100 100 100 100 100 100 100 100 
100 100 100 100 100 100 100 100 100 100 100 100 100 100 
##$AQSEQ= 0
##$AQ_mod= 1
##$AUNM= <au_zg>
##$AUTOPOS= <>
##$BF1= 81.014009
##$BF2= 200.13
##$BF3= 200.13
##$BF4= 200.13
##$BF5= 200.13
##$BF6= 200.13
##$BF7= 200.13
##$BF8= 200.13
##$BYTORDA= 1
##$CFDGTYP= 0
##$CFRGTYP= 5
##$CHEMSTR= <none>
##$CNST= (0..31)
1 1 145 1 1 1 1 1 1 1 1 1 1 1 1 1 1 1 1 1 1 1 1 1 1 1 1 1 1 1 1 1 
##$CPDPRG= <waltz16>
##$CPDPRG1= <>
##$CPDPRG2= <waltz16>
##$CPDPRG3= <>
##$CPDPRG4= <mlev>
##$CPDPRG5= <mlev>
##$CPDPRG6= <mlev>
##$CPDPRG7= <mlev>
##$CPDPRG8= <mlev>
##$CPDPRGB= <>
##$CPDPRGT= <>
##$D= (0..31)
0 1 0 0 0 0 0 0 0 0 0 0.03 2e-05 3e-06 0 0 0 0 0 0 0 0 0 0 0 0 0 0 0 0 
0 0 
##$DATE= 1709547953
##$DBL= (0..7)
120 120 120 11 120 120 24 19 
##$DBP= (0..7)
150 150 150 150 150 150 150 150 
##$DBP07= 0
##$DBPNAM0= <>
##$DBPNAM1= <>
##$DBPNAM2= <>
##$DBPNAM3= <>
##$DBPNAM4= <>
##$DBPNAM5= <>
##$DBPNAM6= <>
##$DBPNAM7= <>
##$DBPOAL= (0..7)
0.5 0.5 0.5 0.5 0.5 0.5 0.5 0.5 
##$DBPOFFS= (0..7)
$$ [...]
##$SUBNAM2= <"">
##$SUBNAM3= <"">
##$SUBNAM4= <"">
##$SUBNAM5= <"">
##$SUBNAM6= <"">
##$SUBNAM7= <"">
##$SUBNAM8= <"">
##$SUBNAM9= <"">
##$SW= 501.771253377433
##$SWIBOX= (0..15)
0 1 3 0 0 0 0 0 0 0 0 0 0 0 0 0 
##$SW_h= 40650.406504065
##$TD= 32768
##$TD0= 1
##$TE= 0
##$TE2= 300
##$TE3= 300
##$TEG= 300
##$TL= (0..7)
0 120 53 12 22 120 120 120 
##$TP= (0..7)
150 150 150 150 150 150 150 150 
##$TP07= 0
##$TPNAME0= <>
##$TPNAME1= <>
##$TPNAME2= <>
##$TPNAME3= <>
##$TPNAME4= <>
##$TPNAME5= <>
##$TPNAME6= <>
##$TPNAME7= <>
##$TPOAL= (0..7)
0.5 0.5 0.5 0.5 0.5 0.5 0.5 0.5 
##$TPOFFS= (0..7)
0 0 0 0 0 0 0 0 
##$TUNHIN= 0
##$TUNHOUT= 0
##$TUNXOUT= 0
##$USERA1= <user>
##$USERA2= <user>
##$USERA3= <user>
##$USERA4= <user>
##$USERA5= <user>
##$V9= 5
##$VALIST= <valist>
##$VCLIST= <CCCCCCCCCCCCCCC>
##$VD= 0
##$VDLIST= <DDDDDDDDDDDDDDD>
##$VPLIST= <PPPPPPPPPPPPPPP>
##$VTLIST= <TTTTTTTTTTTTTTT>
##$WBST= 1024
##$WBSW= 4
##$XGAIN= (0..3)
0 0 0 0 
##$XL= 0
##$YL= 0
##$YMAX_a= 2354
##$YMIN_a= -2448
##$ZGOPTNS= <>
##$ZL1= 120
##$ZL2= 120
##$ZL3= 120
##$ZL4= 120
##$ABSF1= 0
##$ABSF2= 0
##$ABSG= 0
##$ABSL= 0
##$ALPHA= 0
##$AQORDER= 0
##$ASSFAC= 0
##$ASSFACI= 0
##$ASSFACX= 0
##$ASSWID= 0
##$AUNMP= <proc_1d>
##$AZFE= 0.1
##$AZFW= 0.5
##$BCFW= 0
##$BC_mod= 2
##$BYTORDP= 0
##$COROFFS= 0
##$CY= -3
##$DATMOD= 1
##$DC= 0
##$DFILT= <>
##$DTYPP= 0
##$F1P= 0
##$F2P= 0
##$FCOR= 1
##$FTSIZE= 65536
##$FT_mod= 6
##$GAMMA= 0
##$GB= 0
##$INTBC= 1
##$INTSCL= 6.047779e-11
##$ISEN= 30
##$LB= 10
##$LEV0= 0
##$LPBIN= 0
##$MAXI= 10000
##$MC2= 0
##$MEAN= 0
##$ME_mod= 0
##$MI= 50
##$NCOEF= 0
##$NC_proc= -9
##$NLEV= 6
##$NOISF1= 182.463
##$NOISF2= 159.3651
##$NSP= 0
##$NTH_PI= 0
##$NZP= 0
##$OFFSET= 248.5645
##$PC= 4
##$PHC0= -12857.41
##$PHC1= 49.28345
##$PH_mod= 1
##$PKNL= yes
##$PPARMOD= 0
##$PSCAL= 0
##$PSIGN= 0
##$REVERSE= no
##$SF= 81.0140089999694
##$SI= 65536
##$SIGF1= 159.3651
##$SIGF2= -187.1042
##$SINO= 113.3802
##$SIOLD= 16384
##$SREGLST= <1H.CDCl3>
##$SSB= 0
##$STSI= 65536
##$STSR= 0
##$SW_p= 40650.406504065
##$SYMM= 0
##$S_DEV= 0
##$TDeff= 32768
##$TDoff= 0
##$TI= <>
##$TILT= no
##$TM1= 0
##$TM2= 0
##$TOPLEV= 0
##$USERP1= <user>
##$USERP2= <user>
##$USERP3= <user>
##$USERP4= <user>
##$USERP5= <user>
##$WDW= 1
##$XDIM= 65536
##$YMAX_p= 298242862
##$YMIN_p= -38123234
$$ End of Bruker specific parameters
$$ ---------------------------------
##NTUPLES= NMR SPECTRUM
##VAR_NAME=  FREQUENCY,     SPECTRUM/REAL,   SPECTRUM/IMAG
##SYMBOL=    X,             R,               I
##VAR_TYPE=  INDEPENDENT,   DEPENDENT,       DEPENDENT
##VAR_FORM=  AFFN,          ASDF,            ASDF
##VAR_DIM=   65536,         65536,           65536
##UNITS=     HZ,            ARBITRARY UNITS, ARBITRARY UNITS
##FACTOR=    0.620285442955139, 1,           1
##FIRST=     20137.2065510682, 0,            0
##LAST=      -20513.1999529968, 0,           0
##MIN=       -20513.1999529968, -38123234,   0
##MAX=       20137.2065510682, 298242862,    0
$$ Real data points
##PAGE= N=1
##DATA TABLE= (X++(R..R)), XYDATA
$$ [...]
44663 -3219400 -2567296 -1879422 -1180134 -487193 183861 816328 1392819 1898676 2325222
44654 2325222 2670943 2940649 3143498 3290545 3392248 3455918 3482904 3466177 3390583 3237892
44644 3237892 2995654 2665338 2265144 1826412 1386270 980381 638152 380355 217697
44635 217697 149499 163673 239989 356464 495606 646634 803071 958456 1103516 1225867
44625 1225867 1311357 1346026 1318531 1222989 1061079 841626 577079 279015 -43970 -384664
44615 -384664 -733938 -1079057 -1404834 -1696476 -1942246 -2134842 -2270981 -2349113 -2366189 -2315388
44605 -2315388 -2186400 -1968429 -1654823 -1247907 -762642 -227641 317587 828992 1265950
44596 1265950 1597769 1806193 1883568 1828826 1644711 1338467 925471 432892 -99979 -626316
44586 -626316 -1100129 -1485570 -1764011 -1936710 -2022011 -2047671 -2040999 -2021124 -1996825 -1970084 -1942072
44575 -1942072 -1917522 -1905153 -1914465 -1951037 -2013157 -2091841 -2174016 -2246478 -2297921 -2318177 -2295847
44564 -2295847 -2216239 -2061085 -1810770 -1448873 -967503 -371252 321568 1079950 1862207 2618884
44554 2618884 3297813 3852077 4249215 4477884 4548779 4489489 4335926 4123792 3882522 3632589
44544 3632589 3385948 3148551 2923464 2713343 2521894 2354517 2218389 2121990 2074057 2081929
44534 2081929 2149145 2272519 2439972 2630785 2818644 2975839 3076571 3098971 3026814 2851454
44524 2851454 2573283 2202239 1757785 1268752 772135 309495 -79176 -362858 -526426
44515 -526426 -575012 -533166 -437326 -324099 -220585 -141992 -95996 -88506 -125869 -212842 -348933
44504 -348933 -525810 -726878 -928911 -1105156 -1229329 -1280032 -1244954 -1123506 -926180 -670463
44494 -670463 -375801 -61142 253838 546256 789864 958577 1032105 1001241 871059 661116
44484 661116 402175 129947 -122267 -329700 -479750 -573126 -622282 -646185 -661824 -675958
44474 -675958 -682395 -667117 -617879 -531500 -414121 -274972 -118019 63723 288257 578400
44464 578400 951093 1406526 1922346 2456299 2956550 3375379 3681184 3865147 3941150 3939382
44454 3939382 3896120 3843683 3804383 3789697 3802491 3838972 3888963 3936097 3960292 3942794 3871433
44443 3871433 3743183 3563032 3340431 3085292 2804791 2501372 2172121 1809669 1404369
44434 1404369 946859 430247 -147835 -782794 -1460911 -2159778 -2852972 -3517362 -4138717
44425 -4138717 -4712302 -5239086 -5721256 -6160055 -6556222 -6911197 -7227337 -7506707 -7749432
44416 -7749432 -7953120 -8113806 -8227265 -8289165 -8294551 -8238951 -8122395 -7954181 -7754408 -7550269
44406 -7550269 -7368694 -7228759 -7136835 -7086252 -7061805 -7047009 -7029660 -7002024 -6956328 -6880898 -6762108
44395 -6762108 -6592226 -6377428 -6139407 -5908645 -5713434 -5571021 -5484474 -5444396 -5432347 -5424125
44385 -5424125 -5393352 -5316532 -5179372 -4982281 -4742578 -4492438 -4273565 -4130436 -4103258 -4220993
44375 -4220993 -4495112 -4915838 -5452745 -6060116 -6685466 -7278602 -7798944 -8219804 -8529299
44366 -8529299 -8728106 -8824648 -8828955 -8747458 -8581115 -8327416 -7984111 -7551506 -7032238 -6430187
44356 -6430187 -5750747 -5002718 -4200338 -3363943 -2518894 -1693479 -916796 -217108 379903
44347 379903 854087 1194825 1403731 1493522 1483295 1393255 1241597 1043417 809826 546715
44337 546715 254513 -69460 -426221 -809941 -1205312 -1589737 -1939957 -2239284 -2480266 -2660781
44327 -2660781 -2776954 -2818753 -2771151 -2618934 -2351832 -1969056 -1483866 -926658 -342599 217921
44317 217921 711729 1110862 1402397 1583022 1654295 1622001 1498708 1306254 1075218 840569
44307 840569 635389 486195 411910 424923 530606 723660 983805 1275475 1554397 1779635
44297 1779635 1926072 1991473 1994914 1967686 1941060 1935729 1956072 1990277 2015567 2006298 1942190 1814700
44285 1814700 1630631 1412140 1192043 1004388 872970 802542 777039 766079 737082 667739
44275 667739 553636 408740 259927 138664 72585 78583 158274 296457 463350 621195
44265 621195 734782 783155 767916 714341 664723 666707 760717 970268 1297666 1725500 2222068
44254 2222068 2747971 3262254 3727939 4116790 4412232 4609306 4711889 4729000 4672350 4555952
44244 4555952 4396344 4211073 4015011 3817154 3621126 3429383 3247656 3086311 2958135
44235 2958135 2873953 2837521 2841222 2864982 2880073 2856747 2772244 2616201 2392471 2117491 1815723
44224 1815723 1513697 1235384 1000823 827184 729227 716851 790465 937264 1131259 1337475
44214 1337475 1518151 1638443 1670761 1598843 1422419 1161079 853913 552442 308129 159564
44204 159564 124633 199673 363507 583003 818467 1029525 1182592 1259256 1262463 1216732 1160889
44193 1160889 1135982 1173527 1288015 1474193 1707677 1948110 2145137 2246756 2208178 1998969
44183 1998969 1607311 1041332 327941 -490310 -1359904 -2222119 -3019137 -3699319 -4220965
44174 -4220965 -4555131 -4688562 -4626394 -4392601 -4026275 -3574134 -3081895 -2587816 -2120383 -1699767
44164 -1699767 -1340384 -1051384 -834140 -679160 -566233 -469689 -366832 -244823 -101746 58425
44154 58425 232483 420407 621969 831782 1038425 1228888 1394497 1534055 1653132 1760857
44144 1760857 1865687 1971234 2073801 2163314 2227669 2258266 2253758 2220223 2168071 2107746 2046934
44133 2046934 1990829 1944687 1916001 1914024 1946849 2018397 2127650 2270313 2441174 2635491 2849145
44122 2849145 3078361 3319362 3567557 3816009 4053969 4266849 4438485 4555488 4612608 4617314
44112 4617314 4591186 4566077 4575542 4645592 4790067 5012697 5312335 5685472 6123609 6608528
44102 6608528 7110563 7592030 8013888 8342327 8553316 8635218 8590772 8438998 8215110 7964677
44092 7964677 7730680 7538372 7386874 7253112 7105263 6917507 6679359 6397892 6094286
44083 6094286 5796532 5530226 5310253 5136672 4996775 4872479 4749373 4622780 4498140
44074 4498140 4386613 4299166 4242205 4216008 4215632 4232943 4258129 4279752 4284130 4255557 4177863 4036527
44062 4036527 3821060 3528376 3166713 2757232 2330341 1917656 1544233 1224923 964208
44053 964208 755940 581221 407107 190702 -109850 -521509 -1046536 -1661513 -2324669 -2987289
44043 -2987289 -3604719 -4144496 -4590828 -4945308 -5223952 -5451161 -5652150 -5846274 -6043697
44034 -6043697 -6246316 -6451298 -6654075 -6848665 -7025895 -7171942 -7269121 -7298831 -7244991 -7096402
44024 -7096402 -6847833 -6500545 -6062745 -5549424 -4980860 -4380045 -3770553 -3176199 -2622088
44015 -2622088 -2134783 -1739214 -1452239 -1276004 -1195463 -1182095 -1201665 -1221535 -1214280 -1157914 -1035607
44004 -1035607 -837784 -567027 -242641 100065 418515 676471 854860 953504 984294 962233
43994 962233 900660 811848 709716 610993 533738 494378 504805 570281 688354 848761 1034270
43983 1034270 1222327 1387486 1504693 1553066 1519084 1397907 1192315 910067 561076 155358
43973 155358 -298148 -792462 -1323398 -1889800 -2492061 -3128647 -3792215 -4467632 -5132746 -5760576
43963 -5760576 -6321357 -6784733 -7123457 -7318725 -7365023 -7272103 -7063261 -6770975 -6431564 -6080143
43953 -6080143 -5746160 -5448892 -5192683 -4963880 -4733116 -4464877 -4131321 -3723726 -3256294
43944 -3256294 -2761924 -2283141 -1861573 -1528349 -1297820 -1167095 -1121649 -1143508 -1216685 -1327052
43934 -1327052 -1458553 -1590486 -1699263 -1764294 -1774803 -1734188 -1660174 -1580534 -1525122 -1516215 -1560932
43923 -1560932 -1649886 -1763257 -1880408 -1986472 -2072046 -2128226 -2142860 -2101985 -1995372 -1821776
43913 -1821776 -1590476 -1318965 -1028931 -742500 -479070 -252144 -66137 85531 219302
43904 219302 356759 517913 715299 951005 1216933 1497103 1770683 2015088 2209044 2335438
43894 2335438 2383768 2352184 2249174 2094379 1917464 1754301 1640976 1607203 1670794 1834306
43884 1834306 2084497 2394786 2730191 3053336 3329859 3532168 3641670 3650267 3561613 3391389
43874 3391389 3165197 2913613 2665836 2444258 2261103 2116896 2000688 1892997 1771942
43865 1771942 1620614 1432344 1211864 973150 735769 520843 346782 225429 159708 143576
43855 143576 164264 206291 256148 305692 352229 395146 431654 455118 457369 433234 383993 317513
43843 317513 245192 177943 123989 89816 82734 111633 183914 300748 455424 637357 838973
43832 838973 1059659 1303614 1573995 1868713 2181082 2503808 2832064 3162652 3489912 3801878
43822 3801878 4079981 4302700 4450620 4509920 4473337 4339707 4113378 3803442 3422087 2982225
43812 2982225 2495789 1973955 1429425 879530 348250 -134810 -539568 -843738 -1040827
43803 -1040827 -1143595 -1180638 -1187402 -1196040 -1228870 -1297798 -1408255 -1563633 -1766830 -2018584 -2315044
43792 -2315044 -2646955 -3000606 -3359148 -3703487 -4013462 -4270231 -4459487 -4573820 -4612697 -4579977
43782 -4579977 -4480491 -4317872 -4095126 -3817802 -3497900 -3155776 -2817779 -2509597 -2248307 -2037895
43772 -2037895 -1871255 -1737140 -1627020 -1537571 -1468561 -1419170 -1385572 -1360404 -1333363 -1292390 -1225462
43761 -1225462 -1122927 -979873 -797825 -585250 -356540 -129371 79155 256574 398115
43752 398115 508012 598881 689186 798792 942939 1126300 1339760 1562009 1765929 1927567
43742 1927567 2034333 2089214 2109003 2116818 2131912 2161259 2196372 2216168 2194208 2107543 1944304
43731 1944304 1707861 1416730 1101029 797073 541240 363528 281284 294735 386586 526965
43721 526965 682033 822005 924775 975252 964159 889580 760197 596111 424591 272261
43711 272261 157658 87133 54788 45620 40460 20975 -26900 -111863 -238160 -407177 -618149
43700 -618149 -867251 -1145974 -1440646 -1733689 -2005328 -2234655 -2401295 -2489735 -2495480 -2428606
43690 -2428606 -2311225 -2170446 -2031719 -1915533 -1836055 -1799221 -1800709 -1826677 -1858543 -1879198 -1876321
43679 -1876321 -1841064 -1764493 -1635735 -1443581 -1180027 -843027 -437227 26717 533242 1063075
43669 1063075 1594764 2106613 2579125 2997965 3356883 3659279 3917314 4149116 4375967
43660 4375967 4620642 4905621 5248622 5654931 6109862 6576773 7003709 7336781 7534617
43651 7534617 7577996 7471418 7236788 6902462 6492671 6021891 5495732 4916144 4286883 3616360
43641 3616360 2917847 2208685 1509490 842763 230115 -310861 -767604 -1130622 -1391226
43632 -1391226 -1542530 -1584153 -1526902 -1393499 -1214614 -1022428 -844373 -699074 -595822 -537316
43622 -537316 -523086 -550469 -612611 -696132 -781654 -848094 -879054 -868286 -821482 -753331 -681431
43611 -681431 -620230 -577379 -552989 -541296 -534077 -524734 -511401 -497886 -492237 -503307 -536178 -588419
43599 -588419 -649455 -702908 -729030 -705229 -606713 -410727 -104180 309886 811090 1365605
43589 1365605 1932202 2468110 2934059 3298385 3539723 3647848 3622919 3474245 3220022 2888408
43579 2888408 2518247 2157169 1856396 1663604 1615365 1730244 2004384 2412085 2911973 3455931
43569 3455931 3997215 4496456 4925926 5271261 5529060 5701000 5788071 5788434 5699204 5519945
43559 5519945 5255337 4915507 4513822 4063227 3573059 3047719 2487655 1892642 1266974
43550 1266974 624619 -8948 -600218 -1115076 -1526792 -1822043 -2003788 -2089809 -2106175 -2077717
43540 -2077717 -2020397 -1939520 -1833079 -1696338 -1524569 -1313688 -1059916 -759339 -407998 -2948
43530 -2948 456193 966417 1521619 2112791 2726804 3344307 3938543 4476274 4920859 5237466
43520 5237466 5400224 5399743 5247841 4976637 4631502 4259995 3900727 3576503 3294218 3049964
43510 3049964 2834845 2638140 2448408 2255079 2051187 1835426 1611898 1388036 1172218
43501 1172218 972119 794168 644004 527369 450814 422346 452265 553130 736597 1006582
43491 1006582 1351787 1742511 2134494 2478757 2733771 2875627 2902450 2831419 2690069 2506213
43481 2506213 2300453 2082362 1849172 1586293 1270847 879500 399467 -161466 -770736
43472 -770736 -1375158 -1912475 -2326371 -2579777 -2661866 -2586818 -2385971 -2097645 -1758839 -1400598
43462 -1400598 -1046203 -710037 -395779 -94648 213487 553407 942674 1379292 1835405
43453 1835405 2261026 2596605 2789162 2805998 2642021 2319517 1881358 1380073 866200 379370
43443 379370 -55690 -428184 -736808 -983906 -1170262 -1292580 -1344774 -1322095 -1225257 -1062071
43433 -1062071 -846244 -594909 -326670 -60697 183975 390428 547789 655667 726006 779961
43423 779961 840570 924820 1038957 1178546 1331979 1485103 1625232 1743869 1837477 1905575
43413 1905575 1946606 1954280 1917451 1823654 1663357 1432195 1131433 768055 354209 -95168
43403 -95168 -565788 -1045710 -1524081 -1988819 -2425916 -2820679 -3159283 -3429742 -3622888 -3734116
43393 -3734116 -3765377 -3726002 -3631313 -3499322 -3347128 -3188709 -3034342 -2890642 -2760720 -2645134
43383 -2645134 -2544088 -2459501 -2394946 -2353280 -2334133 -2333513 -2345677 -2365602 -2390408 -2419293 -2452476
43372 -2452476 -2489907 -2530361 -2571258 -2609027 -2639231 -2655785 -2649599 -2608344 -2518688 -2370187 -2158124
43361 -2158124 -1883355 -1550029 -1163700 -731161 -261388 233511 737721 1231956 1695730
43352 1695730 2112230 2473684 2783208 3050809 3285541 3488700 3652043 3761381 3802947 3769095
43342 3769095 3661044 3488416 3266883 3015507 2754407 2502665 2276786 2090449 1955178
43333 1955178 1880190 1870123 1921669 2021236 2144745 2259586 2329130 2320171 2211373 1998610 1694344
43322 1694344 1322403 912156 495012 103449 -229127 -469849 -590584 -574154 -419515 -142976
43312 -142976 224679 642848 1065906 1448776 1754392 1962079 2073304 2110941 2111035 2110322 2135440
43301 2135440 2198385 2298296 2426172 2569141 2713142 2844622 2951924 3026473 3063308 3060233
43291 3060233 3015635 2926657 2789886 2604662 2376216 2115358 1834356 1541780 1239640 923995
43281 923995 587860 224527 -169376 -590622 -1026056 -1451364 -1834671 -2145323 -2364409 -2491834
43271 -2491834 -2546477 -2559337 -2562591 -2578754 -2613711 -2655644 -2679943 -2658602 -2571125 -2412545 -2194468
43260 -2194468 -1938575 -1666926 -1395472 -1134154 -891784 -680735 -517641 -419712 -399371 -460420
43250 -460420 -597444 -798087 -1046916 -1329565 -1635675 -1959118 -2295006 -2635078 -2964690 -3264001
43240 -3264001 -3513517 -3701395 -3828510 -3908473 -3962716 -4013591 -4078688 -4167734 -4281633 -4413197
43230 -4413197 -4549554 -4675884 -4779161 -4850531 -4886095 -4886938 -4859215 -4814037 -4765938 -4729040 -4711621
43219 -4711621 -4711512 -4714742 -4698162 -4634729 -4499305 -4273182 -3946425 -3518043 -2994622 -2388458 -1716061
43208 -1716061 -997496 -256193 481797 1189913 1844066 2424769 2917116 3309108 3590368
43199 3590368 3753147 3796033 3728647 3574271 3367923 3150156 2959527 2826660 2770835 2798696
43189 2798696 2904901 3074699 3287603 3520915 3752795 3965282 4147296 4296830 4421649
43180 4421649 4537858 4665581 4822135 5015500 5241672 5486958 5733304 5964640 6173342
43171 6173342 6364875 6556765 6769933 7016123 7288910 7563404 7803963 7975127 8050728 8018012
43161 8018012 7876273 7631968 7293495 6868423 6364386 5792985 5174420 4539604 3927290
43152 3927290 3376285 2915746 2558149 2298756 2121990 2010692 1952373 1939386 1964866 2018458
43142 2018458 2084291 2141772 2169737 2153813 2093947 2006987 1921813 1869954 1877195 1959280 2120974
43131 2120974 2356314 2649119 2974372 3301420 3598887 3839779 4004651 4081812 4065506 3954086
43121 3954086 3749322 3456232 3081975 2633641 2116853 1537681 907917 250285 -400817
43112 -400817 -1004871 -1525053 -1938034 -2239523 -2443019 -2572371 -2652093 -2700445 -2727735 -2738528
43102 -2738528 -2734875 -2718615 -2692207 -2658078 -2616947 -2566089 -2498559 -2403953 -2270826 -2090200 -1858190
43091 -1858190 -1575486 -1243902 -863480 -433250 45534 568011 1128243 1722974 2352136
43082 2352136 3014645 3702026 4393829 5057335 5651798 6135706 6474825 6648992 6656238 6513373
43072 6513373 6252512 5913832 5536172 5148472 4765062 4385946 4000900 3595016 3154025
43063 3154025 2668355 2134849 1555544 935342 282120 -389510 -1054386 -1677871 -2222550
43054 -2222550 -2656176 -2956627 -3113715 -3129900 -3020343 -2810572 -2530837 -2208715 -1863222 -1503020
43044 -1503020 -1129143 -739976 -335058 83822 512450 941960 1354483 1719977 1997951
43035 1997951 2144625 2122716 1909884 1502897 917015 182419 -659758 -1560770 -2467774 -3328441
43025 -3328441 -4095768 -4731262 -5205775 -5499138 -5600361 -5509083 -5237491 -4810957 -4266033 -3645963
43015 -3645963 -2995422 -2356252 -1764833 -1250648 -835564 -533452 -349644 -280119 -311574 -423939
43005 -423939 -595128 -805670 -1040800 -1289786 -1543867 -1793801 -2027127 -2225379 -2362469 -2405939
42995 -2405939 -2322178 -2085108 -1685507 -1136567 -472387 260315 1013671 1748971 2442785 3087283
42985 3087283 3684868 4239511 4748795 5199794 5569636 5830077 5955157 5930104 5758175 5462410
42975 5462410 5082023 4665507 4262360 3914296 3647552 3469340 3370427 3331900 3331236 3344149
42965 3344149 3342882 3294779 3164489 2920146 2541113 2024487 1388651 673146 -65967 -765558
42955 -765558 -1367832 -1831311 -2135792 -2279950 -2274576 -2136471 -1886415 -1550754 -1163106 -762745
42945 -762745 -389137 -75075 158579 305019 370455 370107 321714 238355 123792 -27004 -222320
42934 -222320 -466425 -754938 -1075234 -1410828 -1746173 -2068576 -2366344 -2624812 -2823289 -2935634
42924 -2935634 -2935422 -2803700 -2535189 -2139582 -1638381 -1060823 -441791 178928 758944 1258535
42914 1258535 1647273 1908828 2042183 2059707 1983504 1840922 1659534 1462534 1266274 1080871
42904 1080871 912513 764767 637817 527365 425501 323558 214861 95754 -34651
42895 -34651 -174629 -319406 -460621 -586547 -683532 -738476 -741424 -686957 -573849 -403705 -179812
42884 -179812 93081 408255 756193 1123940 1494970 1849824 2167537 2427877 2614191 2716084
42874 2716084 2730566 2660985 2514507 2299773 2025794 1702271 1341173 958834 576731 218946
42864 218946 -93514 -348336 -543626 -684905 -780194 -837154 -863962 -871928 -875995 -891107 -926604
42853 -926604 -983446 -1056926 -1142455 -1239231 -1348933 -1471608 -1603218 -1737029 -1866631 -1986384
42843 -1986384 -2087503 -2152753 -2155305 -2064839 -1858476 -1530853 -1098945 -600516 -86882 388771
42833 388771 784606 1079891 1277088 1396235 1465650 1513445 1562082 1625891 1710190 1810540
42823 1810540 1911834 1989299 2014183 1963995 1832814 1635967 1406871 1188106 1020801 935954
42813 935954 950226 1066726 1278420 1570332 1919075 2292240 2651392 2959370 3188903 3328843
42803 3328843 3385823 3380496 3338691 3280083 3209252 3113553 2968371 2746392 2426608 2000697 1476507
42792 1476507 878998 248337 -365715 -913561 -1357852 -1683669 -1902029 -2045183 -2156523
42783 -2156523 -2279862 -2451029 -2692182 -3008778 -3390327 -3815956 -4263480 -4717991 -5175554
42774 -5175554 -5640183 -6116438 -6602861 -7090781 -7568694 -8027777 -8463429 -8871785 -9245063
42765 -9245063 -9570609 -9834844 -10028858 -10151318 -10207116 -10203654 -10147617 -10043315 -9891988 -9691721
42755 -9691721 -9438719 -9130373 -8768601 -8361128 -7920218 -7460722 -6999242 -6553933 -6143189
42746 -6143189 -5782613 -5481628 -5241345 -5054004 -4903355 -4765698 -4612432 -4415065 -4152136
42737 -4152136 -3815229 -3410779 -2956598 -2475316 -1988049 -1510162 -1049591 -607996 -184801
42728 -184801 217658 591185 923073 1200609 1415479 1565719 1655030 1690888 1683117 1643875
42718 1643875 1588344 1534410 1500177 1500138 1541865 1624230 1737000 1861704 1974528 2051782 2076754
42707 2076754 2045007 1965079 1853723 1727940 1598088 1465531 1325543 1173559 1011577 851371
42697 851371 712137 613022 564530 563892 596342 639902 670149 663731 601471 471421 270951
42686 270951 7301 -302941 -635101 -959123 -1244355 -1465241 -1605374 -1658151 -1624479 -1509549
42676 -1509549 -1320744 -1067567 -762979 -424609 -74369 263783 566930 816028 998076
42667 998076 1107615 1147069 1125347 1055290 951774 831687 714701 622038 571745 572294 618895
42656 618895 696088 786130 878314 973364 1080419 1209512 1364912 1542903 1733563 1923883
42646 1923883 2100045 2248522 2356860 2414844 2415736 2356438 2236008 2053860 1810092 1509052
42636 1509052 1164108 799698 448235 142886 -90104 -236213 -293585 -271310 -186606 -61350
42626 -61350 82323 227264 366102 503600 654535 836418 1059244 1317554 1589935 1846500
42616 1846500 2059401 2210676 2295746 2324630 2322135 2325351 2376415 2511718 2751770 3096001 3524076
42605 3524076 4002194 4491167 4953308 5356861 5677940 5900020 6011118 6000141 5855419 5567289
42595 5567289 5133223 4561800 3873199 3096687 2266896 1420214 592158 -183798 -876474
42586 -876474 -1457813 -1905255 -2204705 -2352610 -2356698 -2235626 -2016940 -1732391 -1411476 -1076386
42576 -1076386 -741233 -415375 -108267 166513 389097 533813 573638 488990 278359 -34344
42566 -34344 -400255 -754839 -1032705 -1182713 -1178611 -1022432 -740336 -373118 34556 442337
42556 442337 818235 1139437 1391822 1569710 1676625 1726592 1744106 1760532 1806846 1905516
42546 1905516 2065282 2280719 2535892 2809960 3082170 3333836 3546454 3697926 3761043 3707210
42536 3707210 3514752 3177872 2712070 2153993 1556235 978792 478937 101429 -128567
42527 -128567 -207709 -151712 10289 241914 505462 767679 1004651 1204402 1366659 1500601
42517 1500601 1621485 1746796 1892914 2073354 2298267 2573740 2900766 3275780 3693804
42508 3693804 4151796 4648598 5180956 5738756 6302843 6846240 7338096 7749721 8061353
42499 8061353 8266533 8371133 8387525 8328130 8202669 8019636 7789148 7524189 7239859 6951722
42489 6951722 6673767 6415646 6179677 5959351 5740530 5504647 5232342 4906727 4516276
42480 4516276 4056988 3533222 2957240 2347835 1727858 1120292 543927 10737 -474010
42471 -474010 -909964 -1299582 -1645625 -1948100 -2202129 -2399036 -2530558 -2593189 -2589589 -2527031
42461 -2527031 -2415331 -2266175 -2093224 -1911099 -1732762 -1567006 -1417791 -1284852 -1163652
42452 -1163652 -1044519 -913639 -757990 -572543 -365149 -156049 27574 159728 224023 219452
42442 219452 159823 65503 -48569 -181119 -343843 -552994 -818996 -1139935 -1501484 -1882271
42432 -1882271 -2261183 -2622469 -2956334 -3255966 -3514429 -3724545 -3882465 -3992749 -4071318 -4143421
42422 -4143421 -4236726 -4372992 -4562529 -4803212 -5082841 -5382870 -5682907 -5965682 -6220865 -6445092
42412 -6445092 -6637353 -6792019 -6893460 -6915111 -6823290 -6584297 -6172758 -5579211 -4815080 -3913320
42402 -3913320 -2924085 -1906482 -918980 -11129 781890 1441662 1966205 2367111 2664268
42393 2664268 2878610 3024358 3103419 3104974 3011646 2810441 2503806 2115618 1688967 1276095
42383 1276095 924487 664997 506955 441569 450878 517367 629982 784685 980554 1214316
42373 1214316 1476444 1750452 2015292 2249796 2437759 2571817 2653862 2690992 2688626 2644620
42363 2644620 2548007 2383416 2139370 1816840 1434167 1025671 633919 298516 45986 -115511
42353 -115511 -195405 -215315 -202035 -181667 -176319 -202891 -272433 -389201 -550338 -747864 -973142
42342 -973142 -1221398 -1493016 -1790271 -2111460 -2445935 -2772903 -3064901 -3294901 -3444457 -3509302
42332 -3509302 -3499402 -3433288 -3330106 -3204407 -3066525 -2927223 -2802440 -2714445 -2688432 -2746567
42322 -2746567 -2902858 -3161430 -3518115 -3962717 -4479379 -5045146 -5629271 -6195117 -6703830
42313 -6703830 -7117670 -7402427 -7530164 -7483322 -7259339 -6873466 -6357526 -5753842 -5105903 -4449444
42303 -4449444 -3807726 -3192314 -2607510 -2055383 -1539334 -1065658 -643241 -281965 9022
42294 9022 221967 350207 388728 337310 205490 15814 -198128 -398962 -554452 -643649
42284 -643649 -658359 -601024 -481235 -312458 -109372 114329 347834 584508 822012 1060686
42274 1060686 1299870 1532467 1739910 1892103 1956509 1914778 1777822 1588766 1410789 1306911
42264 1306911 1322467 1476717 1763620 2158083 2623487 3117787 3598084 4025426 4370648 4619048
42254 4619048 4770707 4836085 4829836 4766003 4655257 4503333 4310246 4070815 3777209 3423787
42244 3423787 3013457 2563166 2104866 1679660 1326584 1070940 917474 851064 844254 868446
42234 868446 904286 946813 1003141 1084387 1196881 1337411 1493474 1645914 1771525 1846272
42224 1846272 1851139 1779969 1644621 1472659 1297580 1147231 1037181 971895 951423 978839
42214 978839 1064407 1224516 1475601 1825656 2267486 2777111 3317645 3846252 4321395 4708719
42204 4708719 4984616 5137101 5164834 5075838 4886174 4617072 4290004 3922498 3528403 3122480
42194 3122480 2724757 2360198 2053367 1821223 1667454 1580610 1537206 1509186 1472649 1413823
42184 1413823 1330528 1230738 1130560 1051872 1018228 1048971 1153990 1331856 1571278 1853333
42174 1853333 2152402 2436688 2670825 2821763 2866211 2796268 2620440 2359415 2038614 1681267
42164 1681267 1305149 923437 547445 188836 -139287 -421868 -641972 -782600 -830976 -784476
42154 -784476 -655828 -474781 -284072 -129667 -48271 -57311 -151946 -309732 -499721 -691431
42144 -691431 -861044 -994625 -1089061 -1150849 -1192345 -1225765 -1256317 -1276870 -1266694 -1195872 -1034944
42133 -1034944 -766649 -394939 52952 532411 992403 1386426 1679332 1849022 1884730 1784443
42123 1784443 1553152 1202363 750150 220466 -359031 -959966 -1555530 -2121716 -2638598
42114 -2638598 -3092507 -3478119 -3798733 -4064513 -4289951 -4491369 -4683944 -4878005 -5075901
42105 -5075901 -5271357 -5451718 -5601565 -5705854 -5751824 -5730232 -5636651 -5472761 -5246681 -4971425
42095 -4971425 -4661728 -4330610 -3987155 -3636086 -3278810 -2915184 -2545203 -2169952 -1791768
42086 -1791768 -1414055 -1041029 -676902 -324010 19385 359793 706721 1069614 1455753
42077 1455753 1869993 2315117 2791428 3295948 3822555 4363101 4908008 5445319 5959373
42068 5959373 6431367 6842890 7181198 7443515 7637888 7779891 7886956 7973305 8047219 8110327
42058 8110327 8158028 8180935 8167022 8102847 7972459 7755663 7429514 6975013 6386293 5676867
42048 5676867 4879014 4036322 3192989 2384974 1636401 960610 362231 -162381 -625271
42039 -625271 -1044213 -1435838 -1806869 -2148351 -2436982 -2644261 -2749846 -2753082 -2677643 -2567488
42029 -2567488 -2475773 -2450927 -2525659 -2713657 -3014051 -3418269 -3913518 -4482218 -5101535 -5746068
42019 -5746068 -6392022 -7019131 -7609382 -8144985 -8607958 -8981106 -9248784 -9397217 -9416235 -9303940
42009 -9303940 -9072712 -8752227 -8386038 -8022239 -7702090 -7450529 -7270614 -7142919 -7030823
42000 -7030823 -6891317 -6687921 -6400198 -6025761 -5574960 -5062491 -4501272 -3901578 -3274781
41991 -3274781 -2638245 -2017850 -1446511 -959621 -589697 -362263 -293470 -388819 -642496 -1037928
41981 -1037928 -1550400 -2151193 -2811192 -3502242 -4196745 -4867709 -5490691 -6046667 -6523442
41972 -6523442 -6914403 -7215782 -7424518 -7537640 -7552981 -7471059 -7298286 -7050116 -6751025 -6429231
41962 -6429231 -6108360 -5801610 -5512631 -5242284 -4996144 -4787232 -4631897 -4541487 -4515286 -4538979
41952 -4538979 -4588400 -4634555 -4646559 -4592890 -4443921 -4177131 -3782994 -3268191 -2654669 -1975633
41942 -1975633 -1270380 -578767 64707 636297 1125506 1532967 1865167 2130140 2337172
41933 2337172 2499430 2635373 2765639 2905809 3058744 3210965 3335709 3401826 3384652 3274386
41923 3274386 3079429 2824534 2544481 2274360 2039026 1846147 1686502 1541078 1390314
41914 1390314 1220501 1025484 804977 561355 295911 5537 -318420 -687551 -1110475
41905 -1110475 -1586851 -2105355 -2647594 -3196025 -3740866 -4281220 -4819128 -5350012 -5855568
41896 -5855568 -6303924 -6657466 -6883945 -6964703 -6896004 -6684289 -6339865 -5873917 -5300572 -4641639
41886 -4641639 -3929521 -3205280 -2512749 -1892208 -1375938 -984762 -724046 -580943 -527342 -530498
41876 -530498 -566991 -632046 -738870 -908687 -1156704 -1480475 -1855843 -2242372 -2595599 -2879833
41866 -2879833 -3075427 -3178672 -3196930 -3142941 -3030151 -2868723 -2662082 -2405724 -2090249 -1707879
41856 -1707879 -1258775 -753698 -212916 336170 860983 1326199 1698526 1953769 2083325
41847 2083325 2096170 2014408 1864307 1667342 1435142 1169373 865438 518547 130483 -285407
41837 -285407 -703657 -1091063 -1414013 -1645962 -1773301 -1798952 -1743127 -1640491 -1533118 -1459950
41827 -1459950 -1446004 -1496659 -1600588 -1739207 -1895787 -2058616 -2218281 -2363200 -2476971 -2538596
41817 -2538596 -2525348 -2417448 -2202966 -1881069 -1462696 -968931 -427413 132764 686225 1214150
41807 1214150 1703466 2143482 2522663 2827780 3046075 3169442 3198378 3143333 3022529 2857817
41797 2857817 2671411 2484924 2319088 2191213 2109844 2069767 2051612 2027121 1967280 1849715
41787 1849715 1663566 1411413 1108034 776364 442433 131365 -135101 -340509 -475511
41778 -475511 -539130 -538826 -489026 -407975 -313446 -219370 -135715 -71634 -39071 -53497 -130568 -279693
41766 -279693 -496967 -760758 -1033072 -1267363 -1419904 -1459831 -1374128 -1166780 -853772 -456654
41756 -456654 3200 508633 1048447 1616053 2204788 2802118 3386861 3932202 4413073 4813401
41746 4813401 5129219 5366495 5535398 5644302 5696662 5692010 5629664 5512384 5347622 5145666
41736 5145666 4915668 4662256 4385531 4084785 3762980 3428645 3095084 2779383 2502360
41727 2502360 2287588 2157470 2127564 2202886 2378770 2645258 2991261 3404911 3869791 4360658
41717 4360658 4843608 5282349 5646989 5919359 6091632 6160235 6120387 5965659 5692780 5307779
41707 5307779 4828685 4283226 3704149 3125719 2581939 2104163 1716569 1431310 1246562
41698 1246562 1148592 1116068 1124286 1148586 1167402 1164923 1132518 1068390 976000 862528 738249
41687 738249 616930 516664 459790 470193 567113 757134 1028568 1352352 1690077 2004960
41677 2004960 2269571 2466672 2585128 2616461 2556113 2408014 2187423 1918682 1629543 1346169
41667 1346169 1090633 879504 722368 622030 578923 598552 696361 894508 1210345 1642554
41657 1642554 2162901 2718286 3242294 3671076 3957138 4076305 4026744 3822763 3487950 3050851
41647 3050851 2543155 1998135 1447785 919323 432709 -311 -376559 -701730 -989566
41638 -989566 -1258102 -1522991 -1790664 -2055098 -2300142 -2506372 -2659498 -2757134 -2811453 -2846360
41628 -2846360 -2890100 -2966679 -3090442 -3265883 -3491359 -3763572 -4080461 -4441335 -4843922 -5279206
41618 -5279206 -5727046 -6156210 -6530139 -6815950 -6992614 -7055369 -7015292 -6894096 -6715756 -6498947
41608 -6498947 -6254719 -5990435 -5715993 -5446802 -5201632 -4997948 -4848047 -4756460 -4717276 -4711762
41598 -4711762 -4709447 -4675154 -4580246 -4412603 -4180031 -3905716 -3618483 -3342681 -3091807 -2867507
41588 -2867507 -2662888 -2467666 -2272930 -2074361 -1873340 -1675813 -1489603 -1321709 -1176830
41579 -1176830 -1057287 -963746 -896297 -855823 -845498 -872249 -947955 -1089505 -1315989 -1642198
41569 -1642198 -2070726 -2587403 -3163216 -3761062 -4342312 -4869753 -5308282 -5627442 -5807599
41560 -5807599 -5846395 -5759975 -5576997 -5329256 -5044784 -4745690 -4448337 -4163081 -3893900 -3639927
41550 -3639927 -3398962 -3170398 -2955273 -2753907 -2563635 -2378631 -2191934 -1998029 -1794232
41541 -1794232 -1580439 -1358678 -1134098 -916944 -722857 -569419 -470253 -430613 -447531 -514138
41531 -514138 -624801 -777421 -971156 -1200971 -1453191 -1706597 -1940107 -2142598 -2317780 -2480337
41521 -2480337 -2646173 -2823542 -3009837 -3193691 -3358733 -3486172 -3556408 -3551800 -3461938 -3289847
41511 -3289847 -3055020 -2789830 -2530048 -2304441 -2128911 -2006717 -1931942 -1892609 -1872338 -1852211
41501 -1852211 -1814384 -1746914 -1647349 -1522949 -1387423 -1256108 -1141983 -1053623 -994673 -964027
41491 -964027 -956593 -964901 -981302 -999843 -1017279 -1033551 -1052138 -1079802 -1124950 -1195107 -1295146 -1427345
41479 -1427345 -1592229 -1788470 -2011725 -2254107 -2505710 -2757469 -3003280 -3239850 -3464432
41470 -3464432 -3671945 -3853218 -3995184 -4082650 -4100871 -4038960 -3894448 -3677747 -3413198 -3134198
41460 -3134198 -2873716 -2655052 -2487360 -2367007 -2282828 -2222469 -2177562 -2146360 -2133587 -2148369
41450 -2148369 -2201313 -2301010 -2449993 -2641350 -2858435 -3079103 -3282697 -3455687 -3592874 -3694709
41440 -3694709 -3763892 -3803784 -3818557 -3813338 -3793090 -3760452 -3713544 -3644757 -3541519 -3389919 -3181154
41429 -3181154 -2918711 -2622239 -2324520 -2061210 -1857517 -1718197 -1625573 -1546266 -1443809 -1292602
41419 -1292602 -1088248 -849945 -613684 -419906 -302372 -283008 -371966 -568665 -861413 -1227301
41409 -1227301 -1635083 -2051079 -2444961 -2792670 -3076311 -3282794 -3402513 -3428203 -3354144 -3176470
41399 -3176470 -2894911 -2514769 -2047172 -1507263 -912540 -284063 349421 948027 1462646
41390 1462646 1844020 2056100 2088159 1960791 1723770 1446198 1201165 1048860 1023395 1127799
41380 1127799 1338056 1613101 1906217 2174903 2388360 2532412 2611163 2644707 2663363 2700316
41370 2700316 2784969 2938526 3171601 3482483 3855213 4258848 4650915 4986823 5232763 5376091
41360 5376091 5427429 5413328 5363487 5298864 5225321 5133882 5005692 4818734 4554081 4200686
41350 4200686 3758363 3238446 2661482 2052224 1433978 825406 241738 -300725 -780752
41341 -780752 -1172866 -1453332 -1608227 -1639066 -1563631 -1412811 -1225541 -1042982 -901984 -828186
41331 -828186 -830406 -898673 -1007833 -1126722 -1230192 -1308742 -1370713 -1435629 -1522377 -1638684 -1776856
41320 -1776856 -1916537 -2031770 -2098811 -2102351 -2039047 -1917556 -1754813 -1569970 -1379409 -1195958
41310 -1195958 -1032480 -906663 -842951 -869382 -1009917 -1275199 -1656022 -2123299 -2635052 -3146550
41300 -3146550 -3617752 -4015163 -4310563 -4481896 -4518936 -4430928 -4250285 -4028544 -3825700 -3697153
41290 -3697153 -3682026 -3794785 -4021618 -4323463 -4646261 -4935427 -5148723 -5262595 -5271087 -5180394
41280 -5180394 -5003277 -4756223 -4459652 -4139040 -3823807 -3542048 -3312486 -3138012 -3004878
41271 -3004878 -2888190 -2760533 -2599735 -2393662 -2141894 -1854842 -1551077 -1254163 -990108
41262 -990108 -785082 -661912 -635020 -705994 -862881 -1084200 -1345608 -1625708 -1908293 -2180600
41252 -2180600 -2429992 -2643254 -2811192 -2936469 -3038274 -3148166 -3297628 -3504383 -3765579
41243 -3765579 -4060579 -4359289 -4629578 -4840873 -4966007 -4984536 -4887203 -4677905 -4370578 -3983155
41233 -3983155 -3533510 -3040173 -2525546 -2016883 -1542345 -1123791 -770663 -478472 -232460
41224 -232460 -14143 192467 397102 602143 803423 992238 1157924 1289705 1376413 1404675
41214 1404675 1358650 1223904 994033 675465 287474 -140920 -573404 -967305 -1276095 -1456592
41204 -1456592 -1479892 -1341179 -1063345 -692480 -286978 96021 412957 641729 783075 855313
41194 855313 884785 895706 902495 906138 895326 852508 763041 623124 442341 240275 40385
41183 40385 -135896 -274514 -374457 -452324 -542033 -686752 -924306 -1271854 -1716979 -2219699
41173 -2219699 -2724411 -3176280 -3535288 -3783216 -3922178 -3966597 -3933080 -3833514 -3674634 -3462998
41163 -3462998 -3210827 -2938037 -2668965 -2426223 -2226026 -2077893 -1987823 -1961198 -2002405 -2111602
41153 -2111602 -2281184 -2493674 -2721184 -2927162 -3072057 -3122764 -3061592 -2889114 -2619146 -2269844
41143 -2269844 -1856816 -1391056 -880508 -332665 243334 835394 1427980 2002682 2539859
41134 2539859 3021040 3431444 3761930 4009772 4177706 4271072 4293999 4247166 4130165 3948932
41124 3948932 3724048 3492969 3301884 3189773 3172880 3238045 3348417 3458704 3532819 3556112
41114 3556112 3537317 3500468 3471752 3467884 3490418 3526386 3552783 3542117 3467495 3306851 3046148
41103 3046148 2681633 2221709 1688776 1119867 563818 74053 -300993 -526422 -586470 -487324
41093 -487324 -257253 57044 398667 711874 953158 1098640 1146101 1111822 1023774 913321
41083 913321 807507 723287 664355 620898 572660 495343 369330 187838 -39468 -289917
41073 -289917 -536838 -758979 -945118 -1092194 -1199724 -1265266 -1284231 -1253805 -1177829 -1069432
41063 -1069432 -950405 -848166 -791042 -801912 -891250 -1052052 -1259067 -1472820 -1647329 -1739662
41053 -1739662 -1718735 -1570404 -1297685 -918116 -461063 34865 526689 975087 1353034 1650954
41043 1650954 1876129 2046661 2182115 2294316 2382433 2434662 2434915 2369979 2233231 2024404
41033 2024404 1747803 1411452 1027390 611183 179265 -254456 -679630 -1086628 -1461822
41024 -1461822 -1784687 -2029259 -2170000 -2189933 -2087511 -1878624 -1592353 -1262574 -919607 -585396
41014 -585396 -273524 7059 247440 436730 564284 624597 621519 569407 490695 410401 349079
41003 349079 317672 317964 348549 411052 510737 651205 828798 1032583 1250395 1475885 1710856
40992 1710856 1961296 2230579 2515117 2804901 3086967 3348008 3574655 3753226 3871430
40983 3871430 3922307 3907915 3839531 3732976 3601270 3449611 3277183 3085481 2887374 2709574
40973 2709574 2585648 2543616 2596102 2738996 2958407 3240178 3575334 3958937 4385206 4843955
40963 4843955 5321130 5802080 6273882 6724465 7139885 7503534 7799906 8021498 8174297
40954 8174297 8277895 8359946 8447720 8560249 8703713 8871679 9049875 9222617 9376904 9502394
40944 9502394 9589153 9626567 9604762 9517156 9362033 9142332 8864319 8536006 8165651 7760348
40934 7760348 7325258 6864552 6384202 5894568 5410033 4945478 4512755 4120237 3774566
40925 3774566 3481013 3240820 3047934 2888686 2745315 2601679 2449324 2292741 2151959
40916 2151959 2059468 2050057 2146669 2349409 2633912 2959429 3281168 3560623 3771672 3903361
40906 3903361 3959618 3954170 3900743 3803250 3652583 3432652 3131862 2753042 2316756 1857518
40896 1857518 1415938 1030552 731403 535322 442633 436104 483614 544769 579829 558421 465460
40885 465460 302269 82494 -174871 -451346 -731064 -999967 -1244942 -1454954 -1623957 -1753989
40875 -1753989 -1856742 -1952525 -2066720 -2224995 -2448756 -2751423 -3135375 -3589860 -4091183 -4606348
40865 -4606348 -5099810 -5541083 -5910260 -6199093 -6407298 -6536145 -6583171 -6541390 -6403740 -6170544
40855 -6170544 -5856324 -5493053 -5128353 -4818247 -4615509 -4556742 -4652947 -4887206 -5219538 -5595942
40845 -5595942 -5958482 -6254730 -6445454 -6508890 -6440429 -6248501 -5948951 -5559485 -5094505 -4560756
40835 -4560756 -3955345 -3267973 -2487575 -1611274 -652059 358273 1372552 2336862 3201270
40826 3201270 3929432 4505017 4933371 5237218 5447169 5591108 5687805 5746978 5772904 5766742
40816 5766742 5725385 5638703 5488429 5250496 4900734 4422765 3816004 3100640 2316546 1515555
40806 1515555 749955 61928 -522652 -995467 -1363538 -1645318 -1865892 -2051506 -2223982
40797 -2223982 -2396622 -2573653 -2753942 -2936849 -3125850 -3326647 -3540839 -3760254 -3966813
40788 -3966813 -4138294 -4255748 -4308030 -4292504 -4214121 -4084669 -3921432 -3743633 -3567218 -3400739
40778 -3400739 -3244543 -3092668 -2935230 -2760173 -2555142 -2310632 -2023726 -1700171 -1352849
40769 -1352849 -997282 -647080 -312114 658 286505 544768 782091 1012864 1253529
40760 1253529 1511922 1777568 2019581 2194760 2262118 2196513 1995665 1679467 1283997 853017
40750 853017 429038 45863 -275750 -529059 -719806 -862730 -976114 -1075503 -1169235 -1257606
40740 -1257606 -1334970 -1392995 -1424504 -1427895 -1410435 -1387347 -1375618 -1385400 -1413821 -1444542 -1452972 -1414356
40728 -1414356 -1311253 -1138371 -904692 -633463 -359497 -123038 38528 97839 41203 -130752
40718 -130752 -403911 -753123 -1147553 -1558479 -1966317 -2363229 -2750007 -3129119 -3497609 -3843586
40708 -3843586 -4148393 -4393667 -4569916 -4681863 -4746766 -4785295 -4809250 -4813543 -4778355 -4681022 -4510250
40697 -4510250 -4273293 -3991614 -3688842 -3380028 -3069301 -2755957 -2443007 -2141943 -1871997
40688 -1871997 -1656071 -1515919 -1467775 -1518904 -1665917 -1895245 -2185076 -2507611 -2831486 -3124982
40678 -3124982 -3360106 -3516131 -3580573 -3546966 -3411145 -3169002 -2817424 -2357541 -1797734 -1154445
40668 -1154445 -450567 287556 1033290 1762260 2454022 3093068 3669488 4179136 4622651
40659 4622651 5002849 5320937 5573195 5750183 5839659 5832106 5725692 5527414 5249670 4904776
40649 4904776 4501009 4041981 3528183 2958237 2328998 1636258 878267 61593 -794452
40640 -794452 -1658391 -2492212 -3258839 -3928205 -4480629 -4907388 -5208567 -5389065 -5454867 -5411536
40630 -5411536 -5265048 -5023618 -4699466 -4310173 -3878865 -3431806 -2993058 -2578554 -2193628
40621 -2193628 -1836370 -1505015 -1204396 -947015 -748270 -619439 -563018 -572655 -636662 -742308
40611 -742308 -878454 -1035721 -1205116 -1376847 -1540690 -1688016 -1814166 -1919101 -2004698 -2069090
40601 -2069090 -2101076 -2078537 -1972764 -1756896 -1414718 -946890 -373622 266468 921565 1535481
40591 1535481 2058015 2453861 2707943 2826719 2836002 2776013 2694339 2637858 2644908 2738833 2923424
40580 2923424 3180572 3470826 3737875 3917364 3948904 3788789 3420464 2860111 2155300 1375787
40570 1375787 598090 -111582 -710007 -1181131 -1531755 -1782120 -1955609 -2070682 -2136919 -2155920
40560 -2155920 -2126262 -2049735 -1935329 -1798792 -1658479 -1530700 -1428080 -1361916 -1345542 -1393769
40550 -1393769 -1516084 -1706948 -1939983 -2170666 -2346699 -2421268 -2364170 -2167639 -1845918 -1429701
40540 -1429701 -958113 -470981 -2479 423900 798820 1127786 1427977 1721382 2025984
40531 2025984 2347684 2676036 2985807 3243973 3419356 3491284 3454466 3318605 3102747 2826521
40521 2826521 2502771 2136073 1727959 1284471 819814 353345 -97226 -520876 -913396
40512 -913396 -1273676 -1599446 -1885003 -2121396 -2298143 -2405237 -2434676 -2381810 -2246815 -2035724
40502 -2035724 -1759812 -1433105 -1069471 -680769 -276182 137713 555568 969945 1367251
40493 1367251 1725704 2016942 2210336 2278467 2203336 1982967 1636186 1202045 732177 278037
40483 278037 -122038 -450887 -713061 -928810 -1125103 -1327223 -1552247 -1804222 -2071513 -2328134
40473 -2328134 -2540302 -2676417 -2716092 -2654188 -2499046 -2267570 -1980540 -1659780 -1326670 -1001171
40463 -1001171 -701209 -442125 -234851 -82068 25725 109975 197340 309325 454720 629712
40453 629712 825044 1035175 1263778 1522710 1825183 2176606 2567519 2972152 3353524 3673048
40443 3673048 3900865 4023297 4045300 3987800 3881232 3757309 3641037 3544977 3467681 3397264
40433 3397264 3318768 3221622 3103570 2970039 2830724 2695783 2572808 2464720 2368683 2276295
40423 2276295 2175197 2051867 1894936 1697802 1459340 1182981 876228 552337 232918
40414 232918 -52348 -271429 -399405 -426931 -363754 -236459 -82128 59770 155063 180268
40404 180268 124641 -10627 -214559 -468827 -750679 -1036597 -1305616 -1540167 -1723580 -1836405
40394 -1836405 -1855693 -1759840 -1537252 -1193493 -752145 -249028 275983 784678 1242356 1618410
40384 1618410 1888967 2041949 2081258 2025757 1901502 1730226 1520210 1264819 949607 563697
40374 563697 108896 -398093 -930211 -1456977 -1948860 -2377398 -2713658 -2929250 -3001584 -2920889
40364 -2920889 -2694653 -2346946 -1913611 -1436048 -955258 -505805 -109427 229401 522006
40355 522006 786593 1036022 1269783 1475031 1635124 1739592 1789878 1798819 1785268 1767121
40345 1767121 1756087 1756090 1764950 1777275 1786491 1785213 1764734 1715398 1629373 1505342 1352239 1188782
40333 1188782 1038175 920867 849327 826763 849007 907817 994581 1103965 1236600 1399017
40323 1399017 1599759 1842992 2123333 2425171 2726669 3005749 3245275 3436505 3580817
40314 3580817 3688938 3776635 3857539 3936154 4004634 4045099 4036501 3963016 3820170 3616146 3368512
40303 3368512 3099168 2830291 2581809 2369036 2199891 2073056 1978953 1903658 1833735 1759280
40293 1759280 1673662 1570739 1442581 1281115 1084402 863972 647588 474225 382919 400654
40283 400654 534301 769112 1073416 1407378 1733035 2022912 2264866 2461516 2624562 2766873
40273 2766873 2896274 3013253 3112203 3184969 3226262 3240097 3244326 3269258 3348891 3508040 3751518
40262 3751518 4060510 4397088 4713755 4963226 5105166 5109679 4959300 4651088 4198869 3634188
40252 3634188 3004014 2364235 1770616 1270954 901264 685362 634814 747714 1007536 1384306
40242 1384306 1838797 2329042 2817787 3278680 3698205 4071834 4396556 4664753 4863376
40233 4863376 4978304 5000248 4928150 4768652 4533391 4237023 3897213 3535433 3176938 2849590
40223 2849590 2582170 2402094 2331505 2381316 2544754 2793516 3079577 3343626 3527864 3588547
40213 3588547 3504023 3276873 2931257 2506962 2050916 1607313 1208829 871863 597326 376168
40203 376168 197002 52774 -55892 -121431 -133015 -80805 41572 237031 506179 847571
40193 847571 1256606 1724852 2241677 2797552 3386111 4002719 4640266 5285249 5917073 6511808
40183 6511808 7049364 7520969 7932626 8301374 8645144 8971646 9273080 9529645 9718372
40174 9718372 9820583 9824115 9722001 9511765 9197141 8790760 8315703 7804873 7297723 6834272
40164 6834272 6447924 6160082 5978625 5899598 5909759 5988304 6107433 6232568 6324186 6343323
40154 6343323 6260336 6062668 5756772 5363463 4910544 4427196 3941996 3484105 3085890 2783708
40144 2783708 2613086 2598013 2740016 3014892 3379818 3785667 4186816 4545087 4830324 5021119
40134 5021119 5106156 5084309 4962888 4755639 4481876 4165663 3832866 3505740 3197370 2908976
40124 2908976 2631553 2351307 2056786 1744708 1421848 1102751 805802 550732 358152
40115 358152 248851 240605 342988 553408 857322 1232794 1656590 2108587 2573140 3038065
40105 3038065 3492533 3924598 4319075 4656977 4917702 5083904 5147242 5112360 4996984 4827668
40095 4827668 4632682 4434705 4246062 4068330 3896761 3727845 3566252 3426850 3330165 3293966
40085 3293966 3326131 3422694 3571300 3757432 3970005 4203884 4458490 4733131 5020936 5304191
40075 5304191 5554180 5737099 5824079 5800220 5668225 5446548 5165662 4865168 4590735 4388232
40065 4388232 4294858 4330602 4494069 4764075 5105441 5476375 5835985 6151481 6404275 6592871
40055 6592871 6730569 6838453 6936854 7038652 7146001 7250508 7336954 7390097 7402042 7376070
40045 7376070 7324585 7262944 7203483 7152699 7111448 7076402 7041885 7002512 6956996 6912161 6885005
40034 6885005 6900860 6987547 7167733 7452781 7840513 8317035 8861092 9449150 10059872 10676630
40024 10676630 11286759 11877357 12429726 12916267 13302946 13557508 13660334 13613156 13441598
40015 13441598 13190146 12911532 12654859 12456855 12338382 12305215 12350649 12458654 12608645 12783077
40005 12783077 12975963 13197008 13467054 13806480 14223759 14711060 15248006 15809067 16369363
39996 16369363 16906841 17402220 17839132 18205729 18497257 18717660 18878392 18994135 19077383
39987 19077383 19134937 19168017 19175092 19154602 19105731 19027961 18921607 18790258 18643583 18498317
39977 18498317 18376761 18303543 18301472 18387135 18567699 18841015 19199796 19637775 20154086 20752984
39967 20752984 21439051 22211045 23058715 23964991 24912068 25887096 26884176 27902754 28944583
39958 28944583 30010651 31098140 32197927 33294569 34370194 35411345 36415498 37394049
39950 37394049 38370379 39373930 40432665 41566407 42782824 44076833 45433435 46832965
39942 46832965 48256759 49691118 51129062 52570857 54024331 55504816 57033903 58636565
39934 58636565 60336511 62149810 64078369 66106631 68204303 70334099 72460210 74553814
39926 74553814 76595111 78573016 80483077 82324037 84094858 85794551 87425330 88996985
39918 88996985 90529764 92054378 93609198 95235403 96971147 98846305 100879763 103080961
39910 103080961 105455609 108012552 110767115 113738629 116944472 120395164 124092558 128029676
39902 128029676 132190663 136551567 141083209 145755563 150542023 155423124 160390126 165447966
39894 165447966 170616123 175926936 181422453 187150341 193157550 199479892 206127973 213073092
39886 213073092 220238234 227497487 234682730 241592461 247997691 253644779 258261213 261572271
39878 261572271 263332201 263365378 261605827 258121342 253112564 246885775 239807086 232251311
39870 232251311 224559187 217012014 209825311 203156310 197117363 191788929 187229349 183481345
39862 183481345 180576712 178541091 177399814 177183574 177931037 179686332 182491767 186377905
39854 186377905 191353500 197397534 204455029 212436652 221219949 230649012 240530793 250628832
39846 250628832 260657197 270278123 279106609 286724440 292705423 296652350 298242862 297275735
39838 297275735 293704533 287647011 279366956 269235054 257680619 245144932 232042826
39831 232042826 218735709 205517236 192611289 180179522 168333298 157144486 146652811
39824 146652811 136871995 127798358 119421924 111735185 104734212 98411691 92747155 87700979
39816 87700979 83215509 79222285 75651563 72439808 69532301 66881186 64442537 62176781
39808 62176781 60053635 58058209 56193304 54475886 52930055 51580639 50449489 49553682
39800 49553682 48903763 48501311 48336763 48388870 48626602 49013092 49510333 50082945 50700003
39791 50700003 51335238 51967083 52579839 53165692 53725884 54269759 54812114 55370443 55963396
39782 55963396 56610809 57334752 58159923 59110551 60202163 61430663 62764767 64146959 65503044
39773 65503044 66756134 67840277 68710451 69346707 69751446 69941086 69935730 69750796 69393191
39764 69393191 68863071 68160491 67293839 66285130 65168224 63980055 62748853 61484911
39756 61484911 60178295 58805015 57339603 55769031 54102074 52370068 50618343 48891405
39748 48891405 47217872 45601967 44025320 42457377 40868545 39240015 37567341 35858197
39740 35858197 34126792 32388366 30656759 28945712 27271647 25654744 24117511 22683002
39732 22683002 21374940 20218976 19242023 18467838 17910526 17569453 17427842 17454796 17609297
39723 17609297 17844888 18114420 18374619 18590178 18736638 18800823 18778287 18669186 18475414 18200733
39713 18200733 17852920 17445315 16995958 16524439 16048099 15579453 15126106 14692840 14284059
39704 14284059 13904445 13557196 13241077 12948560 12666942 12383166 12091081 11797727 11524376
39695 11524376 11300170 11150615 11086768 11100892 11170373 11266911 11365373 11447739 11501015 11511746 11461897
39684 11461897 11330103 11098630 10762290 10333942 9843550 9331748 8841385 8410311 8067001
39675 8067001 7828932 7702859 7686301 7770350 7943909 8198094 8528287 8932208 9404933 9933692
39665 9933692 10494979 11055170 11574636 12014276 12342448 12540301 12604724 12549055 12401279 12198845
39655 12198845 11980212 11775534 11600628 11457591 11342288 11254417 11203474 11206328 11278288 11424186
39645 11424186 11634787 11888641 12156212 12404280 12601099 12722526 12756608 12702867 12565283 12342856
39635 12342856 12024241 11590479 11023881 10316814 9475190 8516353 7465246 6352648 5216064
39626 5216064 4100694 3057188 2134767 1371336 784769 369935 103576 -44976 -102618
39617 -102618 -86326 -3950 140632 342655 594624 886839 1208143 1545931 1886284 2215326
39607 2215326 2521462 2796481 3033426 3221628 3342798 3373131 3292542 3095817 2797654 2427669
39597 2427669 2019063 1599130 1187159 798895 452021 167725 -32451 -131770 -122144 -5029
39587 -5029 210209 508594 870262 1268814 1669374 2030214 2310170 2479710 2530431 2478246
39577 2478246 2358739 2216645 2093779 2020182 2010968 2067592 2180307 2330035 2490646 2633132
39567 2633132 2731185 2766356 2731680 2634046 2495169 2349507 2237079 2191429 2226793 2330972
39557 2330972 2468769 2595183 2671737 2678003 2614330 2497574 2354275 2214726 2108845 2063428
39547 2063428 2100281 2234952 2475772 2823047 3268619 3796092 4381630 4994946 5600416 6158914
39537 6158914 6631202 6983113 7191775 7251113 7174336 6991911 6745379 6479300 6233784 6039036
39527 6039036 5912425 5858374 5870843 5936901 6039660 6160372 6281040 6388132 6475734 6545962
39517 6545962 6606468 6666920 6736055 6819000 6914136 7010296 7086752 7117618 7079254 6957066 6748773
39506 6748773 6464009 6121761 5746587 5363886 4995454 4657478 4361470 4115662 3923939
39497 3923939 3782818 3680014 3597257 3516343 3425138 3321130 3212072 3113992 3046529 3026070
39487 3026070 3058700 3136578 3240578 3348452 3443756 3519832 3576841 3615120 3630787 3617599 3574195
39476 3574195 3511521 3454322 3433984 3476131 3590428 3768721 3991757 4239344 4497952 4762672
39466 4762672 5034120 5312966 5595242 5870746 6124981 6342622 6509483 6611575 6632843 6554869
39456 6554869 6360424 6039725 5596377 5050166 4435173 3793164 3164122 2577837 2050408
39447 2050408 1586443 1183966 838276 543479 292741 78102 -110089 -283453 -453873
39438 -453873 -629301 -809201 -982590 -1129412 -1223583 -1236413 -1141233 -920430 -573750 -123991
39428 -123991 383838 891008 1338633 1681176 1894815 1978088 1946186 1822943 1634190 1403615
39418 1403615 1150225 887033 621860 360943 113731 -104487 -274625 -379811 -411891 -374738
39408 -374738 -282905 -157030 -18857 111967 218926 288524 310635 280227 200040 81926
39398 81926 -55432 -192425 -315063 -418853 -509344 -600879 -714340 -872486 -1091903 -1373831
39388 -1373831 -1698801 -2029044 -2318447 -2525375 -2622143 -2597727 -2455370 -2209651 -1885511 -1517189
39378 -1517189 -1143776 -801247 -514471 -292889 -131297 -15094 72098 141968 199442 245041
39368 245041 278209 298352 303837 291481 257748 200597 120316 18771 -102392 -243157 -404571
39357 -404571 -586010 -782439 -984284 -1179728 -1356202 -1498307 -1583645 -1581553 -1459103 -1193700
39347 -1193700 -785778 -263385 325080 925974 1494890 2004335 2444302 2819197 3144282
39338 3144282 3442300 3739213 4058126 4412322 4800418 5206488 5605094 5968299 6271609
39329 6271609 6497585 6636822 6686121 6644699 6510722 6280181 5948184 5511685 4972980 4342923
39319 4342923 3641596 2894914 2129125 1367521 631668 -54793 -663770 -1164423 -1528916
39310 -1528916 -1739773 -1795158 -1709305 -1508298 -1224014 -888747 -531297 -174730 163388 468298
39300 468298 725199 919390 1040080 1085178 1063331 991662 890640 778871 669541 568398
39290 568398 472900 373498 258484 121562 -31962 -184620 -312606 -394338 -416532 -374421
39280 -374421 -266954 -91632 155931 476782 862298 1292721 1742202 2186586 2609122 3002284
39270 3002284 3366644 3707824 4031765 4339434 4623866 4872303 5072829 5220980 5321077
39261 5321077 5380783 5402848 5380700 5302078 5159079 4957754 4720058 4476034 4250948 4055152
39251 4055152 3881612 3710627 3518067 3283572 2996468 2658185 2281040 1884634 1491532
39242 1491532 1123491 798888 531704 331355 201809 139309 130620 154640 187754 210101
39232 210101 209534 182157 129985 56471 -38955 -164760 -336573 -570944 -876395 -1246873 -1661749
39221 -1661749 -2092528 -2512450 -2903787 -3259692 -3580722 -3868293 -4118025 -4315782 -4438544
39212 -4438544 -4460319 -4360485 -4130385 -3775122 -3310823 -2760331 -2150291 -1510226 -872182 -269806
39202 -269806 262786 691741 984423 1111864 1052823 798291 355267 -250825 -975954 -1760898
39192 -1760898 -2538893 -3246379 -3834243 -4276199 -4571355 -4740055 -4815322 -4833886 -4829178 -4826077
39182 -4826077 -4836953 -4860345 -4884166 -4893240 -4878316 -4842493 -4801801 -4779456 -4797052 -4867736 -4993965
39171 -4993965 -5168177 -5373591 -5585039 -5771705 -5902091 -5949374 -5895662 -5734983 -5474507 -5132675
39161 -5132675 -4734296 -4304912 -3866575 -3435120 -3018760 -2619276 -2236902 -1876393 -1549071
39152 -1549071 -1268003 -1039271 -855942 -699290 -546323 -378627 -187810 24077 248212
39143 248212 475164 701766 935751 1194782 1499004 1860754 2277601 2732745 3201616 3659720
39133 3659720 4087086 4468427 4791682 5047764 5231838 5344790 5394301 5395875 5372787 5352510
39123 5352510 5359078 5405075 5488191 5593653 5699595 5781608 5814945 5775020 5637991 5383633 5001444
39112 5001444 4497651 3898204 3244513 2583693 1958858 1404120 944820 599794 381382
39103 381382 291107 312896 408834 522351 590026 558054 396024 101532 -305732 -795453
39093 -795453 -1336260 -1899282 -2457017 -2981185 -3441682 -3806851 -4045453 -4131021 -4047803 -3795833
39083 -3795833 -3392992 -2873648 -2284168 -1675352 -1092605 -566854 -110160 282046 623810
39074 623810 930264 1211296 1468793 1697685 1890160 2041267 2153128 2235482 2302645 2369347
39064 2369347 2447914 2546901 2669540 2811324 2958614 3090860 3186870 3232381 3224808 3172506 3089050
39053 3089050 2986161 2869835 2741952 2605083 2465120 2328023 2192367 2043906 1857603
39044 1857603 1607196 1277184 870948 411588 -63861 -513338 -897907 -1187026 -1361241
39035 -1361241 -1413612 -1350128 -1188083 -951963 -668100 -360202 -47095 257172 541756 798104
39025 798104 1021960 1218007 1402694 1600267 1832017 2104940 2407069 2711897 2988576 3211916
39015 3211916 3367122 3447533 3448216 3361376 3178261 2896626 2527868 2097974 1641034 1189122
39005 1189122 764407 377678 33120 -264808 -507623 -684740 -789542 -825387 -807354 -758028
38995 -758028 -699523 -646760 -606097 -579109 -567564 -575544 -607506 -663737 -736231 -808775 -863632 -892547
38983 -892547 -904727 -924501 -978164 -1077366 -1208714 -1334900 -1406020 -1375634 -1215379 -923423 -524443
38972 -524443 -61707 415140 861493 1244596 1545504 1758400 1888968 1951164 1961576 1933041
38962 1933041 1871138 1775592 1644880 1480613 1289776 1085404 886724 718280 606274 571266
38952 571266 619172 734727 881420 1008939 1065382 1009225 816534 481888 15165 -561895
38942 -561895 -1217091 -1908667 -2589281 -3214217 -3750458 -4181281 -4503999 -4723829 -4849056 -4890278
38932 -4890278 -4862232 -4784830 -4681610 -4576197 -4488297 -4430339 -4405775 -4409861 -4432764 -4463306 -4491526
38921 -4491526 -4509874 -4514226 -4505348 -4489811 -4478792 -4484132 -4512815 -4562391 -4620328 -4668613 -4691828 -4684300
38909 -4684300 -4652311 -4610452 -4574344 -4553160 -4544979 -4536583 -4507682 -4438105 -4315743 -4142837 -3938067
38898 -3938067 -3732706 -3561571 -3452446 -3418321 -3454525 -3540274 -3643296 -3726187 -3752496 -3690578
38888 -3690578 -3515170 -3208973 -2765902 -2194760 -1520346 -780495 -20084 715823 1387634
38879 1387634 1964059 2421593 2742034 2910826 2918336 2764012 2461386 2040875 1547700 1034620
38869 1034620 552614 144063 -159541 -337198 -378060 -281991 -60319 263634 654764 1068823
38859 1068823 1458927 1784425 2018219 2149897 2185131 2142939 2051301 1941236 1840448 1768416
38849 1768416 1734041 1736063 1765985 1812157 1862650 1905501 1927937 1917599 1866323 1773503 1645844
38838 1645844 1493666 1326652 1151457 971417 787620 601052 415693 241261 93373
38829 93373 -10115 -54972 -34939 48292 189252 384045 633740 944078 1321747 1768905
38819 1768905 2278674 2833868 3408892 3972424 4488783 4918654 5221752 5362592 5317511 5079825
38809 5079825 4661659 4092951 3418381 2691982 1969228 1297631 708081 209449 -211354
38800 -211354 -582614 -935674 -1292311 -1657609 -2020929 -2361801 -2655290 -2874329 -2991138 -2980837
38790 -2980837 -2827345 -2528366 -2096140 -1553284 -926267 -240458 480646 1212880 1929420
38781 1929420 2602797 3210413 3739231 4185726 4551233 4836280 5037093 5144884 5147212 5031264
38771 5031264 4788915 4422028 3945335 3385449 2776645 2155042 1552597 992469 487574
38762 487574 43116 -338412 -652435 -889761 -1037042 -1080253 -1010645 -831284 -561298 -235522
38752 -235522 101058 402816 633984 776221 830234 811773 745437 659926 585649 552719 586961
38741 586961 703616 901412 1161189 1451432 1738535 1996290 2209837 2373383 2484523 2538891
38731 2538891 2527968 2441200 2271448 2020952 1704797 1350330 992679 667846 405786 226058
38721 226058 136693 134551 205401 324821 462410 589219 684780 740181 756727 742097 705768
38710 705768 655347 595790 532582 476609 446260 464058 549706 714017 956981 1269867 1638872
38699 1638872 2047574 2477053 2904917 3305997 3656524 3940520 4154467 4307017 4414064
38690 4414064 4492573 4556296 4613981 4668855 4718653 4756688 4774481 4765448 4728300 4668760 4598566
38679 4598566 4531691 4479123 4444678 4423822 4405666 4376624 4324137 4239555 4119785 3967546 3790276
38668 3790276 3597863 3399167 3197410 2985389 2742914 2439212 2041108 1524595 884894
38659 884894 140536 -669952 -1496362 -2285966 -2990550 -3571207 -4002446 -4276289 -4404804 -4418574
38649 -4418574 -4360262 -4275230 -4202434 -4167854 -4180909 -4233524 -4302117 -4353061 -4351227 -4269249 -4094340
38638 -4094340 -3830524 -3496506 -3120630 -2734201 -2364204 -2027583 -1730081 -1470964 -1250850
38629 -1250850 -1077415 -965549 -933041 -995383 -1162088 -1434114 -1801189 -2239790 -2714553 -3184939
38619 -3184939 -3615088 -3981844 -4277328 -4506971 -4686457 -4839228 -4993207 -5175291 -5404775
38610 -5404775 -5688373 -6018760 -6376996 -6738146 -7078128 -7378721 -7628689 -7822072 -7956458
38601 -7956458 -8032807 -8056028 -8035508 -7985802 -7927279 -7884923 -7883781 -7942153 -8065572 -8243877 -8451984
38590 -8451984 -8654234 -8811934 -8892378 -8876025 -8759038 -8550995 -8270080 -7938162 -7576956 -7205739
38580 -7205739 -6841003 -6497909 -6191971 -5939039 -5753506 -5646912 -5628526 -5706435 -5886005 -6165132
38570 -6165132 -6529678 -6952933 -7399493 -7830964 -8211525 -8513264 -8721142 -8835534 -8870241 -8846495
38560 -8846495 -8786016 -8705833 -8615245 -8514278 -8394151 -8241303 -8044786 -7803635 -7529752 -7244931
38550 -7244931 -6974770 -6743341 -6569969 -6466775 -6435728 -6466055 -6534016 -6606196 -6645591 -6618659
38540 -6618659 -6501492 -6284021 -5971810 -5585046 -5154058 -4711589 -4284088 -3885990 -3519654
38531 -3519654 -3179929 -2859226 -2549590 -2241712 -1923664 -1581582 -1201906 -773527 -289700
38522 -289700 248907 830162 1428553 2008762 2533790 2972786 3304785 3519024 3614703 3600700
38512 3600700 3493409 3312242 3075570 2799899 2501414 2196189 1897141 1610164 1333678
38503 1333678 1063152 797838 545253 320696 142048 22125 -38101 -51705 -40801 -25399
38493 -25399 -11558 14340 81700 224153 465629 809128 1231177 1683148 2099314 2409841
38483 2409841 2555329 2498839 2232450 1777262 1177180 487983 -235433 -949580 -1627322 -2257143
38473 -2257143 -2839554 -3383437 -3902674 -4411710 -4919730 -5425271 -5913833 -6359960 -6733416
38464 -6733416 -7007384 -7165677 -7206478 -7142171 -6996576 -6800838 -6588296 -6388545 -6221756 -6094555
38454 -6094555 -5998230 -5909901 -5797733 -5630581 -5389655 -5077223 -4717819 -4351089 -4019690 -3757790
38444 -3757790 -3584862 -3506287 -3518601 -3615476 -3791253 -4041170 -4358985 -4733418 -5145216 -5566984
38434 -5566984 -5967018 -6316177 -6594765 -6796209 -6926135 -6998018 -7028237 -7033099 -7028313 -7029233 -7049767
38423 -7049767 -7099440 -7179725 -7281374 -7384318 -7461380 -7485551 -7437890 -7311862 -7112309 -6851545
38413 -6851545 -6546356 -6216934 -5885684 -5574276 -5299781 -5071905 -4892429 -4756912 -4658334 -4591406
38403 -4591406 -4555193 -4552374 -4586176 -4658008 -4767618 -4914695 -5099207 -5319156 -5566886 -5826534
38393 -5826534 -6074501 -6282840 -6423751 -6473196 -6412775 -6230389 -5920736 -5486544 -4940419 -4306048
38383 -4306048 -3616989 -2912469 -2231681 -1608909 -1070633 -634178 -307241 -88414 31007
38374 31007 64412 27393 -64224 -196085 -356842 -538739 -736290 -943255 -1149509 -1339535
38364 -1339535 -1493160 -1588174 -1604344 -1528192 -1356842 -1098923 -772387 -401650 -16171 350682
38354 350682 665596 902794 1051569 1119017 1126016 1098387 1057376 1013412 965420 905318 824625
38343 824625 719002 587712 428371 231214 -21580 -349217 -761905 -1253640 -1802092 -2373947
38333 -2373947 -2931310 -3436746 -3857459 -4169595 -4362137 -4438318 -4412811 -4305141 -4132555 -3906267
38323 -3906267 -3632373 -3315026 -2958463 -2566624 -2141584 -1682724 -1188130 -658548 -102129
38314 -102129 463407 1012994 1518523 1951462 2283270 2487074 2543299 2447270 2213643 1873956
38304 1873956 1467418 1028529 577019 114960 -367735 -883186 -1436777 -2023404 -2628169
38295 -2628169 -3228907 -3799201 -4312596 -4748708 -5099555 -5372129 -5583963 -5752645 -5884659
38286 -5884659 -5969973 -5985570 -5906221 -5717521 -5425673 -5060171 -4668209 -4302503 -4006489 -3802080
38276 -3802080 -3684651 -3627356 -3593058 -3548864 -3477539 -3381972 -3282119 -3206597 -3182230 -3224436 -3330269
38265 -3330269 -3475225 -3614800 -3691386 -3646081 -3433372 -3035093 -2468813 -1786167 -1060074 -365367
38255 -365367 238655 716593 1054921 1254061 1320494 1262391 1088695 809973 439738 -4249
38245 -4249 -499057 -1016850 -1526764 -1997597 -2399782 -2705871 -2890352 -2930480 -2809234 -2519819
38235 -2519819 -2069399 -1479523 -782797 -18002 773881 1552790 2283726 2942127 3517580
38226 3517580 4012876 4438670 4806971 5126301 5399530 5624269 5795496 5909304 5965536 5967660
38216 5967660 5920373 5827232 5690334 5512069 5297353 5054643 4795237 4531450 4274282 4030773
38206 4030773 3801380 3578767 3350148 3104099 2839432 2570857 2326755 2139122 2031240
38197 2031240 2010198 2067534 2185567 2344077 2523516 2704543 2866172 2984756 3034627 2990317
38187 2990317 2830562 2544124 2135556 1626979 1053036 450974 -148204 -722691 -1257312
38178 -1257312 -1739736 -2159003 -2506472 -2777081 -2969549 -3086095 -3133013 -3122185 -3072032 -3006490
38168 -3006490 -2952026 -2933377 -2968081 -3060015 -3194344 -3337856 -3446844 -3480365 -3413785 -3247544
38158 -3247544 -3007830 -2738307 -2485541 -2284090 -2147506 -2068138 -2024334 -1990928 -1948108 -1884816
38148 -1884816 -1796247 -1679357 -1531413 -1352738 -1149962 -935529 -723333 -524168 -344414 -188074
38138 -188074 -59665 34525 87544 94365 54463 -27182 -141931 -281997 -445079 -635556 -861022
38127 -861022 -1126616 -1431075 -1766226 -2118935 -2473860 -2816178 -3134114 -3420762 -3674313 -3895572
38117 -3895572 -4082867 -4226976 -4310444 -4313330 -4221984 -4034856 -3762490 -3423950 -3043041 -2645096
38107 -2645096 -2253447 -1885915 -1552929 -1258061 -999977 -774136 -573120 -385603 -195135
38098 -195135 19536 281709 612066 1023463 1516572 2078027 2682355 3297164 3889035 4427901
38088 4427901 4890156 5261777 5540892 5737296 5867766 5949576 5996290 6017707 6022025 6016496 6004928
38077 6004928 5984312 5944597 5873172 5761119 5606655 5413895 5189234 4938994 4669857 4390696
38067 4390696 4113295 3850654 3613728 3408631 3235596 3089086 2957655 2823420 2662922
38058 2662922 2451125 2167739 1802532 1356696 840805 272625 -323123 -914857 -1467598
38049 -1467598 -1950427 -2343930 -2642917 -2853456 -2987538 -3059151 -3082545 -3070517 -3030416 -2958423
38039 -2958423 -2835777 -2631115 -2309870 -1847133 -1238168 -502145 321673 1182622 2027937
38030 2027937 2809440 3487278 4032590 4430289 4680905 4799764 4813341 4754114 4655168 4545444
38020 4545444 4447150 4376540 4346828 4369767 4453399 4597216 4788437 5002045 5204567 5359799
38010 5359799 5434837 5405672 5261993 5010417 4674602 4291073 3901313 3542552 3240067 3002765
38000 3002765 2822640 2678019 2540112 2381593 2184930 1947383 1680166 1401900 1130184
37991 1130184 876644 647927 449989 290396 176042 108296 79798 75121 74510 59137 17319
37980 17319 -48887 -119509 -158836 -125276 14980 276908 652529 1113863 1620669 2129976
37970 2129976 2604335 3016593 3351627 3607598 3797459 3947315 4087994 4242130 4415047
37961 4415047 4595970 4767444 4914498 5027207 5097590 5116130 5071401 4952304 4750822 4464303
37951 4464303 4097210 3661885 3177681 2668760 2161860 1684747 1264439 923701 675844
37942 675844 520351 442833 420691 431978 462486 507490 568980 652271 764875 916807 1119318
37931 1119318 1380380 1698532 2058774 2433345 2787239 3085557 3299562 3410418 3411506 3309661
37921 3309661 3123805 2879465 2600419 2301609 1987094 1653699 1297819 921813 537357
37912 537357 164939 -169841 -441871 -632870 -737285 -765851 -744570 -708113 -689491 -710076
37902 -710076 -774015 -868862 -971406 -1055753 -1100280 -1091162 -1022381 -894275 -713089 -492151 -252432
37891 -252432 -19347 184878 349764 480654 595379 715151 854240 1012587 1173626 1308221
37881 1308221 1384197 1378597 1287475 1128321 933673 738780 568617 429217 306218 170689
37871 170689 -10248 -262054 -594695 -1000779 -1460308 -1949238 -2446386 -2934037 -3392667 -3795608
37861 -3795608 -4109886 -4303984 -4357396 -4265970 -4041309 -3706828 -3293384 -2835028 -2363878 -1904551
37851 -1904551 -1470869 -1067292 -694124 -352260 -43597 232820 485382 731373 993912
37842 993912 1295526 1651020 2062695 2519752 3001356 3481120 3931534 4328771 4658132 4917870
37832 4917870 5117857 5272435 5391448 5475169 5515658 5502290 5426928 5285715 5077818 4803922
37822 4803922 4467040 4075721 3646930 3205370 2778826 2392640 2067236 1819670 1666406
37813 1666406 1623781 1705141 1916761 2255198 2707235 3251756 3862165 4508279 5157684 5777590
37803 5777590 6338307 6817895 7205889 7504076 7724087 7882959 7997769 8080113 8132085 8146206
37793 8146206 8110563 8016978 7867408 7674516 7456417 7229614 7004741 6786474 6574921 6365190
37783 6365190 6145147 5895126 5593078 5224457 4791872 4319017 3846321 3419781 3077454
37774 3077454 2839449 2705875 2662725 2690643 2770509 2884067 3012992 3140433 3255306 3356437
37764 3356437 3454235 3569364 3728318 3955997 4267527 4663674 5132462 5654547 6207287 6765203
37754 6765203 7299133 7777581 8170998 8456952 8623622 8670155 8603969 8436389 8178776 7840710
37744 7840710 7430431 6956899 6432769 5877036 5315247 4775625 4282232 3849069 3478706
37735 3478706 3165793 2902773 2684835 2512602 2391992 2330699 2331854 2387707 2477515 2571867
37725 2571867 2641630 2667042 2642944 2578390 2491357 2401521 2325444 2277104 2272193 2330681 2472941
37714 2472941 2710241 3035528 3420889 3823959 4200235 4515064 4749822 4900847 4973912 4978085
37704 4978085 4921106 4806891 4636287 4411916 4144740 3856814 3576366 3327544 3121650 2955057
37694 2955057 2814060 2683882 2558727 2449292 2383039 2394455 2508681 2727723 3027392 3365732
37684 3365732 3696685 3981752 4196257 4330301 4385635 4370195 4293178 4163540 3992094 3793841
37674 3793841 3586574 3384847 3192442 2998003 2777011 2499921 2143158 1698303 1176170
37665 1176170 605593 28796 -504976 -947220 -1258470 -1414717 -1409200 -1249175 -949828 -528087
37655 -528087 1803 629448 1345095 2133056 2965725 3802693 4596105 5299244 5874116 6295710
37645 6295710 6552765 6646072 6585797 6389616 6082541 5697261 5272436 4847411 4454731 4114145
37635 4114145 3831508 3602879 3420609 3277290 3165924 3078147 3003455 2930751 2851358 2761706
37625 2761706 2663762 2562073 2458360 2347384 2218014 2059704 1869917 1657177 1438075 1231013
37615 1231013 1051180 909448 814593 775565 800602 892679 1044162 1234447 1432365 1602424
37605 1602424 1712515 1740531 1677846 1528900 1308045 1035806 735961 433076 149539 -98145
37595 -98145 -302768 -467947 -606493 -735471 -869300 -1013268 -1159819 -1289597 -1378175 -1406834
37585 -1406834 -1372415 -1290048 -1186422 -1087628 -1009003 -951707 -905606 -855410 -787684 -697182 -590087
37574 -590087 -481621 -388498 -320802 -278643 -254610 -237938 -215752 -171129 -82199 73936 313333
37563 313333 638251 1035599 1481525 1949323 2416826 2870409 3304280 3715503 4097190 4433546
37553 4433546 4699403 4863924 4896202 4771268 4476710 4019233 3427530 2747390 2029668 1317679
37543 1317679 641280 19408 -533210 -1000837 -1366056 -1613484 -1735914 -1739982 -1648073 -1494538
37533 -1494538 -1317124 -1146997 -1001468 -882463 -781340 -687556 -596408 -511787 -443781 -404492
37523 -404492 -405387 -456064 -561978 -720107 -915170 -1120589 -1305853 -1447307 -1536410 -1580657 -1596766
37512 -1596766 -1600494 -1599130 -1590222 -1565639 -1517267 -1441231 -1339763 -1221096 -1097593 -982289 -885070
37501 -885070 -810111 -755328 -713151 -672134 -620013 -548712 -459899 -368004 -298197 -279175 -333315
37490 -333315 -468279 -674049 -926769 -1196858 -1456682 -1684916 -1868337 -2003186 -2096318 -2164434
37480 -2164434 -2230216 -2316075 -2437139 -2595149 -2775331 -2948223 -3076667 -3125513 -3070532 -2904184
37470 -2904184 -2637370 -2297064 -1920460 -1547106 -1210744 -931782 -711420 -529879 -351461
37461 -351461 -136456 144460 499555 912974 1348829 1759081 2092278 2302450 2358556 2253253
37451 2253253 2007171 1665041 1284156 920038 615028 392394 255443 190126 170037 162854
37441 162854 137005 67351 -61114 -252258 -500627 -794993 -1121545 -1465224 -1809684 -2137994
37431 -2137994 -2435575 -2694386 -2915282 -3106335 -3277918 -3437545 -3586748 -3720115 -3825785
37422 -3825785 -3887427 -3888213 -3816351 -3670408 -3462091 -3214587 -2956161 -2711391 -2494665 -2309862
37412 -2309862 -2156159 -2035624 -1957102 -1933574 -1974512 -2078193 -2229192 -2403047 -2575143 -2728488
37402 -2728488 -2856797 -2963108 -3056239 -3146847 -3243328 -3347446 -3450633 -3533649 -3572495 -3550038
37392 -3550038 -3467232 -3345529 -3217431 -3111357 -3041182 -3006093 -2998042 -3010166 -3041515 -3097050 -3183864
37381 -3183864 -3305521 -3457236 -3624416 -3784892 -3912918 -3983039 -3973714 -3871522 -3675425 -3398815
37371 -3398815 -3067577 -2714798 -2374372 -2074994 -1834562 -1655474 -1523335 -1411906 -1293861
37362 -1293861 -1152518 -988538 -818605 -667731 -559592 -509552 -523187 -599948 -738313 -938069
37352 -938069 -1198190 -1512911 -1869896 -2252192 -2642801 -3029713 -3409551 -3788209 -4177513 -4588664
37342 -4588664 -5025085 -5477314 -5921375 -6321271 -6635843 -6828910 -6879271 -6786494 -6570331 -6264600
37332 -6264600 -5908002 -5534743 -5167963 -4818456 -4489216 -4183386 -3911243 -3692114 -3549508
37323 -3549508 -3501586 -3552248 -3688438 -3885536 -4117497 -4365603 -4621115 -4881107 -5140340 -5383727
37313 -5383727 -5583538 -5703321 -5707157 -5569966 -5284245 -4861130 -4327298 -3720492 -3084929 -2465694
37303 -2465694 -1901640 -1418893 -1028467 -729619 -516915 -386841 -340514 -381454 -509950 -717333
37293 -717333 -983496 -1279158 -1571610 -1831075 -2035311 -2171739 -2237778 -2240430 -2195608 -2127021
37283 -2127021 -2064178 -2038966 -2080484 -2208464 -2427250 -2723341 -3068387 -3426279 -3760777 -4040744
37273 -4040744 -4242483 -4350182 -4355799 -4259443 -4070458 -3807765 -3497063 -3164307 -2828177 -2495771
37263 -2495771 -2163870 -1824691 -1472827 -1109589 -742534 -380974 -31074 305622 629368
37254 629368 937544 1221979 1470733 1674079 1831496 1954903 2065136 2182780 2318206 2465852
37244 2465852 2605464 2709802 2755529 2732399 2646512 2516760 2367267 2220054 2091245 1992223
37234 1992223 1934745 1935871 2017132 2195463 2470305 2815994 3185965 3527088 3795446 3964727
37224 3964727 4024490 3972482 3807953 3530555 3144545 2664075 2114342 1525910 924553 323318
37214 323318 -276708 -876414 -1466372 -2021734 -2508602 -2897352 -3173424 -3339059 -3407215 -3394439
37204 -3394439 -3318143 -3198147 -3058130 -2923471 -2815758 -2747201 -2718245 -2719513 -2736602 -2754988 -2763094
37193 -2763094 -2753507 -2723063 -2671659 -2599245 -2501978 -2370249 -2190612 -1950902 -1645787 -1280373
37183 -1280373 -870730 -441063 -17989 376167 728097 1034225 1297998 1526102 1725597
37174 1725597 1902059 2058016 2191894 2298868 2374354 2418526 2438806 2448084 2459059 2477414 2497310
37163 2497310 2501803 2468388 2377302 2218966 1997692 1730310 1439765 1145738 856589 567395
37153 567395 265269 -62096 -420845 -811464 -1233583 -1690644 -2190945 -2743946 -3353092 -4008130
37143 -4008130 -4680799 -5326995 -5895475 -6339313 -6624542 -6732767 -6659228 -6410247 -6002240 -5461086
37133 -5461086 -4819803 -4114483 -3380037 -2647178 -1941448 -1284776 -698876 -207664 164740
37124 164740 401032 499022 475777 364288 203735 28100 -141493 -298020 -444742 -589755
37114 -589755 -741273 -904154 -1077821 -1256264 -1430335 -1591090 -1732422 -1852060 -1950902 -2031186
37104 -2031186 -2094376 -2140202 -2167669 -2176935 -2169655 -2146384 -2102393 -2025315 -1897369 -1701779 -1429859
37093 -1429859 -1084823 -680830 -238780 218534 669986 1097548 1485630 1819395 2084213
37084 2084213 2268002 2366158 2386416 2350304 2289286 2236445 2217264 2244028 2316466 2427439 2569434
37073 2569434 2737534 2927388 3130238 3329240 3500555 3619369 3667292 3636559 3529152 3352976
37063 3352976 3118765 2839317 2529649 2205946 1883153 1572979 1283527 1019862 783901
37054 783901 573395 381396 197542 11080 -185659 -394796 -612575 -831578 -1044446 -1246715
37044 -1246715 -1436598 -1611909 -1766990 -1892810 -1981079 -2029642 -2044449 -2035184 -2006489 -1951246 -1851754
37033 -1851754 -1688659 -1451534 -1144663 -786588 -406520 -40575 272164 495296 602153
37024 602153 581651 439888 196648 -121266 -486542 -874962 -1265559 -1638811 -1975329 -2256738
37014 -2256738 -2468798 -2605173 -2669636 -2675582 -2643354 -2596621 -2558447 -2547097 -2572404 -2634359 -2724395
37003 -2724395 -2827751 -2925023 -2993454 -3010104 -2957275 -2827310 -2623459 -2356396 -2038950 -1682020
36993 -1682020 -1293188 -878017 -442786 3303 448104 878799 1285073 1661252 2005845
36984 2005845 2317995 2592332 2815644 2968484 3031466 2992578 2851407 2618729 2312502 1952410
36974 1952410 1555310 1133510 696482 254705 -176669 -576254 -918060 -1176809 -1335850
36965 -1335850 -1394437 -1370297 -1295481 -1207108 -1137012 -1104219 -1112570 -1153684 -1213261 -1277223 -1334591
36954 -1334591 -1376466 -1393452 -1374849 -1311037 -1197171 -1034782 -829707 -588146 -314099 -9720
36944 -9720 322541 677949 1048335 1421423 1780242 2103021 2364368 2538536 2605148 2556288
36934 2556288 2401973 2170395 1901465 1635916 1404339 1219699 1074749 944618 794428
36925 794428 590355 310114 -51715 -485305 -971797 -1490040 -2020975 -2549025 -3061283 -3545948
36915 -3545948 -3991365 -4386034 -4718935 -4979947 -5161540 -5262596 -5292221 -5269395 -5216720 -5151959
36905 -5151959 -5083659 -5013815 -4944269 -4880551 -4829508 -4792838 -4762039 -4718955 -4641785 -4513167 -4326862
36894 -4326862 -4091143 -3828112 -3568512 -3342822 -3171351 -3057537 -2987746 -2938002 -2884459 -2812372
36884 -2812372 -2719205 -2611215 -2496848 -2381529 -2266494 -2151043 -2035361 -1921122 -1809090 -1695577
36874 -1695577 -1570787 -1420544 -1230292 -989235 -693617 -349129 28287 414663 783483
36865 783483 1112058 1385551 1596981 1744166 1825966 1840027 1783332 1655300 1461406 1214380
36855 1214380 931259 627598 312477 -12413 -349227 -698263 -1053241 -1399826 -1718398
36846 -1718398 -1990430 -2205719 -2366613 -2486886 -2586325 -2684211 -2794074 -2920296 -3056723 -3187974
36836 -3187974 -3293540 -3353009 -3349853 -3272354 -3112468 -2864542 -2525480 -2096744 -1587403 -1016495
36826 -1016495 -412599 190871 764109 1289504 1765085 2199572 2601330 2968408 3286416
36817 3286416 3535311 3699848 3776487 3772832 3701146 3571200 3387346 3150977 2865541 2540014
36807 2540014 2188700 1827948 1471730 1127849 796126 469572 138465 -204473 -560659
36798 -560659 -925825 -1293014 -1655637 -2008278 -2345432 -2660620 -2948188 -3207532 -3446671 -3681565
36788 -3681565 -3929906 -4201781 -4491709 -4775696 -5014434 -5161509 -5174317 -5024719 -4705916 -4233162
36778 -4233162 -3639007 -2966432 -2263053 -1577056 -953783 -432336 -42565 197283 282407 222249
36768 222249 38749 -239177 -583751 -975377 -1404579 -1867382 -2356998 -2857343 -3342336 -3780024
36758 -3780024 -4137116 -4381012 -4480912 -4411809 -4162321 -3742619 -3187027 -2548584 -1887226 -1255919
36748 -1255919 -689545 -200107 220204 589675 925808 1237224 1521531 1768623 1966883
36739 1966883 2109430 2198002 2243138 2261373 2272082 2295894 2353777 2464406 2639762 2881747
36729 2881747 3182114 3524784 3888204 4247240 4575948 4851748 5059544 5193872 5258389 5263106
36719 5263106 5220516 5142307 5038197 4916744 4786184 4653652 4522917 4392080 4252192 4087310
36709 4087310 3876665 3599369 3240534 2796069 2273750 1690168 1065424 418504 -234283
36700 -234283 -877624 -1494549 -2066058 -2574293 -3007548 -3363774 -3650098 -3878161 -4057320 -4189074
36690 -4189074 -4265736 -4274197 -4202811 -4047979 -3817721 -3531336 -3215722 -2899729 -2608000 -2355648
36680 -2355648 -2144951 -1965312 -1797379 -1620780 -1422786 -1204434 -981906 -783067 -640311
36671 -640311 -581393 -620904 -755800 -967558 -1230530 -1522619 -1832966 -2162732 -2519105 -2906642
36661 -2906642 -3321367 -3750450 -4176352 -4582188 -4955813 -5291666 -5590337 -5856105 -6093225
36652 -6093225 -6302333 -6478673 -6613670 -6699901 -6736913 -6733821 -6706803 -6673622 -6648953 -6641849 -6654017
36641 -6654017 -6678284 -6698644 -6692927 -6637040 -6509421 -6296136 -5997007 -5630410 -5232917 -4852649
36631 -4852649 -4539492 -4336174 -4271730 -4356895 -4581452 -4915026 -5312434 -5722516 -6097306 -6398029
36621 -6398029 -6596354 -6672213 -6611336 -6405166 -6053504 -5567999 -4973640 -4306039 -3604438 -2903151
36611 -2903151 -2225903 -1586475 -995154 -466410 -22285 310895 509943 561242 462749 222195
36601 222195 -145529 -619660 -1173843 -1776928 -2395083 -2995175 -3548906 -4037090 -4453076 -4804097
36591 -4804097 -5109645 -5396554 -5691462 -6012475 -6362767 -6728587 -7082540 -7390991 -7622799
36582 -7622799 -7756045 -7780252 -7694369 -7503577 -7218403 -6856508 -6443874 -6011976 -5591005 -5202733
36572 -5202733 -4856780 -4551365 -4277143 -4021803 -3773566 -3522593 -3260680 -2980772 -2677910
36563 -2677910 -2351727 -2008551 -1660620 -1321536 -1000084 -696391 -403206 -111318 184695
36554 184695 483910 780085 1064297 1326840 1557561 1745321 1878406 1947215 1948340 1886818
36544 1886818 1774178 1623689 1446787 1252534 1047942 836307 614111 369894 87372
36535 87372 -248515 -646014 -1104196 -1614309 -2163231 -2736650 -3320568 -3901542 -4466740 -5004120
36525 -5004120 -5502198 -5949415 -6333887 -6644502 -6873496 -7019882 -7092188 -7108461 -7092564 -7068467
36515 -7068467 -7055892 -7069100 -7117399 -7204881 -7329100 -7480989 -7648117 -7820532 -7995669 -8178749
36505 -8178749 -8378127 -8598796 -8838160 -9085435 -9322776 -9526092 -9666385 -9714150 -9647316 -9459400
36495 -9459400 -9162977 -8785946 -8362359 -7922826 -7489168 -7074307 -6684290 -6318672 -5968734
36486 -5968734 -5616914 -5241046 -4823179 -4358440 -3858290 -3345678 -2844565 -2369769 -1922399
36477 -1922399 -1492108 -1063289 -621460 -158098 325916 818271 1295426 1725467 2072412
36468 2072412 2300384 2377294 2278503 1990238 1511368 852899 36251 -908355 -1943842 -3030202
36458 -3030202 -4130269 -5214448 -6261149 -7252789 -8170751 -8993344 -9698051 -10266163 -10686597
36449 -10686597 -10957376 -11085362 -11085374 -10978481 -10788470 -10536834 -10238519 -9900529 -9523346 -9103563
36439 -9103563 -8636745 -8120563 -7557983 -6959050 -6339957 -5719859 -5117569 -4550202 -4034187
36430 -4034187 -3587228 -3228855 -2977766 -2846286 -2834671 -2929014 -3104658 -3333752 -3593210 -3869597
36420 -3869597 -4159335 -4464684 -4787148 -5120938 -5449467 -5746976 -5985344 -6143968 -6219098 -6228216
36410 -6228216 -6205740 -6190207 -6208839 -6268452 -6357709 -6457408 -6550074 -6622534 -6662241 -6653216 -6576582
36399 -6576582 -6415740 -6161887 -5815492 -5383095 -4872985 -4293864 -3657288 -2980662 -2287060
36390 -2287060 -1601303 -945528 -338153 203114 657984 1004873 1227802 1324357 1308406 1205034
36380 1205034 1040968 836627 604413 353731 99074 -134641 -313655 -403344 -377730 -225140
36370 -225140 51919 440997 924898 1485289 2103358 2757902 3422969 4067850 4660787 5175316
36360 5175316 5596214 5921968 6162364 6332461 6446271 6513427 6539792 6530141 6489851 6423919
36350 6423919 6334575 6220663 6080765 5918082 5742047 5563213 5383607 5189208 4950356 4630379
36340 4630379 4197994 3638115 2958048 2188184 1377047 581232 -147362 -772624 -1279506
36331 -1279506 -1672579 -1970026 -2195978 -2372800 -2514430 -2622728 -2688748 -2698744 -2641997 -2516550
36321 -2516550 -2330040 -2095003 -1821287 -1510936 -1160450 -769832 -351172 71314 470942
36312 470942 830381 1146391 1424781 1671433 1887458 2071417 2224558 2353093 2465385 2566854
36302 2566854 2656785 2728903 2774839 2788291 2767916 2717739 2645369 2559516 2468374 2379023 2297066
36291 2297066 2225914 2165732 2112107 2054648 1976476 1856043 1671540 1406188 1051965 610611
36281 610611 92787 -482698 -1088732 -1690161 -2247261 -2723755 -3097166 -3366595 -3553992 -3698323
36271 -3698323 -3844704 -4031680 -4280380 -4589352 -4937102 -5290641 -5615654 -5884296 -6079235
36262 -6079235 -6194611 -6235070 -6213730 -6149378 -6063001 -5973886 -5896240 -5837394 -5797921 -5773025 -5754535
36251 -5754535 -5733141 -5700054 -5646906 -5563867 -5438214 -5256312 -5009568 -4701584 -4352340 -3996532
36241 -3996532 -3675859 -3427672 -3274339 -3217931 -3242384 -3321254 -3426515 -3534486 -3628032 -3696578
36231 -3696578 -3735822 -3747723 -3739956 -3723557 -3708337 -3697627 -3685311 -3657117 -3595048 -3481723 -3302501
36220 -3302501 -3046401 -2708143 -2291574 -1811972 -1294557 -769607 -267464 183734 558111
36211 558111 832853 991395 1026902 942660 748747 457889 83356 -361378 -863310 -1411351
36201 -1411351 -1996724 -2610579 -3239483 -3861773 -4448308 -4969625 -5407369 -5763131 -6057136
36192 -6057136 -6315416 -6553227 -6766279 -6935814 -7043230 -7083207 -7066089 -7008381 -6918613 -6788355
36182 -6788355 -6593731 -6305266 -5899367 -5365938 -4710724 -3953942 -3126941 -2267869 -1417086
36173 -1417086 -613574 106856 711943 1173455 1469104 1586081 1525124 1303153 952024 512038
36163 512038 21994 -489167 -1004514 -1515035 -2013584 -2491063 -2935810 -3335416 -3680680 -3971079
36153 -3971079 -4218624 -4445983 -4677939 -4930261 -5201776 -5472906 -5710300 -5875215 -5933001 -5861492
36143 -5861492 -5656788 -5335396 -4931569 -4488946 -4047878 -3633356 -3249702 -2884753 -2520196
36134 -2520196 -2141552 -1743508 -1330952 -918191 -527321 -184688 84980 264756 348925 342227
36124 342227 256180 105345 -94030 -322691 -556520 -767050 -925283 -1006997 -997096 -892046
36114 -892046 -700535 -442096 -143479 165750 456063 698954 868460 945222 921718 805136
36104 805136 615734 381479 131584 -108436 -318613 -483232 -588299 -620499 -569313 -431759
36094 -431759 -217447 49065 330874 586614 781292 895995 932662 912156 866665 829782
36084 829782 828465 879394 989098 1155448 1369388 1617933 1889286 2178183 2487938 2827280
36074 2827280 3203534 3615686 4050395 4482360 4878763 5206209 5437844 5558619 5567491 5476124
36064 5476124 5304264 5072924 4797800 4485615 4134995 3741547 3304908 2834185 2348333
36055 2348333 1870527 1419569 1003544 619490 258702 -85851 -414236 -718821 -987923
36046 -987923 -1211080 -1382851 -1503949 -1581036 -1626775 -1659931 -1703827 -1782358 -1914710 -2111288
36036 -2111288 -2372816 -2692766 -3060880 -3464600 -3887368 -4306658 -4696135 -5033034 -5306420
36027 -5306420 -5520289 -5689355 -5831085 -5959481 -6083070 -6205613 -6327033 -6444136 -6551853
36018 -6551853 -6644466 -6715024 -6752577 -6739988 -6655672 -6479996 -6203383 -5831866 -5386985 -4899942
36008 -4899942 -4403400 -3925857 -3490982 -3119439 -2828872 -2630641 -2525914 -2504193 -2545269 -2624047
35998 -2624047 -2717245 -2809913 -2898739 -2990516 -3097331 -3231363 -3400840 -3607259 -3843987 -4096323
35988 -4096323 -4342323 -4553805 -4698591 -4745461 -4670919 -4464511 -4130276 -3684969 -3154850 -2571597
35978 -2571597 -1967062 -1367896 -792411 -251392 247696 695332 1076388 1370973 1560237
35969 1560237 1634235 1596861 1464682 1261281 1011507 738070 459298 185966 -81932 -355257
35959 -355257 -650387 -980047 -1344662 -1729114 -2107606 -2455076 -2759286 -3026334 -3276201 -3531289
35949 -3531289 -3804817 -4094887 -4385916 -4655443 -4882466 -5053431 -5163424 -5212848 -5202327 -5129406
35939 -5129406 -4988944 -4776619 -4493244 -4147655 -3757014 -3344357 -2934264 -2548608 -2204434
35930 -2204434 -1913982 -1684503 -1516009 -1398706 -1314184 -1241973 -1168287 -1092090 -1025943 -991977
35920 -991977 -1014359 -1110164 -1281925 -1515679 -1785829 -2064161 -2327989 -2563647 -2765251 -2931976
35910 -2931976 -3067444 -3181795 -3293148 -3424250 -3593513 -3804490 -4040293 -4267087 -4444997
35901 -4444997 -4539815 -4528953 -4400560 -4150169 -3779525 -3298177 -2725210 -2088880 -1423620 -764709
35891 -764709 -141914 425123 927148 1361702 1728790 2027800 2254942 2400485 2447650 2375982
35881 2375982 2169053 1822623 1348704 774104 136113 -520602 -1144629 -1679299 -2069652
35872 -2069652 -2274730 -2278871 -2094707 -1756439 -1308572 -796843 -264065 250959 714799 1102253
35862 1102253 1399052 1601600 1713041 1738016 1679598 1539713 1321357 1029903 672365 255604
35852 255604 -214824 -734101 -1295531 -1886540 -2485246 -3060618 -3578143 -4009080 -4337899 -4563441
35842 -4563441 -4694339 -4743716 -4727568 -4666738 -4588609 -4524922 -4505347 -4549537 -4661122 -4825703 -5013250
35831 -5013250 -5184665 -5301498 -5335956 -5276993 -5130076 -4912396 -4647512 -4361657 -4081295 -3831253
35821 -3831253 -3633474 -3505786 -3459566 -3496983 -3610760 -3787501 -4011496 -4265434 -4529106 -4780416
35811 -4780416 -5000163 -5177055 -5309091 -5401447 -5463602 -5507136 -5543456 -5581053 -5623696 -5671212 -5722544
35800 -5722544 -5778710 -5843268 -5920246 -6011913 -6118562 -6239477 -6371999 -6507290 -6625773 -6697262
35790 -6697262 -6687826 -6570181 -6332042 -5979011 -5532393 -5024010 -4489565 -3961748 -3465077 -3014814
35780 -3014814 -2620151 -2288746 -2028709 -1846706 -1744183 -1714797 -1744417 -1812858 -1896024 -1968242
35770 -1968242 -2005439 -1989117 -1909654 -1767058 -1568710 -1325400 -1047631 -743615 -419616 -82433
35760 -82433 257719 586603 888732 1151476 1366852 1529910 1636591 1684611 1677259 1625798
35750 1625798 1546275 1451273 1342333 1209217 1037275 818073 556541 271305 -10298 -259288
35740 -259288 -452171 -577505 -640423 -662513 -675550 -711063 -790598 -921123 -1096800 -1304891
35730 -1304891 -1532043 -1767792 -2003974 -2231257 -2436074 -2601081 -2709744 -2752584 -2731633 -2660713
35720 -2660713 -2560875 -2452380 -2346868 -2244651 -2139773 -2030101 -1925424 -1847527 -1821679 -1864698
35710 -1864698 -1976572 -2139748 -2325304 -2501802 -2642868 -2732144 -2766000 -2754181 -2717872 -2685462
35700 -2685462 -2687334 -2751067 -2897512 -3137912 -3472506 -3890756 -4372514 -4889454 -5407134 -5888676
35690 -5888676 -6300192 -6616591 -6825790 -6929994 -6943737 -6889406 -6792005 -6675310 -6560412 -6465216
35680 -6465216 -6402325 -6374869 -6373467 -6378350 -6366856 -6321922 -6236633 -6113450 -5960184 -5785308 -5594312
35669 -5594312 -5388330 -5165562 -4924454 -4666523 -4397537 -4127372 -3869038 -3636470 -3440747
35660 -3440747 -3285833 -3166094 -3067347 -2971514 -2862974 -2733410 -2582710 -2416708 -2245580 -2086013
35650 -2086013 -1965556 -1923418 -2002834 -2236145 -2629811 -3157664 -3765762 -4385276 -4946594 -5390142
35640 -5390142 -5673562 -5776297 -5700870 -5469275 -5115057 -4674690 -4182133 -3667640 -3158923 -2681988
35630 -2681988 -2260201 -1911899 -1647973 -1470800 -1374951 -1348945 -1377184 -1442101 -1527326 -1621828
35620 -1621828 -1723147 -1837239 -1974547 -2144790 -2353655 -2602448 -2889450 -3211273 -3563442
35611 -3563442 -3939916 -4331494 -4723699 -5095514 -5419938 -5666273 -5803664 -5805856 -5657005 -5357270
35601 -5357270 -4925816 -4399220 -3825082 -3252763 -2724668 -2270984 -1908445 -1641313 -1462823
35592 -1462823 -1357185 -1303298 -1279870 -1269689 -1260981 -1246108 -1219856 -1179345 -1125627 -1065186 -1009536
35581 -1009536 -972720 -967917 -1004308 -1084615 -1203787 -1350049 -1508746 -1666999 -1815926 -1949051
35571 -1949051 -2058989 -2135818 -2169043 -2152237 -2087782 -1988860 -1876930 -1775052 -1699390 -1651940 -1616724
35560 -1616724 -1560625 -1439435 -1208415 -834599 -306363 363421 1141088 1979592 2825482 3623016
35550 3623016 4316047 4849915 5175236 5253918 5066311 4617476 3940070 3091666 2146000 1180403
35540 1180403 263710 -551348 -1230061 -1753954 -2118725 -2333500 -2420038 -2409239 -2334116 -2221730
35530 -2221730 -2088028 -1937924 -1769593 -1579857 -1368052 -1137908 -898368 -663775 -452554
35521 -452554 -283501 -170646 -119494 -127071 -185770 -288426 -431394 -613900 -834511 -1087523
35511 -1087523 -1361767 -1641941 -1910340 -2147464 -2333055 -2450345 -2493256 -2471514 -2407788 -2326185
35501 -2326185 -2238228 -2134585 -1987053 -1759106 -1419611 -954058 -369850 305244 1030124 1760204
35491 1760204 2456968 3094555 3661869 4160460 4599918 4992792 5350449 5680598 5986788
35482 5986788 6269392 6526418 6752792 6938984 7071634 7137390 7127785 7041679 6884229 6664436
35472 6664436 6393638 6085257 5754737 5418863 5094272 4795240 4531005 4303644 4107631
35463 4107631 3931494 3760972 3582687 3387258 3170756 2933988 2680369 2414245 2140894
35454 2140894 1867404 1602559 1354803 1129477 927545 746843 584767 440190 313102
35445 313102 202338 103112 5980 -102283 -236554 -410785 -635276 -913823 -1241257 -1602479
35435 -1602479 -1973942 -2327634 -2636385 -2878442 -3039148 -3108956 -3079559 -2941947 -2689214 -2323082
35425 -2323082 -1859480 -1328516 -767923 -213326 309558 787302 1215476 1592588 1915228
35416 1915228 2177084 2371440 2494484 2546830 2532815 2458955 2333146 2164984 1966506 1752315
35406 1752315 1538052 1337025 1156271 994684 845202 700192 556495 416727 286534
35397 286534 170809 72377 -6116 -59907 -82954 -72403 -32924 23622 84025 141237 198658
35386 198658 268706 366335 499960 663632 835237 983595 1081922 1119848 1106565 1064115 1017074
35375 1017074 986367 989639 1043595 1162154 1349604 1594639 1871854 2151044 2408038 2630273
35365 2630273 2815266 2965112 3081324 3162717 3206638 3211897 3180969 3119915 3036248 2935689 2818396
35354 2818396 2675619 2489080 2235568 1896158 1465508 956052 395311 -181328 -738815
35345 -738815 -1249147 -1695342 -2071738 -2380801 -2628732 -2823258 -2974975 -3099788 -3218440 -3351593
35335 -3351593 -3512706 -3702231 -3904968 -4090613 -4217577 -4240656 -4121995 -3842300 -3407655 -2848690
35325 -2848690 -2212456 -1550803 -910095 -325209 182049 601867 934445 1187951 1375937
35316 1375937 1513165 1609517 1664025 1662951 1584687 1409998 1132130 761301 321947 -154547
35306 -154547 -637126 -1099401 -1521104 -1888417 -2194323 -2438282 -2624026 -2756042 -2836854 -2866656
35296 -2866656 -2844664 -2770514 -2644832 -2469190 -2245659 -1975618 -1657788 -1286472 -851826 -343629
35286 -343629 241818 894554 1587749 2281094 2929442 3492293 3939866 4254437 4428374 4461182
35276 4461182 4357289 4125428 3779617 3340763 2837050 2301526 1766762 1258655 792541
35267 792541 373707 1527 -326004 -610485 -854647 -1065014 -1252879 -1432549 -1617867 -1818671
35257 -1818671 -2038231 -2272156 -2509119 -2733313 -2927621 -3076163 -3166030 -3189342 -3146267 -3047434
35247 -3047434 -2913043 -2768009 -2635803 -2534640 -2477410 -2473593 -2530378 -2651352 -2833027 -3061068
35237 -3061068 -3308927 -3540915 -3719280 -3812220 -3799318 -3672955 -3436931 -3104525 -2697385 -2245081
35227 -2245081 -1783765 -1352082 -983942 -700551 -505924 -389044 -331826 -318240 -339004 -389425
35217 -389425 -463096 -547358 -624782 -679541 -703477 -697603 -669352 -629053 -588476 -561498 -565171 -619272
35205 -619272 -743336 -951561 -1247577 -1621503 -2050178 -2499506 -2927507 -3288347 -3538777 -3647084
35195 -3647084 -3601494 -3413066 -3110360 -2728618 -2300309 -1852410 -1409335 -995396 -631873 -329758
35185 -329758 -83787 127195 332675 558905 818734 1107680 1407688 1695089 1946660 2140568
35175 2140568 2254981 2269992 2174653 1974261 1690822 1354868 994312 628442 270311 -66068
35165 -66068 -360126 -584636 -711190 -718927 -603492 -382547 -94444 210762 484689 692485
35155 692485 818708 866654 853836 806807 756760 735582 771274 882361 1072317 1326590 1614625
35144 1614625 1897349 2137801 2311617 2414593 2465403 2501614 2568430 2703016 2920750 3209652
35134 3209652 3535163 3852243 4118946 4305938 4399221 4397092 4305093 4132563 3891649 3597147
35124 3597147 3265234 2910844 2545130 2174832 1804259 1438606 1086226 758592 469196
35115 469196 233453 69659 -1469 39129 201789 481070 852133 1272619 1690325 2054713
35105 2054713 2328282 2493632 2554005 2528121 2442016 2320855 2182586 2034344 1872224 1685467
35095 1685467 1465097 1214046 953005 717136 544149 459990 469857 558492 697746 855756
35085 855756 1002879 1113694 1168051 1154117 1072920 940762 786182 641536 532575 470532
35075 470532 449973 453262 459821 456409 443892 437133 457688 522948 637754 793082 971828 1157445
35063 1157445 1340092 1517192 1688505 1848826 1983211 2069125 2086158 2028549 1912739 1774493
35053 1774493 1656576 1593767 1603027 1682456 1816959 1985570 2166692 2340779 2492088 2610928
35043 2610928 2696252 2756914 2809225 2869725 2945375 3026681 3089132 3103672 3050908 2931244 2765893
35032 2765893 2589361 2438401 2343082 2322655 2385054 2527144 2734439 2981719 3236679 3466693
35022 3466693 3646370 3762947 3817621 3822034 3790373 3729819 3634323 3486017 3264092 2956036
35012 2956036 2564999 2110295 1622172 1133671 672386 254759 -114623 -438335 -719186
$$ [...]
##END NTUPLES=NMR SPECTRUM
##END=
