##TITLE=1H_2xp
 CDCl3
 8 sc, 
 3.11.2023
##JCAMPDX= 6.0         $$ Bruker NMR JCAMP-DX V2.0
##DATA TYPE= NMR FID
##DATA CLASS= NTUPLES
##ORIGIN= UXNMR, Bruker Analytische Messtechnik GmbH
##OWNER= root
$$ XWIN-NMR		Version 3.5
$$ Fri Nov  3 15:31:54 2023 Russian Standard Time (UT+4h)  she@DPX200
##.OBSERVE FREQUENCY= 200.1313
##.OBSERVE NUCLEUS= ^1H
##.DELAY= (6, 6)
##.ACQUISITION MODE= SIMULTANEOUS
##.ACQUISITION SCHEME= undefined
##.AVERAGES= 8
##.DIGITISER RES= 18
##SPECTROMETER/DATA SYSTEM= spect
##.PULSE SEQUENCE= zg30
##.SOLVENT NAME= D2O
##.SHIFT REFERENCE= (INTERNAL, D2O, 0, 15.7039)
##AUDIT TRAIL= $$ (NUMBER, WHEN, WHO, WHERE, WHAT)
$$ ##TITLE= Audit trail, XWIN-NMR		Version 3.5
$$ ##JCAMPDX= 5.01
$$ ##ORIGIN= Bruker BioSpin GmbH
$$ ##OWNER= she
$$ F:/spectra/data/she/nmr/H-F/1/audita.txt
$$ ##AUDIT TRAIL=  $$ (NUMBER, WHEN, WHO, WHERE, WHAT)
(   1,<2023-11-03 15:31:13.54 +0400>,<she>,<DPX200>,
      <created by zg, POWCHK disabled, PULCHK disabled
       configuration hash MD5:
       00 E9 B6 7A A2 85 ED C7 34 08 36 98 17 FE 4E 26
       data hash MD5: 16K
       3D E6 52 7C E8 C9 4E F8 88 6D BD 04 AA 3F 16 F4>)
$$ ##END=
$$ 
$$ hash MD5
$$ F2 1C 4D CE 99 C2 58 CA 7D AD 17 CF C7 B9 F2 60
##$RELAX= 
##$RELAX= 
##$RELAX= 
##$RELAX= 
##$RELAX= 
##$RELAX= 
$$ Bruker specific parameters
$$ --------------------------
##$DU= <F:/spectra>
##$EXPNO= 1
##$NAME= <H-F>
##$PROCNO= 1
##$TYPE= <nmr>
##$USER= <she>
##$AMP= (0..31)
100 100 100 100 100 100 100 100 100 100 100 100 100 100 100 100 100 100 
100 100 100 100 100 100 100 100 100 100 100 100 100 100 
##$AQSEQ= 0
##$AQ_mod= 1
##$AUNM= <au_zg>
##$AUTOPOS= <>
##$BF1= 200.13
##$BF2= 200.13
##$BF3= 200.13
##$BF4= 200.13
##$BF5= 200.13
##$BF6= 200.13
##$BF7= 200.13
##$BF8= 200.13
##$BYTORDA= 1
##$CFDGTYP= 0
##$CFRGTYP= 5
##$CHEMSTR= <none>
##$CNST= (0..31)
1 1 145 1 1 1 1 1 1 1 1 1 1 1 1 1 1 1 1 1 1 1 1 1 1 1 1 1 1 1 1 1 
##$CPDPRG= <>
##$CPDPRG1= <>
##$CPDPRG2= <>
##$CPDPRG3= <>
##$CPDPRG4= <mlev>
##$CPDPRG5= <mlev>
##$CPDPRG6= <mlev>
##$CPDPRG7= <mlev>
##$CPDPRG8= <mlev>
##$CPDPRGB= <>
##$CPDPRGT= <>
##$D= (0..31)
0 1.2 0 0 0 0 0 0 0 0.06 0 0.03 0 0 0 0 0.0002 0 0 0 0 0 0 0 0 0 0 0 0 
0 0 0 
##$DATE= 1699011073
##$DBL= (0..7)
120 120 120 120 120 120 120 120 
##$DBP= (0..7)
150 150 150 150 150 150 150 150 
##$DBP07= 0
##$DBPNAM0= <>
##$DBPNAM1= <>
##$DBPNAM2= <>
##$DBPNAM3= <>
##$DBPNAM4= <>
##$DBPNAM5= <>
##$DBPNAM6= <>
##$DBPNAM7= <>
##$DBPOAL= (0..7)
0.5 0.5 0.5 0.5 0.5 0.5 0.5 0.5 
##$DBPOFFS= (0..7)
0 0 0 0 0 0 0 0 
##$DE= 6
##$DECBNUC= <off>
##$DECIM= 32
##$DECNUC= <off>
##$DECSTAT= 4
##$DIGMOD= 1
##$DIGTYP= 9
##$DL= (0..7)
0 120 120 120 120 120 120 120 
##$DP= (0..7)
150 150 150 150 150 150 150 150 
##$DP07= 0
##$DPNAME0= <>
##$DPNAME1= <>
##$DPNAME2= <>
##$DPNAME3= <>
##$DPNAME4= <>
##$DPNAME5= <>
##$DPNAME6= <>
##$DPNAME7= <>
##$DPOAL= (0..7)
0.5 0.5 0.5 0.5 0.5 0.5 0.5 0.5 
##$DPOFFS= (0..7)
0 0 0 0 0 0 0 0 
##$DQDMODE= 0
##$DR= 18
##$DS= 0
##$DSLIST= <SSSSSSSSSSSSSSS>
##$DSPFIRM= 0
$$ [...]
##$SUBNAM2= <"">
##$SUBNAM3= <"">
##$SUBNAM4= <"">
##$SUBNAM5= <"">
##$SUBNAM6= <"">
##$SUBNAM7= <"">
##$SUBNAM8= <"">
##$SUBNAM9= <"">
##$SW= 18.0517328524113
##$SWIBOX= (0..15)
0 0 2 0 0 0 0 0 0 0 0 0 0 0 0 0 
##$SW_h= 3612.71676300578
##$TD= 16384
##$TD0= 1
##$TE= 0
##$TE2= 300
##$TE3= 300
##$TEG= 300
##$TL= (0..7)
0 120 120 120 120 120 120 120 
##$TP= (0..7)
150 150 150 150 150 150 150 150 
##$TP07= 0
##$TPNAME0= <>
##$TPNAME1= <>
##$TPNAME2= <>
##$TPNAME3= <>
##$TPNAME4= <>
##$TPNAME5= <>
##$TPNAME6= <>
##$TPNAME7= <>
##$TPOAL= (0..7)
0.5 0.5 0.5 0.5 0.5 0.5 0.5 0.5 
##$TPOFFS= (0..7)
0 0 0 0 0 0 0 0 
##$TUNHIN= 0
##$TUNHOUT= 0
##$TUNXOUT= 0
##$USERA1= <user>
##$USERA2= <user>
##$USERA3= <user>
##$USERA4= <user>
##$USERA5= <user>
##$V9= 5
##$VALIST= <valist>
##$VCLIST= <CCCCCCCCCCCCCCC>
##$VD= 0
##$VDLIST= <DDDDDDDDDDDDDDD>
##$VPLIST= <PPPPPPPPPPPPPPP>
##$VTLIST= <TTTTTTTTTTTTTTT>
##$WBST= 1024
##$WBSW= 4
##$XGAIN= (0..3)
0 0 0 0 
##$XL= 0
##$YL= 0
##$YMAX_a= 241390
##$YMIN_a= -203600
##$ZGOPTNS= <>
##$ZL1= 120
##$ZL2= 120
##$ZL3= 120
##$ZL4= 120
##$ABSF1= 10
##$ABSF2= 0
##$ABSG= 5
##$ABSL= 3
##$ALPHA= 0
##$AQORDER= 0
##$ASSFAC= 0
##$ASSFACI= 0
##$ASSFACX= 0
##$ASSWID= 0
##$AUNMP= <proc_1d>
##$AZFE= 0.1
##$AZFW= 0.1
##$BCFW= 1
##$BC_mod= 2
##$BYTORDP= 1
##$COROFFS= 0
##$CY= 11.3945322036743
##$DATMOD= 1
##$DC= 2
##$DFILT= <>
##$DTYPP= 0
##$F1P= 15.7292609196834
##$F2P= 12.9074282941183
##$FCOR= 0.5
##$FTSIZE= 0
##$FT_mod= 4
##$GAMMA= 1
##$GB= 0.15
##$INTBC= 1
##$INTSCL= 1
##$ISEN= 128
##$LB= 0.24
##$LEV0= 0
##$LPBIN= 0
##$MAXI= 10000
##$MC2= 0
##$MEAN= 0
##$ME_mod= 0
##$MI= 1.114404
##$NCOEF= 0
##$NC_proc= 0
##$NLEV= 6
##$NOISF1= 3.799351
##$NOISF2= 2.8
##$NSP= 1
##$NTH_PI= 0
##$NZP= 0
##$OFFSET= 15.70392
##$PC= 1
##$PHC0= -23872.11
##$PHC1= 10.45269
##$PH_mod= 1
##$PKNL= yes
##$PPARMOD= 0
##$PSCAL= 0
##$PSIGN= 0
##$REVERSE= no
##$SF= 200.130013532006
##$SI= 16384
##$SIGF1= 3
##$SIGF2= 2
##$SINO= 400
##$SIOLD= 16384
##$SREGLST= <1H.CDCl3>
##$SSB= 0
##$STSI= 0
##$STSR= 0
##$SW_p= 3612.71676300578
##$SYMM= 0
##$S_DEV= 0
##$TDeff= 0
##$TDoff= 0
##$TI= <>
##$TILT= no
##$TM1= 0
##$TM2= 0
##$TOPLEV= 0
##$USERP1= <user>
##$USERP2= <user>
##$USERP3= <user>
##$USERP4= <user>
##$USERP5= <user>
##$WDW= 1
##$XDIM= 8192
##$YMAX_p= 0
##$YMIN_p= 0
$$ End of Bruker specific parameters
$$ ---------------------------------
##NTUPLES= NMR FID
##VAR_NAME=  TIME,          FID/REAL,        FID/IMAG
##SYMBOL=    X,             R,               I
##VAR_TYPE=  INDEPENDENT,   DEPENDENT,       DEPENDENT
##VAR_FORM=  AFFN,          ASDF,            ASDF
##VAR_DIM=   8192,          8192,            8192
##UNITS=     SECONDS,       ARBITRARY UNITS, ARBITRARY UNITS
##FACTOR=    0.0002768,     1,               1
##FIRST=     0,             0,               0
##LAST=      2.2672688,     0,               0
##MIN=       0,             -203600,         0
##MAX=       2.2672688,     241390,          0
$$ Real data points
##PAGE= N=1
##DATA TABLE= (X++(R..R)), XYDATA
$$ [...]
1831a830K090Q65j628J09J899j016j372J616N89j812J12J369j055j134J133J27
1847F2j265M54P95k28p13J076K4n27j77J409o41n83Q52M70j168J43O57l77o35
1866c72M08L98j093K24P18j95q60P88K87m12j40O01l07m1O55j64j84k75M7J8k96
1887a95L31k83m9M5o1O6K77m67Q2N02k70m42N56Om97J94O96j13p71N69L76q14
1909b62R8N79m65o67Q12K94j021M28O15o52n04Q38p7l69K32Q90l59q77R09K58
1929G00j242J33J392p62r07J034K16j178j62J404q44q44J237L23j284K93J261
1946G70q73m18R17Q40j619K51J100j082r94J551J81j474K19J546j124q64J507
1963D34J45j593O65J229q36p77J465P6j482N58J107j049n85J411j59j452M05J303
$$ plain form
1831 -1830 260 1125 -503 -394 1505 489 -883 733 1322 -490 -378 991 -64 -1198 -65 62
1847 62 -1203 -749 46 -182 -895 181 205 -322 -499 910 269 -314 538 1008 -160 -17 640 263 -372
1866 -372 36 434 -659 -435 283 88 -772 16 303 -109 -249 352 45 4 659 495 311 36 83 101 -195
1887 -195 136 -147 -196 -151 -212 -146 131 -336 -254 248 -22 -464 92 98 -399 -205 491 378 -393 176 552 -262
1909 -262 -164 415 -50 -717 95 389 -632 -204 411 -241 -745 93 16 -353 -121 769 410 -467 442 700
1929 700 -542 -409 983 221 -686 348 564 -614 -776 628 -216 -1060 177 500 -784 -491 770
1946 770 -103 -521 396 1236 -383 -132 968 -114 -1108 443 624 -850 -631 915 -209 -1073 434
1963 434 579 -1014 -349 880 44 -733 732 808 -674 -116 991 -58 -643 768 609 -843 -438 865
1981H65j288l55J441j54j125M80R26r43l53J166k02j185O83Q38q94n40J141j76
1999C25j016M52Q96j020m54J432m47q95Q88O87r05p79J271R9j191O15L70p66j13
2018e51P23J55j038N63P91p80N1K22J28m54J30M41k75o06O88Mn19N93l59j99P7
2039b15O21j49n19M16J14m1k55M38l16m71M27J98m04J02R5k17j71K60K57j52j33
2060a15L06r8k6Q0o2j02Q1J13J89l56J93l54O8K52j85J87m17J76K87k62o6l1R0
2083e2j4K34K19k56k17L37K59m98rJ77j68k4M6q9m34N02j71j6J93j43K2p8J74
2106fJ63m52J73L82M0n2o2k60J94l15L44k33j57K81k83l1J79k51L99Mo7o3r5K67
2130I9n8L9L12k34K60k58k2p3k45k0o6O2P3Q5j23k60K76J28k0J80J21L5k34l80
$$ plain form
1981 865 -423 -778 663 509 -616 -136 790 -153 -506 660 458 -727 -44 794 -100 -640 501 325
1999 325 -691 -239 657 -363 -817 615 168 -727 161 848 -57 -836 435 534 -657 -42 328 -438 -551
2018 -551 172 327 -711 -148 643 -137 -86 136 264 -190 -60 381 106 -500 188 192 -327 266 -93 -292 -215
2039 -215 406 257 -262 154 268 227 -28 410 94 -377 50 248 -156 -54 41 -176 -347 -87 170 18 -115
2060 -115 191 93 67 147 85 -17 64 177 366 10 203 -151 -83 169 -16 171 -246 -70 217 -45 -111 -142 -52
2083 -52 -66 168 387 131 -86 251 510 12 3 180 12 -12 34 -55 -489 13 -158 -174 19 -124 -102 -180 -6
2106 -6 157 -295 -122 260 300 248 186 -74 120 -195 149 -84 -241 40 -243 -274 -95 -346 53 57 -10 -73 -168 99
2130 99 41 80 392 158 418 160 138 65 -180 -200 -266 -204 -131 -46 -169 -429 -153 -25 -45 135 256 291 57 -323
2154c23L34L05j99K77p2j21l53K96l62k88K86L5j32o5K83J63m18N06L79n03J12
2175A40L65k92m75N83K9n50O2K72j90l85J57M1q4o8K54n6j01L35O00o55O6L58
2197D06P5p15M39O99q25J2O9k09o74L04L76l55j63P75n65m5K44L21l36J5Q76m27
2219B97n14O21qp49p0Q47r6p39L59M09p15p8P53m07p00J169K1o35j53R72j75p22
2241c13L95O53r83N6P54m04m21J45M81r21OR41k49q22N89K64n27J23P35k35n75
2262c08N54K68o93J65P68o41m83N74nm12j02P23l69m14L8M53n07L08N00l05l95
2283b83M35J59p1k50L83L1o72M95K38q00L58P7j96l05M84k5n00K38R2J97l45K09
2305e1J56j95L67L94n30r5K50n02L2J92J04j47k73j04K51J2k63J71J37J09J19
$$ plain form
2154 -323 11 316 117 394 322 201 -152 144 -218 -506 -220 -185 -317 -382 -99 64 -354 152 531 28 140
2175 140 505 213 -262 321 350 -200 -138 134 -56 -441 -284 -243 -327 -395 -141 -197 -298 37 637 -18 48 406
2197 406 481 -234 205 904 79 91 160 -49 -723 -419 -43 -398 -561 214 -351 -396 -152 169 -167 -152 724 297
2219 297 -217 404 396 -353 -423 424 328 -411 -52 357 -358 -436 317 -90 -790 379 400 -235 -388 584 409 -313
2241 -313 82 735 -248 -192 562 158 -263 -118 363 -558 -552 389 140 -682 -93 171 -356 -233 502 267 -308
2262 -308 246 514 -179 -14 754 113 -370 204 199 -213 -315 408 39 -375 -337 116 -391 -83 417 112 -283
2283 -283 152 311 240 -10 373 404 -268 227 465 -335 23 100 -96 -401 83 58 -442 -204 -112 85 -260 -51
2305 -51 105 -90 277 671 141 46 296 -206 -174 18 122 -25 -298 -402 -151 -139 -402 -231 -94 15 134
2326A34k70L32p4r6K13m1j75P3N6lj41K52l61j00J19j21Q8k85K96P5O2k90M48
2349A91n5j95L58K00p60L54M25o94k9K23P4m73J89L71k12l50M24K5m12nM36j93
2371a08k69O57O5m84K56O05n24l86N95Q1r44J65M56k73p11P63N22j014K94N89
2391C35k58l49N30K30p70L28O03m65n62R11k6j196N64N49q51j11O71m7o73K01
2411c86P41o52j63O87Qo48M71N95m23n17P76j30q01N59M15p03q5N82j85p03K19
2432c43Q67p56n16J046L1n64K31O65o33j88O94l29n48J12N67m48l07Q19m41p32
2452g73N90O07q53j87O00K73k99lN44m58k00O62j04q07Q46J66o14l74Q00l07p59
2473f50O71J32l70K0K30J33n76L44K16l08j44P58j99k80K11O5k20m03M29m9k40
$$ plain form
2326 134 -136 196 122 26 239 198 23 96 152 149 8 260 -101 -201 -82 -203 -115 -400 -104 -29 33 -257 191
2349 191 136 -59 299 499 -261 93 518 -176 -205 18 92 -381 -192 179 -33 -383 41 66 -346 -351 85 -108
2371 -108 -377 280 345 -139 117 722 198 -188 407 488 -456 -291 165 -108 -819 -56 466 -548 -254 335
2391 335 77 -272 258 488 -282 46 649 184 -378 533 507 -689 -125 424 -427 -538 133 86 -587 -386
2411 -386 355 -297 -460 227 235 -413 58 653 230 -287 489 359 -442 117 532 -171 -256 326 141 -562 -343
2432 -343 524 -232 -748 298 329 -235 -4 661 28 -160 534 205 -343 -231 336 -112 -419 400 -41 -773
2452 -773 -183 424 -429 -616 -16 257 -42 -45 499 41 -159 503 399 -408 438 604 -10 -384 416 109 -650
2473 -650 21 153 -217 -197 33 166 -410 -66 150 -158 -302 456 257 -23 188 253 33 -370 59 10 -230
2494b30NK32j17l31L00L42k52J08J21j09R2J90Ml28J2J77k42q5J97p5k55J12K56
2517A24k34j38P5J81j48L92j86q6n1J7J32K80k19R2L2l37L76m99k3L81N8m77J11
2540a47m0K20j87J85r1n1M3K36j64J45j66q4K27k11J06l09K12k83O4K20m8l38
2562d61M12K9j23K51m3l69N45j43J24k14M0R6J7j75R3P5k93k15L76j90j71L05
2584c4N42m96M9L16k23r0p2M8m6K76l9j05p5J24r2j34j27M32m68p3J70K59k07
2607f5j53J60Q7l82L25Q8k33J47M86n34R3L34l81k70J16L83j5n60J86M69l81K13
2629A13J27m51J35P6M2l1j84M29l63j7J69K34l05L29j89j57m7L64j40j96J84P1
2651A93l18K53k02J20k29pK78l26K65j28l6J93j34J24k21M2K25j49l9J03J31N9
$$ plain form
2494 -230 -225 7 -110 -441 -141 201 -51 57 178 69 161 351 355 27 39 216 -26 -111 86 11 -244 -132 124
2517 124 -110 -248 -173 8 -140 252 66 -20 -71 -54 78 358 139 231 263 -74 302 -197 -220 161 219 -258 -147
2540 -147 -187 33 -154 31 -60 -111 -68 168 4 149 -17 -101 126 -85 21 -288 -76 -359 -295 -75 -123 -461
2562 -461 -49 -20 -143 108 65 -304 241 98 222 8 48 144 161 -14 79 154 -139 -354 22 -168 -339 -34
2584 -34 508 12 61 377 154 64 -8 40 -6 270 231 126 51 175 83 -51 -178 254 -214 -287 -117 142 -65
2607 -65 -218 -58 29 -353 -28 60 -173 -26 460 -74 19 353 -28 -298 -182 201 186 -374 -188 281 -100 113
2629 113 240 -211 -76 0 42 11 -173 256 -107 -124 45 279 -26 303 114 -43 -90 274 134 -62 122 193
2651 193 -125 128 -74 46 -183 -190 88 -238 27 -101 -137 56 -78 46 -175 -133 92 -57 -96 7 138 197
2673A97l09K47k07q0Q4l0M2k59o5L78l6Q1RPn4M2J67k28K43J9j03K9j83R5k28
2698a42o4K25k31K63l63L69o6J41k12n4K30J14k18J43M2J23l17K45j17j85P6K37
2720B39n24P7j27K74j10J92k41K05k35L89k40K02J98j26N0J70k79J45j09j18J06
2741A38M1j51O5l80j54L84O5J9j39o8K63o4k7j01L48o2l0J47l28J19j15j73J29
2764g4j48N9J73p7j03j28K20m3M62j4j92J07n3j30J43J6L2l58K71j67l04J19n4
2787b43K87j93J32j50J27J08P8M1k10K00P5k89J16j09R8r2K67k25j41J8J73k32
2809a64RJ69j07jm3M19k14k7J04J13k81R6K14J17k30O2j13r0k27J32L9j95J52
2832f6r9ll0K68k39j84N81m0l82L52k4k9k37K26K85n94J04K10n2l41L21j48j38
$$ plain form
2673 197 -112 135 -72 -152 -68 -98 -56 -315 -380 -2 -38 43 52 59 5 47 214 -14 229 248 145 174 -9 86 -142
2698 -142 -206 19 -212 51 -312 57 -9 132 -80 -134 96 210 -8 135 177 300 -17 228 111 -74 2 239
2720 239 -285 -208 -335 -61 -171 21 -220 -15 -250 139 -101 101 299 173 223 393 114 259 150 32 138
2741 138 179 28 93 -287 -441 -57 8 27 -112 -180 83 19 -8 -109 239 177 147 294 -34 85 -30 -203 -74
2764 -74 -222 -163 10 -67 -170 -298 -78 -121 341 327 135 242 189 59 202 218 250 -108 163 -4 -308 -189 -243
2787 -243 44 -149 -17 -167 -40 68 146 187 -23 177 252 -37 79 -30 68 -24 243 18 -123 -105 68 -164
2809 -164 -155 14 -93 -94 -137 282 68 41 145 258 -23 73 287 404 174 236 123 33 -194 -62 -23 -218 -66
2832 -66 -165 -168 -198 70 -169 -353 228 188 -194 158 134 105 -132 94 379 -215 -111 99 47 -294 27 -121 -259
2855b59l50M96j13j30L36L20m89J65J44J34l89J23M80m15j63K61r3k01L33j96
2875fl89J70M68k69k30K05m1JK21r5q1j8M72m15N6O5Q6k2k35L4j19l15L17M4L6
2900f0k52M34o8k63Q3J39Oj71M34j39j36j46N15o40K50K35j28l60K69j57nj24
2922b84M57j23l26L33M6j26j93L47J60j46l36M60k38N1J05l53P8j11J37J56l00
2943b06K44j54j57K72L6j19J5K41j20K94j51%o9j60R7j7m9Pj44J53j53L21k68
2966h7Qq7J56j65N0J29J81j01k35L41j35Q5k77K00J59j35q7J3j55oJ1J21k35N7
2990a94K14j84R6J55k0j17J05O4J99o37L23J01k80J71j33J82l3K9q8P8m0n5J57
3013I3l07K69l4l98N01J17j53%L2j09R6k71K89l71L66j59m0j6K21j59j27r3J64
$$ plain form
2855 -259 -609 -113 -226 -356 -20 300 -189 -24 120 254 -135 -12 468 53 -110 151 58 -143 190 -6
2875 -6 -395 -225 243 -26 -256 -51 -92 -91 130 35 -46 -64 408 -7 49 114 200 178 -57 -23 -142 -457 -140 -96 -60
2900 -60 -312 122 54 -209 -126 13 19 -152 282 143 7 -139 376 -264 -14 221 93 -267 2 -155 -160 -284
2922 -284 173 50 -276 57 103 -23 -216 131 291 145 -191 269 31 82 187 -166 -88 -199 -62 94 -206
2943 -206 38 -116 -273 -1 35 -84 -69 172 52 346 195 195 126 -34 63 46 -3 4 -140 13 -140 181 -87
2966 -87 -79 -166 -10 -175 -125 4 185 84 -151 190 55 140 -137 63 222 87 0 13 -142 -148 -137 -16 -251 -194
2990 -194 20 -164 -68 87 67 -50 55 119 318 -319 4 105 -175 -4 -137 45 12 41 -47 31 -9 -64 93
3013 93 -214 55 21 -377 124 241 88 88 120 11 107 -164 125 -246 120 -39 -79 -95 126 -33 -160 -253 -89
3036h9M1m4J5Q7O3j99J50l1q4M0J65J8l89J84J47k87J96LJ1l0K18k06k63J1L65
3061I2J27k46K29j85j1j14K25l33K50J69N4n51K39K87M4l75M25k19l80J90J65
3082H2j34n9Q0j07j70K36K46Q8m5j51J45l82J24oq3J08P6J79m03J72j90K56j73
3105a11J84j59Q0R8Q3R1k68l0K54k87K22J07k85o1L03k60p2L7J60j90lK41j43
3128il8MK15l88L35k25J12J91P0l42j83N33k11r5o2L75l09j68p1K98l2j88J72
3151a6K8J30j04q3J96j64J8J03r0p3M17n54L46P5j58m5k11J81N7j38L2O3Qj6M05
3176D07k22l42L34j36R1j06k02M37m85P9M80m55p7R8N9J47k16J93k58j2K76k18
3198a28L73N9k94N8LK86k88Pr4j02K10j0Kk28M63m02M9l2L5J25m4j37M2j61M60
$$ plain form
3036 -89 -48 -92 -77 10 73 -126 24 -7 -91 -51 114 132 -257 -73 74 -213 -17 -14 -3 -33 185 -21 -284 -273 92
3061 92 219 -27 202 17 6 -108 117 -216 34 203 257 -294 -55 232 276 -99 326 107 -273 -83 82
3082 82 -52 -111 -31 -138 -308 -72 174 262 217 66 211 -171 -47 -53 -136 -28 48 227 -176 -4 -194 62 -111
3105 -111 73 -86 -6 92 175 266 -2 -32 222 -65 157 264 -21 -82 221 -39 -111 -74 86 -104 -107 134 -9
3128 -9 -47 -43 172 -216 119 -106 6 197 267 -75 -258 275 64 -31 -93 282 -27 -195 -266 32 0 -188 -16
3151 -16 12 142 38 -45 151 -13 5 108 18 -55 362 -192 154 229 71 26 -185 -4 53 -85 -53 10 18 2 407
3176 407 185 -157 177 41 132 26 -176 261 -224 -145 335 -120 -197 -99 -40 107 -109 84 -174 -186 90 -128
3198 -128 245 304 10 68 71 357 69 76 -18 -120 90 80 82 -146 317 -85 -36 -68 -33 92 48 -89 -47 -208 252
3223B52Rk33q4J2q4mJ76K9N4k60l2O2Kk1j66O7J95o8j58K04J77j95LJ30O0k56
3249a29O6L8K0m0K12p2k77J46J37N8k40K92l96L05k56J57j8j3J64k70L64k36L6
3272D8m1j78K13q1j7J33Q8k81J3j9K14j59j47L58Q9m50P7R0K91l67J99m1nM5j09
3297c7R3k71J25Q0M7k76J88om0O2o6k2J88j7K10j54q9JN2q4P2qk2L0k58o0q4L27
3325a9KJ38m59O00n9m92M04j74KK87k04N3J06k79J62j20K05l88M58j63l66K02
3347a04M96k81k37K71l60Q9O5J84l55N47m33L17j42j10R2j5k80J84o7J97l32K73
3369aj23K9Q2P3k32J97j08r5J07J83o0K18q6j98K47j3l55l4Q3K01l49K61k65K01
3393c7j41Q3r6L1K06Nl42J57L37r4j14P5r9p1J51l2l2J8N6j98rL09j05k74M72
$$ plain form
3223 252 261 28 -56 -44 -128 -132 44 73 127 -133 -165 -103 -101 -122 -288 -221 -26 -94 -252 -48 129 -66 -63 67 127 -129
3249 -129 -63 -25 -5 -45 167 95 -182 -36 101 159 -81 211 -185 120 -136 21 3 -10 154 -116 248 12 48
3272 48 7 -171 42 -39 -56 77 165 -116 -103 -122 92 -67 -214 144 233 -217 -140 -50 241 -126 73 32 27 72 -37
3297 -37 56 -215 -90 -10 37 -239 -51 -57 -97 -35 -101 -123 65 48 258 104 15 16 68 -16 56 48 26 56 -202 -262 -346 -19
3325 -19 -17 121 -338 262 203 -289 115 -59 -57 230 26 79 185 -94 68 -52 153 -235 223 60 -306 -104
3347 -104 392 111 -126 145 -215 -126 -61 123 -232 315 -118 199 57 -53 39 24 -256 -72 -139 58 -274 -1
3369 -1 -124 -95 -13 60 -172 25 -83 -178 -71 112 52 270 184 -14 233 220 -135 -169 -86 115 -234 27 -238 -37
3393 -37 -178 -95 -191 -160 46 51 -291 -134 203 109 -5 70 -29 -100 51 19 -13 5 61 -137 -146 163 58 -216 256
3418B56k09m06N69J41l67K11j48J14j16l6j9o2J55j96P9PO8J4k61M25j05l2k29
3441a47K12K0j89J09j10P8p0M1L07l05J00k65L95l39K06k10K61j77m5J75o0K8
3463A5j42P8J40R3l3l06K09K43l71NJ11J25k45j33K30j19N4L72m61lJ11P9J19
3486A71k88o2J68PJ77j60J70m29J59L78j28l78K92k7J6j33L2j16J29K55j38l45
3508b50R5K17j3o2n6O0j05J69J26l13L58k56p4J26q8P7k07J84n1J37m04M0L65
3531G5j81K90p8P8n3nj03M9p9J63p4p9o5N5J39j85J4r2K70J79m00j25J70L4q8
3556i1Q8K86l45Q2L36k77J02k89p7K7O1Q6kj05k0k03M24m54M86m4k11M6k5L88
3580B69j49k14K49k8j63J82j74K38j43j88j9J15J58j46K0q1j79J55K66n8M4k6
$$ plain form
3418 256 47 -359 210 351 -16 195 47 161 45 9 -10 -72 83 -113 -34 -27 41 55 -206 219 114 82 -147
3441 -147 65 85 -104 5 -105 -27 -97 -56 251 -54 46 -219 176 -163 43 -167 94 -83 -128 47 -13 15
3463 15 -127 -49 91 184 151 -155 54 297 -74 -69 42 167 -78 -211 19 -100 -46 326 -135 -138 -27 52 171
3486 171 -117 -179 -11 -4 173 13 183 -246 -87 291 163 -215 77 50 66 -67 -35 -151 -22 233 95 -250
3508 -250 -155 62 49 -13 -69 -9 -114 55 181 -132 226 -30 -104 22 -66 11 -196 -12 -63 74 -330 -290 75
3531 75 -106 184 106 184 131 126 23 72 -7 156 82 3 -62 -7 132 -53 -39 -131 139 318 -82 -207 -37 -3 -91
3556 -91 -3 283 -62 20 356 79 181 -108 -185 -158 -97 -11 -13 -118 -138 -341 83 -371 115 71 -140 -94 -119 269
3580 269 120 -94 155 127 -36 146 -28 210 67 -121 -140 -25 133 -13 7 -74 -253 -98 168 110 154 128
3602A28O3j37k20M9J76Q0o0j8j34J19J7M8l4n3o2j14R2P0j1j27J87m8m4J40p7
3627C0K22k95J37l3P9j93j15M9J82o9M0N9q0p7J37j93P9jn1J09j17L43j19l9L9
3652A23j99L15k53L5l5L1Pj61K27j58J80P5j44n3R5l6p9J26k68K58j38j08M29
3675B69j59M3j18J58j63rJ46J71n89L05k9R3o1r8j86M21k03L6J21J85j76k91K43
3698A09k77J42k61K14k3j10mL19j92m6j33K17j1N0L9j18m8J77N7k31J91K7j71
3721h3L3K08k83K29k88M43q3q3k27k2O2k17K14q3K72J1J45j50j24q6rK79l33J81
3745FK83k37j49j8J46k5k48P0L46k78k0M4k5J44m3J10p3K57k92M4J73j34R4j35
3769D0L24k76k26K48j47K26k84j25M10j73j85J22J95n5o2l34J61J3K4J10N8J38
$$ plain form
3602 128 191 54 -166 -117 59 139 79 61 -73 46 63 111 77 24 -38 -152 -60 10 -1 -128 59 11 -33 107 30
3627 30 252 -43 94 61 140 -53 -168 -119 63 -6 34 93 13 -64 73 -120 -41 -42 -93 16 -101 242 123 84 123
3652 123 -76 239 -14 21 -14 17 24 -137 90 -68 112 187 43 -10 85 49 -30 96 -172 86 -52 -160 269
3675 269 110 153 35 193 30 21 167 338 -251 54 25 118 57 -41 -227 194 -9 27 148 333 157 -134 109
3698 109 -168 -26 -287 -73 -96 -206 -210 109 -83 -129 -262 -45 -56 -6 33 -85 -133 44 101 -130 61 88 -83
3721 -83 -50 158 -125 104 -184 259 176 93 -134 -156 -94 -311 -97 -180 92 103 248 98 -26 -112 -121 158 -175 6
3745 6 289 52 -97 -115 31 6 -242 -172 174 -104 -124 -80 -105 39 -4 106 33 290 -2 42 215 81 175 40
3769 40 364 88 -138 110 -37 189 -95 -220 190 17 -168 -46 149 94 32 -302 -141 -128 -104 6 64 202
3791B02j62L2j02K6r8N24m21J44O0q0k37R3L13j64o5k08N27n32J71l3j73J6R9
3814f8q4J71O1j96J62j11M3l08M75j6j96q4N34m55o4K63j31RO6n35N60P3p7j00
3838hO7q3N5k46M0K7O6P1j9K47r7o6Ll07L60M5k9l35N8K55j29lq7J22m1Q6K30
3865B82m96M78Ml68J72Q2j47J32j92J69j84M8J76k71J24q9j4j16L26l27L05k53
3887a59K76J80k31mo3o2Q6J74k96r3J69O3j40M44q5P7l25j09O7J06k33L21k29
3910f6L8L5K7p2j07J60K01n09J82K60j68M9l0l6j20L46o1k37K93l12m3L71l6m6
3934A19m81M17j65lk5L32j96j0m0l6l3J12O5Q8k63L39r6j12k92R0k3J25p5J61
3958bQ2K03j37n4l9j6p8R6J16n4j33R0j63n4O3MO1j2j15M44j55Q0k70nM8O4Q4
$$ plain form
3791 202 40 72 -30 -4 -102 422 1 145 205 125 -112 -19 294 130 65 -143 384 -148 23 -10 -183 -167 -68
3814 -68 -152 19 80 -116 46 -65 -22 -330 145 129 -67 -151 383 -72 -136 127 -4 5 71 -464 96 169 92 -8
3838 -8 59 -24 31 -215 -175 -148 -82 -11 -30 217 120 54 57 -250 110 155 126 -209 -151 104 -25 -28 -115 7 -34 52 282
3865 282 -214 264 268 -100 72 154 7 139 -53 116 -68 -20 156 -115 9 -80 -94 -210 116 -211 94 -159
3887 -159 117 297 66 62 -1 -63 23 197 -99 -192 -23 40 -100 344 259 336 11 -98 -31 75 -158 163 -66
3910 -66 -28 7 34 -38 -145 15 216 -293 -111 149 -19 30 0 -36 -156 190 129 -108 185 -127 -170 201 165 119
3934 119 -362 55 -110 -113 -138 194 -2 -12 -52 -88 -121 -9 56 144 -119 220 124 12 -280 -190 -213 -88 -163 -2
3958 -2 80 283 146 92 53 37 -41 55 171 117 -16 74 -89 -143 -80 -76 -15 -27 -142 302 147 227 -43 -48 0 64 148
3985A48k31K77m38k4K88j4k42K91k49K15o5O0n3n5LJ92K0P4r7l05K01RN6l74N29
4010B16k24O4q5n1O3n9O8K11l61j3J59k0M6j15L04k53j27o3L81P1m9n8k54J61
4034A2R7j63J17l26J90K13j45j19J37m7K33k63J%J91j72o5Q1jJ36k15K37L5l19
4058a55K0J51pn6k65K95r6nO8l0j97L36k89K86J07j94K62l74j8J37K7J9k41L24
4082A05j45K32j86r0L8k0M5Rj40J17J40k09K32k78L13k91L22k0k47K42l14P0J00
4105B5j44k60N65k72R3Ml25J45K24Q0n6l17L43J22j97J7R3k11J6P5Q2p5N1j5J51
4130B14j03k65K44O3k5j31q5R5j60J82P9j44J06L3j54j39J74p0o4l5L86j36N5
4153A20P9j18l7k32l4L15p9L7j90J9Q3L2L63k84j63j33J34K56k30K91j67N0k02
$$ plain form
3985 148 -83 194 -244 -268 20 6 -236 55 -194 21 -44 16 -37 -92 -89 103 123 197 100 -205 -4 5 61 -313 216
4010 216 -8 56 -29 -80 -17 -76 -8 203 -158 -171 -12 -32 14 -101 203 -50 -177 -240 141 212 163 105 -149 12
4034 12 109 -54 63 -263 -73 140 -5 -124 13 -34 199 -64 -63 -63 128 -44 -109 -28 -29 107 -108 129 164 -155
4058 -155 -135 16 9 -47 -312 -17 -113 -118 -50 -80 -277 59 -230 56 163 -31 231 -143 -161 -24 3 22 -219 105
4082 105 -40 192 6 -84 -46 -66 -21 -12 -152 -35 105 -104 128 -150 163 -128 194 174 -73 169 -145 -75 25
4105 25 -119 -379 186 -86 7 11 -314 -169 55 135 79 -238 105 227 30 47 140 -71 -55 20 102 27 78 63 214
4130 214 111 -154 90 153 128 -3 -88 7 -153 29 108 -36 70 103 -51 -190 -16 -86 -150 -185 201 65 120
4153 120 199 81 44 -188 -222 93 14 51 -139 -120 -37 -5 358 74 -89 -222 -88 168 -62 229 62 112 -90
4176i0j23m6J75M0Q5J24o7k3L4k67kJ85K2K2m0k17K51j51K23Q3k65r3J07k1k2
4201g6J35l53N44k98pJ4mJ07j93j36K30K29k30l1J33k75J1L99l49L52j83J5J04
4224A38o9k15M6J37J77K36m89k22K10m2J71K8m12K44p0L6k2J88p2L2P4p1l4K40
4248B39k28k8N2J42k87K01k64L38j17k12K40o5ql5On1N4j07K07n7j36L87k40k37
4272b06K47J42j69j61R4M6J04J25k40J1j69p4K05K98k58j44K13P5m72N80l40J35
4294D2j15L4K36l10J19Q4P5j19K9j59Oj36K63L2j44N3r6R0j11M39m78K72l58K13
4318c9J78K1l74J45l1K69j53p8j76K07J84o17L06J16n7J61l15L57j99NM71n88
4340b07K29m2J05N1M4j25k08K23J84k89J28j90j44N8K99p5j64q7L32J0J29m16
$$ plain form
4176 -90 -213 -259 -84 -44 41 165 98 75 109 -158 -160 25 47 69 29 -188 63 -88 135 218 -47 -140 -33 -54 -76
4201 -76 59 -294 250 -48 -55 -41 -45 62 -131 -267 -37 192 -38 -69 64 -211 -200 199 -150 202 19 34 138
4224 138 69 -146 -100 37 214 450 -39 -261 -51 -93 78 106 -306 -62 -132 -96 -118 70 -2 30 104 33 -1 239
4248 239 11 -17 35 177 -110 91 -173 165 48 -164 76 11 3 -32 -26 -77 -23 -130 77 20 -116 271 31 -206
4272 -206 41 183 14 -147 -53 -7 97 222 -18 -7 -176 -250 -45 253 -5 -149 64 139 -333 247 -93 42
4294 42 -73 -39 197 -113 6 90 165 46 75 -84 -78 -214 49 81 -63 -10 -106 -16 -127 312 -166 106 -252 -39
4318 -39 139 160 -214 -69 -100 169 16 -62 -238 -31 153 -464 -158 -42 -99 62 -253 104 -95 -90 381 -207
4340 -207 22 -20 85 136 180 55 -153 70 254 -35 93 -97 -241 -183 116 41 -123 -210 122 132 261 -155
4362a55L56k64%P7J2l7J92j73n8J08R9j50J10k75P5J45k10K88k68N05m21q9J00
4385c3jL6l9j19jJ97k49J00k94K11j3K7K28k51P5J32K31n4N9j06m9j8p2j4K46
4410B29p0q5R4r2k29J58j56K05k20P9K46k75J92Q7k91k2J75K35l52O8K57k78l8
4433h3J12k2Ql7J82j85J79k05j9K08j70k0J07QR6o7J1j05J58q2J22j9j49N2P8
4458A58jm07M51k41On6L50k37k5l2k15J08M6k3j08K22j73J86p7l8L90K8k42j87
4482a17J6J60Q4j58J43k57J41L3j58P9J66J30k34j63K86J4k5j20KK33m45J56K82
4505B48l89L4k1O3j39kK86k70K7P8L15m15J49J15j30J47j20p4P5K3j85j84N92
4528B23l65L24j33J00J55l73j00J46j63L77l80J66j31M9K7J16k04K61k65J14N8
$$ plain form
4362 -155 201 -63 -63 14 26 -11 181 8 -50 58 157 7 117 -158 -83 62 -148 140 -128 377 -44 -133 -33
4385 -33 -34 2 -37 -156 -157 40 -209 -109 -403 -192 -205 -178 50 -201 -126 6 237 183 242 136 87 69 -3 -17 229
4410 229 159 74 168 76 -153 5 -151 54 -166 -87 159 -116 76 163 -128 -150 25 260 -92 -24 233 -45 -83
4433 -83 29 7 15 -22 160 -25 154 -51 -70 138 -32 -52 55 63 159 92 103 -2 156 74 196 177 28 80 158
4458 158 157 -250 201 -40 -34 -90 260 23 -2 -34 -249 -141 -95 -118 -226 -4 -177 9 -68 -106 284 312 70 -117
4482 -117 -101 59 143 -15 128 -129 12 45 -113 -34 132 262 28 -135 151 165 140 20 22 255 -190 -34 248
4505 248 -141 -107 -128 -65 -204 -206 80 -190 -163 -85 230 -185 -36 79 -51 96 -24 -98 -23 0 -185 -369 223
4528 223 -142 182 49 149 304 -69 -169 -23 -186 191 -189 -23 -154 -105 -78 38 -166 95 -170 -56 2
4549BoJ08K4k17N4K00Q0K0o22L54J38rk75Q4J28J0K16m24O5rk6M1O2M5n7K09j76
4576A9Nm3K71m8k89Q7O5r6L12k68J14k77P4K60l75L63J60l38Q8k13K77l9k72J51
4600a2j1j17J09P0L0k78K57J20k6l88L9L14j8J15m79O1K29j48J72k9j63K33l4
4623D6j53L64J0l31o1J4K06k60n2J46j17J89j57L4Oq6K04P1j05L0kk75L89k1k24
4648a35K28J36j77j72M35k17k07J59o1l21J51J61J03L3k62J64J40j42p1J80k97
4669a72M8J02l67K46K29j68J17L7J49r6l80L82J02j40kj02q5k5l3K44l52L41Q2
4692A57l67J25Q5K14l12J09J34k04J58j21K4R2j08k15J49MM2J79m1J92k89K12
4714B19j53j10K55n5J8n6J58m24K77n3Q7n3k24K27N7p2k3k21J90k0K44m96M9J39
$$ plain form
4549 2 -4 104 128 -89 -35 165 245 265 -357 -3 135 126 -149 -65 63 73 289 -135 -70 -79 -105 -64 -2 43 -14 195 19
4576 19 24 -19 252 204 -85 2 67 -29 283 15 129 -148 -74 186 -189 174 334 -4 84 -129 148 109 -163 -12
4600 -12 -23 -140 -31 39 69 -209 48 168 142 -246 -207 107 89 204 -275 -214 15 -133 39 10 -153 80 46
4623 46 -107 257 267 -64 -125 -111 95 -165 -217 -71 -188 1 -156 -122 -116 -202 2 73 -32 -2 -4 -279 110 89 -135
4648 -135 93 229 52 -120 315 98 -109 50 -11 -332 -181 -20 83 116 -146 18 158 16 -55 125 -172
4669 -172 -124 -22 -389 -143 86 -82 35 72 221 125 -255 127 229 89 87 -15 -100 -125 -158 86 -266 75 157
4692 157 -210 -85 0 214 -98 11 145 -59 99 -22 2 94 -14 -229 -80 -76 -34 145 104 296 7 219
4714 219 66 -44 211 156 174 118 276 -148 129 76 163 110 -114 113 170 98 75 -146 44 24 268 -228 -179 -40
4738d0j30K1R3J19k41L52l00J47L1j10p7J38Q7j68K12k36M9j41K59N5k09J02J38
4761A51k8n3j08R9Q6m3P4l08J44j83K54O3j35j4r1jN2m9Q5j65k6J84j30J87N0
4786I5j58K66k68QK4Q4r1J7L8J86k95k5m2M82m92M29k16R8j64l5L59j16k47j45
4810b08K77k48L70l51J98oK70m42K50j31L3k21J60j0J41j42M7o1o7K32k21J47
4832A7k6j09J72k43l1n2K76k1j83P0r4M29q1j64J40L1j40Pj34J11r6K15j82J01
4856A3r9j86k9L06J62l07J24m4P6J2j78N7K07j58K33j58J79j58l18J95L31m51
4878a91L09J05k62L6j16K23P4j71j81N3J3Q2n0K34m9l25Q3Q1L3J41p0m93K64O6
4902a11J21k76J33K11J49j97j4N4j79N0q2J02Q6j10J47P4K64n14R7j57J09J01
$$ plain form
4738 -40 -170 -149 -56 63 -178 174 -126 21 52 -58 -135 3 90 -78 134 -102 -53 -194 65 120 -89 13 151
4761 151 123 70 -38 61 147 104 178 -130 14 -169 85 148 13 -1 -92 -93 -41 -90 -5 -170 -196 -12 -142 45 95
4786 95 -63 203 -65 -57 -33 51 -40 -23 15 201 -94 -119 -161 321 -171 258 42 140 -24 -59 300 184 -63 -208
4810 -208 69 -179 191 -160 38 32 302 -140 110 -21 12 -209 -49 -59 82 -60 -13 -74 -141 91 -130 17
4832 17 -9 -118 54 -189 -220 -272 4 -17 -200 -130 -224 205 124 -40 100 131 -9 -2 -136 -25 -121 94 -88 13
4856 13 -86 -272 -301 5 167 -140 -16 -60 16 28 -150 -93 114 -44 189 31 210 52 -266 -71 260 -191
4878 -191 118 223 -39 -3 -119 104 178 7 -174 -121 -108 -26 -76 158 109 -216 -133 -52 -19 122 52 -441 -177 -111
4902 -111 10 -266 -133 78 227 30 16 70 -109 -59 -141 -39 47 -63 84 158 422 -92 5 -152 -43 58
4924E8j9M3p0j3q0K30n5k20l2K77p0l4j48J71P0l4K05l3j58j82m8J80J6J49m9
4949A54Q0k31Q4J00l35J68J90j15Nj66O7p2k10K82Q9k08J44r0K87j34j17K72j38
4972A06m8j72jK75j30m5k18K45Q6l35J39J56K7M0p1j08L26l40K77j38J60j50J4
4995I5Q4k65R7K19j79j36j8m8J90o0j20q8M03o4j30J9J47l5J84k36J8k27K25o
5019F9j40J07J17K2k82l7Q7n0J69j05J05j19%J54n0p8m8R3k8r8K43J24m15K47
5043H7j89O8j77O2L61j81j10oK99l20K26p4J00j73J7QlJ20l3k3j66j01K48j05
5067f5J23k15m0L11K08n41K91j90K55k7P4N5k5j57o4J15k22P1J1J77j63j07K02
5090G7j55k80M27k21J70R7k51L38k87J70k40j5M5K44r6J55k06J61n8j50K39j60
$$ plain form
4924 58 39 82 12 -1 -81 149 94 -126 -158 119 49 15 -133 38 108 74 279 246 88 -94 -142 38 54 203 154
4949 154 234 3 87 187 -148 20 210 95 100 -66 1 -71 -281 1 90 -118 26 -64 223 89 -28 244 106
4972 106 58 -114 -115 160 30 -15 -233 12 98 -237 -98 58 85 125 54 -54 272 -68 209 71 231 81 95
4995 95 179 -86 11 230 51 -85 -103 -151 39 -21 -141 -229 174 110 -20 -1 146 111 295 59 77 -150 75 69
5019 69 -71 36 153 175 -107 -144 -57 -107 62 -43 62 -57 -57 97 47 -31 -79 14 -14 -112 131 255 -160 87
5043 87 -102 -34 -211 -149 212 31 -79 -85 214 -106 120 46 146 -27 -10 -2 -5 115 82 59 -107 -208 40 -65
5067 -65 58 -157 -197 114 322 -219 72 -118 137 110 184 239 214 57 -7 108 -114 -43 -32 145 -18 -125 77
5090 77 -78 -358 69 -152 18 115 -136 202 -85 85 -155 -170 -125 119 23 178 -28 133 75 -75 164 4
5112Dn8Q5j15J58n0J31l50R7J41k44J92j23L39j66j02M9j05L49m50N83p01K97
5134c9L23n67J47J94j58K49j84j11J55J09j22p7K64k21rK59L7l74M20l92L61j78
5156H6k84L6J81J5J34k55k11K94J67j26j92M52j77j56Q5N4l1J33r0j84j07p8K02
5179e2J01j26J20l13K76L9j31J55M5lj18J52J89l33J24j3j01J94k07J85j6q9m2
5202C6K76l10k2J61j29J18l83L23J6k18J08Q7M8n8j65O0J69j5j92Rj6k39jO8J32
5227a37K63j31M2k17J46L0P5l6J7J63k8k25Q0NQ5j42J77q6j7j9M3j99K4J16j03
5252g4j22J26J93r0oj33Q9JJ58q7K5j59J04q8O6l2K1k4K4q5J57J9j61K02k58K07
5278G3j00K24k78J94k4l62L7K75k48J99j74q2J04j56L95k09J92r0J5J7j42j21
$$ plain form
5112 4 -54 31 -84 74 24 155 -195 -98 43 -201 -9 -132 207 41 -61 -12 -117 232 -218 365 -336 -39
5134 -39 284 -283 -136 58 -100 149 -35 -146 9 118 -4 -81 183 -38 -47 212 249 -125 295 -97 264 86
5156 86 -198 -162 19 34 168 -87 -298 -4 163 37 -155 297 120 -36 49 103 72 205 115 -69 -176 -254 -52
5179 -52 49 -77 43 -270 6 45 -86 69 114 111 -7 145 334 1 125 112 11 205 -2 183 167 78 36
5202 36 312 2 -20 141 12 130 -253 70 86 -132 -24 63 111 53 -112 -52 117 102 -90 -81 -97 -336 -337 -269 -137
5227 -137 126 -5 37 -180 -34 -4 71 35 52 215 187 -38 42 47 132 -10 167 81 64 45 88 -111 -87 29 -74
5252 -74 -196 -70 123 33 27 -106 -17 -16 142 55 80 -79 25 -63 3 -29 -8 -32 -8 -93 64 83 -78 124 -134 73
5278 73 -27 197 -81 113 89 -273 -236 39 -209 -10 -184 -266 -162 -318 77 -132 60 -30 -15 2 -140 -261
5300b61K75k25K39n7j35N8K82q8r7K5j08K86l78J14QO7k7J24j84J02l2K0Q1k71
5324a82J23J40j18J89j76O5J35j31j31J89l04K89P5l27J54k16N35m46p8l2L78
5345A31r6L1N4j24Q7K49m75K11j2n4j32OO6J78k36K58k37L3L0%K08l31J96l1P0
5370H0J00j61J98m63M20r2o3K44l46J80%n7q9J46j78j91L10n2k07L60q8k4j50
5393a23K92k02J30k18J50j15K86k75j36L15L1m3L9n0k76L32k07q8K11k65J60K4
5415b8M8j47M35m90J55K54k87k12K54J23K47l76N7k46K18j12j4K46j78K21k63
5436i5n2J29k25R1L8K7M2K83p2l33K48m9o6l3J09j22k7Q8J64k1k09j22K4K01m14
5461c96M17r3K0M2J23m8P8j25j17J86k32Q4j74M96r0q1O8o4P6k82J41K0j07J29
$$ plain form
5300 -261 14 -211 28 -29 -164 -106 176 88 -9 16 -92 194 -184 -70 -62 5 -22 102 -82 20 -12 8 89 -182
5324 -182 -59 81 -37 152 -24 41 176 45 -86 103 -201 88 163 -164 -10 -226 309 -137 -215 -247 131
5345 131 35 66 120 -4 83 332 -143 68 56 2 -130 -124 -58 120 -116 142 -95 -62 -32 -32 176 -155 41 10 80
5370 80 180 19 217 -246 174 82 19 263 -83 97 97 40 -49 97 -81 -272 38 -14 -221 139 51 27 -123
5393 -123 169 -33 97 -121 29 -86 200 -75 -211 104 135 92 131 81 -195 137 -70 -158 53 -212 -52 -28
5415 -28 20 -127 308 -182 -27 227 -60 -272 -18 105 352 -24 33 -213 5 -107 -121 125 -53 168 -95
5436 -95 -147 -18 -243 -152 -114 -87 -45 238 166 -167 81 32 -34 -67 42 -80 -107 -19 145 124 -85 -207 -183 18 -396
5461 -396 21 -72 -52 -10 113 65 143 18 -99 87 -145 -61 -235 261 171 90 158 94 170 -112 29 49 -58 71
5485G1M4j22P0m23K97K30n7j35m0P5L2j37J3J4k60L88j04k2J31O6M7j22L9K6k03
5510h2j00J39Q7J25k76J1J14k04K08p3J06J50l76N9J54J85j68j36J16j27k10K22
5532g6J77J13q9j56r8J90j76K60j28J23l7l22jM01l2Ol5k05k35J57J23k77P6M05
5556A64j24jj87k02J39pJ53jl02L70K0J1j36K21k28j96J64K05QNJ40k02J63N2
5580B29l99L59j71j80J11q1J40l01M61j48N3k07K14N0k29J3J25J2L3j29J6kM0
5603Ij00K69k60J40k53K57j44q3k6K52L3k22k26M15K8j41mJ8K67j42p2j25R2Q5
5627F7Rl41J96P1L2K86l83N7k35K04q7k45K43J14m6kJ52j99K58k3l21L74l76N4
5651a41L92m08J92K4j99R1O0R4j15K0j9r9j45J78J42k6J34J5j40q6J32pk28Q5
$$ plain form
5485 71 115 -7 63 -360 -63 167 110 -25 -65 10 42 -95 -82 -68 -328 60 -44 -66 65 131 178 56 95 121 -82
5510 -82 -182 -43 44 169 -107 -96 18 -186 22 -51 55 205 -171 -112 42 227 59 -77 39 -88 -298 -76
5532 -76 101 214 125 -31 -129 61 -115 145 17 140 103 -219 -220 181 149 155 120 -85 -320 -163 -40 -317 -241 164
5556 164 40 39 -148 -350 -211 -218 -65 -66 -368 2 22 33 -103 118 -110 -306 -142 63 71 76 216 14 177 229
5580 229 -170 189 18 -162 -51 -132 8 -293 168 20 73 -134 80 130 -99 -86 39 51 84 -45 -29 -31 9
5603 9 -91 178 -82 58 -195 62 -82 -165 -191 61 94 -128 -354 61 89 -52 -56 -38 229 87 15 -110 -18 67
5627 67 76 -265 -69 2 34 320 -63 -6 -241 -37 -124 -369 -126 -12 -58 -60 92 -107 151 128 -193 181 -195 -141
5651 -141 251 -157 35 59 -140 -49 11 105 -10 10 -9 -108 -253 -75 67 41 175 190 50 -36 96 89 -139 -54
5675e4o4K52l8j42K49k83M3N1O4k5n8K08k55r0O6K73l2m52K09r1K01j65Q3N1j61
5700a60l0N71k70j55K36q8l86O15n64P1J23n9K11j60J79k91L23o8j31k13R9o7
5722b14J66J83k42l0K63k18No2K37k80M9L60j43j67n6J29P1K9j36q9O6J98k53
5745a34J16OJ95l24L64k32n1o2L20p0k33Q9J06n7J26P9k59j17k78L62L06m15K95
5768A32k17K02j60j07J53l60J14K99L2j28Q6k70N69j28n0j17j21K9L4J33j98j18
5790a91K03O1j87K99k25m8J10K2m0n2J33o7Mo8K16j2k15j0P8Q3P8l72J92J4Q1
5815H7k46k7L53k40L06l31L06k59K11q2J20l05Lo1L50j52M7k29J17L33l48m2P1
5838a8l87L07K3k31M19k22m0J86j02L39n09J96J23Pr3j27N3Jmj21K10p5m7L27
$$ plain form
5675 -54 -118 134 96 -46 203 -80 -37 14 78 53 -5 203 -52 -142 -76 197 165 -287 -78 -169 32 -133 -50 1 -160
5700 -160 -190 381 111 -44 192 104 -282 333 -231 -160 -37 -96 115 -45 134 -157 166 98 -33 -246 -147 -214
5722 -214 -48 135 -107 -137 126 -92 -87 -149 88 -192 -143 217 74 -93 -149 -20 51 80 -56 -145 -79 119 -134
5745 -134 -18 -12 183 -141 223 -9 -60 -122 198 128 -105 -16 90 33 159 238 -21 -138 -416 -54 252 -163 132
5768 132 -85 117 -43 -150 3 -357 -243 56 88 -40 46 -224 345 217 167 50 -71 -42 -8 125 -73 -191
5790 -191 12 73 -114 185 -40 -88 22 44 4 -48 85 18 22 -46 170 158 -57 -67 11 94 172 -200 -8 6 87
5815 87 -159 -186 167 -73 233 -98 208 -51 160 78 198 -107 -104 -165 185 33 80 -149 -32 301 -47 -89 -18
5838 -18 -405 -98 -75 -306 113 -109 -149 37 -65 274 -235 -39 84 91 -2 -129 -76 -75 -79 -200 10 -65 -112 215
5862B15j41j09K3J43l14K84Q7l4k12j0K64r2k15J93k57M60k73j19K32n2p4M4P6
5885A19Mo8O4j25pk0k96K63L36o5l33R3J09n4L9N8O5k24K37k62K9j15NR5J69l
5911A13M0j99J48k65M2K46k46K05m1j40J05L9n6J65l1R7k51J96j69N0p0N4K9K38
5935B99o3l51K09j87P8k87O46l74qK5L88l45j43j0k3J46o3K13l7k17q6L55j56
5958Ij17J36j16N2J25k06J97k28J14K91j72j30L62j35j30k36R1K34lm3j65L26
5980B56l09k26P9J32l5K31l77K59K20k27k0k2j02L37k74K69l4j66p4K33j57n4
6002f1J13R9j59J2Q6j50M30n93L15k37K45j72N8R0M1j59J28o0LP2k01R5J42k08
6026g1n8J73l0j66J77K0j73J65qJ33j45L0j45M4K6L67k21j47R9l23J21O2J37k4
$$ plain form
5862 215 74 -35 -12 131 -183 101 188 154 -58 -68 196 104 -111 82 -175 285 12 -107 125 73 -1 43 119
5885 119 123 55 119 -6 -13 -33 -329 -66 270 205 -128 -35 74 20 59 117 182 -42 195 -67 -38 -153 -148 -53 116 113
5911 113 153 -46 102 -163 -121 125 -121 84 43 -97 8 47 -9 156 125 222 -29 167 -2 48 -22 32 61 299
5935 299 236 -115 94 -93 -15 -302 344 -30 -38 -13 375 30 -113 -123 -146 0 -63 150 113 -104 -190 165 9
5958 9 -108 28 -88 -36 89 -117 80 -148 -34 257 85 -45 317 182 52 -184 -93 141 138 95 -70 256
5980 256 -53 -279 -200 -68 -103 128 -249 10 230 3 -17 -39 -141 196 -78 191 157 -9 -83 150 -7 -61
6002 -61 52 151 -8 4 90 -60 370 -223 92 -145 100 -72 -14 76 117 -42 86 26 29 101 -100 -5 137 -71
6026 -71 -129 44 14 -152 25 45 -128 37 29 162 17 47 -98 -54 -28 339 118 -29 70 -253 -132 -70 67 43
6050D3j13k00J98J34K0k38L1m0J4K49L1Nj93rQ8J51k53J14l7M5rr8R7j31P3p9
6076a07Jr3J00K59k23l4M03k24Rk23O4J73j75P5j04O4r4N9k12M32K8J86l06l4
6100B4l8J42j59R9n0J55j0J06k35n5PK83l10j8R2j9J07k18L9P3j45j18J95M9J17
6125A13n1k58L25qj57K3J23l81L42J31j05j27l4l5%K97j54J3j57NJ43j4p7j7M8
6150a2J03k04l3L09O3l66J56J60k0k83J40K6J9M1k57J76m5o8j2JN9j15L61l65
6174a66J83j54R1J49j4j79J53Qj69P3k90K74j51K23m2Q3k75K44k2k69L06J64p3
6197A47k84K11k42K09j94J27p3l4J94j55J97j26j56P03m19j16J24m8j61K19k16
6218i3J99O1j10j7r9P3j69J40j33J99p4J8J35k22kJ29J62k35J32l8k99K17k7n
$$ plain form
6050 43 -70 -270 -72 62 82 -156 -125 -165 -151 98 129 134 -59 -68 20 171 -82 32 -5 40 31 -67 30 -101 -28 -107
6076 -107 -106 -199 -99 160 -63 -97 306 82 91 -132 -68 105 -70 5 -99 -35 -129 -70 -282 150 178 364 58 24
6100 24 -14 128 -31 68 18 173 163 269 34 -21 -14 269 -41 -59 33 14 121 -97 -58 15 -130 -248 -53 -4 113
6125 113 62 -196 129 121 -36 -13 110 -271 71 202 97 -30 -64 -99 -99 198 44 57 -100 -95 48 34 -43 -60 -12
6150 -12 91 -113 -146 163 226 -140 16 176 156 -127 13 39 58 99 -158 18 -27 -95 -107 -106 -47 -162 199 -166
6174 -166 17 -137 -46 103 89 -90 63 71 -98 -25 -315 -41 -192 31 -11 72 -203 41 19 -250 56 220 147
6197 147 -137 74 -168 41 -153 -26 -99 -133 61 -94 103 -23 -179 524 105 -11 113 65 -96 123 -93
6218 -93 106 167 57 40 -59 14 -155 -15 -148 51 -23 -5 130 -92 -94 35 197 -38 94 56 -243 -26 -53 -58
6242e8Q5m9Q0k63P5N4J37j54p5K56l61L40k73K82j64q4L16n9j30P0jl6m0RN8N8
6268G3Pl81J49L17j58q5K00ok59O3P3K11m26J91oP1J73j49N5l07K89L0k08J25
6292D2J77k38J07J80j92r1L4L9J21m04J53o3k52N44J20o5l91K6O4K25k45L55j64
6315H2j77L5J24j24J60kj22r6J43j0K6J07Nok10J7M3M4J4R9l41L76k46J60l71
6340b70K28J63r4q1k52K05K59j86K31l42P8Q1o9m8l9L1K63j34k98J30j22L13k11
6363a64J74j57L68m31J89p9n6J36j87K46Pj35j08L41k22J97K6k57J13j39P9MM21
6386C66j71k18K32k30q4J67lj5J42k28j66J22J09j89K63MK7j95K31k7o3l2j19
6409g7N2n0R1j68M6K27j50J62P5k32R2k02O8M4L7L7j27M44l51l3r8J9N2J25J67
$$ plain form
6242 -58 27 -22 58 -205 -130 -76 61 -93 -168 88 -273 67 -206 76 -88 -172 144 85 -45 25 24 -12 -52 -43 15 73
6268 73 80 -301 -152 165 7 -78 122 116 -143 -80 -7 204 -222 -31 -37 34 207 58 113 -194 95 125 -83 42
6292 42 219 -19 88 268 76 -15 19 58 179 -225 -72 -135 -387 157 277 212 -179 -153 -89 136 -109 246 82
6315 82 -95 -60 64 -60 100 98 -24 -120 23 13 39 146 151 145 -65 -48 -5 39 53 152 -189 187 -59 101 -270
6340 -270 -42 121 27 -54 -306 -101 158 -28 203 -139 -61 20 -49 -97 -136 -105 158 24 -274 -144 -266 47 -164
6363 -164 10 -147 221 -210 -21 -100 -156 -20 -207 39 46 -89 -197 144 -78 119 145 -112 1 -138 -59 -55 366
6386 366 195 -23 209 -21 -105 62 59 44 186 -42 -208 -86 23 -166 97 101 128 -67 164 137 74 42 -77
6409 -77 -25 -75 16 -152 -106 121 -29 133 208 -24 68 -134 -66 -22 15 52 -75 369 18 -15 -113 -94 -42 83 250
6434B50m53K1P7k52K99r4j29M14l14O8J61Jj71m8M94k59j56N0J60M4r8k08k7K39
6458F9k69L41j37J14l22J8K98k04R5k64J74K89j24k54K8R8O3j13J72k01L82m3
6480B10J49m43p4K15L3q8J19l17J16J25OPJ28o7j22o4k43K82m7J80J12k71J95
6503A41j4j7L8l00K64N8j26j89J28K2j01P2lJ75l21m6N32l34k23L60k2j79J92
6526A07j23k52K86n8J54K0j72l2L09j35k49j25K62O2k31L74j98J63j37Q2j65%
6548e8J82k86J20l2p7K74j22n2l71K78K2K4K62j97r3Q0o4LM6J98j09q4Q0J8j19
6573g7M7K03l48J63Ko2r5K55n9r4K9K5n8J48O2o3j48J57j81j03K44K6m1q8r4K86
6599A36m4k68L43j19j29K33q4l07K27J99j08j05j37L89j29k48J90k81K23J77k12
$$ plain form
6434 250 -203 -182 -105 -357 -58 -152 -281 133 -181 -113 48 49 -122 -170 324 65 -91 -41 119 163 65 -143 -170 69
6458 69 -200 141 4 118 -204 -186 112 -92 3 -261 -87 202 78 -176 -148 -50 13 -100 72 -129 253 210
6480 210 359 -84 -158 57 90 2 121 -196 -80 45 51 58 186 119 -3 -67 -310 -28 -75 105 217 -54 141
6503 141 127 110 148 -152 112 170 44 -145 -17 5 -96 -24 -27 148 -173 -219 313 -21 -244 116 94 -85 107
6526 107 -16 -268 18 -40 114 134 -38 -70 239 104 -145 -270 -8 54 -177 197 -1 162 25 107 -58 -58
6548 -58 124 -162 -42 -74 -151 123 1 -51 -422 -144 -122 -98 164 -33 -126 -46 -110 -107 -61 137 28 -56 24 42 -77
6573 -77 -30 173 -175 -12 -10 -72 -167 88 29 -65 -36 -11 -69 79 141 78 -70 87 -94 -197 47 73 32 -56 -150 136
6599 136 92 -176 167 48 -81 152 68 -239 -12 187 79 -26 -163 226 97 -151 39 -242 -19 158 -54
6620e4J67ll9j84q4L54m94M85K2k79K08J5Jj52M6j2M7k48J84J92k15l6R0L0M2
6645H3q2K42n66K48J07J61k80J37qo0Q3j05K72p3j79J51j12k05J58P0j25J45p1
6668iL0Q0l26N23k75P5k22J60j94L40k13QJ78k45J5P3j92J5K20r4j06J35p4J06
6692Hj65L49J4l43J16M7j31L5J25k67m6N7K3K07Nm8Q2j60L74m49m8J90k03L53
6716A25j17k4K55k09k14J21LJ96j56n1N2P5j6j04K04M5j11O4m6J7p3l16K87R2
6740I9j91J09K86m21M0M4J31j55L4j30J97q4K18J57m74J48K23j52p5M2j02j8M27
6763C53k80j02J88m76J53Q4K9K16l61L73k7j70J70n8j64K82j16j24R1K49l56J29
6785H3k31J90P6O3j16j79M1K10j68K02l78J08M3qJ88l7k20R6k74J87j4O7O9k31
$$ plain form
6620 -54 113 110 71 -113 -197 157 -337 148 170 -109 99 114 115 -37 9 -3 44 -204 -20 172 -43 -79 11 41 83
6645 83 1 243 -323 -75 32 193 -87 50 42 -18 65 -40 232 159 -20 131 19 -186 -28 42 -83 62 -9
6668 -9 21 101 -225 298 23 98 -124 36 -158 182 -31 -23 155 -90 -75 -2 -194 -179 41 -53 -159 -24 -98 8
6692 8 -157 192 206 -137 -21 26 -105 -70 55 -212 -258 -201 -178 29 34 -14 68 -92 282 -167 -215 -25 -228 125
6716 125 8 -16 239 30 -184 -63 -60 136 -20 -71 -19 56 40 -64 140 185 74 138 92 109 36 -280 7 99
6740 99 -92 17 303 -118 -78 -34 97 -58 -24 -154 43 -41 177 334 -140 8 231 79 4 46 -56 -74 353
6763 353 73 -29 159 -317 -164 -80 -51 165 -196 177 150 -20 150 92 -72 210 94 -30 61 310 -46 83
6785 83 -148 42 118 181 65 -114 -73 137 -31 171 -207 -99 -56 -64 124 87 -133 -37 -311 -124 -138 -71 -2 -233
6809b33P5J12K16k05m5J77j03j8j19P0O2M6%M8m4j74k8K38j53j46L97k15j70J84
6833b8Q8qr8p6m2K28m2P0j14J75J16k87j36K10m5n0o1j27J93r4J83o0J63j91j00
6858a33J29j00K30j89J65r2R3l69J18J60m4J20j64J19j40N4M4M9n8J34j22P3J39
6881B16k95J54R7l95M85k26p4J10J96l06J3q6K86n9l18K48j09l7L0K9L7k04N1
6904a57L21l55n1pJ74j40J7J49J72j89L1k4K33j19M7op1r6K57j09k80K00K54l18
6928f7L7N8k25K93R0l76J65N7j48J17L66o46L16k05L27j34j37J11p4J84l69K58
6950bO5j70P6L10l86N8p6J8n5q5K62p7l7J20p5j00J42m8n5M30l21M1j05R4l55
6975c31L55k42K14M1j54K07j77K8n6Q9mj72K37j30J40q4m1K39k79K10j36P5j25
$$ plain form
6809 -233 -158 -46 170 -35 -80 97 -6 -24 -143 -73 -11 35 35 83 39 -135 -163 75 -78 -224 173 -42 -212 -28
6833 -28 60 52 -46 -122 -164 64 22 92 -22 153 269 -18 -154 56 11 -39 -100 -227 -34 -128 55 -5 158 -33 -133
6858 -133 -4 -104 126 -63 102 10 103 -266 -148 12 -32 88 -76 43 -97 -43 1 50 -8 126 4 77 216
6881 216 -79 75 172 -223 262 36 -38 72 268 -38 -25 -111 175 116 -202 46 -63 -100 -70 -41 -4 -208 -157
6904 -157 164 -191 -242 -249 -75 -215 -198 -49 123 -66 -35 -59 174 55 102 96 25 -71 186 77 -203 -3 251 -67
6928 -67 -30 28 -197 96 186 -190 -25 32 -116 1 367 -279 37 -168 159 25 -112 -1 -75 109 -260 -2
6950 -2 63 -107 -31 279 -107 -49 -125 -107 -162 -247 15 -62 -99 21 -54 -154 -12 -60 -115 315 -6 35 -70 24 -331
6975 -331 24 -218 -4 37 -117 90 -87 -59 -115 -26 -30 -202 35 -95 45 -39 -80 159 -120 90 -46 29 -96
6998i6K56j08j43n7J87N3p5j80J15R3J13l78K27j65j02K79j02Q8q7K3R6J64k00
7021Ak8J60j08l82K67L1k47K92L33r5p5M2l13o2q8J69N6J54j41N6k88K64J42k75
7045a35L80k00Q8Mk65K44j02j03R7J74j12j68J86m1j70R7Q7k01J74j44K12K07
7067C09j43k01q3Q2K17nj82P9N2j38L7j77K74p8o3K69m59P9L42l65J82K2r4K53
7091B09j65J50j74pJ61l99L53k46j28K52J23j73o5N7k49L29k1l0l07J13M39l53
7113a31J97j46K95p3j36M8J42p1k1J00o9k25m0K09J51l0L3j42K38l6k13j0r9J8
7137a1J90l34L77j67l1N4k06k7J29K10k66p3K87k17o3K2K66j44k77N59m99J50
7159g1Q2j57K35Q1j90J40j1o3M7k30j57L86q6j0K3j00Q1R4k04J5J19j84J04J24
$$ plain form
6998 -96 160 52 -91 -148 39 92 17 -163 -48 45 158 -220 7 -158 -260 19 -83 5 -82 -59 37 201 1
7021 1 -27 133 25 -357 -90 -59 -306 -14 319 224 149 191 -122 -184 -272 -103 -47 107 -34 22 -266 -2 140 -135
7045 -135 245 45 133 137 -128 116 14 -89 8 182 70 -98 88 47 -123 -26 61 -140 34 -110 102 309
7067 309 166 -35 -118 -36 181 176 -6 73 125 -13 24 -153 121 43 -20 249 -210 -131 211 -154 28 50 -44 209
7091 209 44 194 20 13 174 -225 128 -118 -246 6 129 -44 -109 -52 -301 28 7 -23 -330 -217 222 -131
7113 -131 66 -80 215 142 6 54 196 125 104 204 135 -90 -130 79 230 200 233 91 329 293 80 70 -29 -11
7137 -11 179 -155 222 55 24 78 -128 -155 -26 184 -82 -155 132 -85 -148 -126 140 -4 -281 278 -221 -71
7159 -71 11 -146 89 170 -20 120 109 46 93 -137 -294 92 6 -4 19 -81 0 94 -110 -95 24 -160 -56 68
7183F8k03J1J62pJ34l48r4K25K12j31rPj71J85n3j99J40J06N2q1j39K91P0o0l10
7208a42L46r5L4J61m41n6L03%j94K56k13j03K16k82J39j02N4J56l1J2j83J76p8
7231f7L0k3N9k7J30k65J90Q3m0m8m6J5K02L8l83M6L31k03j44k1J30k42J6L33k33
7256a39J82J5j12J12j54R1J33m0m03K82K40j10p5k01J35j71K6K41l18m9L48r6
7278f3J35R6m7r2k1M3qj40K9J78r9J73l02KM72k32l27O8r1R4J85k69L08j54j35
7303a97M63m35J20J24k94K45PK9q5K42m07M48k24J23p5l80K93Q9J6Q3j79q3p1
7326a48J09Q1L7J35k07l1J18rm1r6J01N0Nq3M5p7M8k05R0M3K53l53k12M99K7j
7352A78k40RJ8J02j58L6J66p0K21j00k44K29l05K37O2k29r4l9L1M15l07l7J05
$$ plain form
7183 68 -135 -124 38 31 165 -183 -277 -52 160 29 20 27 -144 41 -12 -211 -71 35 87 6 -133 158 228 168 -142
7208 -142 204 109 143 304 -137 -193 110 110 -84 172 -41 -144 72 -210 -71 -173 -119 37 6 18 -165 11 -67
7231 -67 -37 -60 -1 -28 102 -163 27 110 70 22 -24 -9 193 231 -152 -106 225 22 -122 -143 -13 -255 -239 94 -139
7256 -139 43 58 -54 58 -96 -5 128 88 -315 -33 207 97 22 -179 -44 -215 -189 52 -266 -315 33 -63
7278 -63 72 168 121 29 8 51 43 -97 -68 110 11 184 -118 -116 356 124 -203 -135 -226 -132 53 -216 92 -62 -197
7303 -197 266 -169 -49 75 -219 26 33 62 -23 219 -188 260 36 159 84 -296 -3 86 102 185 6 -77 -148
7326 -148 -39 42 79 214 7 -24 94 85 44 -52 49 99 104 21 66 -11 37 -168 -78 -35 218 -135 -347 152 179 178
7352 178 -62 -53 -35 67 -91 -55 111 41 262 162 -82 147 -158 79 141 -88 -182 -221 -190 225 -82 -119 -14
7375a4M9Pm50M54L1k8J2k44J0K99o3J51m95K22R1M6j86J84M0j79j40L87k38k43
7399b97J41K11L7p7J65j07l05L07m6l0k58K41J63k58J35M6k04J6J49p6J45l3J07
7422A72l8J03m19K8J07J66Q0k34R9O2J24j51k18L02k48O7q8j54J09J17m0j53O2
7445a45P8L44N9n35J43j1K44l55J40K41j38l8M5N1j1m5j15L58k51o7j31K5j06
7468b20K79j75M00k76J21m08K53N3n2K05j33OO5k18K2J57j35J21l20k3L83O7J45
7491C17k76m5m5l1j0j15J34K17j54R3k8p5k60L52n4m0O8k22J12K18pj38J0r2R4
7516B3j00Q7K57j86l06K93mj1N2K0m6J46j16j87l3j33L33k0Rj08j29R7K32j8k98
7541a46m5K21j63J51R3P1o7M2k04P8n8J63q0N9m8J46n33M67j32p4Q5J04k2k27
$$ plain form
7375 -14 35 42 -408 46 77 49 61 -183 -173 126 63 214 -281 -59 32 78 -108 76 116 -63 -203 184 -54 -297
7399 -297 -156 55 92 15 180 73 -232 75 29 -1 -259 -18 145 -113 22 68 -136 -120 29 -47 98 65 172
7422 172 134 237 -182 -154 -47 119 199 -35 64 126 250 99 -119 183 -65 2 -86 -240 -131 -14 -54 -207 -145
7445 -145 -67 277 336 -199 -56 -67 177 -178 -38 203 65 27 72 123 112 67 -48 310 59 -8 -139 -114 -220
7468 -220 59 -116 284 8 129 -279 -26 27 -25 180 47 53 118 -100 -78 79 -56 65 -255 -278 105 172 317
7491 317 41 -4 -49 -80 -90 -205 -71 146 -8 85 57 -18 -278 74 20 -20 48 -174 -62 156 149 11 21 -71 23
7516 23 -77 10 267 81 -225 68 64 53 105 125 79 225 109 -78 -111 -244 89 69 78 -30 -159 -62 170 152 -146
7541 -146 -191 30 -133 18 111 182 115 157 -47 31 -27 136 56 115 67 213 -320 147 15 -59 26 130 108 -119
7565a19J71k49J23l7j92N15l19J63m6J00k08M9O7K44m23J73J21j97M3J28k94r2
7587b79K87o7M4J85l72J44J53l99qL79n3n5O0k24L17j38o6K6Q2j93J38l2k08N6
7611b23L55n6k90K44K1j29L46l32J24m0l1J92n9l16J80j66K96Jj97K07j18J29
7633A38K15o52K52N6J20K20k50k72K04k1mN4k54L73k59K8L7L16l45K90j92J9j12
7656c9J28j17k3L2J06j74m7J81r9j92M34k02J6r9q3L06j91Q3K22k88k31L79p9
7679B3k2J01j75J00Q0l24n5J91K38r3j49p2K33L35m29j9J39n1j06j36Q6j0M5J77
7703A07m2j06k9J13m0L5j99J30L6n9p9J95j49P0J11q2N3l6M8k70R3K12l0r0L1
7728B3K92j92n0p6p6M05l89J23PL06m96n3l3K79rk9j45JLK8J34j38J10k37K38
$$ plain form
7565 -119 52 -197 -74 -111 -303 212 -107 56 10 110 -98 -49 18 262 -161 12 133 -64 -21 107 -187 -279
7587 -279 8 -59 -15 170 -202 -58 95 -304 -312 67 14 -41 19 -205 112 -26 -92 -66 16 -177 -39 -71 -279 -223
7611 -223 132 76 -214 30 51 -78 268 -64 60 20 -11 181 122 -194 -14 -180 116 117 -80 127 9 138
7633 138 353 -299 -47 9 129 349 99 -173 31 10 6 60 -194 179 -80 -52 -15 301 -44 246 54 73 -39
7656 -39 89 -28 -51 -19 87 -87 -134 47 -52 -244 190 -12 4 -95 -178 128 -63 20 242 -46 -277 102 23
7679 23 1 102 -73 27 107 -217 -272 -81 157 64 -85 -157 76 411 -18 -37 102 51 -55 -191 -105 -115 -70 107
7703 107 65 -41 -70 43 3 38 -161 -31 5 -54 -133 62 -87 -17 94 12 65 29 77 -193 -100 112 82 -8 23
7728 23 315 123 73 -3 -79 326 -63 60 67 373 -123 -176 -209 70 61 32 -113 -112 -109 -81 53 -85 25 -212 26
7753B6R2q6l03J93k02L37j64J80j37J82k08J14l1L0m8P5Q9j32j39J73j9j04k10
7776b92N10j30p2K42q7k15moK51j95K94l31r6j24J61N0K3M5j08J69j12J24n5j4
7800B8k0j74J91K9j11J24O1K50m21p7k0K16q1J09K9k71l7J39K12k59N5r9o0L44
7824A57k74R5O2m8j30L4J72k97J46L1j04K60o9N9p8J6j72L1J29O0j58k4K54n5
7848I7j02J76j85q8L14l93Q6J95R6K2n9j46kJ35j38j84J38k76L38J57l9q6k59
7871b03L96l64K24l50M29m1NL3j52K73k88J14K6j02J69J04m05K05m53M62J08l63
7893a73M11k07j28J12j27P7j56P2J13j94K31J97k17l9o4K3J43k1o3j7K6P8j5j71
7917a09J59J54n58L47K05l95J18K58k30o9o0J11O4j07Q8J59k33Q0p4J27%j55K20
$$ plain form
7753 26 118 32 -271 -78 -280 57 -107 73 -64 118 -90 24 -7 23 -25 50 139 7 -132 41 22 -82 -292
7776 -292 218 88 16 258 171 -44 -48 -54 197 2 296 -35 -131 -255 -94 -44 -21 24 -84 85 -27 97 42 28
7800 28 8 -166 25 54 -57 67 128 378 -43 -120 -140 76 -5 104 133 -138 -175 -36 176 -83 -28 -127 -187 157
7824 157 -117 -22 40 -8 -138 -104 68 -229 -83 -52 -156 104 35 94 16 32 -140 -109 20 80 -78 -102 152 97
7848 97 -5 171 -14 -102 212 -181 -95 100 196 218 159 13 11 146 8 -176 -38 -314 24 181 142 56 -203
7871 -203 193 -171 53 -297 132 91 96 129 -23 250 -38 76 102 0 169 273 -132 73 -380 82 190 -173
7893 -173 238 31 -97 15 -112 -35 -191 -119 -6 -200 31 228 11 -28 -92 -69 74 53 -10 -27 -1 77 62 -109
7917 -109 50 204 -354 -7 198 -197 -79 179 -51 -120 -180 -69 -5 -112 -24 135 -98 -18 -92 35 35 -120 100
7940A00k48J00J68Kj35j61M28o5J63l88K0p7J93r5p2J71O8k3j57j17J68q8j9K85
7964B21j39j15K67l10n8N2o8J63R3q0j12N9K68m3j99L4KRo6n7K24p8K1K9m6j3
7990E8k8m2Q9P0m03K63r9M2K0p7J8J2J74p7J45j85J38k0p1krj86J70m8J52k90
8016a86M24r8j48j7J79Q5m44M9K69j13q2J62m4N4k07q6O5qL82k10K12l28J14m8
8040b4n0J17k04Mj76K17r9K80K6j48R9Ok1K34j54j35n2N6J71j69J4j91J21l2K8
8065h2r2K10l8R6j02j70J01K15J10q9k18k49L24J83k99J08p5p6K02pl9O9J87m87
8089b18L04j38J63k24L57l13o5K31j06j96J38j15j06L00r3L64p2q3l51K15j61
8110a69L56j63j89mK06j6L9n9K30k5j61l8J1q4J16o9J09k1j83K55j29j14J22p5
$$ plain form
7940 100 -148 -48 120 122 -13 -174 254 189 352 -36 -16 -93 100 5 -67 104 172 149 -8 -125 43 -45 -64 221
7964 221 82 -33 234 -76 -134 -82 -150 13 106 26 -86 -27 241 198 -1 33 35 44 -22 -79 145 67 88 117 71 58
7990 58 30 -12 77 147 -256 7 -92 -50 -30 -107 -89 -77 97 20 165 -20 118 98 27 25 16 -170 0 -48 104 -186
8016 -186 238 140 -8 -25 154 239 -205 -156 113 0 -82 80 36 90 -117 -203 -138 -146 236 26 238 -90 24 -24
8040 -24 -74 43 -161 -157 -333 -116 -215 65 91 -57 42 48 27 261 107 -28 -80 -24 147 -22 -8 -199 -78 -110 -82
8065 -82 -174 36 -2 94 -8 -178 -77 138 248 159 -59 -308 16 199 -100 8 -67 -143 59 52 13 82 269 -218
8089 -218 86 -52 111 -113 244 -69 -134 97 -9 -205 -67 -182 -288 12 -81 283 211 128 -223 -8 -169
8110 -169 187 24 -165 -169 37 21 60 1 231 206 45 7 18 -66 50 -19 90 69 -114 141 12 -102 20 -55
8134e5j39J91L00o20J97M6J7j42J91j0J35P4J16l97Q5p7J84j56J74k20J61k93
8156b38N58O5l33j4L9K25l21mQ6J12k24J12N9j52jN3n2p8J26j30Om3K63j39q5
8181a10J51k01J85k9J10J40l21NK22n0
$$ plain form
8134 -55 -194 -3 297 -323 -126 -80 -63 -205 -14 -24 111 185 301 -96 -11 -88 96 -60 114 -106 55 -238
8156 -238 320 385 52 38 77 302 -19 -23 63 175 -49 63 122 -30 -31 22 -30 -108 18 -112 -106 -149 114 -25 -110
8181 -110 41 -160 25 -4 106 246 -75 -70 152 102
8191A02
$$ Imaginary data points
##PAGE= N=2
##DATA TABLE= (X++(I..I)), XYDATA
0@%%%%%%%%%%%qJ6j6J6k1K9l2M0m8N6p2Q8j04J20j38J62j92K23k55K89l30L78
33B01m26M81n44O12o86P69q61R57j063J181j308J447j601J770j953K151k369K611
51A369k878L170l495L860m270M732n259N871o586P437q467R746j1388J3576j6658
66i240K1360k9486M7429j61593O9154J51357k53552J29975K09193j77724j32169
77a35296K50271k111j89386J28247J55463k02327o9354J65438n6816j72078J09177
88a8772Q6233j54722m4160J39104k8701j03078R8718J09951r2188l6505J20899
99G6779J927j11771O5574J08432j03213q2746J04814k3933j58156O0081J23241
110F1029j16463n2079J56873k5351j50792J10464J17878j34988p769J64441p5927
$$ plain form
0 0 0 0 0 0 0 0 0 0 0 0 0 -8 8 -8 8 -13 16 -16 24 -24 32 -40 48 -56 64 -74 88 -104 119 -136 153 -177 201
33 201 -225 256 -288 324 -362 407 -454 503 -560 621 -687 760 -841 929 -1024 1127 -1242 1369
51 1369 -1509 1661 -1834 2026 -2244 2488 -2771 3100 -3486 3951 -4516 5230 -6158 7418 -9240
66 -9240 12120 -17366 30063 -131530 -62376 88981 -164571 -34596 174597 -3127 -135296
77 -135296 114975 112864 -76522 51725 207188 4861 -64493 100945 44129 -127949 -18772
88 -18772 67461 -87261 -131421 7683 -21018 -124096 -25378 84573 -7615 -44120 76779
99 76779 78706 -33065 32509 140941 37728 -45018 59796 35863 -122293 -62212 61029
110 61029 -55434 -107513 49360 24009 -126783 -16319 101559 -33429 -41198 123243 47316
121D7316j38537J24260N5282j46238L9907J33551j10869r2352J11927j1407j21315
132a08475P6394R5814q6424j7966R5935l6102p6362O3317M0302o1420N305N5362
144D5680l1458m1658L2859J6171l5203l244K8580r830k9266J5403K9905j6100
156A839j5086L1800R23m6665Q553L8729k8358j5597N3854m500n5321K6983L1495
169B8649n2803J615O4460k7976m2856N1343K361o6961K7903M7943n3595j1426
181c1343O2868k7361m9012N4709K0041n6880K4513M8476m9128k2295N3395j4801
193A3182m4800L9543K2246m9061K152L7632k8972k4785L6641N507l1028J3237
205h506K5447j7914r543K5120O274j9448J630J5625j1444k1223J1280J3909k2937
$$ plain form
121 47316 -91221 33039 88321 -57917 -18010 115541 4672 -87680 24247 12840 -108475
132 -108475 -32081 63733 -22691 -40657 55278 19176 -57186 6131 46433 -14987 -9682 45680
144 45680 14222 -27436 5423 21594 -13609 -16853 11727 1897 -27369 -11966 17939 1839
156 1839 -13247 18553 19476 -27189 -18636 20093 -8265 -23862 29992 25492 -29829 -2846 28649
169 28649 -24154 -22539 41921 13945 -28911 22432 24793 -42168 -14265 33678 -19917 -31343
181 -31343 31525 4164 -44848 9861 29902 -26978 -2465 46011 -3117 -25412 27983 13182
193 13182 -31618 7925 30171 -18890 -16738 20894 -8078 -32863 3778 9285 -21743 -8506
205 -8506 16941 -973 -10516 14604 20878 1430 3060 18685 7241 -13982 -2702 11207 -11730
218a1730r545K7424m835l1541K1372K8719l1316o315M6626j1901m0749L5709K3285
231C5203n1012K537N0325l2345l8596M7047P083n7591K0091M4724m2799j9351
243c4684N4374n497m5272L3564L1643m1610n486M3043j5964l3857K6527J4968
255B1749l5140k499K8896j3040k3516J8874J4664k1230l821K5829r05k1485J2261
268F37K0025j8822j3017K5604J041l0592R551K4039k4797j5805L2189p77l3210
281b3934J8002K6048k9642q754L6507p250l0255K4480J7928l2325j552L1035j5536
294D752k3665K4231P515k8188M872K2370j5177j2848K1157L952j8412O405J5527
307A2491j0453q424J2840K584j2888R95J0557o692q925P331M943j0585j024J1185
$$ plain form
218 -11730 -21275 6149 1314 -30227 -8855 19864 -11452 -17767 28859 16958 -23791 11918 35203
231 35203 -15809 -13272 37053 4708 -33888 13159 20242 -37349 -17258 27466 -15333 -34684
243 -34684 19690 14193 -31079 2485 34128 -7482 -12968 30075 14111 -19746 6781 21749
255 21749 -13391 -15890 13006 -34 -23550 -4676 9988 -11242 -15063 10766 9861 -11624 637
268 637 20662 1840 -11177 14427 15468 -15124 -5573 18466 -6331 -22136 10053 9276 -23934
281 -23934 -5932 20116 -9526 -18280 18227 10977 -19278 5202 23130 -9195 -10747 20288 4752
294 4752 -18913 5318 12833 -15355 -10483 11887 -3290 -16138 5019 8971 -9441 -3036 12491
307 12491 2038 -6386 6454 9038 -3850 -2855 7702 1010 -7915 -584 4359 -6226 -7250 3935
321C935l388q602P994P410r599j136J1416l633r449P921M311j1037j35Q932n362
336d22o540P936J863p915K726N931m837k880O209k15m318K992K951k949p2K540
352C000r70j854%l32j503p44pJ27O53M69R22J568Q24m10L09J116j742j939M96
371a7o25k151J84K851j023j570L530J203l667O18L650l408k756N155K50n293L564
388D95M415n183j049O026l343o448M620Q51p275K144O890m417j425Q612o29n258
404i74N704K955p971k7N063o378m558O367q52n862M567M147n076n3N928j999l563
421b582M201K340m312J00M753j156l582K255K628n072l724M309o43p578K890P290
437B117o396l063J2184L54j0623Q874R757j3757l146J6032p536j6246J4589O410
$$ plain form
321 3935 547 -8055 -61 7349 -2250 -3386 8030 4397 -5052 2869 7180 -3857 -3992 4940 -422
336 -422 -6962 974 2837 -5078 -2352 3579 -1258 -4138 2071 1856 -2462 530 3481 532 460 3000
352 3000 2030 176 176 -156 -1659 -2403 -2410 -2283 -1630 -1161 -239 1329 2153 1743 2052 3168 1426 -513 -17
371 -17 -642 -2793 -2609 242 -781 -2351 1179 2382 -1285 -667 2983 -425 -3181 1974 2224 -3069 495
388 495 4910 -273 -1322 4704 1361 -5087 -467 384 -6891 -4747 2143 -2274 -3699 4913 4284 -974
404 -974 4730 7685 -286 -313 4750 -1628 -6186 181 -671 -6533 -1966 2181 -2895 -2948 2980 981 -2582
421 -2582 1619 3959 -353 -253 4500 3344 -238 2017 4645 -427 -4151 158 -485 -8063 -5173 2117
437 2117 -4279 -7342 4842 5196 -5427 3447 13204 -553 -3699 12333 4797 -11449 3140 9550
451I550k1983L151K0037j4849j2949K3440J660k3301J2257J9085k0469o536K6569
464A5662n650k2135J6789J2641k4740k474K2595r926j9239J6909R100k1664pK1520
478I381p310j5861J5904J1374j8700k938K1509m523j9804J4215J4470k2752p753
491a2788K4863n934k6103J7884J8627k8724n962L3371r911k8529K7338J8276l5719
504a3311k4L6418j8964k7233L4339J1683l9224P820L3265k7499k1541L6170K785
517A4684l5943J5114K6626k9539j3653L2908j469k7093J7781K2111k3666j0245
529a2384K5485k248k4221J1522J9427j8795j2826K2564J748k5076P442K1600j7536
542c298j6549K4754M656k7769J0361K7534j9733j5288L0220J730l2123J4709K5288
$$ plain form
451 9550 -12433 -9282 10755 -4094 -17043 6397 8057 -15244 -2987 16098 -4371 -10907 15662
464 15662 10012 -12123 4666 17307 -7433 -9907 12688 2762 -16477 432 9532 -12132 -12139 9381
478 9381 2071 -13790 2114 13488 -5212 -8150 13359 8836 -10968 3247 17717 -5035 -12788
491 -12788 12075 6141 -19962 -2078 16549 -12175 -18137 15234 5323 -23206 4132 22408 -13311
504 -13311 -13335 23083 4119 -23114 11225 22908 -16316 -8496 24769 -2730 -24271 11899 14684
517 14684 -21259 -6145 20481 -9058 -22711 10197 8728 -18365 -584 21527 -2139 -12384
529 -12384 13101 10853 -13368 -1846 17581 -1214 -14040 8524 10272 -14804 -7362 14238 -3298
542 -3298 -19847 4907 9563 -18206 -7845 19689 -44 -15332 14888 16618 -15505 -796 24492
555B4492k7122j2014L0686q030l1339J9868J8094k8709j704K9633j3303k1328
567b0776K3435J0377k2719P607K1942j4481j3157J6381N9j6803O621J2585r930
580A141p558Q019k260j1856J551Q540p20k597P297O667o151l317Q343m21r218
595b540N002P831r222l924J0261m204j2528O264L271j2966J915J3298m636l509
609e687J3297j138j0945O335N302r765L961J0982p826m694P611p111j0806Q519
623a965K347j0141O612P465j1308j461J2607m992o146J4445K616j2301M921P476
637A0175j2045k851J2638l466r896P273K995j2745r98R148l648n006P967M981
651D522n340o51O985r33o902J757O764m755n623R460L666j2267n80J0302j0489
$$ plain form
555 24492 -2630 -14644 16042 8012 -23327 -3459 14635 -14074 -15778 13855 552 -20776
567 -20776 2659 13036 -9683 -2076 19866 5385 -7772 8609 8668 -8135 -1514 11071 1141
580 1141 -6417 1602 -658 -12514 -10963 -2423 -3143 -5740 1557 8224 2073 -1244 7099 6678 -2540
595 -2540 2462 10293 1071 -2853 7408 3204 -9324 -3060 211 -12755 -10840 2458 -2178 -5687
609 -5687 7610 6472 -4473 1862 7164 -2601 1360 12342 4516 -178 7433 322 -10484 -1965
623 -1965 382 -9759 -3147 4318 -6990 -8451 4156 -836 -6982 7463 10079 -2222 2699 10175
637 10175 -1870 -4721 7917 4451 -5445 1828 4823 -7922 -8920 228 -3420 -8426 -459 4522
651 4522 -818 -1469 5516 4583 -2319 -562 6202 1447 -4176 5284 8950 -3317 -3897 6405 -4084
666d084j1545J5081O045j5206P496J7136j5951j1502J8846j75j9980J3714J8010
679A7885j8847o294K1178q707k1018J5368J1415k0733O35K0719j0178j5497J6345
692B271O807j7520K621J6731q489j1320J2655N631j3847l5J3198n122j2194Q673
706F0Q489j2666m191J4866k037j5635Q496J2357j4194n547J9319j953j8774J0679
720g31J3991j8678m261K2226o113j9556J4576R949k1253l56K1957q639j5414J7140
734D838O455k0561K423J7273j0760j0384J5993L666j5424L131J2272r206q123
747h407J1363L160j1626J056J0791n153q718Q490N669j0428j774J1886k509j1535
761g735Q206Q215j2248l392J3431l533j2406R830Q528j3998j092J4192n865j1475
$$ plain form
666 -4084 -15629 -548 5497 -9709 -2213 14923 -1028 -12530 6316 6141 -13839 -125 17885
679 17885 -962 -7256 13922 5215 -15803 -435 10980 -9753 -9118 11601 1423 -14074 2271
692 2271 9078 -8442 -5821 10910 2421 -8899 3756 9387 -4460 -4495 8703 3581 -8613 60
706 60 8549 -4117 -8308 6558 4521 -11114 -2618 9739 -4455 -10002 9317 7364 -11410 -731
720 -731 13260 -5418 -9679 12547 6434 -13122 1454 11403 -9850 -10206 11751 3112 -12302 4838
734 4838 11293 -9268 -6845 10428 -332 -10716 5277 8943 -6481 -3350 8922 -284 -8407
747 -8407 2956 6116 -5510 -4454 6337 1184 -7534 956 6625 -3803 -5577 6309 3800 -7735
761 -7735 471 8686 -3562 -6954 6477 2944 -9462 368 8896 -5102 -6194 7998 2133 -9342
775i342J1771N395j3621J920J2175p837p825J0818J984j1276L572Q483p684m162
789e629P915L16p183L093N468m493k697N479O20m142M43L806j530l770K287K753
805B736l949j836M307k56m782K329M169m077k179O174l36n153L680L570n024q64
821a491N051j835m352L526J412m818Q70K952k408j573K675L17k152J165J297p45
837a09L89O29mQ23k93p89N52O6k129K47J573k733o96K578l23k850K735J955l067
856a446O62L136j440j952K728O53k919M28K680k336j518J827N3k462O44J568j307
873a001j129J307J024j167K02K015J98j258P17J543j525j258J691k19k785O96
889i49J856j961j327K371M19k562J396K286k182o02K385M8k358J861J252j978
$$ plain form
775 -9342 2429 7824 -5797 -3877 8298 461 -7364 3454 5438 -5838 -2266 6217 -1467 -5629
789 -5629 2286 2602 -4581 -1488 3980 -513 -3210 2269 2889 -1253 -810 2996 1466 -2304 -17 2736
805 2736 -1213 -3049 1258 1002 -3780 -1451 2718 -1359 -3538 2636 2300 -2853 827 4397 -627 -1491
821 -1491 3560 1725 -2627 899 2311 -2507 -1637 1315 -1093 -2666 9 326 -1826 -661 636 -109
837 -109 280 909 905 1728 1435 646 1198 1264 -865 -618 955 -1778 -2474 104 -219 -3069 -334 1621 -1446
856 -1446 -784 2352 912 -1040 1688 2341 -578 -150 2530 194 -1324 503 556 -1906 -1262 306 -1001
873 -1001 -2130 -823 201 -966 -764 1251 1449 191 908 2451 926 -332 1359 1140 -1645 -949
889 -949 907 -1054 -2381 -10 409 -2153 -757 1529 -653 -1255 1130 1178 -1180 681 1933 -45
905d5l38K069j045k090J337L16j548K27J525r07q86J026O84r88P86P93l27n29
923F0N59l24k01J68po0l33k20L3L2l37J23M82K39m44R5K66J44n10N76O67p35n06
946b33K82k89q30J097M39q33l85J254o23j129J309J273j290k16J440r45j372J149
964I8P69j426K04J142j249j408J264M45j016O53J775l93j781R06J124j211M5K068
982B009k31k335M19R20k112n64K767k49k366J029R52k155j49L222q9j581J591
999A078Q26k591K32K367q90j176J768l75k841J47R08p33n9J495m5j394M35L36
1017e12nP01J220K16K38j135q05O40k44kL93L22j740r57M15m92n19J829J075j071
1037d33j57R40l72n40K228R30j152k73J20j156j344P93Q68m54r59K79l98j413
$$ plain form
905 -45 -383 1686 641 -1449 -112 204 -1344 -1117 408 -499 -1385 -359 325 -663 123 916 589 60
923 60 619 295 94 262 255 195 -138 -358 -325 -293 -630 -507 -25 214 -230 -135 131 275 -235 341 1008 273 -233
946 -233 49 -240 -1070 27 466 -367 -752 502 -121 -1250 59 1332 42 -174 1266 321 -1051 98
964 98 867 -559 -355 787 -462 -1870 -606 -161 -1177 -524 1251 858 -923 -17 1107 -104 -59 2009
982 2009 1778 -557 -138 782 -1330 -1894 873 624 -1742 -713 239 -1916 -2065 1157 1068 -513 1078
999 1078 1904 -687 -455 1912 1022 -154 1614 1239 -1602 -1455 -547 -1280 -1339 156 111 -1283 -848 -512
1017 -512 -517 184 1404 1620 1858 723 -82 558 314 312 705 1027 -713 -1670 -1255 -1747 -2266 -437 638 -433
1037 -433 -590 350 -22 -562 1666 2596 1444 1171 1291 135 -1209 -416 452 -2 -961 -682 -1080 -2493
1055b493K6K454O9q55J881J034k726m46L759r64k056K690J278n254m67L627k331
1072g74k696M391Q90n556R04M560l263j887N888P51n103K207L546m340j404N261
1088C375j32n058J796K622m547k280M860N34m179J862L457l476k659M833J420
1103B428m097J598N146m053l818M652J358o106J506N809m455m574N881R24p254
1118e055K751O193n054l659P249P55p210L538O052n987k826O643p91o466L903
1133C6M752n855k111N556j466n600L189M563m624j106N239m96n026K193M319l763
1149b00k082N139M33n806J006M919l977l070N771R38o432J176N476m824l083O284
1165A668J158o189K533N539n014l035N946m27n797L236M618n093j726N445j242
$$ plain form
1055 -2493 -2467 -13 56 -799 1082 2116 -610 -1056 2703 1739 -317 2373 3651 -1603 -2070 1557 -774
1072 -774 -3470 921 1811 -3745 -2841 1719 -1544 -3431 2457 3208 -1895 312 3858 -482 -1886 3375
1088 3375 3243 -1815 -19 2603 -1944 -4224 636 1170 -3009 -1147 2310 -1166 -3825 1008 2428
1103 2428 -1669 -71 5075 1022 -2796 1856 3214 -2892 -1386 4423 -32 -4606 1275 2199 -5055
1118 -5055 -2304 3889 -1165 -4824 2425 3180 -4030 -492 5560 -427 -3253 3390 2599 -3867 36
1133 36 4788 -1067 -3178 2378 912 -4688 -1499 3064 -1560 -2666 2573 2077 -2949 -756 3563 -200
1149 -200 -2282 2857 3290 -2516 -1510 3409 -568 -3638 2133 3071 -3361 -2185 3291 -1533 -4616 1668
1165 1668 2826 -3363 -830 4709 -305 -3340 2606 2179 -3618 -382 4236 -857 -2583 2862 1620
1180A620n045K546K908l770q92M493r7l430J400K146k856j505L375R83k419P45
1196B02K474j717k977K411J105l087O5L781j311l125K283J734l820JL734j468
1212B85k796L403J539l534M9L234j928k393K966R01k564L99J892j672j342J480
1228h1L08j237L07J356l09j083K08J220o49r27J094J526j735r14K225m16k894
1245b001J602K181k336q12L253q48l160J965J746l164m34L687j019k787K713J399
1261A985k983l67K687k56k386J658J698k172j221K843l97k568R83J996j673j718
1277a891K490N50l215N92L222j569k202L012J508l835J57M138k532k963M046J079
1293B587m644J090L966l582l029M726M80m949J979M161l180k432M707N46m561
$$ plain form
1180 1620 -3425 -879 2029 -1741 -2633 1860 1763 -1667 -267 1879 -977 -2482 893 1876 -543 202
1196 202 2676 959 -2018 393 1498 -1589 -1524 2257 946 -2179 104 1838 -1982 -1981 1753 285
1212 285 -2511 892 2431 -1103 -1054 2180 252 -2141 825 1726 -838 -439 1453 -219 -1561 -81
1228 -81 227 -1010 -703 653 344 -739 -531 689 40 -887 207 1733 -2 -916 1309 893 -2001
1245 -2001 -399 1782 -554 -1366 1887 1039 -2121 -156 1590 -1574 -2008 1679 660 -2127 586 1985
1261 1985 -998 -1365 1322 1066 -1320 338 2036 -136 -1357 1486 1089 -1479 -496 1500 -173 -1891
1277 -1891 599 1149 -2066 -1474 1748 179 -2023 989 2497 -1338 -1181 2957 425 -2538 1508 2587
1293 2587 -2057 -967 2999 -583 -3612 1114 1594 -3355 -1376 2785 -395 -2827 1880 2426 -2135
1308b135J660M114l249k558M379R8m491J223L365k911k544L598N66m160J131M194
1324B280k219l024M280J195m490R24M738k848k975M212J077n185L71M537l756
1339h83l240M894J159n418J847M354l449k382M820M86m308J853M060l372k243
1354a822L957K05m579J497L144l146j976L661l1l414J320K865k095j770L377N72
1370A765l217J158L183k410j892L094K29l617Q51K705k106k276K946N10l105J025
1386a157K801k150j656L465J85k867J446K199k418j129K934l46k677J154J599
1401A383k022o76J909m71j322P19J438j406l07J187L04r99J17J203q38n93J108
1418G34l9j190M4R70n12r42J068N0j003K91O99k02p20Q08P63j213K72J125p76
$$ plain form
1308 -2135 -475 3639 390 -2168 2211 2309 -2182 -959 2406 -505 -3049 549 1115 -3045 -1914 2280
1324 2280 61 -2963 1317 2512 -1978 -1054 3684 836 -2139 2073 3150 -2035 -1664 2873 -883
1339 -883 -4123 771 1930 -3488 -1641 2713 -736 -3118 1702 2188 -2120 -267 3793 421 -1822
1354 -1822 2135 2340 -2239 -742 2402 -744 -2720 941 910 -2504 -1184 1681 -414 -2184 1193 1765
1370 1765 -1452 -294 2889 479 -1413 1681 1910 -1707 -856 1849 -257 -2533 413 923 -2182 -1157
1386 -1157 1644 -506 -2162 1303 1488 -1379 67 2266 -152 -1281 1653 1307 -1370 -216 1383
1401 1383 -639 -1315 594 123 -1199 -480 958 -448 -755 432 736 -263 -146 1057 219 -374 734
1418 734 695 -495 -451 519 7 -935 133 183 -820 -529 170 -32 -752 56 819 -394 -122 1003 227
1437B27n62N71N99q90k34R10n30n41j75M40r6j4K33J64J22j54O7j0j42J13M52
1458E50k27n24K76J3m30n7P81n80k37Q00j78n10M9R62n73l87M67K62r14M76L69
1479C88n57N7K85jr12K60O04m85J98L67Pm15J67L40j96O3O85n2q91j91M37m98
1501c40k30N35k35L2j75k0k75K75O28K10J12j13k6l43k6K90j29J87m9k22m25j12
1523d51q3J08K44J24j3J11Q1n05L12M88N48n07K30k82p22k18P72o2j81R5j94m56
1545e61m99R80j07k91Q75J45o73o9L59jn0K93O34j189K2O87p21p08R16O53j294
1566e99R0Q42n81r89J362K49n65Q8J092p57j027J239N69j009K65P50r23j120P74
1585b50K98o67N96O07o98j121R09O30q19L35J042o76r10Q47M73j031L28J594j144
$$ plain form
1437 227 -335 236 835 -55 -289 621 91 -450 -625 -185 -281 -295 -62 102 224 70 137 127 -15 98 550
1458 550 323 -201 75 88 -342 -399 382 -198 -435 365 187 -323 -274 688 115 -272 195 457 -457 19 388
1479 388 -169 -112 173 172 -740 -480 124 -361 -163 204 211 -204 -37 303 107 170 855 803 -88 -279 158 -340
1501 -340 -570 -35 -270 -238 -413 -433 -708 -433 195 405 517 404 378 35 9 299 170 357 308 86 -339 -451
1523 -451 -534 -426 -182 -58 -71 40 121 -384 -72 416 964 457 687 405 -317 -535 237 175 -6 89 -105 -561
1545 -561 -1060 -80 -187 -478 397 542 -131 -200 159 158 108 401 1035 -154 -132 555 -166 -874 42 695 -599
1566 -599 -509 333 -248 -1237 125 374 -191 -103 989 232 -795 444 1013 4 269 1019 96 -1024 -250
1585 -250 48 -619 -23 584 -114 -1235 -326 304 -515 -180 862 186 -724 123 596 -435 -107 1487 343
1604C43j092J113L8j280L5J458o68o36P96L9j333M72J325n00n37R94O3j271K83
1623c58J069p46n0N12J46j258K17M91l10j55O23K18j165J70M07K9j90O64K61o19
1643d4Q1K89k17k65Q29J07p31m8j58M4m79jM50Q0j69J38j34q5J64K35M0J92LR8
1667D19j23o46K22N40L4m84K72j7p79k40J064n21l53O20K88r08L28R51m21n37
1687b91R39Q6j040L7J150o71o69R80L10j583J41J255j178l46J493J37j366K57
1705c59J307j334q23J827L39j506M44J457j345j228J720K52j741L14J874j190
1721Hj389J905M53k201O22K142j909j327K414N97k763R33K507k076j160K746L3
1738A535k763J028K147k145j526K604q9k746J244K286j848j380K451P1k579J244
$$ plain form
1604 343 -749 364 402 -878 -843 615 -53 -689 107 146 -1187 -715 610 110 -427 567 630 -641 -358
1623 -358 711 -35 -85 427 573 -685 -468 23 -287 -442 181 399 -766 -596 -189 -160 -350 314 575 -44
1643 -44 37 326 109 -156 673 780 49 1 -157 -113 -592 -593 -143 -63 -232 -94 -228 -313 -149 86 126 318 321 419
1667 419 296 -350 -128 412 446 -38 234 217 -562 -802 262 -259 -612 8 296 -612 -284 667 246 -291
1687 -291 648 734 -306 -269 881 210 -459 521 831 -752 -611 644 -534 -880 613 750 -616 -359
1705 -359 948 -386 -1209 618 957 -549 -105 1352 7 -1221 499 751 -990 -676 1198 8
1721 8 -1381 524 977 -1224 -602 1540 -369 -1696 718 1315 -1448 -515 1992 -84 -1244 1502 1535
1738 1535 -1228 -200 1947 -198 -1724 880 791 -1955 -711 1575 -273 -1653 798 869 -1710 -466
1754d66K199j893j136K944j20k736R79K036j880j302K676k00l091J220K412k105
1770d63j780L204J8k818J485K492k429j097L199j21l232J449K442k642j195K672
1786A184m47k978J778J822k419j246L223k23k624J830J862k452m25K804k58k358
1802i27J456J677k527r88K584m94k745J571J494k242o61K332l68j743J406J583
1818A408j547o79K197j64j992J317J098k062l37J937n77k192J239J170j860m73
1834a517J809l06j281J364J073j640k61K144n19j228R29P64j612j69J277p50j188
1851a111J029M17j047k98J012p0p55R87M52m43k85R98j63j013N34K74m60r9N22
1870D81j29o20J6J45m67J84K69J24k20J06l6n5K31M5J11J2P3R7k26J1p8Q3J31
$$ plain form
1754 -466 1733 -160 -1296 1648 1528 -1208 -229 1807 -73 -1375 1301 1101 -1990 -770 1642 -463
1770 -463 -2243 961 979 -1839 -354 2138 -291 -1388 1811 1690 -1542 -93 2349 -293 -1488 1184
1786 1184 737 -2241 -463 1359 -1060 -2306 917 694 -1930 -100 1762 -690 -1115 1689 1431 -927
1802 -927 529 2206 -321 -1309 1275 781 -1964 -393 1101 -1141 -1802 530 162 -1581 -175 1408
1818 1408 -139 -818 1379 1215 -777 540 1638 -424 -761 1176 599 -1593 -354 816 -1044 -1517
1834 -1517 292 -14 -1295 69 1142 -498 -759 1385 866 -362 567 1331 -281 -450 827 77 -1111
1851 -1111 -82 335 -712 -1010 2 -68 -823 164 616 173 -112 886 723 -290 244 518 58 -41 481
1870 481 352 -268 -252 -107 -574 -390 -121 3 -217 -111 -147 -202 29 74 185 197 270 367 141 152 74 157 288
1893B88k41k52K78J27o48K80K91l41O0M83l12n43N74L50n98j06J085m71n64N59
1913B99O02j224p0R42m39q27P02L84r19o5Q36k22q92Q01Q44j092Q5J148m17j019
1933e43J195L97j521K75J124q30r37R43M20j120j97J179o07o50R69Q23j599M03
1951b76J354p55j211J484K33j351o5J362o98j218J214O62j544kJ428o96o43R74
1969B52M51j303r8J589p63p81P21Q43j177J41Q09o18q46Q88O06j513K77J334p78
1988C4p94Q84N34j352L60J201r39n98J114L4q56L6R50o62n76J098oj054J04J016
2008E28n29q10R81L54j000L58O43o86n71P04J62o10L86N90n17m79R32j4n78j40
2028b96J056p05o49Q75K70p62j39P70p74k30R52k12o03J65O79n29l68P80o1n46
$$ plain form
1893 288 47 -205 73 200 -448 -168 123 -218 -158 325 13 -530 44 394 -204 -310 775 304 -260 299
1913 299 901 -323 -393 549 110 -717 -15 369 -550 -615 221 -1 -893 -92 752 -340 -255 893 476 -543
1933 -543 652 1049 -472 -197 927 97 -840 103 523 -597 -794 385 -222 -872 97 920 -679 -276
1951 -276 1078 323 -888 596 829 -522 -587 775 77 -1141 73 735 -809 -811 617 -79 -722 252
1969 252 703 -600 -698 891 128 -653 68 911 -266 -125 684 66 -780 108 714 -799 -522 812 34
1988 34 -760 124 658 -694 -334 867 -72 -670 444 478 -378 -342 608 -54 -630 468 462 -592 -488 528
2008 528 -1 -811 170 524 -476 -118 525 -161 -732 -28 134 -476 -90 500 -17 -496 436 422 -156 -296
2028 -296 760 55 -594 281 551 -211 -350 420 -354 -584 368 156 -447 -282 397 -132 -500 280 219 -327
2048c27M34M35l36k26L89j68n08J28N87k69n57P11n06k48M23Q8k00L68j08J71
2068B81m80K86K60j31k75M12j68k28q6K79m9j05j22j5j06J93O7m21M00Q7o0j45
2090a26M2J83j81L34j88J6J07j45J32n16J56K54l11L6k7J74m1J44q4M1j45L76
2112B31k71k9K43o7K6Q8j57K62p6K6j23l37J27l13K04j80J62J46p2NJ67R0j00
2135E2J63j42j49J27J05M6k14j2J50j77j63J98J09m38J79K03k50NL06J30p8M5
2157A95J26l37N1J71L2j96K32R9k63m72R3J24k91j98R07l34m91N28j85j71L97
2178A7O89m45k16M93k16n24M41O7n22P0J54j80k44mM54l91l58O80J02n06N23N42
2200F26n01j62O07J53q35K59J21k38k89O97m54m44K58J36k94j00N93k13m09N60
$$ plain form
2048 -327 107 542 206 -20 369 201 -307 -179 408 139 -418 293 -213 -461 -38 50 -150 218 110 281
2068 281 -199 87 347 216 -59 353 185 -43 -129 150 101 -4 -126 -141 -247 -54 13 -408 -8 79 19 -126
2090 -126 -84 99 -82 252 64 80 187 42 174 -342 -186 68 -243 -207 -234 -60 -101 43 -41 0 -145 231
2112 231 -40 -69 174 107 133 221 64 326 250 276 153 -184 -57 -370 -166 -346 -184 -38 -110 -105 62 152 52
2135 52 215 73 -76 51 156 202 -12 -24 126 -51 -214 -16 93 -345 -166 37 -213 -208 98 228 150 195
2157 195 321 -16 35 206 238 42 274 373 110 -362 -269 -145 -436 -634 273 -61 -552 -24 -209 -380 17
2178 17 706 261 45 538 322 -202 239 306 -216 -146 8 -172 -416 -420 34 -357 -715 -35 67 -439 84 626
2200 626 125 -37 570 723 -112 147 268 30 -259 438 -16 -460 -202 -66 -360 -460 133 -80 -489 71
2220G1K87l98J3N76j95o31M89L52n32l12L91K08q86M08N85q28n0K56K04m92J90
2241b94M90m65l0P76q5o61L14P20q70j90R81m20p68N75K38p24k13N56k7m26M55
2262f8K68o52K83O00k54n28O09P8m43N1L27r1n25M65j0k27j25K89l39m23N64L32
2284A81m97L27L12k27k94K39R8j78J19K1J20n27O82l7o12P5ln9L1J27L4k94J0
2307c52K51r1p5L75J09j34J37q0K9O3l2N2k29j61j47J29J5j84J6L06o1j91q1N13
2331A77k88P1M25m08J98K64L0l48J37j54j34M2n9r0m5r3J12j15k30N74L95p82
2353c21K07O29n55k87O30J98m87j91N22k31n07N19k31l36M6M11k56m66M39N10
2373B43n15%O05k06m38N80K14n85p6J175p09o01Q34k7p82m6N39j61p55O38L73
$$ plain form
2220 71 358 -40 -27 549 354 -277 212 564 32 -280 111 319 -567 -159 426 -402 -452 -196 8 -484 -294
2241 -294 196 -269 -299 477 392 -269 45 765 -105 -295 686 266 -502 73 311 -413 -626 -70 -97 -523 -68
2262 -68 200 -452 -169 431 177 -351 258 336 -107 -56 271 180 -345 120 110 -117 -242 47 -292 -715 -151 181
2284 181 -316 11 323 96 -198 41 139 -39 80 101 221 -306 376 339 -273 -198 -201 -260 -229 -102 -68 -362 -352
2307 -352 -101 -192 -267 108 217 83 220 140 169 232 200 252 23 -138 -285 -156 -141 -325 -309 -3 -64 -255 -336 177
2331 177 -111 -40 385 -23 175 439 469 121 258 104 -30 12 -47 -137 -182 -275 -163 -278 -508 66 461 -321
2353 -321 -114 515 -40 -327 303 501 14 -177 345 114 -393 126 -105 -441 -395 16 -240 -706 -267 243
2373 243 -272 -272 333 127 -311 269 483 -102 -178 997 288 -313 521 494 -288 -334 205 44 -711 -73 300
2394C00o80R7O94l51m93N38L23o41J62J173j030l55P96Q4r02l33R29l45m03O70
2414B33l09n29K81O40m12m45R43R8o54J32O93n72l10O34Op53J18M52n61l01P64
2435A48%o40J00N86k21m90Q66K15q12J62J041r84j94R26l96o19K24L20m64l40
2455e72L96L49p84L91K69k75m55P15O6n15O92L46l43n30L17J16n54N04J45m92
2475b14j04N02K06q16P6N27j99l44N93k55j45N21o7k45k24M53P6n01K70K09n11
2496a92j9K80P7o51L65P9j55j64L62L0l22J43M49j04k83K50J00m34J62L63m57
2517a21r0L82j3m64K04K01l21P4J27N9j19J03k47N9J27L62l89J46O7J27j48l4
2539I2k95J26L40m1m91R0J20j25K38p2k92L61j13J28l1j08L62k39j7o7j1l65K52
$$ plain form
2394 300 -380 -283 411 60 -433 105 428 -213 -51 1122 92 -263 533 617 -285 -618 311 -34 -437 233
2414 233 -76 -605 -324 316 -96 -541 402 500 -154 -22 671 99 -211 423 429 -324 -206 246 -315 -616 148
2435 148 148 -492 -392 194 -27 -517 349 564 -248 -86 955 -29 -223 703 307 -312 -88 232 -232 -572
2455 -572 -176 173 -611 -220 49 -226 -681 34 100 -415 277 623 280 -250 67 183 -371 133 278 -214
2475 -214 -318 184 390 -426 -350 177 -22 -366 227 -28 -173 348 281 36 -188 265 341 -160 110 319 -192
2496 -192 -211 69 146 -505 -140 -61 -216 -380 -18 12 -310 -167 282 178 -105 145 245 -189 -27 336 -121
2517 -121 -211 171 158 -306 -102 99 -222 -148 -21 38 -81 22 -225 -166 -39 323 -66 80 147 274 126 92
2539 92 -203 -77 263 222 -269 -179 -59 -184 54 -18 -310 51 -62 66 35 -73 289 50 33 -34 -45 -410 -158
2562a58j63K23l0K4l6k53M18P3k16J14J95k62J88j06J54j35k01K65Jk45K78J36
2584B64m05l5L89K6m56J30O0k15R8L00R3n23J88K45k40QR5J16j06L5J82l23o0
2607a34J72P8k86L22K07l66K13l9J38k76Q7L2k59o3J68q1J54M2q7l3o3Q8K4k92
2631b54L87J42k50R6P3j17k52JL77j12j46K84k80j93K03K5j46M8N76n15J13j13
2653e3R7l4k50M33j20k07JN23m03N4j27J91j75nlj0j43J81K04k32J25L66m99J9
2677f7Q9J12k22M3J36k51K3r5N1J61k18J66L3j04o5J23L30o1r8J2j13K05k61K67
2701A96k43R5j00r3K2l7k4q3J41j10K81j0Q9j96J83O0J91j15k52J87k67l2J70
2724E3k28J05j85M8P9K2n6%k2K48j45j26L16J8P8l00L49l52M10l00p4J34l66N
$$ plain form
2562 -158 -321 -98 -128 -104 -140 -393 25 98 -118 -4 191 -71 117 11 165 30 -171 94 95 -150 128 264
2584 264 -141 -176 213 239 -217 -87 -27 -242 -144 156 249 -274 -86 159 -81 -73 22 138 32 67 249 -74 -134
2607 -134 38 116 -170 152 359 -7 206 167 305 29 116 148 -111 -174 -6 -87 67 109 22 -11 -74 14 38 -254
2631 -254 133 275 25 121 194 77 -175 -174 203 91 -55 229 -51 -244 -41 -16 -162 -114 462 -53 60 -53
2653 -53 44 10 -240 193 73 -134 -133 390 -13 41 -86 105 -70 -75 -78 -88 -231 -50 154 -78 47 413 -86 -67
2677 -67 22 134 -88 -45 91 -160 -137 -232 -181 -20 -238 -72 -39 -143 -208 -85 245 184 86 98 -15 190 -71 196
2701 196 -47 48 -52 -145 -123 -160 -184 -267 -126 -236 45 35 124 -72 111 171 362 247 -5 182 -85 -117 53
2724 53 -175 -70 -255 -207 -128 -106 -162 -162 -184 64 -81 -207 109 127 205 -95 254 -98 312 12 -62 72 -294 -289
2748b89K22k85L86k57J43k78K14L74k19M92o11J53J54LJ22k70J37j31oJ91m64
2769b19J9j88J09k69L44K81nk35J35JJ55J15q4m5M8K67k25k04N3Q5l20p8kJ25
2793a37j85O7K6J37j41J41M7K61l06K22J01l62L19m3j88N3o7K08m83K66J76K3
2815A35k68J03j23J81K3J32o0n01M33M16m07l5J17l10PL23l25Q4k09K53j45q3
2837b59M10k34k36p6M60L9k18K1J78n3L42k41o5L5J38m26OO4K43K7l39J38j31
2860a77q0qK44j90l0L50J12j29j5L36n55O7M05P8p31L33M43m70k31J40L27m98
2882b79M87l27k08p3O77l19J0O1l2j7R9K00m33M35j95j4O8n43M25P1k4k79K62
2905E2m07J69J96l51K59L02J29k23r4N6r1k94L69j11P6p5K32q4k68J1L67m56M4
$$ plain form
2748 -289 -67 -352 34 -223 -80 -358 -144 230 11 503 -108 45 199 202 324 54 191 60 54 245 -219
2769 -219 -200 -388 -279 -548 -204 77 72 -163 -28 -27 128 243 159 114 162 429 204 0 53 138 -182 -260 -262 -137
2793 -137 -322 -255 -229 -92 -233 -92 -45 216 -90 132 233 -129 190 147 -41 12 -55 153 -330 -64 112 135
2815 135 -133 -30 -153 28 51 183 123 -378 55 471 64 29 146 -164 -157 166 -159 -75 -284 -31 -176 -259
2837 -259 151 -83 -319 -395 65 104 -114 -93 85 32 374 133 68 103 241 -185 -179 -115 128 155 -184 -46 -177
2860 -177 -257 -265 -21 -211 -241 109 221 92 77 413 -142 -75 330 408 -323 10 453 -17 -248 -108 219 -279
2882 -279 208 -119 -327 -400 277 -42 -32 29 -3 -20 79 279 -154 281 86 72 140 -403 22 93 69 -210 52
2905 52 -355 -186 10 -341 -82 220 349 126 32 88 -3 -297 72 -39 37 -38 194 110 -158 -147 220 -236 -192
2928a92N1J4l7Q5J59J12m5J0J01j35R0Q5k65q0n6K92l16p5K06k02J48q2L36k15
2952a1k3J10m4n9M6m8J33j62m7n9M4M5J72l24R5Q2q7k10K69J5N2q1K21j9j2j10
2978a2j89K28m0J98j20m8o4n3m2K61k71Q9J04l9L75m06oL2m6K13k00L6K63jj87
3003G5l1k0j84J49M37n69K89J93n40N5K89Q7r5j02J03k75R5R3Q9l13K41L37m30
3026b7L5p7K64k09j32J45j06j45M38k91m66M53J05J38m13M33j3l31K41j19m4j45
3048b66M23lj22J66P8k84LR0k1p4P1j43O4q6P0J89n6J1J4k75O6M65k65q9j14M14
3074C26k27k41L31k15J51O6j85j62J9Q9k4j17P6L1MQ4J6J15k02J09J3Jl54L42
3098D6K49n01K62p6K22l60K71K38k31l99J64Q4l40L91m3J02k42L29k10M8m2O0
$$ plain form
2928 -192 -141 -127 -164 -79 80 192 147 157 258 123 213 298 33 -47 -103 189 -127 -202 4 -198 -50 -132 204 -11
2952 -11 -34 76 32 -27 19 -29 104 -58 -105 -164 -120 -75 97 -227 -132 -50 -137 -347 -78 -63 -11 -92 129 110 98 -12
2978 -12 -201 27 -13 185 65 17 -47 -100 -142 119 -152 -63 41 2 377 -29 -35 -3 -49 164 -36 0 263 262 75
3003 75 44 24 -160 -11 426 -143 146 339 -201 -146 143 230 135 33 136 -139 -44 49 138 -175 66 403 -27
3026 -27 8 -69 195 -14 -146 -1 -107 -252 186 -105 -571 -118 -13 125 -288 145 132 -199 42 -77 -121 -266
3048 -266 157 154 32 198 276 -8 -5 85 64 -10 61 -82 -18 -104 -34 155 99 110 124 -151 -85 380 115 26 -88 326
3074 326 99 -142 189 -26 125 191 6 -156 -137 -48 -72 -189 -113 -82 -78 6 22 137 -65 44 57 58 -296 46
3098 46 295 -206 56 -20 202 -158 113 351 120 -279 -115 -31 -371 20 -23 79 -163 166 -44 4 -38 22
3120B2j43J14J63K37m23J97k81m9Q6J17j29n9N11n23K0K7J8j23K51k12J92j09
3142i6P1J12j2j52L10j43l64L45j89J70l0j92M42k16K4j71p9m3L33n0m2J40j50
3165A8l4j23l7K74k16O7K13j36M9l1M3l3o4j54L1M4j66J60J89o2J64qk07J52j3
3190A20J90k84NQ5m9O7j04n0p8J86J4lq7q2L06n7k69J23l6n4L03j39j90J84n5
3215D6k2n6k65K14O4j88J83q2M1N2n5n8R0L5K87l33j77M40N6k13j33l5K13j5j47
3240e8j30J1K07j77k1j3M01m47O0J02n0l1K74k9no2J28j28k61K44k64N08k11k99
3264b51J13M2K80k46j35J62K11n2lk2j01J25J9J05j43r4J80l09j81L06K71l65
3286h8J63k67J33J75k89K41k35K06k58L95j87J83q0n8Q2q4k48j7R0j67L08J05
$$ plain form
3120 22 -121 -7 156 393 -30 167 -114 -163 -77 40 -89 -148 363 -160 -140 -113 -95 -218 33 -179 13 -96
3142 -96 -25 87 75 -77 233 90 -274 71 -118 52 22 -170 272 56 80 -91 -170 -213 120 70 28 168 18
3165 18 -16 -139 -176 98 -118 -51 162 26 75 44 87 54 -10 -164 -133 -89 -255 -95 94 32 196 188 -19 133 120
3190 120 310 26 31 116 67 134 30 -20 -98 88 102 99 12 -70 236 179 -90 33 -3 -57 246 107 -83 101 46
3215 46 24 -32 -297 -83 -19 -207 -24 -106 -65 -13 -68 -126 -36 -1 286 -47 -224 216 272 59 -74 -109 104 89 -58
3240 -58 -188 -177 30 -147 -168 -181 220 -227 -167 -65 -115 -146 128 99 94 32 160 32 -229 15 -249 259 48 -251
3264 -251 -138 -96 184 -62 -197 -35 176 124 121 99 -2 123 142 247 104 10 190 -119 -300 6 277 -88
3286 -88 75 -192 -59 116 -173 68 -167 39 -219 176 -11 172 92 34 116 32 -216 -233 -143 -310 -2 103
3308A03j01j48J74K32k73O7pJ43o1J6j94R1J37j93N1J7j10J22J25j51l9J12k55
3331a42J36m8q1J00J75L1j19J86k61K31J65l54R3k93J15J69k77l3j04J42J37J24
3353I2k72m4M04j29k05N6L21j13J73m56L32j25l8R8j17j8p2J25Jl10M45j1l25
3376a88K58k4R8m53M46j54J02J24l15M26n21K55J9j32j78J65j18lK60j79K17L38
3398D43o88rK34J37j89J94j30L3J32k86J84k3j24l3J51P6q3j25j04L40k88J57
3420aj57L76k76M3k81J66Q1l2J16k70L77j96O2q3K59l43P3M4j24Lm1O7n5L15j2
3445A11k6j17n2L4L07p1k58L82k95L5m63K86N9K6m5j41K3J97j02n7L47j68k18
3468b06L00M4j82JK26n2k17J68m5o6o1j4K03l06L56qj63L37j71p9l52J99L07k87
$$ plain form
3308 103 2 -146 28 260 -13 54 47 190 129 145 -49 42 179 -14 37 54 -56 66 191 40 1 113 -142
3331 -142 -6 -54 -135 -35 140 171 52 238 -23 208 373 19 112 -181 -66 103 -174 -207 -311 -169 -32 92
3353 92 -180 -224 180 51 -154 -98 223 110 283 -173 159 34 -4 94 -23 -41 -113 12 13 -297 148 137 -188
3376 -188 70 46 144 -309 137 -17 85 209 -106 320 -201 54 73 -59 -237 -72 -190 -193 67 -112 105 443
3398 443 -245 -254 -20 117 -72 122 -8 25 157 -129 55 32 -92 -125 26 102 19 -106 -210 130 -158 -1
3420 -1 -158 218 -58 -15 -296 -130 -49 -81 35 -235 142 -54 8 -75 184 -159 -86 -42 -166 -163 -204 -137 -192 123 111
3445 111 85 -32 -84 -50 257 186 -72 310 15 50 -413 -127 -68 -42 -87 -228 -205 -8 -110 -167 180 12 -206
3468 -206 94 138 -44 -43 183 131 -86 82 37 -29 -90 -104 99 -207 149 141 -22 315 144 65 -287 -88 219 -68
3492f8j00K17K6J62o3k3o9j15K80m20J82J69j25j95J17J25K4m19K67J2n0l6K65
3515A63j74J24R8Q8l90J72P3L6n70J99J34j24J51P5K0l22J09J71k07K72n4J7j87
3538a26J71j24L27Qk62P9j3l7j7J31k8j35K4N2j07R7J11l04K91j10j61J1J36Q
3562B2L2k0R8j24qJ22p2k34M31j2l89J60O3k24R5R6K2Q8j61J36j51K00k13J46
3586A03q3J10j13k16R2J98k42J65L6j73J08r6K06k20K38k93j37J65J17k72J40
3607a67K36k90K64M4J09o4l24K74l1l21L19J05q5q5q6P4L85m14K53k22j92J97
3629b1P3P4k58K32p5k4L6q5L2K31j16j32l6J47l4q9NL3j62kQ7l75L89j1M7N3j4
3656Eo2K81k00O3j34J12k8r4J26J11J17j70o7n5K5J88j81J16k18L39j51MK4k16
$$ plain form
3492 -68 -168 49 75 237 174 151 82 -33 247 -173 9 178 53 -142 -25 100 124 -295 -28 -16 -66 -102 163
3515 163 -11 113 211 299 -91 81 154 190 -380 -181 -47 -171 -20 55 75 -247 -138 33 -174 98 44 61 -126
3538 -126 45 -79 248 256 -6 73 60 23 6 137 109 -26 -2 50 -57 40 151 -153 138 28 -133 -122 14 22
3562 22 54 34 132 8 0 122 50 -184 247 235 -154 6 69 -155 -60 36 58 146 -15 121 -30 170 -43 103
3586 103 20 130 17 -199 -107 91 -151 14 50 -123 -15 -111 95 -125 113 -180 -317 -152 -35 -307 -167
3607 -167 69 -221 43 87 196 132 -192 82 51 -270 49 154 69 -16 -102 -28 357 -57 196 -26 -218 -21
3629 -21 52 126 -132 100 25 1 37 -48 -16 215 99 -33 -69 78 44 -45 -40 -7 -169 -171 -84 -459 -70 -81 -34 19 5
3656 5 -57 224 24 87 -47 65 37 -57 69 180 297 127 60 5 30 218 37 153 -65 274 123 127 151 -65
3680f5J89j58K26l40K73O0k66K13j46q2q1j9J75J72j57J19k21J78k3j71J39J05
3702A20k96l2J30j88K14J7J89r7o4M5L9k09K32NQ5k04o9J04L5J00j14o2J40Mj88
3727f4j80J58L07k92K51N9l14Q4j93L54k55j48J21J63r0j27J12J41o5R5q4j42
3749a09K58j15j35K23l93L30r9P1L4L0K5k02m9J94j44Ok31M43mk92K24N6K32n69
3773b16J35k3O3l8l5rJ33L5N5l6J01j71k9M3j07K88n6j51P4j60M0k59L91RJ04
3798A81l29K57o7K7m87J55J82K32q6k17K13K6J6m47L51Q2m1K6j72K66q8j03Q1
3821E8P8l43K89j42J3j26K52j19j14K09J46M5j65j73m0R2m9M6J07j37p1K8n7Q2
3845i1j62j20M81j41k16L07PPj50R5L46k84l79K27k6J40j48Q8O4j37m0J60m8l07
$$ plain form
3680 -65 124 -34 192 -148 125 185 -81 132 -14 -96 -177 -196 -21 151 -6 113 -108 70 47 -124 15 120
3702 120 -176 -208 -78 -266 -52 -35 154 57 -7 38 77 -132 100 105 190 -14 -83 21 56 156 42 -20 120 124 -64
3727 -64 -244 -86 221 -71 180 239 -75 9 -184 170 -85 -233 -112 51 -39 -166 -54 87 22 117 33 -109
3749 -109 149 34 -101 122 -271 59 -40 31 65 95 120 -82 -131 63 -81 -75 -306 137 133 -159 65 121 353 -216
3773 -216 -81 -104 -41 -79 -114 -123 10 45 100 64 165 -6 -35 8 -99 189 133 -18 56 -104 -64 -323 68 77 181
3798 181 -148 109 42 69 -418 -263 -81 151 65 -152 61 87 103 -344 7 89 48 74 -98 168 80 -23 58
3821 58 136 -207 82 -60 -47 -173 79 -40 -154 55 201 246 81 -92 -132 -40 -89 -43 64 -73 -144 -116 -173 -91
3845 -91 -253 -373 108 -33 -249 58 65 72 -78 17 363 79 -300 -73 -99 41 -107 -19 45 -92 -132 28 -20 -327
3869c27L69j77K0N6J56j71J90J43j58L7k74j8j9L60k64K01m00L74j19p3P7j15
3891a32K76Q6j99n0j01K11l12K14J51Rr7k15L36j86L22l72K56l39N0o8J38q6O4
3914d4O4k14J52k02K98K87k24o2j38J95l59K02Q3n7OK5k41j2K69M7p2r7%m0K81
3939A47o2J09m15K66m8n7J87l6k00L09l15K62j81K37L1l78R5M2j71L82l29k6o5
3962b16N16k78j97K07j74L76l77L07p6J66l18K0lML02l57L2K00N1j94J69Kj98
3985c6n6L58j64l5K30j72l0O7r7J10r3k58J56l6l5K5P4j04L3k2m2o7PJ4L45r2
4011H0J19k62j43K00j84J76m8J12m9K19k88K13k82L42k73N8K30l12K72j63j05
4032h8K16P2j74Jk5Q2j08K3O3o1Q0R5o5k05J33j20L0J12k13L00k67K4P7l70M32
$$ plain form
3869 -327 42 -135 -115 -59 97 -74 116 259 101 138 -136 -154 -173 187 -77 124 -276 98 -21 -94 -17 -132
3891 -132 144 230 31 -19 -120 91 -221 -7 144 153 56 -159 177 -9 313 -59 197 -142 -92 -160 -22 -108 -44
3914 -44 20 -194 -42 -244 54 341 117 55 -83 112 -247 -45 38 -19 -13 12 -229 -241 28 75 3 -94 -94 -134 147
3939 147 85 194 -221 45 -3 -60 127 91 -109 200 -115 147 -34 203 234 -144 -49 -7 -178 204 -125 -151 -216
3962 -216 300 22 -175 32 -142 234 -143 164 88 254 -64 -44 -47 -43 259 -98 -66 134 185 -9 160 162 -36
3985 -36 -92 266 102 67 297 125 95 162 65 175 82 -176 -20 -56 -91 -66 8 -96 -63 -85 -127 -194 -187 -173 172 80
4011 80 199 -63 -206 -6 -190 -14 -62 50 1 220 -68 145 -137 205 -68 -10 220 -92 180 17 -88
4032 -88 128 200 26 27 2 84 -24 -1 62 1 81 176 111 -94 39 -81 -51 61 -152 148 -119 -95 -18 -388 44
4057D4Q4k81L20l88Q6M56j75r7J16j99k84L28K33q4l42N1J30J3J19O3n6l05L50
4080A82j42J07k48K84K2l39L39l23K9J13J66r8l46J22K30j7j76RO0O4n5r9K16
4103A00j74k07Q1J74Q7R0p2m1k83M7J84J1j40K33Pk02J2j14J73K35j99N1J78l52
4127a21K70k18P3J71j92O2n2k26L14l75J40O7J60J14k8k0%J23j25j01o0J58l48
4150b14OQ9J56j15J47j71j02J63j47K20Mj42j68K62j43P2oJ69J42j78p1K12j50
4173C5k73L80m47M29kp7j61K47k22l9J38K31l20J48m1m2J24j77K78k09P2q0k49
4196b57J06J4N0J58J02p1j28j7J45j58q7m0J49O3J01k44J75j22O0J63j38k4p3
4219g3J55j75J52j41J0pn3k4J57l5M4J36r3j29q2J12J61l2Ok18J61j85K09K11
$$ plain form
4057 44 128 -153 167 -221 -135 321 146 49 165 -34 -318 10 243 159 -183 -132 -2 11 130 193 137 -168 182
4080 182 40 147 -101 183 205 -134 205 -118 -89 24 190 92 -254 -132 98 81 -95 -86 -26 38 -17 -116 100
4103 100 -74 -281 -200 -26 61 151 79 38 -245 -198 -14 -3 -143 90 97 -105 -93 -207 -34 201 2 53 231 -121
4127 -121 149 -69 4 175 -17 45 -7 -233 81 -294 -154 -87 73 187 159 139 139 262 137 36 -24 134 -214
4150 -214 -208 -119 37 -78 69 -102 -204 -41 -188 32 36 -106 -274 -12 -155 -83 -89 80 222 44 -27 185 35
4173 35 -238 142 -305 124 122 45 -116 131 -91 -130 8 239 -81 67 26 -16 108 -69 209 0 72 -8 -257
4196 -257 -151 -137 -87 71 173 102 -26 -43 102 -56 -143 -183 -34 29 130 -114 61 -61 -1 162 24 0 -73
4219 -73 82 -93 59 -82 -72 -79 -132 -156 1 -34 10 146 53 -76 -158 -46 115 83 89 -129 32 -153 56 267
4243B67k51J2j81J46o5l4j20J34L16l06K05m21L01j28K03r8j34N2k3q3J47J97
4265A36j88J58J6o3O5o2O6N7j44l30K83p6k4K43J9j98j83N72k87j60j13Q9L23
4288A99l74L20j28K5L3L9j69J37j45K25o5r5k43J75R9P9j42J59j87q2QJ74l9J50
4312A53l11K36j52L27m55j41K42J24m1J20j75J59j67P7K03k20k21J78J83qL7k25
4334g7Q7Q2O2r7j82J22J5j42J57L17l79j08O1K31L45n85J10j78J36j21J25J30
4356A11k54K64O3Jo2Jk08J75l12K08k7J6j6k0j66K93J09j88R3k6j27J96K6l11
4380a61K43p6L6j38j67J70Q6o0K13k2P9q6j42l22M33r0j18r3K97J02m65N19j11
4403A27j76m0J18J30j76q4K68r3K0k27R5KJ66k83J72m0j61J88k10K05K4j98R2
$$ plain form
4243 267 16 28 -153 -7 -72 -106 -226 -92 224 -82 123 -298 3 -125 78 -20 -154 -102 -125 -208 -61 136
4265 136 -52 106 122 59 124 62 128 185 41 -289 -6 -82 -106 137 156 -42 -225 347 60 -100 -213 -124 199
4288 199 -175 145 17 42 75 114 -55 82 -63 162 97 2 -241 -66 33 112 -30 129 -58 -140 -132 42 3 153
4312 153 -158 78 -74 253 -202 -343 -101 23 -18 102 -73 86 -81 -4 199 -21 -242 -64 119 111 148 -77
4334 -77 10 92 154 57 -125 -3 12 -130 27 344 -35 -143 -82 149 494 -91 19 -159 -23 -144 -19 111
4356 111 -143 121 184 185 123 124 -84 91 -221 -13 -40 -24 -40 -60 -226 67 176 -12 81 55 -72 124 150 -161
4380 -161 82 6 42 -96 -263 -93 -7 -67 146 124 203 117 -25 -347 86 -4 -122 -215 82 184 -281 238 127
4403 127 -49 -89 29 159 -17 -101 167 74 94 -133 -38 -36 130 -153 19 -21 -182 6 -204 1 25 -173 -81
4426h1n4j12M08r3k20Q1P1j52J48J53l67K31j04N2j9Lq1K04P6oR5j38J15n8M3
4451A95m58K71j94J55J8J08n6J46R7k15k07K53k13L25k44m7n6J1M80n14K69j24
4473@r6K52k47J75j21K69j06o6j1O1j55K9J00j88qk0L06j43k05j19K52J28J80
4496B67n13J22R1M57m62J74J10l12P0j61K02L03m81L2L16q4j88k01J6K78J40j63
4518A3j15rL63n7j10n2j5j03M4L3q9K03j20J23j24M2m9L8l15J15L63pj07k70K52
4543D7k7j8J7J28j29k18K61k75K88K20O2j76j44k59L23j04q9J39j21J32j41L60
4565B76j50j47J52j45N1o4J06J57k57q0M61l89J08K5k24J68O1j64K04p3r4p1L7
4588e2MJ76j98j11J80P1J2j95K54k00O7K19k34j88J72k18M25m89L40j15Q6J88
$$ plain form
4426 -81 -135 -247 161 68 -152 -71 0 -152 -4 149 -218 13 -91 -39 -58 -55 -136 68 144 138 233 95 210 152 195
4451 195 -263 8 -186 -31 -13 95 39 185 282 67 -140 113 -100 225 -19 -66 -122 -111 369 -145 124 0
4473 0 -96 156 -91 84 -37 232 126 60 49 110 -45 -16 84 -104 -112 -132 174 31 -174 -293 -41 87 267
4496 267 -246 -124 -33 424 -38 136 246 -66 4 -157 45 348 -133 -101 215 131 -57 -258 -242 36 176 13
4518 13 -102 -111 252 195 85 33 18 -85 -41 -8 -97 106 -14 109 -15 27 -22 16 -299 -184 179 172 65 -205 47
4543 47 20 2 19 147 18 -200 61 -214 74 294 356 180 36 -223 100 -4 -93 46 -75 57 -84 276
4565 276 126 -21 131 -14 37 -27 79 236 -21 -101 360 -29 79 104 -120 48 109 -55 149 76 -18 -89 -52
4588 -52 -48 128 -70 -181 -1 70 82 -113 141 -59 8 227 -7 -195 -23 -241 184 -305 35 -80 6 194
4610A94M9l74o9N40l35n4J91L2j91N1O5j63L83k85j77N53m31J15k37K12nj38j
4633g5K86m46O7P3L12k51K21jj25k81L64K0l40LJ11k6q3KM0J10l1J19p5J14l4
4658G4qn5P4J78j99J26m08m8J64J68k18O4LL86J4q7k0j77Q5j34o1k05J69K14k72
4683a73Q7kR2k18L8J50L98o75L58J30m32L22p8p0J07k09L00k00M00l69J21j48
4705g1O8K46l8k08o5K80K9O9l11m1K98l34K01j21j13J39p4J90P3l58L01k07M5
4728bR7k0p0j40o6M59l32K39l05qJ71L1K5k45K45Rq5j78J99k07L39k22j88M61
4752B07N8k72k06J16q3J4m5J89K22j64q5K2J11j74Q1J37o4J24m38J49j8k22N40
4775A99j80J65k54J32q9n5j7K27r8j77K86k61j50J25J60j69K4J0Q4N5m9m6K53
$$ plain form
4610 194 243 -131 -200 340 5 -49 142 174 -17 34 99 -64 319 34 -143 410 -21 94 -143 69 64 -74 -75
4633 -75 211 -235 -168 -95 217 -34 187 186 61 -220 144 164 -176 -173 -62 -88 -171 -169 -129 -19 -50 69 -6 108 74
4658 74 66 11 85 263 64 190 -218 -266 -102 66 -152 -88 -85 301 315 228 208 31 116 -18 -79 -284 -115 99 -173
4683 -173 -86 -88 4 -214 -176 -26 372 -303 55 185 -247 75 -3 -73 34 -175 125 -75 325 -44 77 -71
4705 -71 -3 243 205 -3 -68 212 241 310 -1 -42 256 -78 123 2 -111 28 -46 144 217 -141 160 -47 -2
4728 -2 95 75 5 -135 -201 258 -74 165 -140 -148 23 54 79 -166 79 88 3 -175 24 -183 156 -66 -254 207
4752 207 265 -7 -213 -97 -180 -166 -211 -22 200 36 -49 -27 84 -90 -9 128 64 188 -250 -101 -119 -341 199
4775 199 19 184 -70 62 -27 -82 -99 128 30 -147 139 -122 -272 -147 13 -156 -132 -122 -38 17 -32 -78 175
4798A75J4j48o8K31k02R1k6j31K06j29k4J66k71K88k73K8KN4M0j51N0j13O6K62
4822A37r8N2j35J2M1L21l59p7M8K65l6o3M5j51K0j61J15J93j21M8j29K14Q2J0
4846B73k94k21M09r2j00p9n0r3L02l10K70j23J67j50K72l84L16rk26L27j41L5
4868I9Q4l64k0O1Q5J35j52K57j87k44K91J46k1j32j42r7J22J0O9J4K7l40M05q0
4892B6M4r5q3j53K73l6J0P3Q5j76R0j31J31N9j74rK49j95M6J83r8j66K43p8r8
4917B0j93K38l81N03l80K25J64k73p6J0K05k48K51m8Q0%J6p1j0J30o1Q4p8j18
4941a1m7P7n9n7n3J40K5m1J18j47J98j90j00L61p5m3j13r4L40p2l3k6L5j18O6
4966H1K3k85J00P4J71Kk21K43m09M6K38k22J87l9K18K1k47m2L7J51k83m6R3m1
$$ plain form
4798 175 189 41 -27 204 2 93 67 -64 142 13 -11 155 -116 172 -101 -73 -71 -17 23 -128 -78 -191 -125 137
4822 137 39 91 -44 -32 9 330 -29 -106 -58 207 171 108 153 2 22 -139 -24 169 48 96 -33 181 263 273
4846 273 -21 -242 167 75 -25 -104 -154 -247 55 -255 15 -108 59 -91 181 -203 113 104 -122 205 64 99
4868 99 183 -181 -201 -140 -55 80 -72 185 -2 -246 45 191 170 38 -104 -201 -79 -69 0 14 41 -299 106 26
4892 26 70 -25 -108 -261 12 -24 -14 59 144 -32 58 -73 58 117 -57 -66 183 -12 34 217 119 -47 196 118 20
4917 20 -173 65 -316 187 -193 32 196 -77 -153 -143 62 -186 65 17 97 97 113 42 32 162 101 185 107 -11
4941 -11 -58 19 -40 -97 -150 -10 15 -26 92 -55 143 -47 -147 214 139 96 -17 -111 229 157 124 98 133 15 81
4966 81 104 -181 -81 -7 164 166 -55 188 -221 -175 63 -159 28 -11 207 228 -19 -61 -24 127 -156 -202 -109 -150
4990a50K10K38n09L31j48K94j50k14J1L20l38J39n2j34K70L9p6k02P7O4K79m29
5012a30L5R1L35m18R4N8j18n2K64k75K62l75O38m70J34k15L48o1p6p0O3j16J73
5035A19Q0j42j06j16K20o5J35j18p5K05m6M6k82J70mk91K09p9K51K2l8j98o6K06
5059C7L7R3r6p0L5o3JK03j32k1j7M5J76j89j06j19M88k46j00k8J52M3j07L12n98
5084b70K60K11k46J5O4n2k1L5Q2r1J75Op3M1k54K29N5j98k24L10j81J7J17j14
5108a07k6K01k8k9J66n4j15K57j92j81j89L16l4m0K67j14O2j71r6M8N1m14N63
5131A41m1j87j8K26J04k25J69r7j26m3O6K92n07O9L1K55m80M47N7N1j36J43P2
5154B63r6j79K80j50Lj24J5j14J55M5j55J51k82J51MK08j51Kk57K34oK06n1R6
$$ plain form
4990 -150 60 298 -211 120 -28 266 116 -98 -87 233 -105 34 -18 -152 118 157 81 -121 -44 20 299 -130
5012 -130 -95 -4 331 -87 7 65 -53 -105 159 -116 146 -229 409 -61 73 -142 206 145 69 -1 62 -54 119
5035 119 199 57 -49 -165 55 -10 125 7 -68 137 91 137 -145 25 21 -270 -61 -140 111 133 95 -103 -169 37
5059 37 74 167 71 1 36 -27 -26 177 45 24 7 52 228 39 -67 -186 302 56 -44 -72 80 123 16 328 -270
5084 -270 -10 201 -45 -30 34 -18 -39 -4 78 -13 162 168 95 136 -118 111 166 -32 -256 54 -127 -110 7 -107
5108 -107 -133 68 40 11 177 123 8 265 73 -108 -297 19 -15 -55 212 98 160 -11 -107 -59 -8 -422 141
5131 141 100 -87 -105 121 225 0 169 72 -54 -97 -31 261 -246 -177 -146 109 -371 76 133 184 48 191 263
5154 263 167 -12 268 118 121 -3 12 -102 53 98 -57 94 -188 -37 -33 175 24 26 -231 3 -3 203 152 248
5178B48l27O6L27j13j5j84j44Q5m0M4R1pm6j19J37k91M00j36K27l54K17j72L44
5201B38Ok83Q9Lo4j41K11k21K92j59Q7j78M1L34m45L28k54K97k35l6O4J34N0k88
5225a30N5oK6j53K12P3j34j2K28l5J02j81k6j11K13kk66J34j08R6KJ13q4R4k03
5250a03k8J47L8k5j11L0j62J47k33L70J13k39KJ07k9m3M1J49k37M1J45p5P8J97
5274C20m02J10j36J01J08j92J16j94J92j11MJ82p0J19j78J39j94m4L08j58j18
5295i8JJ95k11J11j14J54j20J50N5MJ13l09j41M11l14M29l72Ln3Q6L0J97k0k52
5319f5KR7k7k57L83l93J88K20j08L7J12j89p3l4J75l8N9j7r2N8k08K19J14m37
5343b74Q8L27Q5j31Q4j03l04K31pQ8N4j91K60n12O26m67r7M80M2k98p1L6K61j55
$$ plain form
5178 248 -79 -13 314 201 186 2 -142 -57 -97 -53 38 31 -15 -134 3 -288 112 -24 203 -151 66 -106 238
5201 238 244 -39 50 53 -11 -152 59 -162 130 -29 58 -120 -79 255 -190 138 -116 181 -54 -90 -26 108 158 -130
5225 -130 -75 -81 -55 -208 4 77 -57 -69 159 124 226 45 19 -92 121 119 -147 -13 -121 -25 -23 90 6 100 -103
5250 -103 -131 16 54 29 -82 -52 -214 -67 -300 70 183 -56 -54 53 24 -19 22 171 -66 -25 120 45 123 320
5274 320 -82 28 -108 -7 101 -91 25 -169 23 -88 -84 98 28 147 -31 108 -86 -130 178 20 -98
5295 -98 -97 98 -113 -2 -116 38 -82 68 123 127 240 -69 -210 201 -113 316 -56 -53 -106 -20 10 207 187 -65
5319 -65 -63 34 7 -250 133 -260 -72 148 40 77 189 0 -73 -107 68 30 89 72 -20 38 -170 49 163 -274
5343 -274 -186 141 226 95 179 76 -228 3 -4 84 138 -53 207 -305 321 -146 -243 237 279 -19 -90 -54 207 52
5367E2K81l99r5K05j70J48j19J13j16n5K00K5k55K02K4MJ19k51j83K74j50M78
5389C32k22l31M49j90P5p4Q9k30K61r0j48j8J19%N5Qk15K17k6l5j8RP1p0Q3n9
5415D2l8J60j44j25L56m00k21L34Q6q3j27j07O1K70j10P9J5J03k37J73MKk43L7
5439a13q1NJ11J63l6l49K68K41l20K79m05K60J11l94L92j87k34K81R2p4r6J87
5461A01j0k45L6K41m6m63M75j06M3K32j25n80N87j95n8n1M69k68j28J90k75L8
5483a38K0L30k17k08L78j32k97L03j10J30j64K64k91k6K62k27J52Q8k27L29j48
5504G1k9K5j97J69N0q7l7M5o1K80l71N4J04j83nJ11J04k31O6J33j74J05K82k44
5528b0M5j10J66K8l7Qj7q0Q3j00l7K22p8J83k85j18K8K55k36K03k90o7K74j17
$$ plain form
5367 52 333 -66 -161 44 -126 22 -97 16 -100 -155 45 70 -185 17 41 45 164 -87 -270 4 -146 332
5389 332 110 -221 228 38 113 39 128 -102 159 69 -79 -97 22 22 77 85 -130 87 61 26 8 17 88 18 101 42
5415 42 4 164 20 -105 251 -149 -370 -36 50 -33 -160 -267 -206 64 -46 33 48 151 -86 87 91 93 -150 -113
5439 -113 -194 -189 -78 85 49 -300 -32 209 -111 168 -237 23 134 -260 132 -55 -289 -8 84 10 -86 101
5461 101 91 -154 -118 123 77 -386 89 -17 26 258 133 -447 140 -55 -113 -164 305 37 -91 99 -176 -138
5483 -138 -118 212 -5 -213 165 33 -264 39 -71 59 -105 159 -132 -158 104 -123 29 117 -110 219 71
5504 71 42 67 -130 39 89 2 -35 10 -51 229 -142 -88 16 -167 -172 -61 43 -188 -122 11 -163 -58 224 -20
5528 -20 25 -85 81 109 72 80 63 -17 66 -34 -71 151 73 256 -29 -147 -119 136 -100 103 -187 -254 20 -97
5552i7m9K85k26J79l10k8M72o2j53l41L96m61M99j99R2j53N9r6K18L12k27L04
5574D14n04N9K67j32J7k27J6Q7j22K77l97OP7R2P9o7j69J82N6k0k2Q1K46m03r
5599a16M09j72K57k66N6j13j2K51K9p8k28J63j41l6O4r4J07j73J95r5j69%K44
5622H2j24P1j92J45j52k29L29r4J81k61J91J51J42k71O2L4L6L34j83m8k45o5R0
5645a6K25l98J80n9J81k04M3r0J26L3Q5J3j84K16j79NK43k75O0k08M5K58j7j77
5669i4N8o0p0P2O3j45K91N9j36q8l9J94j39J77l16M01j10k83K3K69k04J27o4P0
5693E6K0Q2m77K10O7O9J56j35r5P6J16j75P2k15M0K24M4K8j19J33j39o2K45k35
5717a4L52l76K2N2M8J1k95lK6K51r1k11L52j93O2o2L78j33l14L7RJ01j04O7J23
$$ plain form
5552 -97 -146 139 -87 92 -218 -246 226 164 11 -330 66 -395 104 -95 -3 -156 -97 -193 25 337 110 414
5574 414 -90 -31 236 104 121 -106 -90 -3 -125 152 -245 -239 -162 -70 9 -58 -227 -45 11 -9 -31 50 296 -107 -116
5599 -116 293 121 378 112 168 55 43 294 323 245 17 180 39 3 67 -27 80 -93 102 7 -162 -162 82
5622 82 -42 29 -163 -18 -170 -399 -70 -164 17 -244 -53 98 240 -31 31 65 101 435 252 204 -41 -106 -16
5645 -16 209 -189 -9 -68 113 -91 -48 -138 -12 21 106 119 -65 151 -28 -23 220 -55 5 -203 -158 100 83 -94
5669 -94 -36 -96 -166 -94 -31 -176 115 174 38 -50 -89 105 -34 143 -173 228 118 -165 -142 127 -77 50 -14 56
5693 56 76 158 -319 -109 -42 27 183 48 -47 29 145 -30 42 -173 -133 91 135 163 44 177 38 -24 221 -14
5717 -14 338 -38 -16 36 84 95 -200 -203 -177 74 -17 -228 124 -69 -7 -69 309 176 -138 -101 -92 9 -95 -28 95
5742I5j02j16L09P2k17k17L37j46k39M01l72J34J33M6j62K26j36O6j27K09j50
$$ plain form
5742 95 -7 -123 186 258 41 -176 161 15 -224 177 -195 -61 72 118 -44 182 46 112 -15 194 44
$$ [...]
8191a59
##END NTUPLES=NMR FID
##END=
