##TITLE=1H_2a1611CFA
 aceton-d6
 8 sc, 
 17.11.2021
##JCAMPDX= 6.0         $$ Bruker NMR JCAMP-DX V2.0
##DATA TYPE= NMR FID
##DATA CLASS= NTUPLES
##ORIGIN= UXNMR, Bruker Analytische Messtechnik GmbH
##OWNER= root
$$ XWIN-NMR		Version 3.5
$$ Wed Nov 17 10:40:19 2021 Russian Standard Time (UT+4h)  she@DPX200
##.OBSERVE FREQUENCY= 200.131346
##.OBSERVE NUCLEUS= ^1H
##.DELAY= (6, 6)
##.ACQUISITION MODE= SIMULTANEOUS
##.ACQUISITION SCHEME= undefined
##.AVERAGES= 8
##.DIGITISER RES= 18
##SPECTROMETER/DATA SYSTEM= spect
##.PULSE SEQUENCE= zg30
##.SOLVENT NAME= Acetone
##.SHIFT REFERENCE= (INTERNAL, Acetone, 0, 15.7039)
##AUDIT TRAIL= $$ (NUMBER, WHEN, WHO, WHERE, WHAT)
$$ ##TITLE= Audit trail, XWIN-NMR		Version 3.5
$$ ##JCAMPDX= 5.01
$$ ##ORIGIN= Bruker BioSpin GmbH
$$ ##OWNER= she
$$ F:/spectra/data/she/nmr/H-F/1/audita.txt
$$ ##AUDIT TRAIL=  $$ (NUMBER, WHEN, WHO, WHERE, WHAT)
(   1,<2021-11-17 10:38:19.67 +0400>,<she>,<DPX200>,
      <created by zg, POWCHK disabled, PULCHK disabled
       configuration hash MD5:
       00 E9 B6 7A A2 85 ED C7 34 08 36 98 17 FE 4E 26
       data hash MD5: 16K
       48 8E 14 F7 AB FA A1 D2 7A 72 92 1D 19 7E 05 65>)
$$ ##END=
$$ 
$$ hash MD5
$$ FD 0A 8D DA F5 BA 28 7F D1 F9 6F 56 13 9E AD C2
##$RELAX= 
##$RELAX= 
##$RELAX= 
##$RELAX= 
##$RELAX= 
##$RELAX= 
$$ Bruker specific parameters
$$ --------------------------
##$DU= <F:/spectra>
##$EXPNO= 1
##$NAME= <H-F>
##$PROCNO= 1
##$TYPE= <nmr>
##$USER= <she>
##$AMP= (0..31)
100 100 100 100 100 100 100 100 100 100 100 100 100 100 100 100 100 100 
100 100 100 100 100 100 100 100 100 100 100 100 100 100 
##$AQSEQ= 0
##$AQ_mod= 1
##$AUNM= <au_zg>
##$AUTOPOS= <>
##$BF1= 200.13
##$BF2= 200.13
##$BF3= 200.13
##$BF4= 200.13
##$BF5= 200.13
##$BF6= 200.13
##$BF7= 200.13
##$BF8= 200.13
##$BYTORDA= 1
##$CFDGTYP= 0
##$CFRGTYP= 5
##$CHEMSTR= <none>
##$CNST= (0..31)
1 1 145 1 1 1 1 1 1 1 1 1 1 1 1 1 1 1 1 1 1 1 1 1 1 1 1 1 1 1 1 1 
##$CPDPRG= <>
##$CPDPRG1= <>
##$CPDPRG2= <>
##$CPDPRG3= <>
##$CPDPRG4= <mlev>
##$CPDPRG5= <mlev>
##$CPDPRG6= <mlev>
##$CPDPRG7= <mlev>
##$CPDPRG8= <mlev>
##$CPDPRGB= <>
##$CPDPRGT= <>
##$D= (0..31)
0 1.2 0 0 0 0 0 0 0 0.06 0 0.03 0 0 0 0 0.0002 0 0 0 0 0 0 0 0 0 0 0 0 
0 0 0 
##$DATE= 1637131099
##$DBL= (0..7)
120 120 120 120 120 120 120 120 
##$DBP= (0..7)
150 150 150 150 150 150 150 150 
##$DBP07= 0
##$DBPNAM0= <>
##$DBPNAM1= <>
##$DBPNAM2= <>
##$DBPNAM3= <>
##$DBPNAM4= <>
##$DBPNAM5= <>
##$DBPNAM6= <>
##$DBPNAM7= <>
##$DBPOAL= (0..7)
0.5 0.5 0.5 0.5 0.5 0.5 0.5 0.5 
##$DBPOFFS= (0..7)
0 0 0 0 0 0 0 0 
##$DE= 6
##$DECBNUC= <off>
##$DECIM= 32
##$DECNUC= <off>
##$DECSTAT= 4
##$DIGMOD= 1
##$DIGTYP= 9
##$DL= (0..7)
0 120 120 120 120 120 120 120 
##$DP= (0..7)
150 150 150 150 150 150 150 150 
##$DP07= 0
##$DPNAME0= <>
##$DPNAME1= <>
##$DPNAME2= <>
##$DPNAME3= <>
##$DPNAME4= <>
##$DPNAME5= <>
##$DPNAME6= <>
##$DPNAME7= <>
##$DPOAL= (0..7)
0.5 0.5 0.5 0.5 0.5 0.5 0.5 0.5 
##$DPOFFS= (0..7)
0 0 0 0 0 0 0 0 
##$DQDMODE= 0
##$DR= 18
##$DS= 0
$$ [...]
##$SUBNAM2= <"">
##$SUBNAM3= <"">
##$SUBNAM4= <"">
##$SUBNAM5= <"">
##$SUBNAM6= <"">
##$SUBNAM7= <"">
##$SUBNAM8= <"">
##$SUBNAM9= <"">
##$SW= 18.0517287032376
##$SWIBOX= (0..15)
0 0 2 0 0 0 0 0 0 0 0 0 0 0 0 0 
##$SW_h= 3612.71676300578
##$TD= 16384
##$TD0= 1
##$TE= 0
##$TE2= 300
##$TE3= 300
##$TEG= 300
##$TL= (0..7)
0 120 120 120 120 120 120 120 
##$TP= (0..7)
150 150 150 150 150 150 150 150 
##$TP07= 0
##$TPNAME0= <>
##$TPNAME1= <>
##$TPNAME2= <>
##$TPNAME3= <>
##$TPNAME4= <>
##$TPNAME5= <>
##$TPNAME6= <>
##$TPNAME7= <>
##$TPOAL= (0..7)
0.5 0.5 0.5 0.5 0.5 0.5 0.5 0.5 
##$TPOFFS= (0..7)
0 0 0 0 0 0 0 0 
##$TUNHIN= 0
##$TUNHOUT= 0
##$TUNXOUT= 0
##$USERA1= <user>
##$USERA2= <user>
##$USERA3= <user>
##$USERA4= <user>
##$USERA5= <user>
##$V9= 5
##$VALIST= <valist>
##$VCLIST= <CCCCCCCCCCCCCCC>
##$VD= 0
##$VDLIST= <DDDDDDDDDDDDDDD>
##$VPLIST= <PPPPPPPPPPPPPPP>
##$VTLIST= <TTTTTTTTTTTTTTT>
##$WBST= 1024
##$WBSW= 4
##$XGAIN= (0..3)
0 0 0 0 
##$XL= 0
##$YL= 0
##$YMAX_a= 263673
##$YMIN_a= -246387
##$ZGOPTNS= <>
##$ZL1= 120
##$ZL2= 120
##$ZL3= 120
##$ZL4= 120
##$ABSF1= 10
##$ABSF2= 0
##$ABSG= 5
##$ABSL= 3
##$ALPHA= 0
##$AQORDER= 0
##$ASSFAC= 0
##$ASSFACI= 0
##$ASSFACX= 0
##$ASSWID= 0
##$AUNMP= <proc_1d>
##$AZFE= 0.1
##$AZFW= 0.1
##$BCFW= 1
##$BC_mod= 2
##$BYTORDP= 1
##$COROFFS= 0
##$CY= 11.3945322036743
##$DATMOD= 1
##$DC= 2
##$DFILT= <>
##$DTYPP= 0
##$F1P= 2.36226072786647
##$F2P= -0.459571619588291
##$FCOR= 0.5
##$FTSIZE= 0
##$FT_mod= 4
##$GAMMA= 1
##$GB= 0.15
##$INTBC= 1
##$INTSCL= 1
##$ISEN= 128
##$LB= 0.24
##$LEV0= 0
##$LPBIN= 0
##$MAXI= 10000
##$MC2= 0
##$MEAN= 0
##$ME_mod= 0
##$MI= 1.114404
##$NCOEF= 0
##$NC_proc= 0
##$NLEV= 6
##$NOISF1= 3.799351
##$NOISF2= 2.8
##$NSP= 1
##$NTH_PI= 0
##$NZP= 0
##$OFFSET= 15.70392
##$PC= 1
##$PHC0= -15668.73
##$PHC1= 9.600811
##$PH_mod= 1
##$PKNL= yes
##$PPARMOD= 0
##$PSCAL= 0
##$PSIGN= 0
##$REVERSE= no
##$SF= 200.130013532006
##$SI= 16384
##$SIGF1= 3
##$SIGF2= 2
##$SINO= 400
##$SIOLD= 16384
##$SREGLST= <1H.CDCl3>
##$SSB= 0
##$STSI= 0
##$STSR= 0
##$SW_p= 3612.71676300578
##$SYMM= 0
##$S_DEV= 0
##$TDeff= 0
##$TDoff= 0
##$TI= <>
##$TILT= no
##$TM1= 0
##$TM2= 0
##$TOPLEV= 0
##$USERP1= <user>
##$USERP2= <user>
##$USERP3= <user>
##$USERP4= <user>
##$USERP5= <user>
##$WDW= 1
##$XDIM= 8192
##$YMAX_p= 0
##$YMIN_p= 0
$$ End of Bruker specific parameters
$$ ---------------------------------
##NTUPLES= NMR FID
##VAR_NAME=  TIME,          FID/REAL,        FID/IMAG
##SYMBOL=    X,             R,               I
##VAR_TYPE=  INDEPENDENT,   DEPENDENT,       DEPENDENT
##VAR_FORM=  AFFN,          ASDF,            ASDF
##VAR_DIM=   8192,          8192,            8192
##UNITS=     SECONDS,       ARBITRARY UNITS, ARBITRARY UNITS
##FACTOR=    0.0002768,     1,               1
##FIRST=     0,             0,               0
##LAST=      2.2672688,     0,               0
##MIN=       0,             -246387,         0
##MAX=       2.2672688,     263673,          0
$$ Real data points
##PAGE= N=1
##DATA TABLE= (X++(R..R)), XYDATA
$$ [...]
1622c130J347M040M57m471j572M370K273l412l235K186M209j136m574J50M140
$$ -3130 -1783 2257 2714 -1757 -3329 1041 3314 -98 -3333 -1147 3062 1926 -2648 -2498 1642
1637A642J424l826k801L616L350k619l769J013M434K97m822j023M187K004k946
$$ 1642 3066 -760 -3561 55 3405 786 -2983 -1970 2464 2761 -2061 -3084 1103 3107 161
1652A61l378K008M430j413m564K97M227J312m009k621L730L160k575l878J274
$$ 161 -3217 -1209 3221 1808 -2756 -2459 1768 3080 -929 -3550 180 3340 765 -3113 -1839
1667a839M455p3m594r44M047K276l444l486K860M029j793m089J43M275J354m352
$$ -1839 2616 2543 -2051 -2995 1052 3328 -116 -3602 -742 3287 1494 -2595 -2452 1823 3177 -1175
1683a175k204L745K862k420l929J282M734m05m751n97M086K103l577l236K839
$$ -1175 -3379 366 3228 808 -3121 -1839 2895 2490 -2261 -2858 1228 3331 -246 -3482 -643
1698f43L859j637m244J56M620R61m477j887L691K944k659l995J779M479q00m186
$$ -643 3216 1579 -2665 -2509 2111 3072 -1405 -3292 399 3343 684 -3311 -1532 2947 2147 -2039
1714b039q12M013K285l830l116L086L685j789m181L08M686P19m456j723L607K969
$$ -2039 -2851 1162 3447 -383 -3499 -413 3272 1483 -2698 -2390 2296 3015 -1441 -3164 443 3412
1730C412k685m119J994M389p31m345q04M306K033m056k793L049L566j835m186
$$ 3412 727 -3392 -1398 2991 2260 -2085 -2889 1417 3450 -606 -3399 -350 3216 1381 -2805
1745b805N90M518M90m298j655L641L005l093l766K157M136q22m271o24M386J647
$$ -2805 -2215 2303 2793 -1505 -3160 481 3486 393 -3373 -1216 2920 2098 -2173 -2797 1589 3236
1761C236l929k612K970L562j820m461R22M580J92m189j575L738K839l230l526
$$ 3236 -693 -3305 -335 3227 1407 -3054 -2132 2448 2640 -1549 -3124 614 3453 223 -3303
1776c303K168L939p53m339n33M472J525l869k568K993L588k144m195J125M236
$$ -3303 -1135 2804 2051 -2288 -2821 1651 3176 -693 -3261 -268 3320 1176 -3019 -1894 2342
1791B342J73l993j693L863K727l326l358K173M014r14m531j08M493J084l841k311
$$ 2342 2515 -1478 -3171 692 3419 93 -3265 -1092 2922 2008 -2523 -2631 1862 2946 -895 -3206
1807c206L000L490k282m011J227M202Q3m204j486M191K294l416l092K263L905
$$ -3206 -206 3284 1002 -3009 -1782 2420 2503 -1701 -3187 1004 3298 -118 -3210 -947 2958
1822B958j204m336J77M217J048l754k456L336L357k621l803J490M033p9m260j086
$$ 2958 1754 -2582 -2405 1812 2860 -894 -3350 -14 3343 722 -3081 -1591 2442 2363 -1897 -2983
1838b983M117J935l270k987K274L943j426m284M24M197Q90l976k111L557K992
$$ -2983 1134 3069 -201 -3188 -914 3029 1603 -2681 -2257 1940 2830 -1146 -3257 300 3292
1853C292k783l422J354M040j02m399p55M023J791l295l072K640L853j759m071
$$ 3292 509 -2913 -1559 2481 2379 -2020 -2775 1248 3039 -256 -3328 -688 3165 1406 -2665
1868b665N44L954R84l975k025L601K782k659l452J429M191m79m482m24L959J642
$$ -2665 -2121 1833 2817 -1158 -3183 418 3200 541 -2911 -1482 2709 2230 -2252 -2676 1283 2925
1884B925l261k905K780L601j916l724M19M081Q47m191j744L690K494k577l561
$$ 2925 -336 -3241 -461 3140 1224 -2500 -2081 2000 2847 -1344 -3088 602 3096 519 -3042
1899c042J679M174q14m140l30L753J826l466k936L023L350j820l834M96M286N11
$$ -3042 -1363 2811 1997 -2143 -2473 1280 3106 -360 -3296 -273 3077 1257 -2577 -2081 2205 2716
1915B716m259j344L504K445k520l582J796M041r11m020l73L883J753l763k446
$$ 2716 -1543 -2887 617 3062 542 -3040 -1244 2797 1886 -2134 -2507 1376 3129 -634 -3080
1930c080L020L024j841l754O65M321J34m010j262L372K654k965l478K292L768
$$ -3080 -60 2964 1123 -2631 -1966 2355 2489 -1521 -2783 589 3243 278 -3200 -908 2860
1945B860j194l778l41L956J472l833k112K934K917j775l911R56M315j72l949j135
$$ 2860 1666 -2112 -2453 1503 2975 -858 -2970 -36 2881 1106 -2805 -1849 2466 2294 -1655 -2790
1961b790L563K363l172l043K368L350r55l919k79M311J006l884j864K951L024
$$ -2790 773 3136 -36 -3079 -711 2639 1684 -2235 -2514 1797 2803 -1081 -2945 6 3030
1976C030k148l954J613L883l83l642j182L642K294l381k800K311L390j078m134
$$ 3030 882 -3072 -1459 2424 2041 -1601 -2783 859 3153 -228 -3028 -717 2673 1595 -2539
1991b539L27M168O27l716j714K928L043k469l604J685L556k12l874r96L958J779
$$ -2539 -2212 1956 2583 -1133 -2847 81 3124 655 -2949 -1264 2292 2080 -1794 -2790 1168 2947
2007B947l481k389K425L261j316m021N86L920M45l405j931L217K872k860l161
$$ 2947 -534 -2923 -498 2763 1447 -2574 -1988 1932 2377 -1028 -2959 258 3130 270 -2891
2022b891J734L542l52m072n84M063J277l198k273K201L462j673l933R16L750L49
$$ -2891 -1157 2385 2033 -2039 -2623 1440 2717 -481 -2754 -553 2909 1236 -2697 -1781 1969 2318
2038B318l553j723L539K444k857k902J557L665n38m040k71L716J259l035k609
$$ 2318 -1235 -2958 581 3025 168 -2734 -1177 2488 1950 -2090 -2361 1355 2614 -421 -3030
2053c030K709L373k261l359J059L364N79l691j642L664K032k655k771J471L730
$$ -3030 -321 3052 791 -2568 -1509 1855 2434 -1257 -2899 765 2797 142 -2629 -1158 2572
2068B572p84m023R6L567J186l236k314K916K846k008l167N93L736M40m038r77
$$ 2572 1788 -2235 -2139 1428 2614 -622 -2936 -20 2826 818 -2349 -1756 1980 2420 -1618 -2595
2084b595L451J736k462k922J804L747j320l649K70L225J277l202k281L105K626
$$ -2595 856 2592 130 -2792 -988 2759 1439 -2210 -1940 1285 2562 -640 -2921 184 2810
2099B810k087l206R72L749r1l905n39L163J841k665k894K185L318j352l257m1
$$ 2810 723 -2483 -1511 2238 2147 -1758 -2297 866 2707 42 -2852 -667 2651 1299 -1958 -1999
2115a999L494J201l771j676L223K130j910l206R95L829m24l500o42L050J930k863
$$ -1999 1495 2696 -1075 -2751 472 2602 692 -2514 -1519 2310 1886 -1614 -2256 794 2724 -139
2131a39k762K483K967j424l212M2L714P45l569j271K603K427j871l371J358L687
$$ -139 -2901 -418 2549 1125 -2087 -2045 1669 2414 -1155 -2426 177 2604 733 -2638 -1280 2407
2147B407p44l298o18L179J825l162k287K417K689j154l350J93L763L95l360j371
$$ 2407 1663 -1635 -2253 926 2751 -411 -2698 -281 2408 1254 -2096 -1903 1860 2255 -1105 -2476
2163b476K725K475k284l149J816L098o82l054p83L358J682l295k011K228K720
$$ -2476 249 2724 440 -2709 -893 2205 1523 -1531 -2314 1044 2726 -569 -2580 -352 2368
2178B368j164l536N76L647R3l105j259K660K441k477k832J672K973l00l441o34
$$ 2368 1204 -2332 -1756 1891 1984 -1121 -2380 280 2721 244 -2588 -916 2057 1757 -1684 -2318
2194b318L641J064l010j774K051K809j429l482J007L230J69k918j531K922K322
$$ -2318 1323 2387 -623 -2397 -346 2463 1034 -2448 -1441 1789 1958 -960 -2491 431 2753
2209B753k697k507J603K902l98l537j83L438Q09k647j981K083K940j747l111R10
$$ 2753 56 -2451 -848 2054 1656 -1881 -2064 1374 2183 -464 -2445 -362 2578 831 -2280 -1370
2225a370L047L51l195j392L323J739k594k097J290L029n65l531P3L215P99k584
$$ -1370 1677 2028 -1167 -2559 764 2503 -91 -2188 -898 2131 1566 -1965 -1892 1323 2122 -462
2241d62k036K373K761k122k701Q86L002K94l306j011L111J483k113k417J370L236
$$ -462 -2498 -125 2636 514 -2187 -1301 1701 1995 -1311 -2322 789 2272 159 -2258 -888 2348
2257B348r99l355L14K879R68k789j844K647K203j850k579P33L107J64l445o13
$$ 2348 1349 -2006 -1692 1187 2155 -634 -2478 169 2372 522 -2057 -1324 1783 1947 -1498 -2111
2273b111K885J519k256k465J846K939j325k796J67K730J115l015j651K646J998
$$ -2111 774 2293 37 -2428 -582 2357 1032 -1764 -1597 1133 2248 -767 -2418 228 2226
2288B226j613k652P45L280l42l195l18K627J496k275k406K007K606j217k709k
$$ 2226 613 -2039 -1294 1986 1644 -1551 -1869 758 2254 -21 -2427 -420 2186 969 -1740 -1742
2304a742L077Q42l179j179K541J768j541k762J002L217o35k771n20K485J749k576
$$ -1742 1335 2177 -1002 -2181 360 2128 587 -2175 -1173 2044 1409 -1362 -1882 603 2352 -224
2320b24k215K242K308j167k694M8L222M00k930r87K120K038j666k782J387K885
$$ -224 -2439 -197 2111 944 -1750 -1702 1520 1920 -1010 -1997 123 2161 495 -2287 -900 1985
2336A985o35k703o25K870J396k736j749K057K013q67k849L17L145Q2k635j107
$$ 1985 1350 -1353 -1978 892 2288 -448 -2197 -140 1873 1006 -1843 -1526 1619 1701 -934 -2041
2352b041K303K036k073k445J600K422m86k671n05K897J034k630j438J708K327
$$ -2041 262 2298 225 -2220 -620 1802 1316 -1355 -1860 1037 2071 -559 -1997 -289 2038
2367B038j070k970P40K863l4k517j097K393J886k255k046J391K367l42k874l08
$$ 2038 968 -2002 -1262 1601 1567 -950 -2047 346 2232 -23 -2069 -678 1689 1347 -1527 -1835
2383a835L005P24k385j581J769K462j449k728R61K502J00k457j156K656J631k299
$$ -1835 1170 1894 -491 -2072 -303 2159 710 -2018 -1057 1445 1545 -912 -2068 588 2219 -80
2399h0j877J280K522m77l042J00K773N41k132j646J895K284j585k415Q62K408
$$ -80 -1957 -677 1845 1368 -1674 -1574 1199 1740 -392 -2038 -143 2141 556 -1859 -997 1411
2415A411K93k793r48K770J206k036j777J205K539p42k770K48K401P12k171j674
$$ 1411 1704 -1089 -2037 733 1939 -97 -1874 -669 1870 1128 -1642 -1394 1007 1719 -452 -2126
2431b126K254J998j785k127P94K443P2k750n36K500J067j796j918J363K546j108
$$ -2126 128 2126 341 -1786 -992 1451 1523 -1227 -1763 737 1804 8 -1910 -547 1999 891
2447H91k508L51K361P63k567j276K315J568j565j969M94K707m8k839k88K335J093
$$ 891 -1617 -1266 1095 1858 -709 -1985 330 1898 333 -1636 -1142 1565 1517 -1322 -1610 725 1818
2464A818j845k063J698K306j213k174J89K350O84k526j096K169J516j400k242
$$ 1818 -27 -2090 -392 1914 701 -1473 -1284 1066 1750 -776 -1872 297 1813 413 -1829
2479a829R28K625n66k436k16K182J108k008j799J850J974j131k086Q8K550M03
$$ -1829 -901 1724 1158 -1278 -1494 688 1796 -212 -2011 -161 1813 682 -1404 -1316 1234 1637
2495A637k610p16J969J492j425k249J170K372n87k242l70K212J190k244j507J786
$$ 1637 -973 -1689 280 1772 347 -1902 -732 1640 1053 -1189 -1559 653 1843 -401 -1908 -122
2511a22J770r02k338L21K637K9k307o55J785J531j463k213J323K238o61k079l61
$$ -122 1648 746 -1592 -1271 1366 1395 -912 -1567 218 1749 286 -1927 -604 1634 973 -1106 -1467
2528a467K323R12k279j168J582J714q96k351N43K406o1k037q85J987J562j875
$$ -1467 856 1768 -511 -1679 -97 1617 721 -1630 -1087 1319 1258 -779 -1664 323 1885 10
2544A0j794J328J898m51k146l52K403P21k087j136J491J796j088k283P03K277
$$ 10 -1784 -456 1442 991 -1155 -1507 896 1617 -470 -1606 -115 1681 593 -1690 -987 1290
2560A290m5k101q02K117J278j815j484J026J963l27k475L1K426L62j882j175J535
$$ 1290 1245 -856 -1658 459 1737 -78 -1562 -536 1427 1100 -1375 -1344 1082 1444 -438 -1613 -78
2577g8J837j358k082R43J978o4j982q16K109J168j728j503J105J994o88k217K92
$$ -78 1759 401 -1681 -738 1240 1176 -806 -1622 487 1655 -73 -1576 -471 1523 835 -1382 -1090
2594a090K048M35j820j238J731J626j375j786P10J902J49k280m99K233P45j645
$$ -1090 958 1393 -427 -1665 66 1692 317 -1469 -759 1143 1292 -988 -1487 746 1491 -154
2610a54j352J099J904p84k045L21J960M75j937j114J785J456j386j612O24K063
$$ -154 -1506 -407 1497 713 -1332 -1011 949 1424 -513 -1627 158 1614 228 -1384 -760 1303
2626A303j97k233j04J841P52j384j577J148K014r53j871L12J885M08j930r43J801
$$ 1303 1106 -1127 -1231 610 1362 -22 -1599 -451 1563 610 -1261 -949 936 1344 -586 -1529 272
2643B72J185j216j602O56J957k19k043j83J792Q72j616j487J563J569j037j661
$$ 272 1457 241 -1361 -705 1252 1033 -1010 -1193 599 1471 -145 -1632 -69 1500 463 -1198
2659a198K16J922L99k038p37J727J116j116j768Q66J987m81j968r6J746Q51j733
$$ -1198 -982 940 1339 -699 -1436 291 1407 291 -1477 -611 1376 895 -1073 -1169 577 1428 -305
2676c05j209J464J413p89j779K05K095P2j969m62J528J166j267j712J116J803
$$ -305 -1514 -50 1363 574 -1205 -1000 1095 1167 -802 -1264 264 1430 163 -1549 -433 1370
2692A370o34j662j90J731Q05j760j067J351J440q84j797M95J886j17j706m84J483
$$ 1370 736 -926 -1116 615 1420 -340 -1407 -56 1384 500 -1297 -802 1084 967 -739 -1223 260
2709B60J163j437j467J148J528m13j819j46J988M56j777p60J289J266q82j754
$$ 260 1423 -14 -1481 -333 1195 782 -1037 -1183 805 1261 -516 -1276 13 1279 397 -1357
2725a357O66J724j24j617n76J657J094j556j260J103J460m90j775Q7J843K57j569
$$ -1357 -691 1033 909 -708 -1284 373 1467 -89 -1349 -246 1214 724 -1051 -964 879 1136 -433
2742d33q50J253J430j062j656P20J653k09j619m16J726P34j496j057J037J447
$$ -433 -1283 -30 1400 338 -1318 -598 1055 846 -773 -1189 537 1271 -225 -1282 -245 1202
2758A202n14j818K02J827J39j498q03J386J254j200j465P75J479p2j697l58J720
$$ 1202 688 -1130 -928 899 1038 -460 -1263 123 1377 177 -1288 -513 966 894 -803 -1161 559
2775E59O37j349j070R73J559q22j641L85J632J47j500p46J453J047j156j229O39
$$ 559 1196 -153 -1223 -250 1309 487 -1154 -769 863 1010 -490 -1236 217 1264 108 -1121 -482
2792d82J587k77j749j50J692N42j388j054J124J414q57j506M00J489K80j577o71
$$ -482 1105 828 -921 -1071 621 1163 -225 -1279 -155 1259 402 -1104 -704 785 1065 -512 -1183
2809a183J522R40j208j177P22J487l84j667O2J468M72j297r96J191J300r81j241
$$ -1183 339 1279 71 -1106 -384 1103 719 -948 -886 582 1054 -243 -1239 -48 1252 271 -970
2826i70K54J554J44j684m11J489P01r95j211P25J507n11j489M1J455N28j469r11
$$ -970 -716 838 982 -702 -1113 376 1077 82 -1129 -404 1103 592 -897 -856 599 1127 -342 -1253
2844a253J364J090r32j319L59J596j4j547l47J359P60j100j260R92J366o11j322
$$ -1253 111 1201 269 -1050 -691 905 891 -656 -1003 356 1116 16 -1244 -252 1114 503 -819
2861h19L8J459L91j424p75J241R21p43j323M04J531p6j522k75J318P37j193j035
$$ -819 -781 678 1069 -355 -1130 111 1032 289 -1034 -630 901 825 -697 -972 346 1083 -110 -1145
2879a145R85J140n33j255j5J527L17j474n72J056J022q06j338N67J473l21j276
$$ -1145 -160 980 447 -808 -823 704 1021 -453 -1025 31 1053 247 -1091 -524 949 628 -648
2896f48k57J302O75j228r29R41J139m70j381R7J495J49j350m83J074R52q93j193
$$ -648 -905 397 1072 -156 -1085 -144 995 525 -856 -759 736 885 -465 -948 126 1078 185 -1008
2914a008O18J234j69j294l27J375N74j226p67Q70J070n40j311K91J310J10j215
$$ -1008 -390 844 675 -619 -946 429 1003 -223 -990 -120 950 410 -901 -610 700 810 -405
2931d05n49J011J041r71j129O50J198k23j303j90J406M03j120q05Q31J107n26
$$ -405 -954 57 1098 127 -1002 -352 846 623 -680 -870 536 939 -181 -986 -155 952 426
2948D26j297K71J321N9j231n57J209Q24j031q99O49J100k37j366LJ252M00j074
$$ 426 -871 -600 721 780 -451 -1008 201 1025 -6 -905 -256 844 607 -759 -756 496 896 -178
2966a78q22R29J062p07j129L73J090Q7j198m72J314N83r11q67M89J222l11j260
$$ -178 -1000 -71 991 284 -845 -472 618 705 -493 -965 349 932 21 -846 -357 865 554 -706
2984g06RJ191L62j068p69J026Q68p10r51K43J157J14j282k95J125N30p69r74N74
$$ -706 -697 494 856 -212 -981 45 913 203 -748 -505 652 766 -516 -811 314 844 75 -899 -325
3003c25J184m72j085Q6J016M08j027o79Q80Q89o18j057K49J242q8j146j78R74
$$ -325 859 387 -698 -612 404 812 -215 -894 -14 875 257 -800 -551 691 603 -543 -721 253
3021B53O16q40r37O92J021l82j059k2J110M54j216n52R56P05n97r87L79J106r8
$$ 253 869 29 -908 -216 805 423 -636 -658 452 906 -310 -862 94 799 202 -785 -406 700 602
3040F02j074k94R97P03r84q89P89R27l26j121M2J145K06j116m01P89Q15n62j089
$$ 602 -472 -766 231 934 -50 -939 -150 777 451 -670 -628 517 723 -393 -794 -5 810 248 -841
3059h41M38J094j42j048k19R97N74r48p13O95Q72l02j095M8J148J13r32n08P98
$$ -841 -403 691 549 -499 -718 279 853 -95 -808 -113 759 457 -638 -590 558 671 -261 -769 29
3078B9Q30p12r81N68R05j79r10k48J026M93r48o48N66R21l11j067J10J084J15
$$ 29 859 147 -834 -266 639 460 -450 -698 328 821 -127 -775 -209 712 401 -666 -556 528 643
3097F43r40m91Q14P39p27p38L75R23l2j097j98J147K57q29n54N31R29m33r96L23
$$ 643 -297 -788 26 765 38 -700 -325 598 566 -531 -729 418 675 -154 -708 -177 752 319 -677 -354
3117c54Q47J56r08n51R77N96p20o86K91J030j55j060K0Q23L51p07p17O14R37n83
$$ -354 493 649 -259 -810 167 763 43 -643 -352 678 523 -537 -517 306 657 -50 -767 -153 784 201
3137B01q05K29P95K41r27m56R49M54n86p87M02Q76r5j017lQ41L57p05p58P57O90
$$ 201 -604 -375 420 661 -266 -722 227 681 95 -692 -290 586 491 -526 -529 312 669 -36 -794 -37 653
3158F53m20q01J39R24J18r55k46P13M67n22p51L68R64k58q30n7P64L96p93n94
$$ 653 233 -568 -429 495 613 -342 -588 125 592 70 -681 -313 651 393 -437 -494 270 666 -127 -721
3178g21P88M99l24q19J10R47O2q63k49P08N03n46q43O20Q01l45p63m0P54L72q41
$$ -721 67 566 242 -577 -467 480 542 -321 -570 138 641 95 -748 -128 673 328 -435 -475 279 651 -190
3199a90l80O28N03l10q81K29R24j37p13k13P05N24p50n63M68O60j41p48k22R40
$$ -190 -570 58 561 251 -630 -401 523 386 -327 -540 165 689 -61 -624 -156 504 363 -385 -607 333
3219C33K86r32l07O25N65l56q55L37Q01j41o57k21O46M95o82n70M89O17j28q87
$$ 333 619 -313 -620 5 570 214 -641 -304 497 356 -301 -522 124 619 -63 -633 -144 473 345 -542
3239e42J02Q15N7o43l08M82O78m55p91M05O26J1p42l10Q53L19o88m14M26O64j94
$$ -542 -440 375 432 -211 -519 -37 641 186 -605 -200 426 437 -305 -615 238 557 -131 -545 -119 545 351
3260C51r08J72P39O5n75m56O08O54o08n61L30N85N0q56j00P48K50n75m43L27Q07
$$ 351 -557 -385 354 419 -156 -612 -4 650 42 -519 -189 396 446 -410 -510 238 488 -87 -530 -203 604
3281F04l28p90K04O45J09o14m17P42M27o56l40J02P02Np87o7O98J77m72n23M35
$$ 604 276 -514 -310 335 444 -170 -587 155 582 -74 -414 -312 390 395 -392 -459 239 416 -56 -579 -144
3302a44P10m72n63J71N54K28p14l49P49K97m44m55J52P64j25p75N4N88K46n32
$$ -144 566 94 -469 -298 256 484 -230 -579 170 467 23 -432 -280 484 359 -416 -362 226 472 -60
3322f0m81N71M91l77n03L8O66J08p63k17P39K18l60n90L12P16l29n28M4M43L58
$$ -60 -541 30 521 144 -359 -321 345 453 -310 -527 212 430 70 -520 -208 508 179 -349 -305 138 496
3343D96n65m89O06L87l21m59j7P21P4q00k6M86L32l35n87L75O49l13n07p2N81
$$ 496 -69 -558 48 435 114 -345 -362 359 433 -367 -393 93 425 90 -497 -122 527 214 -293 -365 216
3364B16L05p08k69N54L26k65n30M4P18n6o43o5M02M80n15n62N51M45k31m88j55
$$ 216 521 -187 -456 98 424 159 -371 -327 391 335 -308 -373 29 509 -6 -568 -17 428 197 -291 -446
3385d46P07J36o65j52L67N03k70p17K93O71j79m66k22N29M11n58m02M72L38p9
$$ -446 261 397 -268 -420 -53 450 180 -537 -244 427 248 -218 -440 89 500 -58 -460 12 350 271
3405B71n89j13P99K1o02j27L48M51l77n46L53M24j23l99j73N30L46o07k40L24
$$ 271 -318 -431 368 389 -213 -340 8 459 82 -464 -111 313 190 -209 -382 148 494 -113 -353 -29
3425b9L57p4p00J50O60p9m31k53L85N20m81m83L51M03J0n04k05P18O0m84k06K17
$$ -29 328 254 -446 -296 364 285 -146 -399 -14 506 25 -458 -107 296 306 -198 -403 315 375 -109 -315 -98
3447i8N13k01o34K33M42j6l33l67N29M34n55l56L06L64L8o35j9O42Kl46l16K41
$$ -98 415 214 -420 -187 255 239 -94 -461 68 502 -53 -409 -103 261 299 -336 -355 287 289 -57 -373 -132
3469a32N71l26n55K77L34J31m50k89N70K55m55j74J8N40j0o73J41M18J04l75l30
$$ -132 439 113 -442 -165 169 300 -150 -439 131 386 -69 -243 -225 315 305 -368 -227 191 295 -80 -410
3490d10L39N22l80l31R2M17J41n64j69N60O5k36l80J35O13k24n44J53L29J52l28
$$ -410 -71 451 71 -260 -168 249 390 -174 -343 217 282 46 -334 -199 414 190 -354 -201 128 280 -48
3511d8l97N05K80l00l14M7M74J08o54j0M79J33k54m78L44M91k89l08k7L24K79
$$ -48 -445 60 340 40 -274 -227 247 355 -299 -309 170 303 49 -429 -85 406 117 -191 -218 106 385
3532C85n32k29N05J73k05l82J3N89q6m85P2K17K36k27m39L55L41j83l10o4L86
$$ 385 -147 -376 129 302 97 -285 -272 317 231 -254 -182 35 271 44 -395 -40 301 118 -192 -256 130
3553A30K24o03o6L58J59m5n45K02N94k64k54j09K44L62m58l41M67J94j82k30n8
$$ 130 354 -249 -315 43 202 157 -388 -186 408 144 -110 -219 25 387 -71 -412 55 249 67 -163 -221
3574b21M74M1m51k5J87K57r1n49L12L59j64k99j83M07L02m78k04K96K18j1m41
$$ -221 253 294 -157 -182 5 262 171 -378 -66 293 129 -170 -353 54 356 -122 -326 -30 188 177 -264
3595b64JN62j25l25m4K17L25l09l83L38K09j9k65j72M30J73m67p2J94L08j24m91
$$ -264 -263 299 174 -151 -195 22 347 38 -345 -7 202 183 -82 -254 176 349 -118 -190 4 312 188 -303
3617c03K13L28o2k07j67K26L41m27k18K77J97K6m21j22N52j8l02j27J54L55j77
$$ -303 -90 238 176 -31 -198 28 369 -58 -276 1 198 224 -197 -319 233 215 -87 -214 -60 295 118
3638A18l85K04K41Nl59j26M08K03m27r1J22K98Rm84J01L66n1j55k10J18N08l70
$$ 118 -267 -63 178 183 -176 -302 106 309 -118 -209 -87 211 220 -264 -163 203 152 -3 -213 -95 413 43
3660D3k93K07J95O9l48j79M62R6l14j10L2L91j49l48J36J64Q3j25l75M10K39l36
$$ 43 -250 -43 152 221 -127 -306 156 252 -62 -172 -140 251 102 -246 -110 54 137 12 -363 47 286 -50
3682e0j19L7K66J13m70l3L49O1r0l05Q6N13l00k95J02K02J71l24j97L69Q6j82
$$ -50 -169 -132 134 247 -223 -256 93 154 64 -241 -155 358 58 -237 -135 67 238 -86 -283 86 172 -10
3704a0j10o7M14k0m50J15K36N9q8m13K79K66j73j73n8K68K29m56j22L51M2l0l10
$$ -10 -120 -187 227 207 -243 -128 108 167 79 -334 -55 211 38 -135 -193 75 304 -152 -274 77 119 89 -221
3727b21K5M40j33k82K9J41K42k00k53L12J69k11k04n5L71J07m36L5J83R8r1l83
$$ -221 -196 244 111 -171 -142 -1 241 41 -212 100 269 58 -146 -201 170 277 -159 -124 59 157 66 -317
3749c17K41L15j86j29j43K37K54l53j64L30J12q1k65n2L87l0k82k1J30K73j70
$$ -317 -76 239 53 -76 -219 18 272 -81 -245 85 197 116 -149 -201 186 156 -126 -147 -17 256 86
3770H6l55K25J78j1k13j19L43J14m21L8J03J53Ok97L1L89j71r5j56J32K75k92
$$ 86 -269 -44 134 123 -90 -209 134 248 -173 -135 -32 121 127 -170 -139 250 79 -16 -172 -40 235 -57
3792e7j51K44Q6J5k33j00L19L9k61l0P7K36p2l56J89J67lj47k04K84J82k41j63
$$ -57 -208 36 122 137 -96 -196 123 162 -99 -129 -52 184 112 -244 -55 112 109 -38 -242 42 224 -17 -180
3815a80J19J57J11l93J7L83r6j15j94J49L20k69j67J76M3R0j80k09L53L5j60r5
$$ -180 -61 96 207 -186 -169 214 118 3 -191 -42 278 9 -158 18 61 151 -29 -238 115 150 -10 -105
3837a05J4K18J3l54J33J34Q5j14k44K16K34k06j54K0J78J14k81r7L21m6l2k21
$$ -105 -91 127 140 -214 -81 53 138 24 -220 -4 230 24 -130 -110 68 182 -99 -196 125 79 47 -174
3859a74K7L42q7k04K5O0J75j37k61L01J03j77r4m5K85Nl19Q6J67J3j03j96J27
$$ -174 -147 195 108 -96 -71 -11 164 27 -234 67 170 -7 -101 -146 139 144 -175 -89 78 91 -12 -208 -81
3882h1K56j81p9L0P3J74k73j36K41Pj5q1q3L16q3k39R9N9J76j24k72K08J69j21
$$ -81 175 -6 -85 -55 18 192 -81 -217 24 31 16 -65 -148 168 85 -154 -55 4 180 56 -216 -8 161 40
3906D0m1r9J52J35k80LJ04N3J0k72Q8K83j09j48k8Q2K49k20k16K49M6Kj71j02
$$ 40 -1 -100 52 187 -93 -90 14 67 77 -195 -107 176 67 -81 -109 -27 222 2 -214 35 81 83 -88 -190
3930a90L25n8j37k3Q0R5m3k56J75J05pr3r0J54J86k51n7K9J20Q0k29q9L15r3r4
$$ -190 135 77 -60 -83 -3 92 49 -207 -32 73 66 -27 -117 37 223 -28 -85 -56 64 144 -85 -174 141 48 -46
3955d6n8R2K09j67k17K42pQ6j98j27L06j1j29m1KJ29M5k64O2J84j09L0j64J14
$$ -46 -104 -12 197 30 -187 55 48 134 -64 -191 115 104 -25 -66 -64 65 110 -154 -92 92 -17 13 -151 -37
3979c7K43k26j05N4O2J31k15LK05n9Mj76L1K84j83k11K32L0Qm3j81J73P1j10k6
$$ -37 206 -20 -125 -71 -9 122 -93 -90 115 56 60 -116 -85 199 16 -195 37 67 75 32 -149 24 95 -15 -41
4004d1m6K00qk65P3J43J6o1j80R8K07j46q3K8L6K02k70l7K22j4j5j27o4K93p9
$$ -41 -87 113 105 -160 -87 56 72 11 -169 -71 136 -10 -93 -65 -29 173 -97 -134 88 74 59 -68 -132 161 82
4029H2j82J35K1N8m7j89J43J20j29m8r8J76J48k95N4J09lP2k15K6K14j08j08M
$$ 82 -100 35 56 114 67 -122 21 141 12 -36 -134 42 190 -105 -51 58 55 127 -88 -62 152 44 -64 -60
4053f0L5J71j49j52K04NJ2j54m3K15j5j32l0O6J13L2k69J29J84j07n6j13J93N5
$$ -60 -25 146 -3 -155 49 54 66 -88 -131 84 69 -63 -93 -27 86 118 -151 -22 162 55 -1 -114 79 134
4077A34k29M8Q9K7K3j82rJ72N5j52Ok5K28j89j30J36L7j2l2j81K53N3j72L6n3
$$ 134 -95 -47 42 69 92 -90 -99 73 128 -24 -18 -43 185 -4 -134 2 39 27 -5 -186 67 120 -52 -16 -69
4102f9J22L6k98K02J17q7j5j50J03J86j08j49P5j6J82j62o3K10k0j25k7M0J24
$$ -69 53 89 -209 -7 110 23 8 -142 -39 147 39 -110 -35 -51 131 -31 -94 116 96 -29 -56 -16 108
4125A08l4k27J10L6O0J8k26J79O4j72L5k0J19J03k71L6J37l5P6k20O8J90r1j02
$$ 108 74 -153 -43 -7 53 71 -155 24 88 -84 -49 -69 50 153 -118 -82 55 20 96 -124 -56 134 43 -59
4149e9LQ1J13j86r0K30o5K4p4p4K17%k21R1K6O1m0k36K17J24j63J6p8P5J19j89
$$ -59 -56 25 138 -48 -138 92 27 51 -23 -97 120 120 -101 -10 16 77 37 -199 18 142 -21 -5 -83 -8 111 -78
4175g8jN6N2Nj76N0J77n9j00%M5J85j66j36J76OQn7q8K22Nj81J6L7P3P9k88J17
$$ -78 -79 -23 29 34 -142 -92 85 26 -74 -74 -29 156 -10 -146 30 36 44 -13 -101 121 126 -55 -39 -2 71 150 -138 -21
4203b1J32q1j1o0L3K17k67k4J23J0P0k20J1K62j95n5R5p1J92o8k39J71K4L4n3
$$ -21 111 30 19 -41 -8 209 -58 -82 41 51 121 -99 -88 174 -21 -76 19 -52 140 72 -167 4 28 62 9
4228Ij65K25P1j69J1k5J46l7j64LJ97r0Rj04K6K68j98r8R2P4K0j55p6K44p9p5
$$ 9 -156 69 140 -29 -18 -43 103 66 -98 -95 102 12 21 -83 -57 211 13 -85 7 81 101 -54 -130 114 35 -40
4254d0m8J5K43j06j62P4L4O1p5j38J49P2j57K8N2K1P2j90JJ64j2Oj28nK03r2j06
$$ -40 -88 -73 170 64 -98 -24 10 71 -4 -142 7 79 -78 -50 2 23 95 -95 -94 70 58 64 -64 -69 134 42 -64
4281f4J29o9J56j57j43J98O5j13n8l7K03n0j60L5P5J7J4j81J04J57j72K5n4P1
$$ -64 65 -4 152 -5 -148 50 115 2 -56 -93 110 60 -100 -65 10 27 41 -140 -36 121 -51 -26 -80 -9
4305iJ53k25j1J18J9Pj64pK39j42m0O6rJ36j11j27J35Q8o3o1r8K31K2k75J53m4
$$ -9 144 -81 -92 26 45 52 -112 -119 120 -22 -62 4 -5 131 20 -107 28 116 53 -8 -106 125 147 -128 25 -19
4331a9Q3J4j72J3J55m1n7r9O8J92k11j11K05NM5j72J1J95p8o3o0L8J34m0k00K03
$$ -19 64 78 -94 -81 74 33 -24 -123 -55 137 -74 -185 20 25 70 -102 -91 104 26 -37 -97 -59 75 35 -165 38
4357C8J7m5j6j20J84P8j78mL3R7M0k25L0J57j7r3m5O7P2n7j25J39PK7r8r0K04
$$ 38 55 10 -6 -126 58 136 -42 -46 -13 84 124 -101 -71 86 69 -24 -69 -2 70 13 -112 27 34 61 -37 -127 77
4384G7N5j18o9M6O7N2k75J62O2m1l8j07J20J08j13l8N3K4P5k11PJ87q6M3j66P1
$$ 77 132 14 -55 -9 58 110 -165 -3 59 18 -20 -127 -7 101 -12 -50 3 27 102 -109 -102 85 -1 42 -124 -53
4410e3K00j12j32L0O7P6o7j72L00Jk17M6lJ00K2k23R2N0N0Pj84J08J74j66o5K1
$$ -53 147 35 -97 -67 0 76 9 -163 137 138 -79 -33 -36 64 86 -137 -45 5 55 62 -122 -14 160 -6 -71 -50
4436e0J23M7j88q3K69j30K9p7j4J92q1j81J08P2M4q7j27J95Q9r4o6j16K62l9j51
$$ -50 73 120 -68 -151 118 -12 17 -60 -74 118 37 -144 -36 36 80 -7 -134 61 150 56 -10 -126 136 97 -54
4461e4LM9Q5q3j08Q0J37n9o5o5M2J47j24j48J87qL6j03l2K20m3j70J4N5R1k9k20
$$ -54 -51 -2 83 0 -108 -28 109 50 -15 -80 -38 109 -15 -163 24 16 52 -51 -83 137 94 -76 -62 -7 84 55 -165
4488a65J44J10k6l5j99J87J22j52q9J51J6L7k33M5K09o2p5l6J5J90j55j20J01
$$ -165 -21 89 63 28 -171 16 138 -14 -103 48 64 101 -132 -87 122 60 -15 -51 -36 154 -1 -121 -20
4511b0R4j6j17j13K37O3k01LM3J45o7j70N8J29k8L2k00J67Q2j20l4O3K5L5j22
$$ -20 74 58 -59 -172 65 128 -73 -70 -27 118 51 -119 -61 68 40 72 -128 39 121 1 -33 30 55 90 -32
4536c2j08K32k4l3j06KK30j31j70R0J14M0q7j07J62J7j77J7kK02n7j63L0J28k0
$$ -32 -140 92 68 35 -71 -69 161 30 -140 -50 64 104 17 -90 72 89 -88 -71 -73 129 72 -91 -61 67 47
4561D7k5k00J84J48j16j20R3L7P4j55p5J67J8n7j19M9K58j21k26Q3J32k1l3j84
$$ 47 22 -178 6 154 38 -82 11 48 122 -33 -108 59 77 20 -99 -50 208 87 -139 -56 76 55 22 -162
4585a62K01N5j34M8p0R5M0j57J7J22J8l7j29K0J90r9r3J3R6J16j77j68K21Q8r5
$$ -162 39 94 -40 8 -62 33 73 -84 -67 55 73 36 -93 -73 117 18 -75 -62 34 150 -27 -195 26 114 19
4610A9q8k5J74j6j46M5KJ44m9k08J16J75j07q3oJ40O2k88L5J94k1L1k11l4L05
$$ 19 -69 -94 80 64 -82 -37 -35 109 60 -148 -32 143 36 -47 -53 87 149 -139 -104 90 69 100 -111 -145 160
4635A60j15j29k7J07J06j14j48K11j1k1q3k7J84M2k08L1K9J26m2k11J16J13j03
$$ 160 45 -84 -111 -4 102 -12 -160 51 40 19 -64 -91 93 135 -73 -42 -13 113 71 -140 -24 89 -14
4658a4l4l6J42J03k14k1P0N8J8j36RJ83m4j57M4RJ81j29j49J18O0k5o3j00J55
$$ -14 -48 -84 58 161 -53 -74 -4 54 72 -64 -55 128 84 -73 -29 -20 161 32 -117 1 61 36 -27 -127 28
4683B8P6j74K5jJ79j01j83Q0J34Rj16m1R6J44j89r6J34L0Q7j77n7K54qj62j1j3
$$ 28 104 -70 -45 -46 133 32 -151 -71 63 72 -44 -85 11 155 -34 -130 4 34 121 -56 -113 141 133 -29 -40 -53
4709e3K10r6j36M4J00J0r5q1J08J26j80j2K4R9K1j77J3J68m4m0j19R8J59q9j57
$$ -53 157 61 -75 -31 69 79 -16 -97 11 137 -43 -55 -31 68 89 -88 -75 93 49 9 -110 -12 147 58 -99
4734i9Q8Q5K6j28j20K24j2n2p1m1K18j9j98N0Q8J5J2j79J60M6j33J6k3R0N1j77
$$ -99 -11 74 100 -28 -148 76 64 12 -59 -100 118 99 -99 -49 39 54 66 -113 47 93 -40 -24 -47 43 94 -83
4760h3j8K02np5j03j2K35j27j48J04J4J51j40j72J97M3m0l7q9K39Mk28M4J18m0
$$ -83 -101 101 96 21 -82 -94 141 14 -134 -30 -16 135 -5 -177 20 63 23 -14 -103 136 140 -88 -44 74 34
4785C4J1j19R9N3l4p9k5O6Q1j98k5J33O7j8j52K0K02l2j57N5L3Q6j11j86K36M1
$$ 34 45 -74 25 78 44 -35 -60 6 87 -111 -136 -3 64 46 -106 -86 116 84 -73 -18 15 101 -10 -196 40 81
4811H1l7n3j03K17N2k73N2P9P1kk02M2K25j00j11l2J20J22j77o9J48N8j17n2n6
$$ 81 44 -9 -112 105 157 -116 -64 15 86 84 -118 -76 149 49 -62 -94 26 148 -29 -98 50 108 -9 -61 -117
4836a17K17n4j34L6M7J52o8j96Q0R5j7p8p3J51Q9j29j02K0J42Pk21R4K12q9p3
$$ -117 100 46 -88 -52 -5 147 79 -117 -37 58 41 -37 -110 41 130 1 -101 -81 61 68 -153 -59 153 64 -9
4861in4M3J09r7q2O8M3O1j14r9K36K6k10L7J3J05k2j26P8N4Rj11j25J80Q2j15
$$ -9 -63 -20 89 -8 -90 -22 21 82 -32 -131 105 131 -79 -42 -29 76 54 -72 6 60 69 -42 -167 13 95 -20
4887b0m6N4P5Jj53j3J86o6j4n5J5J78j22j57J18M4N4j11j14K35M4r3j43NJ76O5
$$ -20 -66 -12 63 64 -89 -102 84 18 4 -51 -36 142 20 -137 -19 25 79 -32 -146 89 133 40 -103 -98 78 143
4913A43k29L0Q1L8l3j09O2J49j12o5J8N2O0j22p5J74j5p4k5m3K05n4j35O9J9O4
$$ 143 -86 -56 25 63 30 -79 -17 132 20 -45 -27 25 85 -37 -112 62 47 -27 -52 -95 110 56 -79 -10 9 73
4939G3j00r3J59M0p1j2m1J19O3k36O9L1R2k5j87R4J60j25j21P7M4P0j21q6J61
$$ 73 -27 -120 39 79 8 -4 -45 74 137 -99 -30 1 93 68 -119 -25 135 10 -111 -34 10 80 -41 -127 34
4964C4K8n8q7K2J23K5j56lN6J26r0j51J46P7j27jk4J02L0j13j0J31l0J7j34K4
$$ 34 62 4 -83 -61 62 87 -69 -72 -16 110 20 -131 15 92 -35 -36 -60 42 72 -41 -51 80 50 67 -67 -43
4990d3J21l7k5q8P2J69j67j21J29O1k5q7n3J67J7j60M9L2P3p7k26K22O5n5l8p1
$$ -43 78 41 16 -72 0 169 2 -119 10 71 46 -41 -94 73 90 -70 -21 11 84 7 -219 3 68 13 -25 -96
5016i6J30R7j56rQ7j6J5r9r8K30Qj48MO0R7p4j86J59L8j8r1J1J02M2j26o4J03
$$ -96 34 131 -25 -34 53 37 52 -47 -145 85 93 -55 -51 9 106 32 -154 5 43 25 -66 -55 47 89 -37 -101 2
5043BN5nj47R8N8n8o9k3R9O8q6j05J53j7Kj18k4J54%j12L3l0K08p9k01J34P0j8
$$ 2 57 52 -95 3 61 3 -66 -89 10 78 -8 -113 40 23 25 -93 -117 37 37 -75 -42 -72 136 57 -144 -10 60 42
5071D2o5p6J14J01j76M1M9O3Jj92J4J95p7l8o0K5K39j83j03Q8L7J0j15k4J41k0
$$ 42 -23 -99 15 116 -60 -19 30 93 94 -98 -84 111 34 -4 -64 -39 200 17 -86 2 39 49 -66 -90 51 31
5097C1m8p5l1K44n9k46J48L3L1o1r6J55J01j16j18Q6N5Q2k87O0J99n0l7n5O6J11
$$ 31 -17 -92 -123 121 62 -184 -36 -3 28 -33 -129 26 127 11 -107 -21 34 116 -171 -111 88 38 1 -54 12 123
5123A23j05r2P2M4M9j27o6J75K6q8n6k3J47k4j24l7J56M4j14r4R3J37j78k8L9
$$ 123 18 -74 -2 42 91 -36 -102 73 99 11 -45 -68 79 55 -69 -106 50 94 -20 -114 -21 116 -62 -90 -51
5148e1J09J4j24J2Q9qj7r0N2J50q3q1j8N3N1k9r0R4K9q2o9MJ59M8k07L4M3M7o7
$$ -51 58 72 -52 -40 49 41 24 -66 -14 136 53 -28 -46 7 58 29 -61 33 62 -20 -89 -85 74 122 -85 -51 -8 39 -28
5177b8p3J24L5o0p1K6J8J03j38J7Q2l4M6j21RJ99j23p5O7J8O3p1p1O6R2j07j2
$$ -28 -101 23 58 -2 -73 -47 -29 74 -64 -47 35 1 47 -74 -65 134 11 -64 3 21 84 13 -58 8 100 -7 -19
5204a9p6J35O9j58k3P1K4nr5L1J77r6n9j9J6J02j47l5P2K1L1p6J0J40l3j79R3
$$ -19 -95 40 109 -49 -72 -1 23 18 -77 -46 131 35 -24 -43 -27 75 -72 -107 -35 -14 17 -59 -49 91 58 -121 -28
5231b8L9N0j9j41J07J01n2r7j5M6J19j28l3J23L3m8j65K1J76k4k6o6O7O8p7q1
$$ -28 11 61 42 -99 8 109 57 -40 -55 -9 110 -18 -51 72 105 57 -108 -87 89 65 39 -27 40 108 31 -50
5257e0O9j0J7j9n3N3%l2K4o8J18j5j25J01J7k2l9o4J25O0j16l6P3L1J8o7n5J33
$$ -50 19 9 26 7 -46 7 7 -25 -1 -69 49 34 -91 10 27 5 -34 -98 27 87 -29 -65 8 39 57 -10 -65 68
5285F8lk4n2j6J14k5j43M8Q0j7k4q1N6Q0p9k9O7N6k8j37N4NM5j2m8J3J11r5LL2
$$ 68 65 41 -11 -27 87 62 -81 -33 47 30 6 -75 -19 61 -18 -47 20 76 48 -89 -35 -30 15 3 -45 -32 79 -16 -13 19
5315A9k8J17j53n0J85j05M2m0K3P0n9p9J04N1K8j40j00J13J26j78M0j1Q4L3j34
$$ 19 -9 108 -45 -95 90 -15 27 -13 10 80 21 -58 46 97 125 -15 -115 -2 124 -54 -14 -25 59 92 -42
5340d2k5Q2l2K5j15L0J83o1j17N7oJ03r4q3J20Kl5mn6J54k7j63Q6lJ14m8j46J14
$$ -42 -67 15 -17 8 -107 -77 106 45 -72 -15 -21 82 -12 -95 25 27 -8 -12 -68 86 59 -104 -18 -21 93 45 -101 13
5368A3J18n5n6m1R8L8j69PO7K0Jp5l0J00kn0K6k6Q1q5j44K21j9p7l0l6K13m4j12
$$ 13 131 76 20 -21 77 115 -54 -47 20 40 41 -34 -64 36 34 -16 10 -16 65 -20 -164 57 38 -39 -69 -105 108 64 -48
5397d8j2N1MN6p9OR9r1J8j3OJ52j40j1K9j7K1o8l2J40l8o9j8O2M9o2j03J02K0
$$ -48 -60 -9 -5 51 -28 -22 77 -14 4 -9 -3 149 9 -2 27 10 31 -37 -69 71 33 -36 -54 8 57 -5 -108 -6 14
5426A4m1m1o9K13m2p4pR0j7qj23N7J19r6K4j8K6K6k4o7L8P3qm4k3Q8Rq7N1mJ0
$$ 14 -27 -68 -137 76 34 -40 -47 43 26 18 -105 -48 71 -25 -1 -19 7 33 9 -58 -20 53 45 1 -22 66 75 -12 39 35 45
5457D5k5o5K0P0o4J6j13J30J12j42k3OJ24n4o9mJ64j12L8j16K9J11q1o5R9j2K1
$$ 45 20 -45 -25 45 -19 -3 -116 14 126 -16 -39 -33 91 37 -32 -36 128 16 54 -62 -33 78 -3 -68 31 19 40
5484D0n3q3J53lq7K0j7Q6m0l3nR5o3J8j09J05N4r4l8K7P5j4p6n5J68o8j1l9RJ18
$$ 40 -13 -96 57 54 -33 -13 -30 56 16 -17 -22 73 10 28 -81 24 78 -16 -54 -27 48 34 -42 -97 71 3 -8 -47 -38 80
5514H0n9o8L7L2Mm3q5R6J2k1mm7Q7N3j23kO8m1K0m8M0R3m8k4QqL6p7j2R0J3m4
$$ 80 21 -47 -10 22 26 -17 -102 -6 6 -15 -19 -66 21 74 -49 -51 17 -24 -4 -52 -12 81 33 9 17 9 45 -32 -44 46 59 15
5546A5n9N3M8k2n6L5kN3q1m0K3N1k0Lm1j6P5m2J9RJk0r1J35L5n2Mn0N4L2o0n3
$$ 15 -44 9 57 35 -21 14 12 65 -16 -56 -33 18 -2 1 -40 -56 19 -23 -4 5 6 -14 -105 30 65 13 17 -33 21 53 -7 -60
5578f0Q7L5o5m4kN8N7j22P4m6M3k9n9J25k7n9M7k1J2M0m2k9k3J16j11J5k6J34
$$ -60 27 62 -3 -47 -49 9 66 -56 18 -28 15 -14 -73 52 25 -34 13 -8 4 44 2 -27 -50 66 -45 -30 -56 78
5606G8r1l2NM5R7p3r8R3M1l0m1nP6j0r2QN3O4n2p0J7J05n6n4l5L6J19q9o2M4N0
$$ 78 -13 -45 -40 5 102 29 -69 24 65 35 -6 -11 65 55 -37 -29 24 88 36 -34 -17 88 32 -22 -57 -21 98 9 -53 -9 41
5637D1L3p6o1R4k5l7rK0O9n0m5Q7k2m0Rm7Q9M4k1m6j2M1K0p5K9P3p3K9n7k0J44
$$ 41 74 -2 -63 31 6 -31 -40 -20 49 -1 -46 41 19 -21 -12 -59 30 74 53 7 -5 36 56 -19 10 83 10 39 -18 -38 106
5668A06j29j0L6j0K9m4RJ2Rk7m3L9N2j8m9j3N2J8m1o7J03J8k0n4JN8J7k8m8R0
$$ 106 -23 -33 3 -7 22 -22 -13 -1 8 -19 -62 -23 29 11 -38 -51 1 19 -22 -89 14 32 12 -42 -41 17 34 6 -42 48
5698D8n3J0o1P8O5r0pJ5M3K7o1n0O2M1n3j9K8j3Rq0Q1J8j4O2j29K9N9p5J5K6k5
$$ 48 -5 5 -56 22 87 -3 -10 5 48 75 14 -36 26 67 14 -5 23 10 19 -61 20 38 24 86 -43 -14 45 -30 -15 11 -14
5729a4P7o3j6L6K3m4L2k7Q0l5j03K9Q8l0o3l8J41j8q8Q2p1J7J4%n8N6P3m1q5J9
$$ -14 63 0 -16 20 43 -1 31 4 84 49 -54 -25 63 33 -30 -68 73 55 -33 49 -22 -5 9 9 -49 7 80 39 -46 -27
5759b7J12j10M7p5N5mQl7LM9J3r3P2L6lj12Q3J6kMn0J8O0n5j1L2OL5j5j20R2N9
$$ -27 85 -25 22 -53 2 -2 6 -31 -28 21 34 -59 13 49 46 -66 17 33 31 35 -15 3 63 8 -3 29 35 70 55 -65 27 86
5791H6j03mMJ03q6JpK6Lk5q9R3L2l4ql0Q5k0r3L3l6M6N5l5JN2o2j1%k8J41o6q7
$$ 86 -17 -21 -17 86 0 1 -6 20 23 -2 -91 2 34 0 -8 -38 47 27 -66 -33 -69 -23 32 -3 -2 50 -12 -23 -23 -51 90 24 -63
5824f3N4N1J3l9o6J39o2o3N5m1Q4l3n1K4J6l6NNK3L4o4j2M8m7M6o7%O4m2L0Kn6
$$ -63 -9 42 55 16 -50 89 27 -36 19 -22 62 29 -22 2 18 -18 -13 -8 15 49 -15 -27 21 -26 20 -47 -47 17 -25 5 7 -49
5856d9J27j01j5L3L4Lj08M3M6K0l3m0L0LM6m6K3j2Nn0K4m1J14j01J4K8jPn8M8
$$ -49 78 -23 -38 -5 29 32 -76 -33 13 33 0 -40 -10 -7 39 -7 16 4 9 -41 -17 -58 56 -45 -31 -3 -4 3 -55 -7
5886gM1m6j0RqP9j2r9J13p1Rj1l6P2Q5j20J3mj1L9r3Q8L4%l5k4RK9J7k3J0m2N4
$$ -7 34 -12 -22 -13 -21 58 46 -53 60 -11 -2 -13 -49 23 108 -12 1 -3 -14 25 -68 20 54 54 19 -5 4 33 50 27 37 -5 49
5919D9l7n4M8K5pk9lQ1n7m6J1N6nj5p9K3R7p7K0j8N9J6r7K8j3K0K2k6m9R3l1m
$$ 49 12 -42 6 31 24 -5 -8 73 16 -30 -19 37 32 17 -62 -39 58 -19 1 -17 42 58 -39 -11 -24 -4 18 -8 -57 36 5 1
5951AM2q0N1m3k6Q9J1j4q1j2J21K3j36L7K6pM6j08L0L4Ll4J5l0O4q8K4O0j0qn
$$ 1 43 -37 14 -29 -55 34 45 31 -50 -62 59 82 -54 -17 9 2 48 -60 -30 4 7 -27 -12 -42 22 -66 -42 18 8 0 -5
5982eq0J32l3n0J4N5j5K7j19J07lL4q4oK7O7m9n2K1N0K6j76P8R2L2r1k0kJ5Ln1
$$ -5 -85 47 14 -36 -22 33 18 45 -74 33 30 64 -20 -26 1 68 19 -33 -12 38 64 -112 -34 58 90 -1 -21 -23 -8 -5 -56
6013e6J07p8O5q0l0J07K9q5J5m2M4K7j10P9K7J1K7q0LJ35j39J8MM1m2M3m8J6j2
$$ -56 51 -27 38 -42 -72 35 64 -21 -6 -48 -4 23 -87 -8 19 30 57 -23 -20 115 -24 -6 -2 39 -3 40 -8 8 -4
6042dL0n1M0Rl3k8L0L5pq5P7K1j2p7M2K8l6P8o4K3nk4J4m1L9L6p0k8O8NKK0%J2
$$ -4 26 -25 15 24 -9 -37 -7 28 21 -64 13 34 22 -55 -13 15 -21 57 -7 16 11 -13 1 -40 -1 35 -35 -63 5 10 12 32 32 44
6076D4n2M6Kp0K2M8j04R2o1RL4p8J14Oo1L9r3M1R8j29N4P6l8n5K5l9P5o8JOm8
$$ 44 -8 38 40 -30 -8 40 -64 28 -33 -24 10 -68 46 52 -9 30 -63 -22 76 -53 1 77 39 -16 9 -30 45 -23 -22 -16 -64
6107f4J37q4m3O2L8m9j9m6P8K2p5P5p1J11n4o7O5M4p6M3k2%J15j70LJ24m1k5l2
$$ -64 73 -11 -54 8 46 -3 -22 -68 10 32 -43 32 -39 72 18 -49 16 60 -16 27 5 5 120 -50 -47 77 36 11 -21
6136b1m8J5M5r0R2k1M3kq4J00l7J6ro7J06l3l3QnQ6J8q4L1M2j04J17o2n6J38j30
$$ -21 -69 -54 -9 -99 -7 -28 15 13 -71 29 -8 8 -1 -68 38 5 -28 -20 -25 61 79 -5 26 68 -36 81 19 -37 101 -29
6166b9J6J07j17K6l5J1LJ1P3o5j01J39k4m9M0L4p9K2m0M2qMPl6O5J9n3M9j8m0
$$ -29 -13 94 -23 3 -32 -21 -18 -7 66 1 -100 39 15 -34 6 40 -39 -17 -57 -15 -23 -19 -12 -48 17 36 -17 32 14 -26
6196b6L1jn3J41p1k1L2l6K5o4j3J04l6n5N5K0mmn4N8n8O7J1j21R3J4n2L8m8QR2
$$ -26 5 4 -49 92 21 0 32 -4 21 -43 -56 48 12 -43 12 32 28 24 -30 28 -30 37 48 -73 20 34 -18 20 -28 -20 72
6227G2q3j2L5k5K6j9k7R0j03nM0O0n8L9p4P9q0M1L5mLRk5l4R6r1O0j14K9J40j17
$$ 72 -11 -23 12 -13 13 -6 -33 57 -46 -51 -11 49 -9 30 -44 35 -45 -4 31 27 30 39 14 -20 76 -15 45 -69 -40 100 -17
6258a7N6j4M0m0m2KO7K8j16P4j15J52n0o9O6j2n9M5o2J10Kp0P1r4N2L2n3m3J49
$$ -17 39 25 65 25 -17 -15 52 80 -36 38 -77 75 25 -44 22 10 -49 -4 -66 44 46 -24 47 -47 5 37 -16 -59 90
6287I0j26O1r2N5N8n3rj0LN9m2J6O4p8l3R4m9N3l4j16J05n1O0m1l4Q8n2k0O8q0
$$ 90 -36 25 -67 -12 46 -7 -16 -26 -23 36 -6 10 74 -4 -37 57 8 61 27 -89 16 -35 25 -16 -50 38 -14 -34 34 -46
6317d6RJ20q3l1P5j8J7p0l2R4n7N4j9m1M3k8j8O3k9kpk8Q8l0n7KK6pL1j10J20
$$ -46 -37 83 0 -31 44 26 43 -27 -59 35 -22 32 13 -28 15 -13 -31 32 3 1 -6 -34 54 24 -33 -31 -5 -12 19 -91 29
6348B9or0O3o5J2P6p2Q1J3n7M5m5n3J07m7M9l5n8J26m9o6Q4j2l0N0j12J05k4k4
$$ 29 23 -67 -4 -69 -57 19 -53 28 41 -16 29 -16 -69 38 -9 40 5 -53 73 24 -42 42 30 0 50 -62 43 19 -5
6377eNqnN7j45Q6Q5r0qOMO2r8P5p7j2R6m6m6P9m8J4M8p8R5k5n9R4n9n7N6l3N8
$$ -5 0 -8 -13 44 -101 -15 70 -20 -28 -22 -18 44 -54 21 -56 -68 28 -18 -64 15 -33 -19 29 -49 46 21 -38 56 -3 -60 -4 -37 21
6410B1M2p0J9k0L1j1l7J6Q2p9NNn2J09r8L7K4o5K3nLO3o4O4J9r2P4J2j27N7j7
$$ 21 63 -7 12 -8 23 12 -25 -9 73 -6 -1 4 -48 61 -37 0 24 -41 -18 -23 -20 43 -21 43 62 -30 44 56 -71 -14 -31
6441c1j2O7j14J18k9k8M4n0J3O5n0J5P6q3K1J1k7OK3rM3p4R4q5n7N2k4L6j2l6
$$ -31 -43 24 -90 28 -1 -29 15 -35 -22 43 -7 8 84 1 22 33 6 12 35 26 69 -5 89 4 -53 -1 -25 11 -1 -37
6471c7O9j7m8L6o7R0%l5M7j2n6O5n5j6P3p2jL0M5m4j4m5R0rl3Q9j19P3j1m1O2
$$ -37 32 15 -33 3 -64 26 26 -9 38 26 -30 35 -20 -36 37 -35 -36 -6 39 -5 -19 -64 26 17 -16 73 -46 27 16 -25 37
6502C7q6L6J9j3m7J17r5KM0m3M6q0M5Q5p6J4j4n3J31o2n6O4j1J4J0m5K0nj9M5
$$ 37 -49 -13 6 -7 -54 63 -32 -30 10 -33 13 -67 -22 63 -13 1 -13 -66 65 3 -53 11 0 14 24 -21 -1 -6 -25 20
6532B0l5M6Qo0O3p2N1J9o9P0K9j12M6j8J1M2j05N9K1Rnrk5O9k4q9P0l8O2n0l0
$$ 20 -15 31 39 -21 42 -30 21 40 -29 41 70 -42 4 -14 -3 39 -66 -7 14 23 18 9 -16 53 29 -60 10 -28 34 -16 -46
6563d6R8n9Rk7n4R1Pp9O6J5L1k6p1O2J07j60R1l0m0K5l2jK8J3J9j3n3M6l8K9k0
$$ -46 52 -7 2 -25 -79 12 19 -60 6 21 52 26 -45 17 124 -36 55 25 -15 10 -22 -23 5 18 37 24 -29 17 -21 8 -12
6594a2l2R3o9q4J00N1n0Oj5P3n3j1K0k9k2P3j01O5qLJ1J7l7P8r1l8R6q2R3m6o7
$$ -12 -44 49 -20 -104 -4 47 -3 3 -12 61 8 -3 17 -12 -34 39 -62 3 -5 -2 9 26 -11 67 -24 -62 34 -48 45 -1 -68
6625f8J28j4j03J22p5K5J4q8Q5K0r0N4n5N1K8m7j8M8p9J08j17R9Kq3R2m4j3M9
$$ -68 60 46 -57 65 -10 15 29 -59 26 46 -44 10 -45 6 34 -13 -31 17 -62 46 -71 28 30 -53 39 -5 -18 31
6653C1m4m0Q2l7J4mn9M0MK1L2n7K8Ro3O2L8m4N4j01j9O4q4Q8nK9M1j04n0R9m0
$$ 31 -13 -53 29 -8 6 2 -57 -17 -13 8 40 -17 11 20 -43 19 57 13 67 -34 -53 11 -73 15 10 39 80 -24 -74 25 -15
6684a5M3L4j01mL1Pj6joL8k3M9n3LM2o2O1Nq4M0L1j0L7q8L0R1j19K6M1l7K5k7
$$ -15 28 62 -39 -43 -12 -5 -21 -22 -28 10 -13 36 -17 -14 28 -34 27 32 -52 -12 19 9 46 -42 -12 79 -40 -14 27 -10 15 -12
6716a2J6R4q7n9O8n0N6lo1M1k9P5K8j04O8On1Nk0rP7r7R3o0K6J8l7k1O1n5k6J19
$$ -12 4 98 11 -48 20 -30 26 23 -38 3 -26 49 77 -27 41 47 -4 1 -19 -28 49 -48 45 -15 11 29 -8 -29 32 -23 -49 70
6748G0j00L5j5k7P8k6n5Q2q0Q4k1q8J14k4n6R2j48J22k3o6Q3k9RN4j00J8qj5L3
$$ 70 -30 5 -10 -37 41 15 -40 42 -38 46 25 -63 51 27 -29 63 -85 37 14 -52 31 2 11 65 -35 -17 -25 -40 -7
6777gj2k0J09p2l7M9K1J5q9m0P2M4j1Pm8P2j0m2M4n8K5R9j77J05M0j48R6m7pJ4
$$ -7 -19 -39 70 -2 -39 10 31 46 -43 -83 -11 33 22 29 -19 53 43 1 45 -13 12 111 -66 39 79 -69 27 -20 -27 -13
6807a3j2n6R3m3K1k2l1P1J9p0J8kJ32j42m6J42k2j3M8l3m4J7n0j8Q7k9k0oMJ01
$$ -13 -25 -81 12 -31 -10 -32 -63 8 27 -43 -25 -27 105 -37 -83 59 37 24 72 39 -5 12 -38 -56 31 2 -18 -24 -20 81
6837H1j26R4m6lN3q2K3L3o9O2k2m0L4J3o2O1k5K6Rn9O4j8k5Q1r8Q1M3q5j7O9o5
$$ 81 -45 49 3 0 53 -29 -6 27 -42 20 -2 -42 -8 5 -57 4 -21 5 14 -45 19 1 -24 57 -41 40 83 -2 -19 50 -15
6868a5N4KrM3n6J5j2J1O3j52J3N9k9M0l9o2Q1Lp6J23j04M3Ok3k3L4l3K9l4P4j0
$$ -15 39 41 32 75 19 34 22 33 96 -56 -43 16 -13 27 -12 -74 7 10 -66 57 -47 -4 2 -21 -44 -10 -43 -14 -48 26 16
6899A6r0P5lk0O0n5J8M3q5Q8n5J8M1l6k2J2M1l3K1o1P0m7qM0p3R8m4j00J52m2
$$ 16 -74 1 -2 -22 38 -17 1 44 -41 47 -8 10 51 15 -7 5 46 13 34 -27 43 -4 -12 28 -45 53 9 -91 61 19
6929A9j2m2L2K6K5q6L1N0l5P0j37M8K1o8N3Mm3N2j4rO5j03P4Mr2J38m2o4O5j8
$$ 19 7 -35 -3 23 48 -38 -7 43 8 78 -59 -11 10 -58 -5 -1 -44 8 -6 -15 50 -53 21 25 -67 71 29 -35 30 12
6959A2jj1OJ4j4LJ7k3j8J4M0p2L2k6N5r6L1N4rnJ8n4P1l9OL5o5NN7o5rM1o6O4
$$ 12 11 0 6 20 6 9 26 3 -15 -1 39 -33 -1 -27 28 -68 -37 17 8 3 21 -33 38 -1 5 40 -25 -20 37 -28 -37 4 -62 2
6993Bm2O6J6p1L0K0mQ0p8K9ko3K7J7k4L4m5k9R2q1M3J0n4L2Jm9M4m3j0J07r1J7
$$ 2 -40 26 42 -29 1 21 17 97 19 48 46 -17 10 27 3 37 -8 -37 55 -26 17 27 -27 5 6 -43 1 -42 -52 55 -36 -19
7025a9J9k9K9k0j1Q7j19J06K4q0L4Ql5P1j28O9O8r1j5N3o0J7N6j4N0p4L8k5k6
$$ -19 0 -29 0 -20 -31 56 -63 43 67 -13 21 29 -6 65 -63 6 74 -17 -32 21 -39 -22 34 20 70 -4 34 9 -17
7054a7M2l7PJ7q1R1j1n5O2m6L8k4o%L2l9N9nJM7p7L3J8o5J16j06J5k9K3N5m6l7
$$ -17 25 -12 -5 12 -69 22 11 -44 18 -28 10 -14 -20 -20 12 -27 32 27 28 75 -2 31 49 -16 100 -6 9 -20 3 58 12 -25
7086b5N2m4j0K0KJ5L7j38J14Pp7Q8p6m3P8mL0j3k4M5p7k9P5J5J6J8p8L2J3r4R8
$$ -25 27 -17 -27 -7 -5 10 47 -91 23 30 -47 41 -35 -78 0 -4 26 13 -11 34 -43 -72 3 18 34 52 -26 6 19 -75 23
7117B3l1N5K5r6N8l0pL2K1j7K1j08L8N5l3M5p4j1Q2p7jL4j9L4l6j9N8m1M8rn9
$$ 23 -8 47 72 -24 34 4 -3 29 50 33 54 -54 -16 39 6 51 -23 -34 48 -29 -30 4 -15 19 -17 -36 22 -19 29 20 -39
7148c9O4m9k9K8rN7ql9L9L4m4K2o4O0J0n1K0J2n0P4j1Lm3N4n8J6JJ3J6j8L0m6
$$ -39 25 -24 -53 -25 -34 23 15 -24 15 49 5 27 -37 23 33 -18 2 14 -36 38 27 30 -13 41 -17 -1 0 13 29 11 41 -5
7180ej5L8m5nk0rJ42o0j0K0o6J4K2l1O1n2k3Q5k1J7J5Qn9L4PJ2n1J5nJ1Qo2j8
$$ -5 -20 18 -27 -32 -52 -61 81 21 11 31 -35 -21 1 -30 31 -21 -44 41 20 37 52 60 1 35 42 54 3 18 13 24 32 -30 -48
7213d8O9p2M6J6m0Q0j8p8L8J7j1O3j06N8J7l1qj9QM5QkJrj2kn6J07n5j2O5o7K3
$$ -48 21 -51 -5 11 -29 51 33 -45 -7 10 -1 62 -44 14 31 0 -8 -27 -19 26 34 32 33 24 12 10 -46 61 6 -6 59 -8 15
7246A5L2j8kk7jK4n5LJ2K8M4p4ORRJ2n2k7J23j7p6O1l6k9O7Qp3J1Rpm2O6nk9J7
$$ 15 47 29 27 0 -1 23 -32 -29 -17 11 55 -19 -13 -4 5 17 -35 -62 61 44 -32 29 -7 -36 31 39 -34 -23 -14 -21 -63 3 -2 -31 -14
7281a4OqJ6K1qL2q1L9L6jk5Oj7J9m5Kj5J08n2l0K3j3K9p8J33n8L2m5m8L6Km7K8
$$ -14 -8 -16 0 21 13 45 -36 3 39 38 13 19 2 21 -24 -22 -37 71 19 -11 12 -1 28 -50 83 25 57 12 -36 0 2 -45 -17
7314a7J8J2J4o5P2Qm9j3M1j0K3r8P2J6j9N4n5%L5k3l1J3j5P6m4m2K2mk5M4n0J4
$$ -17 1 13 27 -38 34 42 -7 -20 21 11 34 -64 8 24 5 59 4 4 39 16 -15 -2 -17 59 15 -27 -5 -9 -34 10 -40 -26
7346b6L5J6Oj0O1q1l8J4j5J8NMK3j1l6L2L2o0P5l3l1L6oJ2k3lO3n8jL6k8J1L0
$$ -26 9 25 31 21 82 1 -37 -23 -38 -20 -15 -11 12 1 -35 -3 29 -31 44 11 -20 16 10 22 -1 -4 59 1 0 36 8 19 49
7379D9p3L9k6N0k6n3kK4J0LK1j3J1pq0N8lM7k6qL4j1m7L9nk7O4n4J0KJ1J0k2M9
$$ 49 -24 15 -11 39 13 -40 -42 -18 -8 -5 16 3 14 7 -73 -15 -18 29 3 -5 29 18 -29 10 5 -22 42 -12 -2 0 11 21 -1 48
7413D8j18O6rj9J0K9k2L2kL0m0pm8L7k3L9m3J1M5KOPo6N8k1l2M2k9J8Ll2L8m8
$$ 48 -70 -4 -13 -32 -22 7 -15 17 15 45 5 -2 -50 -13 -36 3 -40 -29 16 18 24 31 -35 23 2 -30 12 -17 1 4 -28 10 -38
7446c8J5L7qj5N4j5k4K6m9M7k5NM6n8K2M8p0k5K4K9Ok9j7L3nj1k1K3J7l0j3K0
$$ -38 -23 14 6 -9 45 30 6 32 -17 30 5 10 56 -2 20 68 -2 -27 -3 26 32 3 -14 19 14 3 -18 5 22 -8 -21 -1
7478aOl5J4j4K3RLoL4p4K8K8j0O3n3%LJ0J8n8NpN9J2m1j9oO1n8j3L2j3j6K7ml3
$$ -1 5 -30 -16 -30 -7 2 5 -1 33 -41 -13 15 5 68 15 15 18 28 46 -12 -7 -14 45 57 16 -3 -9 52 -6 -19 13 0 -16 11 7 -26
7514b6K1%l1%O8j02M8Pl7K2k5QJ0L9Lk6n0O2J6o5Q6j9j9n8Q8RJ9p2M2k4K6J1p2
$$ -26 -5 -5 -36 -36 32 -70 -22 -15 -52 -30 -55 -47 -37 2 5 -21 -71 -9 7 -58 28 9 -10 -68 20 29 48 -24 18 -6 20 31 -41
7547d1P5k5Jn8L4L8l3rM8m4L0J4m8Ql1J4N8o2PM2m7KKM1k3j3N0k1j1m1R7m7K0
$$ -41 34 9 10 -48 -14 24 -9 -18 30 -14 16 30 -18 -10 -41 -27 31 -31 -24 18 -29 -27 -25 16 -7 -20 30 9 -2 -43 54 7 27
7580B7l2PML4p1M9n7K1L4j2LJ1j6L3l6l8LN0nmrm0N5k3K8k8j7J4m6L1J11j03J9
$$ 27 -5 2 6 40 -31 18 -39 -18 16 4 7 18 2 35 -1 -39 -36 14 9 5 -4 -44 11 -12 16 -12 -29 -15 -61 -30 81 -22 -3
7613cp4N4O1j8l4O6p1KMK7%m7O0J3n9N4J6n0L8m6LM0Lm2J1j8OmoLM0n8k7M4L7
$$ -3 -77 -23 38 20 -14 52 -19 -17 -13 14 14 -33 27 40 -19 35 51 1 39 -7 -4 36 39 -3 8 -10 -4 -8 -14 -11 29 -29 -56 -12 25
7648B5l7J2J1m0K9Rl2K3n7P8lo0M3l5K7J6k5j7O3J3k9K2k2L3n8p2Q0k3N8nq7R1
$$ 25 -12 0 11 -29 0 9 -23 0 -57 21 18 -42 1 -34 -7 9 -16 -33 30 43 14 36 14 47 -11 -83 -3 -26 32 27 -60 31
7680C1l7J6l0L3m8P0r0O3p1O2k1K0k7L9j7NJm4N3k3j7N6lL1o7J5m8Q7M8k5m3j0
$$ 31 -6 10 -20 13 -35 35 -55 8 -63 -1 -22 -2 -29 10 -7 -2 -1 -45 8 -15 -32 24 21 52 -15 0 -48 39 87 62 19 9
7712IM0j2Ll8j3NJ8r3Q3lrM1o7M7pn2R2o8m8N7l2P2k7k0K2J7l4oj0K5M3l7j5K2
$$ 9 49 37 40 2 -11 -6 12 -81 2 -1 -10 31 -36 11 4 -48 44 -24 -72 -15 -47 25 -2 -22 0 17 -17 -23 -33 -8 35 -2 -17 5
7746EL8l5j3K7M3j12L4K6k0L6Ko2N9p0N2%m2K8RN8o0l2O3k9k0K1m6jN0m5J3N2
$$ 5 43 8 -5 22 65 -47 -13 13 -7 29 31 -31 28 -42 10 10 -32 -4 5 63 3 -29 34 5 -15 6 -40 -41 9 -36 -23 29
7778B9q1P5Lp5L9J6j9k5K0K9qk7N9j07P6j5l2J11m1o7K7P9o5J9jMj0l7M0l3J5
$$ 29 -52 23 26 -49 -10 6 -13 -38 -18 11 3 -24 35 -72 4 -11 -43 68 27 -40 -13 66 1 20 19 23 13 -24 16 -17 -2
7809bK0o1K2N0r9K5M4mJ0j6Mj5QJ3j9O5j4q7R0kPK4j7k5j5l6K0L6%J9o6L1qn9
$$ -2 18 -43 -21 29 -70 -45 -1 -5 5 -11 -7 -22 -14 -1 -20 45 31 -56 34 32 39 63 46 21 6 -30 -10 26 26 45 -21 10 2 -57
7843e7R3k2k1p1Q6m9P2l2m2M9k9O1l4p5P5N7j29j0P4J2J4o1N8ml5M0L7n0pl2K1
$$ -57 36 14 -7 -78 8 -41 31 -1 -43 6 -23 38 4 -71 4 61 -68 -78 -4 8 22 -39 19 15 -20 20 57 7 0 -32 -11
7874a1M8l2K9l7L9Km7RJ0L1n7J7o7J10o5Rlj0N3l2k2j0O6l8n9M6K3k2n8M9L5l8
$$ -11 37 5 34 -3 36 38 -9 0 10 41 -16 1 -66 44 -21 -12 -15 -25 28 -4 -26 -36 30 -8 -67 -21 2 -20 -78 -29 6 -32
7906c2N2l5mL6j6PPm0J5K3OK6p1M5j8L8l0oM8r8P3J1q4L0j3Q4j06M6KRkl5M5l1
$$ -32 20 -15 -19 17 1 8 15 -25 -10 13 19 45 -26 19 1 39 9 3 51 -47 26 37 -47 -17 -30 54 -52 -6 -4 5 3 -32 13 -18
7940a8K0K0k5M0n6j2j5L8kLl0MJ7oO9qk6m5P4Nl6o3J18n7m8K6K6J3j0jj8MlL2
$$ -18 2 22 -3 37 -19 -31 -46 -8 -10 -7 -37 -33 -16 -22 47 39 13 -32 42 47 11 -52 66 9 -39 -13 13 26 16 15 -3 1 -2 30
7974C0q2L1j7P7r5M7j7lj2L2L0k5K2mk7M2j5o4L0K3L0k1Mj2Kk1K0m8M0N3j0k2
$$ 30 -52 -21 -38 39 -56 -9 -26 -29 -41 -9 21 -4 18 14 -13 29 14 -50 -20 3 33 12 16 4 6 -15 5 -43 -3 50 40 18
8006A8J6Ol1%%jjJ0rk9J2opO7n4n1KQ7J1p7j7P1n4N0M4n3l5M7Qo6M2J8j4l3J1
$$ 18 34 40 9 9 9 8 7 17 8 -21 -9 -15 -22 45 -9 -60 -58 29 40 -37 -54 17 -37 13 57 4 -31 16 24 -42 0 18 4 -29 -18
8041a8K6mJ8M6r3R7o5l5L2m8P9p1k1J17qp8N7m6Rj5K9q1R9l8kOMLLKk9K2Rl7K9
$$ -18 8 4 22 68 -25 72 7 -28 4 -44 35 -36 -57 60 52 -26 31 -15 -6 -21 8 -73 26 -12 -14 -8 -4 -1 2 4 -25 -3 6 -31 -2
8076bJ9o3O5K7k6L3k9pJ8j6QK0q6M0Km2M5J9Jl3J9k2J9jM3q4k9O3K6j7Nn2K4J2
$$ -2 17 -46 19 46 20 53 24 17 35 19 27 47 -39 1 3 -39 6 25 26 -7 12 -10 9 8 51 -33 -62 1 27 10 15 -37 -13 -1
8110al0M5p6O6m7N1K6m4%m5M0JM7m6K9k4L8pK5Jk6l2L2J5L9r4K2J6j5k9M3J8O
$$ -1 -31 14 -62 4 -43 8 34 -10 -10 -55 -15 -14 33 -13 16 -8 30 23 48 49 23 -9 23 38 77 -17 5 21 6 -23 20 38 44
8143D4J7q9O0l6l0J5L5k8L6K3p7L1n7N0MJJJ2j6J5j9k7O9kJ0q2M1L4l2K3l3j8
$$ 44 61 -28 32 -4 -34 -19 16 -12 24 47 -30 1 -56 -6 -2 -1 0 12 -4 11 -8 -35 34 32 42 -40 1 35 3 26 -7 -25
8175b5J7j3N5m5PlJ7rL9n9qO3m6lM0l1
$$ -25 -8 -21 34 -11 -4 -7 10 1 40 -19 -27 36 -10 -13 27 -4
8191d
$$ Imaginary data points
##PAGE= N=2
##DATA TABLE= (X++(I..I)), XYDATA
0@%%%%%%%%%%%%%%%%%%%%%%%%%Mj1J3j3J5j6J7k0K3k4K6l2L8m1M5n2N9o5P1p8
$$ 0 0 0 0 0 0 0 0 0 0 0 0 0 0 0 0 0 0 0 0 0 0 0 0 0 0 4 -7 6 -7 8 -8 9 -11 12 -12 14 -18 20 -21 24 -28 31 -34 37 -41
45d1Q9r7J04j17J30j43J58j73J90k10K32k56K81l12L49l89M33m86N53o27P02p59
$$ -41 48 -49 55 -62 68 -75 83 -90 100 -110 122 -134 147 -165 184 -205 228 -258 295 -332 370 -389
67c89O77K89j4159j60495O3691L33136o9868l62785N4026K92714O3998k32298
$$ -389 288 577 -13582 -174077 -110386 222750 152882 -209903 -155877 136837 200835 -31463
79c1463k13040K27940K80236j86478k84385P9739K88362K2555k85215q4817K43602
$$ -31463 -244503 -16563 263673 77195 -207190 -127451 160911 183466 -101749 -186566 57036
90E7036J58375j97611k37775J79742K60865j32028k31269J0544K41486J14686
$$ 57036 215411 17800 -219975 -40233 220632 88604 -142665 -132121 109365 224051
100B24051k89772j52246K67166J46905j40041k00727K4487K88506J591k98485
$$ 224051 -65721 -217967 49199 196104 56063 -144664 -120177 168329 169920 -128565
110a28565j5457K21753R8437j62633j97368J53311K30263j16815k23889K3203
$$ -128565 -144022 77731 176168 13535 -183833 -30522 199741 82926 -140963 -117760
120a17760K39387N9655k48266j00062J97638J49202j25276k19547Q9895K42190
$$ -117760 121627 181282 -66984 -167046 30592 179794 54518 -165029 -75134 167056
130A67056o1940k02601k1369J76250J20521j96847j57530J84485J49964r5678
$$ 167056 105116 -97485 -118854 57396 177917 -18930 -176460 8025 157989 62311
140F2311j80411J654K36973L0621k35151n1311J66632J19070j15040j91382J02330
$$ 62311 -118100 -116446 120527 151148 -84003 -135314 31318 150388 35348 -156034 -53704
151e3704K00502o4778j79704k0951J87716Q7229k00957j06204J56202J30120p9743
$$ -53704 146798 82020 -97684 -118635 69081 156310 -44647 -150851 5351 135471 55728
162E5728j86790L6396K14330j6612j80159m2075J39445J24130j37403j60250J23643
$$ 55728 -131062 -94666 119664 103052 -77107 -119182 20263 144393 6990 -153260 -29617
173b9617J48538n3697j57248k6031J90825N6257j84125p1607J21583J24053p1330
$$ -29617 118921 65224 -92024 -118055 72770 129027 -55098 -126705 -5122 118931 47601
184D7601j81811N6695J83090k3512j51223n1816J45116J09723j50373j17107J08875
$$ 47601 -134210 -77515 105575 82063 -69160 -120976 24140 133863 -16510 -133617 -24742
195b4742J23176l5196j61821p468J83582K0865j48956o2788J02452J29789r0086
$$ -24742 98434 63238 -98583 -106051 77531 98396 -50560 -113348 -10896 118893 28807
206B8807j58093P5624J39251j4809j32209n5791J51182Q2376j40500q7851Q2817
$$ 28807 -129286 -53662 85589 70780 -61429 -117220 33962 116338 -24162 -112013 -29196
217b9196J22852l1991j65639J6829J62421Q805j25039o9823J08247J19873j05779
$$ -29196 93656 61665 -103974 -87145 75276 84081 -40958 -110781 -2534 117339 11560
228A1560j23109O8600J19184j306j41747l9523J54818M9761j19025p7743O9901
$$ 11560 -111549 -42949 76235 74929 -66818 -106341 48477 98238 -20787 -98530 -28629
239b8629J29550n0807j50102L7002J27122J4893j09992p7011J19009R9805j06258
$$ -28629 100921 50114 -99988 -62986 64136 79029 -30963 -107974 11035 110840 4582
250D582r7248N1284J18183j20j48941j4853J40552L2831r8393q2028P4426J24660
$$ 4582 -92666 -41382 76801 76681 -72260 -87113 53439 86270 -12123 -94151 -19725 104935
262A04935o8809j23472L7375J10008K2555j19926o0650J26699O6955r2177q3292
$$ 104935 36126 -87346 -49971 60037 82592 -37334 -97984 28715 95670 3493 -79799
273g9799M2511J21551j9635j36828P620J12573L3405q9425q5896R0295J04783
$$ -79799 -37288 84263 64628 -72200 -64580 47993 81398 -8027 -93923 -3628 101155
284A01155p7752r7224K8675J06475J9849j27838l5613J17894M7573p6333q5717
$$ 101155 23403 -73821 -45146 61329 81178 -46660 -82273 35621 83194 6861 -78856
295g8856M8034J21140m0806j17562J4848R7632L7273r8055p2986J00289P6098
$$ -78856 -30822 90318 49512 -68050 -53202 44430 81703 -16352 -89338 10951 87049
306H7049o8055q3745J8559J11754O264j23159j5808R6922M7088o8415r1317O2579
$$ 87049 18994 -64751 -46192 65562 71826 -51333 -67141 29781 76869 8454 -82863 -20284
318b0284J05836n0163r3273N806R2778L9082j06111n3594R4174N9430n3626q7001
$$ -20284 85552 35389 -57884 -52078 40700 79782 -26329 -79923 14251 73681 20055 -66946
330f6946K3258J13694j4960j06683n797Q1760M9295p4434q0472P2815Q0446m4404
$$ -66946 -43688 70006 55046 -51637 -57434 24326 73621 -813 -81285 -8470 71976 27572
342B7572q0482p57R8074K5081j05418l1661P9709N3332m8856q8330L8426R9804
$$ 27572 -52910 -53667 44407 69488 -35930 -67591 12118 65450 16594 -71736 -33310 66494
354F6494k7542q5087r275P7386M9620q4686o2877P4053O3148l6643q0498N176
$$ 66494 38952 -46135 -55410 21976 71596 -13090 -75967 -1914 61234 24591 -55907 -50731
366e0731J01047L896r3395j8841O6494N4306n3685q1872N0535Q0414k6896p4048
$$ -50731 50316 54212 -39183 -58024 8470 62776 9091 -72781 -22246 58168 31272 -42776
378d2776j3690Q3672L7604q7772m1826O3129N5877l0595q3179J6986R2511p695
$$ -42776 -56466 27206 64810 -22962 -64788 -1659 54218 23623 -59556 -42570 49941 42246
390D2246p5866k2108O2535N7260o3937o8283N3680O4175j9329p2635j1757Q6998
$$ 42246 -33620 -55728 6807 64067 130 -68153 -14473 49702 30373 -42262 -54019 32979
402C2979K1514p8176l1496N0457N8889l3311q1441K8565P7844r297o5405k5666
$$ 32979 54493 -23683 -55179 -4722 54167 20856 -60585 -32020 45824 36527 -28878 -54544
414e4544O6946M8074o7438n0368M5216N7500j3473p6599j737Q2884R443o5190
$$ -54544 12402 60476 -6962 -57330 -12114 45386 31913 -44686 -46423 36461 45904 -19286
426a9286l2240M8166O1262m4952o9443L5118O1457l951o3149k5689P3243L4544
$$ -19286 -51526 -3360 57902 12950 -56493 -21375 40082 36131 -27018 -52707 20536 55080
438E5080o4603l8984L7004N8545j6798p7091J1137P2735L339n6832l2558N1876
$$ 55080 -9523 -48507 -11503 47042 30244 -46847 -35710 37025 40364 -16468 -49026 2850
450B850N3624m9749n5188L0297N7009r74o9090j4361P2067K0158n4026l7071L4525
$$ 2850 56474 6725 -48463 -18166 38843 37869 -31221 -45582 26485 46643 -7383 -44454 -9929
463i929O1241k8785o8071K0562N7553O297n3184l4852N8933M3929n2161m3472
$$ -9929 51312 22527 -45544 -24982 32571 38868 -14316 -49168 9765 53694 1533 -41939
475d1939K6442N4245m044o8165l743O4461J4131m7943l7083L8687N5142l4263
$$ -41939 -15497 38748 34704 -33461 -37204 27257 41388 -6555 -43638 -4951 50191 15928
487A5928n5738J6688N3477R817o0284k4293O0800K7112m2009l9028K0346N9200
$$ 15928 -39810 -23122 30355 40172 -20112 -44405 16395 43507 1498 -37530 -17184 42016
499D2016j2976o5448P517N2555J4213m2859m0777M4803M9226l8927m5668J5421
$$ 42016 29040 -36408 -28891 23664 37877 -4982 -45759 -956 48270 9343 -36325 -20904
511b0904M9853P489n9387j6490N4965K3949l7837m1334K5559N5473j9889n3946
$$ -20904 28949 36438 -22949 -39439 15526 39475 1638 -39696 -14137 41336 21447 -32499
523c2499M893M7728J8416m9790l2120M8297L3841l0591m1123Q404N6121P38n9826
$$ -32499 -27606 20122 38538 -11252 -43372 4925 38766 8175 -32948 -24544 31577 32315 -27511
536b7511n241M5396K1921l2189m3828L0825N0094k5532m3641M203M3669J7961
$$ -27511 -32752 12644 34565 2376 -41452 -10627 39467 13935 -29706 -25503 18166 36127
548C6127n0549k6037M5769K9509k7353m1627J2487N2950o417m9851m942M0155
$$ 36127 -14422 -40459 5310 34819 7466 -34161 -21674 31276 24859 -24992 -29934 10221
560A0221K4539l7577l7087L4785L7776j9045m0791j606N0767J0730n1566j3795
$$ 10221 34760 -2817 -39904 -5119 32657 13612 -27179 -28785 21982 32712 -18854 -32649
572c2649L6206K6819k1257m5100J8397M9327j3590m0284n519L6432K6368m0486
$$ -32649 3557 30376 9119 -35981 -17584 31743 18153 -22131 -27650 8782 35150 -5336
584e336l2791L5782L2180j7450l9024J515M7618M678m3873j3080L2704K8978k6772
$$ -5336 -38127 -2345 29835 12385 -26639 -25124 22494 27172 -16701 -29781 2923 31901 5129
597E129l9788K3029L8789r149l7465r633M2833J8515m2292j9602K7592K8339j1730
$$ 5129 -34659 -11630 27159 18010 -19455 -29088 13745 32260 -10032 -29634 -2042 26297 14567
610A4567m2994P123M6559l437l6303j2095K9149L0104l0160l4819K5269L1767
$$ 14567 -28427 -21304 25255 21818 -14485 -26580 2569 32673 2513 -32306 -7037 24730
622B4730q402l5054o717M1464J1860l7005j7380K4375L0611j6846m0085J3739
$$ 24730 16328 -18726 -25443 16021 27881 -9124 -26504 -2129 28482 11636 -28449 -14710
634a4710L7146k523l1784j4806L3624K3845l2941k3903K0271K8342m668l8697
$$ -14710 22436 19913 -11871 -26677 6947 30792 -2149 -26052 -5781 22561 17893 -20804
646b0804j531M1107M523l1005j6372K2283L0866k1060l4201J5899K9784k69l0871
$$ -20804 -22335 18772 23295 -7710 -24082 -1799 29067 8007 -26194 -10295 19489 19220 -11651
659a1651j3910L5328J7658l0132k0094J6157K9937p226l7754M692L3706L474k5838
$$ -11651 -25561 9767 27425 -2707 -22801 -6644 23293 16067 -21687 -16995 16711 20185 -5653
672e653j8466K4554K7369k3588k6492J2490K7377K261l4030q496L4426J0343k3933
$$ -5653 -24119 435 27804 4216 -22276 -9786 17591 19852 -14178 -22674 11752 22095 -1838
685a838j9049J4009L0924j2173l2906Q016K6653N696k5242j8712K8180K1165k3176
$$ -1838 -20887 -6878 24046 11873 -21033 -13017 13636 19332 -5910 -24622 3558 24723 1547
698A547k0888R542K7102J71l3306k626K8996Q462k0153k0661J7023K8045j5731
$$ 1547 -19341 -9799 17303 17474 -15832 -18458 10538 19000 -1153 -21814 -4791 23254 7523
711G523k5915O137K4228P284k8206j3240K8051J3571j7748j9426P088K9000m295
$$ 7523 -18392 -12255 11973 19257 -8949 -22189 5862 19433 1685 -17741 -10653 18347 14052
724A4052l0605J641K3386R272j9337k0755K0511K2615j6097k0453L484K3933N997
$$ 14052 -16553 -14912 8474 17746 -1591 -22346 -1835 20780 4683 -15770 -12286 11647 17644
737A7644k8366q047K3854J1808j4251k1539J0049K7484q940k3951R83J9774J1454
$$ 17644 -10722 -18769 5085 16893 2642 -18897 -8848 18636 9696 -14255 -13272 6502 17956
750A7956k1601j7040K1300J5999j1798j8860J000K6110K173k6829l543J8929J1955
$$ 17956 -3645 -20685 615 16614 4816 -14044 -13044 13066 15239 -11590 -15133 3796 15751
763A5751j3282k1455J3134K2507r318j8821j896K0151J0750k3244j1835J8590
$$ 15751 2469 -18986 -5852 16655 7337 -11484 -13380 6771 17521 -5723 -17558 1032
775A032J3346q572k0572L512K5303k653k1049l418J5258J4226j5300j9179J4921
$$ 1032 14378 5806 -14766 -11254 14049 11396 -9653 -13071 2187 16413 1113 -18066 -3145
788c145J6980o460j7418l716K2381O891k2122p307J4014J3493p300k1468O657
$$ -3145 13835 7375 -10043 -13759 8622 15513 -6609 -13916 98 13591 6291 -15177 -8520
801h520K1603l623j6510o214J5874J4174j7880j4210J3375J3599l379j8586k058
$$ -8520 13083 9460 -7050 -13264 2610 16784 -1096 -15306 -1931 11668 8289 -10297 -12355
814a2355K2223K515j7698o595J0828J5605r730j9573R422J6432k241j4803p244
$$ -12355 9868 12383 -5315 -11910 -1082 14523 4793 -14780 -5358 11074 8833 -5970 -13214
827a3214J7855J0192j7328r458R415J3517k374j9925J518J9557L03j3710q182
$$ -13214 4641 14833 -2495 -11953 -2538 10979 8605 -11320 -9802 9755 10058 -3652 -11834
840a1834J1354J5281j2678j4741Q772J2623O12j5719o141J8644N946j4111q350
$$ -11834 -480 14801 2123 -12618 -3846 8777 9389 -6330 -12471 6173 12119 -1992 -10342
853a0342O840J5402m908j8517M771J4586J153j1396r942J3336J2400j2833j0497
$$ -10342 -3502 11900 6992 -11525 -6754 7832 8985 -2411 -12353 983 13383 550 -9947
866i947N344J2641J656j7634k445J6724L069j0235r266O840J5346p664j4449M578
$$ -9947 -4603 8038 9694 -7940 -10385 6339 9408 -827 -10093 -3253 12093 4429 -10020 -5442
880e442J1146L742j2642q863J4795P996j0453q717L200J3881o77j6482J011J2164
$$ -5442 5704 9446 -3196 -12059 2736 10732 279 -8438 -5238 8643 7966 -8516 -7505 4659
894D659L482q119j0922R059J3053q893j0251K455J0533M333j4359n036J3478M531
$$ 4659 8141 22 -10900 -1841 11212 2319 -7932 -5477 5056 9389 -4970 -10006 3472 8003
908H003p051r098L094J4303l726j3263J848Q992N258r249r825J1010Q524p280
$$ 8003 952 -8146 -5052 9251 5525 -7738 -5890 3102 8360 -889 -10714 296 8820 1540
922A540p848K47J1700K442j3930j592R731M607n078j0849N309J2546n433r177
$$ 1540 -6308 -6061 5639 8081 -5849 -7441 2290 6897 1819 -9030 -3721 8825 3392 -5785
936e785R0Q109O177j0863o788J0131N439l983q572j98J2834m81j1335m80O659
$$ -5785 -5695 2414 8591 -2272 -9060 1071 6510 2527 -6045 -6243 6591 6110 -5225 -5705 954
951I54O117n620j0340P197Q686m263o789k245R248N021j1068l685P194N173k224
$$ 954 7071 1451 -8889 -1692 6994 2731 -4058 -6303 2945 7966 -3102 -6787 407 5580 3356
966C356r978J997J1065k428p406j809N479P436p624p719P129N466j509p118k735
$$ 3356 -6622 -4625 6440 4012 -3394 -5203 276 7712 88 -7631 -502 4964 3455 -3663 -6398
981f398J0666K000r357j698M194O091k387r869L843Q148j855n477l697O786O232
$$ -6398 4268 6268 -3089 -4787 -593 5498 3111 -6758 -2915 5233 3378 -2099 -5796 990 7222
996G222q238m588M812M899K0q565n76R456l14n667k922L185P789m702p969M673
$$ 7222 -1016 -5604 -792 4107 4127 -4438 -5014 4442 4128 -1539 -4461 -1276 6513 1811 -6158 -1485
1012a485N009J58n230m429Q107L717p097k610K291N582K6q771J067P208L0l962
$$ -1485 3524 3682 -1548 -5977 2130 5847 -1250 -3860 -1569 4013 4039 -4732 -3665 3543 3573 -389
1028c89m591M289O784n637m730K607M053K101o897k763P753J325m046l392R90
$$ -389 -4980 -691 6093 456 -4274 -1667 2386 4487 -2410 -5173 2580 3905 -141 -3533 -2543
1043b543P368j847p473K395L972J601l363n366N529M657m826k958L67M944J997
$$ -2543 4825 2978 -4495 -2100 1872 3473 110 -5256 273 4930 104 -2854 -2487 2457 4454
1058D454p535o13N657R55k011m776J758O835l211m629J048K928L266m818m214
$$ 4454 -3081 -3694 1963 2918 907 -3869 -2111 4724 1513 -3116 -2068 860 4126 -692 -4906
1073d906N835K396k603l127p84O190L16o185M10K954K470j727n682L375M876k902
$$ -4906 929 3325 722 -2405 -3189 3001 3317 -2868 -2458 496 2966 1239 -4443 -1068 3808 906
1089I06k592j201L684L572n902j974M139J427k63m376n17O293j057m068k52J790
$$ 906 -1686 -2887 797 4369 -1533 -3507 632 2059 1796 -2580 -3097 3196 2139 -1929 -2181 -391
1105c91L933k780m849L751K676q54k624k285M819J995m721q50J483K842J28n544
$$ -391 3542 762 -4087 -336 2340 1486 -1138 -3423 1396 3391 -1330 -2180 -697 2145 2273 -3271
1121c271J251M615j290j773k192J990M464l805k921K496J650J112l539k163N140
$$ -3271 -2020 2595 1305 -468 -2660 -670 3794 -11 -2932 -436 1214 2326 -1213 -3376 1764
1136A764O12l018j123L72L984p19m765J644K551N11j644l395L222L186l355j522
$$ 1764 2376 -642 -1765 -1393 2591 1872 -2893 -1249 1302 1813 169 -3226 -4 3182 -173 -1695
1152a695L87K466J724m747n77L860J46r46k689L79M671j798l215R24J461K139
$$ -1695 -1308 1158 2882 -1865 -2442 1418 1564 618 -2071 -1692 2979 1181 -2034 -1110 351 2490
1168B490k451l219L622J718j729j575r99L749R62m247J6J993J399m05l971J513
$$ 2490 39 -3180 442 2160 431 -1144 -2143 1606 2568 -1679 -1663 330 1729 1324 -2647 -1134
1184a134L690j755j659q73J820K883l392k066K757J098J28k854j054M342o8k911
$$ -1134 2556 801 -858 -1731 89 2972 -420 -2486 271 1369 1497 -1357 -2411 1931 1863 -1048
1200a048l65Q35K836j086l877K001K286l69j547k148K881K433l405j131J159J818
$$ -1048 -1413 -578 2258 1172 -2705 -704 1582 1213 -334 -2482 399 2832 -573 -1704 -545 1273
1216A273P62l860j51L670k41j569j737R45L661k021k973J424J719J066k437k285
$$ 1273 2035 -1825 -1976 1694 1453 -116 -1853 -908 2753 732 -2241 -817 902 1968 -469 -2754
1232b754L491J402k281j271r3L254L09m156N12K499O76j113l047J906L339k277
$$ -2754 737 2139 -142 -1413 -1506 1748 2057 -2099 -1587 912 1588 475 -2572 -666 2673 396
1248C96j939K57J961J791l338j704L235J048j060k405n8M098o93l250K30J635
$$ 396 -1543 -1286 675 2466 -872 -2576 659 1707 647 -1758 -1816 2282 1589 -1661 -1431 204
1264B04J951j632l375K560K474j391j952r11L119J597l824q93K252J574n01l527
$$ 204 2155 523 -2852 -292 2182 791 -1161 -2072 1047 2644 -1180 -2073 179 1753 1252 -2275
1280b275O60L806q24k404q84J833K928k766k865K560J936l11k776j152M045P98
$$ -2275 -1615 2191 1367 -1037 -1921 -88 2840 74 -2791 -231 1705 1394 -1382 -2534 1511 2309
1296B309l291r34J421K727q78m032J355L269m43k172j947K887K768l243k097J695
$$ 2309 -982 -1916 -495 2232 1354 -2678 -1323 1946 1503 -669 -2616 271 3039 -204 -2301 -606
1312f06K258L41l831n85M052M80k623j728J494L579j766l686J552K564N17k714
$$ -606 1652 1993 -1838 -2423 1629 2109 -514 -2242 -748 2831 1065 -2621 -1069 1495 2012 -702
1328g02k189L573K137k935k018R26L321K9m371K19L461O55k164k653K168L626
$$ -702 -2891 682 2819 -116 -2134 -1208 2113 2142 -2229 -2010 1451 2106 -58 -2711 -543 3083
1344C083k328l000R12K712J216l747j742L834J592k291k470P48M051o98m103L99
$$ 3083 755 -2245 -1333 1379 2595 -1152 -2894 940 2532 241 -2229 -1481 2570 1872 -2231 -1832
1360a832K948J340k496l076K870L213k178k847K23L518J055m268j108L406J680
$$ -1832 1116 2456 -40 -3116 -246 2967 789 -2058 -1835 1683 2738 -1530 -2638 768 2448
1375B448j828l331J272M256j203l582j06K970K074l330k847L266K573j667l065
$$ 2448 620 -2711 -1439 2817 1614 -1968 -2074 896 2970 -360 -3207 59 2632 965 -2100
1390b100r3M198O41m257q81K893K304j983l905K060L908j330l260n97L407K099
$$ -2100 -2193 2005 2646 -1611 -2492 401 2705 722 -3183 -1123 2785 1455 -1805 -2402 1005 3104
1406C104l845k344L001K596j170l879L23M576n0l796j088K720K937k585l796K403
$$ 3104 -741 -3085 -84 2512 1342 -2537 -2214 2362 2312 -1484 -2572 148 3085 500 -3296 -893
1422h93L410q45l404j111M120J881m051k010K552L085j239m323Q43M314j62l373
$$ -893 2517 1672 -1732 -2843 1277 3158 -893 -2903 -351 2734 1495 -2828 -1985 2329 2167 -1206
1438a206j659L086L124l126l383K179L383l55m115q22M591J136l621j990K198
$$ -1206 -2865 221 3345 219 -3164 -985 2398 2043 -2072 -2894 1697 2833 -788 -2778 -580
1453e80L630j652m387J157L982K25l522k139L784K935l481k929J819L576j54m567
$$ -580 3050 1398 -2989 -1832 2150 2375 -1147 -3286 498 3433 -48 -2977 -1158 2418 2264 -2303
1469b303l87M367J060l168k621K453M057k306m168J344L708N72l910k001M124
$$ -2303 -2690 1677 2737 -431 -3052 -599 3458 1152 -3016 -1672 2036 2608 -1302 -3303 821
1484H21K396l121k992J615M083o40m682J22M102J137l279k911L025L761k540l565
$$ 821 3217 96 -2896 -1281 2802 2162 -2520 -2398 1704 2841 -438 -3349 -324 3437 897 -2668
1500b668Q42L846Q56m510j605M348J968k894l200J717M433j150m563L40L842J356
$$ -2668 -1826 2020 2876 -1634 -3239 1109 3077 183 -3017 -1300 3133 1983 -2580 -2240 1602 2958
1516B958l489k842L397L302k425l655Q14M375L18m709q71L825K126k824l682K308
$$ 2958 -531 -3373 24 3326 901 -2754 -1940 2435 2753 -1956 -2827 998 3124 300 -3382 -1074
1532a074M313j689l924K5L839J770m159k675L919K893k436l653Q83M602n0m555
$$ -1074 3239 1550 -2374 -2349 1490 3260 -899 -3574 345 3238 802 -2851 -1968 2634 2584 -1971
1548a971q42L755K257l067l536K579L918j505m009j00M423J272m464j889L420
$$ -1971 -2813 942 3199 132 -3404 -825 3093 1588 -2421 -2521 1902 3174 -1290 -3179 241
1563B41K770j971m095J167M734o37m154q36L678K498l491l572L084L677j598l954
$$ 241 3011 1040 -3055 -1888 2846 2209 -1945 -2781 897 3395 -96 -3668 -584 3093 1495 -2459
1579b459n8M508J019m289j875L287L151k418m276J808M467o99m088j019L975K398
$$ -2459 -2517 1991 3010 -1279 -3154 133 3284 866 -3410 -1602 2865 2166 -1922 -2941 1034 3432
1595C432l783l061K760L550j222m415K04M750O53m223j851L327L322k769m055
$$ 3432 -351 -3412 -652 2898 1676 -2739 -2535 2215 2868 -1355 -3206 121 3443 674 -3381
1610c381K019M025l94m139j234M431K078m033k614K688L606j376m637O03M663
$$ -3381 -1362 2663 2269 -1870 -3104 1327 3405 -628 -3242 -554 3052 1676 -2961 -2358 2305
1625B305M03l963j983L403L316k887l909J909M114l87m519p75M469J707l675k803
$$ 2305 2708 -1255 -3238 165 3481 594 -3315 -1406 2708 2321 -2198 -2973 1496 3203 -472 -3275
1641c275K583L989j791m523R16M258O24l988k236M008L081l501l390K012L921
$$ -3275 -692 3297 1506 -3017 -2101 2157 2781 -1207 -3443 565 3646 145 -3245 -1233 2688
1656B688m08m523p06M496J654l687k823K809L873k039m304R11M329N92m413j716
$$ 2688 2280 -2243 -2949 1547 3201 -486 -3309 -500 3373 1334 -2970 -2059 2270 2862 -1551 -3267
1672c267M063K586l068l432J674M491p58m862q5M363J410l650k931L163L811k362
$$ -3267 796 3382 314 -3118 -1444 3047 2289 -2573 -2658 1705 3115 -535 -3466 -303 3508 1146
1688A146m123J089M164N87m402j726M117K521l140l525K133M302j115m569O0M124
$$ 1146 -2977 -1888 2276 2863 -1539 -3265 852 3373 233 -3292 -1159 3143 2028 -2541 -2481 1643
1704A643J574l886k820L399L484k316l967Q48M498M12m812j204M135K285l131
$$ 1643 3217 -669 -3489 -90 3394 1078 -2889 -2041 2457 2869 -1943 -3147 988 3273 142
1719A42l475K283M224j307m374k9M184J555m057k668L620L270k441l909J095M485
$$ 142 -3333 -1050 3174 1867 -2507 -2536 1648 3203 -854 -3522 98 3368 927 -2982 -1887 2598
1735B598K9m582j042L891K416l208l607K515M242j485m394R6M386J244m280k148
$$ 2598 2627 -1955 -2997 894 3310 102 -3505 -990 3252 1767 -2627 -2531 1855 3099 -1181 -3329
1751c329L491L086k337m014J213M594k50m437r74L962K367l424l413K786L813
$$ -3329 162 3248 911 -3103 -1890 2704 2454 -1983 -2957 1005 3372 -52 -3465 -679 3134
1766C134j571m106N9M354J169m240k107L495L079k434m105J612M370m46m248r34
$$ 3134 1563 -2543 -2484 1870 3039 -1201 -3308 187 3266 832 -3273 -1661 2709 2263 -1985 -2919
1782b919L969K322l674l041K677L701j451m277K60M525P53m183j818L459L022
$$ -2919 1050 3372 -302 -3343 -666 3035 1584 -2693 -2433 2092 2845 -1338 -3156 303 3325
1797C325k646l909J775M123n38m101r48M100K180l769k941K899L532j616m254
$$ 3325 679 -3230 -1455 2668 2130 -1971 -2919 1181 3361 -408 -3349 -450 3082 1466 -2788
1812b788N27M456N20m045j753L399L044k826l810J947M087o61m288o12M262J666
$$ -2788 -2261 2195 2715 -1330 -3083 316 3360 534 -3276 -1329 2758 2097 -2191 -2803 1459 3125
1828C125l842k433K794L362j705m180Q66M272L50m050j693L705K818l177l386
$$ 3125 -717 -3150 -356 3006 1301 -2879 -2013 2259 2609 -1441 -3134 571 3389 212 -3174
1843c174K145L783p24m242m11M236J391l654k449K818L557k123m169J279M092
$$ -3174 -1029 2754 2030 -2212 -2623 1613 3004 -650 -3099 -281 3276 1153 -3016 -1737 2355
1858B355J32m027j469L845K501l277l182K064L843q13m316k49M377J124l630k432
$$ 2355 2487 -1540 -3009 836 3337 60 -3122 -1058 2785 1972 -2344 -2593 1784 2908 -722 -3154
1874c154K939L524k328l916J318L921K19m140j413M000K235l206l078K095L872
$$ -3154 -215 3309 981 -2935 -1617 2304 2523 -1617 -3030 970 3205 -1 -3079 -984 2888
1889B888j022m397K65M025R96l485k478L176L282k505l571J169M022J75m400j019
$$ 2888 1866 -2531 -2266 1759 2755 -730 -3208 -32 3250 745 -2826 -1657 2365 2540 -1860 -2879
1905b879M029J851l003l022K094L884j300m158L17L834J201l721k435L545K961
$$ -2879 1150 3001 -2 -3024 -930 2954 1654 -2504 -2187 1647 2848 -873 -3308 237 3198
1920C198k625l448J333L951j11m215p99L814J861l015l155K444L831j661l882
$$ 3198 573 -2875 -1542 2409 2298 -1917 -2716 1098 2959 -56 -3211 -767 3064 1403 -2479
1935b479K79M002J015l958j960L477K550k286l422J157M242m13m283m67L677J847
$$ -2479 -2200 1802 2817 -1141 -3101 376 2926 640 -2782 -1625 2617 2204 -2079 -2546 1131 2978
1951B978l204l058K818L479j887l601M05L968Q51m045j652L400K476k421l657
$$ 2978 -226 -3284 -466 3013 1126 -2475 -2070 1898 2749 -1296 -2948 452 2928 507 -3150
1966c150J826M074r03l927m05L686J812l513k667K946L070j724l567L69M263M15
$$ -3150 -1324 2750 1847 -2080 -2485 1201 3013 -500 -3167 -221 2849 1125 -2442 -2073 2190 2605
1982B605m134j298L389K374k595l466K083L764j034l684m66L813J643l779k307
$$ 2605 -1529 -2827 562 2936 341 -3125 -1042 2722 1688 -1996 -2462 1351 2994 -785 -3092
1997c092L024K906j739l806Q61M215j57l804j043L190K490k867l259K264L480
$$ -3092 -68 2838 1099 -2707 -1846 2369 2212 -1592 -2635 555 3045 178 -3081 -817 2663
2012B663j064l748k57M098J103l801j838K792K950j891l827J182M016k43l655
$$ 2663 1599 -2149 -2406 1692 2795 -1006 -2844 -52 2898 1007 -2820 -1638 2378 2135 -1520
2027a520j179L449K377l327k857K524L078r80l798p0M081Q40l618j775K743K956
$$ -1520 -2699 750 3127 -200 -3057 -533 2545 1565 -2233 -2303 1778 2618 -1000 -2775 -32 2924
2043B924k166l611J528L616k16l662j130L785J914l356k325J979L262q94m049
$$ 2924 758 -2853 -1325 2291 2075 -1587 -2717 1068 2982 -374 -2699 -720 2542 1648 -2401
2058b401L04M036M26l346j748K863K901k525l309J633L344j33l608j013L649J716
$$ -2401 -2097 1939 2365 -981 -2729 134 3035 510 -2799 -1166 2178 2045 -1563 -2576 1073 2789
2074B789l051k478K107L473j510l840Q53L403O08l253k005L159K633k618k772
$$ 2789 -262 -2740 -633 2840 1330 -2510 -1657 1746 2354 -899 -2904 255 2888 270 -2502
2089b502J307L367q2l979n89L914J139l008k274K237L246j614l570P83L365N98
$$ -2502 -1195 2172 2090 -1889 -2478 1436 2575 -433 -2707 -470 2776 1162 -2408 -1625 1740 2338
2105B338l465j675L414K147k531k768J348L647o53l946Q9L310J154k676k589K490
$$ 2338 -1127 -2802 612 2759 228 -2540 -1192 2455 1802 -2144 -2055 1255 2409 -267 -2856 -366
2121c66L207k031l197Q30L373M63l662j261L419J808k385k746J413L571q45l612
$$ -366 2841 810 -2387 -1557 1816 2279 -1383 -2644 775 2583 198 -2548 -1135 2436 1591 -2021
2137b021M2L181J353l090k364K931K660j988k929N45L581M40l844r33L148J829
$$ -2021 -1979 1202 2555 -535 -2899 32 2692 704 -2225 -1680 1901 2341 -1503 -2436 712 2541
2153B541k296k914J749L521j279l315j1L325J152l253j882K767K360j652l089
$$ 2541 245 -2669 -920 2601 1322 -1993 -2004 1321 2473 -780 -2662 105 2465 813 -2276
2168b276N89L770j15l583n49K847J897k485k886K159L049j228l002j66L332J144
$$ -2276 -1687 2083 1968 -1615 -2164 683 2580 95 -2791 -632 2417 1189 -1813 -1979 1353 2497
2184B497l400j686K724K324j667l287J182L503m71l129p90K842K037k801k587
$$ 2497 -903 -2589 135 2459 792 -2495 -1313 2190 1719 -1410 -2200 642 2679 -122 -2709
2199b709K248K709r81l157j69L698O71l420j169K392K343j757l187J317L220l44
$$ -2709 -461 2248 1267 -1890 -2059 1639 2310 -1110 -2279 113 2456 699 -2488 -1171 2049 1705
2215A705l087q89L118J831l021k121K083K582q99l394L19L468L08k861j424K283
$$ 1705 -1382 -2271 847 2678 -343 -2464 -381 2201 1302 -2092 -1773 1695 2003 -858 -2282 1
2231AK665k119l087J624K917l56l062q78L339J403k892j852J782K779j003l450
$$ 1 2666 547 -2540 -916 2001 1645 -1417 -2295 1044 2447 -445 -2297 -515 2264 1261 -2189
2247b189N59L244L79k855j579K702K329k375k487J338K768r8l279o20L278J093
$$ -2189 -1630 1614 1993 -862 -2441 261 2590 215 -2272 -934 1834 1736 -1543 -2163 1115 2208
2263B208k566j941J791K947j424l226Q43K915L76k792j514K877J877k212k332
$$ 2208 -358 -2299 -508 2439 1015 -2211 -1368 1547 1923 -869 -2383 494 2371 159 -2173
2278b173J183K954k98l508r0L147Q07k364k032K043K776j749k771P04K819N16
$$ -2173 -990 1964 1666 -1842 -1932 1215 2022 -342 -2374 -331 2445 696 -2075 -1371 1448 1964
2294A964l059j266L015J628k160k301J206L064p00l196J45K712J014k351k119
$$ 1964 -1095 -2361 654 2282 122 -2179 -973 2091 1391 -1805 -1660 1052 2066 -285 -2404
2309b404K261K488j761k501N64K948L78l276q38K892J323j956k303J305L057r78
$$ -2404 -143 2345 584 -1917 -1353 1595 1973 -1303 -2141 751 2074 118 -2185 -880 2177 1199
2325A199k892O9K592J199k755j783K533J962j554k443N08L052Jl041n23K411J546
$$ 1199 -1693 -1624 968 2167 -588 -2371 162 2124 570 -1873 -1365 1687 1688 -1353 -1876 535 2081
2342B081j898k591J844K719j191k603K4K785R43k877j343K312J785j318k664P28
$$ 2081 183 -2408 -564 2155 964 -1639 -1615 1170 2113 -764 -2107 205 1990 672 -1992 -1264
2358a264L113l42k828n21K457J619k274k273J992K256r45k511j76L026O72k863
$$ -1264 1849 1507 -1321 -1842 615 2234 -40 -2313 -321 1935 990 -1521 -1697 1329 2001 -862
2374h62j090K085J958j480k782J138K868n78k460o03K448J505k353j921J810K173
$$ -862 -1952 133 2091 611 -2171 -1033 1835 1257 -1203 -1806 642 2147 -206 -2127 -317 1856
2390A856p73k806J32L076L07k696r32J961K001j656k525J277K445l86k394p78
$$ 1856 1083 -1723 -1591 1485 1792 -904 -1836 125 2126 470 -2055 -778 1667 1281 -1113 -1891
2406a891K760J249k507j585J701K152q98k735L97K835M8k225j195K037K028j978
$$ -1891 869 2118 -389 -1974 -273 1879 981 -1754 -1357 1478 1526 -699 -1894 143 2171 193
2422A93k253J356K260k01k665m47K763Q67k334j311J432K250j023k775P32K540
$$ 193 -2060 -704 1556 1355 -1310 -1757 1006 1873 -461 -1772 -340 1910 887 -1888 -1156 1384
2438A384J75k364j183K376J725k099j855J212K224k18k718k84K645P07k105j544
$$ 1384 1559 -805 -1988 388 2113 14 -1841 -629 1595 1377 -1341 -1625 1020 1727 -378 -1922
2454a922J627K359j457k454Q66K291K00k389j073K477J405j877j752R38K461m67
$$ -1922 -295 2064 607 -1847 -981 1310 1510 -879 -1952 525 1930 53 -1699 -761 1700 1233
2470A233k797J06K494O17k062j557J936K014j569j971M84K370L06k639p42K395
$$ 1233 -1564 -1458 1036 1653 -409 -1966 -30 1984 415 -1556 -1072 1298 1604 -1035 -1777 618
2486F18J100j679j858J136K550r08k539L70K072Q31k113j542J946J903j474k074
$$ 618 1718 39 -1819 -683 1867 959 -1580 -1210 862 1693 -420 -1962 -16 1887 413 -1661
2502a661N80K525j0k649k89K103J111j707j843J365K230r46k157M8K226Q32k387
$$ -1661 -1081 1444 1434 -1215 -1504 599 1710 3 -1840 -475 1755 809 -1348 -1300 926 1758 -629
2519f29j249K166J398j328j976O17K473j73k439l82K088J195j767j848J555J983
$$ -629 -1878 288 1686 358 -1618 -1001 1472 1299 -1140 -1522 566 1761 -6 -1854 -299 1684
2535A684r12k100k5K430N15k416r01J888J432j104k168P83K446m24k207l68K006
$$ 1684 772 -1328 -1353 1077 1592 -824 -1725 163 1595 491 -1677 -894 1552 1128 -1079 -1447 559
2552E59J245k037j620J676J790q46k147J36K433L08k196q10J665J601j397k098
$$ 559 1804 -233 -1853 -177 1613 767 -1380 -1244 1189 1497 -699 -1509 156 1757 360 -1738
2568a738J105K089m80j936n04K080J179k111j320J483J607p00k180K37K408R5
$$ -1738 -633 1456 976 -960 -1464 616 1795 -316 -1636 -153 1454 754 -1426 -1189 1219 1314
2584A314k141o73J762J427j566j776J100J872k52k122l77K240P60j977j088J355
$$ 1314 -827 -1500 262 1689 123 -1653 -553 1319 1067 -1055 -1432 808 1568 -409 -1497 -142
2600a42J709q77k227O19K104qj837q23J740J477j620j716J140J758l12k162j10
$$ -142 1567 690 -1537 -918 1186 1178 -659 -1482 258 1735 115 -1601 -461 1297 985 -1177 -1287
2617a287K187M52j707j149J354J767j068k025O95J814J69j891q45J956J204j733
$$ -1287 900 1352 -355 -1504 -150 1617 549 -1476 -781 1033 1202 -689 -1534 422 1626 -107
2633a07j340R50J800l86k104o6K154M03j664j196J467J680j216j731N75J872J11
$$ -107 -1447 -497 1303 917 -1187 -1253 901 1304 -360 -1556 -89 1591 375 -1356 -781 1091 1202
2650A202k060n10J949Q51j484j397R25J934n42k152J91J907M78j692j112J583
$$ 1202 -858 -1368 581 1432 -52 -1449 -524 1410 868 -1284 -1093 814 1292 -400 -1512 71
2666G1J464j234j614N25J870Rj960n08J909Q45j395j490J168J791q53j752K30
$$ 71 1535 301 -1313 -788 1082 1091 -869 -1377 532 1377 -18 -1508 -340 1451 598 -1154 -924
2683i24J724N08j753j075J694J252j130j542N17J917r5k052j78J671P77j438j360
$$ -924 800 1308 -445 -1520 174 1426 296 -1246 -729 1188 1093 -959 -1137 534 1311 -127 -1487
2700a487J272J616q43j664J30J852L98j875p64J630J052j057j599P19J902m19
$$ -1487 -215 1401 558 -1106 -976 876 1274 -601 -1365 265 1317 260 -1339 -620 1282 863
2716H63j791j27J543Q79j497j357J347J528q20j614J31J870J90j779n82J449J048
$$ 863 -928 -1055 488 1367 -130 -1487 -140 1388 568 -1046 -915 955 1145 -634 -1216 233 1281
2733A281j102j544Q81J781n17j671k12J685P70j676j012J293J280p87j600K86
$$ 1281 179 -1365 -484 1297 780 -891 -1103 582 1352 -324 -1336 -43 1237 450 -1150 -864
2749h64J877Q5j842m48J412J101j218j473J049J483m55j616j80J784N46j605q93
$$ -864 1013 1098 -744 -1192 220 1321 103 -1370 -321 1162 707 -909 -1089 695 1241 -364 -1257
2766a257J202J306p79j766N23J820q7j596n20J510R93j342j278R72J352k86j695
$$ -1257 -55 1251 472 -1294 -771 1049 962 -634 -1154 356 1349 7 -1271 -299 1053 767 -928
2783i28j16J832L66j557q31J214J287r47j563P11J491r1j512n16J514R25j371
$$ -928 -1044 788 1154 -403 -1234 -20 1267 320 -1243 -532 959 868 -644 -1160 354 1279 -92
2800i2j153R55J390m37j710J83J665K36j458p50J285J115j042j357O77J482j34
$$ -92 -1245 -290 1100 663 -1047 -864 801 1037 -421 -1171 114 1229 187 -1170 -493 989 855
2817H55j570l91J557P33j386r41R03J373n66j610K61J534K33j417p60J264J155
$$ 855 -715 -1106 451 1184 -202 -1143 -240 1133 567 -1043 -782 752 985 -432 -1192 72 1227
2834A227j103j250O24J422j22j655j38J552M62j205r67R24J372o79j522L40J464
$$ 1227 124 -1126 -502 920 798 -857 -995 557 1019 -186 -1153 -229 1143 464 -1058 -718 746
2851G46J91j478o48J489Q58j061j107N74J391j86j609lJ376N13j174j073J106
$$ 746 937 -541 -1189 300 1158 97 -1010 -436 955 769 -840 -843 533 1046 -128 -1201 -95
2868i5J277r34j222L33J339K01j398n79J288Q29r62j159O35J506m49j443P7J293
$$ -95 1182 248 -974 -641 698 899 -499 -1078 210 1039 77 -1082 -447 1059 610 -833 -756 537
2886E37M81j238q95J116J052p27j156J53J442J61j543l61J262P80j037j077P17
$$ 537 1018 -220 -1115 1 1053 326 -830 -677 765 926 -617 -978 284 1064 27 -1050 -333
2903c33J294l62j356jJ278M88j336p52J104R83o66j264L26J489j42j307k93J124
$$ -333 961 599 -757 -758 520 1008 -328 -1080 24 1007 341 -923 -597 892 750 -557 -850 274
2921B74P00r01j170Q70J131l78j263j00J403L74j295o38J035R19o36j248M37J295
$$ 274 974 73 -1097 -227 904 526 -737 -837 566 940 -355 -993 42 961 325 -923 -486 809
2939H09j21j227l41J168P77j123r59R12J015m27j294P4J324K95j273n43R71R64
$$ 809 688 -539 -880 288 1065 -58 -1017 -105 910 483 -811 -737 587 882 -391 -934 37 1001
2957A001p91j160N02J219l9j262l45J242N75j114p60P56J017l60j299R5J377J74
$$ 1001 210 -950 -448 771 732 -530 -875 367 942 -172 -932 -176 841 481 -818 -723 654 828
2975H28j213n38R76Q95q09j062N57J145j42j241k27J218M73r26q65P23J133n35
$$ 828 -385 -923 53 948 139 -923 -366 779 637 -604 -831 387 860 -66 -931 -208 925 390
2993C90j197K63J153J00j051n85J061Q22r11q53M01J131p2j276j77J262L43r31
$$ 390 -807 -544 609 709 -342 -927 134 956 45 -808 -407 724 652 -624 -801 461 804 -127
3011a27p46P61R96n64j098K40J063K51j145n60J106O79q18p83L22J139j70j187
$$ -127 -873 -112 884 320 -778 -538 525 776 -369 -929 177 856 38 -745 -423 716 546 -641
3029f41k6J059L93r00p83P62J008n23j032J21J128J25j161k87R41O54p24r50N08
$$ -641 -667 392 785 -115 -898 -136 872 349 -683 -562 566 691 -470 -757 184 838 114 -836 -328
3048c28J060k76j030o4R65N06j009p44Q98Q01n32r54K01J113J02j200k66Q89O63
$$ -328 732 456 -574 -638 327 833 -176 -920 -22 779 247 -707 -506 607 709 -491 -757 132 795
3067G95p06q99N50R62k85r61j54J075M09j121m67P32P85m20r94J82J211p8j045
$$ 795 89 -810 -260 702 417 -544 -698 377 786 -335 -802 -70 715 295 -699 -517 694 616 -429
3086d29k38P64P23p44r04O16R01k72r66j34J066L14r07n15O27R17n33j033L80
$$ -429 -667 97 820 76 -828 -212 689 417 -549 -683 383 697 -210 -725 -98 819 286 -747 -367
3105c67J007j61p49m38Q92O18q27p21N97P64j93j010p3J126J84r84l96P15P15
$$ -367 640 479 -270 -708 184 802 -25 -746 -149 615 422 -588 -661 465 649 -335 -731 -16 699
3124F99n24q70L49Q13P1q70m07J011M73q52n67M38R24k74j004J00R53J02p13n44
$$ 699 175 -695 -346 467 538 -332 -739 272 745 -107 -674 -236 688 414 -590 -490 463 565 -148 -692
3144f92O39P91n53q95M36P44Q2r65k41R82L33p04n84M30Q20k89q63N7Q87J82q05
$$ -692 -53 738 185 -710 -274 470 552 -413 -654 328 661 -43 -627 -197 623 334 -529 -472 415 597 -208
3165b08n58Q27O33o27o83K78Q57l9r88q7Q67L14n69p33N30Q78l96q63J29P80K30
$$ -208 -766 61 694 67 -616 -338 519 480 -508 -595 272 586 17 -716 -186 692 296 -567 -438 342 572
3186E72q38l98P26N47m79o50J65R41j11r45rO67M43o41o64O22P18m14p47Q4P62
$$ 572 -266 -664 62 609 130 -520 -355 586 475 -470 -479 188 631 -10 -674 -52 666 252 -495 -411 351
3207C51J93q77l21P68M38m13q06L86R07l03p76J9O14M29o68o78P05N68k87p26
$$ 351 544 -333 -654 114 552 139 -667 -281 626 323 -453 -434 180 609 -59 -737 -32 536 249 -477
3227d77l9R76J04q80j88N59N21m66p28M24P63k85o25k02Q26L56q36m49O80M20
$$ -477 -516 460 564 -316 -504 55 576 110 -618 -194 569 284 -341 -543 283 639 -197 -646 34 454
3247D54j85q22P3R73p5o69k21N43N42n46o97M63O62k01o57j35Q73J92p70k72M21
$$ 454 269 -553 -480 493 418 -251 -472 71 613 67 -630 -167 495 294 -363 -498 375 567 -203 -475 -54
3268e4N24j87q41K30Q21r4o79k69O00O25o79n60N27M63j26o80j38R36M9o08l30
$$ -54 470 283 -558 -328 493 399 -280 -549 51 676 -3 -563 -36 427 301 -379 -517 419 468 -140 -470
3289d70M01O20l72p36L16O51k2o11l05P68K84o23m08L38N97k4q85O3P99L5n95
$$ -470 -69 551 179 -557 -241 410 388 -223 -528 240 524 -99 -507 -169 428 404 -481 -418 381 416 -179
3310a79l18M55O60n91n10L33N11O1o97k21P72K26n65l84L02O98k83p58K23N82
$$ -179 -497 -42 618 27 -483 -150 361 422 -275 -496 276 502 -63 -447 -145 553 270 -488 -265 317
3330C17Q4n08m50N86N45n66m83K45N69J49q66p4O87J20l62m82K97P16k97o52J55
$$ 317 401 -107 -557 29 574 8 -475 -230 339 488 -378 -452 235 355 -7 -489 -192 524 227 -425 -270
3351b70N47K33o48l89P16K91m68l75J26O67p1p54L3N43K23l85n30M11N86m39m15
$$ -270 277 510 -138 -527 189 480 12 -363 -237 430 359 -395 -362 181 404 19 -511 -100 486 47 -368
3372c68R0N44J79o95j49N44J93k45m89J32P12j45o96J68L70K57m42n17O45L86
$$ -368 -278 266 445 -250 -399 145 338 93 -396 -264 448 303 -393 -225 145 402 -40 -557 88 474
3392D74l15m76l0O72J41p77n3N21K53k88o14L46O21l12m90J8M12L97o23k93M94
$$ 474 159 -317 -347 325 466 -311 -364 157 410 122 -492 -146 475 163 -327 -309 103 500 -123 -416 78
3413G8K97k16m85j3P59o7o84NL60M19m20m94L96M52k18l64j93N73K47o32k31M61
$$ 78 375 159 -326 -339 420 353 -331 -326 34 453 33 -461 -65 387 169 -195 -388 185 432 -200 -431 30
3435C0L40k07o08J32P23j51m49j11L47M11m82m25M42L49j49m19j45O91mn29r2
$$ 30 370 163 -445 -313 410 259 -190 -301 46 457 -25 -450 -8 341 192 -227 -372 319 315 -214 -306
3456c06K75L86j89o09K84M35rm16k87N18L95n84l26M36K48M6n77J7N96j9m30k24
$$ -306 -31 355 166 -443 -159 276 267 -149 -436 82 477 -107 -433 3 251 297 -280 -263 333 314 -116 -340
3478c40K81M99l67n08L16L55j7l95j61N34K06n45j65J86M29o6o19J22M39J11l77
$$ -340 -59 440 73 -435 -119 236 219 -176 -337 197 403 -142 -307 -121 308 242 -377 -255 184 295 -82
3499h2k91M51L38m57l00J94L02J56n95r0O03P2l64k28J59N50k50n48K90K77R7
$$ -82 -373 78 416 -41 -341 -147 155 311 -284 -374 229 301 -63 -291 -132 418 168 -380 -90 187 284
3520B84l50l43M74L25m29k40J41M06Qn93Q8M35N5k79l46K94M72l32l52J12L19
$$ 284 -66 -409 65 390 -39 -279 -138 268 276 -317 -229 206 261 -18 -364 -70 402 70 -282 -170 149
3541A49J71m99j79N28J33l89j71M3N57j21n43J15L65J19k52m11L99L30l31k79
$$ 149 320 -179 -358 170 303 -86 -257 -214 343 222 -321 -206 159 278 26 -385 14 344 13 -266
3561b66M1M49J52o14L7L11J10j05l92P6O10k50m22J06K43K23l46l02L95K24k36
$$ -266 -225 224 376 -238 -201 110 220 115 -277 -201 409 159 -263 -157 86 309 -37 -339 56 280 44
3582D4k31r6M84M0m86L7K59J62j94m22L34L86k62k40l6L15K47n49j67L83J98q9
$$ 44 -187 -283 201 241 -245 -208 51 213 19 -403 -69 317 55 -185 -221 94 341 -208 -375 8 206 117
3604A17m13O4N44j31l99l4K87L73m17l52L64K47j55k52j12M54J64n86L1J54K47
$$ 117 -296 -232 312 181 -218 -252 35 408 -9 -361 3 250 95 -157 -269 185 349 -237 -206 -52 195
3625A95q3m57K42L64j45k74o0K35L21l68k77L26J85n5l72m9O20j48k90p3Q4M13
$$ 195 112 -345 -103 261 116 -158 -218 17 338 -30 -307 19 204 149 -223 -272 348 200 -90 -163 -79 334
3647C34k11m34L23K16j25j85k03M38J90n13n7J89K10nm06L9M10o9k51j38K27L44
$$ 334 123 -311 12 228 103 -82 -285 153 343 -170 -227 -38 172 167 -239 -200 210 141 -110 -248 -21 323
3669C23l32l00K73J57L5k87j64M78K3l27o4N2L52l3n04K26K64j7j68k98L67K78
$$ 323 -9 -309 -36 121 156 -131 -295 183 206 -121 -185 -133 219 186 -318 -92 172 155 -13 -311 56 334
3691C34l94p4L4K29R6m18l0L74J9j79l17K26M44k48l71J70K32O1k32l28M91J02
$$ 334 -60 -134 -100 129 225 -193 -223 151 170 -9 -326 -100 344 96 -275 -105 127 188 -44 -372 119 221
3713B21l06q1k4L92m3m79J75L16j9j54k58K36K78k60j16K8J76K03m10j23L65P8
$$ 221 -85 -166 -190 202 159 -320 -145 171 152 -2 -260 -24 254 -6 -122 -94 82 285 -125 -248 117 195
3735A95j90k12Q2M38k18l06J45J22J26j83k78L19J63k27j12r8L97K5l93L6K13
$$ 195 5 -207 -125 313 95 -211 -66 56 182 -1 -279 40 203 -24 -136 -234 163 188 -205 -169 44
3756D4O9m5l76K07L54k23j34n8K13K22l78j69L50K7n5j99K6L94j74j80k0J06K16
$$ 44 113 68 -308 -101 253 30 -104 -162 51 273 -105 -274 76 103 48 -151 -125 269 95 -85 -105 1 217
3779B17j90l16K75K23j59j00q6K36J00l76M8J46J30ol47L3L79j51j34p6J70K67
$$ 217 27 -289 -14 209 50 -50 -136 100 200 -176 -128 18 148 142 -205 -172 207 56 -78 -154 16 283
3801B83k69k76K78L2M8j69j66M34o4k50jJ43J43q8l43K14K49j29j17j71K40K24
$$ 283 14 -262 16 48 96 -73 -239 195 131 -119 -120 23 166 78 -265 -51 198 69 -48 -219 21 245
3823B45l07j17J99P2Mk55L4K84j18j31p7P6L49k46k35K38N7M7j46k09L40Q2l09
$$ 245 -62 -179 20 92 96 -159 -125 159 41 -90 -167 -91 258 12 -223 15 72 119 -27 -236 104 186 -123
3846a23m1J17J54Q4l89J52J50j4q6k25K33K52k74j11J27O4Q0k96pK82l7j04o2
$$ -123 -164 -47 107 191 -198 -46 104 90 4 -221 12 264 -10 -121 6 70 150 -146 -153 129 92 -12 -74
3869g4l8K87r8k69J52J00O5j14k47L25J02k50j8K8J50K6k52M3J50K0j02j75J27
$$ -74 -112 175 77 -192 -40 60 125 11 -236 89 191 -59 -77 -49 101 127 -125 -82 68 88 -14 -189 -62
3892f2K40j66j00L1J11J81k59j28K88o6q2n4p9L48q0k88J21R8Q8j09k26J83J56
$$ -62 178 12 -88 -57 54 235 -24 -152 136 70 -12 -66 -145 203 123 -165 -44 54 142 33 -193 -10 146
3915A46j69m0m1J54J37l64j0K15M8n7j97R3K39j23j00n8J23J71j51k34K06J16
$$ 146 -23 -63 -104 50 187 -177 -187 28 76 19 -178 -85 154 31 -69 -127 -4 167 16 -218 -12 104
3937A04q8r3o0L04o0k50O7O0J07qk50J55J21j02p2n3J75J18k66q6K30M6Mj98m8
$$ 104 16 -77 -137 167 107 -143 -76 -16 91 83 -167 -12 109 7 -65 -118 57 175 -91 -177 53 99 103 -95 -143
3962a43K92q6j25l8M2K34j73k04K39M8o8n4j74K90R8k66M9kJ77j4k65J34J61j13
$$ -143 149 63 -62 -100 -58 176 3 -201 38 86 18 -36 -210 80 178 -88 -39 -41 136 122 -143 -9 152 39
3986C9kj94J86P5k01J7J03rR6j60j45L21l2j13m8o6K93r8k38J76L3O1j59p6J66
$$ 39 37 -157 29 104 -97 -80 23 14 110 -50 -195 126 94 -19 -67 -133 160 62 -176 0 33 94 -65 -141 25
4011B5J34j76j2j3J43J6k88J19J29l0m0r5M4K34j81p2N8N1O1j94q1K68K0j53l7
$$ 25 159 -17 -29 -42 101 117 -171 -52 77 47 7 -88 -44 190 9 -63 -5 46 107 -87 -168 100 120 -33 -70
4036g0n3K21n0j38Q2j1J40n0k51K01R9j19J2j08J29J26k90N3R3K0O7k06M4K32
$$ -70 -123 98 48 -90 -8 -19 121 71 -180 21 120 1 13 -95 34 160 -130 -77 16 36 103 -103 -59 173
4060A73j20r4QK7J00q8j44J97J7n6n5o7K23l8j78J15n5Q0J9k01R6J65j20n1k7
$$ 173 53 -41 -33 -6 94 6 -138 59 76 20 -35 -102 121 83 -95 20 -35 45 64 -137 -41 124 4 -47 -74
4085g4O8R2j44o4J36Q0l1j29lJ94o3j24J4%J78j22j43K14n3k5K1j41J38J26j62
$$ -74 -6 86 -58 -122 14 94 63 -66 -69 125 62 -62 -48 -48 130 8 -135 79 26 1 22 -119 19 145 -17
4110a7k6Q9J0N8k57J50J31j25k0m4J4K09k37p4J40L9Q0k31l4K21Qj38j1%K02q3
$$ -17 -43 46 56 114 -143 7 138 13 -7 -51 -37 172 -65 -139 1 40 120 -111 -145 76 84 -54 -65 -65 137 54
4136E4k41J83O0m4j0j60K30J13k17nj2J03P8k26JK32m3j29q1Q8J90j68j22R8M
$$ 54 -187 -4 56 12 2 -158 72 185 -32 -37 -49 54 132 -94 -93 139 96 -33 -114 -26 164 -4 -126 -28 -24
4161b4J10j54q0K61p5m7o2o0K24L8k68J01J03J3l4j80J37O7j01o5QQ8Q7k00P0
$$ -24 86 -68 -148 113 38 -9 -71 -131 93 131 -137 -36 67 80 46 -134 3 70 -31 -96 -88 0 87 -113 -43
4186d3J61o5mr4JK14j51q7N7J4Q5q6j62K55ko7l7j74K26Q7k85Q4J27l5J0j74J18
$$ -43 118 53 49 -45 -44 170 19 -68 -11 3 88 2 -160 95 93 26 -11 -185 41 128 -157 -73 54 19 29 -145 -27
4213b7J33j17j9j2j8K19k12o2J18L7L9j03j14K85j46n0O9q9K21r1k05J10R3l2
$$ -27 106 -11 -30 -42 -60 159 -53 -115 3 40 79 -24 -138 147 1 -49 20 -69 152 61 -144 -34 59 27
4237B7l3q4J53R5k48M1J08OQj72L1K02r1k7n7rJ53r0j55J41J4N8r3r7K29n3j35
$$ 27 -6 -90 63 158 -90 -49 59 65 73 -99 -68 134 43 16 -41 -50 103 13 -142 -1 13 71 -22 -119 110 57 -78
4264g8J5LJ71q0j29J23P0r2pj17Q4J93k07N3o3J18Q0k61K8K03j6j14m8N8J49o7
$$ -78 -63 -60 111 31 -98 25 95 3 -4 -121 -37 156 -51 2 -61 57 137 -124 -96 107 91 -23 -71 -13 136 69
4290F9k16K15pO1j48r6J57M8j08n7l3K33k3k39Q7J00P7k6k12R1J83j44No5L1K12
$$ 69 -147 68 61 122 -26 -122 35 83 -25 -82 -115 118 95 -144 -57 43 120 94 -118 -27 156 12 17 -48 -17 195
4316A95k51q0K22k4k5j34k7L03j14j10jQJ29q6j97K03P3j62M8r4J98N1k39J9J17
$$ 195 -56 -136 86 62 37 -97 -124 179 65 -45 -46 -38 91 5 -192 11 84 -78 -30 -124 74 125 -114 -95 22
4341B2N1J5k20J25J15p8j57R0P0Q0k10l3J88m0J7q7m7K07j5j41k6O9J22q7k10
$$ 22 73 88 -132 -7 108 30 -127 -37 33 113 -97 -130 58 18 35 -52 -99 108 93 -48 -74 -5 117 30 -180
4366a80J99J10j22L1j29J14J01j78J0M3Q7Rk47N5J68q2m2K6K5J44j70r7J14R3
$$ -180 19 129 7 38 -91 23 124 -54 -44 -1 86 95 -152 -97 71 -11 -53 -27 -2 142 -28 -125 -11 82
4390H2K8j29j48K48N3j89M2%Q6o9j11J03Q5o6Nj46J26J32j34n4Q7J7L5j80L1J72
$$ 82 110 -19 -167 81 134 -55 -13 -13 73 4 -107 -4 81 15 20 -126 0 132 -2 -56 31 48 83 -97 -66 106
4416A06q6o9lOJ44o3j96J65kN6j10q8K16J1j21jr0K21Jj66k2J35L1r8j32J63K03
$$ 106 20 -49 -52 -46 98 35 -161 4 2 58 -52 -140 76 87 -34 -35 -125 96 97 -69 -91 44 75 -23 -155 8 211
4443B11j76j03O6P5M3j62p3K44p7m5p1K1J67l9j85J08L3Qo1j19J34O1r8qqJ01
$$ 211 35 -68 -2 73 116 -46 -119 125 48 3 -68 -47 120 81 -104 4 37 45 -16 -135 -1 60 -38 -46 -54 47
4469D7Qj87N4J40K0m0j75Q5J85p3j14L6k3J30q6j01J48M3n2j34j1J80Lk22J00
$$ 47 55 -132 -78 62 82 42 -133 -48 137 64 -50 -14 -37 93 7 -94 54 97 45 -89 -100 80 83 -139 -39
4494c9M8P5q8j38Q9J33m4n5o7J35Q1k62JJ53J7L5j68J9J85j06l7o4P0J70j41j59
$$ -39 9 84 -4 -142 -53 80 36 -19 -86 49 130 -132 -131 22 39 74 -94 -75 110 4 -33 -97 -27 143 2 -157
4520a57J57M6On5n2J39K6j40l9Q5J11l1k00Q2J51q7l4r2P2J66j73j30J79J0O3
$$ -157 0 46 52 -3 -55 84 110 -30 -69 16 127 96 -104 -22 129 42 8 -84 -12 154 -19 -149 30 40 103
4545A03j47j13K42Jj52nM0J40p8j66J37O1K8j64m1J91M9j86l4N3J26Mk03M1J81
$$ 103 -44 -157 85 86 -66 -71 -31 109 31 -135 2 63 91 -73 -114 77 126 -60 -94 -41 85 89 -114 -73 108
4570A08k5p6p5L5J67j87k6J16k8R1j92j9J72k6j23O3j6J52k3k43R3JJ10p9j29
$$ 108 83 7 -68 -33 134 -53 -79 37 9 100 -92 -111 61 35 -88 -25 -41 111 88 -155 -62 -61 49 -30 -159
4595a59J98M8j31o1N7J15P4k53J1J59k5l5j32O6J71m3j54M4R2R0k38k4J64K7q4
$$ -159 39 87 -44 -105 -48 67 141 -112 -101 58 33 -2 -134 -68 103 60 -94 -50 42 132 -106 -130 34 61 -23
4620b3n1k9K40o9j36N2J0O1Oj64J01J04j07m7k0J04Q8j86j4R5LKj37P7J89j05
$$ -23 -74 -103 137 68 -68 -16 -6 55 61 -103 -2 102 -5 -52 -72 32 120 -66 -80 15 18 20 -117 -40 149 44
4646D4j49N5J13L3j26r3K13K0j21l4o1J92N0j93o7J76K7L4k43Q6J69j35n9m7J45
$$ 44 -105 -50 63 96 -30 -123 90 110 -11 -45 -106 86 136 -57 -124 52 79 113 -130 -44 125 -10 -69 -116 29
4671B9J00k07k7J29nN8j87J1J98q0j16Q4lJ13p9j85J70R4j13Mq0J83J6j45j2N6
$$ 29 129 -78 -105 24 19 77 -110 -99 99 19 -97 -13 -16 97 18 -167 3 97 -16 -12 -92 91 107 -38 -50 6
4697FN9M2k34J03J23q0m6q8J18J78j49j59J31O5o0n3j01K50qk24O1O5J10p2j78
$$ 6 65 107 -127 -24 99 19 -27 -115 3 181 32 -127 4 69 9 -44 -145 105 97 -127 -66 -1 109 37 -141
4722a41J55P8q3Kj01J79L6j88%N5P9L1k08L6J60rp0p9P1J84j42j51R0R1K6j52
$$ -141 14 92 9 11 -90 89 125 -63 -63 -8 71 102 -106 -70 90 81 11 -68 3 187 45 -106 -16 75 101 -51
4748e1j06K28K8j33k8%J39n9j56J12J18q4j1j32Q9J66j22q2O4M0R4k47N2K17n5
$$ -51 -157 71 99 -34 -62 -62 77 18 -138 -26 92 8 -3 -135 -46 120 -2 -84 -20 20 114 -133 -81 136 81
4773H1p7q1J2J95j21j34J37J3J10j55j45K54K5j51J9o4J87Jk18K8J13K9l1j66
$$ 81 4 -77 -65 130 9 -125 12 25 135 -20 -165 89 114 -37 -18 -82 105 106 -112 -84 29 58 27 -139
4797a39R2J74j37p1J3J15L6j37p7J76L7r2p2jJ92q8p9K6Q0J8o8j53J59J31j68
$$ -139 -47 127 -10 -81 -68 47 83 -54 -131 45 82 -10 -82 -83 109 21 -58 -32 48 66 -2 -155 4 135 -33
4822c3k6k9K01ok14P4P3J3Nj68R7J28j20n2K0P2J10j83j24J70L7k9l0j27K65p6
$$ -33 -59 -88 113 107 -107 -33 40 53 58 -110 -13 115 -5 -57 -37 35 145 -38 -162 8 45 16 -14 -141 124 48
4848D8j11K1R0Lo7q2J41P7j13J7n8Q8K5j01l8J06k5O2j95Q9J21k2j02n6j8K66
$$ 48 -63 -42 48 51 -16 -98 43 120 7 24 -34 54 79 -22 -60 46 21 83 -112 -23 98 76 -26 -82 -100 166
4874A66j33j14R5N3n3q8j9J71Rj74j5J02Q6Mk09J11J21q3m2j19J38R3j58QQ8L0
$$ 166 33 -81 14 67 14 -74 -93 78 87 -87 -102 0 86 90 -119 -8 113 30 -12 -131 7 100 -58 -50 38 68
4900F8J6k19L5J79j3n6o0mJ77r8j48J36J2N7j38m3J20M8o9p3N2K8M4j58O8P8q
$$ 68 84 -135 -100 79 66 10 -50 -54 123 25 -123 13 25 82 -56 -99 21 69 0 -73 -21 7 51 -107 -39 39 31
4927C1l8r6R5J07j03m2j0J21J5j30l6J59J4p7n6M4J27o9j37L4N6P2m8j43J72L1
$$ 31 -7 -103 -8 99 -4 -46 -56 65 80 -50 -86 73 87 10 -46 -2 125 56 -81 -47 9 81 33 -110 62 93
4953I3j23j1J6P4Q6k47P8J64o4n9j23M7J99j18j10R1M7Op9o6J66L3o7n4o5K28
$$ 93 -30 -41 -25 49 135 -112 -34 130 66 7 -116 -69 130 12 -98 -7 40 46 -33 -99 67 100 33 -21 -86 142
4979A42m6j07L6K2J9m3j74J81P8r0j6o9J21R4j95J1R7L3p6q1RJ75q2l7n1L4J24
$$ 142 96 -11 25 47 66 23 -151 30 108 18 2 -67 54 148 -47 -36 61 94 18 -63 -54 121 39 2 -49 -15 109
5006A09p2j10J23Pj01M3m9J29k4j29L5K0O3j2j81J30J33p4r9k6J21J12j59n2J21
$$ 109 37 -73 50 57 -44 -1 -50 79 55 -74 -39 -19 44 32 -149 -19 114 40 -59 -85 36 148 -11 -63 58
5031E8p%j13k0J98q5j28K7R6R3j50r4J72K3m7o6l2K05o1j62K7P9P6n8j71J56P6
$$ 58 51 51 -62 -82 116 31 -97 -70 26 119 -31 -125 47 70 23 -43 -75 130 69 -93 -66 13 89 31 -140 16 92
$$ [...]
8191c
##END NTUPLES=NMR FID
##END=
