##TITLE=1H_2SR59H
 d2O, 8 sc, 
 31.05.2021
##JCAMPDX= 6.0         $$ Bruker NMR JCAMP-DX V2.0
##DATA TYPE= NMR FID
##DATA CLASS= NTUPLES
##ORIGIN= UXNMR, Bruker Analytische Messtechnik GmbH
##OWNER= root
$$ XWIN-NMR		Version 3.5
$$ Mon May 31 12:23:51 2021 Russian Standard Time (UT+4h)  she@DPX200
##.OBSERVE FREQUENCY= 200.131506
##.OBSERVE NUCLEUS= ^1H
##.DELAY= (6, 6)
##.ACQUISITION MODE= SIMULTANEOUS
##.ACQUISITION SCHEME= undefined
##.AVERAGES= 8
##.DIGITISER RES= 18
##SPECTROMETER/DATA SYSTEM= spect
##.PULSE SEQUENCE= zg30
##.SOLVENT NAME= CD3CN
##.SHIFT REFERENCE= (INTERNAL, CD3CN, 0, 15.7039)
##AUDIT TRAIL= $$ (NUMBER, WHEN, WHO, WHERE, WHAT)
$$ ##TITLE= Audit trail, XWIN-NMR		Version 3.5
$$ ##JCAMPDX= 5.01
$$ ##ORIGIN= Bruker BioSpin GmbH
$$ ##OWNER= she
$$ F:/spectra/data/she/nmr/H-F/1/audita.txt
$$ ##AUDIT TRAIL=  $$ (NUMBER, WHEN, WHO, WHERE, WHAT)
(   1,<2021-05-31 12:22:56.45 +0400>,<she>,<DPX200>,
      <created by zg, POWCHK disabled, PULCHK disabled
       configuration hash MD5:
       00 E9 B6 7A A2 85 ED C7 34 08 36 98 17 FE 4E 26
       data hash MD5: 16K
       E9 8C 24 9F 8D 2C 16 AA 4A 92 DA 56 C3 0C 69 72>)
$$ ##END=
$$ 
$$ hash MD5
$$ 64 62 A6 D2 83 06 E3 17 8B 10 42 6A 93 D3 7C 6E
##$RELAX= 
##$RELAX= 
##$RELAX= 
##$RELAX= 
##$RELAX= 
##$RELAX= 
$$ Bruker specific parameters
$$ --------------------------
##$DU= <F:/spectra>
##$EXPNO= 1
##$NAME= <H-F>
##$PROCNO= 1
##$TYPE= <nmr>
##$USER= <she>
##$AMP= (0..31)
100 100 100 100 100 100 100 100 100 100 100 100 100 100 100 100 100 100 
100 100 100 100 100 100 100 100 100 100 100 100 100 100 
##$AQSEQ= 0
##$AQ_mod= 1
##$AUNM= <au_zg>
##$AUTOPOS= <>
##$BF1= 200.13
##$BF2= 200.13
##$BF3= 200.13
##$BF4= 200.13
##$BF5= 200.13
##$BF6= 200.13
##$BF7= 200.13
##$BF8= 200.13
##$BYTORDA= 1
##$CFDGTYP= 0
##$CFRGTYP= 5
##$CHEMSTR= <none>
##$CNST= (0..31)
1 1 145 1 1 1 1 1 1 1 1 1 1 1 1 1 1 1 1 1 1 1 1 1 1 1 1 1 1 1 1 1 
##$CPDPRG= <>
##$CPDPRG1= <>
##$CPDPRG2= <>
##$CPDPRG3= <>
##$CPDPRG4= <mlev>
##$CPDPRG5= <mlev>
##$CPDPRG6= <mlev>
##$CPDPRG7= <mlev>
##$CPDPRG8= <mlev>
##$CPDPRGB= <>
##$CPDPRGT= <>
##$D= (0..31)
0 1.2 0 0 0 0 0 0 0 0.06 0 0.03 0 0 0 0 0.0002 0 0 0 0 0 0 0 0 0 0 0 0 
0 0 0 
##$DATE= 1622449375
##$DBL= (0..7)
120 120 120 120 120 120 120 120 
##$DBP= (0..7)
150 150 150 150 150 150 150 150 
##$DBP07= 0
##$DBPNAM0= <>
##$DBPNAM1= <>
##$DBPNAM2= <>
##$DBPNAM3= <>
##$DBPNAM4= <>
##$DBPNAM5= <>
##$DBPNAM6= <>
##$DBPNAM7= <>
##$DBPOAL= (0..7)
0.5 0.5 0.5 0.5 0.5 0.5 0.5 0.5 
##$DBPOFFS= (0..7)
0 0 0 0 0 0 0 0 
##$DE= 6
##$DECBNUC= <off>
##$DECIM= 32
##$DECNUC= <off>
##$DECSTAT= 4
##$DIGMOD= 1
##$DIGTYP= 9
##$DL= (0..7)
0 120 120 120 120 120 120 120 
##$DP= (0..7)
150 150 150 150 150 150 150 150 
##$DP07= 0
##$DPNAME0= <>
##$DPNAME1= <>
##$DPNAME2= <>
##$DPNAME3= <>
##$DPNAME4= <>
##$DPNAME5= <>
##$DPNAME6= <>
##$DPNAME7= <>
##$DPOAL= (0..7)
0.5 0.5 0.5 0.5 0.5 0.5 0.5 0.5 
##$DPOFFS= (0..7)
0 0 0 0 0 0 0 0 
##$DQDMODE= 0
##$DR= 18
##$DS= 0
##$DSLIST= <SSSSSSSSSSSSSSS>
$$ [...]
##$SUBNAM2= <"">
##$SUBNAM3= <"">
##$SUBNAM4= <"">
##$SUBNAM5= <"">
##$SUBNAM6= <"">
##$SUBNAM7= <"">
##$SUBNAM8= <"">
##$SUBNAM9= <"">
##$SW= 16.9725357007746
##$SWIBOX= (0..15)
0 0 2 0 0 0 0 0 0 0 0 0 0 0 0 0 
##$SW_h= 3396.73913043478
##$TD= 16384
##$TD0= 1
##$TE= 0
##$TE2= 300
##$TE3= 300
##$TEG= 300
##$TL= (0..7)
0 120 120 120 120 120 120 120 
##$TP= (0..7)
150 150 150 150 150 150 150 150 
##$TP07= 0
##$TPNAME0= <>
##$TPNAME1= <>
##$TPNAME2= <>
##$TPNAME3= <>
##$TPNAME4= <>
##$TPNAME5= <>
##$TPNAME6= <>
##$TPNAME7= <>
##$TPOAL= (0..7)
0.5 0.5 0.5 0.5 0.5 0.5 0.5 0.5 
##$TPOFFS= (0..7)
0 0 0 0 0 0 0 0 
##$TUNHIN= 0
##$TUNHOUT= 0
##$TUNXOUT= 0
##$USERA1= <user>
##$USERA2= <user>
##$USERA3= <user>
##$USERA4= <user>
##$USERA5= <user>
##$V9= 5
##$VALIST= <valist>
##$VCLIST= <CCCCCCCCCCCCCCC>
##$VD= 0
##$VDLIST= <DDDDDDDDDDDDDDD>
##$VPLIST= <PPPPPPPPPPPPPPP>
##$VTLIST= <TTTTTTTTTTTTTTT>
##$WBST= 1024
##$WBSW= 4
##$XGAIN= (0..3)
0 0 0 0 
##$XL= 0
##$YL= 0
##$YMAX_a= 239466
##$YMIN_a= -193468
##$ZGOPTNS= <>
##$ZL1= 120
##$ZL2= 120
##$ZL3= 120
##$ZL4= 120
##$ABSF1= 10
##$ABSF2= 0
##$ABSG= 5
##$ABSL= 3
##$ALPHA= 0
##$AQORDER= 0
##$ASSFAC= 0
##$ASSFACI= 0
##$ASSFACX= 0
##$ASSWID= 0
##$AUNMP= <proc_1d>
##$AZFE= 0.1
##$AZFW= 0.1
##$BCFW= 1
##$BC_mod= 2
##$BYTORDP= 1
##$COROFFS= 0
##$CY= 11.3945322036743
##$DATMOD= 1
##$DC= 2
##$DFILT= <>
##$DTYPP= 0
##$F1P= 15.9154993809931
##$F2P= -4.1035820241983
##$FCOR= 0.5
##$FTSIZE= 0
##$FT_mod= 4
##$GAMMA= 1
##$GB= 0.15
##$INTBC= 1
##$INTSCL= 1
##$ISEN= 128
##$LB= 0.24
##$LEV0= 0
##$LPBIN= 0
##$MAXI= 10000
##$MC2= 0
##$MEAN= 0
##$ME_mod= 0
##$MI= 1.114404
##$NCOEF= 0
##$NC_proc= 0
##$NLEV= 6
##$NOISF1= 3.799351
##$NOISF2= 2.8
##$NSP= 1
##$NTH_PI= 0
##$NZP= 0
##$OFFSET= 15.70392
##$PC= 1
##$PHC0= -11124.74
##$PHC1= 13.00099
##$PH_mod= 1
##$PKNL= yes
##$PPARMOD= 0
##$PSCAL= 0
##$PSIGN= 0
##$REVERSE= no
##$SF= 200.130013532006
##$SI= 16384
##$SIGF1= 3
##$SIGF2= 2
##$SINO= 400
##$SIOLD= 16384
##$SREGLST= <1H.CDCl3>
##$SSB= 0
##$STSI= 0
##$STSR= 0
##$SW_p= 3612.71676300578
##$SYMM= 0
##$S_DEV= 0
##$TDeff= 0
##$TDoff= 0
##$TI= <>
##$TILT= no
##$TM1= 0
##$TM2= 0
##$TOPLEV= 0
##$USERP1= <user>
##$USERP2= <user>
##$USERP3= <user>
##$USERP4= <user>
##$USERP5= <user>
##$WDW= 1
##$XDIM= 8192
##$YMAX_p= 0
##$YMIN_p= 0
$$ End of Bruker specific parameters
$$ ---------------------------------
##NTUPLES= NMR FID
##VAR_NAME=  TIME,          FID/REAL,        FID/IMAG
##SYMBOL=    X,             R,               I
##VAR_TYPE=  INDEPENDENT,   DEPENDENT,       DEPENDENT
##VAR_FORM=  AFFN,          ASDF,            ASDF
##VAR_DIM=   8192,          8192,            8192
##UNITS=     SECONDS,       ARBITRARY UNITS, ARBITRARY UNITS
##FACTOR=    0.0002944,     1,               1
##FIRST=     0,             0,               0
##LAST=      2.4114304,     0,               0
##MIN=       0,             -193468,         0
##MAX=       2.4114304,     239466,          0
$$ Real data points
##PAGE= N=1
##DATA TABLE= (X++(R..R)), XYDATA
0@%%%%%%%%%%%Qj6J6j6K4l2L2m0M8n6P2q8J04j20J36j57J81k08K40k77L16l56
33a89M03m54N10n74O44p20Q02q91R92j102J220j347J487j642J811j996K196k418
51a268K665k936L239l581L965m401M902n483O169o992P998r265J0914j3147J6357
66I136k1380L0346n0981J79182P9270l06780Q4343j80185P0783K47010n0285k4036
78F6423j49290j00043J87394L6372R9295n5020k03619L1653j0049J64950J71400
89B39466k45464l7339m1699q6892K78951L8022j16272m4562j69882J32691J34055
100H1075k7050P5133j97576j04871J66795K7921J19707k7292j92214L619l8383
111a13136J20682J71601j34405o6698p7543l1234J90288K1872l649o9838j89456
$$ y = [0, 0, 0, 0, 0, 0, 0, 0, 0, 0, 0, 0, 8, -8, 8, -8, 16, -16, 16, -24, 24, -32, 40, -48, 56, -64, 72, -85, 96, -112, 128, -149, 167, -189, 214, -240, 270, -304, 340, -380, 422, -469, 523, -579, 641, -706, 781, -861, 950, -1046, 1150, -1268, 1397, -1539, 1700, -1881, 2084, -2317, 2585, -2898, 3271, -3721, 4277, -4988, 5926, -7221, 9136, -12244, 18102, -32879, 146303, 225573, -81207, 3136, -177049, -106266, 140744, 90459, 66423, -82867, -182910, 4484, 40856, 140151, 85131, -118488, -86835, -96884, 68066, 239466, -5998, -43337, -85036, -171928, 107023, 145045, 28773, -15789, -185671, -52980, 81075, 54025, 129158, -68418, -173289, -6494, 21427, 141134, 113842, -78372, -74753, -113136, 7546, 179147, 44742, -21956, -99499, -130733, 59555, 81427, 77778, 7940, -181516]
122a81516J31335J07830L289Q5080j75098j03605Q6818K3056J46529j0916j58121
133d5319j0388n3908Q3927J46377o2189n2025j03129k3443J60951L0871K2652
144I4377n6475j74558O3247Q6366M8025P5040j37008q5550K2961R087J42582P655
156I5749j14381k8618o0837P9883J24274l1048k6533j10384m8384J30544M7452
167E7717M0407l7196j50538J3074M9123O2968P9189j03260p3563n755O235J28347
179F6748K0034p6449m1461p5265O6951J11815q20n918j04383o6275Q3619M8956
191B7552N7456k2492j22115j0582K4123O5269P7220p1136o5370l0991L239J16588
203D8761L5174m1988m7273q6710L9741R0410K3694R772q9602o7345M7094M3142
$$ y = [-181516, -50181, 57649, 60938, 146018, -29080, -132685, -45867, -22811, 123718, 112802, -45319, -55707, -109615, -25688, 120689, 58500, 6475, -96654, -120097, 40854, 71725, 94377, 37902, -136656, -73409, 12957, 60982, 136022, -986, -86536, -63575, -54488, 88094, 95749, -18632, -47250, -108087, -28204, 96070, 65022, 38489, -71895, -120279, 10265, 57717, 98124, 60928, -89610, -76536, -27413, 35555, 114744, 11484, -62079, -67834, -61599, 66748, 86782, 10333, -31128, -106393, -39442, 72373, 71553, 65635, -38748, -105023, -21404, 27552, 85008, 62516, -59599, -70181, -46058, 19211, 96431, 25295, -40075, -71066, -67827, 48761, 83935, 41947, -5326, -92036, -52295, 38115, 61809, 71581, -18021, -85366, -38272, 4870]
215D870O4894r687r9603k5896Q097O4167P9927l8714n9223n0586r661R1671M8514
228F8770j0165m8124q2487J7428O2503M0095J9791p8592o0826K3744L6504P3193
240F1834O962q2209m0257q254M9732Q1631o693n2127n6088j9195N9848N3961R456
253E8601m5621p0546R65M4558N2810K7431o3194n9695j093L0163P5627K1597n8350
266A3253m7253k5119L4263P1969J1375l7525n5191k8205M2184N6280J9883l4235
278B1679o4337j9366L4937N9232L3426l8293n6938k5938K2536O5405K8211l2270
290B8284m8279l6144K4073O1644K2451k4105n2449l7643K7360N8545L0933j8915
302C5755n4886l7498J9659N5905L6297j6311n0271l7631J2339N2596L4365j5623
$$ y = [4870, 69764, 60077, -39526, -65422, -57325, 6842, 86769, 48055, -11168, -61754, -71415, 20256, 68770, 58605, 10481, -72006, -54578, 7925, 48020, 67811, -10781, -71607, -47863, -11359, 61834, 68796, -13413, -53670, -61924, -12192, 69439, 62746, 10619, -45469, -64664, -4816, 49145, 58601, 12980, -57566, -56601, -12043, 40767, 68198, 5004, -54691, -55784, -25621, 50006, 71603, 13253, -34000, -59119, -24856, 47113, 58488, 20963, -34228, -62433, -20249, 36031, 55914, 21679, -42658, -62024, -27087, 32145, 65571, 27278, -29660, -55598, -33062, 32343, 60554, 28284, -19995, -56139, -32066, 29578, 52029, 27924, -24525, -62168, -34808, 23737, 54670, 35755, -19131, -56629, -36970, 18935, 55232, 38921, -11350, -48981, -36642, 15954, 50319, 34696]
314C4696m8951l8259J1286N2748L9427j3574m7668m0098N934N2772M1102p340
326D2075m2705m3265M164M5927L7837k337m5632m1265M807L9474M5118j587m8285
339e674l6463l990L9980N1227k332l7247l9568j0970M2317M1234L416l2367m7473
352c7910l470L6478L7376J3691m1220m4696k220K6140M9353J4356l9983l4657
364b6762j6693K7081N0758O637k4870m0874k0396L5357L6631J3850k1330n3007
376c3618r754K6866L5828K8580l0690m3276j1285J1888M7901K2567k8161l0411
388a3565k7102J8600M7050J1193j2519m0647k9911K7600L3956K3371q762n0851
400b1587j7401J4529L2422L6001j9999l7029j7548P51M4096K5547j8494k6310
$$ y = [34696, -14255, -52514, -41228, 11520, 50947, 37373, -10295, -50393, -44459, 8313, 49415, 42075, -630, -43895, -39731, 6196, 44033, 41696, -3936, -45201, -40394, -920, 44198, 42611, -5674, -42137, -46127, -6147, 45080, 42748, 5501, -34067, -45037, -2720, 38514, 41930, 9563, -37910, -41380, -4902, 32474, 46165, 4945, -39751, -41971, -15831, 33522, 47878, 7895, -26762, -43455, -16374, 34384, 41021, 16151, -24723, -45119, -9762, 26869, 40719, 19389, -33618, -43372, -16506, 19322, 47902, 17212, -26064, -37349, -25461, 22440, 45007, 16846, -13565, -40667, -22067, 24983, 36176, 23657, -16990, -46901, -19301, 14655, 38026, 29264, -21587, -38988, -24459, 7963, 43964, 23965, -13064, -30612, -29861, 14235, 39782, 21288, -5022]
412e022l3877R590M3183J7259p78l6745l6454J7069K8521L0073J642m3642k0939
425c0120L345K6540L9290j2716l0403k1978q968M0749K7396q979j8888l9767p97
438c5296L8633J9902R859k7264l9127O047K2347L1881Q021l5167k3289o848K3310
451f991M0311o558k2411k5188j8400L5042K9595n32j0229l9374j0150L0010K1669
464A6794J6344k0676l6903j864J4095L3176J5397l0502k3317j3808J4417M1751
476B4904K604j7294k3001k2979K3881K8466Q142n341l6716j0969J6856K0377K5322
489C4252j7736l5777m457L948L1644K4693k6045k1067j6072K081L9450J2816j3334
502A4396k1197k1963J2831K3638J8236k138l6374j2424R729J4745L2690r595l4862
$$ y = [-5022, -38899, -29309, 13874, 31133, 30355, -6390, -42844, -25775, 2746, 32819, 34461, -9181, -30120, -26775, -235, 39055, 26339, -4064, -26042, -35010, 5739, 33135, 24156, 5268, -34499, -35296, 3337, 23239, 33098, 5834, -33293, -27246, -4899, 26982, 35003, -164, -23453, -30301, -6991, 33320, 26762, 4351, -20837, -39237, -4195, 25400, 24868, 14639, -24735, -34885, -4875, 16794, 33138, 12462, -24441, -26305, -12210, 20966, 36363, 5861, -17456, -31264, -16847, 24904, 27508, 10214, -12787, -35766, -11885, 16581, 24723, 19382, -17334, -28303, -11447, 8930, 34252, 16516, -19261, -23718, -19770, 11874, 36567, 10522, -10545, -26617, -24536, 14914, 27730, 14396, -6801, -28764, -15933, 7705, 25941, 23803, -12571, -24995, -15266, -521, 32169, 22574, -12288]
515a2288q265n137K7486L1103j8118j8766j7417m984L3117J8035n275k1028k5037
528b6574J0351J7237J8975Q996l3868j9219O303J0814L1679j20k7735j2794j1335
541b7290K3710L0601q755j4823k2900n925K7968J4143P118j6553l3547Q251J5062
554b940J4252J7242k4556k3107n93Q452L0509L927k0332j3149j6263J8281K9017
567B0740r86q631k7808r525K4714J1231J2952q493l4419O68J1731J5201J8195
580B5570j8146j8343q273K250L2282P636j5625j2350k0799J3555K6138L960q42
593A7013k7663j5375J9696J0421J5989l271k9568m541L741J8015K0506j6128j3534
606d699j1318m142K9744J0941q269j2518k3740R713K1008P827N275k4866j7602
$$ y = [-12288, -20553, -25690, 1796, 32899, 14781, -3985, -21402, -26386, 6731, 24766, 19491, -1537, -26574, -16223, 1014, 19989, 28985, -4883, -24102, -17799, -6985, 24694, 24574, -3161, -15955, -27290, -3580, 27021, 18266, 3443, -19457, -25382, 2586, 16729, 23847, 7294, -26253, -18002, -2940, 11312, 28554, 3998, -19109, -19702, -11250, 19259, 23186, 2854, -10295, -26558, -8277, 20740, 19754, 11123, -16685, -26210, -1496, 9735, 22687, 14194, -20225, -19557, -7826, 7375, 25570, 7424, -10919, -19192, -16942, 15340, 22976, 7351, -4999, -25798, -12243, 13895, 17855, 17013, -10650, -26025, -6329, 4092, 20081, 16810, -12758, -17299, -13558, 4457, 24963, 8835, -4699, -16017, -20159, 9585, 20526, 12257, -261, -24001, -14288, 6720, 14547, 19822, -5044, -22646]
619b2646J2401R668J9549j619k4244o539l837J7199K2849j1000j1336j4495o911
632b0961K4595J1335lr994k5773N455J6281J0327R518k1012j7080M282P996K2154
646A7120P43j9193q650q853J4633K1838m670p172j7665q838K0312J0553N734p386
660H506k4911J175J1417J2417J1737j6495j6325j708N132K1833N105j4109j0827
673g053j1385J1028J9112J696l778j8678r871J4227J1018R951n377k2237k834
686a4181N999J3497J4453j2832j4644o026J714J9896P921q433j1105j3279P604
699i416J6402O005j117j7476j0850Q776J0183J2679k877j8869o122J563J3253
712B134J4517p064j2152j0076q39J7561R465l385j0348j4761L550J4053R162J163
$$ y = [-22646, -10245, -577, 18972, 17353, -6891, -13430, -17267, -68, 22781, 11781, 445, -14050, -20961, 3634, 14969, 14966, 4972, -20801, -15346, 935, 11262, 20780, -232, -17312, -13030, -5034, 17120, 17863, -1330, -9980, -18833, -4200, 17638, 12968, 5796, -11869, -20707, -395, 10158, 15892, 8506, -16405, -15230, -3813, 8604, 20341, 3846, -12479, -14187, -9055, 12778, 17883, 3774, -7053, -18438, -7410, 11702, 13398, 9620, -9058, -18929, -4702, 6316, 16267, 10890, -11347, -14181, -8182, 5315, 19768, 6936, -7708, -13734, -12020, 7876, 15797, 7364, -3741, -17020, -9416, 6986, 12991, 11874, -5602, -16452, -7676, 2507, 15186, 12309, -6560, -12682, -11119, 2134, 16651, 9587, -2565, -12641, -13480, 4081, 13546, 10161, -187, -14948, -11398, 2655, 11817, 12980]
726A2980j4290j2273L010R782J3881l95j4068r284k078J1979J3941k675r592j1916
740a0998k521J3480J1113P22r385j4169o01J0815J1498L296j1555j1889j579Q111
754c662J3948K543j0860j0789m238R375J3526K135q320j2373m381R722J1465M216
768A2307p647j3184l641P276J2173N496p996j2148m451O320J2494N661p164j1896
782f400n877O191J2301O212o252j2221n911N418J1820O829n584j1552o732N020
796f738J1534P055m501j1822p168M583J1072P406l668j1578p133L288J0865Q173
810A1368l734j0537p582J882J1655P663k892r749r200K787J0595P352o19j0681
824a692q984K835Q483R180n55j0873p170K4Q896J0113j955q576q255j276J0264
$$ y = [12980, -1310, -13583, -10573, -791, 13090, 12695, -1373, -10657, -12735, -756, 13185, 10510, 918, -10998, -13519, -39, 11074, 11796, 2411, -11758, -12359, -1544, 9954, 13250, 1695, -10194, -11773, -3662, 10286, 12829, 1969, -8820, -13058, -3683, 9843, 11978, 3658, -8715, -13096, -3374, 8091, 12307, 4660, -8524, -12165, -4889, 7284, 12780, 4784, -7364, -11815, -5495, 6999, 12660, 5496, -6400, -12277, -6086, 6215, 12427, 6175, -6046, -11957, -6539, 5281, 12110, 6526, -5026, -11758, -6738, 4796, 11851, 7350, -4472, -11640, -7057, 4015, 11421, 7753, -3825, -10958, -7670, 3195, 11368, 7634, -2903, -10485, -8603, 3052, 10715, 7823, -1926, -11126, -8339, 2256, 9608, 8989, -1692, -10676, -7841, 642, 9822, 9267, -1606, -8776, -8752, 144, 10257, 8302, -274, -8529, -9805, 459]
839D59Q516l77p327j0848M53Q734Q106K426r196r991P16N847J0748J853r716o918
855f515l562P434J1033j25n689q997m318R336P870K553m851j2052j148O459P582
870E010N722q026r529j363L353J1228L511p643o308o108N450J1109J209k519r394
885d298o431Q008O657M922k617j2163k397L705P542P972o894p946l741Q78J1330
900D527M487n141n159q464M049J0008K435M0r415o916N489N033P386n76j1653
915c870l098O74O821R633n333o538n048j585J1187N114k761m704r341K465Q372
930A988L494K849q948p531L231L546Q680N99r627l724k234O413J0116l208m793
945H51o504l171R935M855L52l842j0300J428O266M074M942q125p260J357J728
$$ y = [459, 8975, 8598, 1271, -9577, -9124, -390, 7716, 10142, 946, -9045, -8329, -2482, 8266, 10119, 403, -6515, -10077, -2643, 8390, 8265, 2576, -6421, -10739, -1403, 6467, 9020, 4169, -7883, -9031, -2572, 5010, 10732, 2706, -6823, -8186, -4833, 6395, 9906, 2263, -4045, -10153, -4703, 6406, 7615, 5096, -4298, -10729, -2721, 3936, 8858, 6241, -5922, -8319, -4614, 2928, 10900, 4006, -3940, -7681, -6803, 4527, 9014, 3873, -1286, -9750, -5701, 4307, 6742, 6782, -2633, -9549, -4060, 973, 8359, 7783, -3870, -6968, -6294, 527, 10160, 4827, -1711, -6759, -8344, 2843, 7957, 5196, 492, -8849, -6384, 1988, 5482, 8331, -617, -8148, -4917, -1371, 7309, 7908, -1719, -5443, -7677, -1264, 8852, 5644, 851, -5653, -8824, 1111, 5966, 6318, 2476, -7824, -6396, -130, 3944, 8886, 761, -6499, -5142, -3414]
960c414R661J806q031l424n176N799R838j408k746p464m266Q581M059K858k533
975D140j0708M13L785N062O333p122o364r99K85J0048K774n633l859o570M652
990c763Q761N52m78q437n002O331M098M884k152r423q88J477N497O913n519n286
1006b435k800j034R575L211l067l609p635L371P193K278J023p975n463M017L526
1021A76O344q76q585j746o46N599O934l485l959n044j226Q085L624k07l944q033
1037f989J861N951L680J953o915n400J438L087P178N3o680l226j848N086O629
1052E858j452l104n649k373O615M092J416k982p780j70M488M549L195n870n626
1067d793M2K483O530J711m769m417k801L769O791L59k388n674l137M367N012K381
$$ y = [-3414, 6247, 8053, 22, -3402, -8578, -2779, 7059, 5651, 2905, -4559, -8825, -244, 3815, 6673, 4140, -6568, -6155, -2370, 2692, 9025, 1903, -4461, -5460, -5175, 4873, 7647, 2014, -1845, -8415, -3763, 4998, 5550, 5072, -3365, -8367, -2036, 2062, 6946, 4794, -4629, -5517, -4040, 1457, 8370, 2851, -2435, -5235, -6269, 3306, 6517, 3450, -159, -7794, -4423, 2770, 5048, 6071, -1904, -7367, -3350, 176, 6520, 5644, -2941, -4687, -5333, 266, 7200, 3715, -244, -5288, -6514, 1571, 5195, 4988, 1044, -6989, -5128, 823, 4503, 6456, -459, -5859, -4421, -1334, 5844, 5897, -783, -4009, -5857, -771, 5858, 4406, 1302, -4347, -6720, -105, 3987, 5403, 2421, -5359, -5529, -1041, 3508, 6703, 833, -4793, -4751, -2268, 4262, 5973, 1204, -3213, -6014, -2245, 4546, 4905, 2517, -3157, -6294, -1927, 3085, 5466]
1083E466k200p005j657K972M784M068l867n816j592J489O150K912l574l887l971
1098e728K265O763J536j434n065m009K804M372L931j540o185k787J602M593M775
1113E893k533n076k781J88N711L799k088l637m390P72N570K617j36m308m561J272
1129c688M090M166k08n047l525r3M339N021j034m199l679j063N471L930q53k862
1145G66m981m39M815L415R33l804n203K91L380M490J050m119l920j234L485M786
1161C711M70l037m256k079M594L766J025k137n595q89L365L551K397l130n120
1176c364j143K802M055K447l111m198j752K055M537K058k358m156k467K681L986
1191B072K088j516m956j759J749L893K907k154m348j917J320M049K938j983l511
$$ y = [5466, 3266, -3739, -5396, -2424, 2360, 6428, 2561, -3255, -4847, -3358, 2792, 5704, 2130, -1757, -5728, -3463, 3300, 4836, 3402, -1663, -5672, -2868, 1504, 5435, 3895, -2290, -5077, -3475, 1118, 5893, 3360, -1716, -4497, -4309, 1402, 5201, 3113, -524, -4914, -4142, 1428, 4045, 3909, -399, -4960, -3688, 402, 4568, 4360, -687, -4212, -4305, 34, 5055, 4021, -178, -3857, -4920, 551, 4481, 3628, 766, -4215, -4654, 161, 3576, 4509, 705, -4498, -4207, -827, 3663, 4713, 594, -3326, -4560, -1075, 3711, 4181, 1144, -3112, -5191, -597, 3169, 4194, 2057, -3538, -4427, -1062, 2489, 4886, 1756, -3364, -4507, -1705, 2350, 4797, 1686, -2512, -4264, -2209, 2328, 4386, 2028, -2128, -4595, -1914, 2072, 4160, 2644, -2312, -4071, -2322, 1571, 4478, 2324, -2024, -3941, -2621, 1428, 4366, 2383, -1128]
1206a128k904J240M602K063r97m051l252J715L729K878p33m281k772Q68L841L146
1222C964j081l789k765L11L986L191o84l451l413J07M272K646L02l535l560J32
1238c367L282L320J18l130l409O4K681L619K72k962l438o02K917L572L66k750
1254E53l481n21K924L344N69k640l638n96K661L566P82k581l524r59K491L456
1270B406J360k573l385j280J969L909J088j993l618j510K163L381J749j910l521
1285a765j623J626L463J863j800l081k360J626L689J827j513l450j661J080L322
1300A243K019j543k679k206Q27L660J852j160k878k258R07K926K340o34l231k334
1316c149R51K762K370k41l319k331K66L172K553p63k603k616L68L091K392l70
$$ y = [-1128, -4032, -2792, 1810, 3873, 2876, -1175, -4427, -2712, 1017, 3895, 3162, -1119, -3891, -3023, 818, 3964, 2883, -906, -3671, -3360, 626, 3817, 3133, -318, -3731, -3624, 648, 3294, 3596, 61, -3499, -3367, -85, 3235, 3353, 223, -3186, -3122, -441, 3178, 3450, 488, -2950, -3552, -635, 2937, 3303, 553, -2928, -3449, -525, 2819, 3388, 748, -2890, -3486, -825, 2741, 3523, 942, -2582, -3541, -1050, 2406, 3766, 1193, -2192, -3472, -1503, 2406, 3494, 1501, -2117, -3627, -1464, 1917, 3666, 1756, -1765, -3388, -1762, 1701, 3564, 1764, -1317, -3677, -2051, 1638, 3465, 1952, -1498, -3159, -2079, 1243, 3262, 1719, -960, -3166, -2339, 1321, 3173, 2013, -865, -3123, -2216, 710, 3050, 2416, -815, -3149, -2198, 564, 2934, 2693, -626, -2957, -2691, 481, 3034, 2271, -332, -2948, -2580, 511, 2903, 2533]
1332B533k624k349r1K520K592j29k472k904J29K726K760n5k371k837l22K561K610
1349B277L71k098k814p06K674K301N44j930k839o52K315K661O48j827l143l61
1365b579J619K917J070k080k686j096J959K896P99j525l100r94J835K463J144
1380B642j274l069j158J662K392J662j423k799j428J121K997J670j577k251k011
1395b844J128L018J277q65k755j982J610K270J307j79k733j759P88K275K243j126
1411A673k205j668P1K960K031j295j830k162M17K818J502k19k495j887L65J971
1427D7K055q7k537j396l7J830K560n96j991j903m03K571K094k45j635k382j49
1444b204K290J846M10j841k506J87J272K297N51k263j618o70J442K825K1j439
$$ y = [2533, -91, -2440, -2531, -11, 2581, 2452, -20, -2924, -2795, -69, 2691, 2636, 265, -2572, -2894, -333, 2277, 2648, 550, -2264, -2970, -296, 2005, 2549, 619, -2220, -2872, -557, 2104, 2752, 925, -2218, -2579, -960, 1957, 3027, 947, -1739, -2835, -876, 2020, 2819, 1294, -1806, -2800, -965, 1498, 2642, 1368, -1701, -2859, -1197, 1195, 2857, 1434, -1365, -2793, -1672, 1325, 2995, 1418, -833, -2844, -1716, 1302, 2579, 1714, -1041, -3023, -1413, 857, 2164, 1985, -748, -2507, -1719, 556, 2799, 1673, -532, -2200, -2129, 831, 2862, 1567, -263, -2425, -2008, 810, 2312, 2093, -402, -2289, -1924, 47, 2102, 2015, -522, -1918, -1955, -125, 2435, 1839, -152, -2055, -2458, 113, 2207, 1962, 327, -2055, -2204, 86, 1932, 2342, 501, -2005, -1818, -546, 1751, 2302, 39, -1579, -2249, -807, 2018, 2039, 600]
1460F00j979j316J926K421M73j244k638m28J694J897J035j689k320l70J015K303
1476A380J204j878j603j551J128K618N50p26j896j805J702K073J104n69k983p47
1492a999J019J661J889j532k194n68K88K328R13o49j627j518M89K274R65J8k067
1509c10j881Q95J760J477j62k518j038K64J637K192j056j676j551R8K294J396
1525A821m41j239k137M23J910J274J55j795j839K12J313K119M3k181j054m29J225
1542f20K745l03j610j582m55J772J495N1q64k286j05J321J260J033j368j906k07
1559a629P63K234O51j637j454o38R03K310R3q27j847p26J188J484R00j110j755
1576a097n78O56J838J222j340j464r58N73K292O63p78j751j257J017J653R15m31
$$ y = [600, -1379, -2695, -769, 1652, 2125, 881, -1757, -2185, -491, 1406, 2441, 752, -1568, -1938, -923, 1380, 2584, 706, -897, -2448, -1320, 1298, 1848, 1122, -774, -2579, -877, 1196, 2300, 1731, -1252, -1999, -980, 681, 2570, 1038, -1156, -1724, -1436, 892, 1805, 1156, -471, -1989, -1500, 774, 1739, 1757, -310, -2191, -1296, 464, 1941, 1779, -739, -1777, -1513, 124, 2316, 1260, -416, -1967, -1869, 425, 1821, 1380, 141, -1996, -1573, 337, 1611, 1766, -29, -1868, -1656, -343, 1776, 1819, -362, -1416, -1845, -620, 2125, 1822, 212, -1370, -1825, -53, 1442, 1493, 629, -1657, -1762, -441, 819, 1852, 484, -1422, -1629, -866, 1368, 2019, 382, -1072, -1710, -807, 1503, 1596, 769, -1078, -1804, -616, 868, 1768, 658, -1097, -1675, -1019, 819, 2041, 701, -763, -1721, -1148, 1144, 1807, 1029, -722, -1979, -962, 691, 1606, 1175]
1593A175j780j310R42J593J038n82j841q80N09J354J460m70j541j226L21J662
1609D24J225n16j292j601N09J692O50J60j313j490L32J182J306k9j397j161n9
1626a378J456J271l4j096j442l44J550J318Oj025j649k79J468J394J62j113j473
1643a208j51J016J390L29j084j463o6Q15J534l7p65j243o46J317J166L18o34j656
1661a068m34J106J245M76r60j026j015J164J237N67q64j104j055J056J452N60
1677A337n38j462p53N13J716M70k32j905m15N46J178R75o93j259p49N52J235O05
1695A121l31j031r07K38R91J263m95j381q55K37J590P96k74j330p98o9J416R13
1713A094j72r94j036O3J361Q75k91r28r43Q5Q09J008L63j055j360MJ268Q51L2
$$ y = [1175, -605, -1915, -973, 620, 1658, 1076, -765, -1645, -1136, 218, 1678, 1208, -333, -1559, -1238, 424, 1649, 1133, -159, -1760, -1251, 441, 1091, 1251, -62, -1552, -1220, -38, 1268, 1239, -158, -1319, -1378, 78, 1349, 1315, 219, -1223, -1567, -17, 1301, 1307, 282, -1367, -1646, -178, 1216, 1378, 265, -1208, -1359, -343, 1047, 1376, 292, -1171, -1237, -422, 1112, 1075, 310, -933, -1579, -262, 904, 1222, 588, -1068, -1502, -396, 849, 1325, 365, -661, -1676, -512, 725, 1292, 428, -676, -1731, -675, 777, 1337, 799, -663, -1416, -903, 813, 1283, 1051, -854, -1269, -723, 455, 1430, 737, -522, -1271, -719, 516, 1121, 790, -241, -1148, -910, 81, 1344, 849, -532, -1387, -1150, 440, 1236, 962, -368, -1166, -1235, 181, 1094, 922, -72, -1108, -1045, 316, 1191, 900, -28, -971, -886, -77, 931, 1294, 239, -1121, -1117, 151, 1002, 1034]
1732A034q82j083k36J176J027L05j095j297j43J053J178q1p17j064k27J007R00
1749H55K66p67j438Q9N07R95P50q08j038n88O44J267M84q60j167k75O25J292K10
1768A043o01j111k51K16J221P39q18r75o94N29J152L77k68r61o67N86R29P33n56
1787F23q41r29N69J074O98l85j279n22Q0J316N22l55q45o38P2J148O28l0j207
1806c01o02K07O97J051k54j074n34JP75Q37R9r43o77k99J104P78n7n81r94J13
1826f54M91R49Lq51p77k93J036J159k47o01p03o52Q03R49L76q29q52l99O97J247
1846H52R9q21q47o8L85J063K72o15r91j34M59R94L08n54q02o48P23Q99N47o29
1866D92r60m95N09J008L42l44j100k90M04R90N86o30p27o71L85O12P61l06r56
$$ y = [1034, 152, -931, -1167, 9, 1036, 1341, 246, -1051, -1194, -141, 1037, 956, 239, -825, -1052, -45, 855, 1121, 354, -1084, -995, -488, 507, 1257, 449, -589, -1177, -533, 734, 1218, 358, -809, -1084, -459, 833, 1043, 442, -669, -920, -704, 517, 1256, 438, -537, -1231, -702, 450, 827, 559, -402, -1069, -483, 446, 1179, 623, -218, -1147, -578, 496, 1194, 809, -470, -992, -912, 404, 926, 571, -274, -912, -840, 308, 936, 906, -301, -903, -696, 1, 1052, 798, -276, -810, -809, -34, 803, 902, -41, -718, -1017, 87, 865, 808, 227, -767, -654, -163, 786, 789, -62, -839, -1132, -96, 1063, 816, 215, -488, -1140, -337, 612, 988, 159, -693, -1092, -395, 852, 951, 130, -717, -785, -400, 663, 935, 320, -671, -805, -346, 648, 956, 402, -400, -1048, -325, 574, 1121, 492, -468, -963, -454, 554, 896, 552, -548, -838, -434, 556, 1142, 512, -215, -886, -501, 111, 872, 566, -390]
1885c90o12M78N48J070k04r45o68J90Q34N27j46j013m85J02J083L48J80j094m72
1904f69j6N33Q48P1o76r28K19O79Q55n4q38m85l01Q23N23j4n55p70k0Q65N41K12
1926H43p88l88j19J50R93J76p97o09k33M65J011J65q01p77j77P59N47K71m82q69
1946f60K00L07O89K52k73j091o1K54P90M59n85p02j78K82N53P65m73r27o10O68
1966c41P84l9K01r77j97J86P75L82m88m33o60K39P96N48l12n76o42L12O36L01
1986D95J30q11p24L73P49O10l74m72p90K29O13P77l83k55j044N03M44N94j04p70
2006b10n03K42P18O43k04n51p70j13P24O37o7n25o51m3M41P14l1l58n08q1N04
2027HK51K21k24p77l95Q03M38L55n61o16j18K95P07K56m81m68m07M69P69Q9j86
$$ y = [-390, -1002, -524, 24, 1094, 890, -55, -723, -533, 301, 828, 682, -331, -816, -714, 369, 717, 897, -197, -669, -685, -152, 696, 767, 91, -837, -618, 61, 916, 862, 24, -461, -762, 61, 584, 570, 15, -755, -775, 90, 631, 843, 55, -333, -452, -302, 691, 867, 70, -539, -772, -307, 704, 869, 68, -709, -886, -127, 420, 691, 209, -660, -460, -153, 536, 788, 515, -576, -637, -383, 407, 866, 281, -421, -599, -317, 236, 1001, 528, -399, -1009, -341, 443, 404, 605, -372, -569, -383, 392, 774, 286, -147, -807, -568, 228, 776, 464, -112, -754, -442, 194, 495, 625, -186, -910, -537, 212, 822, 448, -24, -814, -585, 28, 805, 422, 167, -877, -374, 70, 664, 560, -210, -713, -471, 247, 890, 686, 135, -635, -748, -24, 613, 546, 21, -630, -673, -232, 482, 451, 93, -415, -496, 8, 259, 480, 256, -521, -916, -113, 325, 680, 119, -497, -615, -320, 387, 643, 162, -306, -713, -244, 525, 614, 428]
2048D28j039m6Q7O65M28J0q18m81K74O13O21l40o56j73J46O81P8j09q67j67L51
2069c14N79N00m07n57l81K32O32L6K43o81k83L4O48M63l23m46n39p8R38K47J9
2090E62n06n99N9M56L85J60p77l90J57N47N27j36m38m50j85P32K62J88o53k62
2110c61l8L13N88j44k48o99J84J83P55o2j54r91J79K71P01L8m03n72j24N52L26
2131B94L42m26n86l7K90K34L33m4p06k52J11O58K98k81l95n2j25M20O94n99l98
2152b27l05J54Q97j38j50m21k84K57N30M12l70n92n34N74K10N24j5p96k99K11
2172c62M64J99j7k44m74Q7O84K81l3o15l50j30R17m6N3k91o07o4N39N00j34k51
2194A06l98J14N5N09O5o47k83j26M08M55M1j28o00K22N2P97k17l12n43j42N32
$$ y = [428, -611, -657, -570, 95, 523, 533, -285, -766, -492, 121, 742, 402, -254, -427, -281, 400, 478, 369, -498, -665, -314, 265, 765, 358, -199, -580, -348, 284, 320, 563, -118, -401, -367, 281, 744, 421, -25, -564, -642, 296, 543, 562, 56, -543, -484, -28, 357, 517, -260, -650, -493, 54, 581, 445, 7, -443, -628, 104, 366, 554, -99, -361, -399, -86, 502, 358, 110, -589, -405, -222, 533, 471, 317, -674, -495, -224, 477, 515, 112, -460, -584, -32, 294, 636, 210, -376, -413, -123, 111, 444, 400, -306, -558, -447, 211, 509, 228, -167, -219, -344, 76, 770, 171, -227, -532, -378, 519, 381, 231, -190, -474, -217, 313, 725, 355, -237, -771, -197, 13, 537, 522, -274, -573, -362, 102, 301, 284, 40, -434, -347, 337, 618, 585, -30, -380, -510, 407, 361, 414, 123, -484, -548, -9, 491, 357, 106, -292, -178, -123, 386, 451, -196, -479, -605, -197, 258, 299, 171, -429, -207, -155, 642, 425, 113, -430, -572, -40]
2215d0L36J04j86o66L30P7K44K84m15j1m46K15O04r4l42l85n8J94N85P9m38j12
2237a41m04K72M19L50m02m17l7M4L74L25m8n58l03J25M94N74l51k29j84n93J338
2258F48o16J29p00o64P29M46Q67o50l74k95K16L17M54j69n98j69k34R07K50q1
2278D13n11k51k7M27J36K14n42j29j0K28N80j39m15m19p0M80K43L03m68l88q8
2299d33L16M94j2k88m13l7J14M76K04m90k87j46L77N80k37m9n11k40L67O24J19
2320E28l19n33n9n5M44L26j29m83j10J3L01P21l97m21l34J57O01K04l46k97j91
2341c79l8M44M39k67p0p07L63K25M94j90k37k12j40P03q1K51o60m11J86K94L44
2362C51j82m53o2j8M08L78N6m96l92KM21K99J22n07m37J23N2Q07L2n68k11q5K67
$$ y = [-40, 296, 400, 214, -452, -122, -45, 199, 483, 68, 57, -389, -174, 430, 336, -6, -391, -449, -255, 330, 409, -29, -141, -545, -273, 146, 496, 94, -323, -360, -316, 58, 383, 335, -223, -526, -401, 93, 667, 316, 87, -97, -690, 648, 32, 161, -539, -1203, -474, -28, 839, 189, -185, -480, -264, 53, 507, 338, -260, -429, -663, 244, 494, 413, -98, -349, -376, 51, 187, 401, -141, -270, -280, -52, 528, 389, -26, -445, -515, -35, 208, 511, 43, -345, -433, -117, 377, 365, 77, -336, -373, -259, 217, 421, -69, -356, -502, -125, 455, 218, 169, -342, -582, -215, 409, 528, 209, -324, -383, -438, 6, 332, 203, -280, -390, -377, -76, 645, 248, -173, -507, -350, 251, 455, 109, -188, -379, -417, 27, 466, 199, 129, -578, -215, 10, 504, 314, 77, -135, -275, 428, 347, 598, -62, -473, -287, 7, 351, 169, -284, -346, -364, 44, 422, 478, -18, -410, -408, 13, 312, 434, -73, -510, -387, -335, 472, 504, -64, -275, -360, -93]
2385i3L19K10n03p1k09L41K89K64n88k54O6L48q6K91k25l37Q1N6L48K99n47l44
2407c45j40M56L10n7l16k43l9K10L64K33l13l72J95l78M41L46n0m56j55K4M74
2428A89K99j95m26k43K19K38K03o3m28j49K89K67L16k71j82k50j15O05J39m59
2448a7N6k28j58J60O00j65k42m84J80L98K65j03l93j51j1L45L58l09n7k42j55
2469c53M25K52k04r9l12R2M28j02L02l35m78J37J36O59j35l69l57J82j6M84p2
2490B65j53m19l0M03J5K65qn67k5K19J38M2j2m61n5K22L88L67n26j67m16K68M40
2513A93J17l59K1m52L85K98j06R5k40j24K44R9J67k19m52R2j48M94N2p8k0m98
2535d39K87K38O2J36k49o1l0J26K37R1n37k90K23K64J56J78o99L20k40R8N83l74
$$ y = [-93, 226, 436, -67, -138, -347, -6, 283, 547, -41, -295, -229, 119, 33, 324, 99, -238, -157, -101, 247, 546, -1, -345, -485, -29, 281, 224, -92, -335, -374, -164, 200, 433, 120, -252, -57, -435, 6, 352, 302, -154, -309, -285, 189, 488, 293, -133, -376, -157, 81, 284, 221, -207, -356, -67, 200, 516, 245, 63, -187, -302, 303, 442, -17, 39, -189, -347, -187, 413, 248, 6, -478, -298, 100, 365, 262, -131, -282, -293, 52, 410, 101, 44, -198, -353, 72, 324, 120, 21, -291, -199, 229, 127, 429, 94, -384, -247, -111, 548, 413, 44, -313, -131, -147, 337, 265, 112, -307, -337, 66, 81, 346, 338, -229, -254, -35, 103, 145, 133, -328, -383, -161, 227, 594, 68, -99, -515, -247, 193, 310, -49, -28, -480, -95, 203, 97, 192, -48, -172, 72, 171, 338, 119, -333, -241, -389, 105, 157, 79, 59, -439, -152, 86, 148, 284, 35, -26, -56, 70, 307, 398, -139, -429, -206, 58, 214, 392, -307, 13, -227, -129, 454, 80]
2557H0J29m07K56K85R1k53O5m90j38N47o2J69O7p92J61J02M98kk69m13J6M32O7
2580A39J1n1l63J4o4J18M96J33p10qM57j81L12k40k44K31J4j46L7l8K52k04m41
2603d76M59O21p45l7j96J208r52n5L71m00ML73k6o53Q51l56k6P24j75J26m87J11
2625B64r64L72P58J55L06J51k72p97J0R57k47n49m86J231q25P93K77r20l32k67
2645c85k89J010k91j86k78P96j50j39J76R9l33RK36J10l73k02L48l12M83l63N55
2666E21p7m24j52J48r0L42l53J15n78L53J87kL79r38N06j45M58K36l23k7q24Q60
2688A72J6L56K69l72j99o90L76K95j3j45J59m37O45p4j21l31J50j17J27R44o95
2709C15q39j42Q33K3k27Q60j495Q66l80j65Q75j022M65R4k75K75K62l21M0m13
$$ y = [80, 209, -198, 58, 343, 434, 181, 246, -244, -382, 165, 103, 272, 339, -453, -292, -190, 308, 306, 37, -376, -360, 72, 139, 150, 99, -264, -250, -314, -196, 300, 433, -277, -285, 172, -9, 303, 63, -181, 50, 64, -82, -45, -83, 169, -35, -476, -17, 604, -141, -178, -374, 834, -118, -173, 198, -202, -198, 175, 149, -504, 347, -9, -35, 689, 514, 640, 153, 264, -700, -328, 430, 585, 891, 1042, 770, -27, -17, 940, 693, 144, -342, 889, 64, 857, 1134, 214, -118, -385, -674, 336, 45, -141, -419, 377, 227, 88, 264, 363, 30, 39, 275, 385, 12, -190, 158, -154, 329, -34, 521, 444, 20, -132, 16, -74, 268, -85, 30, -548, -195, -8, -10, 369, -569, -63, -208, 250, 486, 163, 136, -688, 172, 188, 544, 813, 441, 242, -448, -72, 223, 210, 65, 224, -213, 432, 358, 237, -94, 56, -61, 66, 1010, 315, -524, -666, 167, 190, -37, 823, -672, 194, -186, -351, 524, -498, -33, 61, -214, 61, 323, 2, 42, -371]
2729c71O29k63J71l46M05m78J94r5L03K96l40k47L98n87J95m17n0J171q78O27
2749C17j171L16J073o95J94j121K010m36j106P97o06P89m1q6k45l08L94L22M8
2768D45L66r25N24o42j39j7L68L76q95K58K29L57o2l66M15n76K14L14J5m47J77
2789a1l57K01M93rq4m13l22O55m2L18o74J73j46J4J22o8M70l26l07K64K75m75
2811b49R42o53l25J80o4o3O44j52n10O3M04N43%j587J066p51P12K7o2j176J10
2832i01J111k8n27P71n39L34K41q88J018K15m03j016O11J2K31p43N67j72q6j36
2852c28J53R4J60J64q65P79o12O79k98J47Q0m9m15O66k77m54J55J21P03o88K09
2873A24n57K59R50o22m36m5J84k31M25o6L14L9m84q5k4L20P2k52N7l90N05K15
$$ y = [-371, 258, -5, 166, -180, 225, -253, -59, -154, 149, 445, 105, -142, 256, -331, -136, -553, -603, 568, -310, 317, -854, -538, 535, -160, 34, -1087, 923, 487, -619, 178, -428, 361, 320, 234, -11, -319, 75, 397, 445, 811, -114, 410, -232, -371, -388, -20, 356, -539, -281, -52, 305, 243, -123, 292, -284, -70, 244, 259, -188, -11, -368, -167, 326, 317, 233, -180, -502, 153, 111, 429, -245, -72, -218, -204, -82, -150, 320, -6, -313, -49, 226, -249, 693, 40, -285, -105, -169, -232, 412, 260, -250, -187, 217, 760, 760, -827, 239, -512, 200, 227, 165, -1011, -901, 210, 182, -345, 426, -113, 221, 462, -426, 592, 807, 404, -612, -1, 11, 242, -501, 66, -106, -192, -328, -175, -81, 79, 243, -622, 157, -455, 224, -74, 73, 153, 104, -311, 355, 78, -376, -221, -100, 603, -85, 124, -433, -174, 776, 154, -282, -327, -143, -374, 51, -15, 299, 338, -146, -231, -255, 65, 137, -115, -58, -448, 57, 272]
2895B72l23K43k87j42L24n0J05q0j23K9p3K52j1J36k93j30K04k11K45O6k51K1
2917g7K32j09J5l8N0m23K08L8J87r8m8k62K9M07O6j10j24k61K29N9K86p8l26L3
2941a15J77j66M30j60k33k5M5j44N06j43k41R1j34J42K32j05q4l58J04L89k13
2962eK35L5l86oO0K26k0j07r2j6J02P0J48k52J60l53J15M81n56M53K5J36p64j3
2986c24L85j09j57Q7K77m4K85m43j7l6L4J69L1j6q2P1k76K08K5Q0n3j65j38K53
3010D5J36j27j42N4M0j17J71m0j85j67J61J11L25J8l71k1J5K21N5j02r2j23j69
3033c04K11J57J79m15J4j42K59K62j08o7l7k57M68J5j06k56j36K78r1K02J18m36
3055a92J32M5J09j55M06j05l01L70j46l49j28l4N81k59K90N7n15N19m49J25l6
$$ y = [272, -51, 192, -95, -237, 87, 37, 142, 62, -61, -32, -105, 147, 136, 272, -21, -151, 53, -158, 87, 153, -98, -77, 155, 46, 61, 23, 73, -350, -142, -104, 83, -15, -63, -325, -296, 111, 177, 67, -57, -318, -89, -30, 256, 178, -148, -115, 62, -104, 326, 166, -67, -92, -47, -191, 315, 172, -69, 22, -112, 30, 262, 157, 73, -285, -181, 208, -5, 230, 265, -121, -127, -67, 159, 139, 32, -60, -76, 26, 96, 244, -8, 152, -201, -86, 395, -161, 292, 317, 453, -311, -324, 61, -48, -205, -118, 159, 115, 400, -43, -60, -96, -62, 107, 138, 122, 40, 111, -165, 43, 68, 148, 95, -70, -208, 45, 181, 54, -88, -34, 6, -111, 60, 20, -165, -332, -171, -60, 265, 283, -88, -109, -94, 127, 182, 80, -12, -135, -304, -93, 64, 243, -172, -158, -300, -41, 221, 113, 46, 9, -248, 220, 235, 129, -127, -263, 15, -76, 126, 244, -192, -60, -15, 94, -61, 345, 240, -61, 309, 163, -186, -314, -348, 233, -26, 264, 321, -194, 325, -124, 1, -35]
3076c5L9O0J11l99J38k5J53p6K07j96k90K68KK69j63j83q2J28K06l8K89o10n6
3099b83L28j42K95j77o0j31J09L34k8j87k62N5k22K83K32k52j02o6K75j28J46
3120A7P8j74k43K07k9J18J77n2k16J79l79O16rj62k95OL68J38j23l36j09R2K54
3143A23J95l39M1o7r7J63J25l6j23J94k97K00n8J6nj48o0K46QJ11k25j87k6l8
3167b84M46p4J5j95j42L03K01j45o5k69r7K72J63n9Kj69J56j62K43l6l9J21m84
3190b98P1M43k48J15L5J4j37m5K60r3k27k69K31K71p1o4j49J44j32nL74j75L9
3213H4k21j64J54L72l24j70K81j54J43N02n00k05K03Q5r4o9M6P6q7j09J5K11L9
3236A14k98q8O4K15J36N6j11k39j02L74l69M13k23q7m5K05L80p0k14l50K44N1
$$ y = [-35, 4, 64, 175, -224, -86, -111, 42, -34, 173, -23, -313, -45, -43, 226, 63, -120, -202, -74, 132, 94, 383, -227, -283, 45, -97, 198, 21, -39, -170, -61, 273, 245, 58, -204, -149, -371, -88, 144, -108, -210, -276, -1, -129, 17, 95, -79, -322, -115, -144, -26, 151, 99, -117, 62, -317, 299, 290, 128, -167, -161, 207, 345, 222, -114, -223, -131, 123, 318, -21, 20, -47, -144, 19, 144, 108, -15, 179, -118, 82, 24, 40, 35, -113, -173, 73, 81, 192, -33, -220, -246, -284, 162, 88, 103, -92, -234, 69, 270, 125, 60, -209, -306, -34, 129, 70, 72, -97, 59, -103, 140, 104, 65, 186, -298, -227, 216, -32, 83, 118, 132, -5, -50, 210, 117, -110, -379, -148, 123, 52, -12, -161, -17, -149, -154, 220, 45, 84, -137, -301, -147, 225, -99, -269, 12, -142, 1, 503, 3, -202, 1, 86, -8, -77, -31, 45, -42, -151, -136, 75, 114, -184, -272, -208, 7, 143, 199, 88, -151, -253, 121, -248, 165, -58, -145, -190, 15, 395, 325, 111, -239, 5, 56]
3258E6J63k2j3l10n2M5K59J2l24Q3K03l9j27M48l59j16o1q2M14r3j19J20j84J51
3282E3L5J17k6l87M19m51J06M83k57j50M5k95K78K00r9j92K8J35l6J73k77N1o3
3305a10r2M03j80j25J51o3O0j30P7p3M7j45M4j2L46l03J64j9j15k23M19n4n7j65
3329a55J89l8m0Q0q8J36j70m8J47R0j47M7m4j90K31J27q3j03K27j95J32r0j53
3352a38J97l79K22J55N0k1k08j30N77k49j15J08p9m37M13J15p1r3k40L77j67L38
3374B25m22m4K70j46N8J27J50N5k25ok74K42m0L05q15l39O72l72L44q5J88K26
3396I4M35j103O67j395J885p69K06J72M43K49o86n25O44n37O4M51l13k07Q1L36
3416A92j49J91l02K08k42M36m37K23j81j28J33P5P6J3p0p1n9K10j89J68k62j5
$$ y = [56, 219, 197, 184, -126, -178, -133, 126, 138, -186, -103, 100, 61, -66, 382, 23, -93, -154, -236, 178, 85, -34, 86, -98, 53, 88, 205, 179, -208, 211, -240, -134, 349, 92, -58, -13, -308, -30, 170, 71, -121, -93, 42, 6, 179, -98, -47, -110, -202, 201, 21, -104, 47, -16, 44, -86, -9, -82, -35, -180, -136, -148, 198, -105, 59, 40, -75, -298, 121, 67, 10, -155, 34, -4, -44, 36, -52, 84, -86, -134, 13, 103, -44, 3, -41, -231, 0, 127, 44, -59, 168, -27, 105, 15, -138, 59, -320, -98, 57, 107, 86, -122, -252, 325, 76, -39, 69, -10, -447, -34, 81, 10, -83, -323, 54, -113, 225, -197, -241, 29, -117, -59, 68, 218, 273, 48, 42, -232, 10, -30, 275, -540, -879, -207, -579, -235, -320, -132, 94, 529, -574, 93, -1302, 583, -186, 20, 192, 635, 884, 198, -327, 317, -220, -156, 295, -18, -225, -144, 192, 43, 234, -68, 140, -102, 334, -103, 120, -61, -189, -56, 19, 95, 108, 38, -33, -92, 118, -71, 97, -165, -180]
3438a80J06l3R6K28l78J03Q6k32M02kk14p2q5M5L29j74p3J37l52K96l33L71k5
3461D6k47n5M16N6q1O6l52r2L82J00k10L8K04k35j64J8K27k7k47L8M0K35j01N3
3485A08k53j06J47J83j13Mp3J68k50M25n7j37K3k45K14J06R4l12n5O1M8j01J96
3508G5l8p2r3J99j11J10l7R8k62K9P7k1K18k61r7P8R6L7k7K05k83N7l18N91j3
3533B37k90r0L7L13k99%K14j70K81k01p2K2p4o1J29L26m26L27j43j18K30q2j03
3556a3M1J52m50L88j62K34j98R6mk41K07m0J91k72Q3Q3m7k42K85j67m9L6K33J9
3580A63k1k89J53pl7J21j19r5L09k13M5K4j82K98r0n6j61P0J60K05m27j7J62J52
3604A48j84L24k00l25M30k04p3J31n0Q1j41m2J5J34r0J6l8%L28oj07k01p5J29
$$ y = [-180, -74, -107, -11, 217, -161, -58, 28, -204, 198, 196, -18, -90, -175, -130, 199, 25, -48, 89, -263, 33, -300, 71, 46, -201, -256, 160, 216, 135, 201, -151, -243, 139, 239, 29, 67, 271, 36, -128, -110, 117, 90, -157, -119, -79, 156, 55, 108, -145, -251, -104, 79, -34, -30, -103, 65, -185, 240, 183, 46, 69, -176, 38, 144, 238, -74, -129, -68, -20, -121, 75, 37, -35, -128, 71, -40, 70, 33, 131, -131, -102, -25, -46, 172, -89, -186, -108, -12, 25, -2, 203, -80, -23, -341, 250, 237, -53, -143, -106, 207, -92, -92, 122, -48, 233, 32, -40, -18, -92, -153, -24, 302, -124, 203, 60, -58, 172, 90, -13, 28, 180, -270, 118, -44, 190, -8, 88, 84, -157, 50, 10, 201, -71, 12, 95, 48, -194, 91, -76, -125, -89, 144, 163, 142, -147, 6, -1, -38, 83, -36, -131, 178, -35, 10, 34, -148, 150, 60, 4, -157, -87, 73, 278, -149, -166, -4, 148, -36, 288, 88, -237, 193, -11, -84, 47, -3, 78, -63, -105, -90, 44, -46, -30, -68, -68, 260, 254, 147, -54, -129, 0]
3628@n5Rp3J56k57J48J47M3k31J72R4k84J76L3j86j13L56j47n5J00K00j33j55
3651e5J19k58L47l81P7J68k10RJ26J60k32j7j17K48R2j47J85k62J14R8M9J39k80
3674b8J3k8O1o7K53P3j94jJ36j20o5j00kJ70L5j58j49N9QN1K53k79J43k3r6q9
3700a44R4J85Jj47j03M1J45m1J19j32j64K3J55J01Q4k14p8j76J88J09K28m94K21
3723Al29K38K38pj47M5n1k16M40O2j70j91J26OJ31j13r0j16o3J69J21J56k75J52
3747A17k31J89k47K57J8l41J03j51M19N7M2k16k62K44L20k94q6Q1k50J69O3p0
3769f9M7M7j33J57m4pJ65l04K75om2k33J37M8Pj32nK46K9j91Q9O2m2m8rJ3Jk1
3797C7m1p1M0J40j22j54K90M2O4k55K34j75n2J68K5K4m29J3M00q4K1j33l6j34
$$ y = [0, -55, -46, -119, 37, -220, -72, 75, 118, -113, 59, 153, -131, 45, 78, -108, -221, 135, -12, -67, 33, 233, 100, -55, 64, -194, 153, -228, -151, 17, -193, -184, -58, 102, -130, -147, -264, -16, 76, -71, 114, -148, -34, 64, 113, 252, -28, -15, -43, 18, -49, 204, 277, 83, 82, 218, 98, 33, -67, -69, 101, 136, -22, -171, -112, -104, -53, 200, -79, 64, 41, -55, -144, -50, 135, 136, -11, -114, -73, 72, 31, 150, 18, -146, -123, 32, 133, 217, 3, -75, -251, -63, 46, 274, -220, 1, -328, -90, 148, 141, -6, 39, -12, -228, 212, 274, 104, -87, 39, 45, 176, 63, -27, -143, -206, -37, 84, 240, -35, 117, -114, 75, -172, 85, 103, -238, -135, -286, 133, 190, 232, 16, -246, -2, 318, 24, -62, 19, -231, -62, 1, -69, -22, 25, -108, 49, 5, -2, 163, -141, 134, 128, 86, -147, -10, 38, 45, -87, -92, 154, 183, -8, 81, 143, 101, 53, 44, 57, 58, 37, -4, -75, -35, 105, -17, -171, 119, 161, 225, -30, 204, 29, -23, 145, 170, 194, -235, -222, 178, 94, 115, -18, -54, -188]
3821a88J05J45k1j6k25J42j20K61P4J76k46l79K98O0J04k7k93j2J72J96kk22J60
3844A42l74J35n7K91l4p7j56r9L93j13r7J35n8q3K4L78k53k82R7p7K85j01q6Q
3868e9m7J08q0P8N9m0r3J6r4P3M9j70K41k08O8J93O1j91j14J20J65k30M02n47
3892b40J42K34q1J06j54J53m3l06N7K46q1m2n7j68O9K1K79p7Q5j69j57J91r7K31
3916A42j06m0j77M44k05J21j19j35M5K07l05j73j6K90j9J42L1j53k7k18J99J33
3938F1l09N44n40k7L08M3O1L4p6j99J0J68N9j19n4J01k08M5o6o8QJ47J13l7k8
3963b9m8J1j5J44J13L3j02l45M8k5O1J82R3k49J19J26O1j12j9r0k06L70L5j60
3987do4J21q1J44N1j83K21o1j79k00J42N5P4j30l38M38k31K76N3J08j91J5l32
$$ y = [-188, -83, 62, 41, 25, -200, -58, -178, 83, 157, 333, 87, -292, 6, 66, 170, 143, -150, -162, 10, 206, 204, -18, 142, -232, -97, -154, 137, 103, 26, -130, -229, 164, 51, -46, 89, 31, -52, -28, 350, 97, -185, -88, -165, 120, 19, -67, -59, -106, 2, -78, 0, 59, 19, -74, -58, -152, -79, -30, -200, 41, -167, -99, 94, 155, -36, -150, -30, 135, -95, 307, -240, -98, 136, 55, 161, 7, 160, 117, -189, -132, 114, 33, -9, -66, -234, -165, -144, 135, 58, 143, -26, -183, 8, -89, 142, 36, -4, -181, 263, 58, 179, 60, -75, -30, 177, -128, -301, -317, -27, -46, 96, 127, -26, -53, -271, -72, 61, -248, 296, -244, -271, 37, 80, 141, 175, 99, -100, -90, 78, 137, 18, -36, 65, -143, -98, -164, -232, -224, -77, 36, -1, -29, -77, -66, -81, 63, 176, 209, 107, -238, -190, -215, -154, 28, 121, -128, -9, 117, 178, 66, 47, -43, -249, 121, 156, -4, -68, 53, -28, 116, 167, -16, 205, 144, -35, -235, -93, -38, 36, -94, -432, 6, -225, 51, 104, 212, 21, 36, -296]
4010b96L60k84K00k8K4k2K18m3j61L39m93P5J86j0J24k52O8P8J90q7k08N1K5j18
4034f4J09k06K82j61K5L7J06j12Q9j13o1j8L58j96L2r7J9q8J59k62M6P2k5K59
4058A90j78J86k17j94J02J5KP9R4j7j41K3j9J01p3j28J78J04j93R1J2o7P0L3r8
4083d5R9J97n74L43jj8R1r1Q9j72K04M8j89L3J06m2Ok1p6M4j68J60p7j36L28j61
4109b3N6o8K43m66M43j11P9q4j38O6k9K57l19R4j01P0J49l39r3K23J78j76J29
4132D0p8nj4J26j7j38J10K7p0K01j52r9J21k5k14M70j47m2l3M8n8O5K0OJ7k02
4158d3j64j39K74J41J85q3l21J73J1J49q8j07m0J40j27J89j56r0N9p6L3J87m4
4181F3O7l35j7m6k6K03L88l72J13J22q9Q34j034j16O09l78J98j16Nj53J20j07
$$ y = [-296, 64, -220, -20, -48, -24, -46, 172, 129, -32, 307, -186, -111, 75, 65, 189, -63, 5, 83, 273, 186, -22, 29, 54, -64, 45, -161, 121, -40, -15, 22, 128, 16, 105, -8, -69, -87, 271, 75, 107, 10, 29, -59, 100, -162, -116, -44, -69, 190, 12, 198, -19, -213, -111, -96, -94, -15, 79, 62, -79, -56, -75, 26, -47, -175, 3, 107, -86, 5, 17, -50, 20, 53, -45, 54, 251, -323, 20, 19, 1, 92, 1, 90, -82, 122, 170, -19, 14, 120, 78, 84, 63, -13, 31, -137, 23, -54, -190, 138, -23, 33, -35, 208, -258, 185, 74, 153, 69, -69, -3, -32, 225, -94, 0, -101, -31, 118, -221, -314, -91, 87, -89, 40, -38, -43, -57, 69, 52, -86, 24, 51, -19, 182, 30, -69, 52, 27, -187, 283, 136, 94, 61, 109, 51, 116, 136, 142, 159, -43, -207, -346, -72, 69, 254, 171, -150, 23, 34, 183, 95, -12, -52, 88, -39, 150, -6, -96, -37, -113, -80, 107, 63, 130, -205, -222, -268, -294, -91, 297, -75, 38, 160, 71, 905, -129, -245, 364, -14, 184, 68, 73, -80, 40, -67]
4203f7M2M1j16J40O0m6j17q9J60K55j38j65r6K65P0j22k62j71L02L8K9p4J87m9
4227G7n2M1J31j32p2q0K30n4j26K12j08L0l53J71K19k26l6j48K84J9O1pj00R6
4251G7jo5J25N2j56J3j31J07J2j3k9r5J70K6j70J78j35l37K85N4R4k98K6J16j69
4276b64K20M1l32L56k66Q5L42j29J27k04P2OL20n49R4l0K21j56K0J8J80k78k0
4299a26J94p0O5J37l46j8J13j9K23k08N9j07J9K00j20J60r3j54O3N0M9J51M5r0
4323A77Q9k67k52L83Np8k22J95o9j16J54p0r6J46j69M12n7j44J05k20O5Q7N4k24
4347a12j56k2L41j91J54p5j9l1J79n7O8l9L6j47J23k1OK9p2j36K55r9l3MN0j0
4373B5r5q2J44J68j16K1j34P5M5k0k40J23J72j51p6J48j1J27j13J61j22p6j63
$$ y = [-67, -25, 16, -100, 40, 100, 54, -63, -152, 8, 263, 125, -40, -136, 129, 199, 77, -185, -356, -54, -16, 13, -61, 126, 77, 25, 66, 197, 65, -7, -87, 143, 89, -37, 175, 67, 97, -256, -85, 134, -92, -128, -276, 8, 27, 88, 81, -19, 77, 76, 11, 136, 188, 32, 45, -86, 21, 33, 20, -9, -104, 66, 92, -78, 100, -35, -372, -87, -33, 61, -237, -211, -95, -264, -44, -3, -335, 21, -245, -160, 182, 53, 180, -24, 48, 54, 374, -175, -81, -111, 110, -46, -26, -8, 172, -106, -126, 68, -2, 63, 200, -146, -164, -51, -70, 153, -55, 4, -103, -84, 116, -4, 156, 63, -91, -28, 22, 71, 222, 267, 177, 266, -1, -253, 130, 135, 57, -165, 30, -39, -155, -1, -71, -167, -21, -190, 222, 165, 21, 126, -94, -29, 58, 112, -112, -268, -290, 51, -140, 14, -61, -80, -111, 68, 11, 79, 40, 76, -71, 52, 31, 37, 66, -6, -142, 113, 14, -19, -15, 35, 25, -70, -152, -8, 160, 44, 65, -69, 6, 51, 31, -209, -86, 86, -65, -141, 7, -4, 123, 10, 171, 49, -27, -190]
4396a90L76o5j03M16n72J23j3J63N0q2j90J63oj05J74j8Mj23J37J76j60J49l82
4419g8o3P1MO6J92j67l25M34r6R3j71L3P8r4J26o5j02m2J20j00J09q1RJ62j43
4444c0r4L77k01K09m11K91j72j67L62l13l5K77l71n2M64J2Q3j89j17j06K72n1
4466C8m6l4j4J2K69l42M3J82j58J7o2J52j42L6M9M1j24k53J38K57l1n6N9j05P5
4491Aj18L18o3k41J75K92m44K90k38J04k2m7k75K26Q4j34L7J92j36m5k0J0J58
4514A04j88K40k37J02o0j7L3j32Q9L0j85K3K74P9k20QL5rR8k47J36q2K00J26k20
4539b0R6k04J69n6R2K73j86pj59j81L17j28j39K44k17K38%k06J21P1j52K71j73
4562F4k54J60k14Q5K23k30L23q7jk74P2J15J28k22Q2NL0k10K11qj08%M1J02r1
$$ y = [-190, 186, 121, 18, 434, -138, -15, -28, 135, 185, 103, -87, 76, 70, -35, 139, 121, 125, 2, 139, 315, 155, 304, -78, -141, -70, -66, 0, 192, 25, -300, 134, 38, 131, -40, -7, 71, -23, 103, 38, -64, -106, 14, -86, 23, -58, -49, 113, -30, -124, 253, 52, 261, -150, 141, -31, -198, 164, -149, -184, 93, -278, -330, 134, 146, 229, 40, -77, -183, 89, 38, -8, -42, -56, -44, 225, -117, -74, 108, -50, -33, -95, 57, -85, -49, 0, 41, -83, -336, -198, 59, 28, -28, 31, -74, 1, -117, 201, 138, -103, 72, 364, -80, 210, -28, 76, 54, 7, -268, -42, 42, -92, -55, 137, 1, -44, -64, -54, 104, -84, 156, -81, 21, -39, -56, -23, -155, -66, -36, -221, -198, 76, 155, -65, -57, -22, -31, 67, -180, -44, -126, 74, 200, -20, 76, -128, 41, -15, 77, 350, 164, 157, -2, -183, 134, 6, -133, 111, -106, 132, 132, -74, 47, 118, -34, 237, 64, -190, -30, -244, -159, 64, -166, 157, 70, 69, -205, -133, -18, 110, -112, -30, -25, 5, -205, 6, -2, -110, -110, -69, 33, -58]
4587e8o6j62J96N7K03k39K2J3L2J50l01O4K94k99m5L4P1j5q7j10L42k50J65P7
4611H8j22p4L0L55m25J81J8l0J36j76J27j49K18k85J17J5j19J45J08p6m0R5p2
4634F5k96L04j67J49j03j0K0j86J75J22p5J35l53L53k15n8M0K3jK3N0J2l2M7L0
4659E2j03j3%j6J84k93p0K49j63J64l6M4O0m0Pj29m8R2j4J65Q4n7Rk5l2p3m6J89
4687A41k47J28r0j71L73k42J01lL1K0j37Q1J6O9N7N1j03j29p2P7j12K33K4k08
4711a12n5J24J28J32l07J1RK71m0l84K42L8r4n7O0J50j44L3P0P0k77J4J34K06
4735B22m38M50j87l2J14m57L88k1j22N3k2l02M20j20nk16L13j99J27J58k35J28
4757A7k7Q2j88k82L54q1J8J90j15j6J9J52O1l19J77j28J83j18N6j61K26Q9j72
$$ y = [-58, -124, -286, -90, -33, 170, -69, -47, -34, -2, 148, -153, -89, 205, -94, -139, -105, -34, -49, -136, -246, 96, -154, 11, 88, -34, -108, -78, 277, -148, 33, 51, 21, 157, -19, 108, -41, 177, -108, 9, 24, -95, 50, 158, 82, 42, 137, 65, -231, 73, -94, 55, -48, -58, -38, -224, -49, 73, -2, 133, -220, 133, -82, -140, -100, -77, -78, -55, -5, 7, -25, 22, 52, -51, -64, -64, -80, 104, -189, -259, -10, -173, -9, -45, -1, 59, 19, 26, -103, -151, -59, -73, 92, 176, 119, 128, 103, 71, -2, -48, 141, -106, 22, -68, -239, 134, -108, -7, -10, 21, 41, -96, -15, 1, 70, 127, 178, 75, -54, -126, -49, -161, 72, 96, -112, -167, -43, 85, 217, -90, -79, -70, 201, 161, -223, 19, 57, -37, -94, -34, 116, -28, 5, 75, 145, -132, -118, 16, 222, -216, 234, 47, 15, 129, -328, 60, 39, -83, -30, -52, -354, 66, -54, -59, -275, 38, -161, -34, 124, -111, 17, -10, 72, -116, -398, -44, -125, -107, 83, -32, -48, -29, 123, 184, -135, 42, -86, 97, -21, 35, -126, 100, 189, 17]
4780A7j35J83J7j80J65K3o0J3j6J24k78K14j56J09p2N0j08P6l9J48p5o3j32pR7
4805h5J80k38J89j62jK39k95Q2K18l74J59nL60l63K12o9P2n4K14nk98l0j21K82
4829A07j53N4N8j80K10m4Rj67J13n7J11j19j65O0L15n9n8N4lj22k42K87L9J54
4853B02m9R0l89j7J92m4J41J15j46j73J17n4J59o3R9j58R4j9lqp4k01J97n3J56
4878A11m9k36K69k23J93k67K42k16K39qk52K96p5j25J79l3J5N8k61M22k55q7j19
4901a82J21K48j29k3r4J20j07J02j20m2K64k96J84p0l3j5j03K09M7q5j47K12M7
4924A08n1J98k33K28k22j2J2j99J47Kj56K08j1J94l46J25k28R6K2J71j87L44k18
4947hn5N1J1j24J19J84j87J9L1K9l4K4j61K33j61J25j03q6K18k45K08m7j81K74
$$ y = [17, -118, 65, 82, -98, 67, 90, 30, 43, 27, 151, -127, 87, -69, 40, -32, 18, -90, -14, -53, 95, 20, -43, -175, -182, -85, 95, -143, 46, -116, -117, 122, -173, -91, 127, -247, -88, -93, 267, -96, 116, 47, 119, 65, 279, 274, -24, -54, -175, 107, -46, 8, 66, -114, 96, 52, 61, -106, 7, -50, 61, -58, -223, -163, 152, 93, 35, 89, 86, -36, -278, 9, 48, 202, 153, 243, -146, -163, 29, -15, 126, 241, 95, -78, 39, -15, 144, 81, 180, 22, 116, 97, 94, 86, 12, -189, 8, -45, 111, 62, -174, 95, -128, 65, -202, 40, -176, 63, 55, -197, 99, 24, -101, 78, 45, 60, 118, -143, 279, 24, -63, -182, -61, 187, 58, 35, -59, 61, -46, 56, -64, -106, 158, -138, 46, -24, -57, -72, -175, 34, 81, -4, -151, 61, 108, 57, 255, 22, 250, 28, 16, 28, -171, -24, -22, -178, 30, 19, 213, -133, -8, -236, -140, -118, 53, -134, 210, -8, -63, -12, -1, -125, -6, 178, -9, 10, 41, 70, 36, 60, -101, 132, -29, 96, -7, -93, 125, -120, 88, 41, -140, 134]
4971A34j51q0KR9K7o7K24k07Q8p7J46j68J98k06o9p6K48j38K77k18QJ67l6j64
4995c9k14M17j82k02M27l25M6l8j06L79k64P6J96j84J08nl99L30K8k79j25K95
5017f0J83j50k15L36P8j21l19K82Q5k11N2L6k5J24J1l92K95O1l9m4J12p5O7k1
5041E0R7j42k71J27J73M7k07J39n2jk6M5L44k09Mj11q8L9m8K65k04J26j4j41R5
5066C7k97L97k3j18p7Q6j38J13J46o0n9N1J59l20L1j4J41M4n0q7J19j40RK6J48
5091A24m07L84l1N5N1r7k47J15R7K12M5l30K0o1J30Jj19K31o4q9j27J20M1k26
5115a72J17J28r4J45j63O5K1k29J70k46L19l44K93P8M9%j37J77j08j81K34r1J05
5138A36m69L01J36l30K65j81M8P4l1R3o1j79J66o6J10N3lq6k61O02k88k12L17
$$ y = [134, -17, -97, -95, 4, 31, -36, 188, -19, 69, -8, 138, -30, 168, -38, -107, -183, 65, -73, 204, -14, -6, 161, 125, -39, -253, 164, -18, -220, 207, -118, -72, -110, -216, 163, -101, -25, 171, -13, 95, 90, -309, 21, 49, -230, -355, -60, 123, -27, -242, 94, 172, 51, -268, 14, 99, -112, -60, -24, -49, 75, 86, -306, -11, 50, 11, -33, 79, 4, 71, 50, 147, 5, -266, -139, 34, 81, -126, 13, -39, -40, -66, -21, 323, 114, 118, 7, -81, -42, -90, 175, -29, 97, 83, -58, 37, -260, 137, 114, -4, -81, 5, -133, -20, 126, 66, 7, 58, 217, -103, -72, -86, 55, 99, 49, -38, 81, -59, -50, -24, 124, -283, 101, 70, 125, 176, 79, -168, -53, 44, 256, 301, -29, -9, -70, 60, 61, -58, 173, 109, 20, -107, 13, 54, -172, -55, 73, -21, 124, -39, 26, 47, -182, -12, -258, 61, -283, 10, 88, 137, 137, 0, 177, 69, -112, 122, 31, 136, -333, -32, 104, -226, 39, -142, -94, -20, -51, 42, -19, -198, -32, -98, 12, 65, 62, -24, -285, 317, 29, -183, 134]
5161A34k75L68n7j26j59J25j56j2L10k94K45l03N6J69k91M24p1L4k11RO1K19l43
5184a44l0J35p0j54M27k76R9m2L27l17J42J15k13O7J19J03k73k7K6K8j63J84j55
5207i2R9j07J28r2k0m9K81k70J97j33K33k09p6q2J71k74L85k15n6L03j19j4L8
5230B7J07j83j83L44k84L07j70J09n7q8O2P6j86J65l8j2k5R4r3p1L51k94J6j12
5254a38J98j51J68j98K03J4N4j63K14l63K4K46j66K42j15R3n32O07l81JK32m0
5276D9k81L96k44J8O0pk52M55k54J00k25J25oj10L4R8j05N3K01j01P1K14r3j20
5300G6k45r1N65l36K57q9l19R7K55j97j55j7K1K15j23J32O0j83K58J7j41k53N5
5323a41j3L28k16Q2k17j4L38k86J21J60l13K18M2k46l5L19j0q5j12K02k20J29
$$ y = [134, -141, 227, 170, 44, -115, 10, -146, -158, 152, -142, 103, -200, -144, 25, -266, 158, 87, 121, -90, -81, -20, 199, -144, -174, -39, -109, -263, 164, -112, -13, -55, 272, -45, 97, 212, -1, 66, 185, 288, 15, -12, 14, 42, -121, 63, -92, 7, -100, 28, -64, -84, -133, 148, -122, 75, -58, 175, -34, -110, -192, -21, -295, 90, -125, -181, 122, 3, -11, 27, 134, -49, -232, 112, -172, 135, -35, 74, 17, -71, -9, 67, -119, 46, 8, -4, -29, 65, -28, -99, 252, -42, -26, -138, 60, -91, 77, -121, 82, 96, 150, -13, 201, -162, -138, 108, -58, 184, 69, 162, -370, 237, -144, -143, 89, 49, -232, 164, -80, -62, -2, -9, -261, 194, -60, 40, -185, -60, -66, -176, -142, -44, -149, -96, 105, 4, 75, 289, 196, 76, -169, -260, 305, -31, 226, 137, -182, -85, 170, -27, -182, -199, -178, 37, -86, 46, 106, -77, 181, 198, 57, -196, -141, -154, 174, -42, 40, -177, -191, 147, -139, -18, 142, -171, 47, 89, -157, -192, 127, 117, 32, -80, 122, -98, 31]
5345C1j2J19k01R4L7q3K01j60J35m67K50J74k67j14L97k73K49j16j25J92j13j00
5367a52L65m14J17p6J86qQ9j56k6o9K46Kj66K09k50Q7r2J42o3q5O1K9P8J82l40
5392a04p7M08l36J08K63l69J73o8j22K16k6k35J80J41j34K46l06J09k38K17m8
5413bp2j15M9M3K0m2k7J52Jm1J81j47K21J4n5P7k26k4M9k4m3j20J95P9l11K55
5439H7j10J95k21N21o00K46j24k59L80m8J1k02K20j22k5j34K85r0K01l05MQ1p8
5462h7J17J43j07m2J37j51mQK14k58M9n1r4J3R3K64j95n5P4l60L93p7O8n6j03
5487f7J38j38J01j2l25r9J96OJ52Q9k33L71j35j29R5l0q8j4K03J21j84j05J45
5510E8M1j33J13O4J2j26J60j01j48J0q1J63r1R4mP5k8n8r9n3o5K40J86k89m3J01
$$ y = [31, 19, 138, -63, 31, 68, -15, 186, 26, 161, -306, -56, 118, -149, -263, 134, -139, 110, -6, -131, 61, -52, -152, 213, -201, -84, -160, 26, 18, 107, -49, -75, -144, 102, 104, -62, 147, -103, -16, -108, 34, -29, -114, -53, -24, 54, 236, -104, -181, 227, -109, -1, 262, -107, 66, -2, -124, 92, 66, -169, 11, 152, 18, 264, -42, 67, -171, 46, -2, -74, -189, -140, -97, -77, -119, -146, 6, 7, -34, 147, 0, 221, 235, 180, 257, 31, 7, 56, 32, -11, -131, 64, 143, -168, 87, -23, 172, -49, 472, -128, 118, -6, -265, 115, 67, 78, -124, 96, -26, -51, -185, 100, 10, 211, -94, -90, -9, -87, 30, 173, 66, 24, 161, 10, 6, 14, 228, -30, 19, -32, -126, -113, -20, 244, 49, -6, 68, -292, 101, 24, 92, 36, -67, 71, -67, 34, 22, -303, -402, -206, -200, -48, 41, -192, 179, 44, -85, 10, -20, -108, -122, 81, 202, 18, -87, 58, 99, -34, 79, 143, 155, 29, 189, 88, -60, -50, -131, 32, -59, 35, 31, 106, 78, 20, -79, -132, -197, 43, 229, -60, -103, -2]
5536bn5j70L22j47R5j5M2j50lK7J9J61L7k89J87J20m3l03J24J62J82n64L39K0
5560I6j08J19j6m6j38Q8K08J80l00k65K40Pj89J17J32j36K1n0N0J14l4n9j8k13
5584b00K01L8o6J29K5n6j59K11j62QJ45k75L27k22J25P2l20J57j03J3O8R3J61
5607B10l84L93j39m0J09k19Qm3J28mj78M2K29j31K3P5p2K23j69J8J17Ml43j44
5631b87J90P3K20j32n3J09k50j47L23Q0J4j26m5M8J17k20N7J76J19l31K30r7k7
5654D1Rm0j36K17J9j03j13K42k56j8J50j2M7j26o0P7J66k66lJ45p8O7J06m40M87
5679A22k45K76k10P4j51P1J4k8J46j16J19k0j74Q1K84k92o5K52P0m21K56m29K61
5702a25O3J00j86l57M56l8J4J77p4m5J52j69J02l2j62K02k7r7q5K1J43j3K2J71
$$ y = [-2, -57, -227, 95, -52, 43, 28, 70, -80, -83, -56, -37, 124, 161, -128, 59, 179, 136, -167, -43, 119, 301, -263, 76, 96, -12, 107, 91, 45, -93, -5, 203, 383, 83, -182, 58, 65, -124, -7, 125, -11, 10, -40, 10, 124, 90, 31, 13, -200, 1, 39, -27, 102, 127, 71, -88, 123, -39, -31, 114, -161, 166, -56, 69, 141, -179, -22, -125, -112, -44, 49, 210, -174, 219, 80, 40, 149, -70, -62, -105, 23, 19, -159, -117, 112, -19, 4, 79, 7, 230, 61, 79, 196, 200, -143, -287, -97, -24, 196, 64, 11, 120, -130, -277, 46, 126, 140, 14, -31, 17, 134, -86, -29, 147, 266, -65, 165, 68, 41, 50, 10, -126, 91, 110, 7, -106, 136, -120, -138, 12, 0, 47, -79, -139, -62, 104, -162, -165, -20, -98, -31, 75, -365, 122, -123, 153, -57, 17, -134, -63, -49, -77, 69, -47, 72, 52, -122, -41, 243, -49, -114, 138, 208, -213, 43, -386, -125, -62, 38, -148, -505, -49, -87, -73, 104, 30, -15, 137, -32, 70, 38, -124, 78, 51, -46, -131, -110, 33, 20, 42, 213]
5726B13j00n74L46J80J55j56L6k58K78j72n3J08J84k32j27M44j89n8m1p9j64K99
5748D0j60jL07l11J91l36M91k24j77J25K04j6j24k9J77k00J41k38K2M55m12JR4
5771B0j83K16j8Rp5J45j00lp7J96l6L9Pj09j50r2Q6M6k37M52l14K84Nk19K52j93
5797d9J42l55J90R0L0K3N8j53J18k59OL92m14K59j40O8m5o6p2J65O0n8j62K5L33
5822A86l59p9K89k1k3O5k35J96N9j28J04o0J50m01K51K60m16L28K6j92J71l84
5844b13J0M22n14J09J75n9J24K8j09K87j39j90M08j59l8j64L35l23J78k99K22
5865I1k48k2K04k4Q7j09J27o5M0K8l7j47r5L5J70p3j08J64P4J47j25j63o6j2N6
5890g1k0K55j69N9O9j66K1K32k31Qm2m4R5J73j39l8K3k41L40nn3j57O3J93j01
$$ y = [213, 113, -461, -115, 65, 220, 64, 100, -158, 120, -52, -105, 3, 187, -45, -172, 272, 83, 25, -16, -95, -259, 40, -120, -121, 186, -125, 66, -270, 221, -3, -180, -55, 149, 133, 9, -20, 157, -43, 98, -140, -118, 337, -75, -74, 20, -163, 53, 35, 44, -31, 114, 14, 11, -66, 130, 94, 133, 140, 31, -119, -211, -125, -79, -316, 136, -178, 106, 111, -108, 144, -49, 93, -262, -72, 18, 48, 71, 129, -24, 94, -165, -159, 233, -181, 78, -62, 6, -39, -105, -177, -12, 48, -10, -172, -147, 186, -173, -252, 37, 16, -7, 58, -177, 19, 78, -50, 54, -6, 144, -257, -6, 254, -162, 166, 192, 0, 171, -213, -203, 219, -295, -186, -11, -70, 54, 82, -27, 260, 121, -69, 339, 180, 142, -22, 313, -10, 168, -131, 91, -157, -179, 25, 1, 88, -21, 106, 41, 81, 109, 72, -75, -170, -135, 35, -38, -146, 18, 92, 239, 114, -49, -115, -127, -71, -91, 164, -5, 54, 123, -43, -22, 210, -21, -13, -55, -99, -4, 169, 30, -8, 15, -226, 114, 109, 56, -101, -38, 155, 54]
5915E4k18Q1j0K3J74j35J24p3P1k25J22j27K11j24O5j34j9r5L82m92K16K81l35
5938a83J13q8K8L1n9J37J37j4o1p3n5J62j27J52k65K38J62k85K5M9q4L54j71j3
5962A10kq6p3j42K45R0k01J06j5J69n0j76k8j73J04N3J44M8m5n5J09j09J62l24
5986a39J57J31j46J07J26k39J22o6j84M2j34J5J42J62k97l1Q4J10m2J05q2j00
6008a57j4L7P3j44m5L55l95L24l9JJ32j83L14j14j41l20K07J25k46J59Rm8n0K62
6032A02m2j34K1Q1j20r8M32k09j1K15k68J93k0l61Q1M6l7J44oO0j1J15Q4m59J76
6057b6O1L7LJ00j4l55M76m14K26l8m1J49k24K31j24K82l72J92j13m3J28k37K10
6080I4j63L11J7p0k86J68j22N8j39L9Q3Q9j74j06M76l20O5o9q0r0L43j51J21j79
$$ y = [54, -164, -83, -93, -70, 104, -31, 93, 20, 91, -134, -12, -139, 72, -52, 13, -121, -140, -235, 147, -345, -129, 152, -183, -70, -158, -130, -99, -158, -21, 116, 102, 41, -32, -87, 75, -52, 100, -165, 73, 235, -50, -25, 24, -60, 294, 123, 110, 108, 22, -51, -193, 52, 142, -59, 47, 32, 201, 151, -25, -53, -226, -122, -69, 75, 123, 78, 23, 132, 23, 185, -139, 18, 149, 3, 110, 236, -3, 119, 53, -131, -89, -223, -208, -66, 96, -201, -232, -148, -38, -80, 25, -57, -157, -171, -134, -61, -205, -250, 105, -290, 34, -5, -4, 128, -55, 259, 145, 4, -316, -109, 16, -230, -71, -62, -110, -160, 102, 60, -74, -53, 28, -92, -190, 242, 33, 22, 237, -31, 162, 142, -219, -138, -92, -129, 15, 9, 69, 58, 173, 257, -202, -26, 35, 72, 75, 175, 161, -194, 282, -132, 94, 56, 15, 164, -60, 171, 47, 329, -43, 149, 36, -7, 121, -116, 94, -69, 242, 259, 189, -97, 71, -51, 7, -132, -93, -10, 79, -95, -201, 275, -45, 20, -49, -129, -219, 124, -27, 94, -85]
6104h5J13J06j97P8J9j83J69J45o9j37Q5L0l1k12J03R4N8k93J68M6O5j96J23k12
6128b13j7J17L0k1R8j3j04o7J57K2J19l54K54n5K3j13J93o6N5Kj36Q9J56k77j16
6153b37K96j50K45j41O0J64j74l23K00j00K55j03n9j7q9J31n1P0q0M7q1J05j37
6176a69K17j45k03K29J19L1j49J23r7J99q5p6j39o3L20j4j12lJ56J63k79r0r5
6199a62J18l4n1j53L81j67K62k34Mm0M1j6j59K91k7j91J05P1K6m0J25k40oQ2J46
6224A32k45N8J60Q1j93k57M09K6k33J44J41j95j52J4J16m5m7k6r9L26l2l7j38
6247i2q3J05J4PP9M8N8j28j8L8j81L94j07j07pJ26j38q8L03j27m2k07K47m4O3
6272A13O1j06p6Q9p3Q3l93K05K68k67MN1M0p4K42j48j43K18k26R6J00q3J29k25
$$ y = [-85, 28, 134, -63, 15, 34, -149, 20, 165, 96, -41, 44, 74, 43, -169, -66, 28, 86, -207, -39, 7, 72, -124, -1, -213, -230, -113, -83, -104, -6, -19, -123, -190, -33, -11, 108, -246, 8, -47, -24, -137, 56, -10, 45, 47, -89, 0, 156, -121, -237, 59, -91, 154, 13, 73, 237, 63, -260, -60, -160, 95, -8, -67, -84, -173, -42, -93, -23, -103, -56, -137, -32, -169, 48, -97, -300, -71, 48, 79, -70, 53, -44, 155, 70, -6, -145, -208, 112, 98, -14, -17, 139, 302, 23, -67, -162, -44, -78, -129, -282, 99, -68, 194, -40, -36, -76, -35, -51, -210, 81, 54, -137, -32, 39, 65, 25, 150, -90, -96, -14, 132, -113, -55, 105, 186, -7, -264, 145, 171, -62, 82, 223, 28, -124, -110, 6, -39, -86, -112, -211, 115, 83, 46, -92, -175, -70, -56, -49, 30, 78, 136, 8, -10, 28, -153, 241, 134, 27, 20, 146, 8, -80, 223, 96, 54, -153, 94, 50, 113, 174, 68, -8, 81, 8, 91, -302, -97, 171, -96, -92, -41, -1, -75, 167, 19, -124, 94, -132, -36, 64, -19, 110, -115]
6296a15L33j62j88J48m5J61L0k18R2O2k12J47l60K73M1k1J44l01K19j08L05j18
6318A07q5j84K24k57K40R6r5l3J99k59J27M3l36J56j8O7O1L7j54J16JQ8o1k19
6342a39J4R4R7J66r8m3j06J65j09n5K63l07m6j0J30k6O0j65L19l10O6j07nJ43
6366iN5o4K11o3Q6j58o4M5P5k12P3J8j29O1K01j80r8J99%mN1n5J0nL17k94j68
6393a01J27O7O4j13K18l31J61P7j47Q7j36J39o1j91N0mJ53m4q0q3L33k19M16l50
6417C2J48k84M8K69j93J93r4j65q5K8m4j2K44j08J4J14j53j02J06l1j01O0L31
6440B15j00Q5n0K2l84M36m04K95j24q7K02j44N03m56j46K64j50K56k94j66l4K34
6462b7R8j32J62p7M8p9k44K51k54J76K97k61P1n2J42j78K86j43j7o9O7l2J97j99
$$ y = [-115, 218, 56, -132, 16, -29, 132, 162, -56, 36, 98, -114, 33, -327, -54, -13, -34, 110, -191, 28, -80, 225, 107, 22, -162, 62, -195, 45, 141, 46, 13, 212, -47, 80, 123, -213, -57, -75, -8, 53, 90, -64, 52, 53, 141, 80, -139, -125, -31, 66, 232, 134, 91, -15, 150, 41, -14, 249, -58, -104, -114, 16, -10, 50, -115, 204, -106, -40, -147, -152, -9, 46, -18, 193, 130, 216, 58, -6, 39, 114, -98, -25, -7, -136, -75, 126, -54, -152, 47, 47, 43, 94, 39, 49, 44, 361, 67, -101, 26, 93, 157, 44, 262, -69, 92, 169, 22, 109, -27, 112, 51, -140, -90, -94, 59, 15, -65, -148, 185, -34, 382, 32, 180, -104, -56, 213, 20, 213, 119, -46, -131, -103, -147, -159, 85, -23, -9, 105, -48, -150, -44, -75, -176, -116, 215, 115, 200, 150, 172, -212, 224, -180, 115, -9, -96, 106, -38, 465, 9, -137, 127, -23, 233, -61, -227, -261, -27, 71, -61, 101, 24, 72, -7, -251, 0, -254, -78, 219, -42, 29, -23, 119, -59, 227, 84, 67, -2, 65, 33, 230, 31]
6486C1o5M7m1Qj52K53J72l19k7J32R0j36P6R4l7O4j09o4J04j13J64J25l02p6K
6511g9j42K55j97K07QL1k10l2J43M0k55K06q5J77Q7l33K94o8j33Q9j9j8J78k25
6535h1kM6l6k0k8K44m80N85j55j32K4R0l25K96J93l64K04k7j05j20Q6L0J83Jk85
6560a78K28j1j56j12K26k07J6K11N8j87j2K60p8j38j27L80o0k4k59N8L4K76j53
6583D5k43J50l9N1R6k83l0J96q9R4l3K18l17J10K2J80M1j44J65n30J03L62j04
6606B1Q5J76j55k17O1P2K0J05j94K00k75j05K45R3n8k94M31j71n3N5j38J67k03
6629a32L27j41q%j07J23j6R6k92J82N8P9l50O3J66k27M54j71j31j33K63l83J99
6652h1J68p0N0j16J1k1m1p9P3PJ45k76J94o2K06j0p8j31K23j51j1J75j78o2J60
$$ y = [31, -34, 13, -28, -20, -172, 81, 253, -66, -93, 39, 129, -7, 69, 163, 126, 190, 81, 17, 121, 8, 172, 297, -5, -81, -79, -221, 34, -163, 44, 52, 83, -127, -159, -16, 24, -231, -25, -110, 67, 154, -179, 115, 47, -86, 3, -16, -34, 144, -81, -83, -37, -73, -93, -121, 123, -357, 228, 73, -59, -35, 55, -270, 26, 219, -145, 59, 32, -73, -193, -107, -77, 106, 107, -178, 50, 39, -117, -229, -3, -210, -194, 17, 75, -112, -124, 136, 58, -80, -207, 173, 113, 89, -170, -112, -78, 198, 45, -198, -48, -87, -36, 60, -223, -253, -57, -146, -52, -85, 133, -184, -74, -52, 128, 169, 25, 190, -340, -237, 125, 21, 106, 282, 127, -90, -29, 43, 63, 168, -26, 174, -101, -206, 39, 132, 74, -220, 211, 40, -13, 42, -96, 71, -132, 195, 54, 46, 46, -61, 62, 46, 142, -150, 32, 90, 169, -181, -118, 48, -179, 275, 104, -27, -160, 103, -280, -81, 87, 17, 67, -49, -38, -59, -100, -179, -106, -99, 46, -230, -36, -98, 108, 98, 20, -111, 112, -39, -50, 125, -53, -115, 45]
6677D5l8j49J85L2k27Q5O1M2j18J20K2k50K19K26k26j34K36j88O8k29L47k62J40
6700GJ19n18M32m9K15q7k35JJ95j26Kj9J66o9j05KL56k49P8k54J0O9j42J05K03
6725A07J8l58O7K35l01L43P0l28K23j15J60k10J14n5J62k28K18l0q9OK22j89m1
6748AJ34m0j72O7q6o8q1J58l1J21o2j3j33J19N8j4qJ37Qp4j48J57K6p2p5K86j31
6775F4j37j37J15J65PR9k24K6o0n8L45k21o6J51q7J7L4R1l23M7J36L0k06K09j11
6800i4l7nP6L01K3m65L62n1J0k42r2J28R9k03J88Jk22L64k74J45L50k08j38j69
6824a53K05j26L6M6o4k0J27j02L4J96k94L39n47K28J92k67J02J65j64m2j62L41
6846G0j26K45k12j8L40l62Oo6K62j44k43N03m14J38J57J01j65l03K93q6M5o5J59
$$ y = [45, 7, -142, 43, 75, -152, -67, -6, 36, -82, 38, 60, -190, 29, 255, 29, -105, 131, -57, 11, -218, 129, -133, 7, 126, -392, 40, -9, 206, 119, -116, -115, 80, -46, -44, -63, 103, 34, -71, -69, 287, 38, 116, -138, -128, -59, -201, -96, 107, 125, -233, -166, 69, -232, 111, 181, -147, 76, -39, 121, -89, 25, -30, 132, -96, 122, 92, 3, 9, 231, 42, 1, 135, 95, -77, -10, -96, -164, -245, -87, -118, 3, -59, -72, -205, -86, -28, -42, -50, 87, 95, 21, -127, 30, 56, -16, -91, 195, 64, -73, -210, -95, 70, 77, 176, -48, -22, -82, -140, 205, -16, -82, 69, -18, -1, 33, 124, -199, -152, -16, 14, -192, 17, -94, -131, -136, -60, 241, 264, -201, 161, 110, 120, -122, -214, -86, 13, -190, -2, -1, -223, 141, -133, 12, 362, 154, 16, -153, 52, -74, -38, 8, -56, -76, 51, -51, -17, 179, -115, 224, -323, -95, 97, -170, -68, 97, -67, -109, -271, 70, -56, 189, -23, -41, 299, -63, -57, -123, 139, -5, -248, 255, -159, -21, 136, 237, 72, -231, 62, -24, 21, -44, 115]
6869A15j34J91N4l29P1l8J94r0j10Kj05L04q1J0K1N6k02Q7o2P1n5pj83K62K3J31
6895A96m4j44J21k10j30K93j5K3Q2Q9k85Q5K2j27L57m12J1J8K75j59j53K7K30
6918A50J06j82J95l06J12j27J23j84J26m9k9K59p2j26j89L43k28R9K01k50K24
6939A96j71j45K12J1j39j16M1K41k93J24K06j98j42L21j95k1K13k40Q6O4j42m0
6961a27K43q5R9j0j45O7m6l5j48K37O4O6q0p4J50j32k51R9K21M4j99J17k0j08
6985e3j14P3K79k10Q0k42L27j13J76k53n2J60j78o8j78L86J35j67Q1J93j75J2
7007I9j79j26j62K53M0j19J22N2L3Q3k97R9L2k05L94r8L7k22L87j49j3j01k2k
7031f4rK7k78K87J15j34L08k74k4j11K14Pk09j40L44j9j4J59l5l7j16J04l2j72
$$ y = [115, -19, 172, 226, -103, -32, -70, 124, 34, -76, -74, -179, 125, 44, 54, 75, 131, -71, 16, -46, 25, -30, -37, -220, 42, 65, 196, 152, 8, 129, -81, -211, 82, 67, 90, 172, 261, -24, 61, 83, -44, 313, -99, -88, -70, 205, 46, -107, -80, 150, 256, 74, 269, -37, 75, -52, 71, -113, 13, -36, -65, 194, 122, -4, -193, 150, -78, 21, 222, -28, 196, 25, -120, 92, 103, -36, -152, -111, 130, -163, -39, 167, -31, -173, 148, -47, -68, 145, -95, -9, 55, -87, -127, 116, 31, 130, 120, -25, 42, -4, -39, -187, 50, 114, 180, 100, 26, 176, 44, -207, -108, 113, 157, -42, 75, 55, -53, -167, -94, 185, -25, 55, -187, 140, 27, 203, -50, -102, 58, -120, -188, -366, 20, 155, -12, 69, 262, 87, 99, -80, -206, -368, -115, -75, -194, -72, -20, 13, 96, -201, -102, -70, -275, 119, 21, 58, -164, 223, 74, 61, -40, -62, -64, -73, -46, -324, -37, 78, -56, 252, -22, -46, -157, 57, 64, -145, -285, 59, 40, 26, 185, 150, 113, -3, 101, 69, -103]
7055a03K69l05J29J90k27J67l20K53j93J85j64O5J19k00L56j66j31J75k14M02
7075B87k96J66k92J94J40k56J56k72J01q6J46o6J60P7m8j4j45K68j5k26N6k9P1
7098G7j43K9R1p2j00J67j8J46j08k06R9K09k36J86l49K90p5Q9j78L1J33P1l1r7
7122EJ69l94M73k80n9Pr4K50R4Kj00n7l1j59L33j44k00M18k05K14m04J96P9j69
7146e6J10j81K75n7j02k7r3K65Lj69J47r7L6J36k08q9J81m1q2P1l07M02p9j17
7170g9J8K40l31L8Q4P7j36j03K68r9j3j84K63k5o1Mk2M34l84M6m21M51j78J62
7194D9k77J27K98k0k76j09K46Pm9m9J32j74KJ01j8L0K36l95P1l6J33k76L72l78
7218b53L14r1K05o5j01o3J71k93K1%J9Lj08K66l3J53j3k08J89K9j87J4j6P0k46
$$ y = [-103, 166, -139, -10, 180, -47, 120, -200, 53, -140, 45, -119, -54, 65, -135, 221, 55, -76, 99, -115, 287, -9, 157, -135, 59, 199, -57, 99, -173, -72, -158, -12, -78, 82, 159, 111, 97, -48, 220, 205, -21, 35, 6, 77, -66, -37, 54, -18, -118, 49, 31, 177, 69, -137, -38, 171, -65, 121, -228, 62, -13, 76, -102, -71, 62, 133, 102, 5, 174, -220, 253, -27, -86, -79, -173, 77, 171, 173, 73, 16, -15, -174, 159, 15, -185, 233, 28, 242, -162, 34, 113, -56, 54, -127, 148, 91, -11, -38, -131, 134, 137, -32, 115, 18, 54, 190, -18, -107, 74, 33, -49, 22, -285, 117, 38, -79, -61, 179, -152, -114, -30, 47, -89, -192, 76, -23, -36, -220, 43, 18, -43, -39, -61, 373, -11, 35, -386, 65, -113, 49, -228, -101, 197, 177, -99, -208, 38, 45, -4, -53, 79, -95, -93, 8, -10, 20, 256, -139, -68, -104, 29, -247, 125, -253, 61, -30, 175, 110, 9, -54, 117, -176, -155, -155, -136, -133, -241, 25, -8, 145, 132, -76, 113, 142, -45, -31, -47, 23, -223]
7243b23L50m36L98m26M90j61j9P9j61M2J56j44J56p8q1j16K40j66K28o2r1J9P6
7266G0N3j31oj56L4K32p1q2J01p6j09N4J09o1K13j55nj24J05j8J21l3q6K49k05
7291B3j14J50j63J50K04k17l4rk98l0L16j04M3P6oM0l25K58qJ3J25o1N3j41L6
7316b3k53L01J09n6j71q5K87q7L1R2k9j23j03J43R7j32j11P7n3R5J9J49l09L50
7340B15n24K09K11k94J06R2J57k71Q9j74K11j19j7R2j81P5Q8J26m1L2r8j35J23
7363b8K31j56l1j21J65m1P4J2n3q7KJ58k09J62j49O8J32k21K70m82K19K12k05
7386g8n0N2K37l04n0K80l60L04j54K1K64j32K9j72K55p0q6J17o2j29J6J4J26j24
7410e6l0K9L03k53p1q8M2j74Q4K62QJ95l36KkJ14n8J19l06L95K7l25J36J10p8
$$ y = [-223, 127, -309, 89, -337, 153, -8, -27, 52, -109, -67, 89, -55, 101, 23, -58, -174, 66, -100, 128, 66, -25, -6, 70, 123, -8, -14, -170, -136, 96, 25, -57, 44, -32, -141, -87, 22, -39, 174, 19, 14, -110, -5, -23, 98, 65, -21, 228, 23, -91, 59, -104, 46, 250, 33, -1, -10, -308, -338, -22, -126, -83, -7, -13, 27, -298, -40, -48, -35, 90, 29, 82, -59, -23, -276, 25, 134, 78, -93, -178, 109, 22, 53, 145, 116, -7, -110, 33, 130, -2, -113, -36, -89, 6, 25, 174, -135, 215, -309, -100, 111, -183, -77, 15, 172, -99, -10, -184, 27, -92, -109, -17, -198, -123, -35, 91, 50, 82, -16, -151, -28, 203, 47, 16, -105, 60, 19, 93, 105, 52, -35, -33, 125, -84, 78, -71, -3, 129, -92, 178, -304, -85, 127, -78, -128, -76, 161, -143, -193, 87, -273, 31, -123, -102, 162, 30, 59, -113, 142, 72, -14, 103, 41, -88, -72, -58, 68, -56, -86, -57, 246, -7, -78, -166, -124, -298, -214, 48, 56, 251, -85, -83, -85, 29, -29, 90, -216, 179, 206, -119, 17, 127, 49]
7435D9l58M33L5l44K48j98K0m2K27j01j23J2K07j08k3J31j14k88L55K9o7J88N3
7458B21j20j72K07k51K1P7k21K35J25Q8J28m11L32m98M08k83J60O0j29l9M1k3
7480d4q0Q5K9j49M7K36k80j27K59q7k85L62n4J11M2p5p0N9J74j62Q6Rn4J75k52
7505d5O6j13R9P3o0p1jL3L5k03M41k58J59k12J84j68J77j54j94K96q5J16J51k18
7529D8Kr1j31K61j38M5l13M48j81m6K35O6k63L6k9J87l7k7j48K98l22K29k72L84
7553B41l88M6J09n7n1J0J32r8L9M0R8j97J30l16J56k4J60L1k47J30L1J1O3K29
7577B78k23j02q3J21J77k78K75k23J91l84K64M2K41k11m7J7j75J69o6n1j41J12
7599i7M6Q3j6pm8J25l20M42k49J31O7l1j72K34o0j08p5N3j65L67m04K27N0k74
$$ y = [49, -309, 124, 159, -185, 63, -135, -115, -157, 70, -31, -154, -142, 65, -43, -66, 65, -49, -337, 18, 47, -20, 168, 221, 101, -71, 136, -115, -94, -17, -238, -3, 122, 210, 338, -73, 259, -239, 169, -114, 46, 106, -23, -62, -21, -44, -124, -39, -10, -159, -112, 124, -156, -283, -24, -111, -396, -34, -88, 23, 65, -10, -80, -21, 153, -9, 77, 86, 32, 207, -45, 21, -92, 7, 80, 20, -51, -52, -19, 16, -187, 254, -4, 155, -57, 127, -41, 136, -18, -212, 84, -1, 115, 266, 48, 50, -41, -172, 89, -49, -4, -317, 131, -50, -96, 139, 205, -58, -22, -51, 136, 99, 72, -76, 222, -100, 129, -143, 241, -147, -101, 8, -49, -100, -90, 42, -56, -17, 23, 121, -76, 54, -262, -106, -130, 30, 61, -186, -56, -25, -14, 49, 278, 55, -47, -130, -9, 168, -110, 165, -58, 133, -251, 13, 55, 296, 85, 38, 55, -120, 49, -17, -68, -209, -97, -51, 32, 16, 9, -39, 86, -234, 208, -41, 90, 157, 126, -46, 188, 128, 20, -55, -2, -167, 200, -204, 23, 73, -201]
7623b01J24N3J76M1m00K26m1q5K27p5j42J70N0j23m6J01j17J8j25N4M9m1K25l07
7647a89K05J28j20J9j74K98k16n4J22l07L79j61K96k89k06K85N8m26K48J6m4P
7669a25r0L6N4J88K7J4n4m10O54m20K14LR0k02J8l12J75J04J97P1q5n47L47k25
7693b78O63n57N79n03l06Q11r44K68r9M92k88K61j87P82n49L5m11j94N76j72K84
7714B63n35M73l31M52p0n20M57K53j91m6p0q06J080q46M97K44k60l65M38n80L47
7735a16N4J50O0j77M20k70j78J86K49po88J91k05M21k32n8M07j93O5R7j54p2M9
7758ar3J97j04k74K14l75O96j4j44N88l72l89L90nj05q9j43J00p4r4j93K54k3
7781e3J32j43J25P0j99j09M29l64K40j21L10j60rj37r6P4J33j67Q7m05K28J27
$$ y = [-201, -77, -24, 152, 193, -207, 19, -22, -107, 120, 45, -97, 73, 123, 0, -46, 55, -62, -44, -169, -115, -66, -107, 118, -189, 16, 144, 24, 43, -131, 167, -49, -103, 19, -288, 91, -70, 226, -63, -269, 16, 74, -352, -104, -88, -132, -125, -215, -179, -125, 63, 90, 104, 50, -360, 294, -126, 88, 91, 181, -21, -3, -315, -140, -36, 161, 232, 147, -400, -53, -278, 385, -172, 407, -96, -402, 409, -535, -267, -366, 126, -162, 99, -88, 694, 145, 180, -231, -425, 151, -21, 263, -272, 201, -130, 322, 252, -268, 189, 442, 251, 205, 135, -671, 409, -437, 60, 304, 44, -321, 117, -463, -116, -62, 88, 148, -29, 391, 121, -57, 129, 378, 371, -317, -126, -331, 90, -142, -200, 207, 14, 79, 176, 22, -50, -1, -94, 103, -1, -275, -61, -436, 260, 246, 102, 690, 318, -71, 319, 314, 209, 120, -23, 77, 3, -91, -284, -30, -53, 79, -64, 61, 131, -68, -177, 252, -112, 128, 7, 317, 157, 148, 11, -85, -11, 122, -45, 42, -363, -135, -8]
7803hj11L6J58R3p6M9k2j1Q3n30M00l62K26R6l53L48N7j14K97k58j0j66l8q4R2
7828b08J62K14L0j10p5M7l6j8l28N21k24j37N01k35j27L8J34j87j73L65k24J35
7850F5k06O9k6N5L1O7j42L13j21j52o5j36J51L9J82k08m9J54Q2l96M53j68l3j52
7874a93K18K39m95M48j06p6j91J4m4M45p3j08j25J95J6k15J38j69J20n9J12k26
7896a35J74l3J46k39j21L22K08k15j43p7L77j92m3k31J85J20J0j48L1K84l83r8
7918b01p0L16k09R4l5K90k18J07O4j94P5J04N2j20k19Q4Ro6J36J13Q1j36p9j56
7942a78j21M52k6j23q9l4J10m9n4J40l26K96mM3r3k3M1J22m6j28R3L1Q7j49P4
7967D6J8o6J6j0r7j53J34j2NK52k18K29l85M25j83k03K19k24K09n2M0J07J43l98
$$ y = [-8, -119, -83, 75, 168, 92, 141, 119, 108, 191, -339, 61, -301, -75, 21, -332, 16, 73, -41, 256, -2, -12, -178, -216, -300, -208, -46, 168, 198, 88, 13, 60, 24, 6, -322, 199, -25, -162, 339, 104, -23, 15, 149, -38, -211, 154, -70, 65, -141, -72, -98, -43, -12, 55, -87, 226, 105, -47, -112, -248, -97, -58, 124, -84, -133, 21, 103, -293, 160, -8, -41, -193, 25, 264, -231, 217, 111, 35, -156, -142, -186, 259, 186, 78, -47, 148, 164, -51, 87, -82, 38, -21, 91, -135, 39, 6, 152, -87, -208, 114, 322, 107, -36, -113, 264, 72, 29, -202, -17, 103, 113, -35, -4, 280, -103, -201, -271, 45, -164, -70, -105, 185, -33, 74, 138, -56, 19, 123, 175, 55, -164, -80, -71, -137, -1, 112, 193, 57, -22, -178, -299, 153, 127, 4, -85, -119, -9, -58, -112, 28, -298, -2, -6, 37, -56, -79, -38, 84, 38, -90, 3, 34, 121, -28, 46, 64, -2, 14, 4, -93, -246, -112, -124, -119, 133, -85, 144, -241, 184, 1, -202, 17, -207, 2, -50, -10, 97, 240, -158]
7991a58J86n1K88p2j66k44K38j1j30L62k46J89k55O4K44k36N0p9j4q9L40l84N21
8014C47l16J4J23O2k41r4J45M1O3J0j74j8N5J56l96J0L17j56qQ9n2m2Q9j46R8
8039b4j42N63k74k58Q0k42L47qk65K84j70J90j62J58r1k4p4j62N03j16m9j59K66
8062A71J6k98J74j01jj07R5J09Q1M8j54j16kJ48o3j35L1P7m92O72j89k29L36l54
8086b83J06R5J88j54kj3pK26j84o3pM42k35r7k06K25J12j90q1K0K41q0p2J1J86
8111A78k09J74K11l75p9L1K21k14n3K0J1J27K06k40j3p4O3k6P1j69J15p0K39l84
8135b39R3K76j10J04j52J2k03K90j2l6J92k17O6n7j79O0K18l8j2J31n5k58J67
8158D1k1K44k98L0k7j00R8J58l1k42PL27r7j05p1k2K25j86J28k28K44N0m1k37
$$ y = [-158, 28, -23, 265, 193, 27, -217, 21, 10, -120, 242, -4, 185, -70, -6, 238, 2, 52, -27, -41, -130, 210, -174, 347, 31, 45, 168, 230, -11, -105, 40, 81, 144, 154, -20, -38, 17, 173, -223, -213, 104, -52, -60, 29, -23, -65, 24, -122, -24, -166, 397, 123, -135, -55, -297, 50, 42, -223, 61, -109, 81, -81, 77, -14, -38, -112, -274, 229, 113, 64, -95, 171, 187, -111, 63, -38, -39, -146, -51, 58, 139, 187, 33, -83, -85, 63, 0, -135, -104, -27, -519, 153, -36, -265, 71, -283, -177, -82, 106, -48, -50, -63, -70, 156, -28, -91, -98, 344, 109, 12, -194, 31, 143, -47, -128, -108, 133, 53, -19, -8, 178, -31, 143, 354, -21, -100, -69, 152, -62, -115, -95, -84, 43, 249, 9, -4, -78, -15, -41, 30, -139, -24, -94, 145, -239, -146, 130, 20, 124, -28, -16, -219, 71, 59, 23, 215, -2, 64, 7, -172, -112, 106, 68, 56, 187, 132, -126, 41, 20, 264, -34, -4, -31, -131, -33, 125, 94, -148, -141, 186, 89, -16, -87, -109, 116, -70, 58, -170, 74, 124, 83, -154]
8182a54O5K21o4j41J21J61l86K48j40
$$ y = [-154, -89, 132, 68, -73, 48, 209, -177, 71, -69]
8191f9
$$ Imaginary data points
##PAGE= N=2
##DATA TABLE= (X++(I..I)), XYDATA
0@%%%%%%%%%%%%qJ6j6J6k4L2l5M3n6O4p2Q8j04J24j48J71j96K25k59K99l41L87
34B06m40M96n59O29p03P86q78R77j086J205j333J475j631J798j983K187k407K651
52A390k922L219l550L923m342M817n362N994o738P627q712J0077j1849J4253j7740
67i915K3344l4350R7707k09006J1398Q1966l6311K90949j12230j39429n6033o7412
79a59322K06267P5304o5239k8486k03042P1325J20447O0098J27549k42378j28721
90a66198J38188m8761K03531P1068k46017k5533n0549R1341J95288j16904k4971
101B0483r5882j18069K30871O5491k5391j4505k02135L3953R6132N5871J40199
112A87018j58242j38179M1074j660J67639K6949j27771l5032j21110J14453J82888
$$ y = [0, 0, 0, 0, 0, 0, 0, 0, 0, 0, 0, 0, 0, -8, 8, -8, 8, -16, 16, -19, 24, -32, 32, -40, 48, -56, 68, -80, 91, -105, 120, -139, 160, -181, 206, -234, 262, -297, 332, -371, 415, -463, 514, -572, 633, -700, 775, -856, 942, -1041, 1146, -1261, 1390, -1532, 1687, -1863, 2060, -2282, 2535, -2827, 3167, -3571, 4056, -4656, 5421, -6428, 7825, -9915, 13429, -20921, 76786, -132220, -120822, -38856, -75167, 215782, 103552, -35877, -91910, -159322, 46945, 122249, 57010, 28524, -174518, -103193, 17254, 77352, 204901, -37477, -166198, -28010, -76771, 126760, 197828, -48189, -73722, -124271, -32930, 162358, 45454, 20483, -75399, -193468, 37403, 102894, 77503, 62998, -139137, -105184, -9052, 46819, 187018, 28776, -109403, -68329, -69989, 97650, 124599, -3172, -38204, -159314, -44861, 138027]
123A38027q8545j59j05177j17122J72048O3940L9168o577j92602R692N7840M5649
135A6182J28100r8751j13271j6254j070J61885K9132q8951l8120j23027P3871
146g0274J60580j7151P087j09602j00348J05408M5176P1641N474j60851j3971
157g6831K6103N4726J15740p5885q5832m0029k2001J50223N5358n5307l8245j18685
169a10665L3544J21229K1136K7025r8333r4875O3600L5938P8317J0301j29112
180d1895k8719k514N9614J17629m6577o4858n5831m1014J18151O5874j5554l3125
192C1181j11247Q758Q5598L5411L6701q3452q6678K8589L2437Q8007K0539r8279
204a2435m1533k8170N0569J10306j2803m1977o3234n0243Q4457O0790Q143k6227
$$ y = [138027, 49482, 49323, -55854, -172976, -928, 63012, 102180, 95603, -96999, -87307, -29467, 16182, 144282, 45531, -67740, -83994, -85064, 76821, 105953, 17002, -21118, -144145, -70274, 90306, 73155, 80242, -29360, -129708, -24300, 20876, 92517, 97991, -62860, -76831, -50728, 3998, 119738, 43853, -41979, -82008, -104009, 46214, 101572, 46265, 8020, -110665, -77121, 44108, 65244, 92269, -6064, -100939, -37339, -1401, 76916, 87217, -41895, -70614, -73128, -13514, 104115, 57538, -7320, -63151, -104165, 13986, 79860, 64306, 31181, -80066, -71308, 14290, 49701, 86402, 2950, -83728, -55139, -22702, 65305, 85844, -12435, -53968, -82138, -31569, 78737, 65934, 23957, -39277, -89520, -5063, 55727, 63870, 37643]
216C7643j01677p806O2149M6640M5572o3673q2734k568K5239Q7237L5800o1125
228B0697n0233m4443L7846Q8355R076k2491o7828n0939O2252N2212K6638j5574
240D5568r4781k6199M3587N0609N6590l3759p7270k5967J7069P0149M3738l0006
252C9328n4452m8616K6293O7455K6536j0005o8509n2903L7761N0391M4455k774
264E4960p9821l8973K0387M7189N9316j3031o2253l6991L822N7036M8677j5177
276D5141n2060n0658P757N8009M3739m01n7155n3737Q539M5964N4628N366n6503
289a371m2928k097M1897N7441k152m9655m3240r408M6394N4659O11m5296n1099
302d6244j1070M3904N4538J1121m1171m9230j2272L7173N2697J3070l9021m8272
$$ y = [37643, -64034, -71840, -9691, 36949, 82521, 18848, -63886, -66454, -41215, 46022, 81822, 20697, -29536, -73979, -36133, 52222, 61298, 38807, -29021, -79960, -17708, 34504, 61142, 45568, -49213, -75412, -31825, 18784, 75374, 41615, -35655, -61622, -44553, 25596, 69334, 39328, -15124, -63740, -37447, 30008, 56544, 46539, -21970, -74873, -37112, 13279, 57734, 54960, -24861, -63834, -43447, 3742, 63058, 50027, -12226, -49217, -45395, 11641, 60318, 45141, -6919, -57577, -49820, 8189, 51928, 51527, -5628, -59365, -50826, -4862, 49766, 55132, -1371, -44299, -46396, -4499, 52942, 50790, 1135, -42105, -51513, -5119, 49540, 50151, 4855, -46244, -57314, -13410, 41128, 52249, 11078, -38152, -50424, -13251, 39446, 52516, 13495, -34777]
314c4777j3713L5247N1705J5202l9330n1824j5894L0431N4335K1065l4867m7614
326c0034k0821K7133N3212J9930k6876m7370k3558L0351M6175K2102k3854n5854
338b9464k0939K5728M3511L2756k5126n1555k0830J4188M8797L1721k2946m0724
350a4883k9522J6886M9626K2012j2680m5885l5543K3378L9732K9659o078n3845
362a7143k8036J3321L5192M1010j1855m3287k5694J281M5260L3811j3786l2311
374b237l9234N857M7209K4405J451l8845m4013J2561L0843L4614P720m4911k9408
387c3988R66K7151M5171m613l4683k8237j1769M0749L6611m354k3209m5200n766
400d1171L8822K6986J4026k9802m3889L432K0679L6240J6103l7911k7896q522
$$ y = [-34777, -48490, -13243, 38462, 53664, 14334, -37490, -53384, -22953, 31382, 52447, 17580, -30034, -50855, -23722, 29490, 49420, 22544, -24826, -48384, -18033, 28142, 50244, 26390, -29464, -50403, -24675, 18836, 51592, 26466, -25089, -45919, -31731, 17066, 48787, 25841, -14883, -44405, -27519, 22107, 44119, 31439, -14446, -49989, -26611, 13121, 42780, 36702, -17143, -45179, -31858, 3334, 44344, 32489, -10798, -36492, -35211, 10049, 43860, 30074, -2237, -41471, -35614, 11595, 36000, 37451, -1394, -45407, -32846, -2003, 32611, 40331, -4580, -33988, -33022, -5871, 39300, 34687, 4, -28233, -40002, 747, 37358, 33004, 9795, -35405, -41171, -2349, 24637, 38663, 8861, -35028, -31596, -10917, 25323, 41426, 3515, -24381, -32903]
412c2903J9537M6490K748k5900l0433k3221L2568L7111O053j3625m4352j2938
424c8865K8059K6147K2666k2704m0858l317J1652L6567K2590l0954k5830j8474
436c3321R145M7581R951j6968k6580l0384K0226L5530J4242n834m0153j7809J8192
449a6182K5339K8976j7207l7562r218R56L4876K9088k2756k1735k3751j377M2256
462A1703J6555p270k3339l2498J2261K9979J9311K722l8127k2113J0802K0228
474B14L4042o971l5943j3987n048K7246L0805j0303j8860k6496m468L3369J7128
487B0728N220k0263l6912Q606K2884K0717J3662l5296k6237N820J2490L3308N516
500C0243l1637j8190p039K0472K7516J213j3388l1294o821K8632J4574J3976j3541
$$ y = [-32903, -13366, 33124, 35872, 9972, -20461, -43682, -11114, 25997, 32050, 18425, -25927, -38865, -10806, 15341, 38007, 15303, -25555, -28872, -17220, 19347, 41937, 10983, -14847, -33321, -24176, 23405, 33356, 16388, -10192, -40576, -20350, 15180, 29422, 23588, -16565, -34374, -16182, 9157, 38133, 20926, -16636, -25854, -24898, 9978, 39066, 16310, -5425, -29176, -30553, 11703, 28258, 20988, -2351, -34849, -22588, 7391, 26702, 29424, -8703, -30816, -20014, 214, 34256, 27285, -8658, -22645, -27693, -447, 30358, 20055, 1195, -25301, -29769, 3600, 20728, 25948, 5685, -31227, -22621, 263, 20980, 34642, -654, -26891, -21071, -8581, 24727, 30243, -1394, -19584, -26623, -6151, 21365, 22578, 9190, -22104, -28925, -293, 14281, 28257, 14716]
513A4716m0823K310J6370J9905K2533k7952k8990R63O456L0756J2586k2773k0247
526a4190j3483J8458K6109L478l494l0567j7317K5003J5871J5074n479l6396o008
539b2941R118J9728K5995k0290k5702p053L312L0973J1694j3429j5855k4502J4253
552a4699K9474K047K718k3501k4465J5754J6225J8549j421l1242q846K073J7561
565B27K7777j2848k1078j4021k654L1870J2053p195j0012k9458N736K7728O522
578A4647N620k0370k2246P973R933K3987L601k9349r559l522J4731K8773p312
591A6907j4619j7812j0158K9048J4263k398o811k8449K38J9517J1321J1949k0533
604B463k0709M238M058K5003R114k3726j1471j0178J2780K7438k789p898j8671
$$ y = [14716, -26107, -23797, -7427, 12478, 35011, 7059, -21931, -20968, -14512, 16244, 28830, 6057, -14190, -27673, -9215, 16894, 20372, 16878, -13689, -31006, -6003, 9868, 24942, 19463, -16933, -22941, -13823, 5905, 31900, 11610, -14092, -21145, -17833, 13140, 24834, 11405, -4450, -28952, -14699, 14775, 16822, 19540, -3961, -28426, -12672, 3553, 22102, 20681, -10561, -19407, -17334, 227, 28004, 15156, -5922, -19943, -22597, 9273, 21326, 14131, 4119, -25339, -19603, 8125, 14647, 20267, -103, -22349, -14376, -4443, 19544, 23145, -6204, -15763, -19285, -4554, 24219, 16907, 2288, -15524, -25682, 3366, 17629, 15231, 8420, -20029, -19791, -274, 11047, 22996, 2463, -18246, -14008, -9950, 15053, 24167, 441, -11030, -21208, -8428, 19010, 16221, 8323, -10348]
617a0348j5251K2997J4856L848m923k7118k273J2527J2511J6924j7160j9955j101
630a4466J293K3899J0885j5499j1229j5769Q817K5497J172k778j8485j6418J6376
643f705J3081J0621l079k5433m413N962J2745J9403j2133j6953o764k039K2747
656G040J1245r431r149j8758M949K1959N212J491j7280j7247R978J1619J3943
669A5571N22k1900p905J015J1937J9030o449j3237j1157m400K0164J1335l125
682A1401q093k0005J997J7015Q486N709j5542j7151M692Q606J5553L964j7049
695d17j0595l193J0678J7939j973r664j2800o970J5923J1875K442p116j9013j586
709a4470J2066J0520Q505j2185j5594j125O036J6135N839j2535j0758p020P959
$$ y = [-10348, -25599, -2602, 12254, 16102, 11179, -15939, -18212, -5685, 6826, 23750, 6590, -13365, -14466, -13173, 10726, 21611, 6112, -5117, -20886, -12069, 13428, 14600, 11822, -6663, -23081, -6705, 6376, 16997, 13918, -11515, -15928, -9966, 2779, 22182, 10049, -6904, -13668, -15707, 7040, 18285, 8854, -295, -19053, -14104, 7855, 13067, 14558, -2722, -19969, -9991, 1628, 15571, 16093, -5807, -13712, -12697, -760, 18270, 11821, -1416, -12573, -16973, 3191, 14526, 11401, 3308, -16697, -14700, 2315, 10801, 16510, 968, -16183, -11491, -2885, 12668, 16632, -417, -11012, -14205, -3527, 14412, 12439, 2775, -10025, -16995, -1072, 10803, 13245, 6129, -12884, -14470, -2404, 8116, 16621, 4436, -11158, -12283, -6247, 9888, 15727, 3192, -7566, -14586, -6627]
722f627J6850K996p226j3335q547J0924J2187O525n521j7082m548O950J1827J0229
736A5602q888j3944n172L556J5514P680p691j1587q955N182J4998O461m002j3524
750d770r002N855J1971Q847l295j4555p293L504J1483J0564m201j2971q213K002
764a0074J2995R509l352j1186r983K292J2010R200j196j1640j0384K353J0635
777A179R873l65j1417j0226O91J0530J0345j26j0624j0354k86J0369J0497M26
791A0512r780j0403j100R819J0645J075r328j0528k081R680J0208K142q720j1326
805i185j881Q737J0375K962q329j1289j927P084J1176L456q339r923l701O845
819c939J1556K710o178j0612m955P575J0124M037n005j2183l624O320R443O076
$$ y = [-6627, 10223, 13219, 5993, -7342, -15889, -4965, 7222, 13747, 8226, -8856, -13404, -6454, 5373, 15602, 6714, -7230, -12402, -8846, 6668, 14348, 6657, -4930, -13885, -8703, 6295, 12756, 8754, -4770, -13772, -7917, 4054, 12901, 9606, -4949, -12242, -8738, 2745, 13309, 9108, -3863, -12076, -10074, 2921, 12430, 9078, -2108, -12091, -9799, 2211, 11411, 10215, -1425, -11809, -9456, 1179, 11052, 10687, -730, -10956, -10265, 265, 10610, 10484, -140, -10494, -10780, -411, 10086, 10512, 732, -9671, -10771, -952, 9693, 10768, 1440, -9088, -11169, -1489, 8719, 10861, 2141, -9185, -11066, -2329, 8046, 11008, 2679, -8610, -10537, -3453, 7723, 11179, 2840, -7083, -10784, -3939, 7617, 10327, 4149, -6463, -11418, -3843, 6281, 10318, 5313, -6870, -10494, -4174, 5269, 11345]
833A1345o445j1047l647L981J1038N776o728q214o831M824J1116M144l176r928
847c792p631O386Q634N938k280j1829m886L866P886Q349m375r614m976N09J0706
862B891P310m149o956q873J842J1242M516J44r034r229M310O749P723J41j1326
877b699n383J077O320J0465k885q109n591k540J0468P398k011m843j0252r6R856
892A175M873L050q151r683K411M405Q851K562j0205n372j761M972J1427j554n560
907A440o620m474Q815P084R45l195j1481q94P227N046N958p301r707O66K103R947
923E559M163q580n166m041L806J0991N9l011p316o486P902O209K947j219j1627
938e810k187M998M829P846n930q336j461L48R542N112o527m102o838K995J0417
$$ y = [11345, 4900, -6147, -9794, -5813, 5225, 11001, 4273, -3941, -10772, -5948, 5168, 9312, 6136, -3792, -11423, -5037, 3597, 9535, 7255, -4574, -9460, -5594, 2292, 10641, 6266, -3348, -8324, -7815, 2891, 10201, 6052, -904, -9777, -7935, 3307, 7823, 7967, -1067, -10296, -5986, 763, 8486, 8627, -2699, -8082, -7005, -685, 9780, 6895, -1214, -6805, -9345, 1123, 8521, 6510, 1667, -8585, -8681, 1175, 6048, 9098, 947, -8736, -6325, -1920, 6931, 9493, -712, -6084, -7845, -2873, 8554, 7000, 1440, -5180, -9654, -839, 6245, 7190, 3995, -7486, -8380, -1153, 3893, 9851, 2550, -7157, -6491, -4388, 5559, 9722, 1142, -4024, -8065, -4259, 6732, 6791, 3780, -3536, -10022, -2120, 4089, 7036, 5817, -5810, -7997, -2999, 1830, 9676, 3746, -4590, -6051, -5703, 3839, 8951, 2424, -1678, -8516, -5521, 4896]
953D896R91j1p701p512O186M851M777L96j0820k855K083M860R276m662p190l264
969e699j592R975N065m014l328q403J747R315J599K042p098p526M102L009O864
984F058J321r305l243p61M656R222k695n325m820l140R326M731j228k780q915
999f898O69O626L392L806o760p044J762J875P758K297p581l524l211M153R409
1014F729j633l220n711m225P599N021J077k548r020%M503M064M883n544o537n76
1030e138J458P883K704n116l940m721L178Q442O67j898o406m477N359M591L094
1045E680j395q007j817K739M408N294l775n765k181J16P456L581l265l996n332
1060f259J748P220K413n52n893n454L531M497M152l97p036l145J359M347N621
$$ y = [4896, 5887, 5876, -1825, -9337, -3151, 1700, 6477, 6873, -3947, -6802, -4719, 141, 9417, 4755, -2435, -5699, -7291, 2684, 7749, 3735, 407, -7996, -6249, 3066, 4665, 6707, -391, -7917, -3815, -806, 6058, 7379, -1926, -5169, -5930, -1274, 7948, 5253, -72, -4892, -8032, 1294, 6025, 4797, 2017, -6898, -6229, 397, 3789, 7595, 835, -6209, -4447, -2572, 5186, 7483, -98, -3622, -6833, -2680, 6729, 5096, 1876, -3835, -8060, -461, 4560, 5637, 3089, -5931, -5931, -1428, 2636, 7519, 1975, -4562, -5138, -3680, 4203, 6907, 1791, -2149, -6870, -3692, 4750, 5417, 3519, -2887, -7364, -2005, 2586, 5680, 4285, -3722, -5539, -2800, 1608, 6902, 3127, -2638, -4819, -4703, 2753, 6334, 3069, -927, -6259, -4511, 2709, 5122, 4570, -1323, -6777, -3246, 1251, 5403, 5006, -2030, -5175, -3816, 531, 6152]
1075F152j966n028l539r36O404M283j244l902n582L56O034L275Q55m717o224J792
1091c987L962M697R48n827m287k40L910N771k63m428m076j730M914M983J63k762
1107A748n934j246M808M002K067l937n914p8L018M809K530m955m285j213K212
1122b368O202Q85l216m179k550L105N158J745k199n743k032L479M037L029l096
1137B257n256j379J483N378L051l667l834k614J382N778K095k210l950l673K213
1152b946N113K106j176m803l050J954L876L484j596m744k437O26M927L581j854
1167C061l918l599P42M965K813n86l956m165J099M244L252M6m447l687N74L778
1183B16L861l17m200l207k97L779L966k89k962m307j99M136K955P75l448m276
$$ y = [6152, 4186, -842, -4381, -5317, 1087, 5370, 4126, 224, -5358, -5002, 1032, 4307, 5162, 445, -5779, -3987, -25, 4672, 5620, -207, -4494, -4734, -824, 4947, 4684, 256, -3820, -5550, -636, 4347, 4510, 1748, -4186, -5432, -624, 3378, 5445, 1508, -4406, -4484, -1466, 3343, 5873, 918, -3367, -4580, -2368, 3834, 4719, 1503, -2676, -5226, -2121, 3037, 4782, 2583, -3160, -5192, -1713, 2324, 5353, 2257, -2999, -4378, -2895, 2483, 5534, 1867, -1967, -4581, -3199, 2579, 4674, 2464, -1486, -5159, -2946, 2167, 4273, 3097, -1706, -4756, -2802, 1074, 4558, 2962, -1782, -4219, -3593, 1334, 4915, 3061, -857, -4456, -3714, 1251, 4064, 3478, -478, -4643, -3544, 700, 3952, 3998, -449, -4136, -3562, 216, 4077, 3760, -440, -3647, -3944, -165, 3801, 3512, 550, -3757, -3956, 180, 3135, 3910, 462, -3814]
1199c814q8L602L541P17l441l937m38K645M661O57l312l675j194L053M088Q85
1215C950k664l950j348K891L678J302k458m067j202K223M076J338k181l913j452
1230c777J699M474J546k143l814k210K226M287J500j988l817k112J879M094J905
1245C749j446l846k419K159L426K342j665l806k191J138M037K361j470l730k470
1260c831J364L562K409r29l416k842J112L360K672q33l279k778N75L377L002m92
1276C033l707k561L68L232L037l89l250l018L25L059K875Kl116l006J38L122K453
1293B597L48k565l385l7K570L153N55k773l308k47K467L025Q58k487l181q70K392
1310h88L585M05j992l261p99J973K847J368k533k768j072K156K845J362k268l053
$$ y = [-3814, -3902, -300, 3241, 3958, 517, -3420, -3858, -1213, 3448, 4105, 793, -2882, -4076, -1023, 3065, 3950, 1286, -2664, -4012, -1121, 2557, 3859, 1401, -2666, -3868, -1645, 2431, 3769, 1588, -2325, -3777, -2078, 2396, 3942, 1799, -2015, -4225, -1999, 2288, 3788, 1800, -2017, -4129, -2250, 1844, 3749, 2303, -1543, -3962, -1803, 1623, 3965, 2300, -1506, -3697, -2559, 1478, 3839, 2369, -1361, -3831, -2467, 1095, 3504, 2575, -841, -3683, -2571, 789, 3461, 2628, -651, -3429, -2854, 523, 3525, 3033, -674, -3235, -2867, 365, 3402, 3013, -237, -3255, -2930, 129, 3004, 3006, -110, -3116, -2978, 144, 2597, 2945, 380, -3005, -3042, -472, 2681, 3236, 463, -2845, -3092, -625, 2400, 3258, 771, -2410, -3280, -888, 2697, 3102, 1110, -2151, -2950, -977, 1870, 3238, 705, -2063, -3135, -979, 1866, 3228, 960, -2093]
1326b093r82J682L176J553j982k872j961J924L311J303j646l045j712J732L121
1341A509J457j294l406j294J146L282J621j280k812j931R22L103J959j154k762
1356i34j880P99L110J677q59k341k688Q78K866K025j82k779k266L76K542K400
1372B744m46k744k189K94K970J925l62k300k518J75K858J951j17k118k831K98
1388b410K566K091K84k466k395q1J934K889J2k363j981n86K299K427p5j755k331
1405a941p59K158K257J054j946k750m29J489K635R75k263k289n14J146L089L76
1421B288j629k008j191J722K201Q55r73k810j047J529K183J511j157k924n33P03
1437a280K274J785j623k345j089N41L249N86r77j831j894J458J825J276j56k702
$$ y = [-2093, -3075, -1393, 1783, 3336, 1354, -1518, -3479, -1555, 1756, 3059, 1413, -1632, -3344, -1612, 1509, 2966, 1672, -1734, -3028, -1882, 1400, 3021, 1741, -1071, -3002, -2080, 1023, 2982, 1828, -934, -2814, -2015, 1095, 2772, 1913, -428, -3116, -2238, 628, 2653, 2471, -308, -2574, -2198, 344, 2744, 2298, -446, -2635, -2341, 629, 2554, 2192, -108, -2626, -2451, 407, 2358, 2241, 123, -2708, -2410, 156, 2247, 2531, 65, -2330, -2411, -477, 2412, 2424, 61, -1920, -2506, -207, 2220, 2145, 390, -1941, -2700, -542, 1715, 2769, 823, -1927, -2356, -867, 1768, 2743, 480, -1809, -2323, -1177, 1912, 2288, 659, -1349, -2540, -818, 1383, 2238, 1265, -1545, -2592, -1063, 1120, 2631, 1474, -1450, -1983, -1280, 994, 2779, 1156, -1189, -2278, -1737, 1512, 2098, 1121, -710, -2604, -1146, 679, 1955, 1799, -903]
1453i03j170N22K081K199j151k290j383J68K378J994q39j955j946L50K702J253
1469B010j96k064j929O79J596J832k5k366j506K58J517K221j98k029j512n01K022
1486a91K159k13j170k436j02K220J350N51j966k130j6J620J840Q61k233j502o11
1503a969J486K346K6j348j665j396J998K181J14q59k510m72J657J529J208j335
1519I91k620j99J027K049P80j407j734p52M92K558P56j178j518j448J340J836
1535I73R44m40k541j075J371J341J543j278j624q23J53K057J769j625r71j464
1551a690L55K329O58k42j778j458O72J459J299J11k096j420N11J467J819n74j777
1568c55j262L62J651J301l41j479j401J94J620J134N26j995j584K53J201J772
$$ y = [-903, -2073, -1551, 530, 2729, 1578, -712, -2095, -1927, 451, 2445, 1606, -349, -2295, -1945, 757, 2010, 1814, -250, -2179, -1500, 96, 1928, 1903, -463, -1969, -1711, -194, 2027, 1829, -200, -1712, -2213, -191, 1968, 1755, 585, -1851, -1953, 267, 1617, 2168, 202, -1928, -1944, -324, 1516, 2377, 144, -1358, -1969, -483, 1863, 1889, 541, -1124, -2520, -522, 1659, 1773, 914, -1596, -2068, -411, 1118, 2326, 991, -1629, -1828, -801, 1248, 2028, 621, -1113, -1865, -1373, 1185, 1941, 763, -755, -2203, -863, 973, 1917, 1477, -1064, -2139, -768, 573, 2116, 838, -786, -1609, -1456, 601, 2370, 745, -226, -1690, -1335, 994, 1652, 1410, -368, -1826, -1154, 305, 1604, 1715, -381, -1801, -1290, 177, 1996, 1422, -355, -1617, -1255, 396, 1697, 1356, -123, -1524, -1330, 290, 1424, 1950, -45, -1629, -1376, -175, 1597]
1584A597M1j828j034k48J380J735J9j558j405m58J522J460K72j216j493o35J503
1601c46J232O79r67j808l97R68J765M10j163j477m51Q64K054J31r85j516q09J138
1619f78J838M16q30j742o26R01J635N84p61j510q35R56J612P83j045j417o64M71
1637i12J671M04k82j432j046N98J519R17l78j441r94N44J376J056q04j223q56
1654a283J93J481O94j55j091j176K01J373R75k68j089j208J92J182J229J2j337
1671g5j257K01J017J665l13j122j277j9J101J283K3j154j199j62J096J263K10
1688A281r85j288q2J063J066L49j232j236m89J340J343Q7j099j060n76J175R25
1705E82O09p45j150m94Q21J168M47n82j382o17Q93J371K82p03j320l62N15J199
$$ y = [1597, 1638, -190, -1224, -1472, -92, 1643, 1662, 104, -1301, -1759, -237, 1223, 1495, 279, -1214, -1849, -346, 886, 1565, 598, -1210, -1607, -639, 1126, 1536, 373, -1104, -1555, -691, 1363, 1494, 509, -1007, -1816, -678, 1160, 1576, 746, -996, -1622, -721, 914, 1498, 737, -773, -1608, -652, 960, 1743, 698, -719, -1383, -912, 759, 1163, 881, -551, -1597, -999, 520, 1437, 1059, -382, -1376, -832, 544, 1600, 796, -427, -1283, -1090, 391, 1085, 930, -161, -1337, -1136, 237, 1212, 944, -145, -1353, -1161, 21, 1250, 1262, -75, -1332, -1131, -114, 1551, 1238, 116, -1161, -1180, -79, 1204, 1227, 73, -1126, -1288, -192, 1071, 1281, 296, -992, -1074, -11, 1055, 1404, 172, -1064, -1553, -213, 1130, 1217, 118, -942, -1518, -343, 582, 1191, 446, -704, -1198, -377, 791, 1238, 656, -726, -1343, -450, 921, 1203, 500, -820, -1182, -667, 532]
1723E32P98m14j619o36O74J246P32p88r31q57O25J152O77m33j325o01O95R30N62
1742A019k65j156p91L86J268P05k49j551m88K87J082P04k37r61p49L36P01J068
1760A109j75j059q58J29J204O31n0j189q25J36R18J117k72r24p46l16J082J133
1778A045K92j416o70k32P46J148J31r73r25k66Q40J277K4r56o00m47O22J223Q4
1797I47p07q76m86O51J442j47j99r86r66Q28J423K5l29j209m03N64J066M07m07
1816F38j089q15O78J016M52j89j170p31P18Q30Q63p83r21k62K45P86N35k24j296
1835g19k03L18Q43P34k63j019o98L98Q45O89m22n68q56K69P77Q55l30p08q69p
1855i34J081P39j87p54q60J29Q90Q24J09j031q35N2P95R54j90r74n25pR51O62
$$ y = [532, 1330, 916, -703, -1339, -665, 581, 1313, 525, -406, -1263, -638, 514, 1191, 758, -567, -1168, -473, 457, 1019, 754, -402, -1193, -807, 461, 1166, 917, -634, -1122, -835, 247, 951, 714, -247, -996, -660, 41, 1109, 934, -125, -983, -854, 350, 981, 931, -258, -1083, -947, -29, 1088, 816, -108, -854, -1170, -88, 1045, 1337, -79, -749, -981, -235, 913, 1044, 71, -854, -1120, -280, 997, 1021, 65, -535, -982, -360, 863, 947, 240, -636, -1122, -471, 971, 824, 625, -361, -1327, -499, 924, 949, 620, -589, -992, -428, 638, 1045, 638, -451, -1266, -588, 428, 880, 691, -479, -1210, -492, 338, 1201, 418, -503, -765, -520, 266, 801, 577, -719, -922, -604, 239, 973, 710, -309, -1007, -609, 236, 925, 503, -65, -921, -652, 125, 980, 650, -58, -927, -934, 147, 886, 699, -55, -915, -786, 104, 928, 1037, 6, -829, -777, 18, 972, 782, -192, -717, -724, 227, 889]
1875H89Q7o13j342K22O32P61K00o94r11j69Q34Q87L8q18n48k59M39Q90N11p16
1895C20r21l6M79P49J02n65q77k22M90J222K2l32r95m76O98P00N95n94j032n57
1915a230Q65Q37M76n90n83n64J34J068M16m29n78o14M60O58M06k51q00n41N16
1934c44N24O27k41p95n03K50Q15N54l56p34o86K50P80N51j93m57r19K43P07N28
1954F01J78p68p95K21N13Q12kp32o27k20J050K96K24o55n59l74P21P58q6n40p33
1975g17O2L23O53J1m05j84m97M79Q32j23j29o25n47O81N80L91n03p90k85N72Q26
1996F05M80n62q41m70K49Q59L18l13n53n88N92N61K01l03n93m24L43P11K55m9
2016D78q82j41K67N91L01j90o19n93K06Q55L38k33n38o23K35M47P93l36n12o16
$$ y = [889, 976, 363, -979, -757, -125, 636, 836, 142, -769, -938, -104, 783, 821, 3, -545, -804, -365, 525, 1036, 320, -601, -637, -158, 591, 693, 128, -749, -971, -481, 741, 763, 431, -564, -1040, -342, 358, 953, 359, -673, -1230, -365, 472, 948, 358, -225, -789, -655, 413, 829, 400, -178, -792, -332, 326, 732, 481, -319, -860, -344, 180, 807, 566, -229, -732, -482, 333, 887, 531, -203, -889, -639, 141, 692, 499, 42, -877, -634, 73, 601, 779, 11, -784, -563, -50, 762, 760, 28, -599, -819, 231, 527, 751, 96, -463, -837, -116, 642, 556, 16, -717, -655, -332, 321, 332, -73, -257, -754, -275, 557, 434, 305, -320, -867, -186, 394, 785, 282, -508, -793, -221, 605, 1085, 523, -318, -788, -539, 320, 638, 325, -228, -816, -224, 337, 538, 235, -358, -782, -439, 272, 527, 478, -404, -545, -278, 313, 614, 424, -195, -788, -582, 273, 611, 378, -160, -783, -548, -101, 692, 356, -156, -772]
2036g72K03M83O20J69q07n61K20P19K80O3m58p80J45O15L12J69p37n34P8N67P05
2057F99j74o47m15k1M24O83K05o38m72qL76N18O8n97l98k17N50R65l91j93p89
2078d72j80N45N64L66n04p02k4J02O82K37m29l11l23J50O39L26k14o78l15L48
2098a93N00L02j84p75l62N66P35Rl78l65k02M5O92K44l62n15j21n9O58K39j63
2119C11p97m34N85N20L64l07k74l54j1N63N71m04l55m60L3P42J77j01m41n82L10
2140c44M36M46k02l62m92P4N39L74O9n76k92k81N15L81l6k80k92k11M53N70J89
2161F78l77n68k60L77M17L15l11o47j1K00N96K87m74m16n56L44P19K73l02o25
2181c41j30K01O97N0j85o50j91L53N12q3L39o83m98L99M76K55l66m12k43K14M83
$$ y = [-772, -569, -86, 534, 703, -104, -665, -445, 274, 554, 617, 159, -621, -476, 139, 451, 620, -117, -651, -573, -6, 699, 525, -122, -537, -558, -134, 549, 754, 116, -356, -364, 12, 530, 598, 1, -397, -614, -64, 901, 510, 317, -472, -652, -107, 457, 823, 319, -383, -407, -305, 377, 614, 185, -126, -449, -299, 340, 666, 452, -226, -541, -193, 307, 609, 425, -350, -712, -146, 589, 598, 220, -145, -347, -302, 390, 634, 272, -243, -364, -423, 235, 474, 311, -486, -920, -335, 185, 549, 242, -32, -386, -397, 166, 737, 333, -22, -482, -449, 293, 470, 369, -72, -654, -344, 92, 538, 336, -26, -518, -444, 95, 469, 538, -38, -330, -611, -96, 285, 249, -31, -323, -534, -81, 489, 678, 301, -267, -527, -150, 267, 582, 271, -376, -387, -187, 409, 696, 222, -194, -750, -406, 313, 586, 284, -341, -471, -270, 427, 477, 292, -358, -549, -196, 316, 233, 572, -111, -609, -210, 266, 521, 155, -257, -500, -286, 197]
2202A97M28j30m86m76R5O74K01l89k83l89K38N72K64j81n56l87K81L33N98l75
2222B29l90m79K40N68K45j1n74k51L02L41K22l47j90j97k12M67L02N5m72k68n7
2243d77M44K66O7j71o72M88q7N91K68r68k68n6J48K38K63k34n6j3p18J350O58
2264A061n38p95l26L16M61L89l62l84l10P7M94L57l77m77k4L50L32J96k32n20
2284c12k48M28M14J91l10o46L7K87K67M50m92m33r0J58M51K37j78l55k87Q5M56
2305A10J50J23p30n57O22M81J87J16p53P7j63N94K63l95k40q0j27N06K40M1m77
2326a2m10M46J33M02o2o29k12J79R8L21K63n29j42j47L53M05k01j99n7l06J76
2347a30L58j95q2j68P3q9O63J4m24l44j85K84M68K32m77m03J18K84K64q8M2m12
$$ y = [197, 625, 495, 9, -467, -372, 302, 503, 114, -169, -558, -320, 252, 516, 335, -221, -608, -327, 6, 604, 229, -161, -640, -400, 168, 413, 402, -172, -423, -121, 220, 442, 95, -95, -292, -504, -37, 265, 320, -152, -420, -477, -33, 233, 300, 129, -543, -55, -142, 449, 717, -251, -519, -575, -427, -189, 74, -160, -216, -229, -947, 403, 1061, 523, -272, -598, -282, 179, 568, 206, -178, -488, -411, 83, 440, 63, -414, -438, -88, 244, 440, 208, -312, -560, -132, 282, 473, 163, -483, -446, -159, 108, 558, 66, -367, -457, -299, 152, 389, 211, -144, -431, -346, 110, 260, 383, -347, -904, -282, 199, 386, 502, -251, -174, -337, 257, 520, 125, -115, -195, -322, 184, 424, 465, -12, -422, 24, 157, 559, 497, -132, -344, -165, -67, 254, 517, -12, -154, -301, 52, 457, 256, 57, 0, -306, -130, 228, 33, -49, -217, -144, -233, 430, 444, 20, -324, -509, -225, 243, 475, -2, -405, -287, -3, 261, 173, 215, -197]
2369a97m15M06K54K16J40o74k84K45N15J18o3o91R8m1N28J50j58j98m26M32J16
2390G1J00j10Rm47L11J48Q0K94m10l19L2M56JQ0n28k37L40J31K55l3m66r5j8O33
2414B78K42k61j33m92PL16K86P1n70p4J21J23M19j60j52q8k81J71N70J37o42k04
2436c16K4K97L46J15j98m78l67N59L10J05k15j66l92L51K70J99j73n80j93L60
2456a42M37o2j91m63m0L83K14J41j07m54P8P6P7M54j06l10j74j84P11q0k77Ll33
2479c49J61K35L05j74k26n38M58J64K51m2l30J00j66L21nM5j56K5j66J28J21q0
2501H2N4l99j13M79J60Q4m06l46J50K51K06Ql74O5j33J29M94j80l84n7MJ59K42
2524A75J12j57p5l04J52K71J58l14l28K82q6N09j65l77R8k26N08j38J2k91J61
$$ y = [-197, -612, -206, 48, 264, 404, -270, -554, -309, 206, 324, 261, -430, -332, -373, 155, 305, 147, -51, -477, -45, 71, 171, 61, 70, -377, -66, 82, 162, 456, 46, -273, -241, 215, 216, 296, -232, -469, -129, 2, 257, 224, -242, -337, -355, 278, 520, 259, 126, -366, -359, -43, 243, 314, -256, -330, -209, -86, 333, 173, 21, -67, -348, -177, 393, 530, -112, -316, -292, 5, 351, 466, 268, -210, -577, -18, 292, 397, 182, 16, -376, -25, 245, 444, 271, -309, -502, -142, 295, 233, 42, -421, -461, -78, 136, 277, 170, -284, -206, -130, -53, 401, 295, -15, -189, -373, 338, 258, -19, -16, -349, -188, 47, 352, 178, -48, -586, -128, 36, 287, 245, -85, 15, -151, 170, 165, 210, 54, 79, -87, 41, 162, 82, 136, -263, -376, 103, 263, 347, -59, -405, -255, -4, 202, 210, -164, -99, -232, -103, 391, 211, -173, -230, -226, -67, 175, 287, 130, 55, -249, -97, 174, 332, 18, -310, -28, -114, 395, 230, -147, -49, -275, 233, 95, 107, -184, -23]
2545b3j00K75R0J12q2k99J88n38O84M4l87Mk74P2K91J99l10K4l18J85L41l2o0
2568H6k96j18K14j25N80j67o42K41m0L71Pm3j80J93k12K30K09K13p66O3M92k22
2590H8p6k6N18j018O31K26L06J01j023K04j10L25J58r1m61J58J14L59L7l2n03
2611a15%J35J30K02M04j017k95N27r1K01M07l17p89M23L34M91o65J85K37r28k94
2632h35Q60J67l66m63l98J021K16o81R83p36q59J047K60O71m88kl51p39R45L27
2652E79l69n49J91RM72m58ok48K46J69K57K1k44m5m75L99l1M83l38R6rn95L24
2675a21J71L45J31j017L65L94k5k08l97K36O7L67j35K61k82J81o85N27K21j91
2695B05o50O93n54K48j59J083j160L19k2j35O0k07o82P20j27J57j19J068n85j77
$$ y = [-23, -123, 152, 242, 354, 272, -27, 161, -377, 307, 351, -36, -32, -306, -234, 57, 256, -54, -30, -348, -163, 178, 146, 86, -210, -328, -114, -239, 341, 174, -468, -227, -267, 104, 111, 68, -112, 81, -131, 99, 308, 521, -245, -182, 310, 88, 12, -14, 504, -514, 117, 343, 649, 750, -273, -69, -179, 146, 304, 213, -248, -90, 24, 383, 420, 388, -115, -115, 20, 150, 352, 756, -261, -556, -29, -120, 81, 488, 171, -618, -195, 139, 630, -35, 150, 387, -541, -835, 25, 192, -174, -637, -1035, -14, 202, -479, 504, -232, -1091, -44, 216, 887, 399, 397, 46, -693, 252, 579, 210, -339, -148, -139, 333, -125, -131, -379, -133, 36, 293, 314, 70, 25, -450, -51, -82, 401, 63, 159, 150, -445, -121, 50, 395, 526, -491, -126, 268, 243, 35, -362, -126, -59, 308, 173, 434, 152, 333, -352, 175, 396, 205, -445, 248, -306, -58, -217, 866, -294, 25, 3, -132, -72, -279, -961, -241, -368, -211, -330, 738, 153, -24]
2715b4o04J066o16PO64j051N86p62Q79l4J50o99M25j2P06m70J60j423K57Q92J81
$$ y = [-24, -628, 438, -178, -171, 493, -558, 28, -734, 145, 111, 261, -438, -13, -25, 681, 211, 371, -1052, -795, 97, 278]
$$ [...]
8191C1
##END NTUPLES=NMR FID
##END=
