##TITLE=1H_2SR47_k
 D2O, 8 sc, 
 2.06.2021
##JCAMPDX= 6.0         $$ Bruker NMR JCAMP-DX V2.0
##DATA TYPE= NMR FID
##DATA CLASS= NTUPLES
##ORIGIN= UXNMR, Bruker Analytische Messtechnik GmbH
##OWNER= root
$$ XWIN-NMR		Version 3.5
$$ Wed Jun  2 13:16:04 2021 Russian Standard Time (UT+4h)  she@DPX200
##.OBSERVE FREQUENCY= 200.131506
##.OBSERVE NUCLEUS= ^1H
##.DELAY= (6, 6)
##.ACQUISITION MODE= SIMULTANEOUS
##.ACQUISITION SCHEME= undefined
##.AVERAGES= 8
##.DIGITISER RES= 18
##SPECTROMETER/DATA SYSTEM= spect
##.PULSE SEQUENCE= zg30
##.SOLVENT NAME= D2O
##.SHIFT REFERENCE= (INTERNAL, D2O, 0, 15.7039)
##AUDIT TRAIL= $$ (NUMBER, WHEN, WHO, WHERE, WHAT)
$$ ##TITLE= Audit trail, XWIN-NMR		Version 3.5
$$ ##JCAMPDX= 5.01
$$ ##ORIGIN= Bruker BioSpin GmbH
$$ ##OWNER= she
$$ F:/spectra/data/she/nmr/H-F/1/audita.txt
$$ ##AUDIT TRAIL=  $$ (NUMBER, WHEN, WHO, WHERE, WHAT)
(   1,<2021-06-02 13:14:58.82 +0400>,<she>,<DPX200>,
      <created by zg, POWCHK disabled, PULCHK disabled
       configuration hash MD5:
       00 E9 B6 7A A2 85 ED C7 34 08 36 98 17 FE 4E 26
       data hash MD5: 16K
       AD CC B5 64 C8 E1 C4 94 BB D0 92 EC 67 B4 7A 30>)
$$ ##END=
$$ 
$$ hash MD5
$$ 03 6D 81 E2 30 50 AB 80 59 30 E9 5C 7E AE 86 A7
##$RELAX= 
##$RELAX= 
##$RELAX= 
##$RELAX= 
##$RELAX= 
##$RELAX= 
$$ Bruker specific parameters
$$ --------------------------
##$DU= <F:/spectra>
##$EXPNO= 1
##$NAME= <H-F>
##$PROCNO= 1
##$TYPE= <nmr>
##$USER= <she>
##$AMP= (0..31)
100 100 100 100 100 100 100 100 100 100 100 100 100 100 100 100 100 100 
100 100 100 100 100 100 100 100 100 100 100 100 100 100 
##$AQSEQ= 0
##$AQ_mod= 1
##$AUNM= <au_zg>
##$AUTOPOS= <>
##$BF1= 200.13
##$BF2= 200.13
##$BF3= 200.13
##$BF4= 200.13
##$BF5= 200.13
##$BF6= 200.13
##$BF7= 200.13
##$BF8= 200.13
##$BYTORDA= 1
##$CFDGTYP= 0
##$CFRGTYP= 5
##$CHEMSTR= <none>
##$CNST= (0..31)
1 1 145 1 1 1 1 1 1 1 1 1 1 1 1 1 1 1 1 1 1 1 1 1 1 1 1 1 1 1 1 1 
##$CPDPRG= <>
##$CPDPRG1= <>
##$CPDPRG2= <>
##$CPDPRG3= <>
##$CPDPRG4= <mlev>
##$CPDPRG5= <mlev>
##$CPDPRG6= <mlev>
##$CPDPRG7= <mlev>
##$CPDPRG8= <mlev>
##$CPDPRGB= <>
##$CPDPRGT= <>
##$D= (0..31)
0 1.2 0 0 0 0 0 0 0 0.06 0 0.03 0 0 0 0 0.0002 0 0 0 0 0 0 0 0 0 0 0 0 
0 0 0 
##$DATE= 1622625298
##$DBL= (0..7)
120 120 120 120 120 120 120 120 
##$DBP= (0..7)
150 150 150 150 150 150 150 150 
##$DBP07= 0
##$DBPNAM0= <>
##$DBPNAM1= <>
##$DBPNAM2= <>
##$DBPNAM3= <>
##$DBPNAM4= <>
##$DBPNAM5= <>
##$DBPNAM6= <>
##$DBPNAM7= <>
##$DBPOAL= (0..7)
0.5 0.5 0.5 0.5 0.5 0.5 0.5 0.5 
##$DBPOFFS= (0..7)
0 0 0 0 0 0 0 0 
##$DE= 6
##$DECBNUC= <off>
##$DECIM= 32
##$DECNUC= <off>
##$DECSTAT= 4
##$DIGMOD= 1
##$DIGTYP= 9
##$DL= (0..7)
0 120 120 120 120 120 120 120 
##$DP= (0..7)
150 150 150 150 150 150 150 150 
##$DP07= 0
##$DPNAME0= <>
##$DPNAME1= <>
##$DPNAME2= <>
##$DPNAME3= <>
##$DPNAME4= <>
##$DPNAME5= <>
##$DPNAME6= <>
##$DPNAME7= <>
##$DPOAL= (0..7)
0.5 0.5 0.5 0.5 0.5 0.5 0.5 0.5 
##$DPOFFS= (0..7)
0 0 0 0 0 0 0 0 
##$DQDMODE= 0
##$DR= 18
##$DS= 0
##$DSLIST= <SSSSSSSSSSSSSSS>
##$DSPFIRM= 0
$$ [...]
##$SUBNAM2= <"">
##$SUBNAM3= <"">
##$SUBNAM4= <"">
##$SUBNAM5= <"">
##$SUBNAM6= <"">
##$SUBNAM7= <"">
##$SUBNAM8= <"">
##$SUBNAM9= <"">
##$SW= 16.9725357007746
##$SWIBOX= (0..15)
0 0 2 0 0 0 0 0 0 0 0 0 0 0 0 0 
##$SW_h= 3396.73913043478
##$TD= 16384
##$TD0= 1
##$TE= 0
##$TE2= 300
##$TE3= 300
##$TEG= 300
##$TL= (0..7)
0 120 120 120 120 120 120 120 
##$TP= (0..7)
150 150 150 150 150 150 150 150 
##$TP07= 0
##$TPNAME0= <>
##$TPNAME1= <>
##$TPNAME2= <>
##$TPNAME3= <>
##$TPNAME4= <>
##$TPNAME5= <>
##$TPNAME6= <>
##$TPNAME7= <>
##$TPOAL= (0..7)
0.5 0.5 0.5 0.5 0.5 0.5 0.5 0.5 
##$TPOFFS= (0..7)
0 0 0 0 0 0 0 0 
##$TUNHIN= 0
##$TUNHOUT= 0
##$TUNXOUT= 0
##$USERA1= <user>
##$USERA2= <user>
##$USERA3= <user>
##$USERA4= <user>
##$USERA5= <user>
##$V9= 5
##$VALIST= <valist>
##$VCLIST= <CCCCCCCCCCCCCCC>
##$VD= 0
##$VDLIST= <DDDDDDDDDDDDDDD>
##$VPLIST= <PPPPPPPPPPPPPPP>
##$VTLIST= <TTTTTTTTTTTTTTT>
##$WBST= 1024
##$WBSW= 4
##$XGAIN= (0..3)
0 0 0 0 
##$XL= 0
##$YL= 0
##$YMAX_a= 218201
##$YMIN_a= -204261
##$ZGOPTNS= <>
##$ZL1= 120
##$ZL2= 120
##$ZL3= 120
##$ZL4= 120
##$ABSF1= 10
##$ABSF2= 0
##$ABSG= 5
##$ABSL= 3
##$ALPHA= 0
##$AQORDER= 0
##$ASSFAC= 0
##$ASSFACI= 0
##$ASSFACX= 0
##$ASSWID= 0
##$AUNMP= <proc_1d>
##$AZFE= 0.1
##$AZFW= 0.1
##$BCFW= 1
##$BC_mod= 2
##$BYTORDP= 1
##$COROFFS= 0
##$CY= 11.3945322036743
##$DATMOD= 1
##$DC= 2
##$DFILT= <>
##$DTYPP= 0
##$F1P= 15.9154993809931
##$F2P= -4.1035820241983
##$FCOR= 0.5
##$FTSIZE= 0
##$FT_mod= 4
##$GAMMA= 1
##$GB= 0.15
##$INTBC= 1
##$INTSCL= 1
##$ISEN= 128
##$LB= 0.24
##$LEV0= 0
##$LPBIN= 0
##$MAXI= 10000
##$MC2= 0
##$MEAN= 0
##$ME_mod= 0
##$MI= 1.114404
##$NCOEF= 0
##$NC_proc= 0
##$NLEV= 6
##$NOISF1= 3.799351
##$NOISF2= 2.8
##$NSP= 1
##$NTH_PI= 0
##$NZP= 0
##$OFFSET= 15.70392
##$PC= 1
##$PHC0= -11484.56
##$PHC1= 9.40099
##$PH_mod= 1
##$PKNL= yes
##$PPARMOD= 0
##$PSCAL= 0
##$PSIGN= 0
##$REVERSE= no
##$SF= 200.130013532006
##$SI= 16384
##$SIGF1= 3
##$SIGF2= 2
##$SINO= 400
##$SIOLD= 16384
##$SREGLST= <1H.CDCl3>
##$SSB= 0
##$STSI= 0
##$STSR= 0
##$SW_p= 3612.71676300578
##$SYMM= 0
##$S_DEV= 0
##$TDeff= 0
##$TDoff= 0
##$TI= <>
##$TILT= no
##$TM1= 0
##$TM2= 0
##$TOPLEV= 0
##$USERP1= <user>
##$USERP2= <user>
##$USERP3= <user>
##$USERP4= <user>
##$USERP5= <user>
##$WDW= 1
##$XDIM= 8192
##$YMAX_p= 0
##$YMIN_p= 0
$$ End of Bruker specific parameters
$$ ---------------------------------
##NTUPLES= NMR FID
##VAR_NAME=  TIME,          FID/REAL,        FID/IMAG
##SYMBOL=    X,             R,               I
##VAR_TYPE=  INDEPENDENT,   DEPENDENT,       DEPENDENT
##VAR_FORM=  AFFN,          ASDF,            ASDF
##VAR_DIM=   8192,          8192,            8192
##UNITS=     SECONDS,       ARBITRARY UNITS, ARBITRARY UNITS
##FACTOR=    0.0002944,     1,               1
##FIRST=     0,             0,               0
##LAST=      2.4114304,     0,               0
##MIN=       0,             -204261,         0
##MAX=       2.4114304,     218201,          0
$$ Real data points
##PAGE= N=1
##DATA TABLE= (X++(R..R)), XYDATA
$$ [...]
2179a201K42L04N41K188k004k44m39N70O55j95j09j503O81m72J004J157m28j353
$$ -1201 -959 -655 -114 2074 70 -174 -613 -43 612 417 308 -1195 -514 -986 18 1175 747 -606
2197f06j68p4J203O03m16j403o28M11P03J973o11j710n15R80L97j64J238j165
$$ -606 -774 -848 355 958 542 -861 -1489 -1078 -375 1598 987 -723 -1238 -258 139 -25 1213 48
2215D8p29l01O63J118j23q18l44m49Q83J003r1q80o87k40Q55O37M53j108l24n55
$$ 48 -681 -982 -319 799 676 -142 -486 -935 -52 951 860 -20 -707 -947 -92 545 998 -110 -434 -989
2235i89O42R48K95o71r00k05O74R77K16o29r40k45N48N72O42m01j126m48O76R82
$$ -989 -347 601 896 225 -675 -880 -206 771 987 358 -582 -827 -279 293 935 534 -592 -1040 -364 618
2255F18N25o00r33m44K52P28R01m79r69q89R54M40P85k21r31n97N17O02N68k35
$$ 618 1143 543 -390 -834 -582 146 1047 568 -401 -1290 -336 104 889 668 -263 -860 -343 259 827 592
2275E92o73r44K63P29P48J68q60p19k40P28P42L88r46p19j39O83J016j13l60r92
$$ 592 -81 -1025 -762 -33 715 883 23 -696 -936 -208 534 922 -24 -743 -882 -199 817 704 344 -648
2295f48k57N99P24L35p30n92k23M67R92o2j98r24k46K25N90M07K31o20q66L17
$$ -648 -905 -306 418 753 23 -569 -792 -325 667 605 407 -517 -763 -538 52 459 690 70 -796 -479
2315d79J028J95l92q01l4L89j79J934r94j506O56o45M82J621k19q67r79M52M82
$$ -479 549 744 352 -449 -483 -94 -273 1661 667 -839 -183 -828 -346 1275 1056 189 -790 -338 144
2334A44N63K16j069k80k16P20M97J94k45j099q4M48J052K38j061m13n38M86J135
$$ 144 707 923 -146 -426 -642 78 575 769 524 -575 -659 -211 841 1079 18 -395 -933 -447 688
2353F88O8m84n35m97N50P05K17m44r24j66O26M60M44q3j021m72N92O66M09j70
$$ 688 756 272 -263 -760 -210 495 712 268 -656 -822 -196 264 708 625 -396 -868 -276 390 799 629
2373F29j258j08L45P10N51n34o10m15J92O15O88r1q63o64j32J358L09q1p01l92
$$ 629 -629 -737 -392 318 869 335 -275 -690 -498 117 805 714 -149 -813 -945 413 722 641 -60 -452
2393d52P6K93O13Nk94p71K0M48R33o55m56r66P73N14N98K32o43j905O73R50R32
$$ -452 -376 -83 530 535 241 -530 -510 -62 871 216 -240 -1206 -433 81 679 911 268 -1637 -964 -14 918
2414I18L83o42p65k11J08M23O15k49j103M5M9N87M26k02n95l37J29O14M58j24
$$ 918 1301 659 -106 -317 -209 214 829 580 -523 -478 -429 158 584 382 -213 -550 -421 193 651 527
2434E27p93l26R1P62O99m57o77n84K97O39P65l63o69m39Q8O40N34m5o78o99K42
$$ 527 -266 -592 -501 261 960 503 -174 -758 -461 178 943 580 -89 -528 -440 200 734 689 11 -688 -446
2455d46M90O72K2p74m10k46P07O02R2m20r15j76O05O73Q1j72q61l31N97M93N23
$$ -446 44 716 738 -36 -446 -692 15 617 709 289 -626 -802 -197 476 557 385 -476 -807 -210 283 806
2476H06n82o29j35P6P71M05m20o50k69L71M57M28j65r52k56K39P19K97j25n52
$$ 806 224 -405 -540 -464 307 712 292 -358 -627 -256 201 629 464 -488 -744 -505 214 511 386 -166
2496a66m54Q7N92O49l52o61k93K55J24R23j21k94j107K33O39L95K00m27p82n1
$$ -166 -620 -533 59 708 356 -305 -598 -343 -219 704 583 289 -818 -585 54 449 649 222 -560 -611
2516f11L19R07L34j030J9j127O04J265M86p37j033J34rn3J601n57j482j08J023
$$ -611 -292 615 949 -81 -62 -1189 -585 680 1166 429 -604 -470 -479 -532 1069 512 -970 -1078 -55
2535e5K78R5m40M5q59n3Q66R85p28N2p24L29P00k94L68p20n01K28P22K68M04j743
$$ -55 223 318 -122 -77 -936 -989 -123 862 134 186 -538 -209 491 197 565 -155 -656 -428 294 562 966 -777
2557g77M66l03P52P63n90j92k55m15M12M99L52m95q74j41M65R63J83k62q97k83
$$ -777 -311 -614 138 901 311 119 -136 -551 -139 360 712 217 -657 -798 -333 630 813 551 -346 -629
2577f29N86J88M73o15o49J12M27O39k46n19j18l16L21P11Q4k82j84m98K54L38
$$ -629 -43 145 618 3 -646 -534 -107 532 286 -233 -351 -667 -346 365 449 167 -17 -515 -261 77
2597G7L62o0m79l86L88K92M33j11p05k78K7P98J34p1o28j37n6N39L44j00m25m06
$$ 77 439 379 -100 -486 -98 194 627 516 -189 -467 -440 358 492 421 -207 -344 -400 139 483 383 -42 -448
2619d48O0M62K68J98m42n36K5M09O00j0m83m31k25K37P47j30k43n22k64N63L21
$$ -448 -388 74 342 540 98 -438 -413 -4 596 586 103 -328 -553 -316 431 301 58 -464 -728 -165 156
2640A56N06n01o10k77M46N78K38j99o62r8J96N24M11m53m63m08L00P39K57j22
$$ 156 662 161 -449 -726 -280 298 536 337 -325 -423 -227 297 708 255 -208 -616 -316 423 680 558
2660E58q24j35K0L78P22k77o42j16j36K73M40j65k57l01J32J96M68J75n27m30
$$ 558 -266 -401 -381 -3 719 442 -200 -316 -452 -179 261 96 -161 -462 -330 -134 334 509 -18 -448
2680d48R5L3P66L7m93m54k25O87M15K08m82l77j96K96P38j0n93j83o3K06K32L29
$$ -448 -353 -320 446 483 -10 -464 -689 -2 413 621 139 -238 -434 -138 600 590 -3 -186 -249 -43 189 518
2702E18m33m40P8j33N93L49j87o02l35J36O81K19j12m54n16L76M54L98K9o55n08
$$ 518 85 -355 -277 -410 183 532 345 -257 -592 -456 225 444 332 -122 -638 -262 192 590 619 -36 -544
2723e44K25L54K44K91n63k48q2L54J81J62k32n20l5M63L44J26n40n05L13J15L50
$$ -544 -319 35 279 570 7 -241 -323 31 212 374 142 -378 -413 50 394 520 -20 -525 -212 -97 253
2744B53M50m30p39N0K06N94ql69k07l10L81L00k9Rl98j80Q1O88J25l17l74m75
$$ 253 703 273 -466 -416 -210 384 376 7 -200 -510 -129 171 142 151 -247 -427 -346 342 467 150 -224 -699
2766f99O48J62K38on38j3k25L92K77p8k54k01p0M89K85j57l04m12J25L94M82j53
$$ -699 -51 111 349 343 -195 -208 -433 -41 236 158 -96 -297 -367 122 407 250 -54 -466 -341 53 535 382
2788C82o17k84L9L77K72J89m92l63j03O10L75Kk85n43J15M35L23J36k88p39p2
$$ 382 -235 -519 -480 -103 169 358 -134 -497 -600 10 385 387 102 -441 -326 109 432 568 280 -459 -531
2809e31K89M28J47k52l80n4K00K35K35j76l17j71J47O55j8k54l40j67J13N97n8
$$ -531 -242 186 333 81 -299 -353 -153 82 317 141 -176 -347 -200 455 437 183 -157 -324 -211 386 328
2830C28l6l67l54J10L89K03j06j88l51Q7M01L40N1n37n08L26J16L61J64m42k83
$$ 328 292 -75 -429 -319 70 273 167 -21 -372 -285 116 456 507 -30 -538 -212 -96 265 429 -13 -296
2851b96J81p3O42j8l57m26N2K45L79K5l77n4k89L83L42J82m67l19j77J67N14J02
$$ -296 -115 -188 454 436 79 -347 -295 -50 329 354 -23 -77 -366 17 359 541 74 -245 -422 -255 259 361
2873C61j73l81l00M13M56J17l03m17j01R2M60M57l29n65l42J20N24L30j43m66
$$ 361 188 -193 -493 -80 376 493 190 -227 -328 -236 224 681 352 -213 -555 -435 89 419 276 -190
2893a90j47k1K56N02q7m27j05k2K87M33n3l76n40K06L46M00o2m47l52j60O07L01
$$ -190 -337 -358 -102 400 313 -114 -219 -241 46 479 426 50 -490 -284 62 462 400 -47 -399 -559 48 349
2915C49R8l07o07P6K33M53pj34l50k70M22M19L3k84m69N0K5L64L48l72m81J07
$$ 349 447 140 -467 -391 -158 295 288 154 -196 -466 -44 375 408 124 -345 -295 -270 94 442 70 -411 -304
2937c04K64J16L33k67k98j57K7L84L16k90j55m24R1M37L24j45l92k77J24L57J13
$$ -304 -40 76 409 142 -156 -313 -286 98 414 124 -31 -455 -364 73 397 252 -140 -417 -293 64 177
2958A77J10m63n72J95M86L04j71r1m64R7M14L11k8l82k63M4M55J44K60n80l92
$$ 177 287 -176 -748 -553 -67 237 66 -25 -489 -392 22 333 305 -77 -340 -296 159 303 563 -17 -409
2979d09k1J91N73K0l32j06k45K67M02J44l50k81l02L22M42J81l32n01j14K74J40
$$ -409 -430 -239 334 354 22 -84 -329 -62 340 484 134 -147 -449 -127 315 496 164 -337 -451 -177 -37
3000c7L14J10m91l53J84K29L94j86k90k80n8M21M58j59k02l63P6K86K44j21k87
$$ -37 277 387 -104 -457 -273 -44 350 164 -126 -406 -464 -43 415 256 54 -309 -233 53 297 176 -111
3021a11j53n3L64L07o1j46n93L20J20M40K5n22m08K44Q3L37J06k80l85j3M19J85
$$ -111 -264 -317 47 354 293 147 -446 -126 -6 434 459 -63 -471 -227 -144 193 299 19 -366 -379 40 225
3043B25K59k33k61m10K23M64P1j09m90q2L58J66J58j90m69q6L66J13K19K15n57
$$ 225 484 251 -10 -420 -197 267 338 229 -261 -343 15 181 339 149 -320 -406 -40 73 292 507 -50
3064e0l34O2N91J47l06j73k95K36J79K12J3m74j41L0K78L99j04m12j49P4P0L91
$$ -50 -384 -322 269 416 110 -63 -358 -122 57 269 282 -192 -333 -303 -25 374 270 -142 -291 -217 -147 244
3086B44J32l78l52J69K55L56o6l60j25j70L16L56j40j96k38l74N61L93k4l21k31
$$ 244 376 -2 -354 -185 70 426 360 0 -125 -295 21 377 237 41 -197 -571 -10 383 359 38 -193
3107a93p1L60N4J41k59l97J07J55M55RO8n54m43M97M79j55m0j31n32J28O61jk58
$$ -193 -264 96 150 291 32 -365 -258 -103 352 361 429 -125 -568 -71 408 253 213 82 -450 -322 339 338 80
3130H0l33o1K78K55J42j20l22o9j07N47K58l89j15p03N22M6l36M38k93K65J48
$$ 80 -253 -314 -36 219 361 241 -81 -150 -257 290 548 159 44 -659 -137 -91 -427 11 -282 -17 131
3151A31K09k71L57o32l3j24L78O03k21o91l9J0M18ol0J18j49o20L74N19P1n13
$$ 131 340 69 426 -206 -239 -363 15 618 397 -294 -333 -323 95 89 59 177 28 -592 -218 301 372 -141
3173a41k04m29N04N87L38n80j06k04j88J80N77m43k26n19J228j96p8L13j167J63
$$ -141 -345 -774 -270 317 655 75 -31 -235 -423 -243 334 -109 -335 -854 374 178 100 413 -754 -591
3193e91N34j07N82R9n34n32l5J009j79L19n42m90K49J07N40k75j84k26n10J092
$$ -591 -57 -164 418 517 -17 -549 -584 425 246 565 23 -467 -218 -111 429 154 -30 -256 -766 326
3213C26L8K86l37q44J03O76j31J69j69m23J92K76J95L8n71k67K86q4Q21l77j05
$$ 326 364 650 313 -531 -428 248 117 286 117 -306 -114 162 357 395 -176 -443 -157 -241 580 203 98
3234I8k38O9K9L36n6r5m26j99K98M56Q0p6n95k97N70L22j8j48m02j42L37K30K94
$$ 98 -140 -71 -42 294 238 143 -283 -482 -184 272 352 276 -319 -616 -46 276 258 110 -292 -434 -97 133 427
3257D27j91o83K50j23L68K35Kk31k75K36J82L3Nk94l03J45K92K16l09j99l12J97
$$ 427 236 -447 -197 -320 48 283 285 54 -221 15 197 230 235 -59 -362 -217 75 291 -18 -217 -529 -332
3279c32M93K10P4n79k18kL72K22r3k30l60K41J80K04J20l21l59J85Q9N75l03k4
$$ -332 161 371 445 -134 -352 -354 18 240 147 -83 -443 -202 -22 182 302 -19 -378 -193 -104 471 168 144
3301A44l35j27J96K69L64m73k01k82M10J68L37k96l92l92K94N17K31J11p76l3
$$ 144 -191 -318 -122 147 511 38 -163 -445 -35 133 470 174 -218 -610 -316 201 432 543 -233 -266
3321b66M05K77J41m46p1l96j05J94P38k61K18p79J72J48j54K92R3j358J185M8
$$ -266 139 416 557 111 40 -356 -461 -267 471 210 428 -351 -179 -31 -185 107 200 -1158 27 75
3341G5L35n55K39n71j0P01l6J68k85m62K09K79K5j28p2k97K29Q4N18n4m30m18
$$ 75 410 -145 94 -477 -487 214 178 346 61 -401 -192 87 112 -16 -88 -385 -156 -72 446 392 -38 -456
3363d56J55L47m5L46m29o2j74K87K17L15m89j79k45L68lN51l93m61J43L2L01J99
$$ -456 -301 46 1 347 -82 -144 -318 -31 186 501 12 -167 -412 -44 -47 504 111 -350 -207 -175 126 325
3385C25j68l64M7j50N08K68j87l96l17Q2M47L48j1o28J59l91O71L3O2k39%l08
$$ 325 157 -207 -160 -310 198 466 279 -117 -434 -352 95 443 432 -196 -37 -428 243 276 338 99 99 -209
3407b09O44k44n6m06Q9J11K04J28mm23L63q16M46P09k3q23k48mk69J148l40O8
$$ -209 435 191 135 -271 -182 -71 133 261 257 -166 197 -619 -173 536 513 -310 -558 -562 -831 317 -23 45
3429D5n19K79J10M14R6l75l3l32M3N49P6l00k57k23P6N46O2M4l04m24J59N65J37
$$ 45 -474 -195 -85 329 425 50 17 -315 -272 277 353 53 -204 -427 -351 195 257 301 -3 -427 -268 297 434
3452D34l64j15l26J22K11L28M3n22k20J91M23Q1k3k25l30K7L30K39J95p96j2K86
$$ 434 70 -45 -371 -249 -38 290 333 -189 -409 -218 205 286 263 38 -292 -265 65 304 499 -297 -309 -23
3474b3J7L71j67p8m43k6J45M03J94l34p7k68L86J36Q0k16k17j56J17L05N1p0l37
$$ -23 -6 365 198 120 -323 -349 -204 199 393 59 -18 -286 100 236 316 100 -117 -273 -156 149 200 130 -207
3497b07l64O65K08j71k10M8k41K30L72k85J3J3m90J88M83%j44j85j81J42K46J26
$$ -207 -571 94 302 131 -79 -31 -272 -42 330 45 58 71 -419 -231 252 252 108 -77 -258 -116 130 256
3519B56l7m07q9K3L42J43j38j66j01QM18q1O5j77m58M2L53K28K65m05m02mJ71
$$ 256 219 -188 -277 -254 88 231 93 -73 -174 -166 252 171 236 59 -399 -357 -4 224 489 84 -318 -322 -151
3542a51N72Q7l68l06N8J41K03n6j7l31o3J57J09M53k82k42m16M8O71m5k6l49j37
$$ -151 421 508 140 -166 -108 33 236 180 163 -168 -231 -74 35 488 206 -36 -452 -404 267 222 196 -153 -290
3565b90Q3M73J73k14n96R1J98N08j67q8k1l74M8N09j41j29l25k53J22N02J41N1
$$ -290 -207 266 439 225 -371 -280 -82 426 259 171 150 -224 -176 333 192 63 -262 -515 -393 109 250 301
3587C01l85k98J69%N85j35k87k41j35N48J10J52k30n20p5M31L54j57j53k84j58
$$ 301 -84 -382 -213 -213 372 237 -50 -291 -426 122 232 384 154 -366 -441 -10 344 187 34 -250 -408
3608d08K32M10K09m27l42j35j55P40J36p1n95K41NJ04J98M6m38j62N05O3J17l54
$$ -408 -176 234 443 16 -326 -461 -616 124 260 189 -406 -165 -160 -56 142 188 -250 -412 93 156 273 -81
3630h1O7m17M69L9M03k02m56m1Q0J72J62J70m60l55K92M32k6m0m13Q4k27M41J90
$$ -81 -14 -431 38 77 480 278 -178 -219 -139 33 195 365 -95 -450 -158 274 248 208 -205 -121 -348 93 283
3653B83r6k68l01k4L10L28j61j01k01Q4M7K56jl14m6j97k5N91M8q4k92k86M71
$$ 283 187 -81 -382 -406 -96 232 71 -30 -231 -147 -100 156 155 -159 -205 -402 -427 164 212 128 -164 -450 21
3676B1L47j02q6o25J07K68M14q6j22l03k30L42K7M37k24l34l20K50K92J85N2m20
$$ 21 368 266 180 -445 -338 -70 344 258 136 -167 -397 -55 -28 409 185 -149 -469 -219 73 258 310 -110
3698a10l0k56O43n6P4k31l82Q3J68M76k36k12n22L82K64L73j70l12j95M4J88J27
$$ -110 -140 -396 247 191 265 34 -348 -265 -97 379 143 -69 -591 -209 55 428 258 -54 -249 -205 -17 110
3720A10J97k10n57K24L02N8J17k01j36m63L36N89j75r5k29j18K79K04J83k80k65
$$ 110 307 97 -460 -236 66 124 241 40 -96 -559 -223 366 191 96 -133 -251 28 232 415 135 -130
3741a30k04j9M52L70k66p39N8J48L53K70j52k70j45q6L73K88N5m61l00K25L28
$$ -130 -334 -353 99 469 203 -536 -478 -330 23 293 141 -129 -274 -360 13 301 356 -105 -405 -180 148
3762A48N5M4l96k54OL05L50n3l65o4L20r9M05k68j95m52J59N35K0n8ql47o7K44
$$ 148 203 247 -149 -403 -397 -92 258 205 -160 -224 96 -3 402 134 -61 -513 -354 181 201 143 135 -212 -279 -35
3786c5K00L00n66n9k27L31L29l9J45n16l14N64j41M29k31n13R5P2O17R3k36m45
$$ -35 165 465 -101 -160 -387 -56 273 234 379 -137 -451 113 -28 401 170 -343 -248 -176 441 534 298 -147
3808a47l57N13MK99j67j83k03J27J46L61p3m76j98L09n3M36j98l54q7m7M86K24
$$ -147 -504 9 13 312 145 -38 -241 -114 32 393 320 -156 -354 -45 -98 338 140 -214 -301 -348 138 362
3830C62j30k42l08J16K31J70R4l79k69N2L62K26m5q8l73k66M02M26q5pj50n26
$$ 362 232 -10 -318 -202 29 199 293 -86 -355 -303 59 285 240 152 -221 -487 -85 341 256 249 99 -427
3852d27L28K10K18L7n45k83M07K51J32L2n55j27L58P9K39k37j36k81J94J17K51
$$ -427 -99 111 329 366 -179 -462 -55 196 328 360 -195 -322 36 115 354 117 -19 -300 -106 11 262
3873B62K4k56l61j30N69J68J37n65j41J7M37J67n0j57l96o9M37J91kl35j08j05
$$ 262 286 30 -331 -461 108 276 413 -152 -293 -276 161 328 278 121 -275 -344 93 284 282 -53 -161 -266
3895b66OL70p3J40k98k82L44L03R1j98l91M9k18N55K91j55m65l7r3M31J73k55
$$ -266 -260 110 37 177 -121 -403 -59 244 335 137 -254 -205 -423 132 423 268 -197 -234 -327 104 277 22
3917B2k53j05J83N5K55pk26j42m4M42L73o18J93k92j14M29K4P8o88J86n4N50k3
$$ 22 -231 -336 -153 -98 157 150 -76 -218 -262 180 553 -65 128 -164 -278 151 175 253 -435 -249 -303 247 224
3940B24m8k83k43k9K61K01L94n54j97O4L2L12j8j0k99nK06L37o4k52q4o2M8K81
$$ 224 176 -107 -350 -379 -118 83 477 -77 -274 -210 -178 134 116 106 -193 -198 8 345 281 29 -55 -117 -69 212
3964B12K14l09k56M7o4K92N5j26k89j33J40M11N6j34k38k60Q3M12J97k18m11J47
$$ 212 426 117 -139 -92 -156 136 191 65 -224 -357 -217 194 250 116 -122 -382 -299 113 310 92 -319 -172
3986a72n2L84K94k67l14j54j57N73lK47k52k98o2J62K90Q1l41k13j5J83L07J42
$$ -172 -224 160 454 187 -127 -281 -438 135 132 379 127 -171 -233 -71 219 300 -41 -254 -269 -86 221 363
4008C63l13k98pJ83N14k14m14j62J95O8L33j65j7k42l96N49J85L24m25l04J00
$$ 363 50 -248 -255 -72 442 228 -186 -348 -153 -85 248 83 66 -176 -572 -23 162 486 61 -243 -143
4029a43R6K84m2j00l30J89j49M82r4L8n49K8K28J12K58j79l18lj52M04K86r1m90
$$ -143 -47 237 195 95 -235 -46 -195 287 193 231 -318 -290 -62 50 308 129 -189 -192 -344 60 346 255 -235
4052b35o6J91J13J87l0l64JL3O9L96j47k95j88K47L05o2M5k06J8j45K0K93K18
$$ -235 -301 -110 3 190 160 -204 -203 -170 -101 295 148 -147 -335 -88 217 155 200 -6 12 -133 -113 180 398
4075C98k97k70L0K3L31R9k69j88m8J11J35K48k15j47l03K84L55m5k28k31N6j30
$$ 398 101 -169 -139 -116 215 314 45 -143 -191 -80 55 303 88 -59 -362 -78 277 232 4 -227 -171 -301
4097c01P46m0k13j16l61rK57M10L5n86M3n0N28k07J77l34l40K34j17M42l6l55
$$ -301 445 405 192 76 -285 -294 -37 373 408 -178 -135 -185 343 136 313 -21 -361 -127 -244 198 162 -193
4119a93k80K79J02M11n2l59r5j58K89L67o3j17k93J5K43K74o4m25R7k34M3M74
$$ -193 -473 -194 -92 319 267 -92 -187 -345 -56 311 248 131 -162 -147 96 370 306 -119 -22 -256 -213 261
4141B61j08j79m5j84K08J40J65k25l06j36R6L34K49k51j89k17J10K48K01r4l19
$$ 261 153 -26 -71 -255 -47 93 258 33 -273 -409 -313 21 270 19 -170 -387 -277 -29 172 78 -241
4162b41o2n0P45o0k23lk36j57N21R0j73j70l51J60N2O30k01l18N1p9n4L13K58
$$ -241 -303 -353 392 332 109 106 -130 -287 234 324 151 -19 -370 -210 -158 472 271 -47 4 -75 -129 184 442
4185D42l60l27J18J75K97k8j11l35j16O8O39k0o01J2k25K71K56J56m37j15k1K21
$$ 442 82 -245 -127 48 345 317 206 -129 -245 -177 462 442 -159 -147 -372 -101 155 311 -126 -241 -262 -41
4207d1J15j3J66l36j97j22O21N5q7m15M3J86j9J71K8j87k85j61N56J48j08j74
$$ -41 74 61 227 -109 -306 -428 193 248 161 -254 -211 -25 -44 127 155 -32 -317 -478 78 226 118 -56
4229e6j08P3K08Q5J21k42k66o2L4N43J25m28k98l2L18J40O4l18m53M36J14K66
$$ -56 -164 -91 117 202 323 81 -185 -247 -213 330 455 27 -271 -303 15 155 219 -99 -552 -116 -2 264
4251B64L0l69k90J44P8L82k0n9k85j24p6O14m2k24j20k54K29K40L23j23m19j62
$$ 264 294 -75 -365 -221 -143 239 219 160 -125 -249 -325 289 247 23 -97 -351 -122 118 441 318 -101 -263
4273b63J19K74q3J73k65j46j71O46n9j90j90j47K45q0L15M3j44m90J73L66K24
$$ -263 -144 130 47 220 -45 -191 -362 284 225 35 -155 -302 -57 -137 178 221 77 -413 -240 126 350
4294C50M7k63n32J96N9L30J80m32j09j21L22J49m0j08l09J37L1L05j0r4k94j90
$$ 350 397 134 -398 -202 -143 187 367 -65 -174 -295 27 176 136 28 -281 -144 -113 192 182 88 -206 -396
4316c96L63N23R5n02k49m73N52L28j58Q2l31j09P6J94M95k03l95j64M63m9L03
$$ -396 -33 490 585 83 -166 -639 -87 241 83 165 -166 -275 -199 -5 490 287 -108 -272 191 142 445
4337D45k64j55k56j72J31M55l24N9j25l30P58K4j13j68k11l1M85l64L91j65n83
$$ 445 181 26 -230 -402 -271 184 -140 -81 -206 -536 222 246 133 -35 -246 -277 208 -156 235 70 -513
4358e13L78K4M41R0l48j30m61M15K37L14M42j108o29M07Q98k97k23K60k16l78
$$ -513 -135 -111 330 420 72 -58 -519 -104 133 447 889 -219 -848 -441 457 160 -63 197 -19 -397
4378c97L47M10k86m24M75j56m46J047o60J78o0n57K39O33o46L39M83j87K74J04
$$ -397 -50 360 74 -350 125 -31 -477 570 -90 88 28 -529 -290 343 -303 36 519 332 606 710
4398G10q86k73j02J09J083j70J24n77K55m78K50R64q51N3r55R31j1qL87m85L58
$$ 710 -176 -449 -551 -442 641 471 595 18 273 -205 45 1009 158 211 -744 187 176 168 555 70 428
4419D28n28N43l95P9l66l98N09K03l25M83K35r25L88o8n5L40P17o81m91j23P12
$$ 428 -100 443 48 127 -239 -637 -128 75 -250 233 468 -457 -69 -137 -192 148 865 184 -307 -430 282
4440B82Oq2m69j27L05M10Q2r1l99k54l74R38J16j07n92M96o73M65N30q9M2o88
$$ 282 288 206 -263 -390 -85 325 407 316 -83 -337 -711 227 343 236 -356 140 -533 -68 462 373 415 -273
4462b73k20O25K15l50n60J81K67K63K62N7m37j67l05O26N94q24J49r53K32R12
$$ -273 -493 132 347 -3 -563 -382 -115 148 410 467 30 -137 -442 184 778 -46 103 -850 -618 294
4482B94J10m90j56L91r23j29J353j05k40o32o16P09O69l87m7o46O38j50K85J048
$$ 294 404 -86 -242 149 -774 -903 450 345 105 -527 -1143 -434 235 -152 -199 -845 -207 -357 -72 976
4502I76j126m86l79O92Q30q75k5n67J229p48k4L24M9O02o36q40N41Q81j150K49
$$ 976 -150 -636 -1015 -323 507 -368 -393 -960 269 -479 -503 -179 -130 472 -164 -1004 -463 418 -732 -483
4522d83O01k22j21M08m74k34K89M39k80K06Q17j016O9O75p86N26l32Q17j012o85
$$ -483 118 -104 -225 183 -291 -525 -236 203 -77 129 946 -70 -1 674 -112 414 82 899 -113 -798
4542g98R89L97j91k40p42Q38k83n09N46m95J42q0M3J256p08l48m37J25N97l42
$$ -798 191 588 397 157 -585 253 -30 -539 7 -488 -346 -426 -383 873 165 -183 -620 -495 102 -240
4562b40O37l22K96j255O87M88m53J54l12J02m71Q3J036k02j60n68J48K77J162
$$ -240 397 75 371 -884 -197 291 -162 -8 -320 -218 -689 -606 430 228 68 -500 -352 -75 1087
4581A087j701P7J90J29R69j146L01Q6n92L4M55P73o41n63L87q51P52L53J78r70
$$ 1087 -614 -537 -347 -218 751 -395 -94 -8 -600 -566 -111 662 21 -542 -155 -1006 -254 99 277 -693
4601f93R87o50O02J03m5k97l6m38L58K57k76j42m6J83k69Q96J42k79l94qj90j74
$$ -693 294 -356 246 349 304 7 -29 -467 -109 148 -128 -270 -316 -133 -402 494 636 357 -37 -45 -235 -409
4623d09M21K23j82n50L81o6L63K13m78l46L01L39n5j49M2j39m5L24K70p28j7J96
$$ -409 12 235 53 -497 -116 -182 181 394 -84 -430 -129 210 155 6 48 -91 -136 188 458 -270 -287 -91
4645i1K02l92Q16p95r2O13k89M67J52K69p29K35q42o7Q84n4q2j99J06n55J010
$$ -91 111 -281 535 -260 -352 261 -28 439 591 860 131 366 -476 -543 341 287 205 6 112 -443 567
4666E67j61J4j014j74J053K57j80m01P7o94N54J74L32o02m26K17o0J10K70K08
$$ 567 406 420 -594 -768 285 542 362 -39 38 -656 -102 72 404 -198 -624 -407 -467 -357 -87 121
4686A21n1m34J12J07J53K2J05l76O01n07J37L11k19n29L12q1O13q18K83j61L37
$$ 121 70 -364 -252 -145 8 30 135 -241 360 -147 -10 301 82 -447 -135 -216 397 -421 -138 -299 38
4707C8K35Mk54k47J05k19P10m58O73m19n43K45J30k35M55o16M23l38K8P71l37
$$ 38 273 277 23 -224 -119 -338 372 -86 587 168 -375 -130 0 -235 220 -396 27 -311 -283 488 151
4728A51J00j52j027P48J80L64l26j9o53N57J1Q08p52R3j35O00q92N54L31r02N98
$$ 151 251 99 -928 -180 0 364 38 19 -634 -77 -66 742 -10 83 -52 548 -344 210 541 -361 237
4749B37n84K62K41j11k09J1K40l48K77m3k84l08K37Q77o07O37q56n6M09J12l65
$$ 237 -347 -85 156 45 -164 -153 87 -261 16 -27 -311 -619 -382 495 -112 525 -331 -387 22 134 -231
4770b31Q77p81m5j26L65K71m29O2L5k51KO18m9k91k80k6j6N15K10l49k3n36M87
$$ -231 646 -135 -180 -306 59 330 -99 -37 -2 -253 -251 367 318 27 -253 -279 -295 220 430 81 58 -478 9
4793IJ29P5k57qk50L39o5M54k59k11k29J21J48Q9Nl5k54J7L29Q8j48Kj10n5P1
$$ 9 138 213 -44 -52 -302 37 -28 426 167 -44 -273 -152 -4 85 90 55 -199 -182 147 235 87 89 -21 -76 -5
4818eJ47J56k54j27q2RJ98N5j20j87jK53Q3M0k09j14QL7L70J00j52n38K27K45
$$ -5 142 298 44 -83 -165 -156 42 97 -23 -210 -211 42 125 165 -44 -158 -150 -113 257 357 205 -333 -106 139
4842A39K4R2K7o05J4L06M4K61j67m76K79j29L58J70j84k87J0l7J96K89m42n9J2
$$ 139 163 255 282 -323 -309 -3 41 302 135 -341 -62 -191 167 337 153 -134 -124 -161 35 324 -118 -177 -165
4865a65rL97k5kj83o3j17J03L73j19m29jK18j50L77j19o4k71K2M25n6M9j94j29
$$ -165 -174 223 198 196 13 -50 -167 -64 309 190 -239 -240 -22 -172 205 86 22 -249 -227 198 142 191 -3 -132
4889a32l0n3N09j3p2k72j58J30L51j77o7k55j8J41M71k22K95p91M1M10j1J0N5
$$ -132 -162 -215 294 281 209 -63 -221 -91 260 83 16 -239 -257 -116 355 133 428 -363 -322 88 77 87 142
4912A42l00PL1J87J81q8k9k88MO7L04rj78m14L53m3M17j90o8m17L57P2K01j31
$$ 142 -158 -151 -120 67 248 160 131 -157 -153 -86 218 209 31 -383 -30 -73 344 154 86 -331 26 98 299 168
4936A68pl78J3J97M9J67r6l58J77N7L46l31m5o0l01M82P6j62K97k33k04l4J74
$$ 168 161 -217 -204 -7 42 209 113 -245 -68 -11 335 4 -41 -101 -402 80 156 -6 291 58 -146 -180 -6
4959fJ08j08r0j6r5K72J99k35j10J7n6N8J10J18j8k93p4K79J17J18l55k27Q0J27
$$ -6 102 -6 -96 -112 -207 65 264 29 -81 -64 -120 -62 48 166 148 -145 -219 60 177 295 -60 -287 -207 -80
4983h0M47k39r7j23m8K33L5p9Lj47k0J09K36k25j6o5j12J73L96k40j93n9r2J49
$$ -80 367 128 31 -92 -140 93 128 49 52 -95 -115 -6 230 5 -11 -76 -188 -15 381 141 -52 -111 -203 -54
5007e4J93J40n71J73P5j38L01K20k02k04J37j32J71M3O3k06j89j7M70j44K7j76
$$ -54 139 279 -292 -119 -44 -182 119 339 137 -67 70 -62 109 152 215 9 -180 -197 273 129 156 -20
5029b0j30J5K54J45k28k1k82l9K61P9K33j90k39O1J40J75m9j56l03K29j6J83k30
$$ -20 -150 -135 119 264 36 15 -267 -306 -45 34 267 77 -162 -101 39 214 165 9 -294 -65 -81 102 -128
5052a28J1k72J10J92L0K42k70m9J44K0J05J2o8m01K84J62n0L5Rq5j75l4L01J7
$$ -128 -117 -389 -279 -87 -57 185 -85 -134 10 30 135 147 79 -322 -38 124 74 109 118 33 -142 -176 125 142
5076A42l4k40k00J21K84P0k04J37k20J99n1L21l46K0j29N5l8K78M8k84k3K9j5
$$ 142 108 -132 -332 -211 73 143 -61 76 -144 55 4 325 -21 -1 -130 -75 -113 165 213 -71 -94 -65 -80
5099h0J76j41j23Q8j00J64K10J05m90j5j42O17j24K39m46o0J29k76L70Nk05j98
$$ -80 96 -45 -168 -80 -180 -16 194 299 -191 -206 -348 269 145 384 -62 -122 7 -269 101 106 -99 -297
5121b97K93l7J81J52j45j67k6k46M67j11J89k43k02J11K93k34J04j40M2j1K15
$$ -297 -4 -41 140 292 147 -20 -46 -292 175 64 253 10 -192 -81 212 -22 82 -58 -16 -27 188
5142A88j81K55l19j72J76J66j00J85j92l09K29K17J86n82J97n3o1J88K0J62j99
$$ 188 7 262 -57 -229 -53 113 13 198 6 -303 -74 143 329 -253 -56 -109 -170 18 38 200 1
5163Amj58l1M15j45p6j23P3pJ0J06J07j31r7K55j60J3l0r0O1J10J93O9k96k11
$$ 1 -3 -161 -192 223 78 2 -121 -48 -55 -45 61 168 37 -60 195 35 48 18 -72 -11 99 292 361 65 -146
5188a46R1K35j15J00J3r2j52Q6K32j34o1l01N2P9Q4N7j46o9K31k13R5M3J93n15
$$ -146 -55 180 65 165 178 86 -66 20 252 118 57 -244 -192 -113 -29 28 -118 -187 44 -169 -74 -31 162 -353
5212c53L17P6R4N9O8n7n97J60M59j02J46k28j21J04R4L46k50m34P2N6N1N0k10
$$ -353 -36 40 134 193 261 204 -393 -233 226 124 270 42 -79 25 119 465 215 -219 -147 -91 -40 10 -200
5235b00J84k86J87J75p5J46p6j66k6r1J13N1J08j47n6j09M69j7p4l09n1L49j03
$$ -200 -16 -302 -115 60 -15 131 55 -111 -137 -228 -115 -64 44 -103 -159 -268 201 184 110 -199 -250 99 -4
5258dJ58j32r3K3k9L6k1K8k20RJ47pL29j14j45j40M16j58K61k58rk15j36K19l6
$$ -4 154 22 -71 -48 -77 -41 -62 -34 -254 -245 -98 -105 224 110 -35 -175 241 83 344 86 77 -138 -274 -55 -91
5283i1J86k68R3J99q2J1o5j24K55p9K03j88n2l3j75J75lO2M1m7J25j6k59J46J23
$$ -91 95 -173 -80 119 37 48 -17 -141 114 35 238 50 -2 -35 -210 -35 -38 24 65 18 143 127 -132 14 137
5308A37m7k61p0J78J40J92l11R2k78N6L13k35J14p5o5j35J45J72J38l81P5J77
$$ 137 90 -171 -241 -63 77 269 -42 50 -228 -172 141 -94 20 -55 -120 -255 -110 62 200 -181 -106 71
5330G1J11k0k00J44k23R9L9J62o3k66M15k61o7M0o2On3K49k01K90J4m78J95P6
$$ 71 182 162 -38 106 -117 -18 21 183 120 -146 269 8 -59 -19 -81 -75 -128 121 -80 210 224 -254 -59 17
5354A7P4o3j09Q1j61L2J55J02j11J22j79l4J91N5O6j76j20o9L63j2m42J52j7k4
$$ 17 91 28 -81 0 -161 -129 26 128 17 139 -40 -74 117 172 238 62 -58 -127 236 224 -218 -66 -83 -107
5378a07K3J97N3k22j21J70K59j19J00j12j30K4L3KJ59j52Jj04p6K38j30q7k95
$$ -107 -84 113 166 -56 -177 -7 252 133 233 121 -9 15 48 50 209 57 58 -46 -122 116 -14 -101 -396
5401c96K60N2J53j55O4qJ10k5l2K4K75m32R3mJ05J20k94Q6N7r1k11L80k46j61
$$ -396 -136 -84 69 -86 -22 -30 80 55 23 47 322 -110 -17 -21 84 204 -90 -4 53 -38 -249 131 -115 -276
5425b76J84l09L59k06M02j29N7q6J0j20j36L41j58K9oK84n8k70J00l81L48J21
$$ -276 -92 -401 -42 -248 154 25 82 -4 6 -114 -250 91 -67 -38 -44 240 182 -88 12 -369 -21 100
5447A00r1N2j47%N6K78k86n3J93k35kM03k87q8k90O33j3j82q0k8mj5J25J29K8
$$ 100 9 61 -86 -86 -30 248 -38 -91 102 -133 -135 268 -19 -107 -397 236 223 41 -39 -67 -71 -86 39 168 196
5472A96k11J28r9J62P9j83K45k96J30k40k9J39R6q8j5L9L5q1K28j60j80rP6M0
$$ 196 -15 113 14 176 255 72 317 21 151 -89 -118 21 117 29 14 53 88 7 235 75 -105 -114 -38 2
5496BJ17k91L0R0P3P1l20Q2j3K07kO2j46J39j19j1P8P9N4k68Lk6N2n2K12J68m43
$$ 2 119 -172 -142 -52 21 92 -228 -146 -159 48 46 108 -38 101 -18 -29 49 128 182 -86 -83 -109 -57 -109 103 271 -172
5523a72P1K62l35J41Rj12J19j4k0K33l29Q8M1n0K55m32K39l95L09L8J15K0j63
$$ -172 -101 161 -174 -33 -24 -136 -17 -31 -51 182 -147 -59 -18 -68 187 -245 -6 -401 -92 -54 61 81 -82
5546h2O9l83M61J07k16N3L18m51k7R6J08j66J09N6J25k94K19R4j86j30K40k35
$$ -82 -13 -396 65 172 -44 9 327 -124 -151 -55 53 -113 -4 52 177 -117 102 196 10 -120 120 -115
5568a15K33rj09n0J84M4j51jj82k6J71j03J70J46k61j89K05J0K6K71j43k07L9
$$ -115 118 109 0 -50 134 178 27 26 -156 -182 -11 -114 56 202 -59 -248 -43 -33 -7 264 121 -86 -47
5591d7O4jK13j57j83J16J10j29J48j11k37J31ll1J90m0k8k05K37K6K3m0l7R0j12
$$ -47 17 16 229 72 -111 5 115 -14 134 23 -214 -83 -86 -117 73 33 5 -200 37 63 86 46 9 99 -13
5616a3j75J79P2j52J55j06K29m8j72M0j20RJ50N4l34L21j43J48J15j92J74n1j88
$$ -13 -188 -9 63 -89 66 -40 189 141 -31 9 -111 -102 48 102 -232 89 -54 94 209 17 191 140 -48
5639d8J9K36r3K8l54K65k20O1K72r7j23r2M48l18N3L67l82j03MK55nk92K69m48
$$ -48 -29 207 114 142 -212 53 -167 -106 166 69 -54 -146 302 -16 37 404 22 -81 -77 178 173 -119 150 -298
5663b98L69O1P8O0m19R0k61M73j1m4R0J2k78k3J59K54j52j87j31K26j42j35K19
$$ -298 71 132 210 270 -149 -59 -320 153 142 98 188 200 -78 -101 58 312 160 -27 -158 68 -74 -209 10
5686A0k40J50O2J34j02n5k04J20J05j35J87Jj52J76J5k55J62K19n16M15k42K61
$$ 10 -230 -80 -18 116 14 -41 -245 -125 -20 -155 32 33 -119 57 72 -183 -21 198 -318 97 -145 116
5708A16J39k00r0j30P9K5J62N5l39k3Q0kJ41J14j75p3k71L79r2n1L24o4l82K63
$$ 116 255 55 -35 -165 -86 -61 101 156 -183 -206 -126 -128 13 127 -48 -121 -392 -13 -105 -156 168 104 -278 -15
5732a5J29j9l05J02j27K82j40J20K1k29J30J46jn9Q1j87J80k94K36o7l7k6K51
$$ -15 114 95 -210 -108 -235 47 -93 27 48 -181 -51 95 94 35 116 -71 109 -185 51 -16 -53 -79 172
5755A72k33K17K19m58K8k64N37m5j8l02P4R5p0J56j71J90k30J22j92J49j00J8
$$ 172 -61 156 375 -83 -55 -319 218 173 155 -147 -73 22 -48 108 -63 127 -103 19 -173 -24 -124 -106
5777a06J35m7j21L7n1K32l1j81J05K7J4j54j20O6O8M0M18l00j2k98J27J17oK09
$$ -106 29 -18 -139 -102 -153 79 48 -133 -28 -1 13 -141 -261 -195 -127 -87 331 31 19 -279 -152 -35 -41 168
5801A68k23r3J0J90K3o1M5pp1j4k9J99j17m5m5K8n0J92n7k95K50j31O2J81j77
$$ 168 -55 -148 -138 52 75 14 59 52 -19 -33 -62 137 20 -25 -70 -42 -92 100 43 -252 -2 -133 -71 110 -67
5826f7n3l3K01J58l17K94j25K2m0K02k26J16j27l60K33K10J83j84l02J01m7j24
$$ -67 -120 -153 48 206 -111 183 58 80 40 242 16 132 5 -355 -122 88 271 87 -215 -114 -161 -285
5848b85M76k31K28l49J03J15J65l9j22k52k29N27j27J13k2p0j00J87J3j95J98
$$ -285 191 -40 188 -161 -58 57 222 183 61 -191 -420 107 -20 93 71 1 -99 88 101 -94 104
5869A04k47l2K41j80K09p1k65K76J70L1j32M1l27R3J76K32j37k30P0j23mJ12J82
$$ 104 -143 -175 66 -114 95 24 -241 35 205 236 104 145 -182 -89 87 319 182 -48 22 -101 -105 7 189
5892A89n7l31r1J15K05J08Q9k74j1J74N6P7m66J41J29j32J81J41j02j42l60lL77
$$ 189 132 -199 -290 -175 30 138 227 -47 -58 116 172 249 -217 -76 53 -79 102 243 141 -1 -361 -364 13
5915A3l2K80k80k33J89P0k6M4pK0k87L99j93q7LO0r6K10J92j15j31o8kJ33j25
$$ 13 -19 261 -19 -252 -63 7 -19 25 18 38 -249 150 -43 -130 -127 -67 -163 47 239 124 -7 -75 -77 56 -69
5940f9K10J32n26P3L89J0j02j17o1J6K94k85K00j7q5k43J4L63j66j48K20j72J85
$$ -69 141 273 -253 -180 209 219 117 0 -61 -45 249 -36 164 147 62 -181 -167 196 30 -118 102 -70 115
5963A15jp7L05n07K92j21q1N2lM4n9J09k2K06Q2n13J28R5N8J16p1p6j49o5K33
$$ 115 114 37 342 -165 127 6 -75 -23 -26 18 -41 68 46 252 334 -179 -51 44 102 218 147 71 -78 -143 90
5988I0L7l9m27K80r0K25j05J00l51L70m79K73L9J68j35q8K16l09K23l3J3P3q4
$$ 90 127 88 -339 -59 -149 76 -29 71 -280 90 -389 -116 -77 91 -44 -132 84 -225 -2 -35 -22 51 -33
6011c3J71P3m24K57J18O9k42K70k80J07m19J81Q5M70L60n97j39j14L55m65L81
$$ -33 138 211 -213 44 162 231 -11 259 -21 86 -333 -152 -67 403 763 166 27 -87 268 -197 184
6032A84L13o59k10L63o2J50J48k12k26L52K66p27N38l55j6J37j84L44K6l00N22
$$ 184 497 -162 -372 -9 -71 79 227 15 -211 141 407 -320 218 -137 -153 -16 -200 144 170 -130 392
6053C92k12j75m73PO9L82j13n80J470p84k78L48k20J83L41l30j33k53m28Q68J88
$$ 392 180 5 -468 -461 -392 -10 -123 -703 767 -17 -295 53 -167 16 357 27 -106 -359 -787 81 269
6074B69k62k68L41l82O0k80J46J041q57J0J65K85q5Ml84P6R1k20M88m46K13k67
$$ 269 7 -261 80 -302 -242 -522 -376 665 -192 -182 -17 268 183 187 -197 -121 -30 -250 238 -208 5 -262
6096b62L41o9M17k21n7j19pl38N75o20J26M99j85j10R5K44n52J62R7l3o2R4r7
$$ -262 79 10 427 206 149 30 23 -315 260 -360 -234 265 80 -30 65 309 -243 -81 16 -17 -79 15 -82
6119h2P5k88J76J46J95Kl12j9J39j9J62k4k42L7K43L1j72Q7m1P3k02N8R0r3l2
$$ -82 -7 -295 -119 27 222 224 -88 -107 32 13 175 151 -91 -54 189 220 48 135 94 167 -35 23 113 20 -12
6144a2j80K53j06L28n7J09o57J2L84J30p3n15L19m3J80L2j66j96K14k15K00j13
$$ -12 -192 61 -45 283 226 335 -322 -310 74 204 131 -384 -65 -108 72 104 -62 -258 -44 -259 -59 -172
6166a72L32P8l06K30J71n25J19N28n03J48k54J91l70m01O68j60K89n4n8K31j02
$$ -172 160 238 -68 162 333 -192 -73 455 -48 100 -154 37 -333 -734 -66 -226 63 9 -49 182 80
6187H0K79k74j09N37l06n64J61m50O25J26L67n8n33j71J98O4l38M22j80k6L29
$$ 80 359 85 -24 513 207 -357 -196 -646 -21 105 472 414 -119 -290 -92 -28 -366 56 -124 -150 179
6208A79l91M7J57N8o03R69k80N21p35J0j02L08J3j50j98J69J65q77J230n81l09
$$ 179 -212 -165 -8 50 -553 416 136 657 -78 -68 -170 138 151 1 -197 -28 137 -740 490 -91 -400
6229d00R7K02n2M51j37o06N59P0Kn19K89J34j86J32n6j73N95m52j25j34M47k56
$$ -400 -303 -101 -153 298 161 -445 114 184 186 -333 -44 90 -96 36 -20 -193 402 -50 -175 -309 138 -118
6251a18Q67p62o03M42j8K59M95j74j03J43l75L04j44l19M63l53l78P28m87K40
$$ -118 749 -13 -616 -174 -192 67 562 388 285 428 53 357 213 -106 357 4 -374 354 -133 107
6271A07J17l50K59m4p7L90n33l9J62N9O30n53l46N75m54K67o53K61M87L4n12J27
$$ 107 224 -126 133 89 12 402 -131 -170 -8 51 681 128 -218 357 -97 170 -483 -222 265 299 -213 -86
6293h6P00L2p32J42N17n78l43L78K92o19R65r95J60P75p04j33j59K50K94J77r24
$$ -86 614 646 -86 56 573 -5 -348 30 322 -297 668 -327 -167 608 -96 -229 -388 -138 156 333 -591
6314e91Q44k01o60m1P51k82qJ04K4j23J26L64j66q76P4J064L3j48N51o70j35O23
$$ -591 253 52 -608 -649 102 -180 -188 -84 -60 -183 -57 307 141 -735 -661 403 436 288 839 169 34 657
6336F57p36J32L83n39L93K92r66L81m1p00Q79k31J44K47O4K72o10j50j10N51n03
$$ 657 -79 53 436 -103 290 582 -384 -3 -44 -744 135 -96 48 295 359 631 21 -129 -239 312 -191
6357a91K75l66N19N92p83L8J62p36J96M70K35j067O53o14K97K83n55J033q76K25
$$ -191 84 -282 237 829 46 84 246 -490 -294 176 411 -656 -3 -617 -320 -37 -592 441 -435 -210
6377b10k56k59J223j05k12m40J36N08k13l07P94j128N77k22J00p4N18o42M6k15
$$ -210 -466 -725 498 393 181 -259 -123 385 172 -135 659 -469 108 -114 -14 -88 430 -212 -166 -381
6397c81J23M36j57k64m2P17j48P1J58m16j78j01L14o7J39l6J60m98q0N28m73K85
$$ -381 -258 178 21 -243 -285 432 284 355 513 97 -81 -182 132 65 204 168 328 -170 -250 278 -195 90
6419I0J12j6j20K58o28j1J60k70L17O46m94K4qK38j87K2j37j01j88J49M07k98
$$ 90 202 186 66 324 -304 -315 -155 -425 -108 538 44 68 60 298 111 133 -4 -105 -293 -144 263 -35
6441c5K31k34K00k84j2Q5J54j89J49K6L3p7J18k40p7J00J28p1r2R7N4%j57J55
$$ -35 196 -38 162 -122 -134 -49 105 -84 65 91 124 47 165 -75 -152 -52 76 5 -87 10 64 64 -93 62
6465F2j32L8j4Q6k05L14k23K24j88j98K08J99K3R1n26L65k0j38J59j38J20j56
$$ 62 -70 -32 -46 40 -165 149 -74 150 -38 -236 -28 171 194 285 -241 124 104 -34 125 -13 107 -49
6487d9N1j25J80K09j55j24K8k94M68l6m34L08k50J34p4N51m72lK37m51L82R3l61
$$ -49 2 -123 57 266 111 -13 15 -279 189 153 -281 27 -223 -89 -163 388 -84 -87 150 -301 81 174 -187
6510a87L84l55N09o06R1K69o78N87k19L75J00m92N31j34J52l31k44K53K51l66
$$ -187 197 -158 351 -255 -164 105 -573 14 -205 170 270 -222 309 175 327 -4 -248 5 256 -110
6530a10j83M40k98r7K96o37Q47L3K08k92l38j29M60j66M51q0p73n30J331Qo05
$$ -110 -293 147 -151 -248 48 -589 258 291 499 207 -131 -260 200 34 485 405 -368 -898 433 441 -164
6551a64k36R42r76Q9K47R88j183M3P97N3j12r07N45M5m08LO53j216L25R09k94
$$ -164 -400 542 -434 -345 -98 890 -293 -250 547 600 488 -419 126 171 -237 -234 419 -797 -472 437 143
6572A43l40N58n56O55o2m70n63p3R21L16j883J330Q53j159J53P62p64RL08k97
$$ 143 -197 361 -195 460 398 -72 -635 -708 213 529 -1354 -24 829 -330 -177 585 -179 -170 138 -159
6592a59Q3M9J663j920J18M57J2n61M74j64J19j92j35J07J15j48l8J33j01J45j02
$$ -159 -76 -27 1636 -284 -166 291 303 -258 216 52 171 -21 -156 -49 66 -82 -120 13 -88 57 -45
6613d5j27J20p8L05l36L00j67j62K59N5J73j39j35l27L59M9m8o9J87k02j42L07
$$ -45 -172 -52 -130 175 -161 139 -28 -190 69 124 297 158 23 -304 55 104 56 -13 174 -28 -170 137
6635A37j18j71K43j22o1J6j3J87J98k49q9L5j73M05j26j75m6l1J26O7j01J91p1
$$ 137 19 -152 91 -31 -92 -76 -89 98 296 47 -42 -7 -180 225 99 -76 -122 -153 -27 40 -61 130 59
6658E9j64p6L12M1o6l27M77k25K00j30j06K18n40L85J47q2M4k04j33J83M1L2l43
$$ 59 -105 -181 131 172 106 -221 256 31 231 101 -5 213 -327 58 205 123 167 -37 -170 13 54 86 -257
6681b57M67K8r7j64j28n2QK52j00K6J90K42k03j93K0k7J11k08j16K27n0J43k0
$$ -257 210 238 141 -23 -151 -203 -195 57 -43 -17 173 415 212 19 39 12 123 -85 -201 26 -24 119 99
6704I9j17O0j89m3K51n9k5J87k11k25K50MR4j06J42j02P0j31j25R1J0m7J77R9
$$ 99 -18 42 -147 -190 61 2 -23 164 -47 -272 -22 -18 76 -30 112 10 80 -51 -176 -85 -75 -122 55 154
6728A54l02l0K03k30L53k83J55J17j91N4R0k07K83Rk58J03R4j13J78j14j25p8
$$ 154 -148 -178 25 -205 148 -135 20 137 -54 0 90 -117 166 175 -83 20 114 1 179 65 -60 -138
6750a38n3K14R2j63j49J15P7j42L33k16O7j46M9M1K31q8k67P3j37O0K12j23K21
$$ -138 -191 23 115 -48 -197 -82 -5 -147 186 -30 37 -109 -60 -19 212 124 -143 -70 -207 -147 65 -58 163
6773A63m05R5J29P8k80J92L77m68Q6K1J97j04j82K57n8n0j25j17K94k06M9n7J95
$$ 163 -242 -147 -18 60 -220 -28 349 -119 -33 -12 185 81 -101 156 98 48 -77 -194 100 -106 -57 -114 81
6796H1l65K60K16o8j81K02l07l2L18j04J16r5j95J45L9L1r8J36Q0l29J71m5J14
$$ 81 -284 -24 192 124 -57 145 -162 -194 124 20 136 41 -154 -9 30 61 -37 99 179 -150 21 -24 90
6819I0j2m3m7J17k1O7m16L75j70O5p7K19j45j41L8p7m1K74K99l73j7L4j10L75
$$ 90 78 35 -12 105 84 151 -265 110 -60 5 -72 147 2 -139 -101 -178 -219 55 354 -19 -36 -2 -112 263
6843B63k60K3k39N1L5k4L11k25O8k30J18J20j47J28M1j56J42k69K16O8K1R8m52
$$ 263 3 26 -213 -162 -127 -151 160 -65 3 -227 -109 11 -136 -8 33 -123 19 -250 -34 34 55 153 -299
6866b99K47J0k1K34m1j33K28m4p7j2lj53l33M22J64j39K3k27L70k56k4J72J18
$$ -299 -52 -42 -63 171 130 -3 225 181 104 92 89 -64 -397 25 189 50 73 -154 216 -40 -64 108 226
6889B26l27J25J69k7J32j89Ll09M27l41K22l6j44P4l3j58K06q8n1J31j50L2J38
$$ 226 -101 24 193 166 298 109 112 -197 230 -111 111 75 -69 5 -28 -186 20 -68 -119 12 -138 -106 32
6912C2P9j31J94l49L43Q8p1l10N4j28K98K4k79j10L02J06k75K45nN0j39o8l9K38
$$ 32 111 -20 174 -175 168 256 185 -125 -71 -199 99 123 -156 -266 36 142 -133 112 107 157 18 -50 -89 149
6936A49j37k9j6QJ12J17j76j75J9J26j29J38K17k37j27J27J60k18P0k9P8j83K26
$$ 149 12 -17 -33 -25 87 204 28 -147 -128 -2 -131 7 224 -13 -140 -13 147 -71 -1 -30 48 -135 91
6959I1J90m17M67l31n7oJ17J32k1j47j59p2J30J47j27o8J04k03K02N6J42j98j61
$$ 91 281 -136 331 0 -57 -63 54 186 165 18 -141 -213 -83 64 -63 -131 -27 -230 -28 28 170 -28 -189
6982a89j2L86j61N8j27JQ7J28o4j59K3j62K48Q3l49K49m3r9K5O9Q5l44L26l30
$$ -189 -201 185 24 82 -45 -44 43 171 107 -52 -29 -191 57 140 -209 40 -3 -102 -77 -8 77 -267 59 -271
7006b71L07k70L08k18J91k17M1J92m2l7j87J00Q0J46R1J11m53PP6P1o8J82n4k25
$$ -271 36 -234 74 -144 47 -170 -129 63 21 -16 -203 -103 -23 123 214 325 -128 -121 -45 26 -42 140 86 -139
7030a39l1j10M56j11r4Rj27Q5L5J8J90j23L2q4%N3J5j02j42J75J61k03M1J17k40
$$ -139 -170 -280 176 65 -29 -20 -147 -62 -27 -9 181 58 90 6 6 59 74 -28 -170 5 166 -37 4 121 -119
7055a19J46j08pJ60k7q0k50J36K82O0j53k41L14l70K83K57j38r8J05k52K47j49
$$ -119 27 -81 -88 72 45 -35 -285 -149 133 193 40 -201 113 -257 26 283 145 47 152 -100 147 -2
7077bO9j14L0n4K4J5K37k39j6O8K3k9PL2k65J35J48J21l13L91k33r6M5r8K68m02
$$ -2 67 -47 -17 -71 -47 -32 205 -34 -50 18 41 12 19 51 -214 -79 69 190 -123 268 35 -61 -16 -114 154 -248
7103b48L63l60K05J43J06r6l2k43N29j65j4K12n02n41Q39m80N04k53J80m69N13
$$ -248 115 -245 -40 103 209 113 81 -162 367 202 188 400 -102 -643 196 -284 220 -33 147 -322 191
7124A91j98k20L38j06k09J57q9j59L35j38pk74K63M76l89m45R4J92K22n34Q17
$$ 191 -7 -227 111 5 -204 -47 -136 -295 40 -98 -105 -379 -116 360 -29 -474 -380 -188 34 -500 317
7145C17o36k01M52P26o55j049J314l4k59o89J20M52L01k58M82q97J55Q81m49o10
$$ 317 -319 -520 -68 658 3 -1046 268 234 -25 -714 -594 -142 159 -99 383 -514 -359 522 73 -537
7165e37N31n4m64Q64m46M38k17n99O38J08j189R94l55K9J07R2m6O82p56M88k07
$$ -537 -6 -60 -524 340 -106 332 115 -484 154 262 -927 67 -288 -259 -152 -60 -106 576 -180 308 101
7186A01k96m12Q63q56L35M88k85L90l69L41p25J05K32J30j42l80L47J61L79p14
$$ 101 -195 -607 256 -600 -265 223 -62 328 -41 300 -425 -320 -88 42 -100 -480 -133 28 407 -307
7206c07L80j16r0m22P30qm04L38J50q6n71O47k13k73J22K10J57L0m57K52o8k47
$$ -307 73 -43 -133 -555 175 167 -237 101 251 165 -406 241 28 -245 -123 87 244 274 -183 69 1 -246
7228b46L45L94o6m22k47L88p5k14N72m72jp5n84O97J39Q8r51J046m66j77J02K3
$$ -246 99 493 427 5 -242 146 71 -143 429 -43 -44 -119 -703 -6 133 221 -730 316 -150 -327 -225 -202
7250b02M70j9j18l36J55J63m56O81m20JJ78l8J56l28K1L27k70P8j40K43J43k59
$$ -202 268 249 131 -205 -50 113 -343 338 -82 -81 97 59 215 -113 -92 235 -35 43 -97 146 289 30
7272C0K48o6n37L79m15M37l23L31j60j96M03j9l63n3L72p7P1l7J6N4k82J4M10
$$ 30 278 212 -325 54 -361 76 -247 84 -76 -272 131 112 -251 -304 68 -9 62 25 41 95 -187 -173 237
7295B37j14j11K0l23q4M67k12L91k39j21L45k7k76j46L47J20l61K3J08k2J97n51
$$ 237 123 12 32 -291 -375 92 -120 271 32 -89 256 229 -47 -193 154 274 -87 -64 44 22 219 -332
7317c32L97J1k7K12k96K79k91k8J59m3o7j0l7l4o6jK68j23J75k10K07l89L01j99
$$ -332 65 76 49 261 -35 244 -47 -75 84 41 -26 -36 -73 -107 -173 -174 94 -29 146 -64 143 -246 55 -144
7341a44J64r4o1K58J00k3k97J19l8J38k56J71j46J73m6j1J10j69o0J86j74j5K35
$$ -144 20 -74 -135 123 223 200 -97 22 -16 122 -134 37 -109 64 18 7 117 -52 -112 74 -100 -115 120
7364A20j31j00L47k62k5J98r0q9j51K24O6k06n2K42j82P9J06r8oO0p4J51r9J23
$$ 120 -11 -111 236 -26 -51 147 57 -32 -183 41 107 -99 -151 91 -91 -12 94 -4 -10 50 -24 127 28 151
7388A51ll85L7J62OJ32l65N63m29L01j91l1L33k53j01N3j51J51L33o22L78p9p4
$$ 151 148 -237 -200 -38 -32 100 -265 298 -131 170 -21 -52 281 28 -73 -20 -171 -20 313 -309 69 -10 -84
7411h4J75J7r8M7n3K20k77j8K32j83j5M9K1k14M23k91J23J37k14K15l45j26K99
$$ -84 91 108 10 57 4 224 -53 -71 161 -22 -37 12 33 -181 242 -49 74 211 -3 212 -133 -259 40
7434D0k56K54J8j5n73L14mM61K47o17L04k52J38R3J67n76j51J65J86l24K15N49
$$ 40 -216 38 56 41 -532 -218 -222 239 486 -131 173 -79 59 152 319 -257 -408 -243 -57 -381 -166 383
7456C83l43k16L6L55j43K25l64k35R3J40k82Q60ll04l06J69J52l8Q8k01j63L54
$$ 383 40 -176 -140 215 72 297 -67 -302 -209 -69 -351 509 506 202 -104 65 217 179 267 66 -97 257
7478B57k64m43O87j97j22n6q7P6L08j95k19N36j187R91o9k83K21J14n9k84P64
$$ 257 -7 -450 237 40 -82 -138 -225 -149 159 -36 -255 281 -906 85 16 -267 -46 68 9 -275 489
7499D89q45J244p28N10k73m5o90j62j41R66k38L92l20j57N19o80L13k04O13o47
$$ 489 -356 888 160 670 397 352 -338 -500 -641 325 87 479 159 2 521 -159 154 -50 563 -84
7519h4k36O57j0k71r69Q99P00r31j61N95j43l8J82p2l3o37L81L70p16K04N12J91
$$ -84 -320 337 327 56 -913 -14 686 -245 -406 189 46 8 190 118 85 -552 -171 199 -517 -313 199 390
7541C90k23j08L28j56j38M69r88N08n19P69n44P74m24N5k61K45j1J27j94k39Q3
$$ 390 167 59 387 231 93 562 -426 82 -437 332 -212 562 138 193 -68 177 166 293 99 -140 -57
7562e7k90k89P21N4K53m44p6K4L95j10l26L23n91L56L41J30o96P46r03M55j19
$$ -57 -347 -636 85 139 392 -52 -128 -104 291 181 -145 178 -413 -57 284 414 -282 464 -439 16 -103
7583a03k1K1M95n48L1K28L79j37m14J50L34k11q63k3R25m87O7O3M92m77l57M63
$$ -103 -124 -103 392 -156 -125 103 482 345 -69 81 415 204 -659 -682 243 -244 -177 -114 378 -99 -456 7
7605Gp04N49r7N6O53J29k06L52r88N30m02J95M23m19L71l98K63m21L41p4J4j34
$$ 7 -697 -148 -245 -189 464 593 387 739 -249 281 -121 74 497 78 449 51 314 -107 234 160 174 40
7627D0m40L20l63K6L63L1L42l98L34l92m87O74L12m42Q56j023M23K56j18o46o3
$$ 40 -400 -80 -443 -417 -54 -23 319 -79 255 -137 -624 50 362 -80 776 -247 176 432 314 -332 -395
7648c95R82l55k55P9l34M38j4L58l89j08J45j91m21Q63m72l56M31L22J60O81o14
$$ -395 587 232 -23 56 -278 160 146 504 115 7 152 -39 -460 403 -69 -425 6 328 488 1169 555
7669E55k70O47n34j076O87p1N57k33q19O07L5l47M14l19J28Q45q28J15m89N79
$$ 555 285 932 398 -678 9 -62 495 262 -557 50 85 -262 152 -167 -39 806 -22 93 -396 183
7689A83K38o72L52Q5n59K92k48L44K88j26N00q14J66j8k0l43K51N2m3j20k33N70
$$ 183 421 -251 101 186 -373 -81 -329 15 303 177 677 -137 29 11 -9 -352 -101 -49 -92 -212 -445 125
7711A25j09Kk88K36P7r7NJ65j82l4K45J6j68J19q2N0k99J48l9R0j21K50l22L26
$$ 125 16 18 -270 -34 43 -54 -49 116 -66 -100 145 161 -7 112 30 80 -219 -71 -110 -20 -141 109 -213 113
7735A13N3k7k23qJ32j03Q4N8r7k09J78Q7L4j09N6m6J31q6j90J44k07K73o4r0P3
$$ 113 166 139 -84 -92 40 -63 21 79 -18 -227 -49 38 72 -37 19 -27 104 18 -172 -28 -235 38 -26 -116 -43
7760d3MK5j36J98j81J67Q6N3k47K2p3J98O4k75Q0n6J27j38K26l05J24Q0l3M3K6
$$ -43 -39 -14 -150 48 -133 34 120 173 -74 -52 -125 73 137 -138 -58 -114 13 -125 101 -204 -80 0 -33 10 36
7785C6m3O2j00j5P2q3K28k63n8L60j2j79N1P3k62J04p6P8J65o8J19j42j32r2K42
$$ 36 -7 55 -45 -60 12 -71 157 -106 -164 196 184 5 56 129 -133 -29 -105 -27 138 70 189 47 -85 -177 65
7810F5k51J81o4J58J12l58L5K10k05m3r4J09l0q1L69l54L48j51k6J56l16O3J20
$$ 65 -186 -5 -69 89 201 -157 -122 88 -117 -160 -254 -145 -175 -256 113 -241 107 -44 -70 86 -230 -167 -47
7833d7J75J47k72L2j41J28K48l29L17j78k40J52J08Rm4k46J08j36Q3K68k10K24
$$ -47 128 275 3 35 -106 22 270 -59 258 80 -160 -8 100 109 65 -181 -73 -209 -126 142 -68 156
7855A56k34J90m7k59J21j05J01L02r3q0j87J64q9J77mJ58l50%K8M3K9l4N1j79
$$ 156 -78 112 65 -194 -73 -178 -77 225 132 52 -135 29 -60 117 113 271 -79 -79 -51 -8 21 -13 38 -141
7879a41J11r0K48k29L46l05O8m7J48j9j99L9j7J0Q2mp4J11oj62J28K54k33n3J27
$$ -141 -30 -120 128 -101 245 -60 8 -39 109 90 -109 -70 -87 -77 5 1 -73 38 32 -130 -2 252 19 -34 93
7904I3l1n5j87L47j02n8O4j90K70k37J72j77N4n5P0J25k76K78l28K61l6l1j9J23
$$ 93 62 7 -180 167 65 7 71 -119 151 -86 86 -91 -37 -92 -22 103 -173 105 -223 38 2 -29 -48 75
7928G5r8O5j04J34r3M0r4M6P7j99M37l86J81k12L23j70l11K00J94l05K33j08L0
$$ 75 -23 42 -62 72 -21 19 -75 -29 48 -151 286 -100 81 -131 192 22 -289 -89 105 -200 33 -75 -45
7951d5J96o4J08j26lJ88m19J16K52n6l61K48r1l9K57j57n6K04n4k36J5J89r8K32
$$ -45 151 87 195 69 66 254 -165 -49 203 147 -214 34 -57 -96 161 4 -52 152 98 -138 -123 66 -32 200
7975B00l41O5K5M6J9OJ70j73j45K4l1J20J8JJ65j09n3J8Q1k57J86O8L7j18J04
$$ 200 -141 -76 -51 -5 14 20 190 17 -128 -104 -135 -15 3 4 169 60 7 25 106 -151 35 103 140 22 126
8000A26j99l12L37O3O1J56l80kL01j66j17O2J02Q3k87K30l4N0O9k63j34J89k03
$$ 126 -73 -385 -48 15 76 232 -148 -150 151 -15 -132 -70 32 115 -172 58 24 74 143 -120 -254 -65 -268
8023b68J73J91j96k2M3J12Q4j58Q0q9k1q8K56nJ0k12m3K26n4j27K0m3k5J31R4
$$ -268 -95 96 -100 -122 -79 33 117 -41 39 -50 -71 -159 97 92 102 -110 -153 73 19 -108 -88 -131 -156 -25 69
8048F9l1m3L9q0r6J86j50k6K5J27o6m7k6L5J09j47J17j02K42j43J76j55m2M0J25
$$ 69 38 -5 34 -46 -142 44 -106 -132 -107 20 -46 -93 -119 -84 25 -122 -5 -107 135 -8 168 13 -29 11 136
8073A36N1m31J80Rl5L9J6J70j81Q6J78k06r2J07k17L35n01nJ83K21n6Q3m1K01
$$ 136 187 -244 -64 -55 -90 -51 -35 135 -46 40 218 12 -80 27 -190 145 -356 -361 -178 43 -13 70 29 230
8097B30k39k6q3R9k91M18q1j97J37M20m58P3N05k29J53j34m38M9M55o11K13j57
$$ 230 -9 -35 -118 -19 -310 108 27 -170 -33 387 -71 2 507 278 431 297 -141 -92 363 -248 -35 -192
8119a92J30J92K55q58N20o7j21J33K16n67P51l51l92j02L12K95o52o5M40N64q22
$$ -192 -62 130 385 -473 47 -20 -141 -8 208 -359 392 41 -351 -453 -141 154 -498 -563 -123 441 -381
8140c81O5J75k38M34J47p3l1J8k73J01lO6r7J03j06R5r7K75k24j11L53m56K46
$$ -381 -316 -141 -379 55 202 129 98 116 -157 -56 -59 7 -90 13 -93 2 -95 180 -44 -155 198 -258 -12
8163a2j4QJ03j24K1K32P4k77j41Q7R8k5j24k0J01r9K05O5r4R7j24J9R9j85J3K6
$$ -12 -26 -18 85 -39 -18 214 288 11 -130 -43 55 30 -94 -114 -13 -112 93 158 64 161 37 56 155 -30 -17 9
8189Il81M6
$$ 9 -372 -326
8191c26
$$ Imaginary data points
##PAGE= N=2
##DATA TABLE= (X++(I..I)), XYDATA
0@%%%%%%%%%%%%%Qj6J6j6J6k4L2l4M2n3O2p4Q8j00J17j36J56j80K06k35K67l01
$$ 0 0 0 0 0 0 0 0 0 0 0 0 0 0 8 -8 8 -8 8 -16 16 -18 24 -29 33 -41 47 -53 64 -72 84 -96 110 -125 142 -159
35a59L41l86M34m85N41o03O70p45Q27r16J014j121J236j364J505j656J824k011
$$ -159 182 -204 230 -255 286 -317 353 -392 435 -481 533 -588 648 -716 789 -867 957 -1054
53a054K215k443K701k990L316l692M130m645N261o017O971q216R922j2428J6541
$$ -1054 1161 -1282 1419 -1571 1745 -1947 2183 -2462 2799 -3218 3753 -4463 5459 -6969 9572
68I572k4941P4833j40830r7785O0207J38679J80992j02087j02595j46876j1831
$$ 9572 -15369 59464 -81366 -179151 -118944 19735 200727 98640 -3955 -150831 -162662
79a62662J78001J32080J9799j65086j72739K4382J40019J63001j7875j23504j42693
$$ -162662 15339 147419 167218 2132 -170607 -146225 -6206 156795 138920 15416 -127277
90a27277l2256J42909J29294N0155j22325j71655j3456Q6557J88409K9389j41796
$$ -127277 -159533 -16624 112670 162825 40500 -131155 -144611 -58054 130355 159744 17948
101A7948j02913o6826J02252J38834M2213m3681j77595o5654Q5943J44026R2931
$$ 17948 -84965 -151791 -49539 89295 131508 87827 -89768 -155422 -69479 74547 167478
112A67478j11394j30718o0558O0561J43673M5667j9428j37835j07172P1627J10210
$$ 167478 56084 -74634 -135192 -74631 69042 114709 95281 -42554 -149726 -78099 32111
123C2111J10986m7131j48359o4960J5059J40192Q4991l7222r2125j19264K7011
$$ 32111 143097 95966 -52393 -117353 -102294 37898 122889 85667 -6458 -125722 -98711
134i8711J09746R9425Q398j38096r0362M696J04932J15835k4247q1562j03480
$$ -98711 11035 110460 118858 -19238 -109600 -104904 28 115863 91616 10054 -93426
145i3426j6634J00035R0725M2794j03066j19906n538P5398J23518J1059q5039
$$ -93426 -110060 -10025 80700 123494 20428 -99478 -105016 -29618 93900 104959 19920
156A9920q5338m7212Q1005R6491L8027n0292j24478l4524N9052J08389N1270p0920
$$ 19920 -65418 -112630 -31625 64866 102893 52601 -71877 -106401 -47349 61040 112310 41390
168D1390r3126n3523N2103J01981M7307l0720j08922n8658L9118R4664P8854m9459
$$ 41390 -51736 -105259 -53156 48825 96132 65412 -43510 -102168 -63050 31614 110468 61009
180F1009r4735o0492K1925J05197N3137j2795q4878q6365K6298P8755Q5100q149
$$ 61009 -33726 -94218 -72293 32904 86041 73246 -11632 -97997 -71699 7056 92156 84007
192H4007j02731o2265N68Q6755P8095j2808o3135q6545m576P7684P4892K0679
$$ 84007 -18724 -80989 -80421 6334 84429 71621 8486 -78059 -82635 -4951 69941 90620
204I0620q0647q3842q712O4443Q9830R930o1781q0497k6392O2982P8990L4152
$$ 90620 9973 -73869 -82581 -18138 71692 81622 19841 -60656 -87048 -24066 54924 89076
216H9076n6035r1589k7804M9536R2010L1500n3583p6672m2436M6623P8388M2588
$$ 89076 33041 -58548 -86352 -36816 55194 86694 33111 -43561 -85997 -39374 39014 81602
228H1602l0304r0770m4293L3366Q2986N4410l9611p5374n1294K4484Q0609M7960
$$ 81602 51298 -39472 -83765 -50399 32587 86997 47386 -27988 -79282 -54798 25811 73771
240G3771j4192p6408o1622J9227P0725O5829j4429p6231n7377O508P2081N9787
$$ 73771 59579 -16829 -78451 -59224 11501 77330 62901 -13330 -70707 -64199 7882 67669
252F7669m576o1519o8002k72O1120O9273Q172o7136o5689q259N9362O8690P566
$$ 67669 63093 1574 -66428 -66700 -5580 63693 71865 4729 -60960 -69219 -9857 58833 66399
265F6399n0636o7820j8583N1139O8177K4830n0412p1868k2679M5041P2420K3526
$$ 66399 15763 -52057 -70640 -19501 48676 73506 23094 -48774 -71453 -26412 46008 69534
277F9534m1906o6360l1078L7793O6466L5216l2106p0639l6745K9940P0809L8454
$$ 69534 27628 -38732 -69810 -32017 34449 69665 37559 -33080 -69825 -39885 30924 69378
289F9378l0532o3912m1154K3385O3804M2333j5441o4126m8866J5826O3282N0386
$$ 69378 38846 -25066 -66220 -42835 20969 63302 47861 -16265 -65131 -49305 13977 64363
301F4363j4507o1664m8020R153N7189M9863k689n4603n5071n18N4833N6948K080
$$ 64363 49856 -11808 -59828 -50675 6514 56377 53688 -915 -55986 -56504 -1671 55277 57357
314E7357n3966n5450m566M9750N4837R195m5032n7417j3416M2635N8924J8401
$$ 57357 3391 -52059 -56625 -6875 47962 57157 12125 -45292 -58708 -16073 42851 61252
326F1252m3516n9558j7736L9329N8501K0267l5889n5787k5191L0481N8642K8923
$$ 61252 17736 -41822 -59558 -20229 38272 58539 22650 -33137 -58328 -27847 30795 59718
338E9718k9028n9672l0423K8288N7634L0565k4238n4899l3361J9178N3507L8749
$$ 59718 30690 -28982 -59405 -31117 26517 57082 32844 -22055 -55416 -36238 17269 56018
350E6018j6572n5384l9283J4580N4161M0387j3391n0527m0756P606M9293M2926
$$ 56018 39446 -15938 -55221 -40641 13520 53907 40516 -10011 -50767 -43161 6132 49058
362D9058l689m8235m5465J313M7324M6957K53m6437m5630k711M2377M6688O310
$$ 49058 45369 -2866 -48331 -47018 306 47263 47516 1079 -44551 -47262 -4885 41803 48113
375D8113l9209m8196j1148L9106N0062J1923l7917m9273j3060L4350M8392J6028
$$ 48113 8904 -39292 -50440 -11334 38728 50651 12734 -36539 -49599 -15249 33143 49171
387D9171l0311m8862k0522K8586N0539K2517k7827n0007k2916K4743M8505K4822
$$ 49171 18860 -30002 -50524 -21938 28601 51118 23291 -26716 -49632 -24889 23616 48438
399D8438k1455m6777k8343J8559M7079L0590j6374m7385l1213J3736M6472L2474
$$ 48438 26983 -19794 -48137 -29578 17501 48091 31717 -15668 -46881 -33145 13327 45801
411D5801j2155m3651l4183Q634M2560L5745n325m2279l7496L877M1685L8179l506
$$ 45801 33646 -10005 -44188 -35554 7006 42751 37426 -4853 -42349 -38472 3213 41392 37886
424C7886l8175l8209r34L6853L8381O026l6636m1584m979L3275M3065O804l3937
$$ 37886 -289 -38498 -39432 -2579 35802 41828 5192 -36392 -41371 -8096 34969 41773 7836
437G836l8498j1850L1353M1132J1219k5828m3964j4157K7576L9770J9115k6250
$$ 7836 -30662 -42512 -11159 29973 41192 15364 -28600 -42757 -15181 24589 43704 17454
449A7454m1546j7008K0368M2677K0050k0716m0021k2916J8000M1248K3146j6036
$$ 17454 -24092 -41100 -20732 21945 41995 21279 -18742 -41658 -23658 17590 40736 24700
461B4700l9401k5357J4832L8134K4378r335l8140k8359J0079L5217L1919q171
$$ 24700 -14701 -40058 -25226 12908 37286 27951 -10189 -38548 -28469 6748 38667 30496
473C0496l8737k6406L397L7144K9578o735k9155l3908K195L3596K9082L689l3577
$$ 30496 -8241 -34647 -31250 5894 35472 28737 -418 -34326 -32131 1465 30547 34236 659
486F59l2622r1K7000L5335K996k7559l2838q710K8862L3364P576k3361l6970q036
$$ 659 -31963 -32054 -5054 30281 33277 5718 -27120 -35830 -6968 26396 33972 10611 -26359 -34395
500c4395K2972L4196J2703k3751l2388j4008J9918L4114J3144j5197l4887j6830
$$ -34395 -11423 22773 35476 11725 -20663 -34671 -14753 19361 32505 17308 -17579 -34409
512c4409J6267L4863J8643j6933l2524j9924J3385L4156J7759q302l3916k2937
$$ -34409 -18142 16721 35364 18431 -14093 -34017 -20632 13524 31283 22981 -10935 -33872
524c3872J3116K8364K4842q330l2163k1792L994L0806K5923n162k8358k8679M220
$$ -33872 -20756 7608 32450 24120 -8043 -29835 -25841 4965 30888 25726 -2632 -31311 -27091
537b7091K8292K5528K519l0288k4991j801K5191K9119J21k1687k9557m464K4127
$$ -27091 1201 26729 29248 -1040 -26031 -27832 -2641 26478 26599 4912 -24645 -29109 -4982
550d982K6946R079k4331k9663o472J9136L2725O641j9819k7077j4653K1918K8567
$$ -4982 21964 31043 6712 -22951 -29423 -10287 22438 29079 9260 -17817 -32470 -10552 18015
563A8015J0926j4025l3393j0640J5583K7349J7113j6144k7106j7179J1583L1044
$$ 18015 28941 14916 -18477 -29117 -13534 13815 30928 14784 -12322 -29501 -17918 13126
575A3126J4946r192k9363j8740J0876K6927J9672q535k6744k0250O334K6905J9448
$$ 13126 28072 18880 -10483 -29223 -18347 8580 28252 19717 -7027 -27277 -20943 5962 25410
588B5410k684k6600k2720N009K2140K5873k961k5367k0917k968K5985K3395r81
$$ 25410 22726 -3874 -26594 -21585 555 26428 23467 -1900 -22817 -25785 200 23595 22614
601B2614j8582k7610j073K1493K2207P907k3228k3275n120J6356K8622M589j7051
$$ 22614 4032 -23578 -24651 -3158 19049 26956 3728 -19547 -24667 -8311 20311 24900 7849
614G849k4639j0357J9663K3072R973j4489k7103q714J2705K5743J2192j4244k3204
$$ 7849 -16790 -27147 -7484 15588 25561 11072 -16031 -24745 -12040 13703 25895 11651 -11553
627a1553j4115J2706K4113J3287q450k6407j3728Q157K3792J7063r320k2220j6859
$$ -11553 -25668 -12962 11151 24438 15988 -10419 -24147 -15990 7802 24865 15545 -6675 -23534
640b3534O163K3864J5512l130k4096j7633N037J9772K0725l598k1326j7765r60
$$ -23534 -17371 6493 22005 18875 -5221 -22854 -17817 1955 22680 19082 -2244 -20009 -20969
653b0969K2090J8704o2j7749k2133r3J7843K0726L366j9164j8956n284J7463K1352
$$ -20969 1121 19825 19763 2014 -20119 -20212 -2369 18357 21723 2559 -16397 -21681 -4218 17134
667A7134L315j3656k2558o206J5646J9710R310j4968k1607p237J1272K3183P841
$$ 17134 20449 6793 -15765 -21971 -6325 13385 22695 7727 -13880 -21117 -9845 13338 21179
680B1179j1360k0429j1809J2039K0060J1634q910k2361j0432P441K1112J3086
$$ 21179 9819 -10610 -22419 -10380 9680 21314 12404 -9957 -20389 -12948 8164 21250
692B1250r008j8172j4813O637J9765J3580l638k0553j4637M923J7771J6392m276
$$ 21250 12242 -5930 -20743 -14106 5659 19239 15601 -4952 -19589 -14666 3105 19497 15221
705A5221j7641j5144P17J8563J5466M87j8282j6814P39J5257J8527K04j5829j5932
$$ 15221 -2420 -17564 -16847 1716 17182 17669 -613 -17427 -16688 -1431 17096 17300 1471 -14461
719a4461m321J6509J6945L167j2760j9631l670J3205J7633O674j4141j7093o597
$$ -14461 -18782 -2273 14672 17839 5079 -14552 -18222 -5017 12616 19290 5149 -11944 -18541
732a8541J1301J8929O171j0030j7720r215J1072J7026R743r185j8482r115P754
$$ -18541 -7240 11689 17860 7830 -9890 -19105 -8033 8993 18736 9551 -8931 -18046 -10292
745a0292J8250R376o245j7110j2070O680J6970J1474m115j8151j1348L822J6410
$$ -10292 7958 17334 11089 -6021 -18091 -11411 5559 17033 12918 -5233 -16581 -12759 3651
758C651J3119l815j5396j3794K244J6129J3148n28j5740j4617J054J4154J5230
$$ 3651 16770 12955 -2441 -16235 -13991 2138 15286 14758 -982 -15599 -14545 -391 14839
771A4839j80j3806j4587j717J3872J4399K928j2843j5775k828J1905J5899L797
$$ 14839 14659 853 -13734 -15451 -1579 12820 15748 2905 -12870 -15698 -3793 12106 15903
784A5903j1982j4775n258J0957J5448N838r594j6380o141Q892J5886P564r131
$$ 15903 3921 -10854 -16112 -5155 10293 16131 6537 -9843 -15984 -7092 8794 16358 7227
797G227j5262p750P354J5887P948o376j5491r204O096J4980J0189n410j5091j0010
$$ 7227 -8035 -15785 -8431 7456 15404 9028 -6463 -15667 -9571 5409 15598 10188 -4903 -14913
811a4913M056J4945J0470l573j3853j1441K755J3656J1504j317j3789j2054J044
$$ -14913 -10857 4088 14558 10985 -2868 -14309 -11554 2102 13606 12289 -1500 -13554 -12510
824a2510J3231J2341m47j2544j2549o13J1780J3169J921j2138j3370j895J0995
$$ -12510 721 13062 12615 71 -12478 -13091 -1311 11858 13779 1641 -11729 -13624 -2629
837b629J3805K334j0198j3190l908R719J3397M583r010j3945m769Q373J3663O003
$$ -2629 11176 13510 3312 -9878 -13786 -4067 9330 13913 4903 -9042 -13811 -5438 8225 14228
851A4228q598j2989o356O910J3555O819o263j3425p660N963J3134Q131n141j3016
$$ 14228 5630 -7359 -13715 -6805 6750 13569 7306 -6119 -13779 -7816 5318 13449 8308 -4708
865d708q454M316J2737Q935l609j2169r648K744J2316J0110k218j2183r936J460
$$ -4708 -13162 -8846 3891 12826 9217 -2952 -12600 -9856 2460 12570 10352 -1831 -11767 -10307
879a0307J1535R924n35j0934j0818J11J0459J1161N04j0193j1043j446R768J1498
$$ -10307 1228 11152 10617 -317 -11135 -11024 -565 10596 11100 907 -10136 -11582 -1814 9684
893I684J705r039j1303l013Q882J1531L518q353j1872l628P860J1515M419p037
$$ 9684 11389 2350 -8953 -11966 -3084 8447 11965 3612 -8260 -11888 -4028 7487 11906 4869
907D869j1935n031O682J1879N123n756j1414o223N635J1272O463m964j1381o819
$$ 4869 -7066 -12097 -5415 6464 11587 5831 -5583 -11806 -6171 5101 11564 6600 -4781 -11600
921a1600M329J1170P188l531j0686q118L064J0957P917k486j0651q003J936R827
$$ -11600 -7271 3899 11087 7556 -3130 -11248 -8184 2773 10690 8204 -2447 -10450 -8514 1313
935A313Q939j279r818q925J34J0220R030k96q920r545l24R012R030J301q406r916
$$ 1313 10252 8973 -845 -9770 -9636 584 9614 9318 398 -9147 -9471 -459 8571 9872 1466 -8450
951h450j488P825J0125K158p767r657l186P258J0641K507o375j0303l418O174
$$ -8450 -9938 -2113 8012 10170 2403 -7254 -10440 -3182 7459 9966 3591 -6712 -10130 -3956
965c956R616M385n270j0498m093M687J0079N467n284r249o182M134J0480N536
$$ -3956 5660 10045 4775 -5723 -9816 -5129 4950 10417 5133 -4116 -10298 -6164 4316 9852
979I852l555r820o715M351Q597O830k663r749o055J942Q582P795k224q324p690
$$ 9852 6297 -3523 -10238 -5887 2710 9540 6877 -2872 -8927 -6985 1597 9392 7168 -1156 -8846
994h846J130Q851P405j108p580q540J66Q130Q026P06p638q579J43O380Q330K145
$$ -8846 -7716 1135 8540 7432 -148 -8688 -8522 -392 7634 8340 702 -7877 -7734 -1354 6976 9121
1010I121p771p754k659O961Q967J243n139r055l161O998P668K955n338q330l527
$$ 9121 1350 -6404 -9063 -2102 6865 8108 2969 -6086 -9247 -2249 5419 8374 3036 -5294 -8821
1025h821M758Q873M482n507p964m636M251Q492M412l057q367n515L200Q327N707
$$ -8821 -4063 4810 9292 3785 -4179 -8815 -4564 3928 8340 5283 -3084 -8599 -5399 2928 8635
1040H635l035q345n600K243Q193N793j784p951o032J431P386O759q07p621o595
$$ 8635 5600 -2745 -8345 -6102 2091 7884 6100 -1851 -7883 -6452 934 7693 6886 -735 -7330
1055g330L21P211P349m83o780p226m11O608P308Q43o632p226p87N547P702J334
$$ -7330 -7009 202 7551 7068 288 -6938 -7349 -741 6567 7410 778 -6448 -7235 -1688 6014 7348
1071G348n623p075k269N419P267K706n144p444k954M631P675K956m115p614l419
$$ 7348 1725 -5350 -7619 -2200 5067 7773 2629 -4815 -7769 -3138 4537 7493 3378 -4236 -7655
1086g655M034P034M035l206p760l758K523P714M625l192o669m931K055P350M396
$$ -7655 -3621 3413 7448 4242 -3518 -7276 -4753 2961 7586 4394 -2275 -7206 -5151 2199 6595
1101F595j314o820n552J923O512N442j377o518n305N70O388N795o25n592o109
$$ 6595 5281 -1539 -7091 -5168 1344 6786 5409 -1109 -6414 -5844 544 6339 5714 122 -5987
1116e987l51O147O000M81n521o455j016N847N952J182m735o798j176M545O441
$$ -5987 -6338 -191 5809 6290 769 -5686 -6702 -855 5097 6279 1544 -5254 -6430 -1885 4556
1131D556K302n033o082k195M058O663J794l343o189l068L636N985L606l180o699
$$ 4556 6858 1825 -4257 -6452 -2394 4269 6063 2720 -3469 -6537 -2901 3084 6690 3510 -3189
1146c189l186K727O514L299k421n732m169K180N942L946j529o232m050J344O052
$$ -3189 -6375 -3648 2866 6165 3744 -1988 -6157 -3977 1965 5911 4382 -1850 -5900 -4556 1496
1161A496M651j685n302m709L57N920M659l16n442m818O7N038N437j84m884n317
$$ 1496 6147 4462 -840 -5549 -5192 728 5387 5071 -371 -5189 -5122 -84 5353 5169 285 -5032
1177e032j07M710N118Q17m649n636o82M217N335J535m194n454j725M185N585J402
$$ -5032 -5139 -429 4689 5506 857 -4779 -5461 -1244 4091 5626 1432 -4022 -5747 -1562 4023 5425
1193E425l203n671k117L411N396K776l435n794k280K646N809K499k406n550k910
$$ 5425 2222 -3449 -5566 -2155 3241 6017 2582 -3212 -5492 -2846 2963 5462 3056 -2494 -5404
1208e404K116N311L278j628n554l429J497N421L517j393m781m139J177M837M230
$$ -5404 -3288 2023 5301 3673 -1881 -5310 -3813 1608 5125 3732 -1049 -5188 -4011 826 5056
1223E056q72n024m026N76M777M242o88m096m597K43M358M362M18m252m770l66
$$ 5056 4184 -840 -4866 -4290 487 4729 4041 -55 -4652 -4409 -51 4311 4729 477 -4293 -4659
1239d659M068M732O33l851m710r91L738M602J440l513m855j556L390M867J540
$$ -4659 -591 4141 4774 923 -3787 -4778 -1040 3562 5002 1489 -3366 -4922 -1532 3335 4875
1254D875l064m659j762K763M123K612j965n926j769K323M876K273j795m798k832
$$ 4875 1811 -2848 -4610 -1847 2276 4888 2923 -3003 -4772 -2449 2427 4700 2905 -1893 -4725
1269d725J862N060K315k213m442k275J317M542L442j322n008l196J243M295L488
$$ -4725 -2863 2197 4512 2299 -2143 -4418 -3101 1441 4883 3561 -1447 -4643 -3400 895 4383
1284D383j090l746l879N37L977L774k8m101l660k10L901L902j6l169m158m97L378
$$ 4383 3293 -453 -4332 -3795 182 3956 3928 -173 -3833 -4043 -142 3760 3744 575 -3583 -4080 -702
1301g02L867J349l590m421o76K967M297J405l304m086j428K703M397J429k548
$$ -702 3165 4514 924 -3497 -4173 -1206 3091 4496 1192 -2894 -4322 -1619 2778 4207 1659
1316A659m507j386K288M176K203k473m235k032K298M036K100j672m344k441J864
$$ 1659 -2848 -4234 -1946 2230 4433 1960 -2275 -4307 -2009 2027 4127 2455 -1889 -4330 -2466
1331b466L696L005j528l891l018J256M086K872j082l669l333R06L769L273n04
$$ -2466 1230 4235 2707 -1184 -4202 -2946 1140 4012 2930 -739 -4072 -3166 603 3876 3372
1346C372l767l275L43L760L141j71l536l265K6L156L647J84l068l584q68L709
$$ 3372 -395 -3670 -3327 433 3574 3403 -133 -3398 -3372 -216 3431 3615 547 -3037 -3905 -196
1362a96K833J054k769l227j195K518L791N47k190l346j985K537L820J690k125
$$ -196 2637 3691 922 -2305 -3500 -982 2809 3356 1166 -2180 -4165 -1628 2192 3882 1757
1377A757m279j818K163M096J695j541m122r23Q84L160K981j683m471j419J635
$$ 1757 -2522 -4340 -2177 1919 3614 2073 -2049 -2972 -2088 1072 4053 2370 -2101 -3520 -1885
1392a885L223K214j259k672l030N85L909J717l31l174l178J336L166K452m71k606
$$ -1885 1338 3552 2293 -379 -3409 -2824 1085 2802 2471 -703 -3881 -2545 621 3073 2602 -4
1408dl286L54L392K319J98k408m056N86K503L299K97l483k441j73K080L304N81
$$ -4 -3290 -2936 456 2775 2973 565 -3491 -2905 -402 2897 3194 -289 -2730 -2903 -823 2481 3062
1425C062j867l664j023K469L255J230k419l005j111J618L322J272j922k948j713
$$ 3062 1195 -2469 -3492 -1023 2232 3462 1043 -1962 -3073 -1455 1867 3139 1217 -1731 -3444
1440c444J834L058J787j351l522j728J505L183J976j418l064k165J296K924K286
$$ -3444 -1610 1448 3235 1884 -1638 -3366 -1861 1322 3298 1880 -1184 -3349 -2053 871 3157
1455C157r57k980k241Q72K928K131m68k840k613M12K911K532k2l124k661L98K447
$$ 3157 2200 -780 -3021 -2149 779 2910 2442 -398 -3011 -2599 312 2844 2822 -302 -2963 -2565 -118
1472a18K723j93k407k377n45K286L137K24k277k930k87K252K708P17k154l118
$$ -118 2605 2412 5 -2372 -2917 -631 2506 2730 453 -2477 -2764 -512 2196 2913 759 -2359
1488b359m17J811K940O19j658k757j296K412K533R04j611k523j199J473J898J540
$$ -2359 -2776 -965 1975 2594 936 -1821 -3117 -705 1828 2732 1121 -1402 -2601 -1128 770 2310
1504B310n62k953j229J133K453K044j937k428j588Q68K713J612q12k458j851M61
$$ 2310 1748 -1205 -2434 -1301 1152 3196 1259 -1169 -2757 -1889 824 2436 1624 -834 -2685 -2224
1520b224K889K046j67l190j784m3K655K403m33k480k045P0K159K615n3k117k517
$$ -2224 665 2711 2544 -646 -2430 -2473 182 2585 2152 -328 -2373 -2303 -144 2471 2418 301 -2216
1537b216j03K229K236K32j814k723l91J855K696P07k295k223o77K098K268J36
$$ -2216 -2319 -90 2146 2378 564 -2159 -2550 -695 2001 2708 413 -1810 -2487 -389 1879 2015
1553B015j434k054q31J241K565J064j433k864n79J002K583J584j555k396j167
$$ 2015 581 -1473 -2304 -1063 1502 2566 1133 -1731 -2310 -1308 1275 2859 1304 -1092 -2259
1568b259R97K220J647j213k263j754J206K188J402n98k579j399L68K696J576m53
$$ -2259 -1262 958 2605 1392 -871 -2625 -1419 769 2171 1573 -1006 -2405 -2037 659 2235 1782
1584A782k119j700j00K220K385k81j938k247K91J932J555M71k472j411l58J924
$$ 1782 -337 -2037 -2137 83 2468 2187 249 -1998 -1707 225 1780 2251 -221 -1632 -1990 -66
1600f6K273J3j797k489l26J904K022N84j664j915m03J156K336J152j606k396j099
$$ -66 2207 2220 423 -2066 -2392 -488 1534 2118 454 -1461 -1864 -708 1628 2780 1174 -1222 -2321
1617b321J148K666L26j176j563j622J430K165J316j012k622j244J468K197R97
$$ -2321 -1173 1493 1819 643 -920 -2542 -1112 1053 2369 1357 -1265 -2509 -1041 1156 2153
1632B153j172j816j142Q21K051J017l31k681q14K91K170J446m22k072j719J79
$$ 2153 981 -835 -1977 -1156 895 1912 1581 -1100 -1914 -1623 547 1993 1571 -501 -2220 -2041
1648b041K195J847m34j599j807J73K051J754o0j294k556l88J798K423J98j941
$$ -2041 154 2001 1567 -32 -1839 -1666 385 2139 2079 785 -1771 -2159 -361 2062 2260 319
1664C19j794k76J619J872O02j491k563l49J166K305M26q23k231l17Q89J589J133
$$ 319 -1475 -1751 -132 1740 2342 851 -1712 -2061 -895 1410 1836 1013 -1218 -1535 -646 943 2076
1681B076j518j230j227J066J576J076p08j816j523J067J929J208j098j444j338
$$ 2076 558 -672 -1899 -833 743 1819 1111 -705 -2228 -1161 768 1976 878 -566 -1904
1696a904M82J932J398l82k080j218L8K109J352k54j483k104Q98J532J292K55j638
$$ -1904 -1422 510 1908 1526 -554 -1772 -1734 375 1727 1473 -10 -2114 -1216 316 1608 1863 225
1713B25k231M73J714J239L14j479j546l58J456J472M37j620j957N96R76J796M12
$$ 225 -2006 -1533 181 1420 1734 255 -1291 -1649 -193 1279 1716 96 -1861 -1265 -289 1507 1919
1730A919j488j413q98J106J577J198j182j877p00J080J708P63j072j431p72M33
$$ 1919 431 -982 -1880 -774 803 2001 819 -1058 -1758 -678 1030 1793 721 -710 -1482 -1049
1746a049J834J064r61j770p71L86J858J067o85j545j011k00K299J331q68j121
$$ -1049 785 1849 888 -882 -1653 -1267 591 1658 973 -572 -1583 -1783 516 1847 979 -142
1762a42j738O89J585J253L7j767j448K63J365J565k66j351j410j29J538J675m59
$$ -142 -1880 -1191 394 1647 1684 -83 -1531 -1268 97 1662 1396 45 -1365 -1494 44 1719 1260
1779A260j036j420l84J216J421N50j135j425q72J549J323N91j161j640l08P35
$$ 1260 224 -1196 -1580 -364 1057 1607 472 -953 -1825 -276 1047 1638 477 -1163 -1471 -736
1795g36K277P2p59k311m56J417J454N43j125j121j088Q95J595J313j144j905q14
$$ -736 1541 1613 854 -1457 -1913 -496 958 1501 376 -745 -1833 -938 657 1970 826 -1079 -1893
1812a893Q65K005R16r7k716n42M06K129N61n87j652n97N95J074Q73J91j786j293
$$ -1893 -1028 977 1893 1796 -920 -1462 -1056 1073 1634 1047 -605 -1202 -607 467 1340 1531 -255 -1548
1830a548L50J302J143jl89k246l6J590R45p3j221j284M74J024J878k28k301r1
$$ -1548 -1198 104 1247 1246 857 -1389 -1425 165 1110 1037 -184 -1468 -994 30 1908 1680 -621 -712
1848g12j382J875P86J785j848j971k60P69K556L0j304j094j086J432J861j72j33
$$ -712 -2094 -219 567 2352 504 -1467 -1727 -958 1598 1628 324 -770 -1856 -424 1437 1265 1132
1865A132j838q33R40J119R20L08k022j079K22J890P89o00j176r87L38J111J204
$$ 1132 -706 -1539 -599 520 1440 1748 -274 -1353 -1131 759 1548 948 -228 -1215 -877 234 1438
1882A438m47j215j174M48J147J378m57j588j191Q70J123J097j06j301j085n1J444
$$ 1438 991 -224 -1398 -950 197 1575 1118 -470 -1661 -791 332 1429 1323 22 -1063 -1114 330
1899C30J026k18j038j016k93J121J308L17j023j675j54R43J620J22j258j109m22
$$ 330 1356 1138 100 -916 -1209 -88 1220 1537 514 -1161 -1315 -372 1248 1370 112 -997 -1419
1916a419R37J302O21p86j508l91N62J461Q32j037j466n30P88J462M52n96j512
$$ -1419 -482 820 1441 655 -853 -1244 -682 779 1611 574 -892 -1422 -634 828 1280 684 -828
1933h28q94Q15J682N48l67j655p75O70J379P15m31j484p24K26J282J380m67j371
$$ -828 -1722 -907 775 1323 956 -699 -1474 -804 575 1290 859 -625 -1349 -1123 159 1539 1072 -299
1951b99r13K49J092J065L5j268j219K08J041J361k36j356r93j05J058J414J21
$$ -299 -1212 -963 129 1194 1229 -39 -1258 -1050 -9 1352 1116 -240 -1233 -1338 -280 1134 1255
1968A255j160j048o44J240J217L55p48j602j24Q76Q74Q31p99j431k16Q41J095
$$ 1255 95 -953 -1597 -357 860 1215 467 -1135 -1259 -383 491 1322 523 -908 -1124 -283 812
1985H12P31m92j812k44N76J229L90n09j434n86M72J538O86o70j351m47M44R55
$$ 812 1543 1051 -761 -1005 -429 800 1190 681 -753 -1339 -867 671 1357 687 -664 -1111 -667 288
2003B88J039n99j288q22L04J126J203k43j309r99K88J240R47j77j261p32j67J252
$$ 288 1327 728 -560 -1382 -1078 48 1251 1008 -301 -1300 -1012 228 1175 998 -263 -995 -1162 90
2021I0Q97L67j280j372j2J095J135L09j117j208k27R93J397M08j179j019o03P79
$$ 90 987 1354 74 -1298 -1310 -215 920 1229 112 -1096 -1323 -330 1067 1475 296 -723 -1326 -547
2039e47J338L40o56j322l40N50J086P34m50j109r96P34J335O01p89j003p83M94
$$ -547 791 1131 475 -847 -1187 -637 449 1183 733 -376 -1372 -638 697 1298 509 -494 -1277 -783
2057g83J358M93m73j006q28N69R28R85n07q60q91K9J104J132l57j132q89j1J095
$$ -783 575 1068 595 -411 -1239 -670 258 1243 736 -124 -1015 -986 118 1250 893 -239 -1128 -1139 -44
2076d4J015O6j076j071L2J052R40N4q86j072j88R44J097J75p48r99k28O71Q49
$$ -44 971 1037 -39 -1110 -1078 -26 914 968 82 -990 -1178 -234 863 1038 290 -709 -937 -266 583
2095E83N95q49r35n53Q05J208L41p34j103n78O17J092N44l72j198p13O71J067
$$ 583 1178 329 -606 -1159 -354 854 1195 461 -642 -1220 -603 489 1033 661 -537 -1250 -579 488
2113D88N60m81q71q22N31J034M46k62r14p77K77J209L70q0r68r86K51R42J017
$$ 488 1048 567 -304 -1126 -595 439 885 623 -291 -1068 -791 418 788 708 -260 -1246 -995 -53 964
2132I64K2j249p86l1R88J030j55r19p22l03Q91J013R0q88q45j28N75J058K27l34
$$ 964 986 -263 -1049 -1080 -92 938 783 -136 -858 -1161 -270 743 833 -55 -900 -1028 -453 605 832 498
2152D98j293k09O76J022L79n87j344l72P48Q35N99m58r41m89N13R02O52o06r10
$$ 498 -795 -1004 -328 694 1073 486 -858 -1230 -482 353 952 494 -447 -936 -423 479 1131 525 -385
2171c85o93K36J209L72j48j190P0k68R94P19p92k21j037Q28p9J072K16r04p44
$$ -385 -1078 -842 367 739 591 -599 -529 -797 197 916 124 -97 -1134 -306 -385 687 903 -1 -745
2190g45l08J902j54Q05j479j209R02M73J21P03p41r70n6k03J184M00m68j845J342
$$ -745 -1053 849 695 1500 21 -1188 -286 187 308 1011 270 -700 -756 -959 225 625 157 -1688 -346
2209c46m32J936n4j150L7p04Q4J044J37m56o55o64N80J608nn19p60q15M83P15
$$ -346 -778 1158 1104 -46 -9 -713 -629 415 552 96 -559 -1223 -643 965 960 441 -319 -1134 -651 64
2229F4Q60l79o41r63N73Q48M60j6j115n12jJ025N14m4r28o48J44Q57N53Q5q69
$$ 64 924 545 -96 -1059 -486 362 822 806 -309 -821 -822 203 717 673 -255 -903 -759 98 651 736 -133
2250a33o31N7O65P68L8o95p18l40P88J004j80n71o04m20Q26Q26K89p01j117P5
$$ -133 -764 -707 -42 726 764 69 -649 -989 -201 803 623 52 -552 -972 -146 680 969 268 -849 -774
2270g74O44O31M72o16j048m4L41Q68N46k96j185m43M31J003K78m66o08m63K08
$$ -774 -130 501 973 357 -691 -735 -394 474 1020 724 -461 -904 -473 530 808 342 -266 -729 -521
2289e21R51M75n78n66o51K71R39N07l4j038o05J79J131K44j32q47o46K45Q54K72
$$ -521 430 905 327 -239 -890 -619 320 827 793 -245 -850 -671 460 704 572 -275 -921 -676 178 450
2309D50J16l61p34k43M55P71L87m3j382l56J031L42L96n95o69j62k32J370J651
$$ 450 566 205 -529 -772 -317 454 841 798 -584 -940 91 433 829 234 -435 -597 -829 541 2192
2328B192j906j051j97N53K98O80K85j633O37j34O85L48k07q88l97J23J055M11
$$ 2192 286 -765 -962 -409 -111 569 854 -779 -142 -276 409 757 550 -338 -735 -612 443 854
2346H54k50q62o79N56P87N04k38q40o19J60Q22N97j1r43n67J90O93R33l45n16
$$ 854 604 -258 -937 -381 406 910 672 -168 -787 -627 195 792 781 -162 -729 -539 154 1087 742 226
2366B26j043L64O63L75L11p10q62L7M75Q97j22m80r05l1N75Q65M27r26o00q8M27
$$ 226 -817 -453 210 585 896 186 -676 -639 -164 733 611 131 -774 -805 -230 635 1062 136 -464 -552 -125
2387a25P10K93j12q53n93J62R75M96k75q88m16L20M53N15p19k03m25K24Q3J383
$$ -125 585 878 766 -87 -680 -518 457 953 678 -210 -626 -306 147 662 -57 -260 -685 -461 -378 1005
2407A005m1j330P7L91k09o6P44r56J85r35J793k56J52r72n64L15O65J213jj157
$$ 1005 964 -366 -289 102 -107 -173 571 -385 -200 -1135 658 402 554 -418 -982 -667 -2 1211 1210 53
2427E3o10mN22Q43k04n42m13j76N36N56J27n39p06kK63O21K27l49m90l48L46O47
$$ 53 -557 -561 -39 804 600 58 -355 -531 5 561 688 149 -557 -559 -296 325 552 203 -287 -635 -289 358
2449C58K34k43p42l37L16O62N31l01r30k64J82R68J64j95m92l90j22O12L87O1
$$ 358 592 349 -393 -730 -414 248 779 478 -452 -716 -534 434 598 403 -89 -479 -601 11 398 459
2469D59o99m66J97O90L00J66n18p60Q5N39P06j13o59k62m49O89O36J45o02p15
$$ 459 -240 -706 -509 181 481 647 129 -631 -546 -7 699 586 -73 -335 -784 -95 541 686 84 -631
2489f31j22P12N54N2l68o23k78O35M83M71o97m65n72N83Q87M9m76m42n57L97Q62
$$ -631 -753 -41 513 565 197 -426 -704 -69 414 885 188 -277 -849 -266 621 670 194 -248 -805 -408 454
2510D54N0o37o3p20M40P99J91K2p44o40O83M75j26o7p32k30M55R08L8j48r57r33
$$ 454 504 -133 -196 -916 -476 323 514 536 -208 -848 -165 310 184 117 -615 -845 -390 518 556 408 -549 -1482
2532a482N70M54P98K3J86j809M98L45J207q10P70j162k29M96P14k96j0j438L94
$$ -1482 -912 -458 340 363 549 -1260 -762 -417 790 -20 750 -412 -641 -145 569 273 263 -1175 -781
2551g81j64P59N30o65J94o36Q45M0O42p56j02j114Q36P92m74M64j06o08j44Q03
$$ -781 -945 -186 344 -321 -127 -763 82 122 764 8 -94 -1208 -372 420 -54 410 304 -304 -448 355
2571C55N50o45l65j47k78M32P21j15n66m04o1O86M4J94m99o00J18O03O11L77j360
$$ 355 905 260 -105 -252 -530 -98 623 508 -58 -462 -523 163 207 401 -98 -698 -580 23 634 1011 -349
2592c49j09O6L36L33J09k70p50J79M56P16j42p28l30k3L01O43P7l41n46o8L94
$$ -349 -458 -392 -56 277 386 116 -634 -455 1 717 575 -153 -483 -506 -205 438 515 174 -372 -440 -46
2613d6L70K46k67p86j07J54Q81L3k02n08m74K78O81M52l26m71n91M61L02L56r4
$$ -46 324 570 303 -483 -590 -436 445 478 276 -232 -706 -428 253 705 379 -92 -683 -222 80 436 342
2634C42n02l38P9P13J47l8l72n58J96M99J74j8l00m88O2M57N43j59l35m45j30
$$ 342 -160 -498 -419 294 441 403 31 -527 -331 168 342 324 24 -464 -402 55 598 439 104 -341 -471
2655d71M48L93K9m6q11j79O03L39J35l10l54m70N60O20J45l01n06l80N24L77M25
$$ -471 -23 370 399 353 -458 -637 -34 305 440 130 -224 -694 -134 486 631 330 -176 -556 -32 345 770
2676G70m69o93j27K93N84L5j34m17l63J79L59L59p8o05j08J4M22J81K65o55j88
$$ 770 301 -392 -519 -226 358 393 259 -158 -521 -342 17 376 298 -307 -415 -401 21 202 467 -188 -376
2697c76r5L26O07j77j56q92M40O4O63k4k04n70L5J39M94J74j99p77j83M89P24
$$ -376 -471 -145 462 285 129 -763 -323 -259 404 380 176 -394 -359 -220 274 448 249 -528 -711 -222 502
2718E02M4j45q46L7J83N82K61m25n03k71M70K30J70l7q07q8M68K60M61j97p92
$$ 502 546 401 -445 -408 -225 357 618 193 -310 -581 -111 119 289 252 -555 -643 -175 85 546 349 -443
2739d43j26K31N29L11l79j7q03K02N30M26P8q59j75j30N03Q06l22o08k31k16O84
$$ -443 -569 -338 191 502 123 106 -697 -495 35 461 539 -320 -495 -625 -122 684 362 -246 -477 -693 -9
2760iL99K0r4p30J97K63K13Q5l6r76R0P62K17J22l50l92l03N42N47k26m62l02
$$ -9 390 410 316 -414 -217 46 259 344 308 -668 -578 184 401 523 173 -219 -522 20 567 341 -121 -423
2782d23PJ43P48K78m83n93k32K68L56M11j48n20m22K31N14L38k57l63k97J76N33
$$ -423 -416 -273 475 753 270 -323 -555 -287 69 480 332 -188 -610 -379 135 473 216 -147 -444 -268 265
2803B65J40j53m69k26J08J60N18O4n92k88J27M99L42j18l74o41K31O20K49K5n09
$$ 265 405 252 -217 -443 -335 -175 343 407 -185 -473 -346 153 495 377 3 -638 -407 213 462 487 -22
2824b2l16OR1P16j1l38k09m13L11M91P7k40l78j94K18L83L31l61n38o1J81N62
$$ -22 -338 -332 -241 475 464 126 -83 -496 -185 306 383 143 -235 -429 -211 172 503 142 -396 -457 -276 286
2846B86J74j26o51j42K95K01L68n0o32k14K74N10J02K5n33l17J41J74O83k8o19
$$ 286 460 334 -317 -459 -164 37 405 355 -277 -491 -217 293 395 420 -113 -430 -289 -115 568 540 -79
2867g9k96J43k8Q02j86n31l14J4M98M80k68j51l45k49N42K72j74j95m85N7M18
$$ -79 -375 -232 -260 542 356 -175 -489 -475 23 503 235 84 -261 -510 32 304 130 -65 -550 -493 -75
2888g5N25J13n78l94r0O08K01kk74k35l38L40P35K9n00m91l5L78M56O8k95l18
$$ -75 450 563 -15 -409 -499 109 310 308 34 -201 -539 -199 536 565 65 -426 -461 -83 373 441 146 -172
2910a72n38N52J25M13m9m73k43J11N01O1J11l52m44J10M07J56K53n00m35K1M50
$$ -172 -710 -158 -33 380 331 -142 -385 -274 227 288 399 47 -397 -287 120 276 529 29 -406 -385 65
2931F5M62m35N6m60J21K02N65j66m28j71k32L93N54Km32k16m51N09L25K02m25
$$ 65 527 92 148 -312 -191 11 576 410 -18 -189 -421 -28 526 528 96 -120 -571 -62 263 465 40
2952D0k45n0J91L62J62l1o80k98L75M34K48m63k06m67K54O34J0M6n68j69%O21
$$ 40 -205 -255 -64 298 460 429 -251 -549 -174 260 508 45 -161 -628 -374 260 270 316 -252 -421 -421 200
2974B00L29j42m93l81M0O67L02k80o13q4K64L22L75k29l06n41J41L32N29O0m31
$$ 200 529 387 -106 -487 -447 220 522 242 -371 -455 -191 131 506 277 -29 -570 -429 -97 432 492 61
2995F1m80oL11M61jl36m84N6M89K68nm62l64M4K42N32k3k51j93l24M83K36J61
$$ 61 -419 -425 -114 347 346 10 -474 -418 71 339 334 -128 -492 -448 -206 326 303 52 -141 -465 18 254 415
3018D15k63n68r3L76K76M14o91Q1l20J02M42J58Qp12K23k80L43L68j32j05l94
$$ 415 152 -416 -509 -133 143 557 -134 -53 -373 -271 171 329 337 -375 -152 -432 -89 279 147 42 -352
3039c52K68K68J67k53k8m68k3N04J60L0l44l68J51K80L85P8o11LJ9L47K17k20
$$ -352 -84 184 351 98 70 -398 -421 83 243 273 -71 -439 -288 -8 377 455 -156 -153 -134 213 430 210
3061B10k76l43K29P7L38J94m55l68OL29J87L99m26k07m51L68K96J23l25oo4J20
$$ 210 -66 -409 -180 -103 235 429 -26 -394 -388 -59 128 527 101 -106 -557 -189 107 230 -95 -101 -165 -45
3083d5K49J03k26l42k28M95K81J55k52n04J19j29N74M0q4m66j41L27K03L04l12
$$ -45 204 307 81 -261 -489 6 287 442 190 -314 -195 -324 250 290 206 -260 -401 -74 129 433 121
3104A21l92M5l7K37M94l95k13k36K18R4J83J07k54l58J18Q2M61N1n08j0J5J22
$$ 121 -271 -226 -263 -26 468 73 -140 -376 -158 -64 119 226 -28 -386 -268 -186 275 326 -182 -192 -177 -55
3126e5L00k0m76Q0K8K93J70m5J81j140L06M58K73jk84n21J26L12O20l67L74n86
$$ -55 245 225 -251 -171 -143 150 320 275 456 -684 -378 80 353 352 68 -453 -327 -15 605 238 612 26
3148B6k00k2O06j83l92K80k03J13L0M07K24j139K57j9M42K65N6q55l76L45M81
$$ 26 -174 -196 410 227 -165 115 -88 25 55 462 686 -453 -196 -215 227 492 548 -307 -683 -338 143
3169A43L96m86k5J89m41k4O32m18k22j44l2L04J74L50q48m14Q2M50J118o60m24
$$ 143 539 53 28 217 -224 -248 384 -34 -256 -400 -432 -128 46 396 -452 -866 -784 -334 784 124 -300
3190c00K63r2k88P44m26K69N8q85N34J88N22n16l43J60m3N01m28j3j52J1K45K6
$$ -300 -37 -129 -417 327 -99 170 228 -657 -123 65 587 71 -272 -112 -155 346 -82 -95 -247 -236 9 35
3212C5M0K67%o32r8M38J62l15J61k48j64O54O8K1p52J47J54L56j7N8q39J25J22
$$ 35 75 342 342 -290 -388 50 212 -103 58 -190 -354 300 368 389 -363 -216 -62 294 277 335 -504 -379 -257
3235b57M14L20l65k04o6pK10K20J78l12n14K38K27J59k44J12l77q6M15K99n9j90
$$ -257 157 477 112 -92 -158 -165 45 265 443 131 -383 -145 82 241 -3 109 -268 -354 61 360 301 111
3257A11n33K98o8L26M44n77l91K37K08J87J25k28n16J14K36K96o3m7k85k46K36
$$ 111 -422 -124 -192 134 578 1 -390 -153 55 242 367 139 -377 -263 -27 269 206 159 -126 -372 -136
3278a36L71Ll19j61k64K18M89k4N2m24l36K62N70J16l43k41r9N5J60K98l8k44
$$ -136 235 238 -81 -242 -506 -288 201 177 229 -195 -531 -269 301 417 74 -167 -266 -211 -51 247 209 -35
3300c5k53J85J68R1K12n89j20J18J19N25j71l71l80L89J14L80k81l07j98K6N37
$$ -35 -288 -103 65 156 368 -221 -341 -223 -104 421 250 -121 -501 -112 2 382 101 -206 -404 -378 159
3321A59M92k61k58n80L23o29J193K08q77Q4l30M68J7k53J15l56N12l48Q10k55
$$ 159 651 390 132 -448 -125 -754 439 647 -230 -146 -476 -8 9 -244 -129 -485 27 -321 489 234
3341B34n9m91m03P77q2L72k17j96k05L31M5J48k14J3o47K86P06j26Mm44j12L76
$$ 234 175 -316 -719 58 -24 348 131 -65 -270 61 106 254 40 53 -594 -308 398 272 276 -168 -280 96
3363I6J08K65l09k44j69q4O16K33l10o26J14R2L02K30o2l48K0j83K53L44j81o4
$$ 96 204 469 160 -84 -253 -337 279 512 202 -424 -310 -218 84 314 252 -96 -76 -259 -6 338 157 93
3385I3m82L8J69N25o6l63k17j10J07P06l0n66rj06J50N26m8k26m10Q6J57O59o07
$$ 93 -389 -351 -182 343 277 -86 -303 -413 -306 400 370 -196 -205 -311 -161 365 317 91 -319 -233 -76 583 -24
3408b4R4j91k02n00P08K34k32J2K61J13l97P86n87j5q24K98M04P61l26n50j17
$$ -24 70 -121 -323 -823 -115 119 -113 -101 160 273 -124 662 75 60 -764 -466 -62 699 373 -177 -294
3429b94j84M00O80l52l11m65K52K66N14j51k34j05k80J72M51j67j33m31q3N08
$$ -294 -478 -78 602 250 -61 -526 -274 -8 506 355 121 16 -264 -92 359 192 59 -372 -455 53
3449E3J19J67l90K2l67M37L06j74rm91K14j85M45J85J3o96o5L41K42K60k10m01
$$ 53 172 339 -51 -29 -396 41 347 173 164 -327 -113 -298 147 332 345 -351 -416 -75 167 427 217 -184
3471a84j71L74K33j26P3l47j10k4K69L74l26k86P9k57M67N21m64j47r7j6J34N74
$$ -184 -355 19 252 126 199 -148 -258 -282 -13 361 35 -251 -172 -429 38 559 95 -52 -149 -165 -31 543
3493E43j71m08k27O4N58j28o3j65n50L28J83K23K7k64m14k5N44K15p1l96j97J28
$$ 543 372 -36 -263 -199 359 231 168 3 -547 -219 -36 187 214 -50 -464 -489 55 270 199 -197 -394 -266
3515b66J78K95Q6j94m58K2J74M41J41j64o12j20L85L10j57J36k76j01q5M29R9
$$ -266 -88 207 293 99 -359 -337 -163 278 419 255 -357 -477 -92 218 61 197 -79 -180 -265 164 263
3536B63j23m38k13L39M13L1j4j42l28p5L35J95l9l8m32j15M65K84j2k95m64O2
$$ 263 140 -298 -511 -172 241 272 258 116 -212 -287 48 243 204 166 -266 -381 84 368 356 61 -403 -341
3558c41M57J54p4k09j81p6K11L57j00j58k75j70J60K97L02l43k29n7L67P7J06
$$ -341 116 270 196 -13 -194 -270 -59 298 198 40 -235 -405 -245 52 354 11 -218 -275 92 169 275
3579B75l80j15k05L38K96k0j65k95j8j31N58J78k82k04j78K70M20n8Q8p67j40
$$ 275 -105 -220 -425 -87 209 189 24 -271 -289 -420 138 316 34 -170 -348 -78 342 284 372 -395 -535
3600e35K30L23K32N4o17j49K80L49K58l72r3l52J48K4O07K1n93J56j07J51K21
$$ -535 -305 18 250 304 -313 -462 -182 167 425 53 -40 -392 -244 -220 387 408 -185 -29 -136 15 236
3621B36K22m93j01K5M1L56L9m32O1m63O13J84l3j33m72J73J36J28L98l44j56l19
$$ 236 458 -35 -136 -111 -70 286 325 -107 -46 -509 104 288 255 122 -350 -177 -41 87 485 141 -15 -334
3643c34L09M86rk36k24j66P8K26j08J03j88j65J12J04L03Rl67k1k89N70K13l49
$$ -334 -25 461 452 216 -8 -174 -96 130 22 125 -63 -228 -116 -12 291 300 -67 -88 -377 193 406 57
3665E7m28K42N4K3K64j67Om88J77J55L38K21n82k21L4K76M40n6q8o65J15L35N62
$$ 57 -371 -129 -75 -52 212 45 51 -437 -260 -105 233 454 -128 -349 -315 -39 401 345 257 -408 -293 42 604
3688F04k78l77k43j6Q9M48kl26K03n03L26M02K3j02n30n5L24PK45j35k60j54M4
$$ 604 326 -51 -294 -310 -221 227 225 -101 102 -401 -75 327 350 248 -282 -337 -13 -6 239 104 -156 -310 -266
3711b66L26K69l15p0j66K63M3L04l66j30k79J33M60Q3k17k64L7j84M80K64j26
$$ -266 60 329 14 -56 -222 41 84 388 22 -108 -387 -254 206 289 72 -192 -155 -339 141 405 279
3732B79m32l1N2K28K96M8l68l06j90N53O5n9j78j77k64N32K67j52j47j55k94M29
$$ 279 -153 -184 -132 96 392 440 72 -234 -424 129 194 135 -43 -220 -484 48 315 163 16 -139 -433 -4
3754dL19j13m1n88K10M4M10K2l24j36j45L28K71L7p4l39k42P4K73K17o8k90j51
$$ -4 315 202 161 -427 -217 -173 237 259 -65 -201 -346 -18 253 290 216 -123 -365 -291 -18 199 131 -159 -310
3777c10M7L93L90k23m98r6J82J32K63q4k00j41k2RL91O6k32k66j0J38L54j14m8
$$ -310 -263 130 520 297 -201 -297 -115 17 280 196 -4 -145 -167 -158 233 299 67 -199 -209 -71 283 169 121
3800A21l06j87J16N03k41N6m42J12J80M88k19j98k46KJ81M01o8l14k88O7K81K19
$$ 121 -185 -372 -256 247 6 62 -380 -268 -88 400 181 -17 -263 -261 -80 321 253 -61 -349 -282 -1 218
3822B18J55l90J47m43K05L62J44l11l95O3J83J56M41j78m67j47J94L91mj43k59
$$ 218 373 -17 130 -313 -108 254 398 87 -308 -245 -62 94 535 357 -110 -257 -63 328 324 181 -78
3843g8j74o6K08K64O7k74k4m27M30L53q6k33r8nJ47K86j41j83k15O0N9N40j59
$$ -78 -252 -318 -110 154 221 -53 -77 -504 -74 279 193 -40 -138 -143 4 290 149 -34 -249 -189 -130 410 251
3866B51l11q5l90K32P80l44j77j48l36L97M47J41m75j18l49K60L38J83J6k66n71
$$ 251 -60 -145 -535 -303 477 133 -44 -192 -528 -131 316 457 -18 -136 -485 -225 113 296 312 46 -525
3887e25N48K05L3o8m08j01L11J17P7o8k44J8j35L32J16J06m28k11K25K37K10j3
$$ -525 23 228 261 193 -215 -316 -5 112 189 121 -123 -105 -240 92 208 314 -114 -325 -100 137 347 334
3909C34m02j16J16NM46rm48l41RN39J22K9k48j7k18J22J04K93l31l98K06P3K27
$$ 334 -68 -184 -68 -63 383 374 -74 -415 -406 133 255 284 36 19 -199 -77 27 320 -11 -409 -203 -130 97
3932I7J0N3k71k03J95N17j92ll76j98J94K45J78j7m32j89K61K59K88l35k79j21
$$ 97 107 160 -111 -314 -119 398 206 203 -173 -371 -177 68 246 229 -203 -392 -131 128 416 81 -198 -319
3954c19%K51L43p3k38k42q6L71L78j30k17l09J46R2K33J5k51k32R3J91J29N2k70
$$ -319 -319 -68 275 202 -36 -278 -364 7 385 255 38 -271 -125 -33 200 215 -36 -268 -175 16 145 197 -73
3977g3k76J45M32J94l60M5m54J37J65L77Ll56j11j8r8M08j02P8j53k87K92J08
$$ -73 -349 -204 228 422 62 107 -347 -210 -45 332 335 -21 -132 -150 -248 160 58 136 -17 -304 -12 96
3999I6M11m36j58j59K12J57l8M4k16k24K96nJ78J94o22p4K0L10M04j22l10l19
$$ 96 507 71 -87 -246 -34 123 85 129 -87 -311 -15 -20 158 352 -270 -344 -324 -14 390 268 -42 -361
4021c61K13K84M44m45m08k43L10L92k8k92j38N8PL73J50j74J05n08q8L02M79j32
$$ -361 -148 136 580 135 -273 -516 -206 186 158 -134 -272 -214 -207 166 316 142 247 -261 -349 -47 432 300
4043C00l57k64L1K62K88rl43O6j57K58R7J40l27j22k69K43J85M22j5m73l22K40
$$ 300 -57 -321 -290 -28 260 251 -92 -26 -183 75 172 312 -15 -137 -406 -163 22 444 429 -44 -366 -126
4065a26L46J83k77k67k7k68M12N6R8l58j56L73J29K11%m47j18n3L97J49j25l50
$$ -126 220 403 126 -141 -168 -436 -24 32 130 -228 -384 -11 118 329 329 -118 -236 -289 108 257 132 -218
4087b18K92m43L03K13J5l99Rk48L25M27J75l60n43J15K55L21l9k25j88j02K76
$$ -218 74 -369 -66 147 162 -237 -228 -476 -151 276 451 91 -452 -337 -82 239 200 -25 -213 -315 -39
4108c9J34J53P1o36r1K2P09k26q5k78J19OM22j4J48o49j39j04N09J23j88n6m4
$$ -39 95 248 319 -317 -408 -386 323 97 12 -266 -147 -141 281 267 415 -234 -373 -477 32 155 -33 -89 -133
4131a33o6K22J83m8j13j96j38L75K89n06P5m24L62J59R1K2m5k76Q4J62J43J03
$$ -133 -199 23 206 158 45 -151 -289 86 375 -131 -56 -480 -118 41 132 154 109 -167 -83 79 222 325
4153C25k84l12k06N16J24j26P0k01k45K04N90k40j32k05j15L44J33k41K20k17
$$ 325 41 -271 -477 39 163 37 107 -94 -339 -135 455 215 83 -122 -237 107 240 -1 219 2
4173Bk41O7L07K38j96k54j82J43L96J51k88j49k64K95L34P5p3o07J4O5M18R1j85
$$ 2 -239 -172 135 373 177 -77 -259 -116 280 431 143 -6 -270 25 359 434 361 -246 -232 -167 251 342 157
4196A57j77m47L39J73K49p0k90l20J74P0L16L25o35j05K94l56N10J48k28j62k81
$$ 157 -20 -467 -128 45 294 224 -66 -386 -212 -142 174 499 -136 -241 53 -303 207 355 127 -35 -316
4217c16L99J81oj46m23k27N31J66L32l54j84k90K77K73K8j52m12o4K38M73j73
$$ -316 83 264 258 112 -311 -538 -7 159 491 137 -47 -337 -60 213 241 89 -323 -387 -149 324 151
4238A51O2m65j03J11N85j10P1l53j72j11O06L8k66q8l22L93M1L73k63n59J98J36
$$ 151 213 -252 -355 -244 341 231 302 -51 -223 -334 272 310 44 -44 -366 27 68 441 178 -381 -183 -47
4260d7R4K05J24l22n45K09M17J64J19n13k35M5K96L02j5l39n2m2M21j23J00m44
$$ -47 47 252 376 54 -491 -282 135 299 418 -95 -330 -285 11 313 298 -41 -93 -135 286 163 263 -181
4282a81k7R8j79L11K42m48J64l15K17J78J48k61j72j62K93L00O6p9m53J47p0J45
$$ -181 -208 -110 -289 22 264 -184 -20 -335 -118 60 208 -53 -225 -387 -94 206 272 193 -260 -113 -183 -38
4304c8J70K14l89k97K77J83L66k37k42k93J08K24Q3J32n6n64J61K46K50q6k12
$$ -38 132 346 -43 -340 -63 120 486 249 7 -286 -178 46 129 261 205 -359 -198 48 298 212 0
4325@k42k7K86K35k4k48k31l2K93J98m7l02P3k42L89Q4J63l66l22J30K53P3K71
$$ 0 -242 -269 17 252 228 -20 -251 -283 10 208 161 -141 -68 -310 79 163 326 -40 -362 -232 21 94 365
4348C65j26K1l95P7M72k97J57p42K10N86j06L45l66j73k25nM28J76K14m93k28
$$ 365 239 260 -135 -58 414 117 274 -468 -258 328 222 567 201 28 -197 -202 226 402 616 123 -105
4369a05k84N60J50M13q09j90J36J26k36Q39l62o88L05M26K27m76N5l1n44L56M75
$$ -105 -389 171 321 734 -75 -265 -129 -3 -239 600 238 -450 -145 281 508 32 87 56 -488 -132 343
4390C43l57P3j088J927r3j277k82K28J003q35P28J25r9k88m75R73O25j018l40
$$ 343 -14 59 -1029 898 805 -472 -754 -526 477 -358 370 495 396 108 -367 606 1231 213 -127
4409a27N75q96j66O71P07L05j217L94k26p08J022l70J42R5m58J71N18n5K60r44
$$ -127 448 -448 -614 57 764 1069 -148 246 20 -688 334 -36 106 201 -257 -86 432 377 637 -307
4429c07O9p6J143L40j138m96j97L03Q29l19K0j5n01J04K15O53o21m35q6K87L27
$$ -307 -238 -314 829 1169 31 -465 -662 -359 470 151 171 156 -345 -241 -26 627 6 -429 -515 -228 99
4450I9K82o4K7p58R7N25o2L69l56l27O1J62m45N75L81j492Q77l10N01L35p66J98
$$ 99 381 317 344 -414 -317 208 146 515 159 -168 -107 55 -390 185 566 -926 -49 -359 142 477 -289 -91
4472i1J2j99J44O71k49r11p09J153J23P4K16o44P43r96O20M98K01k81q23O15p64
$$ -91 -79 -278 -134 537 288 -623 -1332 -179 -56 18 234 -410 333 -663 -43 455 656 375 -448 167 -597
4493e97J429q36M53p21K10R41j148J511r71m38N23n25K45K53K13j6j142L87N43
$$ -597 832 -4 449 -272 -62 879 -269 1242 271 -167 356 -169 76 329 542 526 -616 -229 314
4512C14L56j096L96L17M6o27lJ134j058P16k06j131J815l42k38o03M82j37j66
$$ 314 670 -426 -30 287 333 -294 -297 837 -221 495 289 -842 973 631 393 -210 272 135 -31
4531c1m11J19J83n85J526l50j330J070K87J61l74R36K36j778O84n10Q44m09M49
$$ -31 -442 -323 -140 -725 801 451 -879 191 478 639 265 1201 1437 -341 343 -167 677 268 717
4550G17k58m58m55K28L29R50n77j045K89J791j376J86K81n96L64J6k55L46k40
$$ 717 459 1 -454 -226 103 1053 476 -569 -280 1511 135 321 602 6 370 386 131 477 237
4569B37J7j698J236R5L75n05N9m70R98N85j050l47K4M70O29k55L39L1l48o82O18
$$ 237 254 -1444 -208 -113 262 -243 -184 -654 344 929 -121 -468 -444 26 655 400 739 770 422 -260 358
4590C58M67q89j27j29M64k03qR89j412L26K17M19O0K98j126o8K87k96P70j78M
$$ 358 825 -64 -191 -320 144 -59 -67 922 -490 -164 53 472 532 830 -296 -364 -77 -373 397 219 223
4611B23K18m32j22j84P31N4o76j56L82M63l61K67m63k19J88q3K10K37mr59L64
$$ 223 441 9 -113 -297 434 488 -188 -344 38 501 140 407 -56 -275 -87 -170 40 277 273 -686 -322
4632c22M74q6M22m51o20P5L86K27J80l42Mn06L87j10R57l19q00J96o34J005N5
$$ -322 152 66 488 37 -583 -508 -122 105 285 -57 -53 -559 -172 -282 675 356 -444 -248 -882 123 178
4653A78n7M73k33j27m10Q33j114J24p4K69Q08J2j484P38o32R56j91J019k42o98
$$ 178 121 594 361 234 -176 657 -457 -333 -407 -138 670 682 -802 -64 -696 260 69 1088 846 148
4673A48k61m38J149M4p0q65j46o21K169m95m65m73K44J09p9K22J46o2l19K43J82
$$ 148 -113 -551 598 642 572 -293 -439 -1060 1109 614 149 -324 -80 29 -50 172 318 256 -63 180 362
4694C62j02mp95K75J32K76oO78M0j054m70N32M64m7p96K38j11j39M89N61l84k28
$$ 362 260 256 -539 -264 -132 144 138 816 856 -198 -668 -136 328 281 -515 -277 -388 -527 -38 523 139 -89
4716h9N10j152O94L44K75m22j135J180o8J72M90r89k77L7M74P49l78n33%J04J34
$$ -89 421 -731 -37 307 582 160 -975 205 137 309 799 -190 -467 -430 44 793 415 -118 -118 -14 120
4737A20L08q7n22O56r69N40Q6P42n78k74m6k68N94j55J08j53k36k27N89j17L60
$$ 120 428 341 -181 475 -494 46 132 874 296 22 -24 -292 302 147 255 102 -134 -361 228 111 471
4758D71m71m16M38J50M3m50J28k62J85R02j63k04n87J60k73L93J47l03P0J12k87
$$ 471 0 -416 22 172 215 -235 -107 -369 -184 718 555 351 -236 -76 -349 44 191 -112 -42 70 -217
4779b17K37L39j71J70l53m37M94N8L6k93j12J10J29L94j84k07j93N2M55j5j46
$$ -217 20 359 188 358 5 -432 62 120 156 -137 -249 -139 -10 384 200 -7 -200 -148 307 292 146
4800A46j37k46j37L85L09J5j66l62j10J72J64P1M0k00k10K55J31J62l70n0k73
$$ 146 9 -237 -374 11 320 335 169 -193 -303 -131 33 104 144 -56 -266 -11 120 282 -88 -138 -411
4821d11K28L50J45k12j96r9J16J55M6o5j16k76J98K05J96j00j81l90M42j25J95
$$ -411 -183 167 312 100 -96 -195 -79 76 122 57 -59 -335 -137 68 264 164 -17 -407 35 -90 105
4842A05R8l06k49J84N6N39j17l58j14M4K86K52k6l73j21j71M61q0K4j33jj16r7
$$ 105 203 -103 -352 -168 -112 427 310 -48 -162 -118 168 420 394 21 -100 -271 190 110 134 1 0 -116 -213
4865b13K65J83j84k26N5j5K69J74k40k51L5K19L2K18l77P7k4R1J55k4q9n0l09
$$ -213 52 235 51 -175 -120 -135 134 308 68 -183 -148 71 103 321 -56 21 -3 88 243 219 130 80 -229
4888b29J35K12J13k92K11k28oJ60J60N3k72l93L29j8M87j43l70J33m05M68K13
$$ -229 -94 118 231 -61 150 -78 -84 76 236 289 17 -376 -47 -65 422 279 -91 42 -363 105 318
4909C18J1k02k02l90M21L55k51L7k71O2nN13k52n4j63l50L65K13J90k60j58j30
$$ 318 329 127 -75 -465 -44 311 60 97 -174 -112 -117 396 144 90 -73 -423 -58 155 345 85 -73 -203
4931b03J66L06k88J56l98J47J79K36k00K1k85R0Q4O9J34l10K4r8K28pO0Q6l48
$$ -203 -37 269 -19 137 -261 -114 65 301 101 122 -163 -73 11 80 214 -96 -72 -170 58 51 111 197 -151
4954a51l27Q0N58R3J36j76m59K62m5K63n9lj05k39R0L46p0k34m5r8K02J3L45j63
$$ -151 -478 -398 160 253 389 213 -246 16 -29 234 175 172 67 -172 -82 264 194 -40 -85 -183 19 32 377 214
4978B14k37j12J62J58m7m5k65k80M02J70P4j15l0l52M78J20j51J70l66j63L07
$$ 214 -23 -135 27 185 138 93 -172 -452 -50 120 194 79 49 -303 175 295 144 314 -52 -215 92
4999I2j36K66m1k74j62M24k85L22o2p3l79J68J15K28R0k28k18K15j42L02k6r4
$$ 92 -44 222 181 -93 -255 169 -116 206 144 71 -308 -140 -25 203 293 65 -153 62 -80 222 196 102
5021A02l26o7J43J05K23j08n70L19J24R0P0j83l43K1L91J50O7k48j66K27n8K50
$$ 102 -224 -291 -148 -43 180 72 -498 -179 -55 35 105 -78 -421 -400 -9 141 208 -40 -206 21 -37 213
5043B13l5l67J06o3j2K77K4j30q1k32K86k6K45j08l40j24K32J56P1N7l91M8J39
$$ 213 178 -189 -83 -146 -158 119 143 13 -68 -300 -14 -40 205 97 -243 -367 -135 21 92 149 -242 -194 -55
5066e5K96m4k88o8Q9J09j9J10J31l65m7p2L40L2K7n7k59n5J92M48rn09j26J17
$$ -55 241 197 -91 -159 -70 39 20 130 261 -104 -151 -223 117 149 176 119 -140 -195 -3 445 436 -73 -199 -82
5090h2k3L41l4l92J95j49J91k08L90k67J14k68K38J52m1r7m8j73K52J8j44o4j25
$$ -82 -105 236 202 -190 5 -144 47 -161 229 -38 76 -192 46 198 157 60 12 -161 91 109 -35 -99 -224
5113b24O8J46qL04l59J91k87P3J7K02Q2l49l1Q6K53j4j02k05rJ23K4K40K6k89
$$ -224 -156 -10 -18 286 -73 118 -169 -96 -79 123 205 -144 -175 -89 164 150 48 -157 -166 -43 -19 221 247 -42
5137d2j82P2l0M04m2m11P3j03J89L42j77j78o9J28m39M99L7l1j56J15j04K42m1
$$ -42 -224 -152 -182 222 180 -231 -158 -261 -72 270 93 -85 -154 -26 -465 34 71 40 -116 -1 -105 137 96
5160I6k12J63l57J03K69l2M1k34K11MK83l0j41k82mJ9K36K51n53K57k02L97j52
$$ 96 -116 47 -310 -207 62 30 71 -163 48 52 335 305 164 -118 -122 -103 133 384 -169 88 -114 283 131
5183A31N1j31Ml08M1K20J02K02k56j57n6J90N3J1l35O5N5P1K0J55k03o1o7J69
$$ 131 182 51 55 -253 -212 8 110 312 56 -101 -157 33 86 97 -238 -173 -118 -47 -27 128 -75 -136 -203 -34
5207c4J19K02j93j38R1q2M6p8J10n2O5J80j75kj1j18Jj86M88j87J63m18j2j6M57
$$ -34 85 287 94 -44 47 -35 11 -67 43 -9 56 236 61 59 48 -70 -69 -255 233 46 209 -209 -221 -237 220
5232B20ok76K40k19K35j36K22l32J16N6l04K38L02l42m5m4J00o6O5L78l79j62
$$ 220 214 -62 178 -41 194 58 280 -52 64 120 -184 54 356 14 -31 -75 25 -41 24 402 23 -139
$$ [...]
8191b15
##END NTUPLES=NMR FID
##END=
