##TITLE=1H_2PhBBC1410
 CDCl3
 8 sc, 
 17.10.2022
##JCAMPDX= 6.0         $$ Bruker NMR JCAMP-DX V2.0
##DATA TYPE= NMR FID
##DATA CLASS= NTUPLES
##ORIGIN= UXNMR, Bruker Analytische Messtechnik GmbH
##OWNER= root
$$ XWIN-NMR		Version 3.5
$$ Mon Oct 17 14:08:06 2022 Russian Standard Time (UT+4h)  she@DPX200
##.OBSERVE FREQUENCY= 200.1313499994
##.OBSERVE NUCLEUS= ^1H
##.DELAY= (6, 6)
##.ACQUISITION MODE= SIMULTANEOUS
##.ACQUISITION SCHEME= undefined
##.AVERAGES= 8
##.DIGITISER RES= 18
##SPECTROMETER/DATA SYSTEM= spect
##.PULSE SEQUENCE= zg30
##.SOLVENT NAME= CDCl3
##.SHIFT REFERENCE= (INTERNAL, CDCl3, 0, 15.7039)
##AUDIT TRAIL= $$ (NUMBER, WHEN, WHO, WHERE, WHAT)
$$ ##TITLE= Audit trail, XWIN-NMR		Version 3.5
$$ ##JCAMPDX= 5.01
$$ ##ORIGIN= Bruker BioSpin GmbH
$$ ##OWNER= she
$$ F:/spectra/data/she/nmr/H-F/1/audita.txt
$$ ##AUDIT TRAIL=  $$ (NUMBER, WHEN, WHO, WHERE, WHAT)
(   1,<2022-10-17 14:07:08.14 +0400>,<she>,<DPX200>,
      <created by zg, POWCHK disabled, PULCHK disabled
       configuration hash MD5:
       00 E9 B6 7A A2 85 ED C7 34 08 36 98 17 FE 4E 26
       data hash MD5: 16K
       E3 80 3E 22 FE EA B9 76 C4 40 88 55 87 14 4C 58>)
$$ ##END=
$$ 
$$ hash MD5
$$ 84 51 30 B8 5D 98 63 DB F7 75 F9 8D B9 9F E6 EC
##$RELAX= 
##$RELAX= 
##$RELAX= 
##$RELAX= 
##$RELAX= 
##$RELAX= 
$$ Bruker specific parameters
$$ --------------------------
##$DU= <F:/spectra>
##$EXPNO= 1
##$NAME= <H-F>
##$PROCNO= 1
##$TYPE= <nmr>
##$USER= <she>
##$AMP= (0..31)
100 100 100 100 100 100 100 100 100 100 100 100 100 100 100 100 100 100 
100 100 100 100 100 100 100 100 100 100 100 100 100 100 
##$AQSEQ= 0
##$AQ_mod= 1
##$AUNM= <au_zg>
##$AUTOPOS= <>
##$BF1= 200.13
##$BF2= 200.13
##$BF3= 200.13
##$BF4= 200.13
##$BF5= 200.13
##$BF6= 200.13
##$BF7= 200.13
##$BF8= 200.13
##$BYTORDA= 1
##$CFDGTYP= 0
##$CFRGTYP= 5
##$CHEMSTR= <none>
##$CNST= (0..31)
1 1 145 1 1 1 1 1 1 1 1 1 1 1 1 1 1 1 1 1 1 1 1 1 1 1 1 1 1 1 1 1 
##$CPDPRG= <>
##$CPDPRG1= <>
##$CPDPRG2= <>
##$CPDPRG3= <>
##$CPDPRG4= <mlev>
##$CPDPRG5= <mlev>
##$CPDPRG6= <mlev>
##$CPDPRG7= <mlev>
##$CPDPRG8= <mlev>
##$CPDPRGB= <>
##$CPDPRGT= <>
##$D= (0..31)
0 1.2 0 0 0 0 0 0 0 0.06 0 0.03 0 0 0 0 0.0002 0 0 0 0 0 0 0 0 0 0 0 0 
0 0 0 
##$DATE= 1666001227
##$DBL= (0..7)
120 120 120 120 120 120 120 120 
##$DBP= (0..7)
150 150 150 150 150 150 150 150 
##$DBP07= 0
##$DBPNAM0= <>
##$DBPNAM1= <>
##$DBPNAM2= <>
##$DBPNAM3= <>
##$DBPNAM4= <>
##$DBPNAM5= <>
##$DBPNAM6= <>
##$DBPNAM7= <>
##$DBPOAL= (0..7)
0.5 0.5 0.5 0.5 0.5 0.5 0.5 0.5 
##$DBPOFFS= (0..7)
0 0 0 0 0 0 0 0 
##$DE= 6
##$DECBNUC= <off>
##$DECIM= 32
##$DECNUC= <off>
##$DECSTAT= 4
##$DIGMOD= 1
##$DIGTYP= 9
##$DL= (0..7)
0 120 120 120 120 120 120 120 
##$DP= (0..7)
150 150 150 150 150 150 150 150 
##$DP07= 0
##$DPNAME0= <>
##$DPNAME1= <>
##$DPNAME2= <>
##$DPNAME3= <>
##$DPNAME4= <>
##$DPNAME5= <>
##$DPNAME6= <>
##$DPNAME7= <>
##$DPOAL= (0..7)
0.5 0.5 0.5 0.5 0.5 0.5 0.5 0.5 
##$DPOFFS= (0..7)
0 0 0 0 0 0 0 0 
##$DQDMODE= 0
##$DR= 18
##$DS= 0
##$DSLIST= <SSSSSSSSSSSSSSS>
$$ [...]
##$SUBNAM2= <"">
##$SUBNAM3= <"">
##$SUBNAM4= <"">
##$SUBNAM5= <"">
##$SUBNAM6= <"">
##$SUBNAM7= <"">
##$SUBNAM8= <"">
##$SUBNAM9= <"">
##$SW= 18.0517283424941
##$SWIBOX= (0..15)
0 0 2 0 0 0 0 0 0 0 0 0 0 0 0 0 
##$SW_h= 3612.71676300578
##$TD= 16384
##$TD0= 1
##$TE= 0
##$TE2= 300
##$TE3= 300
##$TEG= 300
##$TL= (0..7)
0 120 120 120 120 120 120 120 
##$TP= (0..7)
150 150 150 150 150 150 150 150 
##$TP07= 0
##$TPNAME0= <>
##$TPNAME1= <>
##$TPNAME2= <>
##$TPNAME3= <>
##$TPNAME4= <>
##$TPNAME5= <>
##$TPNAME6= <>
##$TPNAME7= <>
##$TPOAL= (0..7)
0.5 0.5 0.5 0.5 0.5 0.5 0.5 0.5 
##$TPOFFS= (0..7)
0 0 0 0 0 0 0 0 
##$TUNHIN= 0
##$TUNHOUT= 0
##$TUNXOUT= 0
##$USERA1= <user>
##$USERA2= <user>
##$USERA3= <user>
##$USERA4= <user>
##$USERA5= <user>
##$V9= 5
##$VALIST= <valist>
##$VCLIST= <CCCCCCCCCCCCCCC>
##$VD= 0
##$VDLIST= <DDDDDDDDDDDDDDD>
##$VPLIST= <PPPPPPPPPPPPPPP>
##$VTLIST= <TTTTTTTTTTTTTTT>
##$WBST= 1024
##$WBSW= 4
##$XGAIN= (0..3)
0 0 0 0 
##$XL= 0
##$YL= 0
##$YMAX_a= 41897
##$YMIN_a= -58257
##$ZGOPTNS= <>
##$ZL1= 120
##$ZL2= 120
##$ZL3= 120
##$ZL4= 120
##$ABSF1= 10
##$ABSF2= 0
##$ABSG= 5
##$ABSL= 3
##$ALPHA= 0
##$AQORDER= 0
##$ASSFAC= 0
##$ASSFACI= 0
##$ASSFACX= 0
##$ASSWID= 0
##$AUNMP= <proc_1d>
##$AZFE= 0.1
##$AZFW= 0.1
##$BCFW= 1
##$BC_mod= 2
##$BYTORDP= 1
##$COROFFS= 0
##$CY= 11.3945322036743
##$DATMOD= 1
##$DC= 2
##$DFILT= <>
##$DTYPP= 0
##$F1P= 2.36226072786647
##$F2P= -0.459571619588291
##$FCOR= 0.5
##$FTSIZE= 0
##$FT_mod= 4
##$GAMMA= 1
##$GB= 0.15
##$INTBC= 1
##$INTSCL= 1
##$ISEN= 128
##$LB= 0.24
##$LEV0= 0
##$LPBIN= 0
##$MAXI= 10000
##$MC2= 0
##$MEAN= 0
##$ME_mod= 0
##$MI= 1.114404
##$NCOEF= 0
##$NC_proc= 0
##$NLEV= 6
##$NOISF1= 3.799351
##$NOISF2= 2.8
##$NSP= 1
##$NTH_PI= 0
##$NZP= 0
##$OFFSET= 15.70392
##$PC= 1
##$PHC0= -18035.89
##$PHC1= 14.80069
##$PH_mod= 1
##$PKNL= yes
##$PPARMOD= 0
##$PSCAL= 0
##$PSIGN= 0
##$REVERSE= no
##$SF= 200.130013532006
##$SI= 16384
##$SIGF1= 3
##$SIGF2= 2
##$SINO= 400
##$SIOLD= 16384
##$SREGLST= <1H.CDCl3>
##$SSB= 0
##$STSI= 0
##$STSR= 0
##$SW_p= 3612.71676300578
##$SYMM= 0
##$S_DEV= 0
##$TDeff= 0
##$TDoff= 0
##$TI= <>
##$TILT= no
##$TM1= 0
##$TM2= 0
##$TOPLEV= 0
##$USERP1= <user>
##$USERP2= <user>
##$USERP3= <user>
##$USERP4= <user>
##$USERP5= <user>
##$WDW= 1
##$XDIM= 8192
##$YMAX_p= 0
##$YMIN_p= 0
$$ End of Bruker specific parameters
$$ ---------------------------------
##NTUPLES= NMR FID
##VAR_NAME=  TIME,          FID/REAL,        FID/IMAG
##SYMBOL=    X,             R,               I
##VAR_TYPE=  INDEPENDENT,   DEPENDENT,       DEPENDENT
##VAR_FORM=  AFFN,          ASDF,            ASDF
##VAR_DIM=   8192,          8192,            8192
##UNITS=     SECONDS,       ARBITRARY UNITS, ARBITRARY UNITS
##FACTOR=    0.0002768,     1,               1
##FIRST=     0,             0,               0
##LAST=      2.2672688,     0,               0
##MIN=       0,             -58257,          0
##MAX=       2.2672688,     41897,           0
$$ Real data points
##PAGE= N=1
##DATA TABLE= (X++(R..R)), XYDATA
0@%%%%%%%%%%%%%%%%qJ6j6J6j6J6k4L2l2M0m8N5o3P2q1Q9j04J20j36J53j72J94
38A03k16K41k69K99l34L70m08M52m99N51o07O69p37Q10q96R90j091J205j335J484
58G82j655J855k093K380k735L184l781M616n872Q006j2592M3455m5567k6415P8329
73D1897m4522k6608O1406k988o1727K8500K0038k9568R846K2895l0304o482J9678
86B061o504l635J7117q100j3086J0447P892q000l44O210k406p520Q993J2100j1407
101C818j1751J2493Q76j1329J2942Q817k2150l889J4765n839r23J3323j2254j2790
115a3891J1525p35l660J8097m390k2529J1367J0454j6235R488J7513k2679j0185
128a5860K4512k954j4082J8114K268k4531O316J8652j1742n471J4654p419j3462
$$ y = [0, 0, 0, 0, 0, 0, 0, 0, 0, 0, 0, 0, 0, 0, 0, 0, 0, -8, 8, -8, 8, -8, 8, -16, 16, -16, 24, -24, 31, -32, 40, -41, 48, -56, 64, -72, 81, -91, 103, -113, 128, -141, 158, -176, 194, -214, 238, -261, 290, -317, 352, -385, 425, -471, 519, -572, 633, -702, 782, -873, 982, -1111, 1269, -1466, 1718, -2063, 2553, -3319, 4687, -7905, 35550, -10017, -36432, 41897, -2625, -29233, 32173, 29185, -32542, -4042, 15996, -13572, -3726, 19169, -11135, -17617, 2061, -4443, -8078, 9039, 939, -12147, -1700, 6192, -1808, -2152, 4058, 1652, -5868, 3125, 15225, 3818, -7933, 4560, 5436, -5893, 7049, 15866, -6284, -10173, 4592, -1247, -2170, 11153, -1101, -13891, -2366, -3101, -6761, 11336, 6946, -15583, -4216, 6238, -9997, -509, 17004, -5675, -15860, 8652, 5698, -8384, 9730, 11998, -12533, -6217, 12435, 693, -4778, 9876, 2457, -11005]
141a1005J3596O832j4732J313Q820j0674k160J6752m267j4522Q213N860j2893
154h867N955J4744j3978r936J5603O48j1142J1498N852j7290p24J4208m387m239
168b055Q976l139j0391O213N488m793J364J199o583k2N990j943q53K844l864m321
184e890N490K474n001J313K856m480o83O880j028n340L578K275m967L378N602
199F457o317k588O679k289m427P094O56r864L407O610p937n30R449o911q301J0090
215A278K088j0153N039P178j0652j794J1595l616p087Q394J900r427M166P915
229F824o967k131P781k877n389O187J004o167K370L537n342p35M427k924l046
244c448M177l48m010K056K079l544N58L630k632j750L759o7k181K649P90k902
$$ y = [-11005, 2591, 9423, -5309, -3996, 4824, -5850, -8010, 8742, 4475, -10047, -1834, 4026, -8867, -2912, 11832, -2146, -12082, 3521, 4169, -6973, 4525, 10377, -6913, -7637, 6571, 2184, -2055, 6921, 3782, -6609, -396, 5092, 299, 1663, 2862, -3721, -3743, 2247, 304, -549, 2295, -1569, -5890, -400, 2074, -2927, -1614, 1242, -3238, -3921, 2959, 1931, -3409, 169, 2444, -2523, 855, 6457, 140, -2448, 4231, 1942, -2485, 4609, 5265, -4599, -1192, 5418, -2519, -3049, 6400, -511, -8812, 1278, 3366, -6787, -1748, 5430, -5222, -7016, 4579, 963, -6124, 2270, 4170, -5257, -1091, 6824, -143, -2274, 5507, 2630, -2759, 3428, 4432, -1735, 635, 4172, -1170, -1905, 2522, -402, -3448, 729, 381, -3629, -1573, 506, -3038, -2480, 1150, -1482, -3232, 527, 460, -1721, 928, 1718, -1184]
260a184J480K072j777L49K244k458j692L461p2l055J845O52m623J420L915l167
276e90k471L479j234m180M862K997n936NM173k733j654O522q45n729L000L103
292B769m142J792M983m410l732N216P4l705L289J258o468P53M981k423j857L624
308B002k193m965M102L459m216l19K721l143p06M963K58l572N32R49j565K104
324D11K940k129j857J128o40L78L338j069l671P49Q81j111K358J376l918k203
340c039K945l73p49L045j217n052J794L463j280l95L010l695k965N166K086l407
356f63J229J292m567R19O260j378m199K740l43m463L974M822n150l088L493j150
372b72k946N463R01o362l44M230j774r32M195j934n049K659L682j645N07K090
$$ y = [-1184, 296, 2368, 591, 940, 3184, 726, -966, 2495, 2423, -632, 1213, 1865, -2758, -1338, 2577, -590, -3061, 418, -816, -4996, -134, 2863, -3073, -3068, 1105, -1628, -3282, 3240, 2395, -3334, -334, 2769, -1373, 419, 5402, 992, -2740, 2476, 2550, -1155, 2134, 3392, -3076, -2323, 2658, 235, -1622, 2002, -191, -5156, -1054, 2405, -1811, -2130, 591, -2552, -3258, 1705, 1963, -1609, -1077, -128, -1693, 411, 3351, 1222, -635, 493, -147, 231, 3569, 2500, -1171, -422, 459, -652, 1706, 3082, -836, -3039, -94, -467, -1216, 1829, 612, -4440, -2646, 817, -463, -858, 2152, -1543, -4508, 658, 2744, -663, 566, 1858, -2709, -1790, 4470, 3092, -1107, 1633, 1290, -3173, 801, 5623, 473, -2615, 878, -272, -3218, 2245, 3146, -3216, -3560, 670, -1104, -2036, 2159, 225, -4824, -2165, 1517, -128, 379, 2469]
388B469l438j598L923J287j318J84n14k595J808K888j191j442J99k029k17K882
404A298N87k471l06q48j229K543J993k397r81M55j212J104L890j101l173J437
420d11O99j678K878K963m447k151L635o8j840L495L12o030O35M517j839k010L716
437B376k029n756M527M157n239n03M129m047k468O925M24n501K184K721m546J544
453a102O096l451m265L864P57k967L167K546n163j701L386m30r76K066m25l297
469a895j60K157p06L68L01j090j306O10J589J86j54m20l41M66R10K62J87m47p99
488b82M21J517p0j621R69q7j821J989J911l018j931L071j311k396M394M67n989
505c787J478L929l787n05N787k761n331N030K400n451K757N000o058k137O575
$$ y = [2469, -969, -2567, 1356, 2643, 1325, 1509, 995, -1600, 208, 3096, 1905, 463, 662, -1367, -1584, 1298, 1885, -586, -892, -1740, -2969, -426, 1567, -830, -1811, -1356, -2568, -1464, 2426, 1325, -1848, -411, 288, -1390, 1488, 4451, 4, -2147, 1488, 1420, -420, 3075, 3387, -2643, -2008, 2509, 670, -1340, 2376, 347, -5409, -882, 3275, -1964, -2467, 1662, -2385, -4853, 2072, 2496, -3005, -821, 1900, -2646, -1102, 4994, 1543, -2722, 1142, 1899, -1068, 2099, 4645, -518, -2219, 1167, 737, -239, 1827, 1402, -1895, -2055, 102, -604, -236, 65, -1025, -2331, -1721, -132, 54, -100, -520, -861, -395, 515, 777, 964, 517, -282, 139, 1656, 1586, -35, 934, 847, -974, 1015, 2926, -92, -2023, 1048, -263, -2659, 1735, 2202, -3787, -2309, 1620, -2167, -2672, 3115, 354, -4977, 53, 2453, -2998, -241, 4759, -1299, -3436, 3139]
520C139j345m380N105J312o038J252M829l661j860M132j239l641K589J766l892
535a932L63K838k007j380K528m38k476J211J806j005j44J265p20q06J015J009
551A127j63l6O0o91m56Q96L02J61k99j013j80M62o6l94J261n97j868N02P19j481
571a754O82J969j762j751K884j18l030K819K920m186q3M075k527k707N142M99
587C072n349K887L214n544L4O016l207m059N203l13o087L584L583n301m16M813
603B130l214k454M477l27l480K456J720k862K44K391r99o16J606J42j190O1O80
620G65J60l22J82R03j171j079P63O52q51K59L10j756j32Q81k32M09J82j007K8
639a056O88p02Q80J161j606k55K291j438q24K888n92l111K809J357l449R99L105
$$ y = [3139, 1794, -2586, 2519, 3831, -2207, -955, 3874, 213, -1647, 2485, 1246, -2395, 194, 1960, -1932, -1569, 1269, -738, -2118, 410, -28, -2504, -1293, 513, -492, -636, 629, -91, -897, 118, 1127, 964, 928, 988, 297, -159, 737, 1039, 1200, 901, -112, -292, 170, 104, -290, 971, 374, -1494, -992, -273, -1754, -1072, 897, -865, -2616, 268, 150, -2880, -61, 2859, -1327, -1410, 2665, 138, -2569, 2573, 3072, -2277, 610, 3824, -1720, -1686, 4330, 1123, -2936, 2267, 1954, -4133, -549, 3034, -2267, -2683, 2130, -1084, -3538, 939, 612, -2868, -412, 1308, -1554, -1310, 1081, 82, -534, 1072, 1214, 24, 85, 765, 925, 603, 785, 1688, 517, -562, 201, 853, 2, 261, 571, -1185, -1317, -436, -668, -259, -77, -1084, -1056, -368, -1070, -190, 971, -635, -890, 1401, -37, -861, 2027, 1435, -1676, 1133, 2490, -959, 40, 3145]
656C145l433j355M658j924l803L461J052m553K043L103l690j289L461j234k372
671b730L198J010l628R08K529k084l4K682p85k431J519J358j465N24J899j659
687H11j604J696L21j457P58j8j195l75J140l11p75O82m56l41N39P2l21P5K46l66
707h79N07O25l69p3N22j89J35R88k90r28P98M20j371M82J132j400j053J324K26
726F07j658J428O45k407m61K239m62j647K204O4l133J542K216j874l99L031j917
743A8j885L223J48k511J660J394k624L03K271r61j782J415J02j515N65J042j117
760b54o61N27K03p55P07l54m44J5P89j67K83p0j0k41O38n6M82R0k72k00L29k56
782C23k15Q13k99n73lJ004r47n14Q21l20j148P72P27j434k28J460j066n64J665
$$ y = [3145, -288, -1643, 3015, 1091, -2712, 749, 1801, -2752, -709, 2394, -1296, -2585, 876, -358, -2730, 468, 1478, -2150, -1242, 1287, -797, -831, 1851, 1066, -1365, 154, 1512, 47, 571, 2470, 811, -793, 903, 1224, -233, 525, 507, -688, -1063, 77, -234, -1009, -327, -783, -1124, -585, -513, -834, -759, -513, -879, -372, 253, -116, -189, 333, 144, 279, 1267, 977, 49, 847, 1267, -104, 378, 1510, 110, -943, 381, 607, -1051, 377, 1022, -1385, -1846, 393, -69, -1716, 488, 552, -2581, -1039, 1177, -697, -1096, 1935, 18, -1867, 1356, 1504, -1007, 653, 2047, -577, -274, 1997, 1036, -746, 669, 771, -744, -179, 863, -254, -915, -388, -185, -940, -233, -587, -1031, -1016, -227, -394, -111, -181, -191, -432, 206, 150, 632, 722, 450, 250, 579, 323, 108, 921, 622, 49, 46, 1050, 103, -411, 410, 90, -1058, -286, 441, -993, -1221, 239, -827, -1391, 274]
801B74J47j777O92J295j054o2J539l91j436J363P25j328M85J215j604o31J910
818A362o11j426J432K80j996J85J441j169p06J187j65j215P39P82r67l78J084
835a41J7l84O47K9m99M62L23J00K8J28j39j26J40n7M4J48n67Nl7q7k10J67J85
858A76j086M57L11p48Q5O93o64l26J159J32j059N67J081j008k18J469m66j040
876d85J559L78k017P64J409j675o89J871k43j833R97P50j830r9J725q59j273J168
894c82P81k100R79J285j138o10J385l1r49M88J368p98n11J375k94j015Q03N27
912A163j254J0J322r00p79P75k26m65mM50l22m36P2Q6L3k44KN23j49l36Q41k8
934A34p17N54R25j129n3J240m07j036J339L32j731P23J016j219l47J218l37j418
$$ y = [274, 421, -1356, -664, 631, -423, -485, 1054, 663, -773, 590, 1315, -13, 472, 1687, 83, -548, 1362, 751, -675, 757, 1037, -959, -774, 667, -502, -1208, -21, -186, -1401, -662, 120, -847, -1225, -141, -124, -508, 139, 168, -331, 131, 454, 554, 582, 710, 571, 445, 585, 528, 572, 720, 153, 158, 121, 34, -176, -9, 176, -910, -453, -142, -890, -805, -112, -776, -1102, 57, 189, -870, -303, 778, -230, -448, 1021, 555, -485, 1074, 1452, -565, 199, 1608, -67, -756, 1115, 872, -961, 36, 786, -1044, -1143, 582, -277, -1550, -382, 399, -1701, -722, 563, -575, -1185, 200, 169, -780, -292, 1076, 278, -233, 1142, 848, -167, 636, 1163, -91, -81, 1241, 341, -438, 337, 111, -354, -358, 92, -230, -666, -594, -508, -475, -719, -717, -194, -343, -679, 162, 134, -583, -29, 896, -233, -286, 954, 547, -489, 850, 1182, -549, 174, 1190, -29, -376, 842, 505, -913]
952i13Q58P01j310k44J399l14j726J019P81j187K99J501j158j129J923J79j796
969a117J392J363j671l55J971r53j449J769M47j954L26J535j537m03J481l87j756
986a298J352K83j148rJ070q66mK88p1j51k16Q22R4p6j69L38k93k8P91K18j088
1007a61M04J94n2o41J000j71m28J78l85q7m03M52J97n44m65O99K62j029K39J055
1027C14j295k6J564m75j205J682O99k144Q01J928k281l62K732r78j930J932L13
1044A269k395J165J453j831l34J541r83j275J168N46j148K73N63n64q75J092O34
1061B99m98l27P53j48o90Q33R19q16l21Q37n85n39J007K10r20N07J49p01J74J13
1081B56m82J10j5l81K15k07k25L00K19r8J34M76r63l08J447l23o16J077J59j482
$$ y = [-913, -55, 646, -664, -908, 491, 177, -1549, -530, 251, -936, -637, 864, -294, -1423, 500, 679, -1117, 275, 1638, -33, -388, 1583, 630, -819, 950, 1397, -557, -231, 1304, -233, -636, 845, 458, -1298, 54, 337, -811, -820, 250, -616, -620, -332, -403, -554, -770, 52, 146, 70, -99, 239, -54, -82, 709, 927, -161, 243, 437, 385, -256, 744, 573, 145, 323, -62, -149, -552, -100, 97, -447, -912, -213, 49, -980, -741, 314, -981, -1007, 557, 82, -1123, 559, 1258, -886, -85, 1843, -438, -800, 1932, 954, -976, 956, 1269, -1126, 39, 1492, -339, -673, 868, -115, -1390, -222, 324, -824, -551, 12, -552, -1427, -335, 299, -199, -526, 227, 79, -611, 222, 1141, 325, 4, 841, 256, -283, 724, 934, 14, 521, 670, -31, 143, 256, -226, -116, -131, -512, -297, -504, -729, -429, -210, -308, -174, 302, -661, -969, 478, 155, -461, 616, 775, -707]
1101g07P24J596j163l31J071o03j172R30R06j377J63P60j071q19J003N65j217
1118g42L26Q52j229m26J469k94q14P15N40j054J61J419j106m4P53L81j273Q82
1136E16L47q51J91R28l17r14M73O7o21J40L88k51p25L04m1J41k83M45L3n52n7
1157f39P9J07K80M42q8j49LJ86O02n69J3K48k60j17L32J05o47J80N01p58l25J343
1179H69j123o28R62M40j441m1J154p31o17J416l3j072R29L14j035K72J372p59
1197B48o12P45J48q38Q86K90p58j9N14l99m35N70K20p18L1J37m51p1K38L3j36
1218c77k79J45L13r1k03O09j36l51M82L59n29J00O28l62q3M61j07o12K24M01l70
1239B22j03Q4j24k15L2N85p30j85J0O6m96J09Q96m22m16Q79j84o47O95N50q75
$$ y = [-707, 17, 1613, 450, 119, 1190, 587, -585, 345, 1251, -126, 37, 797, -274, -1093, -90, 475, -742, -416, 436, -793, -1219, 250, -44, -858, -143, 397, -657, -496, 923, -183, -227, 526, 907, -366, 516, 863, 12, 203, 1131, 814, -100, 373, 440, -181, -41, 347, 96, -629, -325, -366, -225, -508, -63, -30, -582, -639, -560, -453, -173, 269, 181, 32, 35, 221, 823, 254, 267, 515, 255, 138, 470, 575, -72, 108, 609, -149, -474, 869, -254, -882, 80, 520, -921, -962, 192, -539, -1156, 260, 227, -845, 84, 398, -637, -365, 1007, 248, -364, 381, 529, -309, 577, 867, 109, 90, 604, 205, -230, 340, 560, -158, -127, 10, -441, -512, -274, -241, -377, -656, -511, -198, -289, -492, 117, -19, -370, 112, 471, -58, 42, 670, 308, 225, 686, 579, -33, 191, 592, 222, 119, 203, 79, -136, -104, 481, -249, -434, -424, -358, -854, -745, 151, -271, -687, 192, 8, -639, 56, 606, -269]
1260b69L12N31m92j93Q32n9r44N58O33q95qN98n43l76O50j82n99P9L31k05j10
1281c51J43n2j81p5J43K85pj15M56l66j40L77O6P8J39J60l23PK67l02l02J75J96
1304B78j98jl3j64l26K77L93o29j84M98j89n63O64K59n80L2M76J32o65P44K97
1325E18r67O28M31j58n01L85J49o46L02N91o45m50R32n56q79J090m9n40j97M66
1345i6j43l49L52M29n57j82N21k9k71M28J61m14o4N55j88j28O31j75m75K08L28
1366E42l01j87K64J59o68J84K64m07k58J04J13J43l98L28l4l95L9O16l01j77O20
1387B50k33l64O27q0m20N56L79o28r4P35k25o43K44L92p03O8Q19l37r37M42J80
1408B8l65l25M26n3m52P92J66q25O43L25n98j15O40o3m05K09N14m69J75N24k32
$$ y = [-269, 43, 574, 82, -111, 721, 662, -282, 276, 909, 14, 6, 604, 61, -315, 335, 153, -446, -367, -36, -241, -351, -208, -260, -441, -516, -373, -88, -95, -210, 246, -120, -260, 117, 183, 261, 400, 560, 237, 244, 511, 209, -93, 82, 278, 80, 79, 46, -118, -444, -167, 226, -403, -587, -89, -278, -841, -177, 82, -498, -466, 10, 142, -523, 221, 518, -449, 179, 610, 452, -49, 336, 485, -161, 141, 732, 87, -363, 569, 13, -866, 224, 175, -365, -562, -96, -239, -588, -236, 193, -364, -546, -25, -54, -325, 103, 264, -150, -214, 341, 153, 25, 656, 481, 6, 214, 542, 241, 54, 318, 477, -191, -7, 257, -150, -408, -304, -191, -48, -446, -118, -152, -547, -508, 108, -193, -370, 250, 17, -347, 280, 200, -220, 336, 715, 87, -7, 728, 503, -140, 104, 496, -207, -139, 680, 343, -594, -152, 28, -337, -662, -236, -289, -741, 51, 217, -608, 35, 360, -238, -353, 287, 224, -181, 28, 542, 73, 248, 772, 540]
1429E40o05K76J84k63r4J30K07p30N75o6n30K9M04m47k69L51M39k29j37M2k36
1450d29l8O19K29j45k88M63o1n78O64R0l88j58M01j84l54M76K70q40K24L75n36
1471a88l65M01M00n84k50P24k16m63O07k56k83K08O70k64k30M80o6n33P52M66
1491A010r07m06J025k21o30O84l9p71k8O60l80l68M64j9p26R7O46m26j16K98J6
1512a37m17L11L41k65J96K65l20K94l3K93k62j32K30j79j78K60J14m35%K03p1
1533G8l30P8L17j42m20L73k87j47l1L09r2jK7L26n21J56N44j49k20P03k30o13
1555b72M99L89n81JO63n10m69Q27k85n91M59N71j126j53O49j6p10P59n7o18J83
1576c88L92m5j09J41L56o50j74N13J72l54J87N73o42J67L91n41J45L82l20j91
$$ y = [540, -65, 211, 395, 132, 38, 168, 375, -355, 220, 154, -376, -347, 57, -390, -659, -308, 131, -98, -235, -193, -429, -467, 152, 381, 236, -52, 411, 350, -228, 436, 526, 138, -20, 381, 197, -157, 319, 589, -251, -27, 348, -188, -553, -152, 248, -336, -586, 138, -78, -541, 66, -190, -473, -265, 405, 141, -89, 391, 325, -208, 544, 1010, 103, -303, 722, 501, -129, 555, 516, -255, -283, 377, -3, -371, 93, 74, -652, -555, 91, -335, -451, -153, -137, -554, -243, 98, -167, 29, 294, -26, 268, 235, 528, 266, 134, 364, 185, 7, 267, 381, -54, -54, 149, 78, -252, -174, 143, 1, -419, -46, -333, -480, -511, -202, -294, -295, -268, 58, -463, -307, 237, 88, -132, 571, 341, -272, 227, 616, 35, 36, 699, 189, -280, 547, 262, -329, 130, 701, -425, -578, 71, 55, -655, 104, 47, -571, -388, 4, -41, -150, -9, 347, -303, -477, 36, 208, -146, 41, 614, -28, 139, 530, -11, 134, 516, 196, 5]
1596EqP9k1j04j8k2k20r3L12k49J5K45j36q6MJ46m3j8L08K03l96J77K90k83JM20
1622E08P9o44O4M81o75l00O87Q6o72J98J41pl5J54k50n01N01R4l15KM84J52p69
1645e37P93l6n26L67M47l55L3R4o3m11M35Q3p0k52M44k28m55J72M4j25j40L33
1667D7k13n2P1K8k21J35K77p4k79L3N51k28k52L93l09NJ51M08k76l39N01M1l85
1690A3M55M5m98j6J95n1j07k60M92m31l6L52m01r0K05K07n75J71O50l00k44m5
1712b69K41M5J26L46l20l4L8K62o73L70K23l17j29K82r3k24L5Pn0k40M89k81n9
1735b25o5K58P4l71K21j64j15L93K09j9k74M65n7m14K03J66l97L29L23m03l21
1756a84K71L23o86J33L95l30l31M61r8l61K97K34m06L4J15M20o04M0L57j21r2
$$ y = [5, -3, 76, 55, -49, -67, -89, -309, -402, -90, -339, -324, -79, -215, -301, -297, -151, -194, -212, 96, 299, -97, 80, 370, 87, 88, 508, 587, -57, 7, 488, -187, -487, 200, 286, -386, -188, -47, -54, -89, 65, -185, -686, -185, -91, -406, -404, 80, 232, -537, 256, 220, -306, 61, 508, 153, 186, 280, 217, -194, 241, 324, 254, 2, 446, 218, -237, -65, -21, -146, -286, 47, -166, -218, -147, -119, -340, -205, 72, -2, -281, -248, 303, 75, -177, 216, -93, -88, 63, 471, 195, -144, 357, 398, 13, 468, 513, 15, -1, 194, 143, 36, -224, 268, -163, -199, 153, -248, -338, -133, 74, -501, -330, 320, 20, -224, -269, -28, 17, 143, 489, 169, 135, 173, 435, -238, 132, 355, 38, -91, 191, 98, -126, -91, -84, -134, -374, 115, -166, -225, -290, -32, 42, -329, -108, -272, -387, 6, 215, 196, -78, 387, 330, -84, 119, 285, -112, 217, 540, 137, -184, 87, 410, -276, -143, 252, -78, -409, 52, -46, -407, -110, 124, -282, -248, -133, 287, -317, -277, 80, -41, -133]
1777a33M34P3m26J65J30jk20K48K02q00M02M23n69j43L87m81n9O84j98n15Q5J81
1799a31j06J96K14K6n47N4M60Q7m52K51K10l38K4N95l23k05J60K46m08J22J44
1820B79k55J71np0m42M96n8m78j00M47j02k89L26L41k66l63L10J58n35M46M0j02
1842e1Q6M51j64k23j20L85m61J17L67J6l07J5L04j038N77L29m6o25M10N8n28L87
1864f1R5l20j81M36k7l30N08o9l06J34L87k19j53L19K36l14j10K86k55k25K31
1885F2J24k66L8K1o3k7j49L24j99r3J78k36N1q9K82k81J05K44j20j15J81K62j81
1908E3KJ13j50J2L43j28k87J90J1k59q4K41J54l73K54n1j48n8J51O4m47J02K91
1931dj67r9Q4K38k52J38J02q9j54M89Q7k77K18K8j02j18K83j39m93M65R6n95K67
$$ y = [-133, 301, 374, -52, 113, 243, 242, 22, 270, 472, -328, 74, 497, -72, -215, 172, -309, -368, 316, 118, -397, -312, -131, -237, -41, 173, 199, -348, -294, 166, 253, -199, 52, 262, -76, -52, 543, 220, 15, 175, 421, 13, 135, 279, 24, 195, 190, 120, -322, 174, 116, -362, -462, -15, -117, -406, -80, 261, -5, -368, -58, 100, -435, 11, 51, -51, 35, 486, 322, 99, -21, 364, -97, 20, 387, 403, 96, 111, 415, -623, -46, 283, 237, -388, 22, 80, -448, -61, 34, -286, -467, -31, -58, -388, 120, 51, -255, -121, 266, 47, -106, 213, 449, 135, 25, 311, 56, -169, 62, 186, -80, -42, -21, -84, -111, -260, 64, -135, -228, -50, -286, -235, -324, -42, -323, -218, 26, -94, -209, -28, 234, 53, 55, 168, 18, 30, 373, 245, -42, 148, 159, -100, -184, 57, 211, -162, 92, 41, -107, -165, -14, 50, -397, -295, -4, -171, -270, -186, 52, -200, -62, 40, -49, -203, 286, 373, 96, 314, 342, 240, 122, 405, 266, -227, 238, 334, -261, 6]
1954Fo7j81K57M0k78K19j88Q3l4k64K24L74l71j14L85q8J2L76k43rr5J52p9l02
1978a85M56J74o27J81Q9k7q5K01k41k0K57j57k18m8K11j18j46Q4M50j05m81K09
2000a46Q7j16N2M20k19j5K20J16m15N30m99mn1N06k75p89P19j70k30K05Q2q0l38
2023d10L80j61j31M29j47m04K26J22K47k17J90j25o3R1L68j35m22K65J50k04q5
2044c6J83K45n96K70J07m68m9N04l64L8J4%R9l19N92n67M6K26nj34J33J15R3j98
2068g1L55p7l58R2J49j23K13ML6n08N94l35J19j41J50j85m4k25P1M01k23k24M58
2091A28k88L16j16l12j6K11l7l9K81K61k26j06L25m85r8K85k6k87L13J63l43Q0
2113a6q3J22p7j21K09n5l42M51j60k85K80O2J9j50J05J67k79M2K54p6n10N76O8
$$ y = [6, -61, -242, 15, 55, -223, -4, -192, -109, -143, -407, -183, 191, -180, -294, 91, 3, 15, 391, 148, 139, 44, 196, 117, -185, 271, 445, -182, -1, 88, 61, -24, 177, -64, -84, 173, 16, -202, -250, -39, -157, -303, -219, 231, 126, -355, -146, -59, -175, -123, 297, 78, 63, 283, 399, -16, 514, 15, 11, -40, 466, 191, -598, 121, -49, -279, -74, 8, -72, -410, -30, -191, -322, 107, -40, -444, -218, -96, 151, -66, 124, -1, -64, 27, 395, 260, -162, 103, 253, 49, -36, 147, 392, -204, 66, 173, -295, -344, 160, -204, -166, -152, -152, -53, -372, 220, -347, -301, -75, -80, -214, -81, 34, 127, -71, 284, 207, -151, -59, 90, -33, 180, 184, 220, -288, 306, -29, 90, -51, 99, -86, -130, -355, -284, 117, -106, -330, 128, -160, 156, 40, -272, -288, -77, -114, -153, 128, 389, 163, 57, 382, -103, -201, 84, 58, -229, 84, 247, -96, -16, -99, 23, -54, -175, 34, -21, -363, 88, -72, -357, -77, -15, 4, -146, -41, 126, -153, -111, 143, 67, -443, 133, 201]
2136B01j61J02J38j45k77L64j51j33M38k25m59L96P9k6q8P8j81j64k9J34L30k11
2158A0q5J21q3j38K21n4k78K62J59l07L08j04p4j23K84R3q2l17M04r6k37K68j65
2181a3N1p3J91m04J87j20J97n2j66J27N9r5K30Kj08J33j7j81M5K65Ok19J26nj38
2206B8r7j41J60J94M0K7l75Q8k8J03K4j36p8j7K39M4N5m36L64j45J35k9J44o6
2230I7l68K82J46n28M67J26qk62K62r8n9r4K79m13k23M40J51m31K42M8l39L40
2252E7j00j19k73K61P1J5J27R8j41k00J22J78J00k50K95m9k58J66Qj10nJ79j94
2275b2q0K26j71j41K83j31k97L75jk8j4k80M83n87p5L84N6m6J62k08p3J77K8L15
2299C35k48L0K3M0Lj17K4l93L15L1l7m6L0j30r6J73J5k6j70N31m33Q6j05K85k43
$$ y = [201, 40, 142, 280, 135, -142, 222, 71, -62, 376, 151, -308, 88, 167, 141, 53, 131, -50, -214, -243, -109, 221, 10, -75, 46, -37, -175, 46, -8, -286, -24, 135, -172, 136, 32, -42, -165, 119, 212, 130, -187, 217, 121, -116, 152, -13, 38, -35, 156, -248, -61, -181, 16, -36, -202, -75, -16, -111, 119, 121, 13, 146, 129, -52, -7, 258, 264, 45, 171, 166, 28, -69, -210, -50, 144, 184, 211, -164, -76, -104, -1, 23, -113, -191, -208, 31, 75, 130, -306, 58, -87, 48, 19, 163, 97, -271, 11, 157, -371, 96, 222, 214, -48, 214, 116, 57, -37, 242, -171, -394, 46, 197, -234, 8, 56, -283, 57, -43, -162, -435, -174, -103, -88, 39, 137, -4, -204, -82, 96, 196, -54, 241, 192, -66, 100, 108, -2, -7, 172, -22, -102, 124, -47, -188, 95, -36, -333, 42, 41, 13, -1, -281, 202, -385, -460, -76, -20, -66, 96, -112, -185, -8, 20, 335, 87, 117, 140, 180, 183, 66, 90, -303, 12, 43, 6, -40, -10, -140, -236, -63, -48, -74, -244, 287, -146, -60, -165, 120, -123]
2324a23J10j21L3p2M14m92J95J74J28J5j84K03l6r6p0J33k35j93J19K75m46K81
2346A2n3m5k08J21N1j03j2K53j67J73J65l18RJ50J21k02K24l2J16l91L89O3j98
2369A18j36n1o3j87M12jl41J71K16Qk57J35k28N9M2J14P5j61K96o22J19J20L69
2392B07k26J1J95k24p5L7K22k38M7J43p4R0l31L50k52j03J55N1l17L00J1j32%
2415a53J01L2L3l04K44K5j3J14k44j6J43L52n52M09j3J02k73K07j91J29j32n7
2437e7P5j12J20R3k82R7J1j20j22J40n2P7k47J78K06j33J75K65m03J46l5p3K69
2460B16r0J42k66J68R7m97L06J56n2j27j53J81o4p1P5l48J53L26j23j63M0J65
2482G1j86k25L87J6o0J44J9n0k38J21l2J62j20R9J71m37K16k11P4M00j45n39L64
$$ y = [-123, -13, -134, -101, -173, 241, -251, -56, 118, 246, 261, 77, 280, 244, 148, 78, 211, -24, -217, -98, 177, -269, 12, -41, -86, -294, -173, -122, -225, -237, 16, -151, 22, 187, -131, -122, 28, 149, -53, 171, 139, 255, -136, 253, 316, 118, -18, -69, -132, -319, 93, 92, -249, -78, 138, 146, -111, 24, -204, -145, -103, 11, 86, -75, 221, -401, -282, -162, 207, -19, -8, 187, -37, -112, -75, 147, -91, -44, 99, 25, 115, -216, 134, -118, -221, -66, -15, -332, -32, -21, -153, -153, -52, -20, 13, -291, -47, -22, -35, 79, -165, -181, -38, 314, -238, 171, 158, 260, -13, 194, 3, 132, 0, -57, 18, -94, 26, 119, -163, -66, -55, -175, -297, -157, -209, -132, -379, -201, 5, -128, 47, 312, -91, 55, 20, -53, 216, 126, 268, 2, 170, 267, -230, 76, 232, 180, 53, -100, 81, 17, -54, 21, -327, -174, 152, 29, -134, -94, 71, -115, -340, 47, 63, 3, 147, 166, 116, -122, -1, -33, 129, 9, 108, 279, -158, 58, -153, -79, 321, 176, -363, 1]
2505AJ16j62n38M68M28k06n75M91j55K13J25k99k1N4L0J32K5k24L85j67k10L15
2527B26j02r6L2J8m0r5O3J93m36J95j44J04R8k62j89L51O9J46m12J51k5J19O0
2550B4K38K3m80J3K37O4m9J86j8k95O4k27K94l03L56p0j29R6l78L69r0K21n22
2573c76L11j42L68l05J51P1m79J51J52n9j88J84M09r5p0j21L1Q7qp4J31l21K75
2596H3k5p8kM5l7k52O15p18M63k45M1k22K33J45r6l2nL17j58k78J5J42Rm8K47
2621A59Mj47N7j29J41J8K38j76k73L44l11R4L8o6M1j60K77o9j08m3J89k93j10
2644b85M64m67L87o2M9j75L84j98j00J08j19K97l05q0K82l7r3j15L3KP3r0J12
2667F5l62L26J55j4j95K9N2k6K4K8l80K50k9K17l30K31M6j36O2J53j01o2m6N7
$$ y = [1, 117, -45, -583, -115, 313, 107, -468, 23, -132, 81, 206, -93, -114, -60, -30, 102, 127, -97, 288, 121, -89, 226, 124, 28, 60, 78, 38, -57, 6, 199, -237, -42, -186, -82, 16, -246, -435, -84, -15, 131, -281, -130, -155, -36, 24, 262, 285, -195, -182, 55, 119, 70, 256, 238, -57, 7, -220, 74, -229, 127, 57, -72, 24, -354, 15, -75, 146, -376, -65, -207, 161, -144, 7, 78, -401, -250, -98, -157, -345, -161, 248, 153, 83, -38, -7, 80, 72, -2, 129, -192, 83, 58, -20, -22, 23, -14, -266, 349, -369, 94, -151, -110, -332, -99, 46, -50, -82, -87, 230, 72, -206, -191, -49, -40, -88, 159, 163, 16, 73, -56, 85, 103, 341, 165, -108, 236, -75, 19, 57, -9, 32, -128, 149, 80, -28, -71, 118, -175, -285, 179, -288, 99, 37, 86, -89, 295, 97, -3, 105, -14, 283, -22, -102, 180, 143, 50, -65, -32, -30, 43, -47, 65, -297, 29, 184, 170, -25, 4, 56, 30, 54, 82, -298, -48, -77, 140, -190, 41, 87, -49, 13, 166, 65, 3, -43, 14]
2691A4P7j16Q0l46N52k45J0J59j75m5qj45J17p9O2q0N5J25m6J75l27K25L6n8Q2
2716I9j24K74k92k06N54j40j38k2j3n2J14K6q6p2J28o4l7j7N4r2K97j68p6L5j4
2741c2j7p5R1k10L43m36L20J43r2l1q5K45l16L78k90J49j05J78l01P6K07j18j67
2764a45j01J86J22l32J56K26j29l1Q3j21J18r7O9N5K7J26j50O9J22k79J10k14
2786a30M3M1J09n5l0r9M3K89j28l27M81j23m07J57K54j21Q2j97K80j74k06K68
2808E0O3j08K20J08m36K67j27K07k62L49l17q9k16L52r9J93M7pj81J80o3j98K45
2831A78k64j40L54J31k72l3o8n3J91J53k96K36k09K14k82K00k2OJ44l83K42k4
2853CK86k72J3Q7k24J68K1j39l1K16j35j09K52R8l13k9j6j7J30j25N4l0J49j45
$$ y = [14, 91, -25, 55, -291, 261, 16, 26, 185, 10, -35, -43, -188, -71, -150, -88, -168, -113, 12, -34, 141, -186, 39, 75, 17, 99, -25, 249, -43, -249, 305, 165, 27, 5, -8, -60, 54, 80, -6, -78, 50, -14, -51, -68, -14, -106, 191, 23, -53, -18, -32, -49, -124, -33, -243, 100, -336, -16, 127, 35, 4, -81, 164, -152, 226, -64, 85, -20, 158, -143, -67, 140, 22, -145, -246, -60, 62, -270, -114, 112, -17, -48, 35, -86, 32, -65, 4, 59, 86, 212, 62, 131, 253, -26, 84, -130, -87, -46, 63, 8, -22, -121, -78, 211, 83, -244, 237, 114, -293, -136, 118, -3, 79, -118, 162, -12, -218, 50, 113, 5, 225, 333, -103, 164, 37, 244, -18, 331, 14, -75, -291, 61, -38, 155, 202, 195, 14, 194, 131, -67, 178, -86, -226, 128, 259, -13, -46, -114, -167, 24, 177, -119, 117, -92, 122, -160, 40, 18, 24, 168, -215, 27, 3, 289, 17, 30, 117, -107, 61, 82, -57, -88, 128, -7, -116, 136, 234, -79, -108, -124, -141, -11, -136, -82, -112, 37, -108]
2877a08J48K6Pk9jJ42j38R4j89m0L3j27K18L18m20J16r0j79J26J42j91L51l07
2900i8J23o6J01J8m0J32k61j2K21j65M6K25l28L58l67N9J13p2K29k16j52K53o0
2923D1k53J77P8l08L34q3j05J78o1J04J1q9Q9l60R7J34J13Qj41j69L14l3k6Ok38
2948a82K76K0k52J70N7m02K36K60k29J13j7j60R1J67j65J9J31k31j30J73q9J9
2970a25K73k18l8K50r9o9J58Q2k27n9J30r7L39k32k56K10k49M25j17j51K86j39
2992G7Jl16J87j17K01Ol3k65K70J13j53J28j17J79j32O5%m2l23M45j72j2k51K14
3016d7K0K47l38K29j09q6n9K45p6Pk25k0R1L3J47j28j13J60R1o2O3pj22L4J7m9
3042e7P6k19L42j78RQ8O9k92R3K51l76K35R9j63q1k42L63M5J7n03L43p6J29J38
$$ y = [-108, 40, 66, 73, 44, 43, 185, 47, 141, -48, -88, -55, -182, 36, 354, -66, 50, -40, -219, -93, 49, -142, 209, -98, 25, -41, 60, 78, 38, 170, -91, -103, 118, -47, -1, 224, -104, 254, -113, -54, 59, -13, 216, 0, -152, 101, 41, -212, -35, 43, -265, 69, -14, -119, 59, -2, 102, 113, 24, 113, -247, -150, -16, 97, 105, -36, -205, 109, 76, 50, 56, -182, 94, 114, -138, 32, 89, -313, -77, 183, -46, 67, 50, -110, -19, 148, -17, 2, 133, -98, -228, -55, -144, -125, 148, -70, -108, 142, 43, -26, 132, 214, -13, -72, 58, -39, 300, 68, -188, 22, -227, 198, 81, -70, 216, 77, 78, -238, -51, -168, 33, 39, 6, -259, 11, 124, -29, 99, -18, 161, 29, 94, 94, 52, -271, 174, 2, -10, -261, -47, -27, 220, -118, 111, 2, -84, -143, 102, 26, 33, -192, -212, -121, -88, 59, -69, -182, -22, 69, 7, 70, 63, -59, -25, -8, -57, 19, -200, 142, -36, -27, 61, 130, -162, -69, 182, -194, 41, 140, -23, -104, -346, 17, 62, 79, -424, -81, -157, -28, 110]
3066A10l85L36m5O1o0J41j17j73J65J38j50K1j52K24Q9n54J84P4K77j1j59P7j45
3089e4k4J99l14L16J39k57k49J06K51k20l3K14Q0j99J08k00p2J49R0j5J8M5j24
3112d6K25l42K73r0K9O3k08J27L9mk26L3J11J36k41j97L9L45J8RJ7k51J6r0J45
3137g0L92k24j50J65j74n6K70l00J97J16j34j05jN0l6j21K04Q1j82q2J29J00k60
3160a91J81k99J54J7J73K28Q7j36k09m8j10Q4m5K01j9j32n3K11p7J53J20m45J38
3183a7J27j59o8n9K96q4K01k51j90J88j39K33O7k11J70j50p6j22L43R3q3k5K00
3206B84k59j71J18K8n2J45m5j0n2j7K12k87L03k97L26j96q1J22k94M12k87J22
3228B4k83J15J60r9j09L39j58Q7m1o2o8K56p2j98L47k68J07K23l76J73j54L01
$$ y = [110, -275, 61, 16, 77, 17, 158, 41, -132, 33, 171, 21, 42, -110, 114, 203, -351, -167, -93, 184, 173, 14, 91, -54, -78, 121, -193, 123, 262, 5, -244, -138, 113, -107, -140, 74, 154, -45, 63, -137, -209, -60, 30, 15, 33, 78, -46, 179, -163, 110, 20, 49, 112, -96, 31, 70, 66, -160, -127, -16, 120, -121, -318, -279, 66, 84, 93, 110, -141, -125, -215, -70, 322, 98, -52, 113, -61, -117, 153, -147, 50, 166, 32, -73, -74, -24, -60, -181, 23, 104, -78, -160, -31, 69, -191, -10, -309, -155, -138, 35, 263, 350, 214, 5, -43, -153, -69, -114, 87, 68, -64, -117, 94, 17, 170, 290, -155, -17, 110, -49, -117, -176, 120, 36, 237, -14, -204, -16, -155, 78, 145, -66, 104, -46, -122, -244, 99, 192, 109, 84, 284, 25, -146, -28, 0, -52, 93, 48, 38, -14, -31, 181, -106, 197, -100, 226, 30, -51, 71, -223, 189, -98, 24, -259, -144, 16, -83, -192, 147, -11, 76, 35, -27, -95, 161, 89, -109, 238, -30, 77, 300, -76, 97, -57, 244]
3250B44k89K18r2Qk79J01k4o5P4J63L9l72J33J92m7O4J3m33M30q9ln4K75j27%
3275H0j20j28P0K22j99J81k73J57J38r2J24j48m1j00m0P8K42j25k5J13j38j03
3297a27M5j54J31N1K16k69K6PJ69N9J1j83o9J63n1j9N5k8p3K64k49J7j46J32n
3322b7K50j73l64K68J43K1j6jj14N1L4L4L22k44j31o4k13J48l0K5J44R0P7m64
3346b34J11J75Q5O7n43K47J56o9K5j2k19K1L14J24j88j33j42J69j02K65J03j66
3368E4j3Q5j3J62l17L2J59L8j77n1j81N7J48j0j28J41p5J79k17j68J26Q0Q1J13
3392A05Ol51K5K74j98p5J32K99p0j53Q1k22J75J40J83m75K63l58J84l4L32k36
3414B7j49K30k83J12j52J79M0L3K22k48j85l5K79n3j69K27k35J99k23N40l76k61
$$ y = [244, -45, 173, 81, 89, -190, -89, -113, -178, -104, 59, 98, -274, -141, 51, 4, 68, 81, -352, 78, -11, -14, -68, 207, 80, 80, -40, -168, -98, 124, -75, 106, -167, -10, 128, 36, 160, 12, -29, -129, -169, -91, 151, 26, 1, 114, -24, -127, -82, -236, -105, -54, 162, -107, -81, -74, 95, 154, 165, -18, -87, 76, 25, 6, 61, 33, -40, 224, -25, -8, -154, -22, -27, 223, 50, -314, -46, 97, 118, 102, 101, -13, 38, 72, 106, 428, 184, 53, -11, -224, -76, -106, -81, 63, 153, 230, -234, -123, 52, 137, 204, -339, -92, 64, -5, 20, 8, -211, -190, 124, 248, 60, -73, -215, -46, -148, 117, 220, 54, 41, 126, 113, 275, -42, -10, 149, 187, 10, -41, -222, -165, -17, -27, -155, -14, -89, 90, -127, -295, -169, -89, -8, 105, 111, -240, -215, 59, -139, -214, -82, 217, 147, -6, 75, -147, 28, 168, 351, -124, 139, -219, -35, -69, 263, 27, -122, 108, -175, -63, -215, -36, 4, 37, 259, 11, -174, -209, 70, 17, -152, 75, -160, 39, -184, 356, -20, -281]
3436b81L25J34q6l17K10P7l9L9O1J78k83K2J43l00R0nk9L9M3K23j75k0j32o2m
3461a49J03L52n23J70n5J79n5N5j3Jj8J18k45NJ70o7k24K37j70K59k82n9L33k92
3485a70R4J18r6j7n6J1K37k47K67k81J9K9j06K04J65j83o6K16k5k22N3J14J7o9
3509FK11o3j54r6M27l78j93L37j8k58J83P1m4Q0j92P3j41K4L4QJ28Lq4LJ20J06
3535A93j83Q5k21J01J84j67J20k09N7J66k55K5L8n4K37j52N4j13k8J11K94k11
3557G2r9J25jQ1l43J58p9O4L21n24L32M3k56Mj63K30J27j68J7K8j15p3J60J68
3581A09q3j70R1R6o4J61j15P3j29J6N5N8j48K0N3k9L0l3m8K06j57j23J75m2j03
3606a01L4j26l8J43k21N68l30N1n2M2k1O2j87M2K48R8n3k68J7J91r4n4P6J8p4
$$ y = [-281, 44, 178, 92, -225, -15, 62, 23, 62, 123, 301, 18, 40, 183, -117, -27, -32, -61, -22, 21, 244, 69, 49, -83, -145, -149, -46, 306, -217, -47, -102, 77, 22, 77, 64, 65, 47, 165, -80, -75, 95, 28, -196, 41, -129, 130, -152, -211, 122, -170, -76, 42, -54, -71, -127, -116, 121, -126, 141, -140, -121, -92, -198, 6, 171, -12, -78, 138, 113, -109, -56, 58, 75, 6, 217, 154, 0, -96, 331, -47, -240, 97, 79, -179, 4, 75, 31, 111, -81, -8, -149, -125, -91, -83, 45, 48, -36, -33, 87, 193, 10, 95, -126, -25, 159, -8, 112, -97, -40, 126, -129, -104, -66, -120, 117, -35, 19, -94, -122, -11, 283, 72, -27, 98, 97, 178, -165, -7, -86, -22, 299, -225, 107, 150, -106, -102, -265, -35, 92, -76, -59, -31, -146, -219, -59, 109, 26, -144, -53, 43, -21, 140, 25, 98, -31, -15, 40, 98, -50, -30, 23, -6, 24, -9, -57, 149, -8, -131, 44, 2, -101, -67, -193, -231, -88, -309, 259, -71, -20, -72, -30, -51, 11, -176, -134, 114, 212, 159, -109, -92, 99, 5, -49, 27, 45, -29]
3631b9j15J01J83j8k12L5K3J99m46L87j3j68J65K0k28K30K3j73j04K89qk89n8
3654b06J22nJ7K64k61K62k7k55J62k66O8K56l03K83k10J28J54j77P9K8j14L56
3676C55n73J32J06J29o8j87K13l3j55K06N0k06J3R4qp6n7kL87k62j60N6J34o7
3700B1L4j18n4J43K2l64N47j29j36pJ60m0j01J04j45o6J11o7R7P9j62K25k40J35
3724D9R3q9j21O9J15m3Qj49J75Q7k27l7J0M6M6L2l92L63R7j96J8j7M5n7J70j98
3750a03N5K21j48j18R1j32L4n1J69K77k60n5j52L46n1%O4j84m9l8J85k05J88j41
3774e7n5K19k56q2K46o2J35j15O3n1j47J64o8J99m9j11J11Ql00K92j49J74j00
3797IM8Q9J4j77J06kj26k07J41m1J57Rj76L17m26L00l56L73p3j75J38J80q3Pj04
$$ y = [-29, -144, -43, 140, 122, -90, -55, -32, 167, -279, 108, 95, -73, 92, 112, -116, 114, 137, -36, -140, 149, 141, -148, -206, -84, -89, -72, 192, -69, 193, 166, -89, 73, -193, -125, 131, -172, 111, -99, 29, 183, 6, 85, 113, -1, 355, -218, -86, 20, 149, 81, -106, 107, 74, -81, 125, 175, -31, -18, 76, 68, -8, -65, -67, 320, 58, -102, -46, 88, 21, 55, -63, -117, 26, 48, -316, 231, 102, -34, -41, 119, 79, -22, 82, -63, -129, -18, -85, 12, 91, -71, 154, -86, 49, 142, 53, -68, 1, 116, 73, 81, -68, 107, 194, -33, -70, -60, -14, 32, 64, -328, 35, 132, -64, -46, -63, -18, -75, 95, -103, -48, 173, 25, -93, -2, -134, -100, -151, 18, 295, 35, -20, -172, 174, 123, 123, 187, 3, -46, -84, 101, -104, 84, -57, -112, 107, -149, -231, 15, -47, 88, -27, 36, -15, -162, 2, -66, 133, 84, -27, 84, 92, -208, 84, -65, 109, 9, 57, 146, 160, -17, 89, 87, -39, -246, -105, -146, 11, 20, -156, 161, -265, 35, -321, 52, -21, -196, -58, 122, 39, 46, -58]
3822e8r7L09j80P0J23m21N58j69k89J64N4M1M5j91o2J94j46j74j6L2L18l06K26
3845B5n8j16J13J55k19Q5L69k89l37L10k65L60k92j21j2L13Rq2M9j33L91o9k34
3868d8K70m24K0R4o7K07R0l23L15k28K59l21L4K12m06L39M2j16J95j8q2q4M8j42
3892a34N03r7l85p6K38j8J87l34J18J93k81J46l29J09K88r0j64P6K1n9K47l15
3914a56K07J42k22r0J82r5K04m07K40j82J10M5j52K22l55K37Q2J88r0K4j78R1
3936D7j12R8l7Q4k40J17NK21j80j31K00k27o6K10j7j67J28oO6P1n8J00q9O3j68
3961h8J57j52P6J90k01mn0Q6m8q5J24k6m8j09L8J7J04n6K88l34K31m4N6j37j14
3986a29K06k8k5L8k14L72k73k3J34j6J05k36K85k23n3J90n3j83J55J52j81N1j4
$$ y = [-58, -155, 154, -26, 44, 167, -254, 304, 135, -154, 10, 64, 105, 150, -41, -103, 91, -55, -229, -245, -213, 105, -201, 25, -33, -149, -36, 119, -100, -15, 354, 65, -272, 38, -227, 133, -159, -280, -292, 21, 30, -52, -3, -136, 255, 186, -48, 222, -202, -182, -88, -155, 52, 142, -181, 134, -94, 165, -156, -122, 90, -316, 23, 65, -51, 144, 126, 44, -40, 8, -134, 369, 272, -113, -189, 49, 31, 218, -116, 2, 195, -86, 60, -269, -160, 128, 38, -126, -50, -29, -88, 159, -156, 51, 193, -29, -119, 63, -32, 172, -235, 5, -177, -67, -22, -174, 48, -307, -70, 12, 200, 110, 134, -44, 47, -65, 33, -4, 80, -160, -43, -38, 183, 3, -128, 72, -155, -221, -11, -28, -195, -67, -73, -7, 64, 6, 106, 17, 80, -88, 69, -83, -7, 183, -18, -22, -72, 14, -34, -119, 5, -21, -69, -178, -140, -123, -19, -75, 213, -121, 110, 66, 122, -15, -129, 77, 49, 24, 62, -152, 220, -53, -76, 58, 42, 147, -89, 196, -27, -80, 110, 57, -126, 29, 181, 0, 51, 37]
4009C7k14P5J88l9p4J08l71J77J20l9r6L00j06l5pK7%P8k3k03o2P9K34j74j69
4034a89j0M34n24K41m7J21K5j14R6J70k55j08O9K65p4J37l58K38j11N7J1r1k4
4057d1M9J94k46K48l35O3L17l64P0J49p6j20k11M30k74J96k89K64m7k5n0MJ82
4080H8qk1m01M29m05K81J82l09M32l06Q7j28M3N4J51j85J9j20L47j26j36j65J20
4103g7L5j44K35j23J32j48j11L59j34j8N2l5j01k01K79J15k10J03j23N9J37j09
4125b8jj31K20nJ31k53J5K25r5q2j70J53k34L7N29m59Q0J43N5l40K64J29m55K77
4149Ej09L50k99k13J75K45j75J38k63K90k36K09r1M3L4j36j19K55j00J13q4j81
4171a49J97j57Q4J9L6o7L3J25l8m2K6J26j6j77k9O9j34L45j66k7k14J47L3l1J35
$$ y = [37, -177, -102, 86, 47, -27, 81, -290, -113, 7, -32, -128, 172, 66, 31, 24, 51, 51, 129, 106, -97, -159, -80, 154, -20, -189, -199, 235, -289, -48, -95, 26, 51, -63, 33, 203, -52, -160, -91, 174, 100, 237, -121, 117, 6, 63, 74, -17, -41, 8, 202, -44, 204, -131, -68, 249, -115, -45, 104, 28, -92, -303, 127, -147, 49, -240, 24, -23, -48, -98, -94, 88, 80, 59, -342, 87, -318, -37, 145, -164, 268, -38, 49, -79, -36, 18, 169, -16, 3, -117, 230, 104, -32, -197, -77, -42, -186, 49, -74, 58, -90, -201, 158, 24, 6, 58, 23, -78, -279, 0, 115, -95, 8, -115, -56, 81, -28, -29, -160, 60, 55, 186, -67, -52, 173, 78, -4, -174, -21, -255, -218, 311, -148, -68, 75, 130, -210, 54, 183, -272, 5, -104, 246, -53, -266, -91, 154, -21, 117, -146, 144, -92, 117, 26, 69, 103, -33, -152, 103, 3, 116, 32, -149, 48, -109, -25, -6, 30, -37, -4, 121, 83, 41, 67, 193, 177, 0, -29, 40, -94, 251, 85, 58, -156, -9, 24, -7, 128]
4196A28k97J17J79j07n0K8j7r8K49j0j51j38J03j3K7LK38N2k24j02OJ56l16J38
4220i9K91k85R4j19k03K91O9P3K3l55J35q2J68K66l39Q6l31K53o3M28k78J14M7
4243A84nn2o9l2Q1j15k06J94J45n7p6j4J31q9J11k03N3l1K66j56m44J57L79k80
4267a28J40j77K27n9L8K83r5m12L35N7j35p6M7L63j53Nj18J84l24K31j63j68K91
4290A93k82J75n06N19k3j33nj8Q4j17J94J0J58l88J12o6J7kL28l20K05j48k13
4313b26L89j64O4RKj00Q3J82j08r6J39j89p0J75J4j36K31j63o7J17k34L02J09
4336B63k59l03mL6J07L51l62K86j13J02l71J48K01j34j8J17j9q1N5Q7j43Q5m5
4359a4K29j10P9j01j37n9J53jj13K57k20P1J42o1Q9k7K36k31j59m5q2K9j0J81
$$ y = [128, -169, -52, 127, 20, -30, -2, -19, -117, 132, 122, -29, -167, -64, -77, -50, -47, 191, 243, 19, -83, -77, 79, -237, -99, 192, -93, 1, -118, -321, -30, 39, 112, 135, -220, -85, -167, 1, 267, -72, 14, -317, -64, -127, 301, 23, 137, 184, 179, 127, 58, 26, 107, -8, -214, -20, 125, 68, -8, -22, 109, 20, 131, -72, -19, -50, 216, 60, -384, -227, 152, -128, 12, -165, 62, 3, 41, 324, 229, -183, 152, 209, 74, -2, 45, 408, 255, 260, 142, 326, 2, 233, 70, -98, 193, -89, 86, -420, 99, 76, -57, -62, -80, 4, -113, 81, 91, 249, -139, -27, -93, -76, -78, 250, -70, 135, -13, -226, 163, -1, 63, 72, 74, -26, 57, 239, 131, 35, 174, -15, -85, 90, 104, -32, 199, 36, -31, 86, -148, 154, 263, 4, -299, -303, -267, -160, 191, -171, 115, 2, 104, -267, -119, 82, -52, -70, 47, 28, -53, 2, 89, -54, 31, -14, 215, 105, 184, 83, -54, -113, 40, 39, -74, 183, -37, 34, 176, 115, 204, 177, 413, 182, 23, -22, -104, -75, -85, 96]
4383I6j18r4J99j75JQ5j13K01j20Q9j56j02J77m1J79k42K79L5k26K27m18L35k82
4406a84NJ71j24J04K09j4k38L4J43n1M8j02N7j91K09l0J04j47k25L02J5O9n4k07
4430i7K37k89MP0q2J51j53J41K0L76m21n6m7J19R0j85J44k97L58Q6k31K28l41
4453a75K84r2k67K76j9R8k25J81l44N74pm43Q7K46j72k44L53k18L7J01K8k43K72
4476H8j86QK59j3Jk7R7j89j42N0j20L31Lq6n7k08J39jn1J61l43J02J38J28q1M7
4502D8K5m6LJ24m25n6J86J64l7j91L27j03j79k8J24J36J00m13J72r8K35O7j00
4525C5k67J37K62j45k24L65L1l23j10K90p9J71j29q7R8R2j83K04r5N6k61J09L11
4548B58o30L61j13K38j25j61L32k28J65j4j07M5L09k13j94PQK24k24O2m6RJ9K0
$$ y = [96, -22, -116, 83, -92, -91, -6, -119, 82, -38, 51, -105, -207, -30, -71, 108, -134, 145, 180, -46, 181, -237, 98, -184, -179, -8, -132, -28, 181, 167, -71, -37, 106, 55, 103, 1, 58, -133, 76, 46, 150, 3, -222, 80, 95, 164, 110, -97, 140, -149, -145, -75, -157, -6, -159, -18, 2, 378, -43, -99, -146, -27, 63, -122, 22, -275, 83, 169, -62, 166, -175, 109, 17, -250, 26, 7, 105, -120, 61, -283, 291, 284, -159, -72, 174, 2, -242, 111, -107, -70, 31, 59, -184, 88, -98, -90, 169, 156, 157, 130, 227, 38, -104, -54, -174, 157, 160, 74, 17, -191, -52, -53, -104, 57, -286, -184, -46, 82, 1, 48, 73, 27, 30, 154, -271, -327, -141, 23, -14, -205, 122, 19, -160, -188, -64, 72, 172, -241, -69, -167, 68, 135, 35, -232, -95, 167, 22, -202, 163, 194, -129, -239, 51, -28, 143, 14, -73, 25, 117, -66, 138, 43, 99, -162, -53, 258, -372, -11, -124, 114, -11, -172, 160, -68, 97, 83, -24, 21, 330, 117, -77, -70, -62, 162, -62, 0, -46, -37, -18, 2]
4572BKJ2k41K30N0j03J49j12K11j62p0K80l46j29K3J49j64J72N3J75j13o7NJ13
4596A19j41J86l91L30j5Qqk30K81n0j41K85k19k41O4L6K08k3m6j08Nk7J55J53
4620A90l43j00L21j02l46M79j33r2R4J09P7j25K16j84JJ89k13l5J69o0j32J20
4642A00q0k6j33R2J08o6m0J94j37j21J16l2k88K07N4L6j7L5L5N0r6L21k28J2k32
4667a36L37k94K28j18j97KQ2L12l26Q0Lqo0K56l56J80j25J67o5K21j40j95K6J97
4691G1j15O7j91K28m9j68L90Ql46K2M26l10j15K55j93k53K29K2P8J12j01j36O7
4714bj35P0o7K19k6O8o2n6N7j67J40j48J62j7J64r7k15j31M22n0q0q5Q9J04j03
4739E4m2oN6R9l54J90J18l67K73m55M23j57R8k3p5L36l1k63J86k38K52j68j7R8
$$ y = [2, 4, 16, -225, 5, 55, -48, 101, -11, 200, 38, -32, 248, -98, -227, -204, -55, -219, -47, 6, 181, 68, 1, 6, 119, -22, 164, -227, 103, 88, 96, 88, -142, 139, 89, -52, 233, 14, -227, -163, -127, 81, 58, 12, -96, -91, -118, 37, 190, -153, -253, 68, -34, -380, 99, -34, -126, -32, 77, 154, 29, 245, 61, 62, 251, 38, 3, 172, 112, -20, 100, 20, -6, -139, -47, 61, -5, -45, 149, 12, -109, 7, -25, -313, -106, -52, -16, -33, 2, 37, 87, -9, 312, 84, 96, -136, 201, -93, 135, 17, -180, -178, -96, 216, -110, -30, -27, -35, -95, 161, -195, -15, -140, 27, -38, 183, 43, -152, -126, 71, -44, 23, -168, 60, 11, -157, 233, 241, -105, -83, 343, 33, -82, 173, -20, -273, -44, -22, 56, 168, 67, -69, -2, -137, -67, -134, 85, 59, 127, 65, 9, 66, -101, 39, -109, 53, 36, 200, 103, -112, -243, 179, 129, 49, -36, 53, 157, 54, 12, 6, 62, 161, -193, -3, 115, -252, 21, -434, -11, -168, -70, -93, -168, 168, 137, -126, 60, -178, 74, -94, -111, -13]
4763a3J48k02O4k6K0M6j41N5N4R1j22J2m1J92k23j29K20R6j94j35K44r3N5J7O1
4788E6Q2j27K3O1j07R9j49o3J96k34J25P1N4l95M45k67N8L44j94K38l46j14JJ08
4812c5K5J79k00l2l9j39K59l11K58o6O3oJ56l77L65k9O9k75L06j10p5N8o8Q6Q0
4837A42p6n3R7J09l31J30j02J32j07n6j15MK97j07k4j81L19k82L55k85K40p8K9
4860E7L2RQ5%P2p2k34p6K5J89j55K1P1M3j04j65K13R5j80m3o1K40k43n6K71l38
4886c04L36J19j23o8J3r7K58j85J06O1l01J75m3J10Q6k12J34j79J37k4j27J69
4908D1k8J45k5k46O1j46N93k75l11L64j59%L6k06j25K34L0l9j57J77j67J94L86
4931C77l59r5K30m3q0K6k14J10K4%j81qL94k15Q3o3j09O8J33J28j53j03nl2J75
$$ y = [-13, 135, -67, -3, -29, -9, 37, -104, -49, 5, 96, -26, -14, -55, 137, -86, -215, 5, 101, -93, -228, 16, -77, -22, -5, 56, 138, 11, 34, 95, -12, 87, -62, -125, 71, -163, -38, 33, 87, -308, 137, -130, -72, 272, 78, 316, -30, -144, -143, -35, -10, 169, -31, -63, -102, -241, 18, -293, -35, -101, -38, -44, 112, -265, 100, 71, 140, -135, 171, 61, -14, 44, -24, 62, 142, 66, 13, 110, 219, -112, 18, -84, 48, -59, -115, -230, -226, 71, -36, -60, -241, 78, -204, 151, -134, 106, 28, 57, 89, 98, 183, 183, 255, 183, -51, -127, -102, 87, -68, -47, 24, 67, -37, -202, 11, 106, -74, -117, -178, 62, -181, -237, 34, -304, 32, 151, 28, -40, -27, -124, 134, -51, 55, 116, -185, -10, -53, 57, 143, -69, 65, -114, 23, -1, -128, 41, 13, 158, 133, -113, -52, -198, 395, 120, -191, 173, 14, 14, 50, -156, -281, -47, -17, -56, -213, -36, -203, -9, 377, 18, -77, 153, 110, 30, 56, -158, -48, -24, -24, -205, -213, 181, -34, 49, -14, -123, -55, 78, 206, 53, -50, -55, -87, 88]
4956H8j66L0j50L49l31K71k32R8J92Pl18j8K03k84J72qP2p1J62n0J11j38j3o5
4980h9nK34k32j22K91q6j09J24j14J10k05L83M2l56J15J13k29K35q2j41N3J14
5002D4m7n6j63J57L38k07j75L71j50Q3j2J28k87P6N1k51R5j12K43J16k14J11J5
5025A54l03K31k2j91J88K8m8K97n14pJ71J81m23K71r4n8J19J2r5q7k6J39L97j22
5049A98j68l0J17j22k55K76K59k52K1J64l49k1k2J27Q6j28J67N4j14P8j7J32k33
5072c2J56k71P0K03r0l00M40K15n75J79K18m05K21m0L0J92k75J58r8N8qq5O6j34
5096a07l2K21M1j51j05O3M0O7O0j79j11K08P4k20nj88L43k79M76j45j25K53m30
5119b31K64K12k16j63K76J20k82J16p2K2m7j21K10j4j20K19l12K03m3j91l1J98
$$ y = [88, -78, -48, -198, 151, -180, 91, -141, -43, 149, 156, -162, -180, 23, -261, -89, -97, -25, -96, 66, 16, 127, -11, -24, -89, -94, 140, -92, -214, 77, -9, -118, 6, -108, 2, -203, 180, 222, -134, -19, 94, -135, 100, 18, -123, -70, 44, -3, -59, -222, -65, 273, 66, -109, 262, 112, 195, 183, 311, 24, 100, 151, -100, -5, -117, 126, 242, 28, 139, 154, -149, 82, 60, -131, 57, 85, 37, 334, -180, -187, -16, 165, -258, 13, -81, -139, -20, -8, -103, -190, -216, -77, 320, 198, 30, 0, 117, -5, -260, 16, 275, 23, 44, 208, -141, -162, -184, -57, 29, -99, 68, 122, 8, 86, 69, 201, -32, 124, -147, -77, 126, 36, -264, 176, 391, -184, -5, 213, -192, 29, -11, 19, 211, -64, 94, -4, 54, 46, -39, 27, -107, -139, 82, 123, -28, -133, -70, -30, 37, 97, -82, -193, 15, 89, -131, -136, -324, 19, -260, 216, 71, -54, 199, -231, 33, 245, 29, -134, 142, 262, -20, 96, 24, 46, -1, -122, 88, 74, -46, 173, -139, 64, 21, -170, -201, -3]
5141cJ59k30p9L4J92k01K31j13p7J50j10l1J34N5j89q3J55J47j83P7n2J33N7m95
5165c22J30J49r3R8K55l21K64P2l24N8J35O1r2m8J51N2m30J67J14J27l01J74J05
5188A81p5j24J69L4j47K86l37J18L05m48j85K39l45L57k2j12k15L22JO1J88m71
5210b20M09j94O2o2M3l9J53j43L3j21J41r4j09J16p6%r4J69k66K68j08J97j55
5233i0N1j05J6m1L61k08m00M32K8q4L03n17K16nj2q5K46j95J29j52j9j07qL68
5257A22j62Jm3n1M8L06j34K4k79J22M4q2J24k36K04J06k06J04J75k31N18m98K24
5280B00p0k01j3K09k67J00J86j69P7q5N2j15K70k79P0J9j37N6J47O6j70J64k36
5303a26Q2q6j21L22j36K96p0j63j1Q6j50j0Q6J07j61J33l22M01K5k85O2N1J32
$$ y = [-3, 156, -74, -153, -119, 73, -128, 103, -10, -87, 63, -47, -78, 56, 111, -78, -161, -6, 141, -42, 35, -17, 116, 173, -322, -192, -43, -136, -38, 217, -104, 160, 232, -92, -34, 101, 162, 70, 22, 173, 225, -205, -38, 76, 203, -98, 76, 181, 106, -18, 151, 185, 38, 324, -13, 105, 410, -38, -223, 16, -329, 28, 6, -106, -321, 1, 2, 63, 251, -220, 189, -5, 57, -5, 38, -1, 152, 9, 42, -79, 62, -32, -141, -25, -101, -101, -195, -26, -292, -24, -132, 65, -90, -39, -144, -128, -169, 192, -16, -416, 16, 44, -40, 263, -254, -38, -43, -55, -140, 106, -89, 40, -112, -131, -238, -246, 122, -40, -39, -82, -133, -85, 221, 87, 111, -168, -46, -2, -84, 40, -196, 8, 114, -92, 12, 187, -44, 474, -24, 200, 130, -71, -84, 125, -142, -42, 144, -25, 52, -33, 19, -96, 174, -105, -35, -16, -153, -97, 50, 116, -54, 110, -126, -44, -130, -251, 71, -65, 231, 161, -2, -13, 73, -77, -87, -1, 106, -55, 78, -244, 157, 182, -103, -41, 10, 142]
5326A42j82M1J66j7j45N2N4p6k1j55K20O6J77k76J04l18J83J00k98L71j16j06
5348c4p8J51N2J17m22K94j60K34o2m24M43L0r2j87K24j8k45L7m7M5j8L53l8k27
5372g2M7N7P5j65j2J23P3j47k0J92r7n6k0J01j33k7J81j76j50K51j89P5o8P7l00
5397c80K41L37k07q8j74M23n7j79K21l94K11j9K85l52J36Rqk6p5J00Rn0o2K53
5421A54K8k17J86j85p7J54o3O7PM9l26J31p9K25j20n9J40j72J69k11R7O6Q8J38
5445A90k76N0k9P1j84K35O3l48L05O5l42K79p5L6j44J24k20K19K8q5j64M9J87
5468C4J21l12L23n7K7Nk11K18j76L4o7j13Q9l7J12J28j53j5J78L9l42K34j21J14
5492E2j05J50p1K58j13n70L81J39Lj25J0l8O%k7QN9K21l60J98J11k04K38o4j23
$$ y = [142, -40, 1, 167, 150, 5, 57, 111, 35, 14, -141, 79, 145, 322, 46, 150, -168, 15, 115, -183, 188, 72, -34, -112, 39, 91, 208, -214, 80, -80, 154, 92, -332, 111, 141, 49, -138, 86, 68, -177, -140, -187, -142, -160, 193, 155, -72, -25, 32, 107, -58, -70, 53, 126, -21, -41, 151, 54, -2, -22, 79, -54, -81, 100, -76, -226, 25, -164, -89, -157, -80, -380, -139, 198, -9, -97, -271, 152, 95, -84, 137, -257, -46, -65, 220, -132, 4, 13, 5, -21, -96, 4, 13, -37, -99, 154, 182, -35, 151, -34, -111, 43, -20, 47, 54, 103, -223, -92, -171, 54, -66, -125, 15, -157, 12, -199, -102, -36, 52, 190, -86, -36, -65, 6, -178, 57, 120, -228, 77, 142, -200, 79, 4, 40, -104, 20, -200, 19, 47, -38, -202, -153, 34, 155, -157, 166, 109, 136, 141, -70, 148, -28, 6, -61, -174, -85, -122, -10, 118, -35, -50, 128, 167, -175, 59, -62, 52, -53, 97, 26, 284, 171, -399, -18, 121, 124, -1, 9, -29, -23, -23, -50, -42, 17, 238, -122, 76, 187, -17, 221, 157, 34]
5517C4Ko8O6j1k91K48q2j68L44j07r4q4J63K9K5J89j74p2l0%M2k5J7L23l35J53
5543I4k07QJ3q9M32J43n55J73k31M78l00J0l0j13J91J80M6l84l8J90qJ89l1j29
5567C2K50r4m51L18R8p8k13K89Q7N8k14k07K14J63l61J88k93P0O9O1r2L27k35
5590a4J42l14J76k09L07R3k66J35J3l4k1p9K32l10M22l06j9K46J00j58m65N32
5612B03j04Nl85M22k25J2k2L76j45j09r8Q9l59K30J52r6J1j81J13M6K23k79L15
5635A94P1m12j75O55l10R7j45m7j7J57k26K83j03k20K56J3l0r1P0KJ64j01J9j17
5659a3m3J51k2J65k42lK1L4k12j11K79j45J32k7lJ95j98J47k05K16j4q4J92k54
5683d4j8j10K50j32l10J20J73P4j06J24j25K05M2l31L43j78L08k64P6O9k53L7
$$ y = [34, 36, -32, 34, 23, -268, -20, -102, -270, 74, -33, -127, -211, -48, -19, 6, 195, 21, -51, -81, -81, -39, -64, -47, 276, -59, 94, -113, -105, -92, -181, 251, 394, -161, 12, -219, 259, -41, -31, -61, -174, 17, 197, 243, -141, -179, 11, 3, 192, 161, 32, 282, 188, -263, 55, 153, 75, -138, 151, 238, 296, 82, -125, 89, 252, -109, 79, -214, -144, -75, -14, -106, 221, -14, 128, -186, -10, -219, 88, 181, -85, 50, 63, 29, 8, -71, 161, -149, 273, -33, -52, 194, 294, 136, -329, 203, 99, 104, -281, 141, -84, -72, -94, 282, 137, 28, -70, 19, -340, -110, 42, -54, -43, -224, -111, -65, 158, -121, 194, 265, -147, -322, 333, 23, 120, -25, -72, -89, 68, -158, 125, 22, -198, 58, 71, 41, -50, 20, 22, 186, 85, 104, -13, -56, 95, 73, 238, -4, -7, 14, 48, -164, -275, 4, -141, -9, -36, -39, 156, -42, 105, -100, 116, 102, 18, 210, -44, -62, -172, 78, -54, -364, -244, -71, 3, -103, 21, -104, 101, 143, -188, 155, -23, 285, 21, 97, 166, -87, -50]
5705e0J94k51K20j66J32J27k49pk1j03K09j07j48K70L4m7K0%Qj11k72K99P6j62
5729a05l7K01j82j26K79N9j44nK93j1k76K84k02LJ54k06k10K51N0P9j11j12K24
5752A50k65J76K3l23m3K27J06k88J37K13k07m1L1P3p0Q5L5K8RJ4j75K12j49l0
5776g2m8K1o0K27j62n5l4K26JP5j46k14M23l19K6K5K46K7l03J61J70j67j20K10
5800A38k83M2l8K00l6J83j48N2j43L9L43l25MJ27j54K71J9q9j74K8k20j17J22
5823a59K12j38p6P7P6K67r0N5k24J39l00K32j44K01j4j01J89j01j72OJ39k74L71
5846A71j62P6P6j59r2j3K05j18j27O3l9j55rL8j05L56O7j13R9j5k31J21r9K40
5870G5J04l19J74q5n3j07K46J51j01j40J6J39j46M8j1k74L32n1Q2k24J59J78j02
$$ y = [-50, 144, -107, 113, -53, 79, 206, -43, -50, -71, -174, 35, -72, -220, 50, 84, 37, 57, 57, 65, -46, -318, -19, 57, -105, -142, 59, -123, -249, 30, 89, -55, -60, 233, 222, -54, 230, 28, 31, 185, -21, -231, 20, 70, 149, 38, -74, 150, -115, 61, 84, -239, -282, -55, 51, -237, -100, 113, -94, -135, -104, -31, -101, -16, 19, 47, 56, 70, -105, 107, -42, -72, -120, -99, -159, 68, -94, -149, -183, 43, 44, 119, -27, -241, 182, -137, -111, -86, 160, 187, -116, 45, 215, 48, -72, 138, -145, -103, -141, 59, 23, 206, 58, 110, -33, 6, 349, 24, 28, 155, 1, 272, 291, 202, 28, 56, -164, -281, -159, 53, -85, -161, -84, -8, 259, 169, 224, 0, 139, -161, 71, -73, 128, 114, 13, 202, 101, -71, -65, 74, -200, 171, 9, 85, 161, 2, -90, -103, 102, -16, -143, -80, -119, -274, -283, -245, -350, 6, 73, -40, 59, 44, -187, -66, -165, 75, 179, -140, 34, -51, -104, -211, 35, 186, 85, -55, -39, 100, -46, 2, -9, -283, 49, -2, 80, -144, 15, 193, 91]
5893I1k74NK38j67O3j52O1J66j35J08pj22K69j67K04J2l63K13j28J57j44M9J50
5916A27k60m2K95k07m0K06J28j45j80K38j45O3j82J85j76l1P3J4N9L2M8k12K43
5939I1M7j15L04m53J84r7J87l35K01O7j84L0j79K16m5mK82l53K81k04n9K3k21
5962c36M34j12l8j34J37J19j52J61j23L33l38j16m4N29k88O0O8q8plj26P5o1K28
5986A78p2j92J15q1K00o3O0k43k0j47J68N5jJ59k55P6K54m83J48J48Q4k75K06
6009A9j7Om2O2k26K50Q5j40R3l8j51m0J56m1K26l02J59K4j05q7j39k7M63j75o9
6034e6n7k2O4l6J06nr7J98JK2M9k75L39j11P4k41J75j62J46j75J38j29J64j21
6058a1j51K03K28k63o3L9j60K78j81n5N0RL9J30r9K55j03m8P4j54J43k46L32r8
$$ y = [91, -183, -178, 60, -107, -44, -196, -135, 31, -104, 4, -3, -125, 144, -23, 181, 193, -170, 43, -85, 72, -72, -23, 127, -133, -175, 120, -87, -127, 79, 207, 62, -118, 120, -25, 38, -144, 41, -135, -166, -93, -79, -20, 12, 60, -152, 91, 138, 23, 327, -126, 58, -39, 148, -187, 14, 81, -103, -73, -252, -36, -81, -85, 197, -156, 125, -79, -138, -115, -336, 98, -14, -52, -186, -49, 70, -82, 79, -44, 289, -49, -165, -209, 320, 32, 92, 160, 72, 65, 62, -64, 11, -50, 178, 106, -86, 29, -52, 148, 85, 145, -98, -118, -265, -97, -42, -43, 116, -139, -63, 191, -292, -144, 4, 88, -187, 19, 2, 8, -34, 28, -198, 52, 137, -3, 90, 52, -99, -139, 17, -24, 202, -100, 59, 83, -22, -109, -248, -275, 188, 13, -56, -113, -135, -71, -107, -1, -6, -103, 95, 96, 118, 167, -108, 231, 120, 194, -47, 128, -34, 112, -63, 75, -54, 110, -11, -162, 41, 269, 6, -57, -18, -178, 100, -81, -136, -86, -77, -38, 92, -7, 248, 145, 97, 171, 17, 160, -86, 246, 148]
6082A48j3n2l30J68K13n6J0j05p9K28n9l60L28l1ON0m5j5J00n2J01m03n2K27J20
6107D7l3j20J2J08j4J76r2Lk6Q9j06J68k05j88L20j55P7j43J77j87R9j50J02K35
6131A94l87K06J4J5K03j77l03K24J45m8k9j00L3o8J07Q2o7J32o2k23L30n8ok41
6155h4K5j46K21m1j26J82j67j90L23J8k22R7N8l4q0rM9J58k0l8p5K13M3m9j42
6180c6j05J78rj46J02k88J54K52l0r5k6K65j85j4J89K10l79j76l1K63j54n0J51
6203D0nj60J1rl9J54n1O2l9L6J14J39l68J45K57j04j85J75j02j0o4J73mk91j91
6228c16K72O8J8P6k35M16l75M7n1O3J95l17K51k09N12n76O4N1j56M6J67qj19k8
6252a44L11m4j66K48j47Pm0m38O48j99J39k04P2o4j2J21o4R8l38L08n0R0k2k67
$$ y = [148, 135, 83, -247, -79, 134, 78, 88, -17, -96, 132, 73, -287, 41, 10, 16, 66, 21, 6, 106, 54, 155, -248, -300, -73, 47, 14, -106, -94, 14, 0, 176, 84, 87, 61, 150, 44, 212, 7, -181, 139, -16, 61, -82, 95, -92, 7, -143, -41, 194, -193, 13, 27, 42, 245, 68, -235, -11, 134, 86, 57, -43, -10, -78, 29, 111, 44, 176, 114, -109, 221, 163, 157, -84, -59, -205, 16, -25, -151, 31, -136, -326, -3, 15, -207, -110, -52, -86, -166, -175, -126, 32, 12, -26, -101, 112, 155, 106, -36, -141, 37, 28, -118, -16, -304, -150, 102, 72, -23, -49, 216, 31, 17, 206, 416, 37, -139, -170, 93, -61, -111, 40, 35, -125, -114, -123, -162, -8, -59, 3, -36, 0, 114, 253, -115, 30, 287, 183, -2, 173, 71, 61, -3, 170, 166, -125, -316, -44, 24, 42, 118, -117, 299, -76, -29, -80, -17, 178, -139, 112, -97, 415, -161, -97, -46, -202, -156, 11, 3, -116, -144, 167, 123, -43, 205, 58, 65, 25, -413, 235, 36, 175, -29, 43, -21, -33, 88, 24, 122, -216, 92, 42, 132, 110, -157]
6276a57j4M88l52n2K6j3Q0J1l0O4j84J73p2J30l0n4J29l13m1M4M66m23J42O3j7
6301F4P1l07L64k03l9R5j49n0K91j67n1K47j69P5k77L28o8P3k80K43j4l14M36
6324A99k89M7k6r3L98r4l30K81k23L10j95J33r6k10K56k60M82m22L47r8l48K63
6346C2m83M78RJ3k6J2J12j28k9j9O9J42k08J7K5l98M46O7k33MJ8k08J69J64l6
6371IJ85p2J3k8o4k3j56J18K21m18J68K12j51j68R9o6nJ53j85l6J1J24m6j9k3
6396a47P5J20J12j76p4L24k88R2Ln0J96j45j60J1K66j66R7j79J17L40k17J58m38
6419a29L3J82qq9j29K25j42J46O8l36L35j42L13m36o7L98l58P5k6LJ05K49k34
6442C6j51J99m2j9j45J58L6M2j7l02K52l23K23m3J38m12L98q8j44L27k07q6K02
$$ y = [-157, -171, 317, -35, -87, -61, -74, 6, 17, -13, 51, -133, 40, -32, 98, 68, 14, 143, -170, -211, -167, 299, -124, 18, 81, 64, 135, -172, 192, -11, -50, 45, -104, -154, 137, -30, -81, 166, -3, 72, -205, 123, 55, 128, -152, 91, 77, -237, 199, -90, -43, -69, -162, 236, 142, -188, 93, -130, 180, -15, 118, 22, -188, 68, -192, 290, -132, 215, 117, -231, 32, -451, 27, 36, 49, 23, 35, 147, 19, -10, -29, 40, 182, -26, -9, 16, -382, 64, 131, -102, -98, -80, -288, -119, 45, 9, 194, 122, 135, 107, 43, 20, -136, -18, 203, -215, -47, 165, 14, -154, -55, -121, -126, 27, -158, -194, -183, -59, -105, -124, -147, -72, 48, 160, -16, -90, 234, -54, 38, 41, -9, 187, 42, -118, -107, 159, -7, 90, -89, 28, 368, 151, 309, -129, -96, 86, 78, -11, -140, 85, -57, 89, 157, -179, 156, 14, 327, -109, -176, 222, -136, -61, -87, -84, 21, 270, 36, -115, 84, 42, 23, -122, 36, 72, 114, 97, -205, 47, -276, -53, -96, 42, -370, 28, -60, -204, 123, -84, -170, 32]
6465C2n3k68L84M0j67J93l9j07Q9k30J29j01K37j30L2OM0j8N3k3k19Q1j29J06
6489f2O5q5L72l55j02K5M02l33K19k45N2J05j13J52j83Q6l63M54l59K99J19j74
6511b4J81k02J8k12P3J79q8R0m19M82l3J29m22P1L35j6j29M8r2J56j50m03M00
6534b8P9q1J20k08J20lO8m7n8p3K70k37L38m49J49L29l22J42j61L5J26j91L16
6557B34l38J01j53L0PJ8k4J12J98k65qj08J86Q1k53J28J06R7q5K28m04L4K24j74
6581b8j2O9j27J56k0r8L1J0L3k03K46%K4k03L45l50J39j64K06k58K17J48j90K74
6605B45j79J3o7LLk5O3Mm0j11K98k71J62K88m89k3J22J66k10J15J01l0P5l52J98
6630E9k74L05l3l3j91m5K17J40m41K69oJ84j24J36p5oo6O1n4q8J65o1O5n8P6n9
$$ y = [32, -21, -289, 95, 135, -32, 161, 122, 15, 104, -126, 3, -98, 139, 9, 41, 47, 87, 69, 122, 99, -120, -39, -168, -62, 3, -82, 290, -65, -167, -142, 260, -73, 146, -99, -47, 58, -55, 97, -86, 0, -363, 91, -268, 31, 150, -24, 157, -45, -27, -239, -166, 13, -75, 15, -404, 78, 45, 174, -248, -177, 158, 142, 13, 61, -31, 125, -25, -428, -28, 51, -30, 90, -118, 2, -1, 67, 20, -38, -111, 159, -78, 260, -189, -40, 289, -33, 109, -52, -17, 109, -82, 234, -104, -3, -156, -126, -119, -101, -125, -13, 185, -80, -88, -196, -10, 71, -182, -54, 52, 149, 64, 292, -112, -78, 146, -28, -40, 29, -98, 58, 38, -60, -29, -19, 14, -189, 57, 57, 81, -122, 223, -127, 12, -152, 54, -204, 13, 161, -29, 245, 66, 79, 12, 15, 18, -7, 56, 60, 20, -91, 207, -64, 98, 386, -103, -126, -4, 162, -48, 67, 168, 138, 213, -139, 59, -215, 90, 57, 24, -167, -212, 5, 145, -296, -27, -33, 151, 27, 163, 88, 82, 16, 77, 23, -65, 100, 39, 104, 46, 122, 63]
6656F3L4L2N7k36Pk1Q5k7j77K20M3N1k21P3K6j47L39k38j44J94M0J33k79J86j08
6681a5l06K17K9o2L28j21rn4m47L44M5k29J66J18l7J08r7Lmj11o8J0J89j5L4J8
6707C4l17M05r8J64k18K5J0M7j5r0P3r6L44k89J52K26j95k08K0r0q0K28K4k83
6731b27K36oj44J32p4J56J4l1q3J06j70J12J82k46M0K04m25L20k74L08j34k03
6753b07K68J84r4j74k85L22j95L68k68J80J1j03j26M8J30j22K8O9j19J89q7R9
6775A16k57j46M95r3N8k47J09L8j43J27R0k00k9j2R7jq2j00K95o0r8R9J1N1k33
6800a15M29j37k42R2N7K2J69k61J2l28K96K57J32m72J47m7J1pJ02l13K08o9K18
6823A61l5l39L18j08k5K40k66K28k79J02k88K54j39J74o1j42K58J05j15n0k9J11
$$ y = [63, 97, 129, 186, -50, -43, -64, 21, -6, -183, 37, 80, 131, -90, -17, 9, -138, 201, -37, -181, 13, 53, 186, -93, 93, -15, -321, -104, -75, -137, 191, 70, 61, 7, -440, -96, -51, -280, -114, 4, -33, 75, -22, -19, -23, -134, -202, -192, -3, -18, 16, 34, -283, 122, 24, 188, -30, -5, 5, 52, 37, -53, 20, -76, 268, -21, 131, 357, 162, -46, -26, -116, -196, 32, 56, -227, 9, 3, -141, -9, -83, 73, 87, 56, -27, 79, -91, 21, 203, -43, -3, 201, -224, 96, -178, 130, -4, -207, 61, 245, 151, -23, -308, 14, -181, 187, -81, 99, 110, 7, -119, -71, 59, -63, -35, 34, -85, 104, 17, 116, -141, -287, 208, 115, 173, -74, 35, 73, -70, 57, 147, -53, -82, -94, 3, 2, -80, -180, 115, 55, -43, 56, 67, 118, -115, 314, 177, -65, 27, 84, 106, 275, 14, 26, -302, -6, 251, 383, -89, 58, 11, 22, 15, 117, -196, 12, -57, 161, 126, -213, 105, -3, -28, 212, -54, 174, -105, -3, -291, -37, -176, -2, -63, -205, 53, 158, 43, -7, -36, 75]
6845G5m0j28J82j00q3J08n4R9Q4l7k81r7L18J07j79n1r6K43l2j57K0J4%P8J47
6870A40k18J7J78kJj72j02M6K5J55k57J77lk05J84J53r4J53j24m4p3m1MK24J43
6895B65j42m3O9j13j7Q2Q0l1k14K26j27np1J47m6p6j10J5P3m4K68j58l1R4k33
6920a42J74k60K36k00R3k3l7M4J84K89m67JK52j24M5Jj64P3M7J14n0k17K34p2
6944C1K7J02j51r2r2K45k3Pp0O9j48K60k55J14J70r6P3k76J10J30j87j52J94J00
6968I0L5j31K37Q6m85O0J93j4p2K5j71K45J7j32J73k97R9O4J33m05M53k18R8j43
6992f0j41K28k00K23k1J26k46J54j5R6k61K40k27R5pP1K6j06j11K27k8j29oJ03
7016C1j49J42q5o2N2K75O8k10j74R8K06k33M98o03Q0J47j35j28R5P5J61j01J23
$$ y = [75, 35, -93, 89, -11, -94, 14, -40, 59, 143, 106, -175, -272, 46, 153, -26, -77, -173, 70, 38, -119, -99, -85, -85, -7, 140, -78, -61, 117, 115, 116, -56, -158, -112, -87, 68, -189, -12, -15, -220, -36, 117, 23, 176, 52, 8, -65, -106, -102, 122, 265, 123, 80, 149, 36, 19, 101, 181, 150, -64, 162, 35, 30, -41, 106, 60, -16, -126, -111, -38, -82, 186, 28, -3, 91, -142, 32, -228, 8, -192, -99, -122, -159, -115, 69, 358, -109, -108, 144, 20, 65, 66, -98, -25, 22, 136, 86, -131, 103, 31, 58, 160, 9, -83, -175, 70, 47, 54, -16, 53, -95, 165, -90, 24, 194, 98, 171, -105, 5, 135, -52, -204, -10, 90, 125, -6, 231, 317, -168, -108, 85, 71, -1, 24, -147, 98, 115, -17, 156, -141, -42, 22, 155, -250, 203, -15, 83, -60, -201, 27, -173, 50, 29, 155, -91, 63, 48, 144, -117, 123, -104, -9, -16, 55, 81, -25, -136, 91, 63, -66, -72, 31, -118, 24, -61, -123, -71, 204, 272, 62, -112, -14, 192, -41, 457, -146, -66, 81, -54, -182, -87, -12, 149, 48, 171]
7039A71M4j7j7j24j02R5k31p0K82R6p7p3J90k19J27Lqj32k08K80j0N5k20L76j39
7064G2N4k37j06J40NK64q6r7J33k37n9J24P6r9j48J75J39l4O5j36K1l2P2J34k08
7089eP8p3J54o4k55K7j2M09l22j02J43N1k33J34K41k25R2K23k93Jj5L7k43J66
7113h6j66K58q0q0J8r4M69k20o5J53L3j04K1q5K28j84J41m07K61K70l48O4m72
7136d75N03J0k65K63N8k11J39m2k22K50J63k6n9j20L11p90M98m9J28L8j58n1Q1
7159b6J64l12J12K22j14J64j94k05K87L6j33J00k03K75p2l9p1M6j52K59k63j15
7181b34K59l3k95K10l0P2P0j57K01k53R8K53m76K87q1l7J49j52K01K08k75J96
7203A81j82M5J16l69K90mk34L57j93J82l39K3M34j73j2K4m78N3Q5J27J51J30k58
$$ y = [171, 215, 198, 181, 57, -45, 50, -181, -251, 31, 127, 50, -23, 167, -52, 75, 78, 70, -62, -270, 10, 0, 55, -165, 211, 72, 126, -111, -217, -77, -72, 192, 106, 9, 142, -95, -154, -30, 46, -53, -201, -26, 113, 79, 144, 8, 29, -3, 69, 203, -5, 73, 0, 154, 90, -165, -138, -150, 259, -63, -165, -22, 29, -204, -70, 171, -54, 38, 261, -32, -31, -46, -9, -252, -86, -252, 6, -74, -154, -136, -230, 239, 19, -46, 107, 140, 36, 57, -28, 200, 16, 157, -250, 11, 281, -67, -3, -475, 28, 38, -227, 36, 94, -117, 22, -20, -242, 8, 171, 145, 86, -34, 277, -513, -15, -64, 64, 102, -56, -107, -26, 138, -174, -62, 160, 46, 210, 16, -189, 98, 134, 1, 101, -102, 173, 101, 62, -9, 37, -115, 144, -119, -234, 25, -8, -303, -93, -123, -51, 19, -138, 63, -190, -92, 161, -315, -28, -109, -146, 3, -149, 52, 260, -15, 181, -1, 44, 160, -209, 81, 77, -157, 200, 7, 189, -150, -127, 307, 134, 122, 146, -332, -279, -194, -67, 84, 214, -44]
7226d4J00k54O0K88K8j63M2J23l8k52J1J55J06j52J60k62P5K54j94j62n8j12L86
7249I7j51K4m4M7j43K09j85N4K94k29Q0r5M7k08J03K74j57K1J83k86K51k19l2
7272f5P5n8M3R0j8j64l7K26j45K70j31j19lr9M08k61J87k23j92K04K64k10o8K31
7296B05j76M5k30j77N61j46j91K77o2l05J37k5N0J01p2K32l78M53j29k84L8L1
7318d5m3J30o4j36J19n1J75r1jJ73j25n4M3j42K07Qj60O8J02j34R2J2J66k09J33
7343A73k28j4O4k13J42J91n0L2k12L2o3K07j66K39o2q2O0j43L27k17j72L15j68
7366hQ4R3j56J59j80O7r6J63j46O2Q0j98Q9j21K75Q7o9j98Mj03LM2j06K86k5M
7392I2l0N1l55J06j15L27j69Q5j11O8J26l59N6K50k4j21J30Q0j81J29j27R3K4
$$ y = [-44, 56, -198, -138, 150, 178, 15, 57, 180, 142, -110, -99, 56, 162, 10, 170, -92, -17, 237, 43, -119, -177, -289, 97, -54, -30, -74, -27, -170, 39, -146, -92, 202, -27, 53, -42, 5, -203, -100, 174, 17, 38, 221, -65, 186, -33, -65, 10, -48, -5, 85, 67, -97, -134, 92, -53, 217, 86, -33, -36, -135, 273, 12, 199, -24, -216, -12, 252, 42, -26, 205, 29, 74, -156, -333, 228, 82, -109, 168, 106, -199, -62, -87, -37, 64, -8, 224, -154, 299, 170, -114, -76, -45, -88, 42, -22, -158, -39, -90, 85, -6, -7, 166, 41, -13, 30, -112, 95, 103, -57, 11, 113, -21, 71, 83, 249, 40, 173, -55, -69, -5, -218, -76, 115, 65, 97, -115, -83, -146, 61, -105, 134, 72, -10, 50, -93, 234, 17, -155, 160, -8, 76, 169, 13, 172, -8, 59, -37, 126, -20, 42, 122, -76, 13, -108, 167, 254, 185, -13, -9, -112, -109, -67, -173, 113, 88, 92, 62, 113, -242, -136, -251, 76, -93, -8, -119, -51, 75, -284, -228, 22, -2, -123, 7, 87, -94, 35, -92, 1, 25]
7415B5P5j78J00q0K56k04N4l4nk23J79K64m19J43PJ32j19L8j64J10R5J59l91J31
7439d9L1O7k17J31J86o0j72r6R1P5J15m3r4k53K39LQJ22l0L1k23J66O0lM0l11
7465a86L81l82M0K96j22K8l0J73l95J42J84MK6J87m38N7P0M1O2l33O7J18o6o4
7489a40K67M8j92l68M11j49o6Q0N8J13k73q4J39R1L1J91j47k0m1m9R1k7J43l20
7513b13K54lm7P0J33j80j00L0J20n6L2n4O1R4k20LP6J61j41L4m39K70J66J40j70
7538B1J10q4k73K23M5k0j29K58N2r0R1k37Lj59j28M76l4M3j99j07N02j23l45J60
7562E6O2k05J55j89J38k23L22j38N3j16l0L00j33n65M82j27J29K13k71P4m6q8
7584a47J45j41J67j23K45q6j58J59n2j30o2J24J53j15r1j24J10J7K7K01M6m39
$$ y = [25, 100, -78, 22, -58, 198, -6, 48, 14, 9, -214, -35, 229, -190, -47, -40, 92, -27, 11, -153, -43, 52, 211, -180, -49, -18, 49, -168, -37, 149, 89, -83, -179, -88, -13, 102, 59, -35, -288, -49, -46, -38, 84, 54, 85, -138, 28, 88, 85, 125, -186, 195, -187, -147, 149, 27, 55, 25, 198, -197, -55, 129, 133, 159, 346, -92, -35, 35, 76, 138, -195, -128, -10, -76, -140, 127, 175, -17, -385, 26, -123, -189, -109, -51, 62, -211, -295, -156, -65, -34, 157, 10, -10, -51, -100, -9, -36, 107, -213, 41, 38, -9, 61, 194, 14, -86, -56, 64, 8, 40, -14, 47, 141, -79, -76, 0, 161, 20, 54, -385, -115, 51, 191, 21, 131, 47, -226, -3, 42, 22, -107, 151, 203, 113, 204, -33, -30, -189, -317, 159, 125, 168, -31, -138, 364, 241, -104, 56, 118, -87, 68, -121, 17, -206, 116, -22, 31, -85, -115, 185, 52, -513, -31, -158, -29, 184, -87, -13, -59, -147, -2, -143, 24, -99, 146, 60, -98, 61, 9, -121, -183, -59, 94, -21, -112, -236, -126, -109, -82, 119, 165, -274]
7606b74R0J56Jj67J53j61L34j95J74p2r9jK6n3J25J24k12J6j4L4o7JM4n6j02J78
7632a7N0J21k71N9J69J23k54K06m67Q4J22n2j63K07O2R9j71K11m0k39J16N3K18
7655B26k76M9P8j42n9K00l34K41L09k68p5n9J50j34P9k77K66O6l11J87K01j13
7677DR7oO9r6P2l15J43j0M6O5l33O8M13nk40j84K33j53J3K6M93k94j17J4J3L8
7703E4j92J91j10o7o4P1L34m48K29J31l3k53M53k13j5j0J0J0m0j88R5N0L24k65
7727E4o9j57J59k7O7j47J0J19q2k8N3j85J2J86J06K12j67k22K59j22M5J21k98
7750a01n0J88k00K73k08p1K11j90J9P5K12j06p0J2m9qk13K48J86O8k29r0O9J47
7774A23r4m8k73K68L4j1P6j27NK4J33J5j24rkJ15k42j89L23J54m05J33M12j68
$$ y = [-274, -184, -28, -27, -194, -41, -202, 132, -63, 111, 39, -60, -61, -35, -88, 37, 161, -51, -35, -49, -15, -82, -81, -37, -93, -195, -17, 33, 154, -117, -58, 111, 234, -20, 186, -281, -197, -75, -127, -290, -83, -21, 78, -93, 118, 78, -161, -45, 8, 226, -50, -1, 77, -65, -124, 76, -258, -17, 292, 24, -51, -110, 40, -94, -15, -292, -26, 40, -271, -84, 117, 4, 101, 95, 164, 68, 140, -175, -32, -42, 4, 69, -264, -196, 217, 212, -28, -212, 21, -132, -119, -93, 400, 106, -11, 3, 16, 54, -138, 53, -57, -124, -188, -117, 217, -231, -2, 129, 96, -157, 296, 83, 68, 58, 68, 78, 38, -150, -55, -5, 319, 54, -15, -172, -13, -40, 27, -120, -110, 9, -73, -101, -48, -233, -221, -35, 71, 283, 116, -106, 153, 31, 76, 197, -101, -151, 37, -163, 110, -98, -169, 42, -148, -129, -54, 158, 52, -18, -6, -55, -63, -276, -28, 158, 226, -3, -93, -24, 123, 29, -19, -292, -24, 10, -1, 75, -52, -47, -23, 110, 125, 1, -8, -10, 105, -137, -326, -3, 151, -254, -121, 291, 123]
7798A23j92Q6J7J5o1N1k4N0J7j7l6m7n7J56j17M1k75K44l61L54M6o1Q7m7J07l51
7824b52K68j61j54K54jJ50m7p6R6j56j65K86k31K50j65R5P0j59J30J3j80l2K26
7847E9j32l9j02K66J69l61Q6K24m55l0L11O3k57J37q0J9J02k6K11j78l03L71Q9
7870A44k14J97k79K23J38n8k24J31N0j06j09K27K5l56L16j2k24K23p5n5Q3R4m
7893A35j55J74M5k58J23K3p4j22J97J69m23J80%j87L76j16j66J05j6p2J27r5j38
7916a68M32m85L64q0J77j29j87J03j60K82l37M0K25k47J56L02k99J36K2k85M7
7937i1j10J46j10J49J89n4q2p4J53j89Kr1j08N86k00l8l6j59K93j10N7M0l37J94
7961B0l3Q6O5l53N5J41J98k14L4rm2j78K15O4q4l5K34j63n1O7J80j02k4j09N9
$$ y = [123, -69, 17, 34, 49, -12, 39, 15, 65, 82, 65, 29, -18, -75, 81, -36, 5, -270, -26, -387, -33, 13, -48, 39, -8, 99, -252, 16, -145, -299, -45, -46, 104, 57, -19, 77, -79, -244, 42, -189, 61, -104, -9, 61, -98, 32, 45, -135, -167, 59, -73, -112, -214, 52, 221, -140, -54, 170, -285, -315, -4, 59, -198, -61, -141, -122, -20, -46, 165, -13, -316, 55, 144, -70, 127, -152, 71, 209, 151, -73, 58, 108, 2, -107, 120, 145, -211, 105, 93, -131, 92, 17, -38, 45, 139, 135, -20, 154, 199, -59, 64, 87, 13, -109, 88, 257, -166, 14, 14, -173, 203, 87, -79, 26, 10, -62, 65, -30, -168, 264, -221, 143, 63, 240, 111, -76, 27, -133, 149, -188, -148, 77, -170, -14, 288, -11, 125, 147, -138, -91, -201, -55, -165, -16, 173, 119, 37, -37, 116, -73, -71, -162, -270, 316, 116, 78, 42, -117, 176, 66, 123, 163, -174, 20, -13, 73, 138, -215, -160, -19, 179, -35, -1, -10, -52, -230, -15, 49, -35, -70, 164, 1, -50, 17, 197, 95, 71, -38, 21]
7986B1o0O3j6P7n8m6k8p2J20n9K7m2N2m9L19n11K13k26J09L29k7k73p2K73j66
8011a02K95l6l89K65L2m3k02J83j50j20K37J5j42L27l13K67M5j01m7J45p1k6Q7
8034A56j51k51L56J16j98J89j87J02J08k52J76j88N4O9q4n9N7k1M2k37L66L6k62
8057f3K3o9K5M04k90J67K3l24Q7J72j50K54j85R4k0j93j33J76J9r3J89k0j43n0
8081a00J07J0j74J60p3K93k66O2Q3j97J18K6P5l94J55J45j92J5L60j64m31K46
8103a36K02j81R7j43K51R5j98J10L0k85K60pn2J69j86M1Jj58N5J71k64J8j89M44
8127A45l25O9r1K94n5p2J23j8Q0k34J47j45K04J05j0M0m94J95K0N0K35j41k16
8150i4J38J31qj93J64j15J31j26P0j29K08l29K14j03k5l4J25p9r3J49K4q3L0k18
$$ y = [21, -39, 24, 8, 85, 27, -19, -47, -119, 1, -58, -31, -73, -21, -70, 249, -262, -49, -275, -166, 163, 136, -137, -209, 64, -102, 193, 157, -232, 33, 65, 22, -180, 3, -147, -267, -30, -15, -157, 170, -143, 124, 169, 68, 21, 166, 95, 69, 156, 5, -246, 110, 226, 28, 217, 30, 132, 240, -12, 164, -24, 30, 99, 15, -44, 13, -8, 34, -203, 163, 199, -63, -40, -109, -84, 320, 30, 197, 220, -104, -17, 155, 5, 259, 74, 168, 148, -45, -178, -2, 17, -76, 113, 93, -50, -100, 7, 17, -157, 3, -70, 223, -43, 19, 102, -95, 23, 49, 124, -270, -115, 30, -162, -147, 213, 49, -382, -136, 66, -115, -18, -161, 90, 185, -13, 97, 127, -158, 102, 95, 43, 212, 26, 67, 68, -90, -35, 136, -128, -110, -299, 145, -180, -111, -202, 92, 37, -35, 88, 70, 150, -84, 63, -82, 122, 227, 217, 257, -237, -42, -22, 28, 263, 122, -94, 44, 175, 167, -26, 138, 23, 154, 28, 98, -31, 177, -152, 62, -41, -66, -100, 25, -54, -147, 2, 26, -57, -27, -245]
8174b45N9P2J31j92mM98q8m40L86j31o3J18l31K86j17J32p3
$$ y = [-245, -186, -114, 17, -175, -179, 319, 231, -209, 177, 46, -17, 101, -230, 56, -61, 71, -2]
8191b
$$ Imaginary data points
##PAGE= N=2
##DATA TABLE= (X++(I..I)), XYDATA
0@%%%%%%%%%%%%%%%%%%%%Qj6J6j6J6j6J9k7L2l2L6m4M8n3O1o8P7q6R6j08J20j33
42g0J47j62J80j99K20k44K69k96L26l59L94m35M83n35N94o62P41q35R49j090J269
63F85j503J827k304L066m483P933k9145l4333Q8310j4530m7509N5705J3433o6868
77b9716J9448M1042l0608n569K7983k4986j5467K5746l60j3004J2313m017j6706
90a3901R508J0582r913l516O570r86o263O350J0208r921j2324J3434Q221j1200
104c151O216J0904j8601o286K0015o14q801R759o821j5401J3307O939q866J0000
118H599j085k2752P373J8090j4639o72J7597j7294j4702K5257M405k0131J1070
131A116Q225k2301K625K3355q650j2268J3911q94j4465J1377J0592j4888l013
$$ y = [0, 0, 0, 0, 0, 0, 0, 0, 0, 0, 0, 0, 0, 0, 0, 0, 0, 0, 0, 0, 0, 8, -8, 8, -8, 8, -8, 11, -16, 16, -16, 20, -24, 24, -29, 32, -36, 41, -45, 51, -57, 63, -70, 77, -85, 95, -104, 116, -128, 141, -155, 171, -188, 206, -229, 254, -281, 313, -349, 392, -443, 506, -584, 685, -818, 1009, -1295, 1771, -2712, 5221, -23924, -58257, 30053, 15523, -31986, 23719, 37152, -29716, -10268, 30774, 166, -5403, 22580, -2406, -17873, 7873, 7513, -5491, 6822, 2805, -13901, -4393, 6189, -3724, -7240, -670, -1656, -7919, -1569, 8639, -1282, -13606, -172, 8049, -3151, 3065, 13969, -4632, -10918, 9097, 8483, -318, 9441, 2620, -12781, 526, 7465, -1401, 8599, 7514, -15238, -7865, 10225, -4414, -5086, 12511, -4783, -19485, 5772, 10177, -9954, 1116, 9341, -12960, -10335, 13020, 4370, -7898, 6013, 5119, -9346, 2031, 12623, -2265, -5278]
144e278J1677n722n753J3686j374j6843N790J0927j1263N94J3903j0926j3702
157a4284J5702N909j4014N504Q674j5263l590J7363j228r441P457r2j0098N590
171a811Q368n162k013L165m314n82O779p43l674K138j860l747M894L151n581j163
187b155L603l223k015N809m94o804K352M078m181P52N405m626m153O951R51n578
203c328N364K851q873K168Q985n822l929Q820l353r124Q483N197j0610J319Q534
218F682q874m987J1453j234j0140O154M551r906J577R195n709m780P844r5o501
233d770N305L709n940P73N471l903j672N174j518l754L613J101m764J301K558
248B684l659p00L468k359k798L061M80k766J161J318k742M17L073j416j029K796
$$ y = [-5278, 6399, 677, -5076, 8610, 7236, -9607, -3817, 7110, -4153, -3559, 10344, -582, -14284, 1418, 7327, -6687, -1183, 7491, -7772, -11362, 6001, 4773, -4668, 2789, 2697, -7401, -1811, 6557, 1395, -618, 2547, -1767, -2349, 4430, 3687, 13, 2151, 291, -3456, 1438, 4589, -992, -2155, 1448, -1775, -3790, 2019, 1525, -5279, -2927, 1151, -3030, -2278, 3127, -1499, -5652, 1299, 2250, -3328, 2036, 4887, -3986, -1818, 7167, 1345, -2584, 6236, 2883, -6241, 2242, 7439, -3171, -1852, 6682, -2192, -7179, 4274, 3040, -7100, -946, 3605, -6301, -4724, 4471, -1238, -6018, 1826, 1731, -4770, 535, 4244, -1696, -923, 4548, 645, -1027, 4147, 2629, -1125, 2488, 3589, -1175, 126, 2684, -975, -1675, 1793, -566, -3364, -303, 177, -2589, -1428, -110, -2852, -2435, 638, -778, -1807, 989]
264I89j239j773L471J324l158R79K514l083j3M443k368m006L374P54m292K751
280F67L298n765k114N259j650l024M659P2o556K055N020l232j045N070l200m039
296d525N442K225m410J977K718n169j83O409j772l713L102k13m316K807L833m133
312G9k507L344j496j851M134J30m845LK494j109J166K500k611k710K223P42j5
329c29K351p91l453J234K657q09J224J363l782k028L733J014j977J673m34m608
345b962J423M422k253j838J782k298k969M974K660m561n78K215k916l21O397p08
361B469n539K046K239l082K320N007m594m140M674J146l551L542J947o450o88
376b654N240j052k594L080j689m720K394M632k519j682J714k483j457L905J902
$$ y = [989, -250, -2023, 1448, 2772, -386, 593, 3107, 24, 11, 4454, 2086, -1920, 1454, 2208, -2084, 667, 3965, -1800, -3914, 1345, -305, -3329, 1330, 1402, -5154, -3099, 1921, -1311, -2356, 2714, -486, -4525, 917, 3142, -1268, 709, 3427, -1742, -1925, 4484, 2712, -1001, 2101, 1888, -2428, 379, 4212, 79, -2428, 916, -580, -2431, 1703, 1833, -3012, -3009, -515, -1624, -458, 2042, -569, -3279, -1056, -314, -329, 2022, 1231, -2222, -988, 1669, 860, 2084, 3447, -335, -2363, 1370, 2384, 407, 2080, 1646, -2962, -1539, 2883, 630, -1208, 574, -1724, -4693, 281, 2941, -1620, -2198, 17, -2899, -3220, 3177, 2469, -3070, -1024, 1215, -1867, 453, 5460, 866, -3274, 1400, 2546, -1005, 2537, 4484, -1966, -2654, 2586, 1534, -1060, 2020, 331, -4389, -1995, 2637, 118, -1564, 150, -2333, -3790, 115, 2017]
391B017k569m22M15j250J448L490j245k530L56K81l8K956L56k916o56L92k66J612
409A431J328k988j964J482q5L25K178j448l805J033K135j411J653K097l584k454
425d077M264J674k578K137J029m612Q1N934j228l285L311n56m898K979M683m780
441G8k528M357k026l636N408J567p110R71M096l395l31N637k796n169L859L048
457B030l624K036K989m501k028M790P38k126J669K8l184K50K989m71j053J61r94
474c01j238J112J146o27p56n99K2P5R78k11m34r3l12K25J644j37j220M23R31j120
494d92J234K122k238j951K801M34k869K857J701n717k61N272k451k439M672j474
510A201o446M214L882n396O13N006m658l589O259R80n306L364K890n783M45N910
$$ y = [2017, -552, -974, -559, -1809, -361, 3129, 1884, -646, -290, -9, -47, 2909, 3265, 349, -307, 85, -181, 1431, 2759, -229, -2193, -711, -796, -471, 1707, 259, -3546, -2513, -378, -1789, -136, 1961, -1623, -4077, 187, 1861, -717, 1420, 2449, -2163, -2082, 3852, 2624, -661, 2650, 2094, -2804, 175, 4858, 78, -2450, 1907, -119, -3755, 1653, 3220, -3890, -2919, 1177, -2218, -2549, 3088, 292, -4877, -1018, 2030, -1594, 442, 3431, -1070, -3098, 1692, 2430, 304, 1973, 2001, -1183, -933, 2056, 1585, 532, 693, -301, -1539, -427, 719, 92, -664, -1263, -1241, -1166, -188, -399, -833, -926, -1238, -1013, 631, 494, -726, -303, 628, -492, 742, 2864, 626, -1325, 1476, 1910, -959, 1898, 3599, -2118, -2379, 2893, 442, -1997, 2675, 1201, -5245, -1031, 2851, -2545, -1932, 3074, -1584, -5173, 1086, 2066, -3240, 124, 3014, -2769, -2324, 3586]
526C586k731k774M088M54m150J981K665l382l26K874j375k284K061M37k803P79
542i00K123j369j363J319l62j460J008J497o53o52L06m92K25J218L36j66l07k11
560I7k74R98K63k85Q88n33j585J23J783j218o69K034j172k823K280R78l126J591
578f50K504l195j962M220p40l669M348J658n378J204M345l928j374O598j861n325
594c205M764K071n962K428M722m869k359N297k043l877L943J211m462J329K513
609A501l199n44K862o78j836J573L97j397K23R60N16j86j66P68p40o97J538R53
627A848j068l9M58j189k21J457k54o17q5n92m15L65k94K24N70j328q04K337o08
646b55j760K226L05k824J400K491k584m17L705j929k418M238j81m132K966K167
$$ y = [3586, 855, -1919, 2169, 2623, -1527, 454, 3119, -263, -589, 2285, 910, -1374, 687, 1124, -1679, -900, 1223, -146, -1509, -190, -552, -2012, -1004, 493, -160, -812, -506, -998, -773, 445, 781, 615, 308, 97, -177, 821, 1084, 799, 1687, 1154, -431, -308, 1475, 257, -412, 1622, 450, -2373, -93, 885, -2241, -650, 1854, -1341, -3303, 917, 177, -3492, 856, 2514, -2864, -1660, 2685, -1243, -2617, 3981, 2120, -3205, 1559, 3630, -2332, 96, 4818, -51, -2410, 2887, 844, -3033, 910, 2121, -2341, -1012, 1501, -1698, -2242, 620, -58, -1894, -321, 76, -1321, -1098, -138, 378, 192, 26, 794, 54, -643, 895, 1848, 780, 741, 1199, 10, -211, 1246, 992, 375, 290, -302, -717, -352, -646, -422, 148, -1180, -1984, 353, -255, -2015, 211, 516, -2308, -908, 1583, -1001, -1418, 2287, 358, -2060, 2178, 1997, -2135, 831, 2998]
662B998l874L45L761k879k483L384m1l135K329J181l557r2K851j353j335K461
678E61m98k639J506K071j405k69J786r85j631J884R92j221K36J083j023n48J494
695A394m6j256K27R7n42K32J88q67o5n0k56M99K03p75k70P04m6o1Q15k01r27L10
717f93J139m40N39P64p56j061J428J011j686M24J003j784q79K566m83k009J315
734C98P45l088O68K457j716j710K873r87k212K569R54k535O74K175k148k20K569
751A466m58k024J746O31j678O43J380j110q56J181J63q99K2L84j158k22R22k71
769a38n80J43J2k26N17j24J51j4n23J96N07J03k71M93J72n24J92R47m88n66Q16
790G95Q1r53N45J099j418m95J128l36j261Q52L27j501k2J644r99l60J075k98j682
$$ y = [2998, -876, -531, 3230, 351, -2132, 1252, 1211, -1924, 405, 1586, -1971, -2063, 788, -565, -1900, 561, 63, -2576, -1070, 1001, -404, -673, 1113, 128, -1503, 381, 1373, 152, 388, 1471, 448, -100, 1394, 1348, 92, 319, 416, -126, 106, 294, -573, -638, -688, -944, -445, -242, -1017, -1287, -583, -629, -690, 125, -76, -1003, -693, 446, 6, 545, 1309, 553, -508, 920, 1931, 245, 669, 1672, -112, -991, 1575, 1092, -917, 398, 1143, -1945, -1277, 1180, -536, -2246, 627, -360, -2572, -3, 951, -1584, -910, 1265, -883, -1103, 1466, 1008, -1016, 730, 1361, -317, 326, 1706, 596, -260, 921, 1084, 185, 207, 591, -567, -789, 133, -138, -718, -575, -563, -789, -272, -396, -245, -259, -782, -586, -79, 24, -247, 246, 418, -106, 86, 1033, 545, -21, 795, 876, -77, 468, 1567, 149, -346, 782, 446, -815, 37, 364, -1137, -1159, 485, -514, -874, 201, -97, -1779]
809a779R99J093j064k9J828j142r14J774K77j680R49J085j227k54J395m63j078
826b30P29O65j424J65J035j312k34O92l06n45L77J46r79L03P35n90J13N79l61
845d42L9M33J89j16J48O1j36M65K0k82J91J36n70L72K18p48k69R07p33r07Q69
866a55O67j617J80J148j035n14J615k22j580J099J118j414n0J854o62j321J824
883I35M99j958R38J322j948j78J748l45j781J258N92j771J69J217q70j184J203
900a54K79j572O44J235j147p55J626N7j227Q43J015j084j3R33k2o55O21J15q18
919g9N99M90n29m77N04r1j75o5l45j0J61l42o8M06q17K56P98j005m9R41k7j189
941a113R56O88j187L20J278p34q37J565K23j460N07Q72r23m75J364m75j257P12
$$ y = [-1779, -780, 313, -751, -780, 1048, -94, -1008, 766, 1043, -637, 312, 1397, 170, -84, 1311, 848, -230, 499, 1164, -260, -95, 940, -372, -606, 86, -220, -765, -388, -242, -1221, -918, -183, -773, -660, -81, -442, -403, 30, 219, 103, 251, 312, 176, 641, 661, 379, 570, 706, 136, 508, 726, -22, -291, 616, -117, -1024, -155, 512, -1105, -925, 223, -812, -1326, 289, 67, -1513, -414, 704, -710, -760, 1094, 432, -889, 935, 1434, -524, 414, 1736, -212, -390, 1358, 1013, -768, 490, 1082, -689, -520, 697, -173, -1357, -154, 125, -1447, -803, 432, -715, -1470, 156, 213, -1014, -171, 844, -240, -253, 680, 658, 3, 624, 739, -79, 520, 1010, 481, 4, 508, 417, 242, 177, -168, -178, -17, -359, -427, -21, -838, -582, 216, -789, -838, 103, 76, -1113, -157, 531, -656, -336, 942, 208, -629, 936, 1159, -301, 206, 1078, 155, -320, 1044, 569, -688, 24]
959B4Q30j234n26J493m49j451R11Q91j739N85J408j143j210K266k4j863J392J205
977A366j986J41K017j265q40J593L9j709J051J094j580O0Q49o51m13L7J07k74
995c64j67K93J61m26l37L12p7j21L75P86j017j20P95k24N5P63K40r53N3M56J1
1016D94O2j96L36l93m90K06P08j146l5J128j258o31J435o9j675J522Q82k272J31
1035a261K212j518j172K625j47k265J818Q76k178O48K150j328r31J958p57j607
1051h77J225J124j368l64Q76r00p88R47P14q78n28N92k37o69P50N77l52l28K84
1070b00J09m37R17L87q89K32L50m79J64N43j54k63M63k75l27K12m47J50l8l06
1090b88l20Q33r04k92R92K02j315P13O62j422P9J793q10q67J161N6j124R63J147
$$ y = [24, 854, -380, -906, 587, 138, -1313, -402, 489, -1250, -665, 743, -400, -1610, 656, 632, -1231, 161, 1366, -620, -479, 1538, 273, -567, 1026, 1065, -644, 407, 1501, -79, -19, 830, 179, -234, -197, -90, -364, -531, -238, -77, -503, -840, -528, -605, -726, -351, 435, -582, -702, 93, -131, -76, 687, 927, -26, 27, 483, 494, 556, 360, 696, 303, -187, 19, 727, -419, -454, 674, -584, -1215, 220, 151, -1524, -2, 880, -1392, -1261, 951, -567, -1739, 886, 739, -1526, 292, 1168, -1010, -362, 1788, 460, -471, 1487, 730, -877, 348, 1472, 104, -260, 616, -284, -1072, -125, 589, -289, -817, -225, -462, -1131, -381, 196, -156, -484, -200, -91, -528, 389, 776, -113, 119, 469, -10, 154, 697, 543, 280, 743, 468, 141, 353, -94, 56, 18, -288, -608, 225, -679, -971, 21, 223, -1092, -379, 283, -1139, -1060, 733, -77, -944, 217, 273, -851, 112, 1259]
1109A259j239l3J069n30j092J173N18j384L5J252j152q15J523j35j538O86Q03
1126D00j283m1J355q44n50Q48J40p06Q5J094p72k5Q74k05o53K72N77m07L59J61
1146F79n4o65K91J4J60m73L58k70n79p4M74k8k12J81j02k78k94P85m5m10K13J50
1168a79K29j28J89L89n62L39M39l11m06P37jj001Q28L07r54j49R23o69j145J619
1188D94k12j172N34P23j062NJ303n75r83P67K88o81L80J076j217o0Q18l15l23
1207b12Q29J29n68J6M79l18j81K28k52j93m29M63N9j78r9J01J89p07N13l7l75
1228e43K75J54k95k20O93P3j77J10L64l11j81M16O0p31O24J77j42k85J76P1l00
1249Hj87P46p98n79Q16J94q26J33O12o34l30Q73j73n66O63N59j303P72N93o45
$$ y = [1259, 20, -13, 1056, 526, -566, 607, 1125, -259, -224, 1028, -124, -939, 584, 449, -1089, -403, 400, -883, -924, 431, -413, -963, -115, 25, -681, -596, 498, -274, -299, 575, 370, -283, -11, 566, 159, 518, 679, 625, -40, 251, 265, 425, -48, 310, 40, -539, -613, -139, -167, -379, -198, -300, -578, -872, -87, -132, -542, -329, -179, 50, -78, 111, 500, -62, 277, 716, 405, -1, 736, 735, -266, 562, 869, -85, -234, 689, 20, -1125, 494, 282, -890, -356, 367, -695, -690, 613, 38, -945, -178, 110, -571, -191, 885, -332, -392, 426, 111, -212, 617, 746, 178, 194, 673, 355, 174, 402, 150, -43, -472, -9, 50, -128, -227, -126, 63, -644, -131, -168, -543, -268, -114, -409, -629, 64, 137, -40, 70, 434, 123, -58, 358, 418, -313, 311, 488, 346, 61, 237, 308, 8, -179, 567, -231, -810, 6, 200, -626, -493, 119, -515, -845, 28, -145, -711, -48, 511, -792, -20, 573, -72]
1269g2k33R50k58n66O19J5l83%N05m78j0L33k77k82Q8J53j73q4l08M23k91k64
1291e93L84o1m43L51N94l61k03O02K3n39M21M53l66j82K48J29k80K00M08m35m89
1312a39N6L52o86K45P79q41n29P13J04q75O12K39p59K1R14l49n99O62L31n65R4
1333b20R38o41j83O49l00m85M90M10l97l81O13j09n45K92J15n16o5N20m14l70
1353e99M96k0l72k23P17k65j12L96j13k26K48L89j54r4K87r1k47O0L92K97q54
1374h8K01M60n37QK29l81m95M22K74l50k56M57k80n70P61P9n36Q3P90m99j71Q63
1396D64L8p66J37N72l09k7O95l10o54L61M80q62K68K43j99o89M14K11l85J68M33
1417B83n75l16O68j12n98M45M21q64K00R00p0o89O31J21m69J89M93k16m81K74
$$ y = [-72, -305, 645, 387, -179, 440, 455, 72, 72, 577, 99, 89, 422, 145, -137, -49, 104, -69, -153, -461, -38, -329, -593, -209, -270, -713, -362, 232, -129, -332, 270, 293, -246, 175, 628, 262, 80, 328, 457, 177, 377, 785, 350, -139, -83, 269, -417, -172, 607, -234, -763, -50, 54, -821, -209, 30, -729, -708, 206, -143, -742, -80, 251, -314, -220, 718, 77, -106, 543, 243, -242, 248, 658, 261, -120, 493, 384, -161, 131, 246, -270, -335, 185, -229, -599, -103, -123, -495, -718, -1, -266, -378, 18, -95, -321, -73, 316, 162, 68, 355, 264, 17, 77, 469, 766, -88, 113, 573, 36, 44, 273, -108, -603, -181, 93, -257, -513, -56, -336, -906, -145, -66, -602, -519, 271, -228, -399, 464, 502, -264, -127, 445, 136, 109, 804, 494, -160, 201, 681, -181, 87, 330, 131, -558, -144, 67, -318, -150, 283, -292, -608, 60, -52, -650, -205, 216, -648, -448, 452, 382, -307, 324, 445, -24, 165, 658, 442, -39, 235]
1437B35M85p18J92J27l19l26M16J75l64k13K87k07k18K35Q5l02J3L56j80j13L88
1458C4M19p94j12P27j66l19M50M51p92J36P83l98n00M51O6p18J77N90n12m62L97
1479i2Q7o84K27O26n44k06M86k9m72Q05J83o74r1P02L3p68O02L28m26k58R81l76
1501D40m33L00N4m51L72J93m69l40L52j42j90J28R7l06K24k05K30j69JN78m73
1522b09k37L33N59o04K2N92m12k09P28j84m26J48M22m33n5M96n78k54K57K32j88
1543@j31j0o6l68k2N54k33l6K69Q0l93O0N27j46k17L59j28m51O03J22n18K85O48
1566G88o45l84P12L8o76R6P49r41j43M35J28p95M62K09l58k04N83k2m30J95K10
1587Gm81J12M21l50J86J79J92k45J66M10p9n55N42p2p43M07K36k96k38J68J50
$$ y = [235, 720, 2, 194, 321, 2, -324, 92, 267, -97, -310, -23, -230, -448, -213, -128, -430, -417, -61, -241, -354, 34, 453, -341, -453, 274, 108, -211, 239, 690, -102, 34, 817, 419, -81, 370, 436, -282, -105, 485, -27, -489, -92, -5, -689, -462, 164, -380, -586, -100, -129, -601, 204, 387, -287, -378, 324, 357, -411, 191, 519, 93, -165, 816, 440, 7, 307, 361, -90, 282, 475, 6, -334, 18, -124, -314, -186, -89, -395, -171, -376, -146, -315, -314, 264, -209, -446, -113, 446, -158, -136, 456, 44, -165, 563, 379, -47, 101, 523, 90, 35, 531, -47, -301, -44, 188, 0, -131, -141, -207, -575, -597, -43, -276, -312, -43, 37, -356, -296, 231, 85, -132, 227, 99, -352, 251, 373, -145, 140, 788, 143, -241, 471, 509, -167, -71, 678, -263, -406, 29, 157, -638, -176, 33, -325, -529, 54, 32, -398, -203, 7, -474, -362, 59, -291, -105, 74, 266, 21, 187, 597, 518, -37, 505, 433, -310, 97, 333, 37, -201, -33, 117]
1608A17k12k23j1L30j56j83J55j73K4L67j20l09L52J57k31r1O80m20k19O60n3
1629D41l88k6J90j07j31M99j36p23K61J88p3k49L89M8p41L16L74j10o37O19o2
1650e8l23K33L95n09K83K85m92l2N81Ok03O2J90m01N2q1K41l55J46J36k8j49q4
1673a05J62m59K47J80k35l10J76jK65J1L36k97k38K23J08kJ1n5R3r0K16J38k48
1696A26J44l7k83m15N77j98j09K07P3o44K42N51l37m17J66L96m29K10K79l47k08
1717d53P48k48j27L15j06r5j9M76p0k23K8K48n22J81K24k09j51k9K38l74L27j50
1739Ij04l55J03M04o9k98J73q4J90l37N54j30j21j12K99j38J15L29k59J77K80
1760F26m71j75M23J0l12l83M08k85p8J70J35m92K29q4R7K9m5L46m40k34P07j21
$$ y = [117, -95, -318, -329, 1, -155, -338, -183, -356, -332, 35, -85, -394, -42, 115, -116, -207, 473, 53, -166, 494, 441, 53, 27, 217, 110, -21, 478, 342, -381, -120, 68, -5, -254, 135, 183, -558, -242, 132, 22, -615, 4, -58, -381, -148, 247, -262, 21, 306, -186, -218, 363, 369, 166, 228, 418, 17, 69, -12, 229, -126, 20, 156, 128, -21, -105, 57, -402, -155, 25, -210, -520, -344, -345, -80, -69, 267, -30, -268, -45, 63, 61, 72, 17, 110, 20, 236, 374, 126, 270, 233, -50, -465, 112, -86, -195, 12, 85, -559, -317, 234, -103, -520, -354, 42, -387, -177, 102, -245, -453, 295, 47, -80, 235, 129, 34, 15, 491, 421, 198, 226, 474, -48, 133, 357, 148, -3, -32, 206, -168, 159, 9, -95, -450, -347, 57, -12, -310, -137, -221, -31, -368, 186, 56, -65, -177, 122, -16, 99, 428, 169, 346, 626, 155, -20, 403, 413, 101, -282, 126, -159, -237, -67, 68, -424, -195, -279, -182, -153, -198, 148, -292, -526, 181, 60]
1782F0j06J13Q7l44K61O10p88J28K69j4n01L18N21p06PJ51n9j64J04J45k99j46
1804c53M07j85r5o8J46R6j67Q8J30j60J67K34k76j50L30Q5k36p5L19l38L43RJ39
1827C90n53K62K22k41q6J42k78q3K14j99j87K3L06l28q8N84q3m19K35K19l0R1
1849A13J96l89k17L60L61k58L1M57o25J06q0K45n52J86M37n45P3M47j62n49R5
1870b70L30k97l0N55j68j75j43K27j74r2K15J84l50K07L56j3m84L93jl78K34K15
1892C41k94n7L12m25J15k2J01j5j63N3n0k49L07J63k79j34M48p2l42K4K60j46
1914a24j14M83k89R6K88O8l99Q9K65k45j21L69k86j32l41N93l40k03L14L09l78
1935i8k5l4l4q5J81K00l75J65M78k41j35L20k87n8K66J22m6k94J55M3k23K65j3
$$ y = [60, -46, 67, 154, -190, 71, 681, -107, 21, 290, 276, -225, 93, 614, -92, -85, 66, 7, -157, -53, 92, -207, -353, 54, -131, -226, -294, -148, -52, -219, -131, -1, -161, 6, 240, -36, -186, 144, 229, -7, -82, 237, -101, 242, 251, 390, -163, 99, 321, 80, -6, 136, -142, -225, -11, -210, -397, -374, -68, -396, -484, 100, 17, -402, -167, 52, 22, 113, 309, -80, -297, 63, 424, 166, 197, 654, 29, 135, 55, 300, -252, -66, 371, -174, -101, 346, 184, -365, -270, 60, -237, -267, 288, 120, -55, -198, 29, -145, -237, -22, 162, -188, 19, 375, 362, -122, 271, 270, -108, 126, 341, 47, -10, 302, -123, -8, -30, 71, 56, -107, -54, -104, -353, -46, 117, -162, -296, 152, 80, -262, -238, 22, -124, -238, 245, -44, 52, 340, 408, 9, 98, 363, 118, -3, 366, 80, -52, -393, 200, -140, -343, -29, 280, -98, -123, -157, -191, -276, -95, 105, -270, -105, 373, 132, -3, 317, 30, -28, 238, 360, 314, 20, 175, 218, -5, 260, 247]
1958B47l22k3N88j25m79o3M29n48k0L47l6n05L88K97n03p7M86K2k86L86o8l73
1980b38L44K75k92P4q2P0j56P3O6j76K47n4K0m65M05j41K00k71J69j43k65J75
2002a65L2j4k18K53N39o43J43K99l06j73N32k76l84M39K18l70J41K43l58J00l4
2023bk4K10k79o5K6J12LQk88O5O0k05K89j75L41k58J72j19j07J41J05j78O4J98
2047I4R7q8k26O51k87l05L18j10j69j10K87j32k28M46P1n20r3K55Lk43O9K87l31
2070b64j22J58K94m05L26j27J43j32J64K12p7j36l2l7q8L89k60j04K00P3m74J14
2092a85L50J2o06K53P4k69J78K68l47R3J53Q2q3j11L00l28J10L25r3l39M55p8
2114B14n9P7RN4k91N1P5l22K88r9J08n14J58J37qj03J84j72j37R2N6J19N0L34
$$ y = [247, -75, -98, 490, 365, -114, -177, 252, -296, -316, 31, -5, -510, -122, 175, -328, -405, 81, 103, -183, 203, 135, -238, 106, 381, 89, 163, 81, 151, -5, 68, 134, -42, 205, 151, 171, -294, 111, -30, 170, -101, 68, -75, -340, -165, -133, -147, -365, -112, 427, -216, -73, 226, -80, -253, 279, 3, -381, 58, 276, -94, 47, 290, -68, 32, -2, -26, 184, -95, -160, -134, -22, -19, -11, -299, -234, -174, -379, -90, -265, 76, -182, -10, -129, -236, -95, 10, -168, -104, 94, 191, 103, -123, 528, 241, -64, 254, 144, -25, -135, 152, 20, -208, 238, 309, -211, -304, -49, -46, -289, -220, 67, -264, -386, -228, 66, -339, -13, -140, 3, -129, 35, 247, 170, 34, 2, -35, -123, 266, 6, -98, 102, 175, -299, -185, 165, 177, -429, -176, -102, -371, -193, 75, -272, -179, -26, 56, -27, -138, 162, -166, -56, 269, 176, -163, 292, 214, 155, 232, 241, 295, 4, 55, 130, -192, 96, -3, 105, -409, -251, -114, -122, -225, -41, -213, -350, -258, -202, -83, -33, 301]
2138C01l64L0K3K90j39j93O9J46j8k4j03R3J65p4jk29K58k68ql56K58J00j63K85
2162G8O4j83k08K58r4j91K35j41n3K85l7r3J56L42m02P2K58j8k83j99J81q4%J68
2186A11K58o57K17J27lk55L84p6k55J38J27J9k54q5J72J8l3K77n48J09J82OJ96
2209A75k06Q7P0j34K10R4q9j61j5r5P7J48l03o6K23R3k13n8R9p4j29J91m1J47
2233C0j39n3K60p3P3M8o9m8J71O7k31pJ26l97K82R6O4k79J80j42n7L58o4l72o8
2258b44L72k93o0k22K38J4m23N21j05k2K53J89n50K19L71r1j90PK89k12Q4K8p2
2281A01j66J25J93l74p9J06j88K11N0o0k69M20P8l45J6K41o4oJ86j63J2k37J60
2304e2J40K08l83LJ31k71M87j86q3K62k04j33K22j9k38j77O3J77J36j94N4o0m17
$$ y = [301, -63, -33, -10, 280, 141, -52, 17, 163, 145, 121, 18, 111, 276, 202, 201, -28, 230, -38, -46, -402, -144, -44, -207, 78, 142, -41, -249, 9, -85, -276, -41, -182, -235, 50, 13, -80, 76, 418, 16, 88, 346, 328, 45, -154, 27, -57, -57, 111, 369, -288, -71, 56, 53, -202, 182, 106, -149, -11, 116, 135, -119, -204, -32, -14, -47, 230, -318, -209, -27, -21, 175, -31, 56, 126, -8, 202, 296, 207, 46, 31, -64, 13, 161, -142, -208, 15, 108, -105, -163, -64, -138, -267, -76, -117, 30, -109, -162, 98, 25, 98, 146, 77, 29, 200, 267, 36, 29, 155, -242, 40, 136, 200, -79, 101, -41, -98, 260, 196, -176, -244, 128, -165, -225, -447, -209, -195, -618, -97, -202, -224, 29, 218, -332, -113, 258, 167, -23, -16, 273, 61, 145, 173, 101, -65, 60, 253, -121, -200, -94, -282, -71, -21, -81, -350, 70, 148, -197, -181, 60, -4, -10, 176, 13, 25, -212, -52, 88, 296, -87, -84, 47, -224, 263, 77, -6, 256, 52, -81, 141, 122, -116, -293, -230, -53, 83, -111, -57, -117, -534]
2327e34N32q1k16L31J2j56K7J09Q6j97J81K05l62L4L47km08J30J27m6l71K11K55
2350B14l68J40Q7j79J9L07k58j21L53l22P6R5J56j64m2K44j67p5N9J9j64J40J51
2373B00j2l10K79J94l45K6Nj27J98K8k25J11q8R6j58lj03L95k01J55k30J68j81
2396a28K86M7j82J4J65m7j82K6J10j6j58J64J30j03o0j68P4l7J66j20k3M5P4l14
2420b37r4L83p9q2j08J15j71J72J6R6k03J81K17k69j83M13k05j90N08j92j82K15
2442A21K06k53R9k52K34k69J02p8k0l9O6p5k03M05k19J26j62L16k56J35PL2l3
2465a0l7J85k48J28K37K8n25K41Q7J79o1k68M84m26p9kJ69k67J11K28k21J26J70
2488B29j79j72J47k2k81P0J59K9J95J95m07J70k9j34l3K89j60n8K8p3J52m10K35
$$ y = [-534, -2, -83, -299, 32, 44, -112, -85, 24, 110, -87, 94, 299, -63, -29, 318, 316, -92, 38, 165, 119, -252, -41, 214, -154, -14, 73, -106, -87, 220, -38, -159, 194, -128, -52, 43, 199, 35, -7, 237, 70, -5, 54, 73, -91, 49, 200, 188, -122, 157, 351, 6, 32, 37, -90, 108, 136, -89, 22, -66, 30, -128, -131, -234, 161, -40, 115, -115, 53, -128, 158, 205, 23, 37, 202, 155, -27, -1, 109, 93, -65, 99, 229, 126, 66, -102, -28, -65, 101, -19, -42, 3, 77, -237, -331, 52, -27, -109, -217, -102, -273, -101, -85, 11, -192, -11, 206, -63, -246, 167, -38, -228, 280, 88, -94, 121, 327, 74, 173, -79, 155, -114, -12, -90, -110, -149, -83, -158, -361, 44, -175, -49, -211, 105, -151, -16, -9, 23, -10, -47, 138, -110, 18, 255, 283, -242, -1, 86, 265, 204, -64, 420, -6, -85, -87, 82, -185, -74, 154, -67, 59, 229, 50, -122, 25, 3, -278, -208, -49, -20, 175, 370, -37, 133, 104, -30, -63, 226, 66, 8, 36, -37, 115, -295, -60]
2511f0J07j33o0L16l10j92P7K91m28L06J7q5R8r4J47j28M9J21Nk32K60M1J31l24
2535h0K97j10j23N2J34l37L12mJ9j75M1J73k53j04K44j66O6k54K17j07M1L48j55
2558G6l49K83j1K5M0n0j14q6N37m4k93j34oj80L38K28j96j18o4O9J52l75K19o3
2582a16k38L04J18k57K05J32L8k76K0q1J07K72k07jRj44o7J82j52K86j7k00O5
2605a8P8J42j58j6l3N4j76J53j00j1J9j28J26j88L09Mk37J52o4Q1q4J4K80j25
2629G4J10j36O9Q4j05Q8j04j09k15P5J51J69j66k14J18K3o3j2J15r0PJ12l8l4
2653i1q0r9J48L84k15r7L10p8k12J32J19j28n5P7j20J75l4Pj39j33J37r2L6k91
2677c39R8K40k14M19m26K2L53l72K58k54J70K6n2K5L57j40k65K09KJ10l53J12
$$ y = [-60, 47, -86, -146, 170, -140, -332, -255, 36, -392, -86, -69, -154, -56, -150, -3, -131, -82, 39, 44, -188, 72, 113, 244, -80, 217, 107, -16, 36, 170, -167, 145, 141, 160, -15, 26, 199, -54, -158, 86, -80, -14, -268, -51, -158, -117, 231, 76, -273, 10, -1, 24, 64, 14, -100, -186, 351, 307, 14, -120, -126, -306, 32, 260, 64, -54, -118, -49, 103, -272, -53, -116, -354, -50, 68, -189, 16, 148, 186, -90, -70, -151, -44, 228, 21, 20, 29, -115, -182, 0, -152, 134, 117, -83, -18, 60, 202, 44, 28, -5, 49, -127, 26, -74, -85, -66, -194, -68, -256, 53, 57, -180, -28, -92, -11, -95, -81, 199, 74, 184, 48, 117, 201, 96, 184, 80, -29, -244, -169, -18, 151, -15, -229, -111, -88, -151, -163, -48, -138, -131, -19, -57, -91, -171, -270, -122, 262, 47, -50, 260, 182, -30, 102, 221, 93, 38, 115, -5, 170, 136, 143, 4, -129, 8, -84, -48, -339, -241, -1, -215, 204, -222, -200, 153, -219, 39, -215, -45, -19, -71, -46, 311, 171, -94, 115, 117, 227, -126, -14]
2699a4J84k87R4P5n7k15M51k08j49J17mrk09J76J50j55P8q4K62l29M7K6m5J08
2723CK93j14k71O0Q3n2Q0J53j94m4pJ11J47k15K06k34M8j96R8P3j01MJ5RJ95l53
2749b03l2J46P8R3J91j37m70L14K69l27L6q1L69k64Q1K85n14K10%j97K61l6k31
2772a59J99k9rN5j59M7P6j05l08J13J92j45K54J5j82J87J2J94l46l0J74k9k54
2795b37J08K77k37K64j58K6l00J72Q4J44j69K32m03J21J58r4j78K38k7O2l21K78
2817D0o3L5Oq5k8j92L02j48J41q3K80j85k8q6j05J84p2M6o9q8L04j98j6J58k0
2842C0l83J79K09J25l77K30k2r9L0J11l3j26K62k31K10Nj31J72Kl2j43m1O1R7
2866A05l19l6K64j72J53J10J94l20j19L51k83J12J1P8k72J25J26n2Q1j91M5q3
$$ y = [-14, 170, -117, -23, 52, -5, -220, 231, 23, -126, -9, -13, -22, -231, -55, 95, -60, 18, -66, 196, -133, -86, -60, -105, 3, 296, 182, -89, -29, 54, 2, 82, 235, 41, -3, -10, 101, 248, 33, 239, 5, 53, -143, -45, 28, -73, -69, -54, -45, 150, -203, -235, -89, -11, 82, 273, 136, -334, -20, 249, -78, -42, -123, 246, -18, 63, 348, -166, 44, 44, -153, 108, 72, -159, 40, 11, 2, 57, -102, -55, 21, -84, -392, -279, -87, -232, 22, 37, -145, 42, 54, 248, -98, -128, 46, 17, -237, -129, 148, -89, 175, 17, 43, -257, -85, -1, 143, -26, 206, -197, -76, 82, -12, -190, 48, 21, 83, -238, 40, -23, 12, 18, -67, -95, -287, 15, -133, 8, -75, 205, 20, -8, -94, -199, -15, -87, -41, -110, -198, 106, -92, -108, 50, 30, -353, -174, 35, 160, -217, 13, -9, -108, -78, 33, 0, -126, 136, -95, 115, 120, -11, 161, 163, 131, -12, -53, 8, 105, -214, -250, 14, -158, -5, 105, 299, -21, -140, 211, -72, 40, 51, 129, -143, -18, 108, 56, 137, -54, -9, -92]
2888i2L32m57J83m0oK24q1j82K73j20r4K09k07J55l32L7l1J67K7N6O3k22K69j26
2912EL92m16j1j72M03j19j56K43j81R2p1j2k26J82K14j12l8r4J08j3K8m8k8J49
2936A19j31R9K8N9l14K32j79J93k74J75K42k42Kk02P6pJ29j51l6J70O0j72L54
2959B30j23J19N6j73j48p3J69M7l85K86r2K3p4L06j91K6m9j03m8J03R6k91L84
2982I5p2o5L4k06L80j52J44L1j36k62K92p6j95K40pP0k60J09J01n5j5M0J1n7J81
3007A70j38m4Q8n9K07l13J30p5m5k29L47r8O2q5J04j9P7n49N64j65O8oJ62l11
3031a57M7P6m8P1mk48J68l7m1K27l8M9l61L40k50M3K58j24L23k34J1k17Q8J33
3055G5l4j52j34J33R0J22P4k21P4j52K10j30n6J5J9n2n0R7N3n7J33j45J11J53
$$ y = [-92, 240, -217, -34, -74, -80, 144, 63, -119, 154, 34, -60, 149, -58, 97, -235, -198, -229, -62, -35, 21, 84, -138, 131, 5, 397, -19, -30, -202, 201, 82, -74, 169, -12, 80, 9, -3, -229, -47, 167, 55, 17, -77, 31, 18, 46, -2, -30, 119, -12, 87, 115, 174, -140, 92, -87, 106, -168, 7, 249, 7, 9, -193, -117, -124, 5, -146, -182, -12, 48, -124, 230, 107, 226, 282, 109, -39, -112, 57, 104, -281, 5, -87, -64, -138, 168, -23, 3, -46, -149, -197, -94, 2, -289, 95, 23, -42, -8, -214, 166, 14, 158, 189, 53, -209, 83, 7, -188, 52, 45, 115, -145, -36, 65, 10, -5, 35, 46, -11, 170, 32, -12, 76, 17, 224, -89, 41, -34, -79, -308, 39, -59, 3, -82, 22, 3, 80, -469, 95, -70, -2, -8, 154, -157, -110, -34, -82, -11, -15, -263, -95, -132, -173, 54, 16, 65, -296, 44, -206, -163, 95, -29, 294, 60, 71, -146, -58, 75, 41, -111, -245, -112, -22, 100, 174, -47, 27, -125, 85, -45, -101, -86, -67, -119, -169, -72, -19, -76, 57, -88, 23, 176]
3079A76k49k58J66N5M7J31k26J61J14k68M07l02J16l00K83n8k28L35k50J86o9
3100c1nj32J02Q7j2j33J66O6m09J72J2J25K03j31Q0j25j8j24K58k15K68k88M1
3123d3J80j23j3l8L8L2j53J21q3K15l79L2L00q4k14J02j6j11K18o8J44r1J42%
3147A08R2l18J41N3jj00qj42M38j86j48K31kj93j95J56J99o5r3R2K59l58N9kj24
3172a07Q4Jj95J46M0J35k05K90k04J90k06K8J67k11kK4kp6K08k60J27J24j05n
3196a4mj13K35l82K56p1J49o6j97L19K0j35K3J69k15L00j11m23K05Q2j08O4j80
3219a97K47j51P9J88J08l01J64k45J04J18k81q2K2J43k2J7J88j29j35L26l54K77
3241H4J7k86Q5K3K14qp9J00m4n1J3Kj50K80k65K48j26K33k76k3J6L3l4K30m44
$$ y = [176, -73, -331, -165, -110, -63, 68, -158, 3, 117, -151, 256, -46, 70, -230, 53, -5, -233, 102, -148, 38, -31, -36, -168, -66, 21, 9, -124, 42, 108, -301, -129, -117, 8, 211, 80, 160, 35, 17, -107, 151, -64, 204, -84, -43, 137, 14, 1, -37, 1, 33, -120, 1, -82, 133, -246, -214, 86, 2, -212, -110, -126, -237, -19, -87, 57, -34, 108, 108, 200, -118, 23, 76, 75, -25, -33, -175, 263, 77, -71, 160, 158, -35, -230, -74, 125, 60, -33, 59, 318, -40, 19, 17, -107, -23, -22, -217, -71, -31, 104, -101, 189, -15, 175, -31, -3, 164, -47, -49, -25, -27, -103, 105, -155, -28, 96, -9, -14, -18, -131, 104, -278, -22, -93, 56, -10, -207, 112, 132, -3, 20, 189, -26, 274, 163, -260, -55, 27, -81, -17, -197, 50, -101, -22, 166, 274, -27, 137, -108, -4, 114, -167, -249, -227, -84, -106, -89, 99, -30, -165, 161, -193, 84, 101, -185, -100, -77, 137, 129, 50, 150, 106, 55, 68, 70, -80, 200, -65, 183, 57, 290, 14, -9, 7, 40, 6, 236, -208]
3266b08J63N2k41J76K54k82LJ95r9k29n7M44r5K51m27K37j54J08j41P6R1j79J50
3289H8j23j23J66P3l1n4pK7j55K72j66j0J89k14j90J50R3j2r6L09j6r4k4O1l10
3314a97K01L03k17j27NJ24j27J87j06l8k45K48q9j62L71k67p0L45r2J28j45k62
3336b32N1O5L3j4J95l6j04K34j81k6P4n7J11k14nM3J60k26N5L7J26j42K32n12
3360c33K13P6j5L8J12j5n0K41o38K48j10LJ80q0j7L33K8j94N0J86o58L60Q3k39
3384a98R1r5L64l9k38O2K1j25o4L60l34K92j50K77k4k81J21j81K08m3J04k64M
3407a32K12p5n4K60m28J56J00k04J41J41l83L43j43J9J3oN0P1OJ14l15M8J9k52
3431b99L44k68L78k57K20L1j86L04l09K38j83L78n38Q5m8K11j28j06K18k24m8
$$ y = [-208, -45, 7, -234, -58, 196, -86, -83, 112, 13, -216, -273, 171, 76, 327, -100, 137, -17, 91, -50, 26, 117, -62, 88, -35, -158, 8, 81, 50, -4, -11, 16, -139, 133, -33, -43, 146, -68, -258, -108, -15, -27, -123, 186, 170, 76, 52, 113, -197, 4, 307, 90, -37, -32, 92, -35, 152, 46, 8, -237, 11, -78, -240, 131, -136, -206, 139, 47, 175, 30, -232, -181, -116, -83, -97, 98, 62, -42, 192, 11, -15, 59, 2, 113, -101, -106, -63, 97, -129, -74, -37, 89, -53, 179, -333, -120, -44, -59, -21, 91, 76, 26, 267, -371, -123, -233, -230, -50, -130, -147, 186, 214, 20, 70, 256, -402, -42, 41, -198, -107, -202, 162, 123, -115, -53, -32, -157, -221, 139, -195, 97, -53, 224, 200, -81, 40, -141, 67, 24, 128, -136, -132, 80, 5, -49, 211, -217, -61, 39, -165, -24, 117, -266, 77, -66, -47, -34, -40, 10, 81, 87, 201, -114, -66, -47, -299, 45, -223, 155, -102, 118, 149, -37, 267, -42, 196, 13, 391, -147, -62, -110, 101, -27, -133, 85, -139, -187]
3452a87L10j47p0M40l99J0l8k49J05M7J56k6nJ11k91p7K82J08k97L51q0j02J13
3475F5O5l14J57J69j00j11J22p0J59l45K73j64Q5K5J43K2j18k19pM50j80N3m14
3498b54J09m7j63L66P3r5N8p2j54J67j44J21p9Mk6L30l55p7K46m6j40J47R8j97
3522a30K31j75N5o6r6nJ92k02P9j03J08L06k53J41M7j19j85K21l03M79k13M4J50
3545B03l56K20j07k87N41k51K19k53J57k02K61j64j79K82j19o3l0M86l14k40K97
3566A01k50Q0M95m36J25p3j37J50j62K35k13P1j62o7J99K01j31k14J98L8L3n9
3588B2r2j20j9P5J43j41P8j99k5K38j99M06j40k92L15O7k26n0K93k0j51O9k85
3611b53L65J10p5O3k80J90k73OK30L3k87q9L65k75j6N18k88J0j28J45j36o9J37
$$ y = [-187, 123, -24, -94, 346, -53, -43, -81, -330, -225, -178, -22, -48, -53, 58, -233, -310, -28, 80, -217, 134, 54, -48, 65, 130, -184, -27, 142, 42, -69, 53, -17, 142, -203, 70, -94, -9, 16, 159, 181, 63, -156, -163, 287, 107, 160, -254, -145, -192, -355, 11, 84, -11, 47, -25, -179, -12, -156, -35, -114, -110, -136, 194, -161, -238, 8, -38, -178, -31, 67, -130, 101, -74, -19, -85, -181, -186, 6, -196, -117, -220, -112, 194, -59, 82, 129, 10, -175, 46, -257, 222, 9, 53, 203, -153, 67, -40, -327, 214, -37, 182, -71, 86, -116, 145, -19, -198, 84, -35, -98, -128, 358, 44, -196, 101, -149, -69, 426, -10, 115, 42, -95, 55, -107, 128, -85, -14, -176, -243, -44, 157, 26, -188, 10, 48, 81, 22, -70, -190, -209, -134, 9, -132, -54, -253, -278, -40, -239, 167, 27, -265, 50, 117, -109, -159, 134, 114, -37, 32, -253, 112, 222, 147, 210, -70, 120, -153, -147, 83, 116, -171, -260, 105, -170, -186, 332, 44, 54, -74, 71, -65, -134, 3]
3634Ck8K2J95J21m47L42k42Q7P5k11L76ml95J88k80J1J46P4pJ5l7O9r6m9J82k18
3660a08j68K14j11J83J18j52q9N9K6J64k13j25K05l22K35Q9L03k9l49J57j97l8
3682a48o7J52K79l63M5o4K24J7J11J9l56L89q7l0O5j58j9N8m1Nl9J07k45K60p0
3707D4J4Jj29NJ5k31L56j38J71J39l27L6M9J63k72J53n9O7l91M99O6n20K53Q8
3731E2r7q1J08LMO5j11m0P9O8j48o1K42j86QL81l72Q1J57q5k94L86j52Q6L4pk47
3758a27%K46j33NL12k39m4ok55L36M9k81J68L5k50M24m2k72k2Q2n5R7o9o4O9R7
3784F1k51J19M7O5k4J58j42k45K96m5k1n3J53j40P0j11K43m5l27L12j18QK6j72
3808a36K8Q4J17L5J05l54J5M33l51K00l33K8J55K1j36N8K05l51K79O0j49q7P2
$$ y = [3, -25, -3, 192, 313, -134, 208, -34, 53, 128, -83, 293, 289, -106, 82, -198, -187, -41, 33, 26, 41, 4, 73, -23, -72, 110, -108, -276, -62, -173, 10, 128, -24, -113, -54, -28, 136, -77, -202, 3, -319, -84, 5, 308, 279, -70, 87, -110, -148, -215, -63, 216, -147, -102, -166, 58, 75, 186, 205, -151, 238, 151, 121, 186, 28, 9, 67, 26, 31, -8, 99, -146, 114, 44, 58, 59, -70, -65, -50, -281, 75, -63, 108, 247, -80, -44, 5, 168, -104, 49, -10, 57, -334, 165, 231, -289, -36, 52, -45, -126, -18, -15, -11, 54, -57, -97, -18, 50, -98, -159, 83, -103, -95, 286, -86, -5, 152, 67, -227, 159, 7, 93, 127, 120, -127, -127, 119, -14, -9, 303, 64, 20, 14, -241, 95, 144, -137, 31, 66, -184, 240, 198, -74, -96, -14, -69, 28, -41, -105, -36, 61, -190, -71, -24, 41, 17, 175, 33, -212, 84, 39, 18, -35, 118, -22, 48, -63, 180, 135, -192, 120, 2, 10, 36, -136, -108, -24, 93, 128, 233, -121, -106, 327, -24, 176, -157, -129, 26, 47, -89, -31, 174, -177, 102, 162, 13, -74, -2]
3831bl1qO9K69j05k99J50k5J79r9j28k00kL31l57L41j82O1j40P1J30j37K49k38
3855a03j08K79N9R6l30R8j05N6o0J09L5j11J22J06j87M9J32q5P0j66Nj16Q2Q8
3879A5J11l16J95L1k78J90J49k9l70K99M9j19J52k35M45k72L1J0q0L5k7K50j61
3902G5k16Q1n8N8j9m9O7J39k6m5j75J65J54j2l03J02J38k37L6J07J02o3J30Q6
3926B37k11R6K17l02k30l4M44j68J68k80K18j46j17M0j44J63L50k42j89m6K57
3947H1j17k04L27j05j2O8l9M4O6k5L1l5J05n7k34O4j18K95j47J32J85k45l6M4
3971F8j74K44j01o5o9J02L0k25J57m1J25j58K56l55O3k0K06R8j10L45l30J32n5
3994A23l68N03j45j49R7J62O1o1o53N38k01J52m3j05J09j74J73q7N7J58k87L74
$$ y = [-2, -33, -41, 28, 297, 192, -107, 43, 18, 197, 98, -30, -230, -232, 99, -258, 83, -99, -38, -178, -107, 23, -114, 135, -103, -211, 68, 127, 223, -107, -9, -114, -58, -118, -9, 26, -85, 37, 143, -44, 5, 137, 52, 122, -44, -39, -155, -73, 15, 126, -190, 5, 36, -242, -52, 97, 68, -302, -3, 46, -73, 79, -156, 289, 17, 48, 58, -22, 13, -14, 236, 75, -141, -60, -118, -60, -79, -128, -61, 78, 52, 7, -168, -3, 151, 139, -164, -62, 76, -161, -125, -18, 84, 21, 151, 237, 26, 122, 339, 37, -193, -227, 217, 49, 217, -63, 155, 9, -108, -68, -212, -49, 301, 59, -130, -176, 81, -36, -240, 87, -18, -30, 38, -1, 43, 109, 84, 115, 80, 185, 128, -106, -42, -160, 135, -12, 120, 305, 60, 24, 68, -106, 138, 37, -28, -97, 5, 35, -190, -33, -74, 51, -107, 149, -206, -143, -163, 43, 141, 31, 376, 46, 178, 123, -245, 258, 113, -36, 61, 223, 284, 223, -430, 108, -93, 59, 16, -89, 20, -154, 19, -68, -11, 147, -140, 234]
4016B34l30L14l19R7O2K9j02k3nN9J40k07J66p2J53m66K55j61N35j62j24k99K66
4039D0l9n5nK80n7l60LK2J90j29J49O4l3j00J6k3lN1j89Q8J66q7J2jO5l59J47
$$ y = [234, -96, 218, -101, -4, 58, 87, -15, -38, -43, 16, 156, -51, 115, 43, 196, -270, -15, -176, 359, 197, 73, -226, 40, 1, -54, -59, 221, 164, -196, -193, -171, 19, -110, 39, 103, 70, -30, -14, -37, -40, 11, -178, -90, 76, -11, 1, 0, 65, -294, -147]
$$ [...]
8191a09
##END NTUPLES=NMR FID
##END=
