##TITLE=1H_2PM1003
 CDCl3, 8 sc, 
 12.3.2019
##JCAMPDX= 6.0         $$ Bruker NMR JCAMP-DX V2.0
##DATA TYPE= NMR FID
##DATA CLASS= NTUPLES
##ORIGIN= UXNMR, Bruker Analytische Messtechnik GmbH
##OWNER= root
$$ XWIN-NMR		Version 3.5
$$ Tue Mar 12 14:33:39 2019 Russian Standard Time (UT+4h)  she@DPX200
##.OBSERVE FREQUENCY= 200.1316
##.OBSERVE NUCLEUS= ^1H
##.DELAY= (6, 6)
##.ACQUISITION MODE= SIMULTANEOUS
##.ACQUISITION SCHEME= undefined
##.AVERAGES= 8
##.DIGITISER RES= 18
##SPECTROMETER/DATA SYSTEM= spect
##.PULSE SEQUENCE= zg30
##.SOLVENT NAME= CDCl3
##.SHIFT REFERENCE= (INTERNAL, CDCl3, 0, 15.7039)
##AUDIT TRAIL= $$ (NUMBER, WHEN, WHO, WHERE, WHAT)
$$ ##TITLE= Audit trail, XWIN-NMR		Version 3.5
$$ ##JCAMPDX= 5.01
$$ ##ORIGIN= Bruker BioSpin GmbH
$$ ##OWNER= she
$$ F:/spectra/data/she/nmr/H-F/1/audita.txt
$$ ##AUDIT TRAIL=  $$ (NUMBER, WHEN, WHO, WHERE, WHAT)
(   1,<2019-03-12 14:31:57.46 +0400>,<she>,<DPX200>,
      <created by zg, POWCHK disabled, PULCHK disabled
       configuration hash MD5:
       00 E9 B6 7A A2 85 ED C7 34 08 36 98 17 FE 4E 26
       data hash MD5: 16K
       77 03 0D 29 09 B9 54 A0 66 92 CA D2 64 E2 CB FB>)
$$ ##END=
$$ 
$$ hash MD5
$$ 5F 74 44 C7 7A 5B D8 42 09 9F 1F DF 84 70 B7 BD
##$RELAX= 
##$RELAX= 
##$RELAX= 
##$RELAX= 
##$RELAX= 
##$RELAX= 
$$ Bruker specific parameters
$$ --------------------------
##$DU= <F:/spectra>
##$EXPNO= 1
##$NAME= <H-F>
##$PROCNO= 1
##$TYPE= <nmr>
##$USER= <she>
##$AMP= (0..31)
100 100 100 100 100 100 100 100 100 100 100 100 100 100 100 100 100 100 
100 100 100 100 100 100 100 100 100 100 100 100 100 100 
##$AQSEQ= 0
##$AQ_mod= 1
##$AUNM= <au_zg>
##$AUTOPOS= <>
##$BF1= 200.13
##$BF2= 200.13
##$BF3= 200.13
##$BF4= 200.13
##$BF5= 200.13
##$BF6= 200.13
##$BF7= 200.13
##$BF8= 200.13
##$BYTORDA= 1
##$CFDGTYP= 0
##$CFRGTYP= 5
##$CHEMSTR= <none>
##$CNST= (0..31)
1 1 145 1 1 1 1 1 1 1 1 1 1 1 1 1 1 1 1 1 1 1 1 1 1 1 1 1 1 1 1 1 
##$CPDPRG= <>
##$CPDPRG1= <>
##$CPDPRG2= <>
##$CPDPRG3= <>
##$CPDPRG4= <mlev>
##$CPDPRG5= <mlev>
##$CPDPRG6= <mlev>
##$CPDPRG7= <mlev>
##$CPDPRG8= <mlev>
##$CPDPRGB= <>
##$CPDPRGT= <>
##$D= (0..31)
0 1.2 0 0 0 0 0 0 0 0 0 0.03 0 0 0 0 0 0 0 0 0 0 0 0 0 0 0 0 0 0 0 0 
##$DATE= 1552386716
##$DBL= (0..7)
120 120 120 120 120 120 120 120 
##$DBP= (0..7)
150 150 150 150 150 150 150 150 
##$DBP07= 0
##$DBPNAM0= <>
##$DBPNAM1= <>
##$DBPNAM2= <>
##$DBPNAM3= <>
##$DBPNAM4= <>
##$DBPNAM5= <>
##$DBPNAM6= <>
##$DBPNAM7= <>
##$DBPOAL= (0..7)
0.5 0.5 0.5 0.5 0.5 0.5 0.5 0.5 
##$DBPOFFS= (0..7)
0 0 0 0 0 0 0 0 
##$DE= 6
##$DECBNUC= <off>
##$DECIM= 24
##$DECNUC= <off>
##$DECSTAT= 4
##$DIGMOD= 1
##$DIGTYP= 9
##$DL= (0..7)
0 120 120 120 120 120 120 120 
##$DP= (0..7)
150 150 150 150 150 150 150 150 
##$DP07= 0
##$DPNAME0= <>
##$DPNAME1= <>
##$DPNAME2= <>
##$DPNAME3= <>
##$DPNAME4= <>
##$DPNAME5= <>
##$DPNAME6= <>
##$DPNAME7= <>
##$DPOAL= (0..7)
0.5 0.5 0.5 0.5 0.5 0.5 0.5 0.5 
##$DPOFFS= (0..7)
0 0 0 0 0 0 0 0 
##$DQDMODE= 0
##$DR= 18
##$DS= 0
##$DSLIST= <SSSSSSSSSSSSSSS>
##$DSPFIRM= 0
$$ [...]
##$SUBNAM2= <"">
##$SUBNAM3= <"">
##$SUBNAM4= <"">
##$SUBNAM5= <"">
##$SUBNAM6= <"">
##$SUBNAM7= <"">
##$SUBNAM8= <"">
##$SUBNAM9= <"">
##$SW= 24.9336934301222
##$SWIBOX= (0..15)
0 0 2 0 0 0 0 0 0 0 0 0 0 0 0 0 
##$SW_h= 4990.01996007984
##$TD= 16384
##$TD0= 1
##$TE= 0
##$TE2= 300
##$TE3= 300
##$TEG= 300
##$TL= (0..7)
0 120 120 120 120 120 120 120 
##$TP= (0..7)
150 150 150 150 150 150 150 150 
##$TP07= 0
##$TPNAME0= <>
##$TPNAME1= <>
##$TPNAME2= <>
##$TPNAME3= <>
##$TPNAME4= <>
##$TPNAME5= <>
##$TPNAME6= <>
##$TPNAME7= <>
##$TPOAL= (0..7)
0.5 0.5 0.5 0.5 0.5 0.5 0.5 0.5 
##$TPOFFS= (0..7)
0 0 0 0 0 0 0 0 
##$TUNHIN= 0
##$TUNHOUT= 0
##$TUNXOUT= 0
##$USERA1= <user>
##$USERA2= <user>
##$USERA3= <user>
##$USERA4= <user>
##$USERA5= <user>
##$V9= 5
##$VALIST= <valist>
##$VCLIST= <CCCCCCCCCCCCCCC>
##$VD= 0
##$VDLIST= <DDDDDDDDDDDDDDD>
##$VPLIST= <PPPPPPPPPPPPPPP>
##$VTLIST= <TTTTTTTTTTTTTTT>
##$WBST= 1024
##$WBSW= 4
##$XGAIN= (0..3)
0 0 0 0 
##$XL= 0
##$YL= 0
##$YMAX_a= 40055
##$YMIN_a= -46927
##$ZGOPTNS= <>
##$ZL1= 120
##$ZL2= 120
##$ZL3= 120
##$ZL4= 120
##$ABSF1= 10
##$ABSF2= 0
##$ABSG= 5
##$ABSL= 3
##$ALPHA= 0
##$AQORDER= 0
##$ASSFAC= 0
##$ASSFACI= 0
##$ASSFACX= 0
##$ASSWID= 0
##$AUNMP= <proc_1d>
##$AZFE= 0.1
##$AZFW= 0.1
##$BCFW= 1
##$BC_mod= 2
##$BYTORDP= 1
##$COROFFS= 0
##$CY= 11.3945322036743
##$DATMOD= 1
##$DC= 2
##$DFILT= <>
##$DTYPP= 0
##$F1P= 18.9103706918063
##$F2P= -1.10871071338519
##$FCOR= 0.5
##$FTSIZE= 0
##$FT_mod= 4
##$GAMMA= 1
##$GB= 0.15
##$INTBC= 1
##$INTSCL= 1
##$ISEN= 128
##$LB= 0.24
##$LEV0= 0
##$LPBIN= 0
##$MAXI= 10000
##$MC2= 0
##$MEAN= 0
##$ME_mod= 0
##$MI= 1.114404
##$NCOEF= 0
##$NC_proc= 0
##$NLEV= 6
##$NOISF1= 3.799351
##$NOISF2= 2.8
##$NSP= 1
##$NTH_PI= 0
##$NZP= 0
##$OFFSET= 15.70392
##$PC= 1
##$PHC0= -8923.606
##$PHC1= 2.000254
##$PH_mod= 1
##$PKNL= yes
##$PPARMOD= 0
##$PSCAL= 0
##$PSIGN= 0
##$REVERSE= no
##$SF= 200.130013532006
##$SI= 16384
##$SIGF1= 3
##$SIGF2= 2
##$SINO= 400
##$SIOLD= 16384
##$SREGLST= <1H.CDCl3>
##$SSB= 0
##$STSI= 0
##$STSR= 0
##$SW_p= 3612.71676300578
##$SYMM= 0
##$S_DEV= 0
##$TDeff= 0
##$TDoff= 0
##$TI= <>
##$TILT= no
##$TM1= 0
##$TM2= 0
##$TOPLEV= 0
##$USERP1= <user>
##$USERP2= <user>
##$USERP3= <user>
##$USERP4= <user>
##$USERP5= <user>
##$WDW= 1
##$XDIM= 8192
##$YMAX_p= 0
##$YMIN_p= 0
$$ End of Bruker specific parameters
$$ ---------------------------------
##NTUPLES= NMR FID
##VAR_NAME=  TIME,          FID/REAL,        FID/IMAG
##SYMBOL=    X,             R,               I
##VAR_TYPE=  INDEPENDENT,   DEPENDENT,       DEPENDENT
##VAR_FORM=  AFFN,          ASDF,            ASDF
##VAR_DIM=   8192,          8192,            8192
##UNITS=     SECONDS,       ARBITRARY UNITS, ARBITRARY UNITS
##FACTOR=    0.0002004,     1,               1
##FIRST=     0,             0,               0
##LAST=      1.6414764,     0,               0
##MIN=       0,             -46927,          0
##MAX=       1.6414764,     40055,           0
$$ Real data points
##PAGE= N=1
##DATA TABLE= (X++(R..R)), XYDATA
0 0 0 0 0 0 0 0 0 0 0 0 0 0 0 0 0 0 0 0 0 0 0 7 -8 8 -8 8 -8 8 -8 10 -14 16 -16 16 -20 24 -24 26 -29 32 -36 40 -44
43 -44 50 -53 60 -68 76 -85 95 -110 126 -149 178 -218 275 -368 533 -879 1904 -10601 -46927
62 -46927 -5570 24264 -2204 -3587 20965 -3211 -33527 -313 32361 4798 -17438 -1252
74 -1252 -181 -11028 9449 23180 -5960 -23050 -642 8904 -2605 3891 11462 -6998 -14118
87 -14118 7207 11819 -7089 -7872 5202 2202 -2974 4686 3407 -8652 -5997 6286 5993 -1039
101 -1039 -3139 -3968 -1042 7301 6405 -5191 -8788 -3075 673 6463 11771 647 -15104 -8917 6928
116 6928 7882 3573 2559 -7240 -13760 3111 17562 3687 -10481 -4587 -2145 -4566 9311 17466
130 17466 -5074 -20929 -2652 11374 1807 373 6669 -5810 -14952 4635 16975 -1239 -11897
143 -11897 -146 2087 -4189 5254 11232 -5516 -13655 2450 9497 -1277 -2510 3427 -2618 -5807
157 -5807 5638 7733 -5972 -8042 3561 4725 -1527 1252 2729 -5639 -5809 6164 7825 -3671
171 -3671 -6912 191 2520 868 2796 1499 -5857 -6306 3370 8124 2050 -3783 -3694 -2522 -111 5143
187 5143 5564 -2736 -7995 -1789 5522 4280 206 -1468 -3759 -4203 2358 7715 2236 -5547 -4388 376
203 376 1516 2476 3243 -1539 -6048 -1356 5213 3053 -2104 -2037 -786 -1340 833 3747 921 -3702 -2449
220 -2449 1685 2189 411 -396 -924 -1073 593 2123 754 -1794 -1873 473 1903 836 -731 -980 -740
237 -740 -282 1368 2185 -551 -3198 -993 2290 1407 -571 -385 -1004 -2059 671 3476 527 -2952 -1035
254 -1035 1057 -142 584 2408 -591 -3695 -178 3302 586 -1466 510 -24 -2067 677 3156 -404
270 -404 -2712 536 1359 -1391 -98 2475 -592 -3083 716 2636 -1020 -1675 1500 609 -2041 37
286 37 1986 -631 -1554 1113 834 -1584 -177 1813 -246 -1517 790 1157 -1118 -593 1493 389 -1357
303 -1357 -225 847 -7 -163 406 -317 -727 391 698 -227 -225 131 -538 -432 845 624 -869 -736 359
322 359 271 32 447 -95 -1059 -218 1166 589 -577 -366 -29 -170 371 890 -74 -1075 -371 674 712 325
342 325 -260 -986 -650 763 1174 54 -838 -719 -247 492 1040 269 -1080 -1028 199 845 760 244 -894
361 -894 -1489 -67 1654 1043 -708 -1029 -266 167 618 990 75 -1314 -963 754 1381 410 -695 -1054
379 -1054 -559 584 1259 470 -848 -1053 -132 755 806 85 -840 -993 -28 1039 979 -179 -1169 -976 289
398 289 1261 818 -483 -1110 -491 474 957 588 -438 -1205 -602 840 1390 356 -931 -1152 -307 727
416 727 1109 374 -869 -1222 -152 1053 921 -188 -964 -775 57 903 970 -29 -1196 -1076 261 1182 712
435 712 -416 -961 -548 398 984 576 -507 -1046 -439 658 1056 423 -610 -1076 -411 705 1083 304 -732
454 -732 -904 -96 826 825 -76 -851 -773 19 783 835 49 -906 -932 110 997 671 -309 -830 -501 270 760 492
476 492 -353 -899 -481 491 958 451 -451 -852 -375 455 802 335 -494 -844 -228 677 817 23 -735 -667 -54
497 -54 565 767 238 -682 -942 -65 814 605 -165 -592 -523 22 716 725 -198 -948 -492 430 711 409 -97 -652
519 -652 -680 197 943 487 -520 -737 -113 491 660 285 -507 -903 -257 683 794 132 -529 -715 -283 529
539 529 875 129 -833 -742 171 734 494 -81 -642 -758 7 917 796 -233 -795 -481 147 596 606 -55 -832
560 -832 -586 497 896 184 -499 -549 -267 222 812 525 -579 -936 -41 658 399 -53 -297 -598 -296 749
580 749 981 -264 -1146 -416 541 603 345 41 -651 -884 253 1251 537 -687 -797 -183 328 809 726 -481
600 -481 -1367 -415 973 893 -12 -400 -606 -657 286 1259 514 -1025 -1004 162 631 418 246 -353 -973 -301
620 -301 915 771 -281 -538 -160 -71 215 687 169 -806 -482 610 614 -140 -266 -117 -196 152 692 190 -801
641 -801 -544 469 601 10 -191 -294 -542 -55 923 739 -661 -1169 -112 748 533 151 -155 -771 -764 549
661 549 1397 291 -983 -676 51 195 653 951 -351 -1599 -357 1321 690 -451 -87 -113 -962 -82
679 -82 1527 548 -1315 -633 606 -60 -270 904 316 -1354 -464 1255 241 -927 328 765 -771
696 -771 -574 1038 314 -1016 174 1062 -508 -889 719 495 -767 212 1060 -737 -1351 814 1290 -615
714 -615 -672 595 -240 -1080 603 1459 -414 -1349 -27 468 -46 366 611 -602 -1133 97 923 422 -97
733 -97 -253 -476 -320 300 682 457 -284 -849 -313 670 527 -174 22 88 -726 -453 997 721 -747 -422
753 -422 506 -404 -709 997 1026 -1117 -980 875 276 -879 588 1233 -929 -1348 831 921 -621 95
771 95 870 -830 -1158 1062 1130 -827 -386 821 -556 -1092 1132 1344 -1117 -1066 851 200 -913 565
789 565 1104 -961 -1166 840 620 -825 82 948 -637 -1117 730 907 -693 -366 829 -93 -991 297
807 297 1010 -177 -517 307 30 -645 187 967 68 -747 -225 175 -70 186 590 18 -843 -535 437 680
827 680 176 -290 -454 -413 -4 609 610 -174 -737 -412 156 417 538 240 -618 -833 195 889 261 -347 -142
848 -142 -178 -364 279 834 39 -813 -280 347 91 9 316 -105 -640 -40 576 -16 -511 110 417 -239 -361
869 -361 296 227 -381 -54 573 65 -715 -151 679 318 -254 18 7 -547 -77 1008 536 -853 -690 349
889 349 227 -71 566 340 -1063 -875 874 987 -348 -445 12 -588 -379 1092 855 -982 -945 462 257
908 257 -268 644 577 -1093 -922 1005 894 -579 -300 377 -411 -450 899 607 -863 -462 651 15 -495
927 -495 476 406 -835 -342 907 191 -862 -26 618 -178 -287 417 -23 -664 135 722 -83 -470 81 43
947 43 -200 405 576 -378 -679 120 462 194 152 -116 -562 -221 516 383 -95 -140 -310 -410 292 776 1
968 1 -658 -220 101 -21 335 439 -465 -767 263 595 -117 -141 235 -314 -508 505 709 -388 -561 279
988 279 212 -207 277 355 -531 -423 598 383 -477 -137 331 -221 -269 518 295 -629 -326 478 183 -206 115
1009 115 -13 -465 26 629 20 -538 -8 222 -198 42 522 -43 -671 -33 573 95 -204 69 -47 -307
1029 -307 153 459 -69 -379 -19 138 -75 75 187 -196 -332 97 277 -16 -136 -43 -85 0 214 87 -207
1050 -207 -102 100 54 14 115 -47 -223 36 283 98 -116 -58 -25 -25 166 242 -108 -291 12 207 47 -17 39
1073 39 -105 -199 82 256 44 -179 -126 -12 68 146 61 -164 -150 53 106 26 28 -14 -148 -55 149 145 -51 -92 -37 11
1099 11 94 108 -25 -145 -24 106 59 -34 3 -8 -79 -28 124 78 -102 -111 42 104 13 -26 -9 -35 -26 81 78 -26 -79
1126 -79 3 60 12 19 42 -28 -55 47 102 14 -67 -25 37 39 37 -8 -67 -41 55 42 -29 2 2 -82 -32 115 62 -104 -76 33
1156 33 37 1 51 8 -107 -29 103 31 -67 19 21 -65 -15 149 75 -115 -55 86 60 -8 13 3 -39 -15 49 22 -1 19 -19
1185 -19 -34 46 57 -36 -55 5 22 -7 32 21 -76 -13 59 12 -52 33 35 -60 -36 86 35 -75 -7 49 -7 -25 47 2 -59 21
1215 21 64 -53 -50 74 21 -94 -4 79 -37 -69 57 34 -71 -11 68 -48 -53 109 50 -136 -43 151 33 -117 28
1240 28 133 -59 -93 111 124 -54 -43 65 22 -37 62 57 -39 -43 45 25 -37 6 55 -18 -100 -2 66 22 -64 -24 41 -17 -56
1269 -56 47 77 -16 -91 8 34 -45 36 94 -47 -137 48 130 -37 -16 103 -35 -177 52 223 -33 -138 64 34
1293 34 -155 49 238 -69 -254 28 162 -85 -54 199 -9 -267 16 245 -3 -125 76 26 -160 32 209
1314 209 -22 -141 85 78 -144 -28 229 52 -167 -14 108 -45 -84 90 111 -50 -132 -58 49 77 37 -27 -71
1337 -71 -108 -54 118 196 -13 -174 -77 -10 3 212 251 -188 -368 71 299 1 16 189 -170 -396 184 531 -23
1360 -23 -282 66 7 -265 188 515 -142 -508 93 263 -182 -8 373 -121 -525 129 437 -171 -194 316 18
1381 18 -437 98 470 -163 -321 334 232 -432 -143 462 93 -311 96 225 -287 -219 375 272 -241 -169 39
1402 39 -103 -4 339 154 -328 -326 81 211 124 65 -77 -260 -204 150 401 174 -284 -334 24 208 138 168 65
1425 65 -344 -321 311 448 -74 -199 62 -102 -224 340 455 -295 -498 186 274 -214 -15 298 -214 -413 236
1446 236 337 -297 -183 314 -33 -338 197 337 -361 -250 495 196 -513 -80 435 -63 -256 324 178 -518
1466 -518 -179 565 197 -365 -28 128 -282 -88 563 200 -576 -352 301 207 -21 131 -6 -416 -214 401
1486 401 421 -88 -278 -157 -61 129 363 217 -303 -418 37 365 183 -38 -54 -135 -237 70 454 145 -376
1507 -376 -252 159 79 -60 149 64 -350 -203 296 134 -267 -19 229 -158 -248 223 176 -302 -53 395 -7
1528 -7 -428 48 342 -107 -113 307 -20 -532 21 642 81 -439 -5 147 -284 -15 598 156 -664 -318 355
1549 355 229 -46 116 -44 -479 -149 491 305 -223 -162 -43 -170 53 502 204 -454 -313 246 206 -40 100
1570 100 117 -270 -253 240 316 -99 -213 27 30 -83 79 136 -112 -186 77 122 -97 -111 108 84 -90 -24 76 -53
1594 -53 -107 125 192 -54 -177 0 79 17 98 148 -119 -259 67 316 72 -146 -37 -9 -118 54 309 44 -312
1617 -312 -148 157 79 3 102 -53 -293 -32 306 89 -208 -42 77 -141 -62 286 121 -310 -145 222 88
1638 88 -120 40 85 -151 -89 222 79 -183 -6 136 -94 -100 166 74 -211 -51 220 18 -203 4 135 -63
1660 -63 -79 94 15 -131 31 137 -21 -59 66 22 -79 68 160 -24 -116 36 102 5 7 51 -55 -66 53 77 -20
1685 -20 -34 11 -25 -37 44 52 -51 -76 -33 27 21 -10 -41 -25 14 1 -28 14 46 -23 -66 34 55 -20 -17 41 -9 -18 31 26 -28 1
1717 1 81 -15 -83 48 95 -41 -66 55 35 -94 -13 98 0 -83 1 58 -23 13 54 -29 -72 45 72 -35 -33 42 14 -37
1745 -37 32 78 -28 -53 19 29 -4 10 1 -63 -43 76 59 -59 -53 27 6 -29 32 36 -54 -44 30 25 8 3 -23 -52 8 86 22
1776 22 -67 -27 49 22 3 23 8 -51 -18 61 76 -5 -31 -37 21 65 52 -21 -76 -13 45 20 25 8 -48 -70 4 85 38 -50 -74
1807 -74 -30 7 54 30 -46 -73 -7 36 25 15 -10 -59 -44 45 75 0 -55 -34 -6 24 50 14 -59 -41 43 48 -9 -12 -35 -47 14
1838 14 53 25 -41 -41 -5 21 52 53 -46 -91 11 95 38 -22 -16 -22 -18 42 97 19 -64 -44 17 47 81 19 -63 -68 47 79 -12 -27
1870 -27 5 -41 -36 53 59 -26 -57 -29 30 31 19 -22 -66 -15 60 28 -34 -36 -6 -9 26 66 11 -66 -56 26 80 55 -13 -49 -41 37 74
1903 74 39 -20 -56 -38 17 78 58 -26 -41 -47 -12 73 87 -35 -110 -24 71 45 20 24 -45 -51 30 94 25 -46 -26 -16 -16 45 62 -41
1935 -41 -94 16 56 -14 -22 13 -34 -50 33 67 -45 -84 13 15 -21 41 21 -87 -64 67 73 -36 -46 22 1 -1 67 56 -57
1964 -57 -53 22 60 55 46 -12 -62 -8 60 57 6 -35 -45 -10 51 66 -6 -28 -35 -28 28 92 17 -94 -48 45 25 -3 38 -21 -97 0 100
1997 100 9 -72 14 14 -53 11 117 -14 -139 13 111 -37 -63 54 -1 -107 24 141 -42 -131 29 65 -61 4
2021 4 119 -60 -152 59 164 -30 -85 45 14 -83 59 124 -56 -130 24 88 -12 40 65 -73 -110 75 123 -19
2045 -19 -64 -8 -5 -32 64 73 -34 -91 -29 21 32 23 -19 -57 -29 14 26 31 -7 -67 -24 74 22 -40 13 32 -46 -31 96 27 -91
2076 -91 4 112 -14 -66 71 41 -82 30 142 -42 -150 63 130 -69 -45 116 -20 -180 49 197 -37 -147
2098 -147 38 32 -107 58 179 -67 -186 53 119 -55 4 120 -51 -204 57 203 -29 -126 24 21 -100 34
2120 34 154 -15 -151 -15 72 -23 7 64 -33 -124 -10 90 17 -41 -9 -2 -44 -18 46 61 -14 -32 8 19 -12 26 74 23
2148 23 -71 6 69 23 -11 83 43 -94 -52 117 78 -52 -14 39 -65 -78 133 101 -94 -77 51 -18 -63 76 98 -121
2174 -121 -121 91 76 -76 22 111 -67 -144 77 142 -39 -51 73 -20 -113 44 146 -25 -87 19 13 -90 10 159
2198 159 29 -144 -49 86 26 -2 66 31 -125 -94 103 125 -16 -38 4 -58 -39 135 144 -77 -138 35 65 -7 58 105
2224 105 -87 -180 59 168 -15 -75 39 -29 -114 45 159 -65 -167 37 75 -76 -23 119 -19 -163 30 142
2246 142 -60 -103 81 74 -81 -14 73 -40 -63 118 97 -99 -90 54 51 -17 51 60 -105 -108 85 157 15 -78 -80 -51 26 110
2274 110 96 -52 -134 -39 86 126 47 -42 -90 -78 40 172 110 -100 -137 15 109 56 49 2 -136 -102 133 170 -54 -105
2300 -105 -25 -23 -13 117 87 -176 -163 104 131 -57 -31 37 -105 -78 143 131 -137 -137 64 71 -13 77 21 -182 -56 210
2326 210 129 -117 -74 39 -13 42 150 40 -185 -97 125 142 25 -19 -85 -118 51 206 54 -159 -122 -3 62 100
2350 100 83 -67 -171 -55 135 142 18 -102 -132 -14 134 120 -13 -119 -111 15 142 121 -36 -138 -74 32 93
2373 93 97 -23 -172 -114 112 140 0 -82 -74 -57 44 155 49 -137 -128 54 97 66 39 -54 -156 -18 202 113 -107
2398 -107 -114 -15 34 104 119 -29 -179 -55 133 117 10 -49 -108 -110 95 206 16 -173 -114 25 94 82 27 -94 -153
2423 -153 0 153 89 -28 -119 -103 14 136 117 -62 -159 -65 62 107 53 -49 -127 -69 81 125 42 -75 -120 -48 92
2448 92 128 5 -109 -103 13 100 96 7 -105 -86 36 114 69 -20 -97 -67 48 130 77 -64 -116 -34 66 98 52 -67 -110
2475 -110 -15 95 92 -1 -77 -96 -25 78 101 -16 -130 -88 25 93 47 -27 -84 -75 24 109 38 -58 -93 -31 28 92 61 -53
2503 -53 -97 -34 83 87 1 -72 -65 -1 70 84 17 -58 -73 17 89 68 9 -57 -68 28 86 56 -16 -62 -22 32 78 61 -30 -54 -19
2534 -19 46 71 25 -33 -69 -16 54 69 11 -64 -44 10 33 28 3 -47 -58 7 57 42 -29 -52 -37 4 58 16 -38 -57 2 41 42
2565 42 16 -21 -28 -10 24 36 5 -22 -34 3 38 55 2 -33 -7 38 40 32 19 -19 -15 21 33 33 3 -23 -21 11 39 19 -30 -31 14 10
2599 10 0 7 1 -29 -20 24 9 -24 -15 -26 -19 11 26 -3 -34 -10 19 20 -8 1 16 -14 -2 38 22 -13 -4 22 5 3 21 15 -17 2 28
2634 28 16 -16 7 22 9 -3 9 26 2 0 21 17 3 4 8 0 -1 24 6 -9 11 17 5 -21 -5 15 7 -11 1 -1 -11 0 1 -1 -3 -9 5
2671 5 -1 12 -1 -8 -1 -10 23 4 2 2 3 6 8 15 26 -1 4 24 21 11 15 -5 -5 5 29 31 -3 -14 6 17 11 14 21 4 -18 20 26 6 -3 0 3 7
2713 7 9 15 2 -27 -12 12 14 0 15 11 -15 -2 30 5 -23 -18 8 15 -1 -11 -10 -29 -7 24 10 -14 -10 -1 -2 9 22 -11 -36 -15 26 30
2749 30 -2 -11 -10 -12 3 50 38 -3 -12 10 29 40 40 17 -25 -13 37 48 15 -13 -4 -1 3 21 16 -5 -39 -4 25 21 -4 -8 -27 -27 19 41
2785 41 -3 -48 -14 13 21 1 11 -9 -33 2 37 12 -29 -18 11 12 16 19 0 -39 -22 57 39 -17 -39 -9 6 10 57 12 -56 -42 50
2818 50 63 24 -7 -27 -46 -8 91 56 -52 -50 3 36 31 61 -2 -76 -65 50 92 23 -33 -22 -16 -7 58 50 -38 -67 2 36 7 2
2850 2 -2 -36 -41 25 69 -21 -75 -7 44 9 9 19 -28 -46 40 79 0 -71 -7 34 14 40 49 -45 -90 13 121 57 -51 -19 -11 -8
2882 -8 53 106 11 -109 -49 59 66 18 11 -45 -96 17 117 43 -77 -49 10 10 42 75 -2 -117 -46 94 48 -34 -19 -26 -51
2911 -51 19 80 30 -91 -63 38 33 -15 0 -6 -59 -10 64 55 -60 -69 23 53 13 14 2 -56 -43 65 83 -31 -72 9 28 14
2941 14 50 49 -65 -79 57 122 18 -58 -19 -8 -11 70 86 -50 -107 15 77 8 19 14 -62 -73 60 127 -10 -77 -14 18
2969 18 -8 38 55 -65 -87 19 79 11 -43 -6 -26 -33 66 82 -30 -82 -11 50 23 1 12 -36 -41 32 63 5 -42 -33 21 23 18
3000 18 13 -16 -39 0 64 35 -21 -27 19 23 17 49 2 -49 -34 60 58 -19 -27 -12 -4 8 49 42 -60 -65 35 44 -21 -8 0 -55 -36 44 58
3035 58 -44 -46 0 6 -9 40 21 -66 -24 51 44 -23 -7 21 -20 -4 56 45 -40 -27 42 36 1 13 -13 -22 0 15 29 -21 4 14
3067 14 0 5 26 6 -28 -6 16 20 -8 -15 2 24 13 -2 3 1 -10 9 26 7 -26 -20 3 1 -5 9 -10 -28 -1 24 -6 -40 -19 4
3101 4 -9 -11 11 0 -45 -3 17 -17 -13 19 8 -25 3 31 5 -18 12 30 5 -4 13 12 8 18 19 1 -14 13 3 8 16 4 -24 -9 6
3136 6 9 -4 -35 2 7 4 7 -2 -7 -29 2 12 4 -9 -24 -18 8 17 -4 -12 -33 1 15 21 -8 -20 -2 -1 -5 -4 7 -23 -30 4 12 7 -17 -16 -11 5
3176 5 26 16 -6 -15 7 18 19 17 10 -13 11 29 35 10 -13 -16 -2 23 31 -12 -21 -14 15 12 6 -10 -12 -25 1 24 12 -15 -33 -12 4 24 -10
3213 -10 -25 -19 -1 4 -4 -3 -10 -12 -5 7 13 -9 -26 -30 14 26 15 -10 -32 -2 12 17 11 -2 -28 -9 17 14 5 -7 -9 -11 32 35 20 -27 -15 21
3251 21 21 17 10 -17 -13 21 31 25 0 -16 -17 5 22 25 -23 -31 -7 5 4 -12 -14 -25 -10 8 7 0 -8 -28 -1 7 32 3 -9 -1 17 24 0 -2 -6
3290 -6 -13 -14 20 16 2 -22 -5 24 19 20 -6 -8 2 7 24 2 -5 -5 13 19 8 6 -3 -8 0 24 21 -6 -20 -2 18 3 10 -1 -6 8 9 15 -9 -9 -8
3331 -8 -23 2 5 9 -23 -26 3 8 -5 -3 -4 -20 -13 9 2 -9 -3 0 -3 3 20 9 -25 -5 14 18 -7 3 -2 7 2 2 17 3 -5 9 15 6 4 7 6 7 18
3374 18 17 18 -1 4 -1 5 -1 11 -6 -12 -4 14 0 -4 -9 -4 -11 -4 11 -4 -23 11 7 -17 -16 6 11 -23 -27 10 -11 -25 -13 10 -10 -10 -3 7 -14 -17
3414 -17 23 -6 -16 7 17 -17 -2 21 7 -5 -5 3 -9 1 2 14 2 4 10 12 -25 0 26 -14 -9 9 3 -3 8 1 18 0 6 14 -9 -4 -2
3451 -2 -3 -14 -18 -10 2 -3 -4 6 -11 -5 -14 6 0 -12 -12 -6 -1 -19 5 2 -11 -8 8 15 -9 1 20 9 -1 10 19 -4 8 25 28 -2 16 21 10
3490 10 -4 4 14 -3 -8 10 11 -17 12 13 -7 -10 12 13 -11 -8 2 1 -19 2 30 -13 -28 -5 11 -9 11 16 4 -14 0 2 -7 -1 3 0 -8 -2
3528 -2 21 -2 -16 4 -2 3 -5 10 10 -16 -4 6 5 7 0 4 -12 9 26 21 8 7 10 3 8 9 25 8 -8 1 20 15 -2 5 7 -10 -9 14 5 1 -6 -3
3570 -3 -5 -13 0 23 -4 -16 -11 1 -31 -30 6 -8 -14 -12 -11 -6 -4 17 -6 -25 -5 17 13 -19 9 21 -17 -7 19 9 -15 -3 10 -4 -10 10
3606 10 21 -14 -11 24 19 -15 12 18 1 2 34 30 -14 -4 23 13 -24 11 18 -8 -19 8 7 -21 6 14 -13 -23 8 17 -10 -24 -6 -3 -9 -4
3642 -4 15 -6 -19 -7 21 -2 -3 -4 -1 -7 7 14 -4 -6 10 8 -7 11 17 1 -9 8 28 12 -5 15 20 1 8 22 10 2 10 23 14 7 -6 5
3680 5 5 3 18 20 -13 -16 22 20 5 0 3 -5 -4 -1 38 -18 -31 -1 5 -4 1 10 -28 -36 11 14 -15 -15 -2 -8 -14 0 20 -20 -38 2 7 -1 11 7 -27 -16
3722 -16 24 33 -5 -10 13 19 -3 20 22 -13 -21 23 26 6 -3 23 -7 -7 26 33 -24 -29 0 7 13 8 -5 -28 -21 17 29 -10 -26 -17 2 9 12 -1 -31
3761 -31 -32 13 22 11 -13 -28 -33 -1 23 18 2 -40 -25 20 28 22 -16 -11 -1 12 26 2 -4 -10 16 24 30 10 -24 -25 -15 31 31 -3 -23 -1 14
3798 14 29 26 3 -26 -16 23 31 27 -11 -20 -2 25 32 27 -35 -46 -4 23 6 12 -15 -18 -12 33 28 -11 -36 -33 2 13 13 -2 -49 -34 24 22 13
3835 13 -21 -12 -12 0 48 28 -14 -37 -11 45 42 13 -9 -28 8 42 43 7 -20 -3 17 34 35 6 -16 -18 19 48 19 5 -23 -23 19 25
3869 25 11 -17 -26 -19 25 17 -2 -21 -16 -3 23 34 11 -35 -39 7 45 12 -11 -36 -29 1 31 18 -20 -37 -19 14 26 27 -12 -56 -12 26
3903 26 34 3 -27 -15 4 29 22 5 -23 -26 -3 41 33 -2 -19 -5 12 43 32 -11 -17 -12 13 23 7 -20 -24 -23 14 23 13 -11 -28 -7 27
3938 27 37 -4 -26 -27 -5 23 32 -7 -30 -22 -5 16 14 -3 -40 -15 7 11 17 -12 -24 -18 26 32 6 -17 -8 6 15 17 19 -12 -35 -3 40 33 5
3975 5 -11 -8 0 31 21 -3 -14 3 21 20 22 14 -16 -5 12 23 7 -19 -11 -6 15 22 6 -22 -20 -5 8 5 -8 -23 -8 -12 15 25 -7 -21
4011 -21 -15 11 9 18 3 -12 -10 0 20 13 2 -10 7 13 7 10 0 -10 0 29 18 -9 0 5 10 3 3 12 -2 -14 11 8 7 4 10 -11 -7 7 7 -13
4051 -13 -9 13 -2 -2 6 -1 -16 -2 -2 9 -10 -5 -3 -8 -4 1 -5 -14 -10 8 6 -8 3 7 5 -5 -1 16 -2 -18 -1 18 -1 5 18 -6 -2 -5 7 2 8
4092 8 17 8 -16 11 15 10 10 -5 9 0 4 23 22 -13 -12 4 7 -13 12 4 -14 -10 16 0 -9 -1 4 6 -3 9 12 -17 -21 4 1 1 -2 0 -11 -7 2 3 -28 -24
4136 -24 -1 1 -8 -4 14 -11 -8 15 23 -14 -5 5 16 17 19 17 6 1 27 25 13 -9 13 14 15 16 21 -3 -11 3 9 10 7 -5 -9 3 10 22 -6 -16 -5
4177 -5 -4 -6 0 12 -1 -7 -5 14 9 -16 -17 -1 -9 -13 0 -2 -33 -20 14 -5 -8 -2 5 -12 5 5 -2 -24 -16 15 11 1 8 0 -16 -7 19 15 -10 -5 11 1
4219 1 16 7 6 -10 -7 18 30 -3 9 0 -16 3 31 9 -4 -21 0 4 6 -4 -10 -23 -7 7 1 -16 -12 -9 -10 -6 2 -4 -28 -30 3 18 3 -14
4257 -14 2 -7 10 12 14 -8 11 2 4 11 14 19 7 -10 20 31 -5 -8 2 21 21 21 19 6 -9 7 15 8 7 -1 -1 0 4 8 1 -14 -8 3 5 -7 0 -3 -10
4300 -10 -6 -2 2 -12 -4 6 3 3 5 -13 -6 -19 2 10 -4 -6 -4 1 -2 17 13 -21 -2 1 10 4 9 -11 -3 10 12 -1 -2 -17 3 11 0 8 5 -6 5 12 22
4343 22 1 -1 10 19 7 10 13 7 -8 -1 14 3 -3 8 2 -7 2 22 -1 -12 3 -4 6 8 8 -12 -14 -2 13 4 -1 -14 -2 -5 8 8 1 -9 0 22
4383 22 10 1 -9 5 -4 8 15 11 -11 -8 15 -2 9 -3 1 -4 0 10 10 1 3 -1 12 3 -4 4 -2 -3 12 12 -3 5 -7 -5 11 -3 -7 -7 -15 -2 16 7
4425 7 -14 -6 5 -15 0 19 7 -9 -27 3 3 -4 -2 -9 -10 -2 9 -1 -14 1 -7 -4 1 10 1 -4 -6 11 18 6 -2 10 0 9 1 18 -2 13 5 2 15
4466 15 -6 6 -7 -9 21 22 -4 -15 -1 9 -8 6 -3 -11 -4 2 14 7 -11 1 -8 15 6 -5 -8 -10 -15 2 0 -6 -4 1 -4 4 1 -8 -1 -9 -7 -3 2 -4 2 -4
4510 -4 -5 -1 7 -11 5 6 3 10 12 5 13 8 8 6 -1 -5 -5 10 12 8 5 5 -19 1 6 6 1 -8 -4 -21 9 -1 -5 -14 -5 0 -1 -14 -8 -9 -4 -1 -12 -4 -2 7 -8 -8 -3 -3
4560 -3 1 -18 0 -3 -8 -7 -8 -5 -11 -3 1 10 -9 12 4 4 17 6 2 -4 10 5 -1 -4 3 4 6 1 6 -5 -8 14 18 7 9 -4 -11 -10 1 8 -5 -9 2 -9 -4 -8
4606 -8 -7 -13 -5 -7 -15 -8 8 -4 -17 -3 2 -2 -1 6 -7 8 -3 -2 -3 -7 -12 -4 -6 9 8 8 -4 4 5 18 -6 5 -1 1 1 10 6 19 1 7 10 10 11 -14 10
4651 10 8 11 2 5 8 -13 -13 7 -1 6 -9 0 8 -3 9 9 -21 -12 5 2 -18 -3 -7 -14 -9 -1 10 6 -10 -10 -1 5 1 -12 2 -2 19 -2 3 7 4 -11 14
4694 14 6 -7 1 12 20 6 18 1 -3 2 16 16 1 4 2 11 17 18 12 -3 9 12 11 2 4 3 7 -7 14 10 -15 5 -5 20 18 3 2 -8 -10 9 -5
4735 -5 -5 -12 -6 11 4 7 -7 -8 -4 13 27 22 -6 1 -3 6 17 19 8 3 -7 16 17 0 7 5 11 18 13 17 -9 -7 22 16 26 5 13 -5 12 15 23 -9 1
4778 1 5 5 -3 6 6 6 2 9 10 -9 -5 -2 -1 1 13 7 -19 -28 14 9 -10 -4 -4 -10 8 4 10 -13 -15 13 9 8 7 4 -14 -7 33 37 5 -16 4 9 7 0 14 -11
4824 -11 -15 12 21 16 -7 3 3 -10 18 19 -7 -6 2 8 6 -2 8 6 -17 1 15 -4 -17 3 16 2 -2 5 3 -12 1 12 -1 -35 -9 -7 -5 10
4862 10 22 -4 -20 -3 9 17 -10 -1 9 -8 14 12 4 -13 -3 20 14 -3 23 15 -4 6 28 17 1 9 11 10 9 15 9 1 1 21 17 -7 2 14
4900 14 3 -8 12 -2 -11 -1 -5 6 -8 -4 -1 2 -5 -2 7 -17 -16 0 3 2 11 8 -17 -14 7 5 -9 -6 0 6 -5 12 15 7 -12 6 20 -7 6 5 1
4941 1 -10 12 19 -8 -2 17 18 -7 12 6 3 2 10 17 8 -18 10 15 10 11 10 16 -14 -2 6 -5 -18 11 1 -5 3 12 12 -7 6 16 -4 -6 5 -1 -12
4982 -12 -17 1 6 -10 -2 -12 -8 2 5 20 11 5 12 10 -9 -2 14 -3 6 15 5 10 4 9 6 4 8 15 0 5 14 16 5 9 10 10 1 6 20 -1 6 -9 -5 -3 1 -3
5028 -3 -4 0 -2 -1 -2 -10 -11 -3 -4 -1 4 4 -12 -11 -1 4 -4 14 0 -1 -7 7 8 0 6 9 15 6 6 15 1 4 5 26 4 1 11 9 9 -1 8 2 3 11 15 -7 11 13 7
5077 7 12 19 7 5 0 10 -1 1 -9 12 2 -7 9 5 -9 -5 13 -1 6 10 -3 -6 0 5 5 -1 14 -3 -3 7 17 3 14 0 2 -6 9 16 13 8 3 12
5119 12 10 17 5 2 10 8 17 19 10 5 -1 21 15 5 6 1 17 11 16 17 9 -3 -9 16 13 20 5 2 -6 -2 3 7 -1 -4 5 11 18 -5 -8 -14 -6 7 16 1 -9 -5 -5 -10 3
5168 3 5 -11 -14 7 0 -1 7 4 6 -3 17 19 5 -1 15 15 13 16 2 -7 6 14 22 15 -4 -7 2 14 9 17 1 -11 14 12 11 -2 -11 -7 12 1 15 -5 -13 -13
5212 -13 3 11 -5 8 0 -10 11 11 2 -8 -13 -6 5 20 4 -6 -5 -12 5 15 4 -6 -13 -5 16 8 0 -7 -3 9 14 16 14 -8 8 18 25 18 18 11 9
5253 9 18 18 14 -8 5 4 11 22 20 -6 -5 -9 5 21 5 -11 -6 3 18 22 11 -4 -14 2 17 20 -8 -14 -8 0 16 21 6 -13 -8 15 12 2 4 -6
5293 -6 -6 2 26 8 6 -10 -1 11 3 13 4 -12 1 15 15 11 4 -13 4 19 19 4 -10 6 18 26 9 9 -4 -20 14 29 10 -15 -17 -8 6 20
5331 20 1 -21 -10 -13 4 -2 -16 -20 -26 -13 18 10 -2 -16 -12 7 7 17 -3 -18 -16 -2 23 13 4 -14 1 6 20 2 4 2 -4 11 29 5 0
5368 0 -5 -1 19 14 6 1 -10 7 32 18 3 0 2 0 32 24 -7 -18 7 12 5 11 1 -3 -11 12 12 10 5 -16 -10 6 -1 -7 -12 -14 0 15 3 -21 -9 -5
5410 -5 5 2 -3 -10 -12 -1 5 8 -1 -7 1 -6 10 15 8 -1 -7 1 20 9 6 0 -4 -7 10 17 12 -3 -10 15 -2 17 16 10 0 3 23 9 -9 8 8 -1 6 1 4 -1
5456 -1 12 2 -1 -17 -1 -4 10 -3 4 -9 -18 -5 7 -7 2 1 0 5 -3 3 11 2 1 14 4 14 13 3 -3 -3 6 2 3 13 11 7 15 3 19 18 2 2 10
5499 10 7 8 22 10 -2 7 -1 12 16 -8 -1 1 -2 7 -5 1 2 2 -8 -8 -2 -6 -8 -20 3 4 -9 1 -11 -10 -7 10 13 -14 -7 1 2 4 13 -6 -10 1 19
5542 19 16 -7 3 0 1 13 26 18 -5 -2 11 19 12 5 -4 -7 16 37 19 11 -11 7 9 15 13 6 -9 0 11 20 2 -3 -5 -11 4 8 26 -27 -10 6 9
5583 9 5 -21 -7 -8 3 10 16 -6 -26 -15 11 5 13 5 -21 -12 8 32 0 -6 -9 1 5 22 30 3 -11 9 33 27 7 -3 -3 14 34 27 2 -19
5621 -19 -10 12 21 10 -6 -10 0 6 24 7 -21 -13 12 19 20 23 -13 -30 -5 17 11 -5 -9 -6 -9 16 35 4 -28 -10 8 25 6 -4 -27 -20 14
5658 14 34 23 -20 -8 2 9 2 8 -18 -19 -3 28 26 7 -11 -3 9 13 28 2 -15 3 10 20 20 7 -6 -4 -1 22 9 -20 -22 2 4 11 13 -3
5696 -3 -11 -1 23 17 -12 -22 -7 -5 14 17 12 -18 -24 6 17 3 -4 -16 -4 3 26 28 0 -19 8 10 11 17 -8 -16 -12 9 17 7 -8 -9 5 15 23
5735 23 14 -1 -4 17 22 16 7 -4 -5 7 24 20 6 -12 0 27 21 9 3 -4 -7 8 23 14 -9 -23 -7 11 15 -3 -18 -25 -6 17 4 -13 -1
5772 -1 -7 -10 17 19 11 -12 -11 24 17 7 -1 -14 -7 -1 7 5 4 -7 16 25 4 21 6 -5 4 15 10 2 -2 -1 16 9 17 0 -3 -4 19 9 8 4 -10 -5 11
5815 11 6 4 -4 -10 9 11 11 1 -9 -8 8 14 2 19 -12 -4 -7 16 4 9 -11 -9 -4 6 8 -1 -5 0 6 13 13 -1 1 2 18 8 18 6 -12 8 13 29
5857 29 13 6 2 12 11 5 15 2 17 6 1 13 -1 5 1 -3 6 10 16 0 -1 -2 8 0 -1 -4 -7 -19 -6 -5 -3 -11 10 -1 2 -3 -3 -3 5 4 -4 -7 3 0 5
5902 5 17 2 -8 -1 2 10 6 -9 10 12 10 5 -1 2 15 7 5 12 18 11 6 7 2 -1 10 10 -3 15 2 8 2 4 1 -4 4 12 1 0 12 9 -2 -14 0 -1 -6 -7
5948 -7 3 -8 1 -1 0 1 -5 4 1 2 4 7 17 6 3 -1 4 8 1 2 -4 14 18 16 10 14 6 13 15 16 20 14 -3 10 8 3 5 -10 4 12 5 15 -3 -4 0 5 9 -12 -2
5997 -2 -1 3 10 -2 10 -5 1 -6 -8 12 -1 0 -2 7 2 -7 1 -2 2 -5 5 -6 4 -8 -3 13 -1 -4 -7 -1 -4 7 -3 10 0 -2 2 12 5 19 5 -3 4
6040 4 14 14 9 2 5 13 13 15 19 7 14 8 19 3 -2 -2 -1 9 7 4 -8 -11 6 11 10 4 6 -9 1 8 1 -1 6 3 -5 8 3 0 -11 1 20 11 2 -11 3 3
6086 3 0 17 5 -6 -5 3 12 7 6 6 0 8 7 11 14 -12 0 12 22 18 21 1 -3 16 27 21 4 8 1 17 15 14 6 -10 6 8 7 -2 -2 -6 2 9 1 -1 -23 -1
6132 -1 5 -1 9 -7 -8 -3 5 10 6 -5 9 10 17 13 17 8 -11 -1 14 16 1 -3 10 14 18 14 15 -2 7 9 9 16 -1 8 0 4 18 14 3 -6 -7 3 -1 7 2 6 4
6179 4 6 16 17 3 0 1 9 -4 4 -17 -16 -5 -4 10 3 -14 -15 -6 2 1 -9 -7 -14 0 2 10 -14 -7 -15 -1 12 2 -2 -11 2 14 10 5 -13 5 6 11 18 6
6223 6 1 -8 16 7 22 4 -12 1 4 10 1 8 -3 -2 19 19 7 -4 -2 -3 5 10 18 -2 -9 11 15 -1 -7 -2 -6 -18 7 16 -9 -7 -5 2 -5 -9 -10 -13 -17 -4 17
6268 17 4 -9 -14 6 -5 14 13 -7 -6 21 18 11 4 5 -6 0 10 10 8 -6 7 12 7 2 5 15 -6 6 11 -1 -2 1 1 -4 -13 -4 8 -19 1 6 -5
6309 -5 -4 -11 -6 -8 4 5 -4 -14 -5 18 4 7 1 -1 -8 8 12 11 -8 -11 -13 1 0 -1 0 -1 -11 -1 8 -14 -7 3 12 1 7 11 5 9 9 2 2 -1 6 7 -3 14 3
6356 3 5 5 7 22 -2 -5 -9 -6 -6 1 13 -9 -20 -6 0 -14 -14 -3 -25 -10 0 5 0 -11 3 -11 -10 -7 1 -4 -7 -13 1 -9 -7 -2 18 -13 -6 18 7
6397 7 1 -6 2 2 0 12 12 5 12 9 4 2 12 5 -6 -8 11 15 10 7 11 0 -4 -12 4 -10 -13 -2 11 -8 -4 -4 -9 -6 -1 4 -8 0 9 -5 -3 -7 6 13 -11 -10 8
6444 8 3 -11 2 -3 0 -4 16 9 -5 7 -7 1 -1 12 8 -5 2 9 7 9 12 -3 -1 6 6 1 -2 10 -4 8 -3 4 -3 -8 -5 13 17 -9 5 -3 -5 -8 4 -11
6488 -11 -4 -8 -13 1 9 1 1 2 0 2 5 -21 -2 -9 17 5 -10 4 -4 -6 -6 -9 -4 3 0 9 7 3 8 3 8 -4 0 3 -1 -2 -2 9 1 5 -10 -6 8 11 4 1 -5 2 -3
6537 -3 4 1 7 -8 -5 13 -3 0 -4 -7 -15 1 11 7 -8 -13 -5 2 7 -1 -7 -4 -3 6 2 -10 -14 -7 -6 0 -1 -9 -25 -7 -17 5 4 14 -4 -8 4 -5 3 3 -1 0 12
6584 12 11 8 4 4 -3 -1 12 17 6 -13 9 9 12 8 -6 3 1 3 -2 -2 2 1 1 -3 1 -3 -15 -1 -1 5 3 -3 -17 0 -2 -5 11 3 -6 -12 2 -3 2 -14 -8 -5 8
6631 8 8 3 4 -19 5 -3 -7 -2 1 -3 -7 11 9 6 10 -1 6 -1 0 10 3 8 11 11 8 5 1 7 -2 8 -12 10 -3 2 7 -5 5 -4 3 5 2 5 4 -1 8 4 -5 -3 2 -5
6681 -5 0 5 -1 5 -3 -9 -2 -14 -1 -5 4 2 6 6 6 1 1 -4 9 2 -3 10 -11 7 8 14 15 5 1 9 2 16 14 7 20 4 4 0 12 7 3 2 -1 7 9 7 -2 -10 -11 -2
6731 -2 -3 5 0 -10 -7 1 -12 -11 2 4 -12 -18 8 -6 6 -6 4 -5 1 7 -4 5 -6 2 -4 13 4 9 7 6 -2 2 6 10 4 -5 10 6 4 9 4 12 5 5 15 9 7
6778 7 11 7 8 3 -2 15 6 6 1 -10 6 -14 -11 -6 -11 3 -10 8 -16 -2 -12 -10 -17 -2 6 -9 -10 -17 -7 4 -4 -2 -2 3 2 -1 -4 2 -2 1 -1 3 11 4 -8 6
6824 6 21 5 -5 -10 -1 14 -2 13 2 18 8 8 16 15 -7 -7 8 14 11 5 1 -3 4 -1 3 6 6 -3 -3 -5 8 7 -3 0 -5 -12 -9 -1 -1 -4 -5 -7 -13 -8 -6 0 -5 -9
6872 -9 3 5 6 4 6 4 2 7 8 11 2 9 -4 4 15 -4 -5 -5 5 7 7 1 11 -1 8 0 6 1 2 -2 8 7 -10 0 6 11 -3 19 6 -9 11 -2 10 0
6916 0 -6 -2 -9 -12 -1 -10 -3 -14 -11 3 2 -3 3 -10 -11 3 4 -4 5 16 12 -6 0 4 7 -6 1 5 2 3 11 -2 6 11 4 10 -7 13 -1 4 3 -1 4 6 2 1 -13 -10
6964 -10 16 1 3 -3 2 8 5 16 -4 -2 2 -9 4 11 13 1 -3 -10 4 -4 -7 9 -4 9 -8 -4 -8 -16 4 0 7 -5 -10 -9 16 -5 6 2 2 11 10 -7
7006 -7 9 2 9 7 6 16 16 11 9 3 10 8 16 3 -6 -6 3 8 1 4 -18 -1 -7 8 5 7 11 -3 10 2 6 0 -12 -9 -3 1 -10 -6 0 -7 -3 -2 6 -5 9 13 6 4 -1
7055 -1 -6 8 -6 5 8 3 -1 -4 13 -2 9 14 -2 3 -1 10 9 6 12 7 2 19 12 22 11 15 10 15 11 9 6 8 4 10 6 -3 -3 3 5 -6 10 -1 -8 -2 8 -4
7101 -4 -15 0 -5 4 4 -15 -10 -5 2 2 -14 -1 -2 3 -2 10 -1 1 -7 -7 14 9 -2 10 3 -6 10 4 1 14 -1 2 3 12 0 6 -2 0 0 7 4 -7 12 -12
7145 -12 6 -2 6 3 -10 -1 4 -1 -10 5 1 4 7 0 -12 0 -5 0 -17 -2 -11 0 -8 1 1 -4 7 -6 -4 -2 2 -10 0 -5 6 1 22 4 1 -3 6 7 13 -2
7189 -2 -3 13 2 -6 3 12 10 3 7 5 -1 7 0 11 4 4 -1 -6 4 13 3 22 -2 3 3 -7 9 2 7 3 6 2 -3 -3 14 -6 -2 4 7 -6 -2 -7 -3 2 -4 6 -2 2
7237 2 -3 0 7 2 1 5 5 14 10 9 0 2 8 8 0 5 4 3 10 5 21 8 12 9 0 7 15 -8 11 -3 5 10 -4 -2 4 0 12 -5 -1 8 11 6 4 -17 -2 2 -16 5 -4
7286 -4 1 -5 -2 -7 3 -4 -5 4 3 -9 -4 -8 -7 -12 -1 -6 10 -8 6 -3 -3 5 13 3 8 3 1 1 12 9 2 1 11 0 8 -6 8 2 -10 4 2 6 3 6 16 16
7332 16 16 4 3 6 18 5 2 6 7 18 10 9 11 -7 13 -3 7 -7 -3 -5 1 9 0 5 2 1 -5 -1 11 -11 -6 4 15 10 1 9 -2 4 4 -5 12 3 0 -3 6
7377 6 9 8 7 6 -3 -10 -7 -4 -5 -2 3 8 7 -5 1 4 0 -1 -2 -2 3 -12 6 -8 -3 -2 8 -6 2 0 4 5 -5 -5 0 -4 -6 6 7 13 -5 -14 -7 6 1 1 -4 1 4 0 -14
7428 -14 6 4 3 11 13 11 16 14 10 2 0 2 13 16 3 10 15 12 5 6 6 5 13 6 -1 -6 12 13 6 0 2 -6 3 -6 7 -6 3 -1 -4 -6 -12 -2 -14 -3 -9 7 0 -3 -4 0
7478 0 15 1 3 11 -4 -12 2 -2 13 5 -4 11 5 0 -1 0 -2 -5 -1 13 5 -6 -4 3 10 8 6 0 -6 5 6 -7 1 4 -6 6 4 8 1 -12 -2 -4 11 -7 -7
7523 -7 2 -7 -4 -2 -11 -10 -9 5 8 2 -11 -7 -16 1 -4 6 0 8 7 0 4 3 7 -1 1 14 21 4 4 8 17 11 18 14 9 0 -4 8 8 11 2 4 6 4 2 12 9 -3 8 8 -4
7574 -4 -4 3 -5 6 2 -4 9 -7 6 9 11 0 -2 -7 0 -7 -1 -1 -14 -5 -8 4 -7 -6 -11 -4 1 -8 12 5 1 1 -4 6 10 3 15 -11 10 15 4 11 -2 4 11 13
7620 13 1 10 2 3 8 11 4 12 -4 8 8 8 5 -8 1 -6 2 4 6 10 -4 -4 -7 -2 3 -6 -10 -5 4 10 6 -5 2 9 11 -2 5 2 -1 3 4 1 -8 -17 -1 1 4 15 4 1
7670 1 -5 10 17 6 -2 6 -2 13 7 7 12 -11 0 -1 9 1 1 -2 9 2 3 5 -10 -5 3 8 0 -3 -3 9 -2 5 -1 -17 -12 -3 0 2 -2 3 -8 4 -5 10 2 0 2
7717 2 4 2 -4 6 -2 0 5 7 2 7 4 0 9 9 8 -6 5 12 -9 16 11 4 5 7 8 26 -4 7 11 2 22 18 4 -7 -3 10 16 10 1 -3 1 8 -4 12 0 -1
7763 -1 5 -2 -5 -18 2 -5 -2 3 2 -4 2 3 6 3 -4 -11 -10 -13 -1 0 -6 4 -3 -1 -3 -5 -4 -6 -8 3 4 4 6 3 3 6 14 8 -7 6 10 5 0 0 3 3 4 7 8 7 4 13 15 7
7817 7 9 9 -1 -3 8 0 -3 1 3 -1 -12 11 10 0 -8 5 -2 -18 -9 -9 -1 -9 3 5 -9 -4 3 0 1 1 -9 8 8 4 5 1 13 3 10 7 -5 -4 4 -5 -4 16
7863 16 8 7 14 7 17 13 1 5 3 11 16 17 3 0 1 8 -2 6 -4 -4 -11 16 9 -4 -3 -2 3 -3 2 13 -7 -1 -1 2 -4 3 6 2 5 10 5 -15 -7 10 8 9 5 5 1
7912 1 16 7 11 5 4 7 -3 15 -2 25 2 9 13 -1 1 -4 3 15 7 8 18 3 -5 7 13 18 -8 3 1 0 12 6 6 0 -3 21 8 4 4 -8 0 0 6 -3
7956 -3 -11 -5 6 -1 9 -14 -11 -7 -9 1 5 6 -12 3 -4 16 12 3 0 4 8 6 3 -3 2 2 8 4 8 5 3 1 15 7 3 3 -7 7 6 14 4 -11 0 -2 12 -8
8002 -8 -10 -7 -15 -8 -5 5 -19 -9 -5 -12 1 -5 -11 -3 2 -1 4 1 -2 -20 -4 3 9 -9 -7 -5 -11 0 11 -6 -12 -1 7 9 2 -1 -6 -2 5 7 2 -3 -8 8 8 11 17 -3
8050 -3 5 2 3 11 -7 2 -8 4 9 3 -2 -10 -13 6 -8 5 -15 1 1 3 2 2 -8 3 -2 3 6 -14 -23 1 9 -2 8 -22 -11 0 5 3 1 2 -3 -1 -8 5
8094 5 11 4 -8 -2 -6 2 1 -5 -9 3 5 2 -5 -2 0 -1 5 13 5 -4 -1 -3 5 0 -7 -4 -7 -2 1 2 -10 -11 -6 -15 -2 -5 -7 -3 -2 8 3 -15 -24 -3 -6 0 14 1 -16 -24 0
8145 0 -1 -5 -10 7 -8 1 13 8 -5 3 8 -8 2 -8 -1 -3 -1 -3 -6 -1 -1 -3 12 10 2 10 3 -2 -11 8 3 6 13 4 2 2 12 7 -3 -5 -2 -4 -3 -6 -10 -12
8191a2
$$ Imaginary data points
##PAGE= N=2
##DATA TABLE= (X++(I..I)), XYDATA
0 0 0 0 0 0 0 0 0 0 0 0 0 0 -1 8 -8 8 -8 8 -16 16 -16 17 -24 24 -32 32 -40 48 -49 56 -64 72 -81 91 -104 113
36 113 -128 142 -157 174 -192 213 -235 262 -287 319 -356 396 -442 497 -560 636 -729 845 -998
55 -998 1206 -1503 1975 -2843 4925 -19979 -6392 40055 1952 -10922 10123 -570 -29564 2970
69 2970 34309 3714 -26509 -3790 7888 -3677 6225 18342 -9127 -24811 1994 17364 513
82 513 -1003 7287 -6114 -13806 7212 13156 -7286 -10184 6296 5080 -4074 1046 2606 -7595
96 -7595 -4863 7995 6376 -3842 -4816 -1656 1163 5926 3587 -7283 -8570 1320 6096 6158 6048 -3780
112 -3780 -14982 -5307 12186 10017 -1115 -3292 -6398 -8550 6006 17006 506 -15259 -5350
125 -5350 4198 1098 7003 11291 -8544 -21122 621 17147 3451 -5141 1804 -4204 -11470 5694
139 5694 16784 -3045 -15332 -37 7202 -1244 2426 7922 -6063 -13218 4146 12364 -1278
152 -1278 -5870 2182 -307 -4624 4447 6900 -6171 -8223 4982 6888 -2271 -1885 1644 -3981 -4326
167 -4326 6252 6973 -5333 -7947 1708 4928 693 158 -163 -4858 -3841 5370 8032 -527 -6522
182 -6522 -3567 512 2427 4555 3025 -4381 -7279 561 7413 3621 -2756 -3511 -2560 -1354 3656 6499
198 6499 -182 -7397 -4033 2898 3422 1481 826 -2484 -5111 85 6017 2461 -3826 -2939 392 457
214 457 1185 2851 -12 -4013 -1788 2914 2653 -448 -1300 -777 -358 921 1726 36 -2135 -1399 1204
231 1204 2042 257 -1431 -1119 -69 474 1177 1200 -1191 -2954 -314 2874 1331 -1531 -1161 -410 -817
248 -817 1054 2999 -60 -3426 -931 2117 701 -56 1292 -735 -3229 279 3777 557 -2439 -185
264 -185 612 -1296 489 2764 -601 -3154 339 2050 -949 -738 1902 -385 -2933 639 2940 -867
280 -867 -2220 1218 1098 -1812 -232 2103 -306 -1793 914 1253 -1320 -428 1800 14 -1677 559
296 559 1389 -948 -860 1328 442 -1505 -313 1129 106 -545 157 -143 -637 370 740 -359 -551 104
314 104 -211 -291 707 516 -939 -735 643 581 -107 97 -96 -787 -18 1222 446 -895 -536 261 141 260
334 260 565 -286 -1051 -144 957 590 -233 -616 -779 -218 961 981 -426 -1152 -475 307 697 706 -157 -1191
354 -1191 -711 723 1081 343 -379 -966 -915 520 1760 667 -1248 -1164 187 698 573 450 -359 -1289 -545
373 -545 1129 1272 -204 -1189 -889 48 939 1011 -85 -1195 -888 342 970 526 -388 -954 -608 460 1141
392 1141 549 -688 -1209 -434 850 1293 323 -968 -1078 -19 895 836 62 -790 -983 -47 1174 1116 -281
411 -281 -1332 -891 340 1076 820 -231 -1140 -904 375 1235 601 -687 -1094 -352 573 974 499 -575
429 -575 -1252 -588 810 1273 294 -874 -936 -91 772 864 99 -846 -923 36 954 831 -151 -997 -879 100 993
450 993 834 -233 -1029 -716 337 939 487 -511 -956 -408 510 912 473 -432 -994 -539 584 1071 340
469 340 -694 -839 -97 634 722 129 -653 -781 -49 805 826 -5 -810 -777 12 721 676 -81 -749 -670 132 830
491 830 577 -378 -896 -412 387 713 463 -226 -868 -688 335 966 402 -521 -683 -207 376 696 375 -534
511 -534 -931 -167 781 706 14 -489 -630 -312 485 907 184 -802 -700 193 666 443 -150 -711 -679 155 884
532 884 599 -315 -765 -482 140 715 643 -231 -939 -477 556 824 204 -476 -679 -364 407 952 459 -637
552 -637 -918 -180 522 611 250 -391 -825 -295 722 805 -184 -794 -455 88 447 605 121 -800 -832 255 859
573 859 268 -374 -417 -312 49 757 669 -576 -1149 -92 934 614 -72 -344 -603 -465 556 1193 162
592 162 -1058 -744 281 659 578 178 -784 -1172 38 1302 760 -526 -780 -425 -141 540 1062 88 -1258
611 -1258 -854 613 910 197 -215 -478 -662 45 1058 638 -622 -720 23 237 262 407 -35 -812 -349 735
631 735 575 -392 -503 -29 17 154 447 -35 -842 -408 678 614 -236 -457 -217 -156 204 811 399 -867 -1017
652 -1017 293 1075 431 -317 -436 -534 -276 784 1192 -135 -1293 -578 547 554 389 355 -640 -1398 -11
671 -11 1564 611 -905 -513 60 -452 79 1324 314 -1544 -710 969 344 -390 515 255 -1204 -402
689 -402 1376 427 -1075 36 844 -557 -658 959 489 -1029 -71 1050 -358 -988 639 713 -741
706 -741 -180 867 -527 -1237 800 1377 -741 -1066 540 188 -806 505 1299 -584 -1480 179 981 89
724 89 16 302 -581 -924 419 1140 228 -527 -429 -259 6 487 563 57 -581 -757 -71 801 496 -435 -353 44
746 44 -438 -265 926 613 -941 -684 579 14 -571 756 871 -1111 -1066 1007 691 -814 191 1054
764 1054 -811 -1338 938 1246 -677 -435 694 -512 -1020 1024 1228 -961 -830 765 -116 -942 904
781 904 1244 -1200 -1315 944 667 -844 200 985 -849 -1197 918 944 -798 -263 877 -400 -1034 740
799 740 1070 -680 -637 755 112 -908 241 1057 -248 -816 195 232 -482 118 814 -119 -945 -209 438
818 438 117 37 312 -174 -810 -286 692 672 -127 -565 -397 -77 303 615 361 -430 -742 -121 537 529 243 -131
840 -131 -659 -561 446 948 42 -672 -292 38 -104 280 625 -185 -921 -229 579 207 -160 99 -113 -533
860 -533 33 612 26 -541 37 446 -181 -380 270 307 -310 -117 487 46 -640 -84 740 269 -468 -208 78
881 78 -272 -3 810 276 -1024 -707 600 522 -165 152 143 -887 -625 1040 1019 -625 -803 100 -58 -117 941
902 941 656 -1105 -965 723 692 -286 222 383 -940 -770 1118 997 -798 -671 440 -77 -397 699
920 699 518 -951 -611 746 238 -580 218 426 -703 -405 877 261 -925 -120 741 -80 -469 297 127
939 127 -547 101 720 -119 -631 74 278 -103 224 395 -432 -672 277 625 60 -176 -202 -411 -61 590 330
960 330 -342 -346 -147 -131 337 630 -165 -775 -139 389 156 137 225 -436 -634 395 746 -156 -383 169 -104 -357
982 -357 448 658 -478 -678 312 400 -229 30 243 -455 -425 558 408 -569 -292 376 -43 -306 370 271 -610
1003 -610 -313 570 276 -353 -54 98 -292 48 592 10 -608 -33 398 -61 -72 382 -74 -628 25 649
1023 649 79 -400 -41 51 -172 117 381 -146 -468 9 253 -24 -24 101 -176 -291 147 317 -68 -221 -43
1044 -43 8 34 153 36 -226 -116 162 93 -46 12 -63 -174 43 274 26 -224 -97 38 12 111 132 -175 -308
1067 -308 56 260 2 -127 -21 -73 -108 118 237 -24 -252 -91 81 125 100 -5 -172 -101 126 147 10 -32
1089 -32 -33 -84 -10 157 120 -102 -133 -6 61 63 20 -79 -158 -22 128 41 -88 -66 6 -47 -29 93 49 -126 -115 80 111
1116 111 -15 -66 -29 -13 3 45 55 -63 -87 14 67 3 -17 -2 -40 -48 40 101 -29 -101 -13 58 32 4 -34 -79 -19 50
1144 50 27 -58 -21 -5 -50 -16 104 33 -115 -79 64 46 -11 1 -2 -79 -10 113 44 -83 -30 36 -43 -12 112 31 -147
1171 -147 -82 94 56 -62 -33 -23 -56 -25 35 5 -44 -20 -25 -22 30 41 -44 -59 25 33 -15 8 3 -51 -12 73 25 -65 17 58 -39
1202 -39 -24 83 30 -95 -17 84 -11 -45 45 -1 -74 4 52 -39 -62 41 18 -107 -28 67 -27 -87 46 42 -78 -38 64
1229 64 -34 -82 74 62 -130 -55 135 44 -149 -10 114 -51 -107 78 105 -82 -87 58 24 -51 22 37 -75 -71 41
1254 41 26 -41 -19 24 -12 -77 3 86 17 -62 -31 47 -2 -41 27 85 -30 -81 24 63 -15 1 60 -62 -134 53 142 -46
1282 -46 -93 52 -25 -151 35 192 -50 -224 19 81 -100 4 185 -73 -283 34 210 -66 -109 138 1 -242
1304 -242 14 273 -2 -180 41 65 -103 18 206 -20 -167 61 107 -111 -44 183 24 -198 -33 124 -19
1325 -19 -110 63 76 -97 -135 -11 87 78 2 -73 -69 -41 15 135 146 -70 -202 -49 90 55 115 119 -227 -324 125 355
1351 355 -14 -152 60 -122 -329 191 477 -115 -456 6 130 -151 101 393 -190 -560 96 412 -105 -120
1371 -120 286 -78 -465 129 511 -118 -311 236 113 -365 80 484 -110 -396 244 271 -381 -180 473 129
1391 129 -410 -18 262 -201 -222 355 247 -327 -275 115 43 -4 232 56 -371 -261 219 299 58 -83 -139 -187
1413 -187 -62 250 343 10 -370 -300 149 319 90 -43 -71 -294 -194 345 413 -201 -373 42 31 -137 234 351
1435 351 -339 -516 233 409 -189 -143 246 -120 -374 229 405 -267 -269 311 84 -339 130 359 -304 -293 449
1456 449 233 -530 -151 482 19 -344 175 192 -436 -180 552 178 -498 -150 216 -131 -82 424 119 -605 -300
1477 -300 457 306 -147 -59 -19 -308 -88 472 347 -261 -386 -48 127 191 244 37 -370 -349 177 437 116 -215
1499 -215 -162 -77 -97 118 370 37 -462 -246 262 183 -97 26 43 -268 -137 334 184 -277 -80 245 -70 -221
1521 -221 206 225 -267 -121 353 25 -444 14 410 -72 -249 171 9 -448 30 603 11 -577 -83 260
1541 260 -133 -72 443 35 -689 -253 535 301 -206 -70 -48 -334 -30 546 245 -360 -272 71 8 82 380 77
1563 77 -537 -275 372 286 -127 -64 49 -217 -187 276 286 -186 -301 42 98 -56 32 112 -102 -176 86 155 -96
1586 -96 -117 95 74 -92 -51 91 -16 -94 109 152 -98 -193 19 133 27 19 50 -141 -203 100 288 -1 -251 -77
1610 -77 55 -39 36 222 -32 -336 -101 238 129 -71 -2 -37 -205 15 338 78 -258 -61 149 -46 -54 246
1632 246 95 -311 -149 291 124 -164 -19 87 -128 -96 183 71 -215 -55 159 -49 -132 120 88 -224 -91
1653 -91 197 28 -218 -4 159 -40 -110 80 37 -118 -2 135 -18 -108 34 43 -72 24 113 -62 -149 30 112
1676 112 -14 -52 19 -35 -65 48 76 -38 -67 -8 -2 -29 40 46 -61 -70 9 53 29 -10 -42 -18 26 26 -11 5 42 -20 -54 29
1706 29 59 -16 -35 33 3 -31 7 23 -48 -13 43 -41 -102 20 91 -49 -89 45 46 -89 -42 80 -3 -103 4 64 -15
1733 -15 -16 49 -23 -66 34 77 -45 -49 46 35 -50 21 62 -25 -60 25 54 -30 -19 -2 -49 -40 69 45 -72 -52 32 15 -21 10
1763 10 28 -40 -48 41 42 -8 -28 -16 -27 15 64 7 -85 -26 69 19 -16 -12 -11 -41 -23 52 45 -50 -75 -36 21 49 29 -61 -86 7 58
1796 58 19 -15 -14 -37 -39 44 89 22 -66 -56 13 47 58 11 -61 -61 16 65 23 3 -23 -51 -11 66 52 -32 -62 -31 13 27 24 -13
1828 -13 -70 -41 32 35 -15 -47 -34 -28 10 46 -11 -72 -51 8 34 39 6 -75 -79 29 90 19 -62 -40 -17 -10 40 64 -13 -83 -47 40
1860 40 57 23 -17 -89 -63 62 68 -12 -39 -7 -15 -8 55 45 -39 -70 -2 55 27 -4 -28 -49 12 68 36 -58 -47 4 16 10 35 -11
1892 -11 -80 -49 51 56 10 -47 -47 -17 42 51 -8 -73 -67 -32 41 71 13 -66 -65 -4 38 61 33 -70 -101 -3 84 44 -28 -33 -38 -40 42
1925 42 89 -7 -74 -23 10 6 34 50 -51 -91 34 81 -12 -43 35 -4 -34 32 50 -63 -80 18 43 -10 5 -3 -61 -52 62 78
1955 78 -48 -71 5 19 -2 33 17 -64 -75 23 63 19 -24 -62 -66 2 71 20 -43 -52 -28 -7 51 43 -34 -58 -20 4 48 72 -13
1986 -13 -82 -29 72 50 -15 -3 -11 -64 15 105 13 -83 9 53 -21 7 98 -23 -137 23 142 -23 -90 30 11 -85 8
2013 8 120 -56 -150 37 86 -52 -37 63 -44 -139 54 156 -58 -142 27 53 -65 42 113 -62 -140 41 111 -7
2037 -7 -16 31 -56 -81 81 128 -53 -112 -8 20 -4 51 39 -68 -82 3 38 35 6 -29 -59 4 47 18 9 -16 -45 -12 72 27
2067 27 -41 -6 37 -25 -36 68 29 -102 -24 99 -15 -98 40 54 -87 -2 132 -44 -171 33 147 -71 -94 86
2091 86 8 -164 41 192 -45 -180 37 88 -62 26 146 -61 -178 76 170 -36 -69 91 -32 -150 67 214
2113 214 -30 -172 21 62 -64 5 135 -43 -156 -10 95 2 -25 46 -38 -111 4 117 17 -65 -17 21 -16 -6
2137 -6 51 46 -38 -56 13 40 -6 -12 38 -16 -84 -18 56 5 -47 21 12 -105 -69 87 65 -91 -63 27 -39 -63 91 96 -109 -104 55
2168 55 40 -45 63 89 -104 -119 103 122 -79 -19 96 -37 -137 81 158 -50 -101 37 12 -97 34 129 -43 -140
2192 -140 6 51 -56 10 106 -5 -166 -58 126 48 -34 6 4 -108 -71 126 124 -59 -94 4 -12 -5 111 90 -118 -155
2218 -155 45 98 -8 -9 60 -89 -153 85 181 -37 -148 8 16 -66 44 133 -56 -166 37 127 -49 -49 99 -5
2242 -5 -150 14 141 -40 -113 67 73 -79 -49 79 -6 -64 70 84 -110 -112 70 74 -37 -10 21 -97 -114 86 131 -39
2268 -39 -135 -60 15 65 96 28 -101 -130 3 120 97 -8 -96 -73 -18 89 140 37 -148 -135 69 131 28 -25 -19 -81
2294 -81 -59 149 148 -87 -150 10 56 9 87 33 -163 -138 138 155 -68 -83 43 -34 -45 136 111 -156 -138 103 116 -28
2320 -28 -6 -1 -142 -55 195 104 -181 -127 61 22 1 94 -20 -190 -76 167 123 -68 -96 -67 -64 76 166 1 -199
2345 -199 -109 75 101 63 4 -104 -138 21 172 116 -51 -131 -75 54 148 76 -86 -146 -51 74 141 71 -110 -154 -21
2370 -21 96 95 23 -84 -165 -49 145 127 -58 -136 -42 14 61 103 11 -172 -107 100 125 17 -36 -78 -107 33 196 54
2396 54 -166 -128 28 84 63 41 -87 -181 -25 180 97 -55 -101 -80 -33 107 167 -45 -213 -81 105 119 39 -37 -112
2421 -112 -93 69 175 49 -94 -119 -49 75 141 55 -113 -154 2 118 97 -15 -102 -122 -23 98 87 -31 -125 -106
2445 -106 3 119 95 -55 -159 -82 53 111 47 -58 -111 -52 75 117 22 -77 -106 -33 66 118 19 -104 -108 27 106 82
2471 82 -12 -102 -86 28 115 71 -45 -91 -64 29 99 86 -63 -134 -49 92 100 14 -72 -80 -24 63 93 13 -90 -83 3 79 73 4
2501 4 -77 -93 0 102 55 -52 -111 -51 27 80 35 -48 -79 -55 27 83 22 -63 -96 -41 46 73 -6 -77 -72 8 58 46 3 -65
2531 -65 -60 11 67 69 -19 -48 -38 16 76 53 -22 -83 -26 49 54 17 -31 -46 -34 23 58 5 -49 -46 -2 32 26 12 -41 -43 0 58 27
2564 27 -32 -38 -29 7 37 21 -13 -39 -23 2 32 34 -28 -49 -15 32 27 -4 -20 -26 -8 31 30 2 -16 -22 -14 13 35 -6 -41 -37 16 27 10
2599 10 -3 -10 -8 -12 24 13 -17 -13 -1 -7 0 16 2 -43 -5 23 12 -26 -8 5 -20 -23 15 -2 -20 -12 17 -15 -11 1 -2 -22 -14 12 -5 -31
2635 -31 -14 17 -5 -18 -7 -3 -20 -4 3 6 -20 -12 8 -10 -1 2 -9 -21 5 19 -2 -14 -1 9 -1 -13 -7 -2 -3 -9 5 9 -15 13 -5 -2
2671 -2 -13 -1 -4 -12 7 12 10 -17 -2 6 6 10 -2 -7 -7 -19 -2 11 0 -9 -18 -8 -5 5 1 -6 -32 -14 3 -7 -11 -2 -14 -16 3 11 -4 -20 -7 -2
2711 -2 -1 -1 8 -6 -15 -13 22 1 -11 13 15 -2 13 13 4 -20 -12 21 20 -17 -6 -9 -9 14 19 14 -20 -15 -11 11 1 12 -17 -30 -19 27 24 -25 -18 -13
2751 -13 -7 12 23 24 -26 -24 9 27 14 6 -7 -48 -37 25 33 -15 -42 -19 4 16 21 7 -33 -42 4 41 12 -16 -24 -15 -3 12 34 3 -43
2786 -43 -14 28 10 -1 -5 -4 -10 11 42 7 -38 -20 21 22 -13 -4 -14 -43 -21 50 11 -59 -51 -6 11 11 27 -18 -72 -38 50 60 -22 -40
2820 -40 -36 -18 7 66 37 -87 -77 8 49 23 11 -15 -81 -42 62 76 -14 -75 -26 6 12 42 22 -69 -77 27 68 4 -26 -20 -32
2851 -32 -31 35 44 -31 -76 6 55 9 -23 -3 -21 -45 31 65 -21 -80 -11 41 11 -6 -1 -55 -80 28 102 9 -106 -67 4 -9 24
2882 24 43 -44 -125 -24 86 46 -27 -38 -45 -63 38 114 17 -105 -51 48 42 33 50 -29 -97 -23 99 56 -47 -51 -16 -12 24 68
2912 68 4 -88 -43 56 49 -11 -29 -15 -38 -9 56 28 -75 -81 28 55 0 -27 -17 -36 -8 60 63 -62 -94 4 46 11 -6 -2 -68
2943 -68 -75 55 99 -15 -101 -26 21 -3 55 41 -77 -99 27 101 14 -34 -17 -32 -52 80 120 -39 -117 -4 62 16 36
2970 36 25 -40 -64 45 91 -6 -57 -16 -11 -17 50 50 -48 -95 4 60 8 -32 -15 -36 -38 22 48 -17 -58 -15 18 20 1 -10 -34 -40 14
3003 14 40 13 -51 -44 24 11 -4 4 -6 -47 -24 45 32 -53 -47 -5 12 -3 37 13 -72 -52 66 41 -21 -32 10 -15 -12 64 56 -48
3035 -48 -58 24 22 16 18 -8 -46 -28 63 44 -37 -29 6 -16 -22 33 30 -55 -62 31 28 -19 -13 -11 -24 -18 19 2 -33 -11 8 1 -18 12 -5 -23
3071 -23 1 23 1 -15 -12 -2 18 4 -5 2 -6 -10 5 7 0 -16 -7 2 6 0 7 -4 -34 1 34 6 -28 -6 20 6 1 28 1 -23 -19 10 -9
3108 -9 -26 2 0 -21 -6 26 3 -33 -3 14 -17 -27 -6 2 -32 -15 -3 -16 -33 6 -5 -14 -9 -1 -19 -11 19 15 -13 -18 -10 9 12 12 -1 -27
3144 -27 -13 16 8 10 -10 -9 -6 7 16 -12 -12 -10 -1 19 0 -11 -14 -10 0 8 -4 -16 -16 -16 1 17 -6 -25 -28 -7 12 3 -14 -21 -18 5 9 -1 -13
3183 -13 -14 -14 -14 15 10 -19 -32 -22 3 19 -9 -29 -31 -18 20 25 6 -13 -14 -12 4 27 -10 -33 -17 -1 18 27 -9 -23 -24 -4 18 4 -1 -13
3219 -13 -29 7 14 1 -23 -35 -14 5 13 -19 -32 -31 2 4 1 -17 -19 -38 2 6 -2 -36 -31 -15 -8 12 7 -25 -38 -13 4 5 -11 -5 -15 -10 2
3256 2 22 4 -19 -15 -16 4 20 2 -26 -18 18 28 2 -6 -13 -25 -13 22 11 -11 -14 -11 1 5 21 -7 -40 -27 18 19 -1 -19 -17 1 8 21
3292 21 8 -6 -21 -7 4 2 -13 -13 -11 -1 7 -3 -8 -23 -14 1 7 -9 -27 0 -19 3 11 14 -21 -24 0 5 3 4 -13 -24 -8 8 -1 -7 -3 2 -3
3331 -3 -11 14 -1 -28 -18 21 7 -4 -7 -4 -28 -7 7 -4 -8 -14 -10 -16 -9 8 5 -15 -13 6 4 -24 -13 -6 -2 -15 -7 0 -8 -10 0 -4 3 -2 -17 -1 -4
3372 -4 9 5 -8 -12 -1 1 -7 6 7 -1 -9 -10 9 16 -15 -8 19 7 -5 20 8 -18 -14 10 8 -7 15 14 -2 -17 9 13 -15 -6 18 -9 -11 -3 -2 -22
3412 -22 -14 6 -3 -12 -3 6 -4 -15 0 -1 -23 -14 -3 -12 -20 -8 2 -9 -10 -2 -15 -3 -16 13 0 0 -2 9 -30 -21 5 1 -17 -11 1 -4 -3 2 22 -10
3452 -10 -8 -2 7 -1 -11 -4 6 -12 -13 -5 6 -6 -9 -8 -16 -15 2 16 -10 -15 3 4 -3 -1 14 3 -12 2 7 -20 -12 6 0 -10 -19 5 -4 -27 2 1 -11
3493 -11 -20 10 3 -20 -4 9 2 -10 8 11 -16 -12 15 6 -12 -11 14 3 -15 15 20 -3 -7 2 3 -22 -8 14 -4 -5 -15 6 -14 2 19 10 -18
3530 -18 -14 -6 3 -5 3 -2 -24 -11 0 2 -16 -17 -8 -2 -14 -8 0 -12 -27 -16 15 -15 -10 -3 -12 -12 -9 -2 -4 -11 -23 -2 -7 -21 2 7 -14 -13 -6 -3 -10 -15 6 -3
3574 -3 -7 1 4 -14 -7 6 17 -23 -13 11 -4 -17 17 3 -23 -11 10 3 -23 -6 -8 -22 -32 8 5 -33 -13 5 -3 -39 2 4 -20 -27 10 4
3610 4 -22 -8 14 -16 -25 20 24 -18 -28 5 -2 -19 0 5 -21 -27 2 17 -12 -19 15 3 -31 11 14 -23 -25 -4 5 -9 -8 11 -1 -35 4 8
3646 8 -14 -4 -6 -1 -13 3 6 -17 -17 -5 7 -17 -2 -11 2 -16 -2 -10 0 -9 -12 3 -17 -16 -20 -6 -12 -10 5 5 -22 -14 3 -15 -16 17 -1 -23
3684 -23 -25 22 13 -7 -29 -3 4 -10 15 5 -15 -18 17 14 5 11 6 -28 -25 18 23 -20 -30 -13 5 -7 12 17 -19 -34 -6 19 -1 -17 -11 -27
3720 -27 -32 17 24 -13 -31 11 5 -13 -3 -1 -11 -22 6 25 -5 -10 -8 -15 -4 5 5 -37 -26 -1 10 -7 -11 -13 -18 -9 19 22 -13 -26 0 19 12 8
3758 8 -9 -30 -16 20 28 13 -9 -18 -7 17 10 20 -20 -26 -5 9 22 0 -10 -27 -2 29 19 -9 -30 -24 1 18 20 -12 -24 -21 13 25
3792 25 26 -15 -30 10 27 9 2 4 -28 -18 21 33 -5 -15 -31 -18 8 11 2 -33 -31 15 32 11 -30 -12 -20 -12 34 30 -30 -32 -8 19 29
3827 29 22 -16 -30 -10 31 43 -4 -30 -16 4 17 24 -6 -40 -38 4 28 -2 -6 -42 -31 -6 22 16 -28 -44 -17 21 18 9 -22 -45 -28 20
3861 20 26 10 -33 -35 3 25 27 3 -35 -31 4 34 17 -5 -22 -27 6 34 27 -2 -33 -14 16 34 12 -28 -22 -7 26 31 0 -27 -28 -5 16
3896 16 33 -3 -33 -47 -13 36 22 -11 -34 -29 9 29 23 -20 -35 -23 8 19 2 -27 -51 -25 20 30 0 -38 -42 -10 11 10 0 -26
3928 -26 -31 -14 18 30 -1 -38 -20 9 26 18 -14 -33 -19 20 25 11 -22 -29 -23 14 10 7 -19 -35 7 19 16 5 -26 -27 -14 16 24 -15 -28
3963 -28 -7 -1 13 8 3 -24 -29 4 19 12 -19 -21 -13 -1 10 14 -25 -33 -5 21 0 0 -13 -19 -5 18 35 3 -25 -19 7 9 15 -11 -15 -19 -10 23 12
4002 12 -18 -14 -17 -4 16 8 -18 -26 -3 4 16 -6 -9 -8 -7 9 2 4 -9 -13 -15 5 3 -17 -23 -18 -16 10 -8 -37 -19 -14 -7 -5 0 5 -18 -13 2 -6 -5 -17
4044 -17 -1 0 -6 3 2 -11 -22 -4 7 3 -12 10 -4 -11 10 14 -21 -1 -6 -10 -8 2 6 -9 -10 12 -5 -13 -19 -9 7 -10 1 12 -15 -16 2 1
4082 1 -1 -4 2 -3 -10 -7 14 -5 3 1 -7 -13 -14 15 -7 -18 -1 6 -14 -6 -8 16 -9 -15 11 11 -7 -8 -2 -6 -14 11 14 -9 -5 3 5 -6 1 13 -22 -27 12 9
4126 9 -5 -6 10 10 1 21 -4 -28 -13 15 7 -27 -3 8 -15 -7 6 14 -12 -22 -3 -1 -15 2 -7 -9 -3 5 14 -16 -10 -12 -9 -5 8 8 -4 -21 -1
4165 -1 10 -2 -8 -11 -18 -17 12 3 -11 -11 -13 -2 7 3 -4 -11 -20 8 12 9 -17 -5 10 1 13 19 4 -21 -7 31 20 -10 -9 2 -12 -14 8 -11 -31 -11
4205 -11 20 17 -15 -9 -5 -20 -4 15 3 -27 -22 -4 -3 -4 -5 -15 -29 -17 11 3 -14 -25 -1 -7 17 12 1 -19 -8 9 8 -6 -21 -11 -34 -15
4241 -15 11 -1 -1 -25 -10 -6 6 10 0 -10 -9 8 26 -18 -13 -4 5 0 -7 4 -8 -27 -4 4 3 6 5 -6 -7 3 -1 -4 -25 -6 1 -4 -9 -12 -23 -15 8
4282 8 3 -16 -19 -15 -14 -4 -3 -3 -1 -22 -10 -4 -6 -10 -4 -10 -4 2 20 -7 6 -3 18 13 -5 -6 -5 -19 -11 8 -2 -17 -9 -16 12 -4 0 3 -15 -11 1 -1 0 -11
4326 -11 -15 -11 -16 7 4 -4 -17 3 -10 9 1 -4 -14 -8 -5 0 -12 -13 -7 -3 3 -14 3 -12 -12 3 0 5 -13 -1 12 -6 -3 -2 -6 -28 0 6 -3 -3 -8 1 -3
4369 -3 6 5 0 -12 -12 7 11 -7 8 4 -14 -12 -3 -1 -4 -26 -15 0 -3 0 11 -9 -20 5 1 -3 -3 -15 -14 -3 8 -10 -10 -13 -21 4 0 -17 -7 -9 -8 -11
4411 -11 9 -6 -16 -15 -10 1 -15 4 4 -13 -4 4 0 -16 -10 11 -10 1 -4 -3 -8 -9 0 8 1 -5 -10 -10 -3 12 -5 -26 -12 14 0 -20 8 -8 -24
4450 -24 -16 -6 0 -18 -22 -20 -8 -18 -5 -11 -22 -19 -9 -11 -19 -12 -8 -5 -3 1 -2 0 -8 5 0 3 -4 -7 -12 -7 8 9 -6 1 -9 -18 -1 -2 -5 -2 -10 9 9 -2 -1 -10
4496 -10 -1 -8 4 9 -8 -15 -12 -6 -6 4 -8 -13 -2 -19 9 -12 -19 -6 -8 2 -6 -11 -14 -5 -2 -5 -8 -19 -7 -3 -9 0 1 -8 -4 -15 -1 -3 -8 0 3 -12 -1 6
4540 6 4 -11 -7 -6 -8 4 -6 5 -4 -3 10 4 -1 -13 10 -1 -2 -2 6 -6 3 4 8 -4 -17 5 -6 -2 -7 -9 -18 -4 -2 0 -9 -9 -3 -10 -19 -1 -2 -9 -3 -8 -10 -7
4586 -7 -2 -8 -9 -4 7 7 1 -4 3 -4 2 3 11 7 -2 -5 -12 0 6 12 -4 -11 -6 -5 -10 10 -9 3 0 8 1 -1 5 -3 -5 0 3 9 -6 4 -2 -2 6 1 2 -2 -1 9 -3 -9 -6
4637 -6 -1 -3 2 -14 -7 -12 -13 1 -8 -2 -8 -13 3 13 8 -12 3 -8 0 -4 8 14 -17 -5 -5 5 10 -2 0 -7 -3 13 1 7 -6 6 -3 -5 9 -6 -10 2
4679 2 -9 -4 0 0 1 -12 11 9 2 -3 -4 16 5 -6 0 -15 -13 5 7 7 -7 -6 -19 -1 1 6 -14 -3 3 6 -8 4 10 -4 -6 10 3 -21 -1 -8 -13 1
4721 1 0 -7 -6 -19 12 -2 -1 -17 -8 -10 13 8 2 -3 8 -6 1 8 -10 0 -15 3 3 0 -6 -26 -13 -1 10 1 7 -12 -24 -2 13 9 1 -19 -2 16
4761 16 9 7 7 -12 -2 12 2 6 -3 -8 -11 4 21 -1 -27 -9 5 10 1 -11 -2 -14 0 4 0 -12 -12 10 2 -1 -6 10 -19 -7 26 19 -12 -13 9
4800 9 -3 -3 5 3 -10 -22 2 12 5 5 -9 -13 -6 11 5 -2 -23 5 9 -6 -3 3 -10 -15 -1 9 -15 -20 -1 -3 9 3 -3 -13 -21 3 1 1 -19 -12 -5 -15
4842 -15 2 12 -10 -19 -4 9 8 0 -2 -5 3 8 16 0 -19 -10 9 -10 0 7 -8 -6 2 27 13 -9 -4 -7 -1 6 15 5 -25 -15 12 11 -16 -9 -10 -13 -8
4883 -8 4 6 -9 -10 24 25 -5 -2 -7 -13 -5 15 -1 -17 -2 3 -6 -3 8 2 -11 -11 4 14 0 -17 4 -4 6 12 14 -11 -16 -1 3 -1 -9 -5 -16 -12 11
4924 11 13 -16 -10 20 1 -8 -2 3 -18 -16 -7 18 -3 -13 -7 -2 -1 -5 2 -15 -14 -14 3 12 1 -5 -4 -4 9 9 -9 -26 -2 6 1 -2 -4 3 -18 0 11 2 -13
4967 -13 -6 9 -13 1 11 -8 -9 -15 22 5 6 3 -4 -6 -3 10 4 -11 0 16 12 5 7 9 -8 1 14 9 -11 -12 0 4 -7 -6 -8 -11 -7 -15 -8 0 8 1 -1 -14
5011 -14 -4 9 -10 -7 -4 8 -6 -12 12 -2 -8 -8 5 -3 -7 -2 8 -8 -3 11 4 2 3 2 3 -4 -5 0 -6 -8 14 11 1 0 -5 -7 6 -9 -5 -6 -10 6 10 3
5055 3 7 1 -6 -3 11 8 -4 -4 1 0 7 7 -7 -8 -10 -12 5 -4 2 -4 -2 6 12 2 5 -10 -2 13 3 -2 -8 -5 1 9 10 1 -4 0 5 2 10 3 -4 0 -4 7 -1 13 -2 7
5105 7 -7 5 -1 -9 -2 -11 9 2 1 15 -11 -16 -18 0 5 2 -6 -6 12 -2 6 6 -7 -16 0 -9 5 -14 -8 -11 -7 -2 3 -4 3 -9 3 4 -6 -5 -11 -7 6 7 -1
5150 -1 -8 -7 -11 1 -10 1 -2 -8 -4 6 -1 -3 -4 -1 2 -8 -4 4 8 2 22 23 2 7 3 -5 6 1 14 -11 -15 -1 -3 -2 4 5 -11 -4 9 7 -7 -12 -12 -4 3 15
5196 15 3 -7 -1 1 11 4 4 -8 -6 5 14 7 -19 -20 -3 -3 10 15 -10 -19 1 8 2 -4 -8 -27 -9 -1 14 -8 -17 -11 -3 15 7 -8 -20 -13 5 1 3 -1
5238 -1 -21 -21 10 14 4 -16 -9 -12 -9 -13 8 -11 -12 -9 1 -2 -11 -2 -17 -18 7 7 -3 -20 -22 -9 -2 7 8 -16 -13 9 -5 1 -15 -19 -15 -1 11 16 -9 4
5280 4 3 7 19 3 7 -15 0 20 8 8 5 -7 6 12 19 5 -5 -6 8 6 3 -6 -10 -15 -6 8 8 -17 -24 -18 -3 17 8 -1 -18 -5 4 9 3 -17 -8 1 4
5323 4 13 -5 -23 -7 4 -1 16 -16 -26 -16 2 10 7 -14 -18 -20 -3 6 9 -14 -17 -8 15 5 -7 -2 -12 -8 6 10 -2 -14 -12 -6 13 9 4 -22 -16 -9
5363 -9 11 5 -9 -13 -16 -4 13 6 -11 -11 4 14 17 4 -5 -11 0 14 10 5 -11 -16 -8 12 17 -9 -7 1 -4 17 15 -7 -4 -5 0 10 11 -8 -8 -11 0 25
5405 25 7 -12 -12 -7 10 12 1 -2 -18 -6 4 9 3 -5 -6 14 4 6 -2 -12 -17 2 11 0 -19 -12 -5 7 -1 -17 -6 -25 -3 -5 1 -18 -9 -7 -6 -6 -6
5446 -6 -1 -2 4 7 13 -12 7 2 -2 11 12 1 -10 -4 3 2 -6 8 14 -2 0 1 8 -3 6 4 10 2 6 -4 -3 8 4 7 6 0 -3 -2 -2 8 0 7 3 0 -4 0 5 13 8 -17
5496 -17 10 -4 -10 -8 16 8 -13 -12 -11 10 5 -3 0 -14 -3 11 5 -4 -11 -12 1 3 7 -8 -4 -2 3 5 -2 3 -10 -4 8 23 6 -13 -6 7 11 7 8 -10 -14
5539 -14 6 3 8 -10 -8 -6 9 1 8 9 -17 -16 3 0 -2 8 -5 1 -1 15 14 -18 -10 -7 12 16 -5 -1 -12 -8 15 26 -11 -9 0 -4 7 5 1 -17 -26 7
5581 7 22 6 -3 -13 -9 15 30 22 -12 -8 -7 25 14 2 -5 -24 -2 29 7 -9 -16 -16 4 7 10 0 -21 -24 1 11 17 -15 -12 -15 -8 19 12 -22 -22
5620 -22 -7 5 4 3 -17 -19 -13 16 23 -1 -31 1 11 25 16 1 -23 -16 4 9 6 -7 -35 -10 3 19 5 -13 -21 -16 16 4 18 -12 -25 5
5656 5 1 19 12 -9 -29 6 16 21 -4 -13 -22 -2 28 9 -2 -16 3 1 16 11 -12 -24 -16 9 11 -4 -6 -7 -4 16 23 -9 -25 -17 3 11 7 2 -13
5695 -13 -12 0 11 16 -16 -14 -14 -18 3 2 -12 -22 -9 13 3 -12 -19 -21 -14 10 16 6 -17 -16 1 8 -1 -13 -12 -29 -7 7 9 -12 -15 -23 6 10 6 -3
5735 -3 -22 -27 4 13 -3 -17 -15 -7 -6 2 -8 -12 -27 11 19 4 -11 -18 -23 -19 1 -1 -13 -25 -16 -4 3 -3 -5 -12 0 9 10 10 -19 -12 -3 2 15 -1 -7 -17 -5
5778 -5 12 4 6 -5 2 -3 2 10 0 -8 -5 -10 8 -8 2 1 -10 6 6 14 -2 -7 -5 1 4 -7 2 -16 -16 9 1 -12 -16 -2 -7 4 0 4 -10 -15 -4 -2 -5 -17
5822 -17 -9 -11 -8 -3 8 -8 -12 -13 -3 1 -5 -10 -14 -13 -12 1 -3 0 5 -9 -7 0 3 -5 -6 -13 4 0 -19 2 0 -12 -9 4 -9 -2 -2 -6 -1 0 2 -12 -2 -11 5 4
5868 4 -3 0 0 2 -5 0 -7 -9 -3 5 9 1 -1 -9 -6 2 5 10 -6 5 4 -8 -3 8 3 8 -2 11 2 1 0 11 1 -11 2 2 -8 2 -3 1 -9 -9 -3 -8 1 -4 -8 -3
5916 -3 -2 -17 -10 2 1 -3 -5 1 18 -8 -14 -6 2 -17 -5 -9 -9 -2 -7 -16 2 -14 -13 -12 13 -10 -9 -4 2 4 -2 0 -4 4 -6 2 -10 0 0 7 6 -2 -4 5 -8 -6 2
5963 2 1 8 -4 -3 6 -4 8 2 -7 -2 -1 -4 -2 5 -19 -11 -11 -5 1 -12 -10 1 5 -5 -4 0 -6 4 -6 -10 5 1 3 8 1 -3 -4 -14 -19 2 -7 -1 3 -7 0 4 19
6010 19 -4 -4 -8 -16 0 -1 -1 -18 -6 -8 -3 -4 -6 -1 -13 2 -7 12 -7 -1 -1 -6 -1 -1 -3 -9 -5 -14 -7 1 -3 -4 -10 -4 -5 -3 -15 -1 -3 -4 4 11 -12 -8 -3 -15 -12 3
6058 3 -1 -7 -11 -1 1 -4 4 -2 -8 -1 5 5 -10 -8 5 8 17 0 -12 -2 -5 12 2 -11 -7 -10 -1 0 13 4 -3 -3 4 17 7 -9 -3 -5 -3 6 -7 -11 -18 -13 -1 4
6104 4 12 -6 -9 9 4 13 -3 -15 -9 2 -9 -5 -6 -14 -12 -6 13 -8 -11 -13 -10 2 4 1 -2 -30 -5 2 11 -5 -7 -22 -7 6 2 -4 -5 -10 1 -3 13 -2 -17
6147 -17 3 -3 18 17 -3 -15 1 1 -3 1 -7 1 -3 1 8 -8 12 -12 -25 9 1 4 -20 -11 -5 2 5 -7 -16 -25 -7 13 9 -9 -18 -18 0 -8 13 -4 -12 -7
6189 -7 19 10 4 -11 -11 0 5 13 6 -14 -15 16 7 8 7 -8 -12 -1 22 3 1 1 -10 6 12 8 3 -1 4 1 16 7 -15 -17 -5 -10 3 4 -8 -14 -9 -2 3 2 4
6234 4 -13 -6 10 9 -6 -4 -6 0 2 -5 2 -9 -9 -1 9 -7 -18 -3 -5 -10 5 -4 -19 -20 -1 14 -10 -8 -4 -16 -12 -7 6 -2 -10 1 5 7 -1 5 -11 -4 5 5
6278 5 10 -2 -7 -8 0 1 13 5 -22 -10 8 -6 -9 5 10 -7 -8 7 2 -11 6 7 3 -19 5 -9 -18 -3 16 6 0 3 -8 -1 -7 -1 -3 -10 -5 15 8 -16
6320 -16 -11 11 -4 -3 7 5 -14 -11 7 13 -4 -4 3 -8 -7 -7 -5 -9 7 -5 -2 -22 -1 0 -9 -10 7 5 -12 -7 -5 -14 -8 3 4 1 0 -8 6 -3 -10 0 8 -11
6364 -11 -5 6 -16 -16 -5 3 2 8 5 10 -2 9 -1 -9 -12 5 -8 -17 4 -6 -14 -4 -8 19 1 -5 4 2 -5 -10 -6 -7 -8 -3 1 -13 -9 -15 2 -20 -20 -3 -14
6407 -14 -3 -4 -21 -10 -17 0 7 -11 -9 -11 -6 -14 -9 3 -7 -9 -3 -2 -11 -7 -6 -11 -17 -2 -6 -5 -9 2 -17 -23 -9 -2 -8 -12 -4 2 -8 -3 -6 -6 -1 -7 12 1 -6 -11
6453 -11 -1 -1 5 -1 4 -7 -2 2 7 -4 -12 2 -9 -5 0 -6 -9 -12 9 -2 -9 -7 0 1 3 -4 -1 -7 -15 -10 -1 1 8 2 -7 8 3 10 -4 -7 3 3 -1 9 4 2 -11 8
6501 8 -9 -19 3 3 -3 -6 6 1 -2 -9 -1 -14 -9 0 6 -7 -13 -13 -10 -15 -11 -18 -12 -1 -2 -4 0 -8 3 -4 -4 -8 3 2 -18 0 -10 -11 -10 -14 -5 2 2 -7 -17 -5 4
6548 4 0 6 -2 -17 -5 7 5 -1 -11 -10 13 3 7 -5 -6 -1 -4 1 -8 -9 5 2 11 5 -2 -4 4 13 -6 -5 -1 -8 -5 -9 -7 12 -17 -11 -1 -1 4 4 -6 -5 3 -12 -13
6595 -13 -5 -18 -11 0 3 -6 -4 -15 2 -3 -2 18 4 5 0 1 0 -4 -2 -2 -7 -6 -8 -1 -11 0 0 1 -10 2 -9 -12 -6 1 2 -7 -14 -17 -15 -4 -15 -2 -9 -7 -10 -3
6641 -3 5 0 -20 -8 -1 -3 -5 -2 -9 -7 0 -4 -3 -8 -15 -7 -11 -1 -3 -5 -4 -2 -9 -9 -12 -13 -17 -7 -16 3 3 -12 -5 -13 -10 -8 -7 -12 -10 -10 -9 3 -9 6 -12 -7 -4 -6 -2 -6 -6
6692 -6 8 11 -2 -3 1 0 2 16 -7 -3 -4 -5 -13 -2 -3 3 -9 3 0 -13 -9 -8 -10 -7 -11 -13 2 -21 -12 -5 -1 -4 3 2 -7 -6 -4 -6 6 -10 -8 -3 -7 -5 -5 -16 1
6739 1 -3 0 -14 -15 -8 -18 9 -12 1 -5 3 -9 8 -5 -10 6 -1 4 5 9 -8 7 -7 -1 -10 -3 -6 -5 -7 1 -4 -10 -2 1 -15 -7 -2 -3 -4 -12 2 -16 -12 -11 -17 -2
6785 -2 -6 -2 5 -9 -4 -5 0 -1 -4 7 -9 -8 3 -4 -19 -1 -17 -13 -3 2 -6 -2 2 6 -1 -7 -10 -8 0 -2 -3 1 -3 1 -14 -9 -10 -4 2 12 -3 1 -6 -7 -8 -4 -7 -5 -14 -12
6835 -12 9 -11 -4 -5 -4 -12 -13 1 -15 -21 -12 -14 -5 -4 -8 -6 -17 -18 -14 0 -5 0 -8 9 0 -9 9 -12 1 4 -4 -14 5 -4 8 -4 1 -2 -3 -7 4 4 -10 9
6879 9 0 -5 -16 5 -5 0 -3 -11 -5 -5 -2 -7 2 0 0 -2 -6 -10 -11 -19 -10 -9 -4 -11 -6 -4 -8 -12 -20 -12 -13 -18 -17 3 -13 -1 -11 -21 5 -2 1 -11 2 -7 3 -6 -7 -3 -16
6928 -16 -17 -5 -3 1 -8 -2 1 0 -11 -5 -1 0 -7 -7 6 -10 1 -2 -6 -2 8 -13 -9 0 -3 3 -6 -11 -10 -5 4 -3 -4 -14 -2 2 -8 -15 -10 -11 2 -11 4 -3 -28 -7
6974 -7 -7 -7 9 -6 -1 -1 -3 9 3 -12 -1 -1 -1 -9 -12 2 -2 -6 -18 -12 -4 -7 7 -3 -1 -6 -6 -12 -4 -1 -22 2 -6 -4 0 -8 -6 -3 -12 -10 -11 -17 -8 -18 -8 -25 -27
7021 -27 -4 -2 -12 -7 -14 -1 -12 -16 -8 -9 -5 -10 -14 -7 -9 -11 -11 -10 -5 5 -17 -7 -9 4 -1 -1 -5 0 -11 7 2 -8 -12 2 -14 6 -3 1 -8 -11 3 6 -7 -19
7065 -19 -13 3 9 2 -2 -6 3 -8 4 -6 -12 -9 0 -11 2 -6 -9 -12 5 4 -14 -1 -4 -8 -11 -17 6 7 5 -18 -9 -7 4 -10 -4 -14 -19 7 -8 9 -13 -11
7107 -11 -9 3 -6 3 -9 0 11 7 -14 -2 -1 5 1 -5 6 3 0 -5 -1 -6 6 -9 1 -17 -14 5 -8 -15 -12 1 -14 -3 -8 -29 -7 -5 3 -5 -1 -3 10 -10
7149 -10 3 2 -5 -14 -13 1 -7 -2 1 -5 1 0 -5 -11 -5 0 -5 -8 5 -10 5 4 -5 1 -5 8 4 8 -11 -11 4 -8 -1 -2 5 3 11 3 -1 -6 -1 -9 4 -7 -6 -13 -4 -2 5
7198 5 1 -5 -20 -6 2 -2 -15 -5 -3 -1 -3 -18 -16 -6 -1 -5 -9 -3 -11 -15 -4 6 -5 -10 -9 -16 3 8 5 -4 -11 -8 10 -4 2 -1 -3 -5 -7 10 1 -10 -1 3 5 -5
7244 -5 -3 -1 -8 -5 4 -4 2 0 -2 2 -7 -3 -11 -3 -3 8 8 6 -2 -1 -9 -2 -9 0 -8 -14 -1 -9 6 -1 -5 -5 -3 2 -1 -5 -1 -6 5 3 -5 1 3 -1 -2 2 -4 -8 10 0 -4 -2 6 -5
7298 -5 6 2 -3 13 1 9 -3 1 6 -3 -10 -1 -17 -2 0 -13 -11 -3 -4 2 -12 -5 -14 -13 -3 -4 -11 -6 1 -13 -5 -5 1 -6 1 -9 -10 2 -4 -3 4 -2 2 -6 -5 -9 -5 -16
7346 -16 -15 12 5 -2 -6 7 0 -5 -4 -2 1 1 -4 -2 5 -1 10 3 -3 2 -3 7 2 -10 15 6 3 -9 -8 -7 -5 -14 -10 -5 -10 -2 -5 -13 -1 -9 -3 -5 -9 -5 -13 -8 -9 -1 -11 -6 -9
7397 -9 -4 0 -8 2 -6 -3 -6 0 -6 4 -3 4 -2 -13 -12 0 1 10 -4 -11 2 -5 -18 7 -4 -3 4 2 -1 -3 1 -5 -5 -5 -18 -14 -19 -15 -7 -2 -12 -16 -7 -20 -13 -12 -4 -12 -18
7446 -18 -11 -5 1 -22 -17 -8 1 -5 -7 -9 -3 -12 -15 -10 -1 -4 -1 -7 1 -11 3 0 -6 2 -7 -14 -3 -8 -3 3 -5 6 -3 -4 -3 -4 -2 -6 10 -1 5 2 6 -2 -9 3 -5 3 0 7 4 -11
7498 -11 -5 -10 -10 -4 -5 -10 -13 -2 -5 -7 -4 -16 -8 -6 -10 0 -9 -16 -14 -11 -7 0 -15 1 -8 -2 1 -6 -5 -7 2 -2 -5 -20 -14 -2 -9 -9 5 -7 -12 -10 -17 -13 1 -4 -14 -16 -4
7547 -4 -15 6 -3 -6 -5 -7 -16 -10 -6 -6 2 -7 -4 7 -4 -12 -9 -11 -8 -14 -9 -6 -4 -9 -12 -8 -5 -9 -6 -14 3 -7 -4 0 0 -11 -1 9 -4 -3 11 5 9 2 0 -7 -5 0 4 5
7597 5 -13 -4 -21 -1 0 0 -9 2 -10 -1 6 3 7 -2 -6 -3 -5 4 -7 -10 -6 -7 -4 -6 0 -1 1 -2 -10 -12 -11 -6 -9 -15 -12 -7 -19 -10 -7 -2 -23 -21 -11 -5 12 -4 -12 -4 -10 -1
7647 -1 -5 -5 -1 -3 5 4 4 -2 3 -8 -11 -1 6 -10 3 -2 0 -3 9 0 -2 -5 0 -4 10 -12 -4 2 -12 12 -13 -8 -6 -10 4 -8 -10 -7 -5 -2 0 10 -4 -6 -9 -12 -5
7694 -5 -5 5 -15 -14 1 -1 -6 -16 -7 -6 -13 6 -7 -6 -6 -20 -2 3 0 2 -12 -8 -6 10 -1 -14 -14 -5 8 -5 -8 -7 9 -2 0 1 0 -15 -10 -2 5 -4 -2 -1
7738 -1 -6 -6 1 -7 -3 -9 -4 -12 -2 -2 -10 -17 -14 -6 -9 1 -8 -16 -18 -12 7 -14 -12 -5 3 3 -10 3 -3 -12 1 10 0 -8 -6 0 -9 1 12 3 2 -3 2 4 4 -3 -13 4 -3
7787 -3 6 3 -10 -3 3 -4 -5 -2 4 -11 -15 4 -5 -10 -12 -8 -1 -3 -8 -4 -8 -5 -9 -15 -15 -14 -3 2 -6 -12 -2 -7 -11 -3 -8 -4 -12 -4 5 -13 -1 0 -2 -6 7 -2 -3 -13 0 8 -10
7838 -10 11 -1 8 -6 1 -4 -11 -4 -2 -5 11 0 2 -2 -7 -4 -5 7 5 6 -4 -6 5 -4 0 0 -5 0 1 -9 -6 -9 -6 2 6 4 -12 -15 -4 -13 -11 -23 -9 -8 4 1
7884 1 -2 -8 -14 -10 -4 -4 -3 -6 -7 -10 3 -19 -8 0 -9 5 -11 2 3 7 0 11 10 -9 -14 0 -4 -8 -6 6 -11 -10 -9 -10 -6 -15 -6 -1 -2 -9 -7 -13 -13 -12 -10 -12 -9 -16 -17 -21
7934 -21 5 6 -5 -15 -18 -5 -5 -7 -12 -19 -11 -7 -5 -4 -3 -7 -14 -3 -12 1 -4 -11 -17 2 -8 2 -6 -8 -5 0 -7 1 -2 0 4 8 3 -6 -6 -5 -7 13 3 -7 3 -7
7980 -7 1 12 3 -5 -16 -14 -7 2 4 -4 -19 -11 -6 -2 -3 -8 -9 -9 -5 2 -4 -18 -6 -11 -6 -10 6 -15 -10 -6 -10 -14 -11 -9 -12 3 -7 7 -19 -10 -6 -3 17 -1 -14 -3
8026 -3 4 3 4 1 0 -3 1 -2 0 -11 -23 -5 -7 1 1 1 -11 -17 -1 -2 -7 6 -11 -6 6 -8 -12 -13 -10 2 -8 15 2 -4 -20 -3 3 1 -13 2 -8 -3 6
8069 6 4 -5 -9 -8 -3 2 -2 4 -2 0 -10 6 -6 -3 -2 18 5 11 -2 0 -14 10 0 6 -1 -11 -6 -6 14 6 -9 -5 -10 2 3 4 -4 -7 -10 -1 -9 -4 3 -12 -13 5
8115 5 8 -10 -3 -12 -3 4 -1 -1 -11 -14 -3 12 13 1 -5 -3 1 2 2 6 7 -3 -9 -3 0 -19 -8 -12 1 8 -2 -1 1 -1 3 -5 3 -2 0 2 -5 -4 0 -9 -14 -2 -2 -8 -5 -3
8165 -3 -4 -11 0 3 -12 -6 -16 -1 -1 -2 -24 -12 -11 0 -14 -1 0 -6 -7 -3 1 -10 -6 -4 -9 0
8191@
##END NTUPLES=NMR FID
##END=
